##TITLE=AC1534_ROEFFECT0009_8214376_YM702Qd0Co
##JCAMPDX= 6.0         $$ Bruker NMR JCAMP-DX V2.0
##DATA TYPE= NMR SPECTRUM
##DATA CLASS= NTUPLES
##ORIGIN= BRUKER
##OWNER= Administrator
$$ 1.72 TOPSPIN		Version 2.1
$$ 2014-08-01 15:49:37.021 -0700  Administrator@X
$$ Compression mode = diff/dup
##.OBSERVE FREQUENCY= 400.02188249412
##.OBSERVE NUCLEUS= ^1H
##.ACQUISITION MODE= SIMULTANEOUS (DQD)
##.ACQUISITION SCHEME= undefined
##.AVERAGES= 64
##.DIGITISER RES= 22
##SPECTROMETER/DATA SYSTEM= spect
##.PULSE SEQUENCE= noesygpps1d.comp
##.SOLVENT NAME= COFFEE_meoh
##.SHIFT REFERENCE= INTERNAL, COFFEE_meoh, 1, 14.97816
##AUDIT TRAIL= $$ (NUMBER, WHEN, WHO, WHERE, PROCESS, VERSION, WHAT)
$$ ##TITLE= Audit trail, TOPSPIN		Version 2.1
$$ ##JCAMPDX= 5.01
$$ ##ORIGIN= Bruker BioSpin GmbH
$$ ##OWNER= Administrator
$$ $$ E:\/data/COFFEE/nmr/AC1534_ROEFFECT0009_8214376_YM702Qd0Co/32/pdata/1/auditp.txt
$$ ##AUDIT TRAIL=  $$ (NUMBER, WHEN, WHO, WHERE, PROCESS, VERSION, WHAT)
(   1,<2014-08-01 15:49:30.047 -0700>,<Administrator>,<X>,<go>,<TOPSPIN 2.1>,
      <created by zg
	started at 2014-08-01 15:37:59.981 -0700,
	POWCHK enabled, PULCHK disabled,
       configuration hash MD5:
       16 EA D6 F4 BB 67 03 14 9B FF E7 A0 43 5B 48 2E
       data hash MD5: 64K
       27 8D 74 E3 F8 FF C7 FF A3 04 7A 09 6E DA 77 B7>)
(   2,<2014-08-01 15:49:34.912 -0700>,<Administrator>,<X>,<proc1d>,<TOPSPIN 2.1>,
      <Start of raw data processing
       efp LB = 0.3 FT_mod = 6 PKNL = 1 PHC0 = 0 PHC1 = 0 SI = 128K 
       data hash MD5: 128K
       22 0A F1 52 18 60 21 AE DA 9F 67 D6 76 F1 CC E7>)
(   3,<2014-08-01 15:49:35.928 -0700>,<Administrator>,<X>,<proc1d>,<TOPSPIN 2.1>,
      <pk PHC0 = -81.2439 PHC1 = 0 
       data hash MD5: 128K
       4A 60 C6 6C 65 C4 4A B4 C3 FA EE 77 DE 42 8B 0C>)
(   4,<2014-08-01 15:49:36.396 -0700>,<Administrator>,<X>,<proc1d>,<TOPSPIN 2.1>,
      <abs ABSG = 1 
       data hash MD5: 128K
       3B 5A 8A 13 E7 3A DF DB 94 E8 4C 23 C5 EE 95 10>)
(   5,<2014-08-01 15:49:36.506 -0700>,<Administrator>,<X>,<proc1d>,<TOPSPIN 2.1>,
      <abs ABSG = 2 
       data hash MD5: 128K
       79 40 62 C0 3D D7 2A CB 08 71 2E F5 B6 FF 85 A4>)
(   6,<2014-08-01 15:49:36.631 -0700>,<Administrator>,<X>,<proc1d>,<TOPSPIN 2.1>,
      <abs ABSG = 3 
       data hash MD5: 128K
       25 14 22 1E A1 42 F1 53 6F C0 3F C5 A2 06 12 BD>)
(   7,<2014-08-01 15:49:36.756 -0700>,<Administrator>,<X>,<proc1d>,<TOPSPIN 2.1>,
      <abs ABSG = 4 
       data hash MD5: 128K
       0B 90 3C 83 AC 6F F9 32 B5 68 D8 B1 E0 6F CF 50>)
(   8,<2014-08-01 15:49:36.818 -0700>,<Administrator>,<X>,<proc1d>,<TOPSPIN 2.1>,
      <abs ABSG = 5 
       data hash MD5: 128K
       EE EA 65 87 96 A1 6D 18 DE 64 C8 15 6E 4C 76 40>)
$$ ##END=
$$ 
$$ $$ hash MD5
$$ $$ 40 16 1C DD FE 99 2F 29 EA 3E AA F0 4A 8C 82 5B
##$RELAX= 
##$RELAX= 
##$RELAX= 
##$RELAX= 
##$RELAX= 
##$RELAX= 
##$RELAX= 
##$RELAX= 
$$ Bruker specific parameters
$$ --------------------------
##$DU= <E:\>
##$EXPNO= 32
$$ [...]
##$TP07= 0
##$TPNAME0= <>
##$TPNAME1= <>
##$TPNAME2= <>
##$TPNAME3= <>
##$TPNAME4= <>
##$TPNAME5= <>
##$TPNAME6= <>
##$TPNAME7= <>
##$TPOAL= (0..7)
0.5 0.5 0.5 0.5 0.5 0.5 0.5 0.5
##$TPOFFS= (0..7)
0 0 0 0 0 0 0 0
##$TUNHIN= 0
##$TUNHOUT= 0
##$TUNXOUT= 0
##$USERA1= <user>
##$USERA2= <user>
##$USERA3= <user>
##$USERA4= <user>
##$USERA5= <user>
##$V9= 5
##$VALIST= <valist>
##$VCLIST= <CCCCCCCCCCCCCCC>
##$VD= 0
##$VDLIST= <DDDDDDDDDDDDDDD>
##$VPLIST= <PPPPPPPPPPPPPPP>
##$VTLIST= <TTTTTTTTTTTTTTT>
##$WBST= 1024
##$WBSW= 4
##$XGAIN= (0..3)
0 0 0 0
##$XL= 0
##$YL= 0
##$YMAX_a= 11122892
##$YMIN_a= -11999292
##$ZGOPTNS= <>
##$ZL1= 120
##$ZL2= 120
##$ZL3= 120
##$ZL4= 120
##$ABSF1= 14.97816
##$ABSF2= -5.580022
##$ABSG= 5
##$ABSL= 3
##$ALPHA= 0
##$AQORDER= 0
##$ASSFAC= 0
##$ASSFACI= 0
##$ASSFACX= 0
##$ASSWID= 0
##$AUNMP= <proc_prof1d_extract.lims>
##$AXLEFT= 0
##$AXNAME= <>
##$AXNUC= <1H>
##$AXRIGHT= 0
##$AXTYPE= 0
##$AXUNIT= <>
##$AZFE= 0.1
##$AZFW= 0.1
##$BCFW= 0
##$BC_mod= 0
##$BYTORDP= 0
##$COROFFS= 0
##$CY= 15
##$DATMOD= 1
##$DC= 0
##$DFILT= <>
##$DTYPP= 0
##$F1P= 0
##$F2P= 0
##$FCOR= 0.5
##$FTSIZE= 131072
##$FT_mod= 6
##$GAMMA= 0
##$GB= 0
##$INTBC= 1
##$INTSCL= 1
##$ISEN= 128
##$LB= 0.3
##$LEV0= 0
##$LPBIN= 0
##$MAXI= 10000
##$MC2= 0
##$MEAN= 0
##$ME_mod= 0
##$MI= 0
##$NCOEF= 0
##$NC_proc= -1
##$NLEV= 6
##$NOISF1= 0
##$NOISF2= 0
##$NSP= 0
##$NTH_PI= 0
##$NZP= 0
##$OFFSET= 14.97816
##$PC= 1
##$PHC0= -81.2439
##$PHC1= 0
##$PH_mod= 1
##$PKNL= yes
##$PPARMOD= 0
##$PPDIAG= 0
##$PPIPTYP= 0
##$PPMPNUM= 2147483647
##$PPRESOL= 1
##$PSCAL= 4
##$PSIGN= 0
##$PYNMP= <proc.py>
##$REVERSE= no
##$SF= 400.020002772887
##$SI= 131072
##$SIGF1= 0
##$SIGF2= 0
##$SINO= 400
##$SIOLD= 131072
##$SPECTYP= <>
##$SREGLST= <1H.CDCl3>
##$SSB= 0
##$STSI= 131072
##$STSR= 0
##$SW_p= 8223.68421052631
##$SYMM= 0
##$S_DEV= 0
##$TDeff= 65536
##$TDoff= 0
##$TI= <>
##$TILT= no
##$TM1= 0
##$TM2= 0
##$TOPLEV= 0
##$USERP1= <user>
##$USERP2= <user>
##$USERP3= <user>
##$USERP4= <user>
##$USERP5= <user>
##$WDW= 1
##$XDIM= 131072
##$YMAX_p= 80055808
##$YMIN_p= -335279034
##$CURPLOT= <Network HP LaserJet P1505>
##$CURPRIN= <$Network HP LaserJet P1505>
##$DFORMAT= <normdp>
##$LAYOUT= <+/1D_H.xwp>
##$LFORMAT= <normlp>
##$PFORMAT= <normpl>
##$SURQMSG= 1
$$ End of Bruker specific parameters
$$ ---------------------------------
##NTUPLES= NMR SPECTRUM
##VAR_NAME=  FREQUENCY,     SPECTRUM/REAL,   SPECTRUM/IMAG
##SYMBOL=    X,             R,               I
##VAR_TYPE=  INDEPENDENT,   DEPENDENT,       DEPENDENT
##VAR_FORM=  AFFN,          ASDF,            ASDF
##VAR_DIM=   131072,        131072,          131072
##UNITS=     HZ,            ARBITRARY UNITS, ARBITRARY UNITS
##FACTOR=    0.0627417313425164, 1,          1
##FIRST=     8223.62146879497, -1275,        -12590
##LAST=      0,             -1624,           -13057
##MIN=       0,             -335279034,      0
##MAX=       8223.62146879497, 80055808,     0
$$ Real data points
##PAGE= N=1
##DATA TABLE= (X++(R..R)), XYDATA
$$ [...]
62989B66033j51J59O06R70J179J352J631J907J879J504J215J432J994K402K556
62974B86668K871L628M590N345N786N994O019O015O318P119Q173R056R661J0221
62960C77464J0928J1751J2606J3455J4262J4957J5553J6150J6855J7696J8611
62949E40288J9455K0102K0603K1176K1919K2643K3077K3196K3182K3088K2700
62938G81429K1785K0419J8969J7805J6943J6023J4700J3010J1284R644P847N696
62926I55554L414J388l17j928l545n030o384p881r717j1643j3147j3944j4207
62913H72613j4379j4801j5458j5986j5958j5274j4212j3148j2179j1101r687p966
62901G12464o201m640l274j865k26J561L206M476N332N898O363O840P269P413
$$ y = [266033, 265882, 266041, 266647, 267617, 268796, 270148, 271779, 273686, 275565, 277069, 278284, 279716, 281710, 284112, 286668, 289539, 293167, 297757, 303102, 308888, 314882, 320901, 326916, 333234, 340353, 348526, 357582, 367243, 377464, 388392, 400143, 412749, 426204, 440466, 455423, 470976, 487126, 503981, 521677, 540288, 559743, 579845, 600448, 621624, 643543, 666186, 689263, 712459, 735641, 758729, 781429, 803214, 823633, 842602, 860407, 877350, 893373, 908073, 921083, 932367, 942011, 949858, 955554, 958968, 960356, 960039, 958111, 954566, 949536, 943152, 935271, 925554, 913911, 900764, 886820, 872613, 858234, 843433, 827975, 811989, 796031, 780757, 766545, 753397, 741218, 730117, 720430, 712464, 706263, 701623, 698349, 696484, 696258, 697819, 701025, 705501, 710833, 716731, 723094, 729934, 737203, 744616]
62887G44616P084O389N657N091M534L682K410R03n47j782k853l925n099o376p727
62872G52057r162j0633j1966j2951j3656j4455j5654j7097j8265j8811j8870j8792
62860E71745j8718j8555j8285j8029j7775j7244j6264j5121j4281j3812j3285
62849C90376j2332j1115j0071r410q989q576q048p324o360n253m285l709l552
62836B91352l634l730l685l427k975k462k077j951k006k014j796j379r51o66n72
62821B58027o85j031j523j921j995j787j550j471j505j526j521j570j620j499
62807B36823j161q37q06j069j374j573j736j881j830j487j086q89p86m74JK13
62791B20048m6m45n26k23J69L91L90K28k3k61l96l67j61J23K49R3r1P8N33P28
$$ y = [744616, 751700, 758089, 763746, 768837, 773371, 777053, 779463, 780366, 779819, 778037, 775184, 771259, 766160, 759784, 752057, 742895, 732262, 720296, 707345, 693689, 679234, 663580, 646483, 628218, 609407, 590537, 571745, 553027, 534472, 516187, 498158, 480383, 463139, 446875, 431754, 417473, 403661, 390376, 378044, 366929, 356858, 347448, 338459, 329883, 321835, 314511, 308151, 302898, 298613, 294904, 291352, 287718, 283988, 280303, 276876, 273901, 271439, 269362, 267411, 265405, 263391, 261595, 260216, 259265, 258599, 258027, 257342, 256311, 254788, 252867, 250872, 249085, 247535, 246064, 244559, 243033, 241512, 239942, 238322, 236823, 235662, 234825, 234019, 232950, 231576, 230003, 228267, 226386, 224556, 223069, 221983, 221094, 220308, 219834, 219835, 220048, 220002, 219557, 219031, 218808, 218977, 219368, 219758, 219986, 219963, 219702, 219306, 218939, 218778, 218901, 219150, 219243, 219152, 219230, 219763, 220491]
62771B20491L47k01k63K97J043J524J573J233O91K79K05L06K72Q7PJ46L69N75
62753B28981P95R71R25O34L28K08K51L64M94N72M65J68j41k63j86o6j06l68o49
62734B33377o34k74J06K55L48O12Q04N30Lj33K87P07P59P95J229J772J839J386
62716B43768R00P30Q12R99J224J424J554J724K088K633L254L910M568N072N321
62701B79981N470N727O106O551P214Q272R567J0718J1618J2538J3762J5286J6904
62688D09714J8367J9470K0161K0627K1100K1647K2249K2969K3808K4455K4468
62677F49035K3787K2786K1834K0911J9756J8242J6502J4782J3172J1489R489P177
62665H48962M769K293m39l357n967p998r870j2147j4687j6836j8389j9799k1435
$$ y = [220491, 220838, 220637, 220374, 220671, 221714, 223238, 224811, 226044, 226735, 227014, 227219, 227525, 227797, 227884, 227891, 228037, 228406, 228981, 229776, 230747, 231672, 232306, 232634, 232842, 233093, 233457, 233951, 234523, 234988, 235156, 235015, 234752, 234566, 234500, 234394, 234026, 233377, 232743, 232469, 232575, 232830, 233178, 233790, 234594, 235124, 235127, 234994, 235281, 235988, 236747, 237542, 238771, 240543, 242382, 243768, 244668, 245398, 246210, 247209, 248433, 249857, 251411, 253135, 255223, 257856, 261110, 265020, 269588, 274660, 279981, 285451, 291178, 297284, 303835, 311049, 319321, 328888, 339606, 351224, 363762, 377524, 392810, 409714, 428081, 447551, 467712, 488339, 509439, 531086, 553335, 576304, 600112, 624567, 649035, 672822, 695608, 717442, 738353, 758109, 776351, 792853, 807635, 820807, 832296, 841785, 848962, 853731, 856024, 855585, 852228, 846261, 838263, 828393, 816246, 801559, 784723, 766334, 746535, 725100]
62652G25100k3070k4284k4910k5003k4712k4325k4110k3964k3493k2556k1409
62641D63264k0268j9070j7793j6595j5478j4196j2691j1278j0125q998p729o584
62629C02459n790n046l952k645j607j041p83o15l08M33J625K789L519M077M991
62614B98106O212P270Q140R316J0877J2183J2760J3015J3630J4636J5497J5936
62602D37578J6207J6616J7117J7470J7556J7456J7271J6950J6312J5267J3986
62591F19786J2753J1630J0380Q792O958N168L608K202P23j052l187n521p730r526
62577F54984j0882j2042j3316j4809j6321j7569j8462j9090j9488j9600j9481
62566D73924j9318j9100j8547j7568j6548j5862j5284j4302j2963j1916j1497
$$ y = [725100, 702030, 677746, 652836, 627833, 603121, 578796, 554686, 530722, 507229, 484673, 463264, 442996, 423926, 406133, 389538, 374060, 359864, 347173, 335895, 325770, 316772, 309043, 302459, 296669, 291623, 287671, 285026, 283419, 282378, 281595, 280980, 280672, 281105, 282730, 285519, 289038, 293115, 298106, 304318, 311588, 319728, 329044, 339921, 352104, 364864, 377879, 391509, 406145, 421642, 437578, 453785, 470401, 487518, 504988, 522544, 540000, 557271, 574221, 590533, 605800, 619786, 632539, 644169, 654549, 663341, 670299, 675467, 679075, 681277, 682000, 680948, 677761, 672240, 664510, 654984, 644102, 632060, 618744, 603935, 587614, 570045, 551583, 532493, 513005, 493405, 473924, 454606, 435506, 416959, 399391, 382843, 366981, 351697, 337395, 324432, 312516, 301019]
62555C01019j1220j0459r256q140p360o670n832m937m217l783l624l668l751l633
62541B14469l228k683k216j878j590j349j248j268j200q79m13k6K26M52O36O01
62525A98406L23M9J2J66L81O91J099J403J429J365J551J975K349K592K975L693
62509B20459M623N573O477P249P737Q002Q404R160J0008J0515J0554J0355J0171
62496C29287J0126J0248J0419J0383R958R297Q744Q445Q204P732O909N829M673
62483D40254L577K573J641P44j78j204k349l515m596n613o595p479q213q949r827
62468C90271j0634j0997j0929j0933j1328j1790j1762j1150j0343r707r264q810
62456B62624q147p215o154n232m620m262m000l749l471l178k969k921k847k426
$$ y = [301019, 289799, 279340, 270084, 261944, 254584, 247914, 242082, 237145, 232928, 229145, 225521, 221853, 218102, 214469, 211241, 208558, 206342, 204464, 202874, 201525, 200277, 199009, 197809, 196930, 196517, 196491, 196717, 197169, 197805, 198406, 198729, 198778, 198790, 198956, 199337, 200028, 201127, 202530, 203959, 205324, 206875, 208850, 211199, 213791, 216766, 220459, 225082, 230655, 237132, 244381, 252118, 260120, 268524, 277684, 287692, 298207, 308761, 319116, 329287, 339413, 349661, 360080, 370463, 380421, 389718, 398462, 406907, 415111, 422843, 429752, 435581, 440254, 443831, 446404, 448045, 448789, 448611, 447407, 445058, 441543, 436947, 431334, 424739, 417260, 409047, 400098, 390271, 379637, 368640, 357711, 346778, 335450, 323660, 311898, 300748, 290405, 280698, 271434, 262624, 254477, 247262, 241108, 235876, 231256, 226994, 222994, 219245, 215774, 212596, 209627, 206706, 203859, 201433]
62442B01433j640r09n63m24j27L79Q34J095J266J510J941K565L212L654L969M536
62426B22731N459O254O468O383O677P544Q528R224R615R783R689R402R148R026
62412C35931Q920Q777Q635Q369P746O823N953N303M728M168L754L374K579J186
62398D16246l76j651k705l805m897n782o531p239p648p511p222p487q391r306
62384C35695r777r972j0083r850r015p907p160o948o890o627o183n765n483n267
62370B28768m932m264l254k246j666j553j510j199p14l27j02Q8K79M16N69Q98
62354B09251J378J770J977K156K426K625K526K135J601J047O04N11Q38J257J325
62339B33427R87N54K37m7l93p08r11j067j276j510j714j913k139k363k507k473
$$ y = [201433, 199793, 198884, 198321, 197897, 197770, 198149, 198983, 200078, 201344, 202854, 204795, 207360, 210572, 214226, 218195, 222731, 228190, 234444, 240912, 247295, 253972, 261516, 270044, 279268, 288883, 298666, 308355, 317757, 326905, 335931, 344851, 353628, 362263, 370632, 378378, 385201, 391154, 396457, 401185, 405353, 409107, 412481, 415060, 416246, 415870, 414219, 411514, 407709, 402812, 397030, 390499, 383260, 375612, 368101, 360879, 353392, 345001, 335695, 325918, 315946, 305863, 296013, 286998, 279091, 271931, 264983, 258093, 251466, 245283, 239518, 234035, 228768, 223836, 219572, 216318, 214072, 212406, 210853, 209343, 208144, 207430, 207103, 207001, 207089, 207368, 207784, 208353, 209251, 210629, 212399, 214376, 216532, 218958, 221583, 224109, 226244, 227845, 228892, 229496, 230007, 230845, 232102, 233427, 234414, 234968, 235205, 235158, 234765, 234057, 233146, 232079, 230803, 229293, 227579, 225666, 223527, 221164, 218657, 216184]
62323B16184k180j727j438j569j925k040j760j431j404j607j722j589j250p99
62309A93743l78j60j94k98k63m3K98P04J082J307J375J432J562J657J624J547
62293B04995J540J635J878K334K816K919K536K163K349L001L541L661L567L522
62279B42457L534L564L739M184M811N412N903O351O872P480Q025Q292Q269Q248
62265C27141Q533R078R554R734R679R542R378R205R097R107R156R051Q658Q037
62251D54950P417O936O410N488M113K650J520P97K90j73p31j587k814m186n378
62236D75702o314p102p719p990p928p856q121q763r485r889r821r590r635r934
62222C55555r937r336q576q303q482q553q234p711p089o250n372m936n001m978
$$ y = [216184, 214004, 212277, 210839, 209270, 207345, 205305, 203545, 202114, 200710, 199103, 197381, 195792, 194542, 193743, 193365, 193205, 193011, 192713, 192450, 192407, 192705, 193409, 194491, 195798, 197173, 198605, 200167, 201824, 203448, 204995, 206535, 208170, 210048, 212382, 215198, 218117, 220653, 222816, 225165, 228166, 231707, 235368, 238935, 242457, 245991, 249555, 253294, 257478, 262289, 267701, 273604, 279955, 286827, 294307, 302332, 310624, 318893, 327141, 335674, 344752, 354306, 364040, 373719, 383261, 392639, 401844, 410941, 420048, 429204, 438255, 446913, 454950, 462367, 469303, 475713, 481201, 485314, 487964, 489484, 490281, 490571, 490398, 489667, 488080, 485266, 481080, 475702, 469388, 462286, 454567, 446577, 438649, 430793, 422672, 413909, 404424, 394535, 384714, 375124, 365489, 355555, 345618, 336282, 327706, 319403, 310921, 302368, 294134, 286423, 279334, 273084, 267712, 262776, 257775, 252797]
62208B52797m411l606l148l104l079k814k334j724j086o32n10n56m92k97j56j46
62192B24702j72j47j0L43R20J467J662J499J304J358J655K040K398K687K950L346
62176B48002M003M806N449N774N990O449P200P909Q303Q599R239J0239J1018J1076
62162C54056J0615J0202J0036R864R513R085Q611P947P131O399N759M921L882
62149D58021L096K764K375J321k77j806k937l796m566n351o325p531q630r247
62135D17111r499r825j0292j0577j0498j0207r816r244q541p914p407o851o234
62122C00206n711n211m465l517k791k462k187j676j154r41r13p63m60j71J30N63
62106B68477J011J237J256J348J663K075K369K441K333K224K294K509K689K810
$$ y = [252797, 248386, 244780, 241632, 238528, 235449, 232635, 230301, 228577, 227491, 226859, 226349, 225793, 225301, 225004, 224848, 224702, 224530, 224383, 224373, 224716, 225636, 227103, 228765, 230264, 231568, 232926, 234581, 236621, 239019, 241706, 244656, 248002, 252005, 256811, 262260, 268034, 274024, 280473, 287673, 295582, 303885, 312484, 321723, 331962, 342980, 354056, 364671, 374873, 384909, 394773, 404286, 413371, 421982, 429929, 437060, 443459, 449218, 454139, 458021, 461117, 463881, 466256, 467577, 467300, 465494, 462557, 458761, 454195, 448844, 442519, 434988, 426358, 417111, 407612, 397787, 387495, 376918, 366420, 356213, 346397, 337153, 328612, 320698, 313291, 306440, 300206, 294495, 289284, 284819, 281302, 278511, 276049, 273862, 272186, 271032, 270091, 269178, 268415, 267955, 267784, 267914, 268477, 269488, 270725, 271981, 273329, 274992, 277067, 279436, 281877, 284210, 286434, 288728, 291237, 293926, 296736]
62092B96736L057L402L461L041K597K699L212L487L296L113L346L764L953L967
62078C43131M194M708N149N218N070N084N387N706N661N192M641M401M487M569
62064D12598M359L881L311K748K197J720J388J137P91K93k23n98r23j430k186
62049D29063k944l464l820m241m686m820m508m129m184m638m939m693m114l696
62035C70187l588l456k944k142j488j264j315j301j089q06n34k34M2Q5j64m32
62019C49557l93p6J93J66j65o87j181j342j078p58q43j241j381j049p67j073j748
62002C36134k126k007j826j989k383k610k427j861j163o78n20l43L12J361K158
61987C20032K300K153K343K940L524L884M249M810N389N682N634N423N256N237
$$ y = [296736, 299793, 303195, 306656, 309697, 312294, 314993, 318205, 321692, 324988, 328101, 331447, 335211, 339164, 343131, 347325, 352033, 357182, 362400, 367470, 372554, 377941, 383647, 389308, 394500, 399141, 403542, 408029, 412598, 416957, 420838, 424149, 426897, 429094, 430814, 432202, 433339, 434130, 434423, 434200, 433602, 432679, 431249, 429063, 426119, 422655, 418835, 414594, 409908, 405088, 400580, 396451, 392267, 387629, 382690, 377997, 373883, 370187, 366599, 363143, 360199, 358057, 356569, 355305, 353990, 352689, 351600, 350794, 350260, 350026, 350068, 350153, 349989, 349557, 349164, 349088, 349281, 349447, 349282, 348595, 347414, 346072, 344994, 344236, 343393, 342152, 340771, 339722, 338955, 337882, 336134, 334008, 332001, 330175, 328186, 325803, 323193, 320766, 318905, 317742, 317064, 316544, 316201, 316513, 317874, 320032, 322332, 324485, 326828, 329768, 333292, 337176, 341425, 346235, 351624, 357306, 362940, 368363, 373619, 378856]
61973C78856N308N248M927M601M706N239N586N185M173L161K509K051J472O44
61959D33666l68j411k243k708k892l073l414l905m476n081n610n971o283o758
61945C79473p391p915q153q154p957p500o966o822p265p771p644o877o142n940
61931B76976o071o030n642n126m744m569m464m225l781l287k996k942k911k692
61917B17496k308j944j749j785j981k156k121j859j511j184q97p45r09j331j600
61902A93416j325o19M3L34L07J46j16m75p85q39o66n26o25q62r95r53q81q83q78
61883A82818q05p92r44j079r35o21n63r68j514j771j660j372r81n02r9j0j87l25
61865A67690k56j10o4p9MK77O94J129J430J572J710J973K238K302K248K384K750
$$ y = [378856, 384164, 389412, 394339, 398940, 403646, 408885, 414471, 419656, 423829, 426990, 429499, 431550, 433022, 433666, 433298, 431887, 429644, 426936, 424044, 420971, 417557, 413652, 409176, 404095, 398485, 392514, 386231, 379473, 372082, 364167, 356014, 347860, 339903, 332403, 325437, 318615, 311350, 303579, 295935, 289058, 282916, 276976, 270905, 264875, 259233, 254107, 249363, 244794, 240330, 236105, 232324, 229037, 226041, 223099, 220188, 217496, 215188, 213244, 211495, 209710, 207729, 205573, 203452, 201593, 200082, 198898, 198001, 197256, 196347, 195016, 193416, 192091, 191472, 191515, 191849, 192156, 192302, 192186, 191711, 190926, 190087, 189421, 188895, 188270, 187408, 186413, 185460, 184579, 183696, 182818, 182013, 181221, 180277, 179198, 178263, 177642, 177079, 176111, 174597, 172826, 171166, 169794, 168813, 168311, 168212, 168202, 168015, 167690, 167434, 167324, 167260, 167181, 167185, 167462, 168156, 169285, 170715, 172287, 173997, 175970, 178208, 180510, 182758, 185142, 187892]
61848A87892L010K957K876L144L704M156M285M210M095M002L973M028M058L865
61834B40255L426K941K635K599K799L086L236L130K934K914L081L166K984K629
61820B81815K317K148K086K001J707J114M58J13J55K92L13L61O02Q32P14K49k40
61803B97037n52p47q72q66p79q73j356k125k880l399l600l489l142k742k535k689
61787B64391l162l697l979l909l677l522l446l239k791k223j673j145o18k18p3
61772B27019k9K94J071J983K535K619K660L106L916M660N046N180N315N565N900
61757B76840O259O553O677O665O714O920P084O940O528O154O011O013N949N736
61743C67043N441N148M870M508L986L393K923K610K268J781J278Q31K51n87j360
$$ y = [187892, 190902, 193859, 196735, 199879, 203583, 207739, 212024, 216234, 220329, 224331, 228304, 232332, 236390, 240255, 243681, 246622, 249257, 251856, 254655, 257741, 260977, 264107, 267041, 269955, 273036, 276202, 279186, 281815, 284132, 286280, 288366, 290367, 292074, 293188, 293646, 293759, 293914, 294206, 294519, 294880, 295482, 296314, 297028, 297277, 297037, 296485, 295738, 294866, 294000, 293221, 292348, 290992, 288867, 285987, 282588, 278988, 275499, 272357, 269615, 267080, 264391, 261229, 257532, 253553, 249644, 245967, 242445, 238999, 235760, 232969, 230746, 229073, 227928, 227310, 227092, 227019, 226990, 227284, 228355, 230338, 232873, 235492, 238152, 241258, 245174, 249834, 254880, 260060, 265375, 270940, 276840, 283099, 289652, 296329, 302994, 309708, 316628, 323712, 330652, 337180, 343334, 349345, 355358, 361307, 367043, 372484, 377632, 382502, 387010, 390996, 394389, 397312, 399922, 402190, 403971, 405249, 406080, 406331, 405744, 404384]
61728D04384j643j516j479j782k216k603l048l576l940m028m082m296m478m417
61714C61280m343m627n183n574n607n501n443n326n027m686m559m702m922n006
61700B90774m947m873m779m436l702k824k210j888j537j088r31j274j689j615
61686B52981j072n27k67k21l02m58m93k18K39N41N91N25M01J88PL0J35R7JR3K68
61665B52539J68j65k95j14l1k33l37q2J38j24o51r18q16o31n23m59m89o71q37
61646B45469q13p44q89j149j227j093r79r61q95p09m57j46K04M18L82L20M97P19
61628B37947N60L2l81m27l37l73m74n08m85l66k3M47O70M57M4k51l77m04l78m51
61608B34922q56j509j925j820j507j472j715j872j779j643j680j893k120k165
$$ y = [404384, 402741, 401225, 399746, 397964, 395748, 393145, 390097, 386521, 382581, 378553, 374471, 370175, 365697, 361280, 356937, 352310, 347127, 341553, 335946, 330445, 325002, 319676, 314649, 309963, 305404, 300702, 295780, 290774, 285827, 280954, 276175, 271739, 268037, 265213, 263003, 261115, 259578, 258490, 257559, 256285, 254596, 252981, 251909, 251382, 251115, 250894, 250592, 250134, 249641, 249423, 249662, 250203, 250794, 251319, 251720, 251908, 251915, 251945, 252080, 252177, 252178, 252271, 252539, 252707, 252542, 252247, 252133, 252102, 251869, 251532, 251450, 251588, 251464, 250813, 249895, 249079, 248448, 247925, 247466, 246977, 246306, 245469, 244656, 243912, 243023, 241874, 240647, 239554, 238575, 237614, 236719, 236010, 235553, 235407, 235611, 236029, 236411, 236731, 237228, 237947, 238507, 238539, 238158, 237731, 237394, 237021, 236547, 236039, 235554, 235188, 235165, 235612, 236282, 236739, 236783, 236532, 236155, 235751, 235373, 234922, 234066, 232557, 230632, 228812, 227305, 225833, 224118, 222246, 220467, 218824, 217144, 215251, 213131, 210966]
61594B10966j927j587j497j731j926j787j527j531j742j778j527j272j219j236
61580A88679j165j061j028j079j166j225j113p76m35l85n33m88j46J15j0k84k96
61563A77604k2K31K71J26j55n28p71o22j28L37N26N56N88N13J84k29l40n3K76
61544A78364K87L9j93l32n08o71n54j13K72K08k07n41o00n97p25q74q30o24m90
61525A71311n89q64j146j306j303j160r85r05r46r54p22k80j0k73r59j556j740
61508A55613j711j764j821j593j087o49n43p55j133j474j483j009l46n5l17p67
61492A39106j013j028r44p53m69l33n31r03j135j156j092r68p31m56k78j87q2
61475A27047K6J13K96O56R50Q31L50n1o2J74L23K24p5m02n21k91J52N41P72R09
$$ y = [210966, 209039, 207452, 205955, 204224, 202298, 200511, 198984, 197453, 195711, 193933, 192406, 191134, 189915, 188679, 187514, 186453, 185425, 184346, 183180, 181955, 180842, 180066, 179631, 179246, 178713, 178225, 178079, 178194, 178184, 177900, 177604, 177582, 177813, 178084, 178210, 178055, 177527, 176756, 176134, 176006, 176343, 176869, 177425, 178013, 178526, 178710, 178481, 178141, 178088, 178364, 178651, 178690, 178497, 178165, 177657, 176986, 176432, 176319, 176591, 176799, 176592, 176051, 175451, 174854, 174129, 173255, 172425, 171801, 171311, 170722, 169858, 168712, 167406, 166103, 164943, 163958, 163053, 162107, 161153, 160431, 160151, 160141, 159868, 158909, 157353, 155613, 153902, 152138, 150317, 148724, 147637, 146988, 146445, 145690, 144557, 143083, 141600, 140591, 140245, 140190, 139873, 139106, 138093, 137065, 136121, 135368, 134899, 134566, 134035, 133132, 131997, 130841, 129749, 128781, 128050, 127594, 127316, 127129, 127047, 127073, 127186, 127482, 128138, 129088, 129919, 130269, 130218, 130156, 130330, 130653, 130877, 130802, 130400, 129879, 129588, 129740, 130281, 131053, 131962]
61455A31962R12O39K31J23M90R56J057Q02N48M65M40L97M19N32O18N91N08M28
61437A42118K98Q0p4O2N10R37R01L10l72n26l3O32R60R00O93M35M8m18p50q55
61417A45856q41p64n30j59P3m8l69n30m05j85r6j74l15m22m16k64k3J81K71K61
61397A41101J44j28m72o10l17K30N87N14J85r9k33k33l1M16Q74R45M94j84o70
61378A42513p61m98m3L89O31O88O61N51K35k17m86l77j18m0r3L2L60N43L60L6
61358A44366o6J55N97J127J535J511R97M53M07P78R80P72O11R62J544J670J187
61341A59586O39N12O81P65P02P06Q51J036J226J429J511J283Q46N43M91M32J67
61324A73406o5J22P34J347J524J211P30M86N82O92M18j50m84k95L2lk92l19J6
$$ y = [131962, 132874, 133513, 133744, 133867, 134357, 135313, 136370, 137172, 137720, 138185, 138625, 139022, 139441, 139973, 140591, 141182, 141690, 142118, 142416, 142496, 142422, 142484, 142994, 143931, 144832, 145142, 144770, 144244, 144211, 144843, 145803, 146703, 147396, 147831, 147879, 147461, 146711, 145856, 145015, 144251, 143721, 143562, 143635, 143587, 143218, 142688, 142283, 142098, 142002, 141828, 141513, 141091, 140675, 140411, 140388, 140569, 140840, 141101, 141245, 141117, 140645, 140035, 139718, 139948, 140535, 141049, 141234, 141135, 140902, 140669, 140638, 141054, 141928, 142873, 143367, 143183, 142513, 141752, 141254, 141211, 141600, 142231, 142919, 143580, 144131, 144366, 144149, 143663, 143286, 143168, 143128, 143035, 143067, 143427, 143970, 144330, 144366, 144300, 144455, 145052, 146179, 147714, 149225, 150222, 150675, 151082, 151860, 152840, 153612, 154223, 155185, 156729, 158399, 159586, 160225, 160737, 161418, 162183, 162885, 163591, 164442, 165478, 166704, 168133, 169644, 170927, 171773, 172316, 172807, 173239, 173406, 173341, 173463, 174197, 175544, 177068, 178279, 179009, 179495, 180077, 180769, 181187, 181037, 180553, 180258, 180290, 180287, 179995, 179676, 179692]
61305A79692K39N3k27j91R6L08L92M78M57R8m52p10n02k10k20m23m99l96l19l25
61285A77339k97k19k16l18m37n80q19j016q69l49J68M03N32Q28J159J218J079
61268A77606J130J447J673J592J512J818K382K721K544K001J430J080J016J136
61254B01088J262J323J418J612J804J803J571J244J007R72J092J172J044Q07P51
61239B19970R81J239J220Q90L71k17p00q07m65l7P9n3n7J70L61L50L17M66P17
61220B24795Q93R95J135J350J593J819K000K164K398K700K873K691K234J852J750
61205B53242J826J928K076K300K465K391K096J720J375J122J022J054J053Q11
61191B76481K54n10j186j447j206p84o35q62j182j324j292j167r51o78m76m10
$$ y = [179692, 179931, 179984, 179757, 179566, 179662, 179970, 180362, 180840, 181297, 181395, 180943, 180233, 179731, 179521, 179301, 178878, 178379, 177983, 177664, 177339, 177042, 176823, 176607, 176289, 175852, 175272, 174453, 173437, 172568, 172219, 172387, 172790, 173322, 174150, 175309, 176527, 177606, 178736, 180183, 181856, 183448, 184960, 186778, 189160, 191881, 194425, 196426, 197856, 198936, 199952, 201088, 202350, 203673, 205091, 206703, 208507, 210310, 211881, 213125, 214132, 215104, 216196, 217368, 218412, 219219, 219970, 220951, 222190, 223410, 224300, 224671, 224454, 223754, 222947, 222482, 222445, 222524, 222471, 222414, 222584, 222945, 223295, 223612, 224078, 224795, 225688, 226683, 227818, 229168, 230761, 232580, 234580, 236744, 239142, 241842, 244715, 247406, 249640, 251492, 253242, 255068, 256996, 259072, 261372, 263837, 266228, 268324, 270044, 271419, 272541, 273563, 274617, 275670, 276481, 276735, 276225, 275039, 273592, 272386, 271602, 270967, 270105, 268923, 267599, 266307, 265140, 264189, 263511, 263035, 262625]
61175B62625m21m95o48p38n30r1J77R6m5L1J88K42L45O51Q72O43J72l5K2j18n73
61154B62370q56o32k36j70m21o00n31l82l18l15l02k95l42m21m34k89j3K35L31
61135B56379K90K05J63L16Q43J660K305K399K171K169K521K800K699K487K619
61120B82026L136L677L906L790L541L505L853M345M507M197L808L760M017M266
61106C36334M401M535M659M627M397M077L669L081K408J999K083K422K494K017
61092C83203J176L92j06l97o69j002j410j896k391k705k764k817l205l910m586
61077C56913n022n319n566n650n547n466n493n373m917m409m188m092l699l077
61063B89095k768l001l315l146k424j496p11k78k73n27o62m43L4N51J027J429
$$ y = [262625, 262204, 261709, 261061, 260323, 259793, 259702, 259879, 259975, 259930, 259961, 260149, 260391, 260736, 261387, 262259, 262902, 263074, 263039, 263061, 262943, 262370, 261514, 260882, 260646, 260476, 260055, 259455, 258924, 258542, 258224, 257909, 257607, 257312, 256970, 256549, 256115, 255826, 255813, 256048, 256379, 256669, 256874, 257037, 257353, 258196, 259856, 262161, 264560, 266731, 268900, 271421, 274221, 276920, 279407, 282026, 285162, 288839, 292745, 296535, 300076, 303581, 307434, 311779, 316286, 320483, 324291, 328051, 332068, 336334, 340735, 345270, 349929, 354556, 358953, 363030, 366699, 369780, 372188, 374187, 376270, 378692, 381186, 383203, 384379, 384771, 384665, 384268, 383599, 382597, 381187, 379291, 376900, 374195, 371431, 368614, 365409, 361499, 356913, 351891, 346572, 341006, 335356, 329809, 324343, 318850, 313477, 308560, 304151, 299963, 295871, 292172, 289095, 286327, 283326, 280011, 276865, 274441, 272945, 272234, 271956, 271683, 271156, 270494, 270051, 270085, 270636, 271663, 273092]
61047B73092J665J790K052K562K995L001K739K724L162L765M260M702N192N611
61033C19312N819N961O237O602O844O933P046P273P555P864Q235Q591Q772Q805
61019D21849Q915R195R436R447R316R239R208R127R108R359R796J0063R990R765
61005E53813R590R410R172R072R346R850J0150R952R334Q577P943P574P378P051
60991F78212O342N360M466L839L345K802K161J365K72j102k432l386l968m409
60977F92867m861n358o001o895p834q385q364q112q136q575r102r329r160q829
60963E83926q630q625q572q210p560o859o215n529m803m277m061l848l284k482
60949E00971j831j350o86K15R01J110J277J967L065L976M495M976N693O499P266
$$ y = [273092, 274757, 276547, 278599, 281161, 284156, 287157, 289896, 292620, 295782, 299547, 303807, 308509, 313701, 319312, 325131, 331092, 337329, 343931, 350775, 357708, 364754, 372027, 379582, 387446, 395681, 404272, 413044, 421849, 430764, 439959, 449395, 458842, 468158, 477397, 486605, 495732, 504840, 514199, 523995, 534058, 544048, 553813, 563403, 572813, 581985, 591057, 600403, 610253, 620403, 630355, 639689, 648266, 656209, 663783, 671161, 678212, 684554, 689914, 694380, 698219, 701564, 704366, 706527, 707892, 708164, 707062, 704630, 701244, 697276, 692867, 688006, 682648, 676647, 669752, 661918, 653533, 645169, 637057, 628921, 620346, 611244, 601915, 592755, 583926, 575296, 566671, 558099, 549889, 542329, 535470, 529255, 523726, 518923, 514646, 510585, 506737, 503453, 500971, 499140, 497790, 497104, 497319, 498220, 499330, 500607, 502574, 505639, 509615, 514110, 519086, 524779, 531278, 538544]
60934E38544Q240R626J1166J2485J3724J5422J7827K0611K3410K6391L0113L4949
60922G62508M0945M8241N7450O9404Q4569J02889J24029J47338J71230J92972
60912A801575K09842K20881K27462K32120K37069K43816K53343K65752K79506
60903C971366K91637K99208L00734K96375K87152K74157K58206K39749K18933
60894F437517J95762J70179J42030J11262P8634M6139J6157j0296l4406n8441
60884G094537q4019j11756j42226j76092k12700k48949k80444l03924l18421l24468
60874D891538l23135l16138l06101k95760k86652k78675k70726k61530k50064
60865B302757k35730k18364j98203j75997j53186j31612j12596r6286q2105o9690
$$ y = [538544, 546784, 556410, 567576, 580061, 593785, 609207, 627034, 647645, 671055, 697446, 727559, 762508, 803453, 851694, 909144, 978548, 1063117, 1166006, 1290035, 1437373, 1608603, 1801575, 2011417, 2232298, 2459760, 2691880, 2928949, 3172765, 3426108, 3691860, 3971366, 4263003, 4562211, 4862945, 5159320, 5446472, 5720629, 5978835, 6218584, 6437517, 6633279, 6803458, 6945488, 7056750, 7135384, 7181523, 7197680, 7187384, 7152978, 7094537, 7010518, 6898762, 6756536, 6580444, 6367744, 6118795, 5838351, 5534427, 5216006, 4891538, 4568403, 4252265, 3946164, 3650404, 3363752, 3085077, 2814351, 2552821, 2302757, 2067027, 1848663, 1650460, 1474463, 1321277, 1189665, 1077069, 980783, 898678, 828988]
60855H28988n9154n0546m3549l7781l3080k9289k6111k3294k0828j8753j6998
60844D69605j5462j4163j3130j2296j1563j0918j0362r843r313q725q004p138
60832C38688o343n926n879n810n419m831m374m127l924l641l318l052k930k946
60818B76168k970k843k638k601k760k799k531k239k305k649k887k884k826k828
60804B38408k822k866l111l464l590l406l205l165l079k738k292k005j877j825
60790A98963j907k119k163j740j001l11K46Q00J184J015L95J6L47R86J225R77
60774A96913P88R84J279J278J053J001J282J671J893J941J933J842J528J004N29
60759B16919L43L95M04J98j46m26n11m14k41j38k18m89q78j312j750k127k363
$$ y = [828988, 769834, 719288, 675739, 637958, 604878, 575589, 549478, 526184, 505356, 486603, 469605, 454143, 439980, 426850, 414554, 402991, 392073, 381711, 371868, 362555, 353830, 345826, 338688, 332345, 326419, 320540, 314730, 309311, 304480, 300106, 295979, 292055, 288414, 285096, 282044, 279114, 276168, 273198, 270355, 267717, 265116, 262356, 259557, 257026, 254787, 252482, 249833, 246946, 244062, 241236, 238408, 235586, 232720, 229609, 226145, 222555, 219149, 215944, 212779, 209700, 206962, 204670, 202665, 200788, 198963, 197056, 194937, 192774, 191034, 190033, 189722, 189968, 190768, 191952, 192967, 193362, 193378, 193725, 194711, 195936, 196913, 197701, 198685, 199964, 201242, 202295, 203296, 204578, 206249, 208142, 210083, 212016, 213858, 215386, 216390, 216919, 217262, 217657, 218061, 218259, 218113, 217687, 217176, 216762, 216521, 216383, 216165, 215676, 214798, 213486, 211736, 209609, 207246]
60742B07246k409k274k030j836j906k269k634k675k500k528k845k993k613k072
60728A73662k021k475k797k579k132j938k007k014j831j562j267q94m69j28N5
60713A49603O2j47n19p74o29j85J58K26K52M73P49Q07O68N92P01Q69R82J048J013
60694A55949P05J25m06n67m11k47j50R2N01O94L29l87r07j024j003j064j079r30
60676A50220q74j234j849k177j920j348r26q11q58r29j013j107j089q40m07%K16
60659A33054K37J74J22J63L44N76N86K15k57l24R1M65L70M9N1M57Q31Q79P61P12
60639A39556O95O26O25Q28J149J370J384J189Q32N09N07Q54J148R86M56k4k31
60622A52459k72k60j71m9j7n3L7L02N13M29M0n44j214j759j872j472r02n99o18
$$ y = [207246, 204837, 202563, 200533, 198697, 196791, 194522, 191888, 189213, 186713, 184185, 181340, 178347, 175734, 173662, 171641, 169166, 166369, 163790, 161658, 159720, 157713, 155699, 153868, 152306, 151039, 150145, 149676, 149548, 149603, 149665, 149518, 148999, 148225, 147596, 147411, 147569, 147795, 148047, 148520, 149269, 150076, 150744, 151336, 152037, 152906, 153888, 154936, 155949, 156654, 156779, 156373, 155806, 155395, 155148, 154998, 155090, 155591, 156285, 156614, 156227, 155320, 154296, 153293, 152229, 151150, 150220, 149346, 148112, 146263, 144086, 142166, 140818, 139892, 139081, 138223, 137294, 136281, 135174, 134085, 133245, 132838, 132838, 133054, 133291, 133465, 133587, 133750, 134094, 134670, 135256, 135471, 135214, 134890, 134981, 135446, 135816, 135865, 135916, 136373, 137204, 138083, 138844, 139556, 140251, 140877, 141502, 142330, 143479, 144849, 146233, 147422, 148254, 148763, 149270, 150124, 151272, 152258, 152714, 152690, 152459, 152187, 151927, 151756, 151707, 151690, 151637, 151674, 151976, 152489, 152918, 152958, 152414, 151200, 149441, 147569, 146097, 145195, 144596, 143978]
60603A43978p06p17p25p65p39o33n71n91n94n83p24j010j130q50l62k5R6J62J90
60584A33701P2q6n7J22J50OO8N06R20Q50M15J15J95M63O86P83P18N29M13N54P54
60563A41877O24J10m01o24o83p57p26m09M1K90K73K18K62K64P6j92k99j96l9L2
60543A39741Q4K16L27J92j82m99n44m52m39m37k56J7O1j91m73n36m05j92N2K19
60523A36303J54o9j79j06r2k59l66k06K3M5p5j09n7k3P5L58N78M00j0j14K23M96
60501A36990K79k01m35l09j03RJ33L80O66Q29Q41P42N65L41K09L37O94J017J112
60482A44096J098J224J455J518J339J181J218J265J127R83J110J441J678J749
60468A62482J808J848J675J328J124J248J495J569J414J185J062J173J481J765
$$ y = [143978, 143272, 142555, 141830, 141065, 140326, 139693, 139122, 138531, 137937, 137354, 136630, 135620, 134490, 133640, 133278, 133253, 133349, 133511, 133701, 133773, 133687, 133630, 133752, 133902, 133908, 133976, 134482, 135402, 136252, 136667, 136782, 136977, 137440, 138126, 138909, 139627, 140156, 140569, 141123, 141877, 142501, 142611, 142210, 141586, 140903, 140146, 139420, 139011, 139052, 139342, 139615, 139833, 140095, 140359, 140435, 140243, 139944, 139748, 139709, 139741, 139825, 140041, 140368, 140560, 140378, 139879, 139335, 138883, 138444, 138007, 137751, 137768, 137829, 137638, 137165, 136629, 136224, 136032, 136084, 136303, 136457, 136388, 136209, 136103, 136011, 135752, 135386, 135180, 135203, 135248, 135173, 135064, 135007, 134984, 135059, 135417, 135995, 136395, 136385, 136271, 136494, 136990, 137269, 137068, 136633, 136324, 136221, 136230, 136363, 136743, 137409, 138238, 139079, 139821, 140386, 140727, 140936, 141273, 141967, 142984, 144096, 145194, 146418, 147873, 149391, 150730, 151911, 153129, 154394, 155521, 156504, 157614, 159055, 160733, 162482, 164290, 166138, 167813, 169141, 170265, 171513, 173008, 174577, 175991, 177176, 178238, 179411, 180892, 182657]
60454A82657J850J921K273K802L037K808K506K511K700K780K822L100L588L968
60440B21323M064L986L842L590L235K943K850K914K993L008K953K817K599K354
60426B65471K197K174K134J835J260P21N13N10L37n3k72JN90J051J176J112J174
60409B81931J656K629L811M766N369N914O615P279P626P766P978Q211Q183P892
60395C67626P685P722P733P412O801O142N516M816L967L016K094J300O29r6j113
60380D31250k487m000n354o454p439q451r408j0107j0534j0940j1511j2049j2199
60367C20317j1957j1738j1780j1815j1456j0713r858q983q005o988o168n611n182
60354B00063m824m590m404m047l486k944k547k183j779j486j443j534j532j378
$$ y = [182657, 184507, 186428, 188701, 191503, 194540, 197348, 199854, 202365, 205065, 207845, 210667, 213767, 217355, 221323, 225387, 229373, 233215, 236805, 240040, 242983, 245833, 248747, 251740, 254748, 257701, 260518, 263117, 265471, 267668, 269842, 271976, 273811, 275071, 275792, 276305, 276815, 277152, 277099, 276827, 276828, 277418, 278469, 279645, 280757, 281931, 283587, 286216, 290027, 294793, 300162, 306076, 312691, 319970, 327596, 335362, 343340, 351551, 359734, 367626, 375311, 383033, 390766, 398178, 404979, 411121, 416637, 421453, 425420, 428436, 430530, 431830, 432459, 432363, 431250, 428763, 424763, 419409, 412955, 405516, 397065, 387657, 377550, 367016, 356076, 344565, 332516, 320317, 308360, 296622, 284842, 273027, 261571, 250858, 241000, 232017, 224012, 217024, 210856, 205245, 200063, 195239, 190649, 186245, 182198, 178712, 175768, 173221, 171038, 169259, 167773, 166330, 164796, 163264, 161886]
60340A61886j176j039j018j058r74n93n1K80K15l3j53n8J70M55O50N71K56L5P1
60321A58436O8k60o32m96J59P68R52R14R38R39P39M91M68N91N65L67K81M29N75
60302A66292N10L91N24R24J320J489J513J629J909K130J978J414Q07O01Q69J287
60286A85587J538J618J652J592J306Q98O82Q16J109J290J284J213J214J356J620
60271B04775J862J901J740J560J471J383J235J191J417J795K065K134K070J859
60257B28458J455J005P68P67P48N95N05O55R05R87Q15M80N5l88p31r24j058j210
60239B33887j282j171r78q95r63j081j189j278j317j295j281j277j120p23l15
60224B17722j67j86m9K64M01K01m1J0K65M18L82L00K59K44K76L58L65J95k3p8
$$ y = [161886, 160710, 159671, 158653, 157595, 156621, 156028, 155977, 156257, 156472, 156439, 156286, 156228, 156398, 156853, 157503, 158074, 158330, 158365, 158436, 158504, 158244, 157612, 157116, 157275, 158043, 158995, 159909, 160847, 161786, 162525, 163016, 163484, 164075, 164640, 165007, 165288, 165717, 166292, 166802, 167193, 167717, 168641, 169961, 171450, 172963, 174592, 176501, 178631, 180609, 182023, 182830, 183431, 184300, 185587, 187125, 188743, 190395, 191987, 193293, 194191, 194873, 195689, 196798, 198088, 199372, 200585, 201799, 203155, 204775, 206637, 208538, 210278, 211838, 213309, 214692, 215927, 217118, 218535, 220330, 222395, 224529, 226599, 228458, 229913, 230918, 231686, 232453, 233201, 233796, 234301, 234956, 235861, 236848, 237663, 238143, 238198, 237810, 237079, 236155, 235097, 233887, 232605, 231434, 230456, 229561, 228598, 227517, 226328, 225050, 223733, 222438, 221157, 219880, 218760, 218037, 217722, 217555, 217369, 217320, 217584, 217985, 218186, 218145, 218155, 218420, 218838, 219220, 219520, 219779, 220023, 220299, 220657, 221022, 221217, 221194, 221116]
60204B21116j8q0l04m77m79m86o88j031j371j657j869j899j707j510j544j748
60188B04248j841j724j579j563j612j594j554j614j754j823j710j422j010n39
60174A82909j27O3m7l72p53j064j220j135p51j60L64N19K41j85l52p2M63Q64Q99
60155A80084P07N83O20N73K06l29n93l76K9K31K43L55O15P26N15K20J53K70L06
60136A85138K18K59O01J109J526J712J689J563J515J716K164K599K727K494K157
60121B09187J986K002K016J894J707J560J423J225J044J042J185J254J164J073
60107B29762J079J017P44M10K17M9l25p37p23j98L06K41l21q20q24l83J13K52
60089B29859p1n62q00p24o87r43j264j241q31l25O7L61N49N39L84K93L48L41R9
$$ y = [221116, 221098, 221018, 220714, 220237, 219758, 219272, 218584, 217553, 216182, 214525, 212656, 210757, 209050, 207540, 205996, 204248, 202407, 200683, 199104, 197541, 195929, 194335, 192781, 191167, 189413, 187590, 185880, 184458, 183448, 182909, 182782, 182845, 182798, 182426, 181673, 180609, 179389, 178254, 177503, 177343, 177707, 178226, 178467, 178282, 177930, 177858, 178321, 179185, 180084, 180791, 181374, 181994, 182567, 182773, 182444, 181851, 181475, 181504, 181735, 181978, 182333, 182948, 183674, 184189, 184409, 184562, 184832, 185138, 185356, 185615, 186216, 187325, 188851, 190563, 192252, 193815, 195330, 197046, 199210, 201809, 204536, 207030, 209187, 211173, 213175, 215191, 217085, 218792, 220352, 221775, 223000, 224044, 225086, 226271, 227525, 228689, 229762, 230841, 231858, 232602, 233012, 233229, 233278, 232953, 232216, 231493, 231295, 231601, 231842, 231521, 230701, 229877, 229494, 229607, 229859, 229788, 229226, 228426, 227702, 227015, 226072, 224808, 223567, 222736, 222411, 222478, 222839, 223388, 223927, 224311, 224604, 224952, 225293, 225392]
60070B25392j95j97J44M77M86K56J75M33Q12R68Q68P75Q06P30L17k17l64J18R62
60051B32746J704K056J978J600J139P82N43L47K87N97J282J932K119J828J329
60036B52269P92K62q7l0L03M54J74l03o67r25j175j256r91o42o57r88j079o77
60018B44777k58l86r34j309j247j021q94q16o99o89r09j153j067n58J07N81P33
60001B34258P06P32Q84R84Q16M18P1l7L1J33K36L40L95L85L93M48L74K9m64q29
59981B40303j011j161j317j315j080q04p19q28r83j161j416j724j944k010j993
59966B20837j992k018k050k043j909j598j230j017r78q32l71J92M29K24j30l41
59950B05173m38n45o35o11n23n19o32p65q34q28p45o79q12j185j520j489j147
$$ y = [225392, 225197, 225000, 225144, 225621, 226107, 226363, 226538, 226971, 227783, 228751, 229619, 230394, 231200, 231930, 232247, 232030, 231666, 231784, 232746, 234450, 236506, 238484, 240084, 241223, 242005, 242548, 242895, 243182, 243779, 245061, 246993, 249112, 250940, 252269, 253061, 253323, 253236, 253206, 253509, 253963, 254137, 253834, 253167, 252242, 251067, 249811, 248820, 248178, 247521, 246533, 245454, 244777, 244519, 244133, 243199, 241890, 240643, 239622, 238728, 237912, 237213, 236524, 235615, 234462, 233395, 232837, 232944, 233525, 234258, 234964, 235696, 236580, 237564, 238380, 238798, 238869, 238832, 238863, 238996, 239232, 239572, 239967, 240352, 240745, 241193, 241567, 241596, 241132, 240303, 239292, 238131, 236814, 235499, 234419, 233615, 232896, 232068, 231085, 229924, 228508, 226784, 224840, 222830, 220837, 218845, 216827, 214777, 212734, 210825, 209227, 207997, 206980, 206002, 205170, 204799, 204991, 205420, 205644, 205514, 205173, 204735, 204190, 203555, 202944, 202421, 201902, 201270, 200505, 199671, 198843, 198098, 197419, 196607, 195422, 193902, 192413, 191266]
59933A91266q49p96q70r24r89j083j122j048r40q92r20j049j260j360j155p93
59917A75216o48p83q00m34LO2k58n79o59n42l42j77j98m08n69m93k69o0J96N32
59897A68790O79M18N1P5M21N25J58k76l55j47P4K09K70K38J86K73M21L22r2m56
59877A71784m26q0L07N98P52P15O06P18J066J210Q24J77k52l99m44l05K29R13
59859A77993J147P56K34J03L14M51K98j0k22j86O2L21L94K29p4l59m54k45J69
59840A80921M83N27M78N46N72K67k22l73L4O66J134J434J716J891J751J320Q74
59823A94019O66P91J155J499J558J342J132J090J044Q12N03L43L00K16J52L29
59807B06951P24R95Q91N13J10j68k47q9K29N07O31P09Q59R71Q43N01K46L13O22
$$ y = [191266, 190417, 189621, 188751, 187827, 186838, 185755, 184633, 183585, 182645, 181753, 180833, 179784, 178524, 177164, 176009, 175216, 174568, 173785, 172985, 172551, 172554, 172616, 172358, 171779, 171120, 170578, 170236, 170059, 169861, 169453, 168884, 168391, 168122, 168062, 168258, 168790, 169469, 169887, 169938, 170013, 170434, 170959, 171117, 170841, 170486, 170339, 170413, 170622, 170892, 171130, 171316, 171589, 172010, 172332, 172240, 171784, 171358, 171278, 171585, 172183, 172935, 173650, 174256, 174974, 176040, 177250, 178074, 178251, 177999, 177600, 177156, 176851, 177080, 177993, 179140, 179896, 180130, 180233, 180547, 180998, 181296, 181286, 181064, 180878, 180940, 181261, 181655, 181884, 181810, 181451, 180997, 180752, 180921, 181404, 181931, 182409, 182955, 183527, 183794, 183572, 183199, 183233, 183899, 185033, 186467, 188183, 190074, 191825, 193145, 194019, 194685, 195476, 196631, 198130, 199688, 201030, 202162, 203252, 204296, 205108, 205611, 205954, 206254, 206470, 206622, 206951, 207675, 208670, 209561, 210074, 210184, 210016, 209769, 209680, 209909, 210416, 211047, 211756, 212615, 213586, 214429, 214930, 215176, 215489, 216111]
59788B16111R01R76Q88P77P55Q75J084J231J150R01P49R00J232J452J451J379
59772B32812J350J249R34M97J77J02K20M45P12R21R75Q91Q02P46O40M62L78N90
59754B44903J026J395J501J465J533J697J698J415J101J083J321J503J487J436
59740B64564J458J377J044O65N37O03N63L20O4j35m58r35j254j147q19p28j070
59723B64649j637k138k472k670k736k647k467k351k423k597k587k203j621j206
59709B32894j106j134j124j160j336j492j390j064p50n77m96m76n49o80p66p83
59693B18011p74o91m55j36J13K91N05P06O84L84J9k29l49l34q2L40O40O44N71
59674B19858P00R99J242J386J534J609J375Q34L68L83Q92J513J882J997K176K608
$$ y = [216111, 217012, 217988, 218876, 219653, 220408, 221283, 222367, 223598, 224748, 225649, 226398, 227298, 228530, 229982, 231433, 232812, 234162, 235411, 236345, 236842, 237019, 237121, 237341, 237786, 238498, 239419, 240394, 241285, 242087, 242833, 243473, 243935, 244313, 244903, 245929, 247324, 248825, 250290, 251823, 253520, 255218, 256633, 257734, 258817, 260138, 261641, 263128, 264564, 266022, 267399, 268443, 269108, 269645, 270248, 270811, 271131, 271195, 271060, 270602, 269667, 268413, 267266, 266447, 265719, 264649, 263012, 260874, 258402, 255732, 252996, 250349, 247882, 245531, 243108, 240511, 237924, 235721, 234100, 232894, 231788, 230654, 229530, 228370, 227034, 225542, 224152, 223088, 222338, 221761, 221265, 220789, 220240, 219560, 218794, 218011, 217237, 216546, 216091, 215955, 216068, 216359, 216864, 217570, 218254, 218638, 218657, 218428, 218079, 217745, 217663, 218003, 218643, 219287, 219858, 220558, 221557, 222799, 224185, 225719, 227328, 228703, 229537, 229905, 230288, 231180, 232693, 234575, 236572, 238748, 241356]
59658B41356L047L079K684K290K235K402K503K495K500K507K449K377K353K292
59644B76569K175K240K623K959K742K047J459J314J394J444J501J628J619J279
59630C02993P15J70k36m64m60k80j33j51k41l01l65m54m78m15l76l89l33j55M7
59611B98694K31M49N50K32m32q48o24o9K56K60K06J87J36J92N12Q47P63L14J5
59592C01871J15L46M23M34N10M99J53n05j192j618j680j502j337j298j231j024
59576B92964r12j212j774k070j865j482j328j432j606j767j928k045k053j961
59562B69529j787j564j388j383j547j804k147k493k526j995j218q43j063j405
59548B46366j469j393j420j437j307j244j482j812j869j726j720j867j846j560
$$ y = [241356, 244403, 247482, 250166, 252456, 254691, 257093, 259596, 262091, 264591, 267098, 269547, 271924, 274277, 276569, 278744, 280984, 283607, 286566, 289308, 291355, 292814, 294128, 295522, 296966, 298467, 300095, 301714, 302993, 303708, 303878, 303642, 303178, 302718, 302438, 302305, 302154, 301913, 301612, 301247, 300793, 300315, 299900, 299524, 299135, 298802, 298647, 298694, 298925, 299374, 299924, 300156, 299724, 298876, 298252, 298183, 298439, 298699, 298905, 299092, 299228, 299420, 299932, 300779, 301542, 301856, 301871, 301986, 302332, 302755, 303189, 303699, 304198, 304351, 303846, 302654, 301036, 299356, 297854, 296517, 295219, 293988, 292964, 292052, 290840, 289066, 286996, 285131, 283649, 282321, 280889, 279283, 277516, 275588, 273543, 271490, 269529, 267742, 266178, 264790, 263407, 261860, 260056, 257909, 255416, 252890, 250895, 249677, 248834, 247771, 246366, 244897, 243504, 242084, 240647, 239340, 238096, 236614, 234802, 232933, 231207, 229487, 227620, 225774, 224214]
59534B24214j301j331j619k000k374k681k893l032l040k748k141j549j332j422
59520A94751j483j370j178r09m77k2J31o1l10m10m22l51l7M66P42N27J20j6J94
59501A89885M53N82O34O65O39N49M58L81K65J49J57L43N93P11O02L43J17N6J03
59482A97685J02j8j66k21j74j04q8j86m12o86q35p41m59j70m0j00k14k15r7j6
59462A92845j6J09N34J048J260J151J131J470J943K187K162K074K015J940J866
59447B13719J833J753J552J407J601K102K510K483K079J641J433J473J573J512
59433B38671J246R48P91P10M96J22k29m33o00q79j220j440j479j496j686k014
59417B31508k184j935j410j070j185j485j508j204r68j106j481j774j843j721
$$ y = [224214, 222913, 221582, 219963, 217963, 215589, 212908, 210015, 206983, 203943, 201195, 199054, 197505, 196173, 194751, 193268, 191898, 190720, 189811, 189334, 189312, 189443, 189382, 189072, 188662, 188240, 187889, 187852, 188318, 189060, 189587, 189707, 189691, 189885, 190338, 190920, 191554, 192219, 192858, 193407, 193865, 194246, 194511, 194660, 194817, 195160, 195753, 196464, 197066, 197409, 197526, 197582, 197685, 197787, 197769, 197603, 197382, 197208, 197104, 197016, 196830, 196418, 195732, 194897, 194156, 193697, 193527, 193487, 193387, 193173, 192958, 192861, 192845, 192829, 192938, 193472, 194520, 195780, 196931, 198062, 199532, 201475, 203662, 205824, 207898, 209913, 211853, 213719, 215552, 217305, 218857, 220264, 221865, 223967, 226477, 228960, 231039, 232680, 234113, 235586, 237159, 238671, 239917, 240865, 241656, 242366, 242862, 242984, 242755, 242322, 241722, 240843, 239623, 238183, 236704, 235208, 233522, 231508, 229324, 227389, 225979, 224909, 223724, 222239, 220731, 219527, 218559, 217453, 215972, 214198, 212355, 210634]
59403B10634j434j065p99p71q82r28q40o53l76j7L11M61M46L67K91K81M83R28
59385B06437J305J232P65L85L69N15N60N84P71J046J229J405J760K177K317K115
59369B24972J876J822J832J730J564J449J339J149R46Q82R93J180J312J298J178
59354B45522J139J316J526J468J220J209J567J779J346N13k8ML23O71J072J470
59338B62117J608J441J324J520J823J934J976K301K947L567L855L811L648L589
59324B97461L750M049M257M255M168M169M219M187M111M161M355M447M174L498
59310C55261K627J858J349R84N40J7l56m86o29j022j545j979k414l065l756m050
59294C43334l835l471l292l295l444l842m385m659m433m016l836l852l734l403
$$ y = [210634, 209200, 208135, 207336, 206565, 205683, 204755, 203915, 203262, 202886, 202869, 203180, 203641, 204087, 204454, 204745, 205026, 205509, 206437, 207742, 208974, 209739, 210124, 210493, 211008, 211568, 212152, 212923, 213969, 215198, 216603, 218363, 220540, 222857, 224972, 226848, 228670, 230502, 232232, 233796, 235245, 236584, 237733, 238679, 239561, 240554, 241734, 243046, 244344, 245522, 246661, 247977, 249503, 250971, 252191, 253400, 254967, 256746, 258092, 258605, 258577, 258581, 258904, 259575, 260647, 262117, 263725, 265166, 266490, 268010, 269833, 271767, 273743, 276044, 278991, 282558, 286413, 290224, 293872, 297461, 301211, 305260, 309517, 313772, 317940, 322109, 326328, 330515, 334626, 338787, 343142, 347589, 351763, 355261, 357888, 359746, 361095, 362079, 362619, 362636, 362280, 361794, 361165, 360143, 358598, 356619, 354205, 351140, 347384, 343334, 339499, 336028, 332736, 329441, 325997, 322155, 317770, 313111, 308678, 304662, 300826, 296974, 293240, 289837]
59280B89837l044k700k234j657j149p24k06M25R26J188J440J874K301K404K237
59265B90918K266K875L899M680M647L910L205L137L520L723L541L388L482L390
59251C40581K677J717J267J394J352O90j31m31k67k54p23j438k096k653l132l435
59235C35118l550l689m025m443m704m753m703m628m567m593m717m757m499l990
59221B73500l478l073k643k137j766j703j798j714j319p99m06k46k55l32m03m54
59205B50974m74m01j83R6K33J72J67N35J270J975K232J963J418R10N63L01M6q2
59187B61715J21O53J206J492J537J543J591J614J674J938K391K727K693K389K174
59172B87458K278K597K814K731K483K365K438K403K015J481J209J240J240J048
$$ y = [289837, 286793, 284093, 281859, 280202, 279053, 278329, 278123, 278548, 279474, 280662, 282102, 283976, 286277, 288681, 290918, 293184, 296059, 299958, 304638, 309285, 313195, 316400, 319537, 323057, 326780, 330321, 333709, 337191, 340581, 343258, 344975, 346242, 347636, 348988, 349678, 349547, 349116, 348849, 348595, 347872, 346434, 344338, 341685, 338553, 335118, 331568, 327879, 323854, 319411, 314707, 309954, 305251, 300623, 296056, 291463, 286746, 281989, 277490, 273500, 270022, 266949, 264306, 262169, 260403, 258700, 256902, 255188, 253869, 253070, 252664, 252418, 252163, 251831, 251428, 250974, 250500, 250099, 249916, 250012, 250245, 250417, 250584, 251119, 252389, 254364, 256596, 258559, 259977, 260887, 261450, 261751, 261797, 261715, 261836, 262489, 263695, 265187, 266724, 268267, 269858, 271472, 273146, 275084, 277475, 280202, 282895, 285284, 287458, 289736, 292333, 295147, 297878, 300361, 302726, 305164, 307567, 309582, 311063, 312272, 313512, 314752, 315800]
59158C15800Q49P38M67j25p39r74q60p25p53r52j403k111k712k724k195j744j860
59141B97977k407k925l176l228l174k986k650k281k095k233k552k728k614k411
59127B60517k314k194j824j367j195j341j461j415j446j683j841j650j234p98
59113B38754l05K68N98L90r1k94p0K13K56J55J41K81M93O23N09J35k58m36n20
59094B40842p72j097j098o70k14j27l11l83j96R0K53J88n5l02m07m19n20p03p36
59075B33363n51l89m50n70n28m61o83j126j363j190q98q72j086j244j192j077
59059B19683j111j342j641j846j882j835j831j886j851j602j225r60r55j139j342
59044A97235j511j680j840j862j648j218o75r7L98O23M56N8j98m4M75J159J847
$$ y = [315800, 316649, 317387, 317854, 317729, 316990, 316016, 315156, 314431, 313678, 312726, 311323, 309212, 306500, 303776, 301581, 299837, 297977, 295570, 292645, 289469, 286241, 283067, 280081, 277431, 275150, 273055, 270822, 268270, 265542, 262928, 260517, 258203, 256009, 254185, 252818, 251623, 250282, 248821, 247406, 245960, 244277, 242436, 240786, 239552, 238754, 238449, 238717, 239315, 239705, 239614, 239320, 239250, 239463, 239719, 239874, 240015, 240296, 240789, 241412, 241921, 242056, 241798, 241362, 240842, 240070, 238973, 237875, 237205, 236991, 236864, 236553, 236170, 235974, 236064, 236317, 236505, 236450, 236148, 235741, 235322, 234802, 234099, 233363, 232812, 232423, 231973, 231403, 230875, 230414, 229731, 228605, 227242, 226052, 225154, 224282, 223196, 221952, 220760, 219683, 218572, 217230, 215589, 213743, 211861, 210026, 208195, 206309, 204458, 202856, 201631, 200671, 199716, 198577, 197235, 195724, 194044, 192204, 190342, 188694, 187476, 186801, 186704, 187102, 187725, 188181, 188239, 188041, 187997, 188472, 189631, 191478]
59027A91478K445K838K947K842K734K792L000L142L016K709K617L050L764M133
59013B33507L866L359L197L419L581L372K944K584K380K261K149J915J411P00
58999B70645J10p7N0J76R0k28p53j424k023k304k226j989j804j754j879k181k499
58982B49930k567k312j995j942k175k465k599k563k465k448k562k662k503k055
58968B16617j605j428j422j312j050q09o15l70k16m80j090j474j267q20o82q02
58952B01175p03k73Q4J33J33L48O23P05O49P09R52J298J746K309K766K810K447
58935B17911K041J895J952J952J822J739J876K136K214J966J631J577J805J917
58921B44434J628J160R64J142J375J367J153R50Q31O86M18J25K8K15M42L40j18
$$ y = [191478, 193923, 196761, 199708, 202550, 205284, 208076, 211076, 214218, 217234, 219943, 222560, 225610, 229374, 233507, 237373, 240732, 243929, 247348, 250929, 254301, 257245, 259829, 262209, 264470, 266619, 268534, 269945, 270645, 270755, 270678, 270728, 270904, 270994, 270766, 270013, 268589, 266566, 264262, 262036, 260047, 258243, 256489, 254610, 252429, 249930, 247363, 245051, 243056, 241114, 238939, 236474, 233875, 231312, 228847, 226399, 223837, 221175, 218672, 216617, 215012, 213584, 212162, 210850, 209800, 208991, 208376, 208006, 207790, 207310, 206220, 204746, 203479, 202659, 201977, 201175, 200472, 200199, 200283, 200416, 200549, 200897, 201520, 202225, 202874, 203583, 204535, 205833, 207579, 209888, 212654, 215464, 217911, 219952, 221847, 223799, 225751, 227573, 229312, 231188, 233324, 235538, 237504, 239135, 240712, 242517, 244434, 246062, 247222, 248186, 249328, 250703, 252070, 253223, 254173, 255004, 255690, 256108, 256233, 256261, 256476, 256918, 257258, 257140]
58904B57140m75k96K60O44O07M41M80O61P74Q33R85J189J274J271J404J704J950
58887B70846J957J820J719J687J678J741J974K380K829L176L319L250L145L251
58873C04772L576L783L533K937K418K184K034J745J407J207J087Q19L53j14m01
58858C31340n27o11p22q93j163j562k066k574k934l049l009l046l276l520l549
58843B98839l424l413l555l523l054k368j979k146k631k942k821k445k213k275
58829B60050k305j838q57Q9M61K99Q1J16L10M67N91P71R40R57R00J084J702K494
58811B66312K936K826K535K628L231L930M322M470M706N138N541N709N671N554
58797C25509N369N101M881M854M960M950M712M384M097L711L041K231J708J711
$$ y = [257140, 256665, 256369, 256629, 257273, 257880, 258321, 258801, 259462, 260236, 261069, 262054, 263243, 264517, 265788, 267192, 268896, 270846, 272803, 274623, 276342, 278029, 279707, 281448, 283422, 285802, 288631, 291807, 295126, 298376, 301521, 304772, 308348, 312131, 315664, 318601, 321019, 323203, 325237, 326982, 328389, 329596, 330683, 331502, 331855, 331741, 331340, 330813, 330202, 329480, 328587, 327424, 325862, 323796, 321222, 318288, 315239, 312230, 309184, 305908, 302388, 298839, 295415, 292002, 288447, 284924, 281870, 279502, 277523, 275377, 272746, 269804, 266983, 264538, 262325, 260050, 257745, 255907, 255050, 255139, 255600, 255899, 255980, 256096, 256406, 256873, 257464, 258235, 259175, 260132, 261032, 262116, 263818, 266312, 269248, 272074, 274609, 277237, 280468, 284398, 288720, 293190, 297896, 303034, 308575, 314284, 319955, 325509, 330878, 335979, 340860, 345714, 350674, 355624, 360336, 364720, 368817, 372528, 375569, 377800, 379508, 381219]
58783C81219J971K034J697J087M35q3l74n02o74j018j392j612j749k021k400k635
58767C73983k659k697k907l179l397l643l970m209m224m178m255m335m215m017
58753C22098m098m514m930n028m815m437l979l571l459l768m266m518m312l826
58739B62577l375l070k807k485k150j876j622j350j176j201j226r16k82K33L19
58724B39593J89K31M82P11P98P88O54L59O9JM3j41o11j008j007p10m86o05j049
58705B38301j527j640j253p23n86r47j412j625j623j593j519j300j018q94j033
58690B19608j370j746j956j849j476j074q15o75n63m80m32l26r5K11M72O00N29
58673B08563K48q4k62l31n45r30j095p28j55m0n99j286j388p59R2N22L50l8j13
$$ y = [381219, 383190, 385224, 386921, 388008, 388443, 388360, 387986, 387484, 386810, 385792, 384400, 382788, 381039, 379018, 376618, 373983, 371324, 368627, 365720, 362541, 359144, 355501, 351531, 347322, 343098, 338920, 334665, 330330, 326115, 322098, 318000, 313486, 308556, 303528, 298713, 294276, 290297, 286726, 283267, 279499, 275233, 270715, 266403, 262577, 259202, 256132, 253325, 250840, 248690, 246814, 245192, 243842, 242666, 241465, 240239, 239323, 239041, 239274, 239593, 239782, 240013, 240495, 241206, 242004, 242792, 243446, 243805, 243874, 243875, 243918, 243777, 243166, 242158, 241151, 240441, 239955, 239350, 238301, 236774, 235134, 233881, 233158, 232572, 231625, 230213, 228588, 226965, 225372, 223853, 222553, 221535, 220641, 219608, 218238, 216492, 214536, 212687, 211211, 210137, 209322, 208647, 208084, 207604, 207172, 206846, 206751, 206962, 207434, 208034, 208563, 208811, 208727, 208465, 208134, 207589, 206659, 205564, 204836, 204681, 204641, 204042, 202756, 201368, 200609, 200701, 201223, 201573, 201535, 201422]
58654B01422K22N93O37M35L48N46Q54J054J166J362J712K050K136J941J721J785
58638B19984K119K408K449K426K646L082L402L420L352L493L736L605K828J761
58624B60711J085J064J285J224Q62N70N46O09N57M02K18l4m24r57j630k381k993
58607B60714l285l452l884m549m913m668m246m252m673m973m823m357l872l608
58593B01159l747m183m400m011l358l185l556l672k900j619o80l37j48K83Q24
58578A66470J107R96O73M07L57M95P30J027J377J646J582J129N72L15M93R44J417
58561A81737J685J540R36J72k66j93P7J15j61m78o58p87j010j265j411j449j495
58544A77089j568j559j442j336j328j334j240j051q30n25p9L93O28M94J21k35
$$ y = [201422, 201644, 202237, 202874, 203309, 203657, 204203, 205057, 206111, 207277, 208639, 210351, 212401, 214537, 216478, 218199, 219984, 222103, 224511, 226960, 229386, 232032, 235114, 238516, 241936, 245288, 248781, 252517, 256122, 258950, 260711, 261796, 262860, 264145, 265369, 266231, 266801, 267347, 267956, 268513, 268915, 269133, 269099, 268675, 267718, 266088, 263707, 260714, 257429, 253977, 250093, 245544, 240631, 235963, 231717, 227465, 222792, 217819, 212996, 208639, 204767, 201159, 197412, 193229, 188829, 184818, 181460, 178275, 174719, 171047, 168147, 166528, 165848, 165511, 165363, 165646, 166470, 167577, 168573, 169246, 169653, 170010, 170505, 171235, 172262, 173639, 175285, 176867, 177996, 178568, 178883, 179376, 180320, 181737, 183422, 184962, 185898, 186070, 185804, 185611, 185688, 185803, 185642, 185164, 184506, 183719, 182709, 181444, 180033, 178584, 177089, 175521, 173962, 172520, 171184, 169856, 168522, 167282, 166231, 165401, 164876, 164797, 165190, 165818, 166312, 166433, 166198]
58528A66198m01l11L2N07Q79R73Q35O67N87N21L64J39n3j62j59L3M57R42J154
58509A73202R30M71J45J69N01R28J219J211R73P76Q58J179J517J680J610J379
58493A88748J252J606K532L559M024L728L072K562K422K665L235L962M620N129
58479B33116N551N848N862N593N301N165N071M856M607M533M672M897N062N069
58465C05203M856M516M216L957L547K914K251J758J374R34M42nl98p89j199j624
58449C31953k057k422k697l070l715m392m638m448m350m612m825m582m110l846
58435B78189l780l672l617l817m037l898l523l320l271l026k611k429k523k466
58421B32199k074j658j430j220r58r01j124j298j164r24q19p64o17m77m55m19
$$ y = [166198, 165797, 165486, 165518, 166025, 166904, 167877, 168712, 169379, 169966, 170487, 170851, 170990, 170937, 170775, 170616, 170649, 171106, 172048, 173202, 174132, 174603, 174748, 174917, 175418, 176346, 177565, 178776, 179749, 180525, 181383, 182562, 184079, 185759, 187369, 188748, 190000, 191606, 194138, 197697, 201721, 205449, 208521, 211083, 213505, 216170, 219405, 223367, 227987, 233116, 238667, 244515, 250377, 255970, 261271, 266436, 271507, 276363, 280970, 285503, 290175, 295072, 300134, 305203, 310059, 314575, 318791, 322748, 326295, 329209, 331460, 333218, 334592, 335526, 335968, 335963, 335565, 334776, 333577, 331953, 329896, 327474, 324777, 321707, 317992, 313600, 308962, 304514, 300164, 295552, 290727, 286145, 282035, 278189, 274409, 270737, 267120, 263303, 259266, 255368, 251845, 248525, 245254, 242228, 239617, 237188, 234665, 232199, 230125, 228467, 227037, 225817, 224859, 223958, 222834, 221536, 220372, 219448, 218629, 217865, 217248, 216771, 216316, 215897]
58405B15897k82k11k98k95K1M57O72P06Q89J355J886K213K236K040J835J788J883
58388B32792J942J866J751J690J661J620J569J481J354J279J333J384J232R58
58374B53912Q15Q39Q25P41P68Q98R01P46O22M67o1r12j446j256p30m38l62j36
58356B56193K26L86K63R3Rn2r1j5J28J66K6k15m22m14o2M38O09K76j68l00k56
58335B56818l78n87n02j66m9l64p22o60j98K70M46L49J62j0k35n95r63j076q65
58316B50675n74m75o06q54j107j213j068q08p12p37n18J9L85J62l71o20m32j08
58298B41038J36L28N22P71J172J675J978J932J802J860J961J900J881K176K515
58283B63647K413J975J805K093K384K315K088K088K408K900L329L411K999K344
$$ y = [215897, 215615, 215404, 215106, 214811, 214832, 215289, 215961, 216667, 217556, 218911, 220797, 223010, 225246, 227286, 229121, 230909, 232792, 234734, 236600, 238351, 240041, 241702, 243322, 244891, 246372, 247726, 249005, 250338, 251722, 252954, 253912, 254727, 255566, 256391, 257132, 257900, 258798, 259699, 260445, 261067, 261534, 261473, 260561, 259115, 257859, 257129, 256691, 256329, 256193, 256419, 256805, 257068, 257161, 257170, 257118, 257027, 257012, 257140, 257306, 257332, 257117, 256695, 256281, 256219, 256657, 257266, 257542, 257374, 257074, 256818, 256440, 255853, 255351, 255185, 255136, 254772, 254050, 253390, 253192, 253462, 253908, 254257, 254419, 254409, 254174, 253579, 252616, 251540, 250675, 250101, 249626, 249020, 248166, 247059, 245846, 244778, 243970, 243258, 242521, 242003, 242022, 242407, 242569, 242198, 241578, 241146, 241038, 241174, 241502, 242024, 242795, 243967, 245642, 247620, 249552, 251354, 253214, 255175, 257075, 258956, 261132, 263647, 266060, 268035, 269840, 271933, 274317, 276632, 278720, 280808, 283216, 286116, 289445, 292856, 295855, 298199]
58269B98199J876J688J555J408J437J687J947K095K220K319K239K027J966K153
58255C24816K327K288K178K228K433K614K615K392K086K007K299K671K715K448
58241C58117K264K370K619K850L020L002K699K379K468K920L190K927K367J926
58227C95118J785J977K462K991L224L136K993K871K615K329K386K798L062K903
58213D32650K712K908L291L444L426L625M184M893N509N846N714N151M577M456
58199D92386M866N521O089O361O286O079O105O505P043P463P749Q007Q233Q453
58185E87146Q780R212R604R948J0439J1090J1584J1740J1813J2074J2412J2623
58173G18465J2841J3279J3806J4144J4343J4711J5330J5958J6418J6770J7145
$$ y = [298199, 300075, 301763, 303318, 304726, 306163, 307850, 309797, 311892, 314112, 316431, 318670, 320697, 322663, 324816, 327143, 329431, 331609, 333837, 336270, 338884, 341499, 343891, 345977, 347984, 350283, 352954, 355669, 358117, 360381, 362751, 365370, 368220, 371240, 374242, 376941, 379320, 381788, 384708, 387898, 390825, 393192, 395118, 396903, 398880, 401342, 404333, 407557, 410693, 413686, 416557, 419172, 421501, 423887, 426685, 429747, 432650, 435362, 438270, 441561, 445005, 448431, 452056, 456240, 461133, 466642, 472488, 478202, 483353, 487930, 492386, 497252, 502773, 508862, 515223, 521509, 527588, 533693, 540198, 547241, 554704, 562453, 570460, 578693, 587146, 595926, 605138, 614742, 624690, 635129, 646219, 657803, 669543, 681356, 693430, 705842, 718465, 731306, 744585, 758391, 772535, 786878, 801589, 816919, 832877, 849295, 866065, 883210]
58162H83210J7609J8198J8902J9607K0198K0722K1385K2338K3521K4710K5707
58151A116107K6565K7545K8804L0181L1436L2580L3819L5245L6931L9081M1774
58140A480068M4625M7153M9443N2054N5213N8639O2166O6069P0555P5424Q0475
58129B141884Q5852R1808R8471J06002J14646J24463J35328J47329J60869J76318
58119C382970J93918K14082K37430K64522K95989L32987L77285M31087M97355
58110F227625N80569O87063Q24984J003829J233249J521696J875856K297618K773229
58101A9025718L259164L683072L971219M085635M038655L874581L641041L374595
58093D8953680L100625K834829K583612K347748K126996J922022J738714J596637
$$ y = [883210, 900819, 919017, 937919, 957526, 977724, 998446, 1019831, 1042169, 1065690, 1090400, 1116107, 1142672, 1170217, 1199021, 1229202, 1260638, 1293218, 1327037, 1362282, 1399213, 1438294, 1480068, 1524693, 1571846, 1621289, 1673343, 1728556, 1787195, 1849361, 1915430, 1985985, 2061409, 2141884, 2227736, 2319544, 2418015, 2524017, 2638663, 2763126, 2898454, 3045783, 3206652, 3382970, 3576888, 3790970, 4028400, 4292922, 4588911, 4921898, 5299183, 5730270, 6227625, 6808194, 7495257, 8320241, 9324070, 10557319, 12079015, 13954871, 16252489, 19025718, 22284882, 25967954, 29939173, 34024808, 38063463, 41938044, 45579085, 48953680, 52054305, 54889134, 57472746, 59820494, 61947490, 63869512, 65608226, 67204863]
58085F7204863J526805J547473J637594J739308J786426J722324J492423J043100
58077G9700316L55492n11676j423010k222548k801779l133851l266760l293240
58069F3402944l312027l390545l544045l742359l936368m082255m149473m117265
58061C3128607l973149l718917l377049k987254k592234k222989j894066j608495
58053A0754454j364235j157093r81864q33885p09762o06308n19798m46924l85711
58044C748874l34752k92271k56548k26628k01818j80929j62715j46685j32826
58035A813702j20869j10310j00899r2570q5087p8231p2111o6831o2132n7756n3855
58024I13051n0616m7680m4487m1070l7976l5482l3358l1347k9430k7598k5785
$$ y = [67204863, 68731668, 70279141, 71916735, 73656043, 75442469, 77164793, 78657216, 79700316, 80055808, 79544132, 78121122, 75898574, 73096795, 69962944, 66696184, 63402944, 60090917, 56700372, 53156327, 49413968, 45477600, 41395345, 37245872, 33128607, 29155458, 25436541, 22059492, 19072238, 16480004, 14257015, 12362949, 10754454, 9390219, 8233126, 7251262, 6417377, 5707615, 5101307, 4581509, 4134585, 3748874, 3414122, 3121851, 2865303, 2638675, 2436857, 2255928, 2093213, 1946528, 1813702, 1692833, 1582523, 1481624, 1389054, 1303967, 1225736, 1153625, 1086794, 1024662, 966906, 913051, 862435, 814755, 770268, 729198, 691222, 655740, 622382, 591035, 561605, 534007, 508222]
58013E08222k4104k2768k1685k0451j8860j7173j5773j4804j4192j3835j3521
58002C11056j3001j2288j1757j1691j1830j1633j0949j0171r652r239q579p668
57990A82598o841o296n931n683n672n901o051n844n421n122n013m898m699m540
57976A04686m497m458m324m124l876l546l187k953k925l048l261l535l762l762
57962E3428l539l312l258l290l275l242l276l312l203k969k781k723k690k586
57948I972k486k518B317c94k630k495k422k400k368k324k265k081j682j240j066
57933b3367j232j428j313q85m08j48j79l99n73n42m10m15n26m10N4M82N00L21
57915c0878M52R08J145Q63M39L99O85P99N50K78L35N50M73L0l59m17m56r13j605
$$ y = [508222, 484118, 461350, 439665, 419214, 400354, 383181, 367408, 352604, 338412, 324577, 311056, 298055, 285767, 274010, 262319, 250489, 238856, 227907, 217736, 208084, 198845, 190266, 182598, 175757, 169461, 163530, 157847, 152175, 146274, 140223, 134379, 128958, 123836, 118823, 113925, 109226, 104686, 100189, 95731, 91407, 87283, 83407, 79861, 76674, 73721, 70796, 67748, 64487, 60952, 57190, 53428, 49889, 46577, 43319, 40029, 36754, 33512, 30236, 26924, 23721, 20752, 17971, 15248, 12558, 9972, 7486, 4968, 2317, -394, -3024, -5519, -7941, -10341, -12709, -15033, -17298, -19379, -21061, -22301, -23367, -24599, -26027, -27340, -28225, -28633, -28781, -28960, -29359, -29932, -30474, -30884, -31299, -31825, -32235, -32181, -31699, -31199, -30878, -30426, -29518, -28373, -27510, -27071, -26672, -25987, -25188, -24638, -24360, -24025, -23475, -23002, -22972, -23331, -23748, -24204, -25117, -26722]
57896b6722j919j696j500j752k093j962j483j250j452j701j732j740j908k041
57882e0951j857j449j153j140j347j592j714j597j290r79q35q27q07o60m67m47
57866f9112p08j029j027o16j79r2k99m78n31n84o35n46l30j65q4M4K27K97K34
57847g5613K08K72K81K28L38O76R39Q47N05K67K97M77N84M62J38j20n2K50L52
57828f8664qo04j033j179j215j309j471j614j611j352r05n42n09p56j006j052
57812h4830r29q53j014j334j464j144o01l85p07j118r96k70N28Q74P51N17M34
57795i2541M47M19L90N27Q13J020R96Q46P09N88N19O79J092J441J452J284J209
57778g8110J131Q55O22Q35J329J490J161Q17P37O31L22J61L60N28L16K1O1K68
$$ y = [-26722, -28641, -30337, -31837, -33589, -35682, -37644, -39127, -40377, -41829, -43530, -45262, -47002, -48910, -50951, -52808, -54257, -55410, -56550, -57897, -59489, -61203, -62800, -64090, -65069, -65904, -66731, -67538, -68198, -68665, -69112, -69820, -70849, -71876, -72492, -72671, -72763, -73062, -73540, -74071, -74655, -75290, -75836, -76166, -76331, -76415, -76371, -76144, -75847, -75613, -75405, -75133, -74852, -74624, -74286, -73610, -72671, -71824, -71319, -71052, -70755, -70278, -69694, -69232, -69094, -69214, -69266, -69016, -68664, -68672, -69276, -70309, -71488, -72703, -74012, -75483, -77097, -78708, -80060, -80965, -81507, -82016, -82772, -83778, -84830, -85759, -86612, -87626, -88960, -90424, -91568, -92169, -92554, -93261, -94379, -95375, -95645, -95117, -94243, -93492, -92975, -92541, -92094, -91675, -91285, -90758, -89945, -88925, -87929, -87083, -86374, -85786, -85267, -84588, -83496, -82055, -80603, -79319, -78110, -76979, -76124, -75502, -74667, -73338, -71848, -70687, -69870, -69133, -68502, -68180, -68019, -67659, -67131, -66815, -66794, -66733, -66465]
57760f6465K70J85L15M58K30j54j70Q9qn63r43p89n45o77r43q45l67J15L91N02
57740f9914M82L44J95J10L6k7J28O16J174J394J188Q50O90P77R58R75O70J87r4
57721e9261L4L36L79Qn58j044j337j482j607j871k311k725k850k679k464k415
57705h1847k480k515k507k566k702k807k794k702k588k450k247j974j643j258
57691a15080q91p23r02j324j661j628j234p30l69k12j33k5L3j44n44q71q47n62
57673a27847l38l01l15k68k70l93n06m43k07J00L93N46M14N0k33j83J15M34O66
57654a28586P83P15N21M57O80R65J026R45R85J117J081Q73P45P37O03L57M07J014
57636a14575J829K265K082J449O54l9m05m28l31l01k72j79j99n11r20j043q48
$$ y = [-66465, -66195, -66010, -65695, -65237, -65007, -65161, -65331, -65242, -65250, -65813, -66756, -67545, -68090, -68767, -69710, -70555, -70922, -70807, -70416, -69914, -69432, -69088, -68893, -68783, -68747, -68774, -68646, -68030, -66856, -65462, -64274, -63424, -62734, -61957, -60999, -60024, -59354, -59167, -59261, -59227, -58891, -58512, -58504, -59062, -60106, -61443, -62925, -64532, -66403, -68714, -71439, -74289, -76968, -79432, -81847, -84327, -86842, -89349, -91915, -94617, -97424, -100218, -102920, -105508, -107958, -110205, -112179, -113822, -115080, -115971, -116694, -117596, -118920, -120581, -122209, -123443, -124173, -124542, -124754, -124887, -124912, -124879, -125023, -125567, -126438, -127285, -127847, -128185, -128486, -128801, -129069, -129339, -129732, -130238, -130681, -130888, -130788, -130395, -129849, -129435, -129385, -129618, -129801, -129686, -129252, -128586, -127803, -127088, -126567, -126110, -125430, -124465, -123439, -122494, -121509, -120392, -119311, -118438, -117693, -116956, -116353, -115996, -115589, -114575, -112746, -110481, -108399, -106950, -106296, -106335, -106740, -107168, -107499, -107800, -108072, -108251, -108450, -108961, -109881, -110924, -111772]
57619a11772p17q94j156j164r15o73n46l96j53lj30m47p02p94q39q94q24n07n8
57600a23584K91M31L92K12j00m50o83p46p20o97o92o32m20j6M34O81P24R59J760
57581a22856K956L963M484M729M952N035M810M472M368M422M184L465K714K503
57567f5799K845L167K968K318J622J070N33j16q23j585k564l754m770n250n330
57552g5468n472n847o224o462o716p102p405p423p288p259p332p261o910o360
57538a70529n754n155m551l896l197k577k197k052j960j822j705j652j560j401
57524b10008j308j333j289j042p89q06j029j195j254j370j535j526j282j007q33
57509b27606o84n48n99r13j232j271j120j091j289j507j505j297j059r10q59q89
$$ y = [-111772, -112489, -113383, -114539, -115703, -116618, -117291, -117837, -118233, -118386, -118389, -118519, -118966, -119668, -120462, -121301, -122195, -123019, -123526, -123584, -123293, -122862, -122470, -122258, -122358, -122808, -123491, -124237, -124957, -125654, -126346, -126978, -127398, -127414, -126980, -126299, -125575, -124616, -122856, -119900, -115937, -111453, -106724, -101772, -96737, -91927, -87455, -83087, -78665, -74481, -71016, -68302, -65799, -62954, -59787, -56819, -54501, -52879, -51809, -51276, -51392, -52215, -53800, -56364, -60118, -64888, -70138, -75468, -80940, -86787, -93011, -99473, -106189, -113291, -120696, -128119, -135407, -142666, -149998, -157259, -164169, -170529, -176283, -181438, -185989, -189885, -193082, -195659, -197856, -199908, -201868, -203690, -205395, -207047, -208607, -210008, -211316, -212649, -213938, -214980, -215769, -216575, -217604, -218799, -220053, -221423, -222958, -224484, -225766, -226773, -227606, -228290, -228838, -229437, -230350, -231582, -232853, -233973, -235064, -236353, -237860, -239365, -240662, -241721, -242631, -243490, -244379]
57493b44379j043j323j578j569j278j027j152j566j841j742j484j368j382j357
57479b64089j337j515j820j889j548j115j051j389j741j809j699j688j787j727
57465b86204j344q42o13p95j127j258j161j126j360j698j817j622j317j067p85
57450c04136l57O3J35k63r25j515j822j785j461j053q15q27r10q89q02p54o78
57433c18794m55k59m56j084j594j434p63l08m48p69o79k50q6m34q52q76o21n07
57415c30669o16p19p57q98j104j065p37n18p15j094j227j103j050j195j317j214
57399c45998j015j021j374j915k278k205j825j588j780k148k213j877j516j468
57385c70221j647j771j769j793j938k061j943j561j159j062j357j814k105k087
$$ y = [-244379, -245422, -246745, -248323, -249892, -251170, -252197, -253349, -254915, -256756, -258498, -259982, -261350, -262732, -264089, -265426, -266941, -268761, -270650, -272198, -273313, -274364, -275753, -277494, -279303, -281002, -282690, -284477, -286204, -287548, -288390, -289003, -289798, -290925, -292183, -293344, -294470, -295830, -297528, -299345, -300967, -302284, -303351, -304136, -304493, -304430, -304295, -304558, -305483, -306998, -308820, -310605, -312066, -313119, -313934, -314761, -315671, -316560, -317362, -318116, -318794, -319249, -319508, -319964, -321048, -322642, -324076, -324839, -325147, -325595, -326364, -327043, -327293, -327379, -327813, -328665, -329541, -330162, -330669, -331285, -332004, -332761, -333659, -334763, -335828, -336565, -337083, -337798, -338892, -340119, -341222, -342272, -343467, -344784, -345998, -347013, -348034, -349408, -351323, -353601, -355806, -357631, -359219, -360999, -363147, -365360, -367237, -368753, -370221, -371868, -373639, -375408, -377201, -379139, -381200, -383143, -384704, -385863, -386925, -388282, -390096, -392201, -394288]
57371c94288j846j570j483j709k095k254j974j533j370j528j606j309q19n48p24
57356d16656j211j655j734j447j144j132j291j377j517k042k765l006k503j865
57342d41345j728j906j821j459j323j577j865j958k033k215k338k315k340k466
57328d68689k391j901j272r32j001j321j754k156k312k194k095k233k363k139
57314d94753j669j380j373j338j129j037j324j819k173k278k259k231k238k328
57300e19329k466k510k411k371k585k917l014k797k587k656k836k735k289j841
57286e55344j697j771j842j908k099k335k383k258k258k494k661k505k275k392
57272e86222k829l178l246l285l523l845m001l964l873l856l971m218m412m290
$$ y = [-394288, -396134, -397704, -399187, -400896, -402991, -405245, -407219, -408752, -410122, -411650, -413256, -414565, -415384, -415932, -416656, -417867, -419522, -421256, -422703, -423847, -424979, -426270, -427647, -429164, -431206, -433971, -436977, -439480, -441345, -443073, -444979, -446800, -448259, -449582, -451159, -453024, -454982, -457015, -459230, -461568, -463883, -466223, -468689, -471080, -472981, -474253, -475185, -476186, -477507, -479261, -481417, -483729, -485923, -488018, -490251, -492614, -494753, -496422, -497802, -499175, -500513, -501642, -502679, -504003, -505822, -507995, -510273, -512532, -514763, -517001, -519329, -521795, -524305, -526716, -529087, -531672, -534589, -537603, -540400, -542987, -545643, -548479, -551214, -553503, -555344, -557041, -558812, -560654, -562562, -564661, -566996, -569379, -571637, -573895, -576389, -579050, -581555, -583830, -586222, -589051, -592229, -595475, -598760, -602283, -606128, -610129, -614093, -617966, -621822, -625793, -630011, -634423, -638713]
57258f38713l796l222k936l074l522m044m401m487m465m599m906n133n114m943
57244f97355m733m471m252m309m590m630m169l604l470l636l498k925k478k647
57230g50767l283l913m282m388m274m021l784l710l860m209m591m683m322l836
57216h07923l775m215m666m764m727m935n321n521n434n295n327n532n834o146
57202h79415o334o299o108n925n855n937o178o496o684o653o572o593o557o219
57188i67825n712n461n608n853n937o003o285o722p061p233p334p376p293p131
57174a058834p038p028o969o820o703o656o545o313o184o423p007p671q215q590
57160a156996q787q819q847r084r474r708r632r495r616r968j0234j0255j0215
$$ y = [-638713, -642509, -645731, -648667, -651741, -655263, -659307, -663708, -668195, -672660, -677259, -682165, -687298, -692412, -697355, -702088, -706559, -710811, -715120, -719710, -724340, -728509, -732113, -735583, -739219, -742717, -745642, -748120, -750767, -754050, -757963, -762245, -766633, -770907, -774928, -778712, -782422, -786282, -790491, -795082, -799765, -804087, -807923, -811698, -815913, -820579, -825343, -830070, -835005, -840326, -845847, -851281, -856576, -861903, -867435, -873269, -879415, -885749, -892048, -898156, -904081, -909936, -915873, -922051, -928547, -935231, -941884, -948456, -955049, -961606, -967825, -973537, -978998, -984606, -990459, -996396, -1002399, -1008684, -1015406, -1022467, -1029700, -1037034, -1044410, -1051703, -1058834, -1065872, -1072900, -1079869, -1086689, -1093392, -1100048, -1106593, -1112906, -1119090, -1125513, -1132520, -1140191, -1148406, -1156996, -1165783, -1174602, -1183449, -1192533, -1202007, -1211715, -1221347, -1230842, -1240458, -1250426, -1260660, -1270915, -1281130]
57147a281130j0357j0691j1033j1245j1388j1625j2003j2362j2541j2603j2792
57136a409770j3227j3800j4335j4728j4908j4818j4569j4410j4488j4732j5084
57125a568869j5588j6116j6286j5910j5377j5278j5752j6489j7214j7889j8508
57114a749276j9053j9638k0322k0874k1011k0923k1137k1840k2650k3179k3486
57103a983389k3818k4234k4630k4957k5220k5463k5852k6542k7405k8109k8557
57092b268176k9040k9810l0801l1806l2744l3588l4318l5038l5902l6851l7669
57081b635743l8370l9247m0382m1513m2464m3435m4624m5928m7226m8604n0072
57070c117608n1428n2650n4067n5852n7701n9349o0987o2835o4674o6360o8380
$$ y = [-1281130, -1291487, -1302178, -1313211, -1324456, -1335844, -1347469, -1359472, -1371834, -1384375, -1396978, -1409770, -1422997, -1436797, -1451132, -1465860, -1480768, -1495586, -1510155, -1524565, -1539053, -1553785, -1568869, -1584457, -1600573, -1616859, -1632769, -1648146, -1663424, -1679176, -1695665, -1712879, -1730768, -1749276, -1768329, -1787967, -1808289, -1829163, -1850174, -1871097, -1892234, -1914074, -1936724, -1959903, -1983389, -2007207, -2031441, -2056071, -2081028, -2106248, -2131711, -2157563, -2184105, -2211510, -2239619, -2268176, -2297216, -2327026, -2357827, -2389633, -2422377, -2455965, -2490283, -2525321, -2561223, -2598074, -2635743, -2674113, -2713360, -2753742, -2795255, -2837719, -2881154, -2925778, -2971706, -3018932, -3067536, -3117608, -3169036, -3221686, -3275753, -3331605, -3389306, -3448655, -3509642, -3572477, -3637151, -3703511, -3771891]
57059c771891p1299p4837p8124q0807q3336q6209q9538r3301r7532j02087j06694
57048d735655j11351j16321j21685j27245j32934j38952j45416j52237j59447
57039e941243j67310j75957j85214j94924k05211k16302k28270k41053k54632
57030g810116k69131k84909l02442l21984l43437l66777l92445m21061m52938
57021a0965240m88294n27783n72417o23021o80281p45326q19910r06193j006892
57012a7335357j125747j267491j437869j644877j900568k221634k629383l151374
57004c2714300l823258m685639n773825p104362q660589j0374187j2106476j3651371
56996i8894007j4783911j5345147j5312763j4805455j4017609j3132393j2267236
$$ y = [-3771891, -3843190, -3918027, -3996151, -4076958, -4160294, -4246503, -4336041, -4429342, -4526874, -4628961, -4735655, -4847006, -4963327, -5085012, -5212257, -5345191, -5484143, -5629559, -5781796, -5941243, -6108553, -6284510, -6469724, -6664648, -6869859, -7086161, -7314431, -7555484, -7810116, -8079247, -8364156, -8666598, -8988582, -9332019, -9698796, -10091241, -10512302, -10965240, -11453534, -11981317, -12553734, -13176755, -13857036, -14602362, -15422272, -16328465, -17335357, -18461104, -19728595, -21166464, -22811341, -24711909, -26933543, -29562926, -32714300, -36537558, -41223197, -46997022, -54101384, -62761973, -73136160, -85242636, -98894007, -113677918, -129023065, -144335828, -159141283, -173158892, -186291285, -198558521]
56989a98558521j1469179j0740920j0069419r442098q852230q303743p819722
56982b65255832p443044p212327p119060p082291o973771o683037o174511n496791
56974c19440664m742279l983857l223917k388076j374289j25952J327885K892691
56966c31058458M461599N959609P367806Q732669J0146585J1687999J3357641
56959b69344550J5071093J6710487J8167141J9327890K0046772K0172456J9627532
56952a40221179J8463402J6839912J4957651J3000287J1109042R376740P850495
56945d8623650O542389N443939M535949L792895L187175K693879K292329J964688
56937a8170407J695609J473230J288747J134700J004642Q94005P99713P18815
$$ y = [-198558521, -210027700, -220768620, -230838039, -240280137, -249132367, -257436110, -265255832, -272698876, -279911203, -287030263, -294112554, -301086325, -307769362, -313943873, -319440664, -324182943, -328166800, -331390717, -333778793, -335153082, -335279034, -333951149, -331058458, -326596859, -320637250, -313269444, -304536775, -294390190, -282702191, -269344550, -254273457, -237562970, -219395829, -200067939, -180021167, -159848711, -140221179, -121757777, -104917865, -89960214, -76959927, -65850885, -56474145, -48623650, -42081261, -36637322, -32101373, -28308478, -25121303, -22427424, -20135095, -18170407, -16474798, -15001568, -13712821, -12578121, -11573479, -10679474, -9879761, -9160946]
56929i160946O48416N86765N33219M87006M46768M11223L79513L50960L25087
56920d991989L01797K80876K61599K43360K26418K11356J98006J85608J73789
56911b909180J62718J52435J42770J33810J25813J18571J11507J04396R7520R1090
56901a668550Q5003P9222P3959O9381O5455O2099N9201N6543N3981N1617M9592
56890i62497M7784M5963M4108M2275M0357L8330L6518L5207L4126L2724L0893
56879e34212K9028K7413K5978K4643K3473K2463K1463K0468J9674J9186J8849
56868b81574J8449J7902J7250J6595J6056J5659J5285J4825J4284J3718J3128
56857a08423J2581J2225J2088J2022J1982J2115J2434a0305B350J2623J2755J2826
$$ y = [-9160946, -8512530, -7925765, -7392546, -6905540, -6458772, -6047549, -5668036, -5317076, -4991989, -4690192, -4409316, -4147717, -3904357, -3677939, -3466583, -3268577, -3082969, -2909180, -2746462, -2594027, -2451257, -2317447, -2191634, -2073063, -1961556, -1857160, -1759640, -1668550, -1583547, -1504325, -1430366, -1360985, -1295530, -1233431, -1174230, -1117687, -1063706, -1012089, -962497, -914713, -868750, -824642, -782367, -742010, -703680, -667162, -631955, -597829, -565105, -534212, -505184, -477771, -451793, -427150, -403677, -381214, -359751, -339283, -319609, -300423, -281574, -263125, -245223, -227973, -211378, -195322, -179663, -164378, -149553, -135269, -121551, -108423, -95842, -83617, -71529, -59507, -47525, -35410, -22976, -10305, 2350, 14973, 27728, 40554]
56845D0554J2560J2172J2114J2407J2606J2398J1874J1255J0675J0176R698R057
56833A77546Q198P360O778O350N837N240M727M274L788L412L346L429L286K854
56819B46425K387J957J418Q27N07N56O39L96j72q28j297j325q23r5L52L72L30
56802B51626O06J140J624J920K143K426K723K869K772K592K612K876L052K810
56788B83791K220J588J097P82P24R05J044R11P25R15J494K093K518K874L099K925
56772C09705K397K016K061K186J964J519J303J451J716J947K292K894L581L983
56758C41015L873L423L019K899K976L125L388L789M084M003L629L280L091L011
56744C88605L062L258L321K959K395K133K206K116J666J265J256J425J493J612
$$ y = [40554, 53114, 65286, 77400, 89807, 102413, 114811, 126685, 137940, 148615, 158791, 168489, 177546, 185744, 193104, 199882, 206232, 212069, 217309, 222036, 226310, 230098, 233510, 236856, 240285, 243571, 246425, 248812, 250769, 252187, 253014, 253521, 254077, 254716, 255112, 254940, 254112, 252815, 251490, 250667, 250572, 250924, 251296, 251626, 252232, 253372, 254996, 256916, 259059, 261485, 264208, 267077, 269849, 272441, 275053, 277929, 280981, 283791, 286011, 287599, 288696, 289478, 290202, 291107, 292151, 293062, 293787, 294702, 296196, 298289, 300807, 303681, 306780, 309705, 312102, 314118, 316179, 318365, 320329, 321848, 323151, 324602, 326318, 328265, 330557, 333451, 337032, 341015, 344888, 348311, 351330, 354229, 357205, 360330, 363718, 367507, 371591, 375594, 379223, 382503, 385594, 388605, 391667, 394925, 398246, 401205, 403600, 405733, 407939, 410055, 411721, 412986, 414242, 415667, 417160, 418772]
56730D18772J950K252K237K112K208K329K041J378P84M37J44j57k72k65n58j354
56714D34038k270k816k946k996l198l474l618l494l115k629k230j954j589r12
56700C96797j7O27N91m8p76j180j299j315j154o91k06k07p66j419j814k079k394
56683C82650k584k476k316k423k642k545k087j630j379j192r89r98j412k065k581
56668C53331k733k535k150j801j708j958k436k869k982k734k394k304k456k463
56654C19808k094j621j487j723j988k053k015j987j870j531j067p36p12r16j095
56639B96913j045p96n40l63k00n6q9l20n00m63m14n89q15p74n13l44k51Q5O34
56620B89560Q37L13n56j047q82l61J16M04N51O26O26N10L02J40J62L16M05L19
$$ y = [418772, 420722, 422974, 425211, 427323, 429531, 431860, 433901, 435279, 436063, 436500, 436644, 436487, 436215, 435950, 435392, 434038, 431768, 428952, 426006, 423010, 419812, 416338, 412720, 409226, 406111, 403482, 401252, 399298, 397709, 396797, 396780, 397407, 397998, 397950, 397174, 395994, 394695, 393380, 392226, 391535, 391329, 391122, 390356, 388937, 387123, 385044, 382650, 380066, 377590, 375274, 372851, 370209, 367664, 365577, 363947, 362568, 361376, 360387, 359389, 357977, 355912, 353331, 350598, 348063, 345913, 344112, 342404, 340446, 338010, 335141, 332159, 329425, 327031, 324727, 322271, 319808, 317714, 316093, 314606, 312883, 310895, 308842, 306827, 304840, 302970, 301439, 300372, 299636, 298924, 298008, 296913, 295868, 295072, 294532, 294169, 293969, 293913, 293824, 293504, 293004, 292541, 292127, 291538, 290723, 289949, 289436, 289092, 288841, 288926, 289560, 290397, 290710, 290154, 289107, 288225, 287864, 287980, 288384, 288935, 289561, 290187, 290697, 290999, 291139, 291301, 291617, 292022, 292341]
56602B92341J60Q7J61L15L68J78j47k47K7K62m2o87q77k48O03Q75M87l7l43m80
56582B92756n46n12l99l09k44o3K38M74M75K35j22m06m47k86k14m45p93q72o09
56563B87911k98j51o4Q9K19K06J42J76K18M0m08r01j145j029o45j77K09M42M79
56544B85313K81j29n48p07n52l02k15l24m83n62n11l44j53n1n8q2j09k75o27r53
56524B78609j041j021j174j404j275o29N7K02j81n66o06m72m79o52p66o72m12
56507B67518j24P9J13k2j78j70QJ84K40K80M33N99N25J73j98l60m25o34r90j234
56487B65817j180q52l75R4L30J68k04l74j94Q4K22L55O40Q91Q46O25N82P41P82
56468B68998N41K29J01J89M41Q00J073J021O87M37N31Q51J169J402J488J240O21
$$ y = [292341, 292501, 292588, 292749, 293064, 293432, 293610, 293463, 293216, 293243, 293505, 293463, 292776, 291899, 291651, 292254, 293129, 293616, 293579, 293236, 292756, 292210, 291698, 291299, 290990, 290746, 290683, 290921, 291395, 291870, 292105, 291983, 291577, 291130, 290844, 290630, 290185, 289392, 288520, 287911, 287613, 287462, 287398, 287487, 287706, 287912, 288054, 288230, 288448, 288488, 288080, 287179, 286034, 285005, 284360, 284183, 284392, 284834, 285313, 285594, 285465, 284917, 284210, 283658, 283356, 283141, 282817, 282334, 281772, 281261, 280917, 280764, 280713, 280655, 280573, 280464, 280189, 279562, 278609, 277568, 276547, 275373, 273969, 272694, 272065, 272122, 272324, 272143, 271577, 270971, 270499, 270020, 269368, 268602, 267930, 267518, 267394, 267473, 267586, 267564, 267386, 267216, 267224, 267408, 267648, 267928, 268361, 268960, 269485, 269658, 269460, 269100, 268675, 268041, 267051, 265817, 264637, 263785, 263410, 263504, 263834, 264002, 263798, 263424, 263230, 263314, 263536, 263891, 264531, 265422, 266268, 266893, 267475, 268216, 268998, 269539, 269768, 269869, 270058, 270499, 271299, 272372, 273393, 274080, 274517, 275048, 275899, 277068, 278470, 279958, 281198, 281819]
56451B81819o0m14l57p3K61N60P64Q42P78N32J18k24k12K9L1l38o30n11l10m98
56431B82107r30j135j100j211j536j683j440j026o91m88m57o10o94m33o5j35o60
56414B67813j076j101j106j315j354r47m75l66m08k67j80n06r11q19m06l84q34
56397B55358j112r72r35j279j423q62k8K85Rl17m18m55m68k69Q0J97p4l92l91
56378B46534j61j0J0R1L12M99N07M35M88O89Q05O41K99P8O2J0l01o92p87m99j65
56357B48845j00k41l04j37J79M81O19M59K9l76m26j15K02K39N8p3k1J37K44J67
56337B49866j20m71o28n10l72m83p61q26m97LL35L39M8m11p60o68r2N67Q35N90
56317B45984O0n02r32j066q30m01r3J1J21L94O74P53O88O98P72O32J66k87k49
$$ y = [281819, 281759, 281345, 280988, 280915, 281176, 281736, 282500, 283342, 284120, 284652, 284770, 284546, 284334, 284363, 284394, 284056, 283426, 282915, 282605, 282107, 281177, 280042, 278942, 277731, 276195, 274512, 273072, 272046, 271355, 270867, 270410, 269800, 269106, 268673, 268608, 268473, 267813, 266737, 265636, 264530, 263215, 261861, 260914, 260439, 260073, 259665, 259398, 259218, 258712, 257801, 256982, 256576, 256192, 255358, 254246, 253274, 252339, 251060, 249637, 248775, 248747, 249032, 249041, 248724, 248306, 247851, 247383, 247114, 247194, 247391, 247317, 246925, 246534, 246373, 246363, 246373, 246464, 246776, 247275, 247782, 248217, 248705, 249394, 250199, 250840, 251139, 251217, 251279, 251289, 250988, 250296, 249509, 249010, 248845, 248745, 248504, 248200, 248063, 248242, 248723, 249342, 249801, 249830, 249454, 249028, 248913, 249115, 249354, 249412, 249339, 249318, 249455, 249699, 249866, 249746, 249275, 248647, 248137, 247765, 247282, 246521, 245695, 245198, 245201, 245536, 245875, 245923, 245512, 244752, 244084, 243992, 244559, 245394, 245984, 246044, 245542, 244610, 243544, 242714, 242313, 242220, 242231, 242352, 242746, 243420, 244173, 244861, 245559, 246331, 246963, 247129, 246842, 246593]
56298B46593K66O81N04n7l71j79J66K89K91M32O34O47N27N55P24P15M38J88J28
56279B53171P7l9R9O71J223J134M31k91o27o24m01L0M92O11K99m5l5K55M94N21
56259B57446L84J72OM8K85M58M25L78N19O92O29M45M51N79M21j44o89q11o16m45
56239B60633l81k44K0K38K82K28K60N02R16J306J435J228Q09L90J36J56M36P76
56221B69126R29R05R51J173J367J332J158J039R64Q24O67O37P41Q70J001J132
56205B84816J143R84R19J279J934K345K237J910J806J983K239K501K845L219L395
56190C15555L214K794K456K478K875L403L813M110M470M945N395N741O060O409
56176C73718O699O901P251Q013R132J0281J1263J2222J3422J4927J6598J8329
$$ y = [246593, 246859, 247540, 248044, 247987, 247616, 247437, 247603, 247892, 248183, 248615, 249249, 249896, 250423, 250978, 251702, 252417, 252855, 253043, 253171, 253248, 253209, 253308, 253979, 255202, 256336, 256767, 256476, 255849, 255225, 254824, 254854, 255346, 255957, 256256, 256211, 256176, 256431, 256925, 257446, 257830, 258002, 258008, 258056, 258341, 258799, 259224, 259602, 260121, 260813, 261442, 261887, 262338, 262917, 263338, 263194, 262505, 261694, 261078, 260633, 260252, 260008, 260028, 260266, 260548, 260776, 261036, 261538, 262454, 263760, 265195, 266423, 267232, 267622, 267758, 267914, 268350, 269126, 270055, 270960, 271911, 273084, 274451, 275783, 276941, 277980, 278944, 279768, 280435, 281072, 281813, 282683, 283684, 284816, 285959, 286943, 287862, 289141, 291075, 293420, 295657, 297567, 299373, 301356, 303595, 306096, 308941, 312160, 315555, 318769, 321563, 324019, 326497, 329372, 332775, 336588, 340698, 345168, 350113, 355508, 361249, 367309, 373718, 380417, 387318, 394569, 402582, 411714, 421995, 433258, 445480, 458902, 473829, 490427, 508756]
56164E08756K0223K2438K4912K7338K9496L1493L3535L5548L7198L8327L9121
56153H48385L9789M0285M0465M0347M0078L9714L9152L8233L6793L4727L2135
56142A270103K9373K6756K4281K1644J8545J4899J0813O467K044k314o504j0490
56130A405617j4350j8196k1974k5403k8310l0949l3682l6413l8580l9869m0553
56119A077338m1004m1225m1068m0616l9982l8976l7370l5383l3493l1820l0101
56108F66300k8211k6317k4500k2599k0572j8646j6989j5516j4120j2842j1692
56097D54296j0533r349q344p611o966o247n568n059m603m054l543l246l037k706
56083C73430k406k415k546k192j165q8K89l0l67j78M60J115J449J408J163R89
$$ y = [508756, 528979, 551417, 576329, 603667, 633163, 664656, 698191, 733739, 770937, 809264, 848385, 888174, 928459, 968924, 1009271, 1049349, 1089063, 1128215, 1166448, 1203241, 1237968, 1270103, 1299476, 1326232, 1350513, 1372157, 1390702, 1405601, 1416414, 1422881, 1424925, 1422611, 1416107, 1405617, 1391267, 1373071, 1351097, 1325694, 1297384, 1266435, 1232753, 1196340, 1157760, 1117891, 1077338, 1036334, 995109, 954041, 913425, 873443, 834467, 797097, 761714, 728221, 696401, 666300, 638089, 611772, 587272, 564673, 544101, 525455, 508466, 492950, 478830, 465988, 454296, 443763, 434414, 426070, 418459, 411493, 405246, 399678, 394619, 390016, 385962, 382419, 379173, 376136, 373430, 371024, 368609, 366063, 363871, 362706, 362618, 362907, 362877, 362510, 362332, 362792, 363907, 365356, 366764, 367927, 368916]
56067C68916J058J321J629J951K375K928L496M016M543N089N556N930O409P184
56053D22401Q216R318J0351J1232J1850J2224J2625J3252J3922J4274J4299J4312
56041E68276J4479J4682J4878J5149J5366J5174J4544J3917J3524J2999J1980
56030G24968J0744R784Q993P834O209M577L221J897L25j362k894m215n403o459
56016G58219p410q371r392j0359j1166j1817j2317j2627j2822j3074j3359j3389
56004F22116j2975j2318j1757j1359j0932j0293r405q295p043n838m906m316l896
55991E08783l352k507j441m23L09P17R33J144J529K149K818L201L161K900K677
55976E22598K513K337K259K448K835L164L310L302L160K931K824L021L388L648
$$ y = [368916, 369974, 371295, 372924, 374875, 377250, 380178, 383674, 387690, 392233, 397322, 402878, 408808, 415217, 422401, 430617, 439935, 450286, 461518, 473368, 485592, 498217, 511469, 525391, 539665, 553964, 568276, 582755, 597437, 612315, 627464, 642830, 658004, 672548, 686465, 699989, 712988, 724968, 735712, 745496, 754489, 762323, 768532, 773109, 776330, 778227, 778552, 777190, 774296, 770081, 764678, 758219, 750809, 742438, 733046, 722687, 711521, 699704, 687387, 674760, 661938, 648864, 635505, 622116, 609141, 596823, 585066, 573707, 562775, 552482, 543077, 534782, 527739, 521901, 516995, 512679, 508783, 505431, 502924, 501483, 501060, 501369, 502086, 503019, 504163, 505692, 507841, 510659, 513860, 517021, 519921, 522598, 525111, 527448, 529707, 532155, 534990, 538154, 541464, 544766, 547926, 550857, 553681, 556702, 560090, 563738]
55962E63738L781L981M223M238L911L439L064K923L146L755M497N055N452N862
55948F21065O153O072N846O041O741P412P705P851Q038Q044P832P938Q755R850
55934G25343J0546J0805J1073J1497J1887J2207J2599J2986J3139J3159J3447
55923H58688J4197J5195J6115J6791J7288J7854J8755J9935K1028K1821K2516
55912A060183K3358K4295K5233K6282K7466K8519K9357L0378L1881L3511L4818
55901A375281L6079L7931M0332M2571M4319M6078M8457N1450N4612N7672O0791
55890A895573O4412O8856P3951P9244Q4669R0760R7983J06217J15273J25505J37425
55879B939868J51023J66128J83183K03112K26560K54011K86596L26157L74467
$$ y = [563738, 567519, 571500, 575723, 579961, 583872, 587311, 590375, 593298, 596444, 600199, 604696, 609751, 615203, 621065, 627218, 633290, 639136, 645177, 651918, 659330, 667035, 674886, 682924, 690968, 698800, 706738, 715493, 725343, 735889, 746694, 757767, 769264, 781151, 793358, 805957, 818943, 832082, 845241, 858688, 872885, 888080, 904195, 920986, 938274, 956128, 974883, 994818, 1015846, 1037667, 1060183, 1083541, 1107836, 1133069, 1159351, 1186817, 1215336, 1244693, 1275071, 1306952, 1340463, 1375281, 1411360, 1449291, 1489623, 1532194, 1576513, 1622591, 1671048, 1722498, 1777110, 1834782, 1895573, 1959985, 2028841, 2102792, 2182036, 2266705, 2357465, 2455448, 2561665, 2676938, 2802443, 2939868, 3090891, 3257019, 3440202, 3643314, 3869874, 4123885, 4410481, 4736638, 5111105]
55870E111105M33361N06225N99217P20480Q77900J077680J324769J622696J968241
55861A4241674K341288K699907K991962L179986L259755L256643L205183L130404
55853C8306802L041256K932834K792386K608159K378713K118127J857176J642447
55845E7677900J527155J545767J683380J868429K001160J994454J795642J387866
55837G1481753P91786P1652o74592j350618j899239k312711k615242k841445l026148
55828E7625196l199814l380390l565274l733177l856044l910547l881058l757791
55820B8341101l538860l237239k883271k515580k166069j851597j576748j340567
55812I231170j139840r69636q24821p01920n98688n12363m39617l77989l26196
$$ y = [5111105, 5544466, 6050691, 6649908, 7370388, 8248288, 9325968, 10650737, 12273433, 14241674, 16582962, 19282869, 22274831, 25454817, 28714572, 31971215, 35176398, 38306802, 41348058, 44280892, 47073278, 49681437, 52060150, 54178277, 56035453, 57677900, 59205055, 60750822, 62434202, 64302631, 66303791, 68298245, 70093887, 71481753, 72273539, 72345191, 71670599, 70319981, 68420742, 66108031, 63492789, 60651344, 57625196, 54425382, 51044992, 47479718, 43746541, 39890497, 35979950, 32098892, 28341101, 24802241, 21565002, 18681731, 16166151, 14000082, 12148485, 10571737, 9231170, 8091330, 7121694, 6296873, 5594953, 4996265, 4483902, 4044285, 3666296, 3340100]
55803C340100k83034k46934k16604j91215j69866j51523j35593j21957j10361
55794A713013j00326r1597q4135p7639p1620o5975o0990n6715n2800m9016m5507
55783I56693m2405l9616l7013l4561l2189k9888k7903k6459k5343k4126k2743
55772F14447k1458k0309j9083j7837j6891j6226j5456j4501j3774j3457j3154
55761D32301j2562j1960j1667j1446j0912j0203r717r426q946q163p366o784o388
55748C06761o142o090o144o145o085o058n927n420m613l974l810l917l930l747
55734B34759l454l079k672k415k398k340j901j186p06p44j034j134r00m91j09
55719B10196J09O2k43o49r78j192j292j235j025q43q50j005j175j365j611j780
$$ y = [3340100, 3057066, 2810132, 2593528, 2402313, 2232447, 2080924, 1945331, 1823374, 1713013, 1612687, 1521090, 1436955, 1359316, 1287696, 1221721, 1160731, 1104016, 1051216, 1002200, 956693, 914288, 874672, 837659, 803098, 770909, 741021, 713118, 686659, 661316, 637190, 614447, 592989, 572680, 553597, 535760, 518869, 502643, 487187, 472686, 458912, 445455, 432301, 419739, 407779, 396112, 384666, 373754, 363551, 353834, 344408, 335462, 327299, 319933, 313149, 306761, 300619, 294529, 288385, 282240, 276155, 270097, 264170, 258750, 254137, 250163, 246353, 242436, 238506, 234759, 231305, 228226, 225554, 223139, 220741, 218401, 216500, 215314, 214608, 213864, 212830, 211696, 210796, 210305, 210196, 210305, 210367, 210124, 209475, 208497, 207305, 206013, 204778, 203753, 202910, 202060, 201055, 199880, 198515, 196904, 195124]
55703A95124j739j618j633j676j478j166j176j567j814j559j131j031j252j483
55689A74801j660j841j849j566j367j680k179k093j349p75r35j442j668j605j556
55674A51236j485j196q83r27j296j610j734j843j956j873j578j341j303j325j308
55659A29578j352j493j608j652j743j835j648j098n52m14p10j193j644j871j691
55644A09074j154o76n80p21p48o21n25m63k91q5o5j91k26j99m18r06j255j221
55626I8729j062j069j069p41j33M05O57O08L01q7k09M5K47j9m71m70K2L30P2l02
55606I5784k21J67L03P8q7R7M45O68P24P29O92N56L76L16M88P77R17P40L70R9
55586A04018J07L15N54P33Q30Q33P99Q54J049J272J409J515J702J888J826J411
$$ y = [195124, 193385, 191767, 190134, 188458, 186980, 185814, 184638, 183071, 181257, 179698, 178567, 177536, 176284, 174801, 173141, 171300, 169451, 167885, 166518, 164838, 162659, 160566, 159217, 158442, 157507, 156065, 154397, 152792, 151236, 149751, 148555, 147672, 146745, 145449, 143839, 142105, 140262, 138306, 136433, 134855, 133514, 132211, 130886, 129578, 128226, 126733, 125125, 123473, 121730, 119895, 118247, 117149, 116597, 116183, 115473, 114280, 112636, 110765, 109074, 107920, 107244, 106664, 105943, 105195, 104574, 104049, 103586, 103295, 103210, 103145, 102954, 102728, 102529, 102111, 101205, 99950, 98729, 97667, 96598, 95529, 94788, 94655, 95060, 95717, 96325, 96626, 96539, 96330, 96375, 96622, 96603, 96132, 95662, 95684, 96014, 96086, 95784, 95563, 95730, 96033, 96111, 96024, 96121, 96566, 97234, 97958, 98687, 99379, 99935, 100311, 100627, 101115, 101892, 102809, 103549, 103919, 104018, 104125, 104440, 104994, 105727, 106557, 107390, 108189, 109043, 110092, 111364, 112773, 114288, 115990, 117878, 119704, 121115]
55570A21115Q43M63M47O59P93O22K11j62k73j40Kr9n21j075j403j331j129j252
55552A17770j753k128j918j253o94n93q68j233j489j547j424j293j349j577j749
55537I6902j647j276q32n52n67p61q35o02k24k6r6k28k14l2K16L98L30j03p30
55518H9121j182j250j041p57m79k22p5j01k54m34n62n51l55j13n2j55j08K59O54
55499H2343O99M18J45K9p9k58l29j27K54N93P66P71O59N82O93R44J066R08O97
55480I0774P82J166J508J539J329J096R27P86O74O43O91P56P87P77P07O02N77
55463A06121P33R41Q82M01k62p31q74q39p31m76n1L09L07q9o21j021j223j290
55445A01486j252j067p49m33l21m99q31j054j019q21o67o77q45j105j361j462
$$ y = [121115, 121958, 122421, 122868, 123527, 124320, 124942, 125153, 124991, 124718, 124578, 124580, 124481, 123960, 122885, 121482, 120151, 119022, 117770, 116017, 113889, 111971, 110718, 110024, 109431, 108563, 107330, 105841, 104294, 102870, 101577, 100228, 98651, 96902, 95255, 93979, 93147, 92595, 92028, 91267, 90432, 89830, 89606, 89580, 89484, 89256, 89042, 89010, 89226, 89624, 89954, 89851, 89121, 87939, 86689, 85648, 84891, 84412, 84190, 84115, 84014, 83760, 83326, 82764, 82213, 81858, 81745, 81693, 81538, 81430, 81689, 82343, 83042, 83460, 83605, 83634, 83555, 83297, 82968, 82841, 83095, 83688, 84454, 85225, 85884, 86466, 87159, 88103, 89169, 90077, 90774, 91556, 92722, 94230, 95769, 97098, 98194, 99121, 99907, 100581, 101224, 101915, 102671, 103458, 104235, 104942, 105544, 106121, 106854, 107795, 108677, 109078, 108816, 108085, 107211, 106372, 105641, 105165, 105114, 105423, 105730, 105641, 105020, 103999, 102776, 101486, 100234, 99167, 98418, 97985, 97664, 97165, 96334, 95280, 94261, 93440, 92773, 92096, 91251, 90146, 88785, 87323]
55429H7323j343j128j007r47o97j70L12L09k37q97j188r74m86o3N9j13l53m12
55411G7988l23l23n12o46m79j27P4j2k29m36o36p42n30K8N58O63L84O0j30k82
55391G4348m43m72l04j09n5o6L5K37L63L14J64%j60k78k31K5L26M26K69L1j02
55370G4318j21r6m1N2R3l8l34o46q25p96n17k2M75P17O67N08L66K03M9P6L19N23
55348G4930M69K66J10l1k34l14j05J34K8k91l01P8L42J96L2K66O67P46N07L30
55328G7825L22K40L7p4j3N5J23M24R44J247J025N44L05M20N73M95K34j2j29j39
55308H4446j47k05k48j82q3j84n50r13r53o93m53m57o12p00n73j92L67Q50R36
55289G9454N23p7l83k05J72L21J12j38n2L44N95L29l00p90q41o13m48m80n83n73
$$ y = [87323, 85980, 84852, 83845, 82898, 82201, 82031, 82343, 82652, 82415, 81518, 80330, 79356, 78870, 78807, 78866, 78753, 78400, 77988, 77665, 77342, 76830, 76184, 75705, 75578, 75652, 75640, 75411, 74975, 74339, 73597, 73067, 73095, 73653, 74316, 74700, 74760, 74630, 74348, 73905, 73433, 73129, 73020, 72965, 72899, 72934, 73171, 73534, 73848, 74012, 74012, 73852, 73574, 73343, 73368, 73694, 74120, 74389, 74420, 74318, 74197, 74101, 74060, 74112, 74205, 74167, 73833, 73187, 72362, 71566, 71049, 71027, 71502, 72219, 72886, 73394, 73760, 73963, 74012, 74088, 74407, 74930, 75399, 75665, 75775, 75744, 75510, 75196, 75091, 75225, 75253, 74962, 74661, 74739, 75081, 75277, 75309, 75575, 76242, 76988, 77495, 77825, 78147, 78387, 78424, 78350, 78337, 78392, 78515, 78939, 79883, 81130, 82155, 82699, 83004, 83424, 83997, 84492, 84726, 84714, 84585, 84446, 84299, 84094, 83846, 83664, 83581, 83397, 82847, 81934, 80981, 80288, 79835, 79378, 78766, 78066, 77493, 77301, 77668, 78518, 79454, 79977, 79900, 79517, 79312, 79484, 79805, 79917, 79779, 79727, 80071, 80666, 80995, 80695, 79905, 79064, 78451, 78003, 77523, 76940, 76367]
55269G6367l70m6K15K30ol14n38o77p34o09k84J4L1j26r6K25N06M14M3k72l83
55248G3590l92m02m00l50k65j42K0J74K48K26J41M4L1J86M01M04R9k49l23j60
55228G2881n5j30k43k71k16j5M03Q55R78O90L29J73J22k8k34l92n85q80j022p19
55208G1641j27K74L00K52M04O18N96L22M5n8m0j5LN3J00K6j76l51l57k71k26j39
55186G2874J83O40Q35O15L29K92L22P6l05l96j61Ml6K7L31N03K26k35m36l56l14
55165G5018m18m92m45l36j66J15L62L54J57P2J68J65p7k81j94j8j45n39p32m41
55145G2127J24N73P32N70N7o57j083q12o4M87M97L14L67N68N52K77L2o4j85m01
55125G4011n31m71l75l46k54NK20J56j08k71j71J33M95O88M57j42o33o28l57l63
$$ y = [76367, 75997, 75951, 76166, 76396, 76390, 76076, 75538, 74861, 74127, 73518, 73234, 73248, 73279, 73153, 73057, 73282, 73788, 74202, 74245, 73973, 73590, 73198, 72796, 72396, 72046, 71781, 71639, 71659, 71833, 72081, 72307, 72448, 72492, 72523, 72709, 73110, 73514, 73613, 73364, 73041, 72881, 72826, 72696, 72453, 72182, 71966, 71951, 72354, 73209, 74187, 74877, 75206, 75379, 75501, 75473, 75239, 74847, 74262, 73382, 72360, 71641, 71514, 71788, 72088, 72340, 72744, 73362, 73958, 74280, 74325, 74267, 74227, 74212, 74215, 74268, 74368, 74394, 74218, 73867, 73510, 73239, 73013, 72874, 73057, 73697, 74532, 75147, 75476, 75768, 76090, 76166, 75861, 75465, 75304, 75308, 75272, 75299, 75630, 76133, 76359, 76124, 75688, 75332, 75018, 74600, 74108, 73663, 73327, 73161, 73276, 73638, 73992, 74149, 74221, 74389, 74554, 74477, 74196, 74002, 73984, 73839, 73300, 72568, 72127, 72251, 72824, 73556, 74126, 74183, 73526, 72443, 71631, 71567, 72054, 72551, 72865, 73232, 73800, 74352, 74629, 74661, 74597, 74412, 74011, 73480, 73009, 72634, 72288, 72034, 72039, 72259, 72415, 72307, 72036, 71865, 71998, 72493, 73181, 73638, 73496, 72863, 72235, 71878, 71515]
55105G1515o88p92l40L45P82R21R93J040R19O48M15K90J87Q5O8J45K11J98J11
55086G7053m2k26k88r9J66J87p7k86j63J48L12K05k9j88j41J08L49K81j00l69
55066G6801j63L05M65J49k44l22j74j14k32l63l44j58J01K44J44p3j07R3K02o
55046G6204k97l08j28j27l26l65p3K89M62N16N50M18L6l01k28J70M54L77J21k7
55026G7417pO2P8K9l4n7m5o8j50k11j80q5K5J61L17L81K90J34P5J34K22K94L17
55003G9099K19J8r1L8K08J09k51n04l92pM38Q20R96Q11L52l4j49j72k68k62K6
54982H1004L31K02l24o92n21q4J04r4l28k27K15O55P70N74L83M27N53M69J95M3
54962H3655J58K50l0o04j052j095q67o46n18l43o8R5j23o68j112j059n39J32P05
$$ y = [71515, 70827, 70035, 69695, 70040, 70822, 71743, 72736, 73776, 74695, 75343, 75758, 76048, 76235, 76320, 76388, 76533, 76744, 76942, 77053, 77011, 76785, 76497, 76398, 76564, 76751, 76674, 76388, 76225, 76373, 76685, 76890, 76861, 76673, 76532, 76640, 76989, 77270, 77170, 76801, 76638, 76943, 77408, 77557, 77313, 76991, 76817, 76703, 76471, 76108, 75764, 75606, 75707, 75951, 76095, 76022, 75915, 76008, 76210, 76204, 75907, 75599, 75471, 75344, 75018, 74653, 74580, 74869, 75331, 75847, 76397, 76815, 76851, 76550, 76322, 76492, 76946, 77323, 77444, 77417, 77410, 77472, 77550, 77579, 77545, 77488, 77443, 77375, 77225, 77014, 76834, 76749, 76774, 76935, 77252, 77633, 77923, 78057, 78132, 78266, 78488, 78782, 79099, 79318, 79336, 79245, 79283, 79491, 79600, 79349, 78845, 78453, 78446, 78884, 79704, 80700, 81511, 81863, 81829, 81680, 81508, 81240, 80978, 81004, 81335, 81537, 81213, 80521, 80000, 79916, 80020, 79926, 79598, 79371, 79586, 80241, 81011, 81585, 81968, 82395, 82948, 83417, 83612, 83655, 83813, 84063, 84033, 83429, 82377, 81282, 80415, 79769, 79251, 78908, 78840, 78935, 78812, 78144, 77032, 75973, 75434, 75566, 76271]
54943G6271J103J226R59L96j17l51m00m19l92k77k07l05m22l52k33l75p16p52
54925G4637k36M44P14N38L76M89O59N63K59L5K4J34L28O86J122J259Q39J35k84
54906H2721k31r9k58n44n07q1L38M05K23J41L41P19J019J029P12K48j10k61k94
54887H5511l11l24l02k01J8K72L16qm22m21R7O26O48K16k40m58m76l86k25p8L3
54866H3885K24N17O27L22j32k30L9J83J0m3L80R19R81N71K07J99L97O27Q77J069
54846I1629J000O50K84R5L1N8L15Q46J376J592J475J213R09N99L77K81J60o7j76
54827A02647O4M07L75m2k89j9M23M68J6o07j100j346j288r64o23n11o08p27p80
54808I5496p28m72n9J50p1l40q8N81R69P83N33P42J233J526J471J170O55R9n4
$$ y = [76271, 77374, 78600, 79559, 79955, 79838, 79487, 79087, 78668, 78276, 77999, 77792, 77487, 77065, 76713, 76480, 76105, 75389, 74637, 74401, 74845, 75559, 76097, 76473, 76962, 77621, 78184, 78443, 78478, 78502, 78636, 78964, 79650, 80772, 82031, 82870, 83005, 82721, 82490, 82391, 82133, 81589, 81082, 81001, 81339, 81744, 81967, 82108, 82449, 83168, 84187, 85216, 85928, 86176, 86066, 85805, 85511, 85200, 84876, 84574, 84373, 84391, 84663, 84979, 84971, 84549, 84128, 84225, 84851, 85499, 85715, 85475, 85017, 84541, 84155, 83930, 83852, 83885, 84109, 84626, 85253, 85575, 85443, 85213, 85252, 85435, 85445, 85402, 85782, 86701, 87682, 88253, 88460, 88659, 89056, 89683, 90560, 91629, 92629, 93279, 93563, 93658, 93689, 93747, 94062, 94908, 96284, 97876, 99351, 100564, 101473, 102072, 102449, 102730, 102890, 102823, 102647, 102711, 103118, 103493, 103451, 103162, 103143, 103566, 104034, 104050, 103443, 102343, 100997, 99709, 98745, 98122, 97611, 97003, 96276, 95496, 94768, 94296, 94237, 94387, 94316, 93976, 93888, 94469, 95438, 96221, 96754, 97496, 98729, 100255, 101726, 102896, 103551, 103650, 103596]
54789A03596L61Q01O53J10j29J29M00L12j5m21r11j323j327r71p53r02j017p43
54771I7850l73l80o97q57p10n45n98p80q81q23o69n53n84p40q95r96j055r71o33
54752H4110k07l0j11j14P3J15j37k86m6J73j47p52r44o15l07l18l90l30l05l45
54732G9087j59K99N98M39J22N3J60J73J35K49L84K49o9j72O8K83J46j82k87p3
54712H1503J15l9l76l64K61J126J542J211M67j30k66QM49P94R24Q84P41N19L22
54693H9691L97Q13J230J308J241J467J930K130J976K019K519K884K460J529R73
54678A14567J152J637J920J899J690J383J113J022J065J031P89L98kk49k15j2
54662A29188Pl37p71r42r09r36r86q58o69p40r98j019o91l54k52k79m04q20j457
$$ y = [103596, 103957, 104758, 105411, 105521, 105392, 105521, 105921, 106233, 106218, 105797, 104886, 103563, 102236, 101265, 100512, 99610, 98593, 97850, 97477, 97097, 96400, 95543, 94833, 94288, 93690, 92910, 92029, 91206, 90537, 89984, 89400, 88660, 87765, 86769, 85714, 84743, 84110, 83903, 83873, 83762, 83648, 83721, 83836, 83699, 83413, 83367, 83540, 83393, 82641, 81697, 81082, 80775, 80457, 80067, 79737, 79432, 79087, 78928, 79227, 79825, 80264, 80386, 80439, 80599, 80772, 80907, 81156, 81540, 81789, 81720, 81548, 81616, 81899, 82045, 81863, 81576, 81503, 81618, 81579, 81203, 80839, 81100, 82226, 83768, 84979, 85446, 85316, 85050, 85058, 85507, 86301, 87225, 88109, 88850, 89369, 89691, 90088, 90901, 92131, 93439, 94680, 96147, 98077, 100207, 102183, 104202, 106721, 109605, 112065, 113594, 114567, 115719, 117356, 119276, 121175, 122865, 124248, 125361, 126383, 127448, 128479, 129268, 129666, 129664, 129415, 129200, 129188, 129195, 128858, 128087, 127145, 126236, 125300, 124314, 123456, 122787, 122047, 121049, 120030, 119339, 118985, 118733, 118454, 118050, 117230, 115773]
54643A15773j851j750j463j314j131o94k56j81l47l38q6J18J36P6k6j95k80j27
54625A06064M8j42o21q92p74o64r17j352j586j567j458j264r20o23p06j153j491
54608H9982j303o68m3K35J59j15m58p45q09o05l42l02n02o72o43n36n15n13l92
54589H1213j86%J79M05N59M79K50R9M1j21l89m79k19J58L03J62k3l6J02K02J18
54568H2817j17l25l82l33k57j48l6q3l67o38n70k21K5J9J5K14M55M97L69K70K97
54547H1501M19N25M18l7n92p54m18p5j15l01k37r1l37q55r54l45L86N12M7l94
54527G8303m04j53j0n0l4K52O91R42Q16M74K10J39J88K87M15N19N05L34lm70q91
54506H2060r51n24J37O18P30N37J54k51m26k79p8j34l93n57n69n72n34k63J43
$$ y = [115773, 113922, 112172, 110709, 109395, 108264, 107570, 107314, 107133, 106786, 106448, 106362, 106480, 106616, 106692, 106666, 106471, 106191, 106064, 106112, 105970, 105349, 104457, 103683, 103019, 102102, 100750, 99164, 97597, 96139, 94875, 93955, 93332, 92626, 91473, 89982, 88679, 88011, 87968, 88203, 88362, 88247, 87789, 87044, 86235, 85630, 85288, 84986, 84484, 83812, 83169, 82633, 82118, 81605, 81213, 81027, 81027, 81206, 81611, 82170, 82649, 82899, 82998, 83039, 82918, 82529, 82050, 81831, 81989, 82292, 82454, 82431, 82395, 82497, 82699, 82817, 82700, 82375, 81993, 81660, 81403, 81255, 81219, 81136, 80769, 80131, 79561, 79340, 79365, 79384, 79399, 79613, 80068, 80565, 80934, 81204, 81501, 81920, 82445, 82863, 82826, 82234, 81480, 81062, 80987, 80872, 80571, 80334, 80243, 79906, 79051, 78097, 77752, 78138, 78650, 78697, 78303, 77899, 77746, 77736, 77686, 77652, 77904, 78595, 79537, 80353, 80827, 81037, 81176, 81364, 81651, 82066, 82585, 83090, 83424, 83421, 82951, 82060, 81109, 80585, 80722, 81340, 82070, 82607, 82761, 82510, 82084, 81805, 81727, 81593, 81200, 80643, 80074, 79502, 78968, 78705, 78848]
54487G8848L13J55J0R4J66l8l58m43j87K07M63L86J2k76o8M87P52M28n1j45O1
54466H0816J45Qj60l02m34l14K98J072J298P53M2j24K75O72O32K64m7j06k6P0
54446H4832K72O43Q97O99K11j4J74K87l6m04k88J46K90j3l52m26l13j36N3P0k70
54425H6322p30p92l52J39K84J59lj23j58j7J99J70j93n52n77l29n7J57L21L64
54405H4232K74K15L38N29N61L38p7n17p63o72l57j02k2J7J24K39K94L25L29K52
54385H5557J64J99K83K19O9J26M38O84O37M43K65O1j42j08K22M81L61J7j91j37
54365H9648J11M49N93K07n79j055p42K1N67O80N03J20l49n29k59pk51o88o48j07
54345H7685L16K72j2k87n03m71l5M54M33kj32K71N85L62j7p4j9k87p01o89j20
$$ y = [78848, 79161, 79316, 79326, 79420, 79586, 79548, 79190, 78747, 78560, 78767, 79230, 79616, 79628, 79352, 79284, 79771, 80523, 80951, 80900, 80755, 80816, 80961, 80969, 80809, 80507, 80073, 79759, 80057, 81129, 82427, 83180, 83222, 83098, 83373, 84045, 84677, 84941, 84894, 84788, 84762, 84832, 85104, 85747, 86644, 87343, 87554, 87540, 87714, 88001, 87965, 87561, 87273, 87419, 87709, 87696, 87344, 86918, 86605, 86469, 86522, 86592, 86322, 85592, 84800, 84448, 84587, 84871, 85030, 85027, 84904, 84746, 84729, 84928, 85098, 84905, 84353, 83776, 83447, 83390, 83547, 83868, 84232, 84506, 84721, 85059, 85588, 86149, 86487, 86410, 85893, 85130, 84458, 84101, 83999, 83977, 83994, 84118, 84357, 84651, 84976, 85305, 85557, 85721, 85920, 86203, 86422, 86491, 86617, 87055, 87739, 88376, 88819, 89084, 89145, 89003, 88895, 89117, 89598, 89959, 89976, 89785, 89648, 89759, 90208, 90801, 91008, 90429, 89374, 88632, 88653, 89220, 89900, 90403, 90523, 90174, 89645, 89386, 89379, 89128, 88440, 87792, 87685, 88001, 88273, 88261, 87974, 87471, 87000, 86965, 87419, 87852, 87850, 87718, 87989, 88574, 88936, 88919, 88845, 88826, 88539, 87838, 87149, 87029]
54324H7029N73R69J002Q23O17M88L42J3m02n17j90J99K40J8r4MJ07O9o2j60q7
54303I0981K27O05O63K82j55k18PJ17k9j87j48O8L41N77O68N55L31J25l5j16N
54282I4664L50O74P29N86M83M48L26J39R1K47M37N47O27O94O34L94J18OJ06L03
54262A02603M38M14K68J10l4k15l57k75MJ29j18m73n32l56l46o19q86r16p90o36
54242I7413m82m07n02n85l18K35N27K59j89k97j26j03l42n20m34k42j67k02k17
54223I3301j43%J08J0l02n54m23J7L40K76jj89k15j47J5K65M12K54j26m17m68
54202I2013m02l73l56k72j30K1J76L23M20M63M67L70J05j93k63j07o8l06m57j46
54182I1285L82N47K94J62M41P55P01M47L56L48R3l29m14P7Q07J242J135N77j20
$$ y = [87029, 87602, 88571, 89573, 90396, 91013, 91501, 91843, 91856, 91454, 90937, 90747, 90946, 91186, 91204, 91110, 91114, 91221, 91290, 91228, 91068, 90981, 91208, 91813, 92476, 92758, 92603, 92385, 92392, 92509, 92480, 92293, 92145, 92213, 92554, 93131, 93799, 94354, 94685, 94810, 94775, 94659, 94664, 95014, 95688, 96417, 97003, 97486, 97934, 98260, 98399, 98490, 98737, 99174, 99721, 100348, 101042, 101676, 102070, 102188, 102194, 102300, 102603, 103041, 103455, 103723, 103833, 103799, 103584, 103227, 102952, 102956, 103085, 102967, 102494, 101962, 101606, 101260, 100641, 99755, 98839, 98049, 97413, 96931, 96524, 96022, 95437, 95119, 95354, 95881, 96140, 95951, 95654, 95528, 95425, 95083, 94563, 94129, 93887, 93720, 93518, 93301, 93158, 93158, 93266, 93276, 92974, 92420, 91997, 92014, 92354, 92630, 92629, 92440, 92225, 92078, 92093, 92358, 92770, 93024, 92898, 92481, 92013, 91611, 91238, 90882, 90610, 90480, 90501, 90677, 91000, 91420, 91883, 92350, 92720, 92825, 92632, 92369, 92262, 92194, 91888, 91431, 91285, 91667, 92214, 92508, 92670, 93111, 93866, 94567, 95014, 95370, 95718, 95811, 95482, 95068, 95145, 95952, 97194, 98329, 98906, 98786]
54163I8786n35m09N8L69K77Qj19r8p2k3J64L93L70K8l40l89j65l8k72p17r54p17
54141I5605j49L15L49K2k25k9M82P68M65j55m77k49J55K00k20p24q59n09J7K42
54121I5024m2n29p13m48o8R7Q2N1m3l07n77n41j88J64K46J27K0QRr2k76l45j29
54098I1530K29L44P8k03n8M35P68O45K43j38l46l34j17R4l7n30r60q75l36J61
54078I0593K42%j55M8M53O38L81o8l24k90j92j85j83p0J27K99L55K21r2l76l50
54057I1072K6M79P18O82M57J28j91k84M7P76J565J937J647R62M36L23L43K03O5
54038A01391K76P26R72Q55O28M68L26K67M74Q10Q15L94J0k0L0j33k67l2L96N98
54018A08984N64N86O81O10L59J44j2k60n25n51l48k40l95o76r43j178j262r74
$$ y = [98786, 98251, 97842, 97900, 98269, 98546, 98554, 98435, 98337, 98265, 98242, 98406, 98799, 99169, 99197, 98857, 98468, 98303, 98265, 97993, 97276, 96322, 95605, 95456, 95771, 96120, 96142, 95917, 95888, 96370, 97138, 97603, 97448, 96971, 96722, 96877, 97077, 96857, 96133, 95274, 94765, 94782, 95024, 94982, 94453, 93740, 93292, 93224, 93321, 93403, 93454, 93411, 93104, 92527, 91986, 91798, 91962, 92208, 92335, 92355, 92363, 92372, 92280, 92004, 91659, 91530, 91759, 92103, 92181, 91978, 91920, 92355, 93123, 93768, 94011, 93873, 93527, 93193, 93076, 93170, 93133, 92603, 91643, 90768, 90432, 90593, 90835, 90835, 90680, 90728, 91181, 91819, 92200, 92132, 91808, 91518, 91326, 91141, 90958, 90888, 91015, 91314, 91669, 91890, 91798, 91422, 91072, 91098, 91577, 92295, 92977, 93434, 93562, 93371, 93087, 93134, 93910, 95475, 97412, 99059, 100021, 100457, 100780, 101123, 101326, 101391, 101667, 102393, 103365, 104220, 104848, 105316, 105642, 105909, 106383, 107193, 108008, 108402, 108412, 108392, 108422, 108289, 108022, 107990, 108386, 108984, 109548, 110134, 110815, 111425, 111784, 111928, 111916, 111656, 111131, 110580, 110232, 109992, 109597, 108921, 107978, 106800, 105538, 104564]
54000A04564m07l9k08p09j066j034p44m43k48o8K37O05P73O12L53K67K74J19j69
53981A02669l19l18m33p25q55o00j94L%Q1M12Q42J085R37M70j3k28j94r1N0L22
53960A02901O28P22N90N10N80N86M41L99O31Q81Q49P04Q15J155J378J386J458
53943A16614J777K132K217J958J513J103R05R89J235J429J480J453J429J392J330
53928A38956J307J376J488J536J462J276J008O83L54J40J20K02J33k19o73q73
53912A48276o93l73k64n52j133j698j913j711j403j340j450j351r39n55m82n37
53896A31882m32k25j61j97p9K07L74K81J38J96L92M33J38l29n82l92M1K73J66
53877A32124L6J77M21M44K71J76J67l8n03r07j001r40r74j067j037q68p14o78
$$ y = [104564, 104157, 104118, 103910, 103201, 102135, 101101, 100357, 99914, 99666, 99598, 99835, 100440, 101213, 101825, 102178, 102445, 102719, 102838, 102669, 102350, 102032, 101599, 100874, 100019, 99419, 99225, 99228, 99228, 99309, 99721, 100563, 101648, 102585, 103055, 103042, 102814, 102620, 102529, 102579, 102901, 103529, 104251, 104841, 105351, 105931, 106517, 106958, 107357, 107988, 108869, 109718, 110422, 111237, 112392, 113770, 115156, 116614, 118391, 120523, 122740, 124698, 126211, 127314, 128219, 129208, 130443, 131872, 133352, 134805, 136234, 137626, 138956, 140263, 141639, 143127, 144663, 146125, 147401, 148409, 149092, 149446, 149586, 149706, 149908, 150041, 149822, 149149, 148276, 147583, 147210, 146946, 146394, 145261, 143563, 141650, 139939, 138536, 137196, 135746, 134395, 133456, 132901, 132419, 131882, 131450, 131225, 131064, 130867, 130788, 130995, 131369, 131650, 131788, 131984, 132376, 132809, 132947, 132618, 132036, 131644, 131685, 131958, 132124, 132160, 132337, 132758, 133202, 133473, 133649, 133816, 133778, 133275, 132368, 131367, 130427, 129453, 128386, 127349, 126481, 125767, 125089]
53859A25089p22p48o70m83l08k82l29k15R9L65M16M56P88J360J839K042K097K164
53841A32958K247K310K388K487K552K602K768L056L229L055K670K451K554K743
53827A70070K759K680K735K944L113L155L187L251L199K882K365J848J459J245
53813B06892J195J169R75N98K89K26K59J27j73m66p08r72j206j282j256j355j649
53796B02663j966k195k418k710l001l180l182k953k551k250k312k596k703k548
53782A66098k458k566k562k221j826j737j845j868j907k227k663k737k393k064
53768A35024j962j786j337r62j062j489j739j611j311j019o85k85qn4l95q23j174
53751A17322j394j443j243p76j99K02K42Qk36k72j06Q6J03j12m18n62m02k7L46
$$ y = [125089, 124367, 123619, 122949, 122466, 122158, 121876, 121547, 121332, 121431, 121796, 122212, 122668, 123456, 124816, 126655, 128697, 130794, 132958, 135205, 137515, 139903, 142390, 144942, 147544, 150312, 153368, 156597, 159652, 162322, 164773, 167327, 170070, 172829, 175509, 178244, 181188, 184301, 187456, 190643, 193894, 197093, 199975, 202340, 204188, 205647, 206892, 208087, 209256, 210231, 210829, 211118, 211344, 211603, 211730, 211557, 211091, 210383, 209411, 208205, 206923, 205667, 204312, 202663, 200697, 198502, 196084, 193374, 190373, 187193, 184011, 181058, 178507, 176257, 173945, 171349, 168646, 166098, 163640, 161074, 158512, 156291, 154465, 152728, 150883, 149015, 147108, 144881, 142218, 139481, 137088, 135024, 133062, 131276, 129939, 128977, 127915, 126426, 124687, 123076, 121765, 120746, 120061, 119776, 119768, 119714, 119319, 118496, 117322, 115928, 114485, 113242, 112466, 112267, 112469, 112711, 112719, 112483, 112211, 112105, 112191, 112294, 112182, 111764, 111202, 110800, 110773, 111119]
53732A11119N46N22K99Jj69r4J48M12O84R81J133Q66K24l38l58J86R19J435J554
53713A20070J343J066R94J131J211J039Q17R12J360J776J797J460J074Q98R99
53698A37947J306J631J716J427R65P25R02J244J293Q30R5m35m44k2M15M93J66
53681A50254k98o24p33p15o51o20p11r90j380j697j787j574j084n20k61n49j187
53664A34873j702j844j752j575j275q92p22r41j242j141o14j33n3k63m73n86o82
53647A18983q40j051j237j233r37m42L0L72O05P06N68K02k22n82q82j061r51n31
53629A11497o7K20M04O65R09Q69M80J5k04q8K16M98O38O76P09P56P78P84Q65J006
53609A21626J053Q93O46N02N18O29P69Q78Q64O83M46L36M53P56J125J380J374
$$ y = [111119, 111665, 112187, 112486, 112487, 112318, 112224, 112372, 112784, 113468, 114449, 115582, 116448, 116672, 116334, 115976, 116162, 117081, 118516, 120070, 121413, 122479, 123473, 124604, 125815, 126854, 127671, 128583, 129943, 131719, 133516, 134976, 136050, 136948, 137947, 139253, 140884, 142600, 144027, 144992, 145717, 146619, 147863, 149156, 149986, 150081, 149646, 149202, 149180, 149595, 150088, 150254, 149956, 149332, 148599, 147884, 147233, 146613, 145902, 144912, 143532, 141835, 140048, 138474, 137390, 136870, 136609, 136060, 134873, 133171, 131327, 129575, 128000, 126725, 125833, 125111, 124170, 122928, 121787, 121173, 121040, 120987, 120724, 120251, 119665, 118983, 118143, 117092, 115855, 114622, 113685, 113243, 113273, 113645, 114250, 114956, 115524, 115726, 115504, 114922, 114040, 112979, 112028, 111497, 111430, 111650, 112054, 112719, 113628, 114497, 114977, 114992, 114788, 114700, 114916, 115414, 116052, 116728, 117437, 118193, 118971, 119755, 120620, 121626, 122679, 123572, 124218, 124720, 125238, 125867, 126636, 127514, 128378, 129061, 129507, 129843, 130296, 131052, 132177, 133557, 134931]
53592A34931J137R00Q23Q36P96O83N55M06K56K52M94Q25R48P77M74K42J74K82
53574A45791N08O77O45M29J54j04l43n09n64n60n19l57o2J43J00M0L21Q65J191
53555A47846J067P87O67O27M33J14j25j92r8J41L96L76J8k32J67J094J777J666
53537A56529J019N25M97O71P16O42O52P60P60N52L25L51O63J035J214J118Q56
53520A68885O29N86P05Q23Q43Q30Q53Q43P23N53L95J82p3p4M47J211J584J322
53502A81267Q29N63N24M65L42K75L03M07O36R69J182J081P67M92L37K11R9L4j8
53483A90765j12j73j12j5l0j42k40l27m74o11o20n67o00o70n58k67p1j69m48o76
53463A83883p24n85l29j07m3j00j48k09l90o39p51o70n80n64m68j87J34L38M89
$$ y = [134931, 136068, 136968, 137791, 138627, 139423, 140106, 140661, 141067, 141323, 141575, 142069, 142894, 143842, 144619, 145093, 145335, 145509, 145791, 146299, 146976, 147621, 148050, 148204, 148100, 147757, 147248, 146684, 146124, 145605, 145248, 145186, 145329, 145429, 145469, 145790, 146655, 147846, 148913, 149700, 150367, 150994, 151427, 151541, 151416, 151224, 151126, 151267, 151663, 152039, 152057, 151825, 151992, 153086, 154863, 156529, 157548, 158073, 158570, 159241, 159957, 160599, 161251, 162011, 162771, 163323, 163648, 163999, 164662, 165697, 166911, 168029, 168885, 169514, 170100, 170805, 171628, 172471, 173301, 174154, 174997, 175720, 176273, 176668, 176850, 176777, 176703, 177150, 178361, 179945, 181267, 182096, 182659, 183183, 183648, 183990, 184265, 184568, 184975, 185611, 186580, 187762, 188843, 189610, 190102, 190439, 190650, 190749, 190783, 190765, 190653, 190480, 190368, 190353, 190323, 190181, 189941, 189614, 189140, 188529, 187909, 187342, 186742, 186072, 185514, 185247, 185176, 185007, 184559, 183883, 183159, 182574, 182245, 182138, 182095, 181995, 181847, 181638, 181248, 180609, 179858, 179188, 178608, 178044, 177576, 177389, 177523, 177861, 178350]
53444A78350P00Q63Q19O14M27L15K38K52M37O52O95O46Q33J347J858K032J992
53427A93070K108K448K710K669K471K387K472K628K876L340L967M437M480M122
53413B36185L649L387L574M237N095N715N914N935O087O333O430O313O144O022
53399C11020N943O012O379O934P340P444P428P456P434P282P147P164P225P236
53385D09444P358P729Q110Q148P886P663P595P470P158O816O593O414O158N805
53371E10347N388M954M669M652M657M219L259K266J712J554J539J644J865J840
53357E54565J185J27o63r27j025j295j611j851k243k991l806m272m404m496m570
53342E21723m431m202m321m869n331n212m623m082l900m000m201m401m541m495
$$ y = [178350, 179050, 179913, 180732, 181346, 181773, 182088, 182326, 182578, 183015, 183667, 184362, 185008, 185841, 187188, 189046, 191078, 193070, 195178, 197626, 200336, 203005, 205476, 207863, 210335, 212963, 215839, 219179, 223146, 227583, 232063, 236185, 239834, 243221, 246795, 251032, 256127, 261842, 267756, 273691, 279778, 286111, 292541, 298854, 304998, 311020, 316963, 322975, 329354, 336288, 343628, 351072, 358500, 365956, 373390, 380672, 387819, 394983, 402208, 409444, 416802, 424531, 432641, 440789, 448675, 456338, 463933, 471403, 478561, 485377, 491970, 498384, 504542, 510347, 515735, 520689, 525358, 530010, 534667, 538886, 542145, 544411, 546123, 547677, 549216, 550860, 552725, 554565, 555750, 555877, 555214, 554287, 553262, 551967, 550356, 548505, 546262, 543271, 539465, 535193, 530789, 526293, 521723, 517292, 513090, 508769, 503900, 498569, 493357, 488734, 484652, 480752, 476752, 472551, 468150, 463609, 459114]
53328D59114m134l441k608j990j800j860j764j297o32n2L52O70J007J415J878
53313D44858K322K707L097L576M088M580N183O006O804P206P326P740Q650R531
53299E23674R880R936J0256J0901J1520J2038J2681J3445J4006J4237J4367J4554
53287F71495J4758J5055J5698J6657J7467J7702J7404J6947J6647J6596J6640
53276H53066J6468J5951J5335J4881J4413J3572J2459J1515J0780R843Q617P561
53264A004461O896O208N172M067L103J851m4k028l261l815m466n493o481p308
53250I98862q450j0073j1554j2307j2559j2871j3327j3671j3899j4222j4560j4589
53238H46780j4302j4121j4308j4558j4358j3651j2893j2513j2450j2345j2006
$$ y = [459114, 454980, 451539, 448931, 446941, 445141, 443281, 441517, 440220, 439588, 439536, 439888, 440558, 441565, 442980, 444858, 447180, 449887, 452984, 456560, 460648, 465228, 470411, 476417, 483221, 490427, 497753, 505493, 514143, 523674, 533554, 543490, 553746, 564647, 576167, 588205, 600886, 614331, 628337, 642574, 656941, 671495, 686253, 701308, 717006, 733663, 751130, 768832, 786236, 803183, 819830, 836426, 853066, 869534, 885485, 900820, 915701, 930114, 943686, 956145, 967660, 978440, 988283, 996900, 1004461, 1011357, 1017565, 1022737, 1026804, 1029907, 1031758, 1031714, 1029686, 1026425, 1022610, 1018144, 1012651, 1006170, 998862, 990412, 980339, 968785, 956478, 943919, 931048, 917721, 904050, 890151, 875929, 861369, 846780, 832478, 818357, 804049, 789491, 775133, 761482, 748589, 736076, 723626, 711281, 699275]
53227F99275j1545j1109j0693j0260r847r466r072q732q603q609q403p861p377
53214E77698p303p336o886n939n094m757m729m656m441m113l654l195k966k921
53200E09708k704k171j645j391j233q84l73J65P99J570K182K407K514K951L661
53185E15556M198M451M749N243N653N744N667N604N446N064M652M523M689M853
53171E86092M761M329L587K672J830J237Q23M07p8n89j131j751k370k818l125
53156E93876l576m388n381o128o396o389o485o866p413p954q436q849r024q801
53142D97790q331q078q317q795r014q802q404q063p775p484p228p033o818o618
53128C87030o621o822o868o506o034n926o115o093n700n331n298n405n409n440
$$ y = [699275, 687730, 676621, 665928, 655668, 645821, 636355, 627283, 618551, 609948, 601339, 592936, 585075, 577698, 570395, 563059, 556173, 550234, 545140, 540383, 535654, 530998, 526557, 522444, 518790, 515595, 512629, 509708, 507004, 504833, 503188, 501797, 500564, 499680, 499307, 499472, 500271, 501841, 504023, 506430, 508944, 511895, 515556, 519754, 524205, 528954, 534197, 539850, 545594, 551261, 556865, 562311, 567375, 572027, 576550, 581239, 586092, 590853, 595182, 598769, 601441, 603271, 604508, 605331, 605738, 605660, 605071, 603940, 602189, 599819, 597001, 593876, 590300, 585912, 580531, 574403, 568007, 561618, 555133, 548267, 540854, 532900, 524464, 515615, 506591, 497790, 489459, 481381, 473064, 464269, 455255, 446453, 438049, 429986, 422211, 414727, 407499, 400466, 393648, 387030, 380409, 373587, 366719, 360213, 354179, 348253, 342138, 336045, 330345, 325014, 319716, 314311, 308902, 303462]
53114C03462n601n557m980m183l777l846l965l978m176m601m809m537m191m245
53100B41016m561m690m574m487m429m103l550l299l703m389m685m399l949l772
53086A82426l862l901l637l072k436k058k116k417k515k205j821j827k165k299
53072A46095j990j610j559j635j387q40m77n32p33q04q25r19r63q12n81m57m25
53055A29546m04m55o60q76q78o84m93l79k24O0L91O08N76K39k84o72o33k06K88
53036A24860N55N42L69K29K75N00P08O72M03J15j8l1m2j02j69j94j60n7J06K92
53016A28853L98L27J28L9K53O40Q38O63K85o2l56o52q70q51o22l45j34j1K2L5
52996A28578K03N55P43L75m44j084j096o94m38n66q06q32o58n20m99m14j45J34
$$ y = [303462, 297861, 292304, 287324, 283141, 279364, 275518, 271553, 267575, 263399, 258798, 253989, 249452, 245261, 241016, 236455, 231765, 227191, 222704, 218275, 214172, 210622, 207323, 203620, 199231, 194546, 190147, 186198, 182426, 178564, 174663, 171026, 167954, 165518, 163460, 161344, 158927, 156412, 154207, 152386, 150559, 148394, 146095, 144105, 142495, 140936, 139301, 137914, 137074, 136597, 136065, 135332, 134528, 133703, 132784, 131821, 131009, 130428, 129971, 129546, 129142, 128687, 128027, 127151, 126273, 125589, 125096, 124717, 124493, 124553, 124944, 125552, 126128, 126367, 126083, 125411, 124778, 124572, 124860, 125415, 125957, 126326, 126555, 126830, 127330, 128038, 128710, 129113, 129228, 129210, 129179, 129137, 129035, 128866, 128672, 128512, 128455, 128561, 128853, 129251, 129578, 129706, 129745, 129998, 130638, 131476, 132139, 132424, 132362, 132006, 131354, 130484, 129633, 129011, 128666, 128532, 128521, 128543, 128578, 128781, 129336, 130079, 130454, 130010, 128926, 127830, 127136, 126698, 126132, 125326, 124494, 123836, 123316, 122817, 122403, 122258, 122392]
52978A22392J61j8q8Q4K53J84k4j19k7J81M59P01O44K22j85j86J0j15n27n94m6
52957A23362N35N30J44M6L86O66M97L6l64n63n92m93l49k80k78k04j2J39J41N0
52937A23397m9j62k54j35K62O55O78L23q2l27m63n15l43M9L38K27j57m39m39k20
52917A22344J72O82J004P72J01m10l30J39N30O31N05K28p6j22J89N30N17K73K32
52898A27911M36M47N5l89n15m34m52n22l57P0M65O36O60O45N56L63J29j05l80
52879A29219o33o19j71N32J076J180R06M83J05j23j40%Q9q6m71p35n85q4M07N69
52859A30919L97J17p0j71k89l98l28m2K08J46j18j96Q8M93P02O66M63J31k27l42
52839A32149q1K71L27P8j54j93j73k38l48m22l98j57L47Q64J006P13K89k1k65
$$ y = [122392, 122553, 122535, 122447, 122531, 122784, 122968, 122944, 122825, 122798, 122979, 123438, 124139, 124783, 125005, 124820, 124634, 124644, 124529, 124002, 123408, 123362, 123897, 124427, 124571, 124617, 125003, 125669, 126166, 126202, 125838, 125275, 124683, 124190, 123841, 123561, 123283, 123079, 123067, 123206, 123347, 123397, 123348, 123186, 122932, 122797, 123059, 123714, 124392, 124715, 124633, 124306, 123843, 123328, 122985, 123034, 123372, 123599, 123442, 123003, 122564, 122344, 122516, 123198, 124202, 124974, 125075, 124665, 124335, 124474, 125004, 125635, 126140, 126368, 126292, 126170, 126359, 126889, 127406, 127679, 127911, 128347, 128794, 128849, 128460, 127945, 127511, 127059, 126537, 126180, 126250, 126715, 127351, 128011, 128656, 129212, 129575, 129704, 129599, 129219, 128586, 127967, 127796, 128328, 129404, 130584, 131490, 131973, 132078, 131955, 131815, 131815, 131904, 131818, 131347, 130612, 130027, 129943, 130350, 130919, 131316, 131433, 131363, 131192, 130903, 130505, 130177, 130135, 130343, 130489, 130371, 130175, 130263, 130756, 131458, 132124, 132587, 132718, 132491, 132149, 132068, 132339, 132666, 132744, 132590, 132397, 132224, 131986, 131638, 131216, 130818, 130661, 131008, 131872, 132878, 133591, 133880, 133859, 133594]
52820A33594n10o60o66o43n90l11K08N90N20J92L1J24K28J81M6j04k07j18K35
52801A32140N76M93k0m58l80J40O94R54Q08L27k17m45k23J26J94Qm0K06M33L18
52781A35634qk13k92n13q42q30k55M71P59N15J04j97l75m75n11n50o04m84p9K76
52761A31531J55l15n48l43j48l20o17o66n38n27o41p07p24p69p38n05j88M3K34
52742A23669M34M54J76j55k79l74o77r03n99O8M43L00L6m9j05j87m8L16M71K35
52722A23226P8L69P14N55P5o9K04K91j50o94p77m41j72k29m03l92j91n6j56l25
52702A21457k50J33M97M74K6n45r23r90q03m73j27J27K48K59J88P6l4j28k30l46
52682A18636m20l75j86P3K60K47M5j71k40j85j16l9J27L48M54L96L26L70M31L60
$$ y = [133594, 133084, 132424, 131758, 131115, 130525, 130214, 130422, 131012, 131532, 131724, 131755, 131879, 132107, 132288, 132334, 132230, 132023, 131905, 132140, 132716, 133209, 133189, 132731, 132351, 132491, 133185, 134139, 134947, 135274, 135057, 134612, 134389, 134515, 134709, 134717, 134677, 134883, 135316, 135634, 135626, 135413, 135121, 134608, 133766, 132936, 132681, 133152, 133911, 134426, 134530, 134333, 133958, 133483, 132972, 132422, 131818, 131334, 131255, 131531, 131686, 131371, 130823, 130480, 130332, 130012, 129395, 128729, 128191, 127664, 127023, 126316, 125592, 124823, 124085, 123580, 123392, 123435, 123669, 124103, 124557, 124733, 124578, 124299, 123925, 123248, 122345, 121746, 121814, 122257, 122557, 122593, 122544, 122439, 122252, 122204, 122520, 122991, 123226, 123304, 123673, 124387, 124942, 125017, 124948, 125152, 125443, 125293, 124599, 123822, 123381, 123209, 122980, 122577, 122185, 121994, 121938, 121782, 121457, 121207, 121340, 121837, 122311, 122337, 121792, 120869, 119879, 119076, 118603, 118476, 118603, 118851, 119110, 119298, 119374, 119340, 119212, 118982, 118636, 118216, 117841, 117655, 117728, 117988, 118235, 118280, 118109, 117869, 117684, 117568, 117529, 117656, 118004, 118458, 118854, 119180, 119550, 119981, 120341]
52662A20341K18J90K99L31J39j33j89O7M15O01O71Q41J067R91M52j64l21N0N46
52643A26412Q03P65N10J90N4K12L26k9o47p88j99M63N25K19K30O33Q69O27K26
52624A31401K5m5k05m47o15o52n36k17K06M24K51n0l5L67P27O31J73j70j31Q4
52604A31186J34j4j20o6J7K2LJ1l1j39j47M5K58K10j59o77j079j073m82M54J097
52583A29450J036N36J27j03m42q83r97o17j78j89n86q39n95j0M56M67J06k24k17
52564A26298%R0RK4K63M81M32K28J18J46K19L24M95O08N47M14M42O35P51O49M80
52543A33653M53N47O07N84N76O45O59M53L8l77n90n47k99P8M61O71O16L93J77
52524A38798L9p6j99l14l98l94k40k1j4l50p70r03p79p19p76o62k92j2p1j92%
$$ y = [120341, 120559, 120749, 121048, 121379, 121518, 121385, 121196, 121263, 121678, 122279, 122950, 123791, 124858, 125849, 126301, 126137, 125816, 125866, 126412, 127215, 127980, 128490, 128680, 128734, 128946, 129272, 129243, 128596, 127808, 127609, 128072, 128597, 128816, 129046, 129679, 130548, 131175, 131401, 131426, 131381, 131176, 130729, 130114, 129462, 128926, 128709, 128915, 129339, 129590, 129540, 129505, 129872, 130599, 131230, 131403, 131233, 131102, 131186, 131320, 131306, 131186, 131120, 131137, 131159, 131162, 131173, 131142, 131003, 130856, 130901, 131159, 131369, 131210, 130533, 129454, 128381, 127899, 128353, 129450, 130486, 131022, 131149, 131046, 130604, 129721, 128724, 128107, 127929, 127740, 127154, 126315, 125720, 125710, 126166, 126633, 126739, 126515, 126298, 126298, 126388, 126397, 126421, 126684, 127165, 127597, 127825, 127943, 128089, 128308, 128632, 129127, 129735, 130282, 130696, 131138, 131773, 132524, 133173, 133653, 134106, 134653, 135260, 135844, 136420, 137065, 137724, 138177, 138215, 137838, 137248, 136701, 136402, 136480, 136941, 137612, 138228, 138621, 138798, 138837, 138761, 138562, 138248, 137850, 137456, 137216, 137195, 137181, 136831, 136061, 135158, 134379, 133660, 132884, 132222, 131930, 131918, 131847, 131655, 131655]
52503A31655M06O12M94L22K86K83J57p0k66l32j91J64O08R19R38O75K67p7j71
52484A36679rJ96K05k7l49n62m98j38K53L03%j90J18O46Q24N59K89K77L08J69
52464A39053L4J22L02K90M2l10p23j131j277r71m84k85m36n30l34r4r4j93p2K38
52444A33147M41M47M25M24K89J9j02N0J72l7l58l62m1K15K73L99O75P38L71KJ60
52423A37347O71Q98O39L59M16O01N69L72K89L45L29J50r0l21n62p54p42m72p1
52404A39973L01N80P27O67L52j22n58p93p96o66n36m66l82j39K85O58O38J48m45
52385A39426o45l45Q6K84K88L69N90P58P18N35L56K77L15L89L52J54k3NJ49J68
52365A44206L4o3m1J2J05L24M92K52l85q56p31k56M5M0o7k11m42n70l27J39L58
$$ y = [131655, 132061, 132673, 133167, 133489, 133775, 134058, 134215, 134145, 133879, 133547, 133356, 133520, 134128, 135047, 135985, 136660, 136927, 136850, 136679, 136670, 136866, 137071, 137044, 136695, 136133, 135635, 135497, 135750, 136053, 136053, 135863, 135981, 136627, 137451, 138010, 138299, 138576, 138884, 139053, 139087, 139209, 139511, 139801, 139843, 139533, 138810, 137679, 136402, 135431, 134947, 134662, 134226, 133696, 133362, 133268, 133174, 132981, 132909, 133147, 133588, 134035, 134460, 134884, 135173, 135192, 135090, 135140, 135312, 135275, 134917, 134555, 134514, 134729, 135002, 135401, 136076, 136814, 137185, 137187, 137347, 138018, 138916, 139555, 139914, 140330, 140931, 141500, 141872, 142161, 142506, 142835, 142985, 142895, 142574, 142012, 141258, 140516, 140044, 139973, 140274, 140854, 141581, 142248, 142600, 142478, 141920, 141127, 140331, 139665, 139129, 138663, 138281, 138142, 138427, 139085, 139723, 139871, 139426, 138781, 138436, 138522, 138806, 139094, 139463, 140053, 140811, 141529, 142064, 142420, 142697, 143012, 143401, 143753, 143907, 143884, 143889, 144038, 144206, 144240, 144177, 144136, 144148, 144253, 144577, 145069, 145321, 144936, 144080, 143349, 143093, 143138, 143178, 143111, 142900, 142458, 141888, 141561, 141700, 142058]
52344A42058J78p0j05q9k30l98l11N1M04M76K03k34n19m51j78QQ4K94P17J091
52324A42979J224J245J291J202Q08L33J71L55N58N77N54O89R21J001P46K15k89
52307A54580m45k15P3J21OJ8K51N29O92P12O11M47L45L30J89k39o88p24l77j37
52287A56079k69m99n29m48m29l26L0M17N08L60K85L08J98%M9M26P64P78O29O00
52267A58931O86P31P75R52J180J246J083Q30O04M23K97K54K63K57K32K44L49N89
52249A69926R84J400J555J331R69Q34R29R51P74O70R04J329J575J525J446J624
52233A88726K052K453K567K417K296K467K865L136L078K904K996L450L997M348
52219B29752M475M552M739N089N588O116O475O524O375O316O526O873P098P104
$$ y = [142058, 142236, 142166, 142061, 141972, 141742, 141344, 141033, 141084, 141488, 141964, 142167, 141933, 141414, 140963, 140785, 140793, 140877, 141171, 141888, 142979, 144203, 145448, 146739, 147941, 148749, 149082, 149253, 149608, 150166, 150743, 151297, 151986, 152907, 153908, 154654, 154869, 154580, 154135, 153920, 153993, 154114, 154120, 154138, 154389, 154918, 155610, 156322, 156933, 157380, 157725, 158055, 158244, 158005, 157317, 156593, 156216, 156079, 155810, 155311, 154782, 154334, 153905, 153579, 153609, 154026, 154534, 154894, 155179, 155487, 155685, 155685, 155734, 156160, 156924, 157702, 158331, 158931, 159617, 160348, 161123, 162075, 163255, 164501, 165584, 166414, 167018, 167441, 167738, 167992, 168255, 168512, 168744, 168988, 169337, 169926, 170910, 172310, 173865, 175196, 176165, 176999, 177928, 178879, 179653, 180323, 181227, 182556, 184131, 185656, 187102, 188726, 190778, 193231, 195798, 198215, 200511, 202978, 205843, 208979, 212057, 214961, 217957, 221407, 225404, 229752, 234227, 238779, 243518, 248607, 254195, 260311, 266786, 273310, 279685, 286001, 292527, 299400, 306498, 313602]
52205C13602O995O864O734O711O942P346P533P280O874O784P017P136O903O530
52191D11251O205N773N122M536M315M233L818L050K371K045J876J650J447J366
52177D59058J266R96O58M11K31P8Q6L64P52R86J024R73Q39O08N23R09J673K308
52159D73743K486K388K334K337K265K261K640L384M002M082L747L489L593L926
52145E16677M201M311M269M035L537K855K235J860J679J513J273J019Q12O23L55
52130E51254m7n41j019j381j633j880k232k691l084l175k915k596k606k974l283
52115E19197l191k885k763k853k793k405j908j484j035n48l34n83r76j082r64
52100D93393r89j127r55l26L67P00O59M58K39N2p6k47n56q33p54l52j31m03q77
$$ y = [313602, 320597, 327461, 334195, 340906, 347848, 355194, 362727, 370007, 376881, 383665, 390682, 397818, 404721, 411251, 417456, 423229, 428351, 432887, 437202, 441435, 445253, 448303, 450674, 452719, 454595, 456245, 457692, 459058, 460324, 461320, 461978, 462389, 462620, 462698, 462784, 463148, 463900, 464886, 465910, 466883, 467722, 468330, 468853, 469762, 471435, 473743, 476229, 478617, 480951, 483288, 485553, 487814, 490454, 493838, 497840, 501922, 505669, 509158, 512751, 516677, 520878, 525189, 529458, 533493, 537030, 539885, 542120, 543980, 545659, 547172, 548445, 549464, 550276, 550899, 551254, 551207, 550666, 549647, 548266, 546633, 544753, 542521, 539830, 536746, 533571, 530656, 528060, 525454, 522480, 519197, 516006, 513121, 510358, 507505, 504712, 502307, 500399, 498915, 497880, 497332, 496998, 496415, 495439, 494357, 493393, 492404, 491277, 490322, 489996, 490363, 491063, 491722, 492180, 492419, 492471, 492395, 492148, 491592, 490759, 490005, 489653, 489522, 489119, 488242]
52081D88242j078r75q82r15r33q64q02p91q01q43r06q42n66l15l78o38o68l45
52063D74700o3j93o23r28q64n38k08j00k28l74l17j18l6j51l00l75m83o19n23
52044D67659pO84J124J155R29O38M27M61P66J099J193J172J371J830K235K416
52028D85152K582K879L087K982K795K953L474L938M061M028M170M511M788M812
52014E36212M709M760N098N562N837N785N578N513N729O105O381O356O038N682
52000F15345N546N574N432N002M644M676M785M330L306K470K356K552K325J644
51986F69987J092R46Q60N06L3l07n89r86j402j594j586j631j867k167k321k202
51970F56772j806j293r57r96j270j414j200p06j54L12P04J078J423J664J776J896
$$ y = [488242, 487164, 486189, 485307, 484392, 483459, 482595, 481793, 481002, 480201, 479358, 478452, 477610, 477044, 476729, 476351, 475713, 475045, 474700, 474637, 474444, 473821, 472893, 472029, 471491, 471283, 471183, 470955, 470581, 470264, 470146, 470110, 469959, 469659, 469284, 468801, 468182, 467659, 467652, 468336, 469460, 470615, 471544, 472182, 472609, 473070, 473836, 474935, 476128, 477300, 478671, 480501, 482736, 485152, 487734, 490613, 493700, 496682, 499477, 502430, 505904, 509842, 513903, 517931, 522101, 526612, 531400, 536212, 540921, 545681, 550779, 556341, 562178, 567963, 573541, 579054, 584783, 590888, 597269, 603625, 609663, 615345, 620891, 626465, 631897, 636899, 641543, 646219, 651004, 655334, 658640, 661110, 663466, 666018, 668343, 669987, 671079, 672025, 672885, 673391, 673424, 673117, 672528, 671542, 670140, 668546, 666960, 665329, 663462, 661295, 658974, 656772, 654966, 653673, 652716, 651720, 650450, 649036, 647836, 647130, 646976, 647288, 647992, 649070, 650493, 652157, 653933, 655829]
51954F55829K187K606K891K851K571K240J954J744J684J740J636J141L98j66l44
51939F80962l55n36r94j567k010k191k219k405k925l621m195m634n127n628n796
51924F36759n506n152n212n701o290o754p062p141o928o617o510o564o414n951
51910E48957n613n841o509p114p429p655p912q002p759p371p128o968o661o283
51896D50712o247o737p414p835p957q003q032p896p568p225o984o809o680o651
51882C48674o679o610o425o257o097n716n106m668m696m842m497l607k775k435
51868B78264k369k100j534r24m41j3M71J015J548J988K287K535K928L482L892
51853B91029L849L480L258L408L680L721L536L378L378L442L422L203K691J917
$$ y = [655829, 658016, 660622, 663513, 666364, 668935, 671175, 673129, 674873, 676557, 678297, 679933, 681074, 681472, 681306, 680962, 680607, 680071, 679077, 677510, 675500, 673309, 671090, 668685, 665760, 662139, 657944, 653310, 648183, 642555, 636759, 631253, 626101, 620889, 615188, 608898, 602144, 595082, 587941, 581013, 574396, 567886, 561322, 554908, 548957, 543344, 537503, 530994, 523880, 516451, 508796, 500884, 492882, 485123, 477752, 470624, 463656, 456995, 450712, 444465, 437728, 430314, 422479, 414522, 406519, 398487, 390591, 383023, 375798, 368814, 362005, 355325, 348674, 341995, 335385, 328960, 322703, 316606, 310890, 305784, 301116, 296420, 291578, 287081, 283474, 280699, 278264, 275895, 273795, 272261, 271337, 270896, 270883, 271354, 272369, 273917, 275905, 278192, 280727, 283655, 287137, 291029, 294878, 298358, 301616, 305024, 308704, 312425, 315961, 319339, 322717, 326159, 329581, 332784, 335475, 337392]
51839C37392J130O01K92r2p02j364j881k301k791l370l947m516n118n678o015
51824C01640o091o073o162o346o396o062n359m674m447m646m734m299l562l015
51810B29774k745k466k130k070k379k646k477k008j597j307j028q43q82r18n83
51795B03695O2N24N50M07M33N87O86P57R17J088J085Q89O47M57L43L67N68Q21
51777B14883R24Q29O33M16J77k8j03n0j2j32m38q75j303j561j613j663j895k151
51759B06038k074j661j388j576j933j933j565j297j367j462j246q63o85p70q38
51744A85380p11n24m79n87p38q58q92p29k83L12O87N68Q7k95k80j9J85L11N59
51725A81694Q82R25N25L7r7Q9K02M5j99l09k85k08j03J1P1J03K49N61Q87R63O50
$$ y = [337392, 338522, 339123, 339415, 339323, 338621, 337257, 335376, 333075, 330284, 326914, 322967, 318451, 313333, 307655, 301640, 295549, 289476, 283314, 276968, 270572, 264510, 259151, 254477, 250030, 245384, 240650, 236351, 232789, 229774, 227029, 224563, 222433, 220363, 217984, 215338, 212861, 210853, 209256, 207949, 206921, 206078, 205196, 204278, 203695, 203757, 204281, 204831, 205238, 205671, 206258, 206944, 207701, 208618, 209706, 210791, 211680, 212327, 212784, 213127, 213494, 214062, 214883, 215807, 216636, 217269, 217685, 217862, 217834, 217731, 217681, 217669, 217537, 217099, 216224, 214921, 213360, 211747, 210084, 208189, 206038, 203964, 202303, 200915, 199339, 197406, 195473, 193908, 192611, 191244, 189782, 188536, 187673, 186988, 186218, 185380, 184669, 184145, 183666, 183079, 182341, 181483, 180591, 179862, 179579, 179891, 180578, 181146, 181233, 180938, 180658, 180639, 180824, 181135, 181694, 182576, 183501, 184026, 184063, 183966, 184055, 184257, 184302, 184103, 183794, 183509, 183301, 183198, 183209, 183280, 183383, 183632, 184193, 185080, 186043, 186693]
51704A86693P3l88l30K76R73J258J115R11Q40P25M24J05k1O0K57N10P14P16N60
51685A95471M84N36M86K48R0K04L47K07q2j85p2K7M4Mk94j026j831k051j537q44
51665A90226n19n78p77j000j150j082q79q73j151j325j061n79l15k81j49J32K07
51648A78846j96q63j299j203p07k48j64l67m75l43k50m67p90p71k80L69Q33J004
51630A72629R02N73J37k30m37m89l47J0M09N73M69L66M51N71M57J05j67n5M90
51611A76417J188J600J417P75J60q8j01k35n37p22n98l15j06k3Lm3j92l37l28
51592A77935j95j11j64k55k65j77k6J43K54K56J91J23Jk02k85l3L69M63J61l3
51572A78150K39O85Q68R44J302J769J756J229Q30Q98J024Q34O33P77R37N84o6
$$ y = [186693, 186766, 186378, 186048, 186324, 187297, 188555, 189670, 190581, 191421, 192146, 192570, 192675, 192654, 192714, 192971, 193481, 194195, 194911, 195471, 195955, 196491, 196977, 197225, 197315, 197519, 197866, 198073, 197991, 197806, 197734, 197761, 197805, 197809, 197515, 196489, 194658, 192607, 191070, 190226, 189707, 189129, 188352, 187352, 186202, 185120, 184241, 183368, 182217, 180892, 179831, 179252, 178937, 178656, 178507, 178639, 178846, 178650, 177787, 176488, 175285, 174578, 174330, 174166, 173799, 173324, 172981, 172731, 172264, 171474, 170703, 170423, 170792, 171625, 172629, 173531, 174104, 174241, 174011, 173574, 173085, 172738, 172748, 173157, 173730, 174199, 174565, 175016, 175587, 176044, 176149, 175982, 175927, 176417, 177605, 179205, 180622, 181397, 181557, 181469, 181368, 181133, 180596, 179874, 179276, 178961, 178855, 178832, 178835, 178792, 178600, 178263, 177935, 177740, 177629, 177465, 177210, 176945, 176768, 176742, 176885, 177139, 177395, 177586, 177709, 177710, 177508, 177223, 177190, 177559, 178022, 178183, 178150, 178389, 179074, 179942, 180886, 182188, 183957, 185713, 186942, 187772, 188670, 189694, 190528, 191161, 191938, 192875, 193459, 193393]
51555A93393k73J82P94J136J301J400J217O56Q3j34j54l95q73j207j178r84r22
51538A94042j091j433j818k052j966j684j534j627j650j309q50q08j250j600j408
51523A71962r51p87r24q46l26K47M89N32O79Q54P99O02O33R82J335J449J450J515
51505A79694J558J395J120J015J183J392J348J044P70P89J044J228J134Q53N98
51490A96165M59L92L69L98M44M25L17J90J60L48P62J236J545J711K008K537K974
51473B12440K989K781K902L557M390M994N290N338N119M698M345M240M228M074
51459B71385L866L840L955L904L528K957K323J590P86J47j23j63k80o01r89j355
51443B94770j800k431l163l843m447n029n498n674n543n342n281n307n227m942
$$ y = [193393, 193120, 193302, 194096, 195232, 196533, 197933, 199150, 199806, 199889, 199755, 199601, 199206, 198333, 197126, 195948, 194964, 194042, 192951, 191518, 189700, 187648, 185682, 183998, 182464, 180837, 179187, 177878, 177028, 176220, 174970, 173370, 171962, 171011, 170224, 169300, 168454, 168128, 168375, 168864, 169396, 170075, 170929, 171728, 172330, 172963, 173945, 175280, 176729, 178179, 179694, 181252, 182647, 183767, 184782, 185965, 187357, 188705, 189749, 190519, 191308, 192352, 193580, 194714, 195567, 196165, 196624, 197016, 197385, 197783, 198227, 198652, 198969, 199159, 199319, 199667, 200429, 201665, 203210, 204921, 206929, 209466, 212440, 215429, 218210, 221112, 224669, 229059, 234053, 239343, 244681, 249800, 254498, 258843, 263083, 267311, 271385, 275251, 279091, 283046, 286950, 290478, 293435, 295758, 297348, 298134, 298281, 298158, 297995, 297715, 297114, 296125, 294770, 292970, 290539, 287376, 283533, 279086, 274057, 268559, 262885, 257342, 252000, 246719, 241412, 236185, 231243]
51429B31243m530m161l999m097m243m084l471k672k070j776j651j603j621j583
51415A89682j281p01j38R1m5k76l05j04M5j52n96q43o59k77k7J01K59L02nn15
51395A84556q21q24p55o54l52L6R2k41m91m42m91r35j340j184p09n78q82j076
51377A72909q34m19j99k17l60n54o88o57n55n46n60l89r3J9j09j27K39Q62J426
51358A69148J799J947J832J516J253J264J495J705J666J278O58J57M9J92J76q0
51342A86055j85J27N52N86J58l75o86p07n34l90n62j102j610j608j109n96m45
51325A77569n85p62q59q61p40n08l36l74n65o94o17l63o5J26J46Q9J68N15J059
51306A72343J604J995K134J946J507J125J165J673K350K927L429L930M252M195
$$ y = [231243, 226713, 222552, 218553, 214456, 210213, 206129, 202658, 199986, 197916, 196140, 194489, 192886, 191265, 189682, 188401, 187700, 187562, 187653, 187608, 187332, 187027, 186923, 186968, 186816, 186220, 185377, 184718, 184441, 184414, 184515, 184774, 185076, 185071, 184556, 183735, 182911, 182156, 181502, 181150, 181186, 181278, 181037, 180546, 180104, 179613, 178678, 177338, 176154, 175445, 174867, 173985, 172909, 172075, 171656, 171457, 171240, 170880, 170326, 169638, 168981, 168426, 167880, 167320, 166931, 166838, 166857, 166748, 166621, 166860, 167722, 169148, 170947, 172894, 174726, 176242, 177495, 178759, 180254, 181959, 183625, 184903, 185561, 185718, 185767, 185959, 186135, 186055, 185870, 185997, 186549, 187135, 187293, 186918, 186232, 185525, 184991, 184601, 184039, 182937, 181327, 179719, 178610, 178014, 177569, 176984, 176222, 175363, 174502, 173762, 173254, 172918, 172544, 171979, 171285, 170668, 170305, 170240, 170366, 170512, 170601, 170769, 171284, 172343, 173947, 175942, 178076, 180022, 181529, 182654, 183819, 185492, 187842, 190769, 194198, 198128, 202380, 206575]
51292B06575L944L961M360M740M737M544M600N003N447N700N777N679N301M690
51278B75058M127L775L422K796K014J508J473J589J371P03r6o80j038j408j897
51263B92717k432k993l709m545n178n339n225n298n709o155o293o085n690n279
51249B22787n002m893m765m397l868l488l309l020k483k034k004k165k039j563
51235A77757j136j013j040r54p18m48k56k23l47m63l95k14j59k85l31q4L55P29
51217A70775Q96Q62O92M68K91J69J7j83k76j20K09M92N77M56J64k22n60p11o66
51198A73330n09k62J44O56J009R04L95o6l8M10P22M85o9k96R7P27J004P67L73
51179A79783K13L15L90J96k20n58n87l92l06n23q64r82p75m51j90P0M36P97Q77
$$ y = [206575, 210519, 214480, 218840, 223580, 228317, 232861, 237461, 242464, 247911, 253611, 259388, 265067, 270368, 275058, 279185, 282960, 286382, 289178, 291192, 292700, 294173, 295762, 297133, 297836, 297740, 297060, 296022, 294614, 292717, 290285, 287292, 283583, 279038, 273860, 268521, 263296, 257998, 252289, 246134, 239841, 233756, 228066, 222787, 217785, 212892, 208127, 203730, 199862, 196374, 193065, 190045, 187562, 185528, 183524, 181359, 179320, 177757, 176621, 175608, 174568, 173614, 172896, 172448, 172192, 171969, 171622, 171159, 170764, 170550, 170391, 170106, 169775, 169691, 170046, 170775, 171671, 172533, 173225, 173693, 173984, 174153, 174170, 173987, 173711, 173591, 173800, 174292, 174869, 175325, 175489, 175267, 174707, 173996, 173330, 172821, 172559, 172703, 173359, 174368, 175272, 175667, 175601, 175563, 175973, 176695, 177180, 177111, 176815, 176912, 177639, 178643, 179410, 179783, 179996, 180311, 180701, 180897, 180677, 180119, 179532, 179140, 178834, 178311, 177447, 176465, 175690, 175239, 175049, 175119, 175555, 176352, 177229]
51160A77229O14K62J06J26P7j27k77j57J23K38L7k73m09l58l06l31k62N4M84P21
51140A77571O03K52j20l83m75l43m6J95J99O9R1L59O44P08N95M90M35L28J63P6
51120A81411J37K31K28J65J97L90O35P38O04L53K36M00P16R29R24P65N11J22l57
51101A89335o71n59o7M58O87N84L39J21o6k72m24l53o6J72R9j77k89j02J15Q0
51081A88944j46l42n18q16j097r51k78M52O72L32j54m55n78o29n84l99j56M7K24
51062A83568L90M48K95K9j49k24l65o28q15p23m40j86k4J25K63K95K55L07M61
51043A82882N11L27R0M8J58J75L1p4K5K49M32N26N34L79L0l34m30j91J58M07N85
51022A86518P94R40Q42N87N11P55R68P16Q4l80l53p8O7Q3J75L08K72J16J63N01
$$ y = [177229, 177843, 178105, 178211, 178337, 178414, 178287, 178010, 177853, 177976, 178214, 178251, 177978, 177569, 177211, 176905, 176574, 176312, 176366, 176850, 177571, 178174, 178426, 178306, 177923, 177448, 177105, 177059, 177254, 177453, 177522, 177613, 177972, 178616, 179324, 179919, 180409, 180844, 181172, 181335, 181411, 181548, 181779, 182007, 182172, 182369, 182759, 183394, 184132, 184736, 185089, 185325, 185725, 186441, 187370, 188294, 189059, 189570, 189692, 189335, 188664, 188105, 188038, 188496, 189183, 189767, 190106, 190227, 190161, 189889, 189465, 189112, 189046, 189218, 189317, 189140, 188851, 188749, 188864, 188944, 188798, 188456, 187938, 187122, 186025, 185074, 184796, 185248, 185920, 186252, 186098, 185643, 185065, 184436, 183852, 183453, 183297, 183344, 183568, 183958, 184406, 184701, 184730, 184581, 184357, 183992, 183364, 182549, 181826, 181386, 181200, 181176, 181301, 181564, 181859, 182114, 182421, 182882, 183393, 183720, 183810, 183858, 184016, 184191, 184222, 184148, 184173, 184422, 184854, 185380, 185914, 186293, 186323, 185989, 185559, 185368, 185526, 185933, 186518, 187312, 188252, 189094, 189681, 190192, 190947, 191915, 192631, 192715, 192335, 191982, 191904, 191971, 192054, 192229, 192537, 192809, 192925, 193088, 193589]
51002A93589Q04Q08O99P84J010J099R86Q42P08M63K13L04Q22J312J290Q59N67
50985B07159P10J003J007O59L27L65P30J051J078R99J159J531J668J319Q21P08
50969B22294J035J396J548J661J917K172K195K018J856J803J783J700J504J164
50955B46046P47M22K90K42J19o2j76k29l27m89o19o64o35n56m57m68o72q95q62
50936B40755n64k24J03O12J323J879K025K028K324K833L021K636K093J962K309
50921B65115K718K832K680K517K496K580K662K705K693K586K353K074J919J946
50907B99876J990J837J505J253J335J742K244K572K601K437K323K455K767L030
50893C29967L117L165L385L817M321M861N613O719P974Q953R495R966J0835J2088
$$ y = [193589, 194393, 195201, 195900, 196684, 197694, 198793, 199779, 200621, 201329, 201792, 202005, 202309, 203131, 204443, 205733, 206592, 207159, 207869, 208872, 209879, 210538, 210865, 211230, 211960, 213011, 214089, 215088, 216247, 217778, 219446, 220765, 221586, 222294, 223329, 224725, 226273, 227934, 229851, 232023, 234218, 236236, 238092, 239895, 241678, 243378, 244882, 246046, 246793, 247215, 247505, 247747, 247866, 247804, 247628, 247399, 247072, 246583, 245964, 245300, 244665, 244109, 243652, 243184, 242512, 241617, 240755, 240191, 239967, 240070, 240682, 242005, 243884, 245909, 247937, 250261, 253094, 256115, 258751, 260844, 262806, 265115, 267833, 270665, 273345, 275862, 278358, 280938, 283600, 286305, 288998, 291584, 293937, 296011, 297930, 299876, 301866, 303703, 305208, 306461, 307796, 309538, 311782, 314354, 316955, 319392, 321715, 324170, 326937, 329967, 333084, 336249, 339634, 343451, 347772, 352633, 358246, 364965, 372939, 381892, 391387, 401353, 412188, 424276]
50879D24276J3234J3940J4412J5035J5853J6631J7309J8070J8919J9512J9568
50868F06759J9294J9189J9500J9984K0202J9935J9314J8645J8106J7576J6777
50857H15281J5628J4407J3443J2715J1879J0703R311P972O717N349L761K101N85
50844I29852p46k011l287m571n919p432r040j0442j1382j1952j2457j3050j3651
50831H23912j4185j4666j5075j5378j5689j6181j6740j6964j6712j6388j6426
50820F49508j6676j6648j6221j5731j5392j5041j4509j3878j3235j2456j1481
50809D88240j0502r712r048q386p748p137o372n392m515m060l803l237k273j349
50795D04706q00m73q3L93Q49J276J670J884J836J745J963K604L442M177M670N010
$$ y = [424276, 437510, 451450, 465862, 480897, 496750, 513381, 530690, 548760, 567679, 587191, 606759, 626053, 645242, 664742, 684726, 704928, 724863, 744177, 762822, 780928, 798504, 815281, 830909, 845316, 858759, 871474, 883353, 894056, 903367, 911339, 918056, 923405, 927166, 929267, 929852, 929106, 927095, 923808, 919237, 913318, 905886, 896846, 886404, 875022, 863070, 850613, 837563, 823912, 809727, 795061, 779986, 764608, 748919, 732738, 715998, 699034, 682322, 665934, 649508, 632832, 616184, 599963, 584232, 568840, 553799, 539290, 525412, 512177, 499721, 488240, 477738, 468026, 458978, 450592, 442844, 435707, 429335, 423943, 419428, 415368, 411565, 408328, 406055, 404706, 403906, 403433, 403350, 403743, 404592, 405868, 407538, 409422, 411258, 413003, 414966, 417570, 421012, 425189, 429859, 434869]
50779D34869N395N970O716P565Q589R886J1298J2445J3213J4002J5314J7203J9284
50766E81749K1219K2982K4703K6474K8352L0351L2421L4471L6429L8223L9745
50755I17119M0942M1847M2487M2792M2736M2502M2319M2179M1831M1112M0096
50744A377962L8958L7792L6591L5251L3603L1546K9157K6554K3691K0415J6760
50733A708280J2998R388N999K808k45l294o524r945j3343j6501j9356k1875k3946
50720A624444k5508k6705k7785k8856k9876l0787l1608l2403l3216l3997l4638
50709A289065l5094l5445l5709l5668l5113l4246l3551l3145l2600l1546l0243
50698I16705k9215k8510k7621k6080k3915k1472j9112j7065j5411j4018j2672
$$ y = [434869, 440264, 446234, 452950, 460515, 469104, 478990, 490288, 502733, 515946, 529948, 545262, 562465, 581749, 602968, 625950, 650653, 677127, 705479, 735830, 768251, 802722, 839151, 877374, 917119, 958061, 999908, 1042395, 1085187, 1127923, 1170425, 1212744, 1254923, 1296754, 1337866, 1377962, 1416920, 1454712, 1491303, 1526554, 1560157, 1591703, 1620860, 1647414, 1671105, 1691520, 1708280, 1721278, 1730666, 1736665, 1739473, 1739228, 1735934, 1729410, 1719465, 1706122, 1689621, 1670265, 1648390, 1624444, 1598936, 1572231, 1544446, 1515590, 1485714, 1454927, 1423319, 1390916, 1357700, 1323703, 1289065, 1253971, 1218526, 1182817, 1147149, 1112036, 1077790, 1044239, 1011094, 978494, 946948, 916705, 887490, 858980, 831359, 805279, 781364, 759892, 740780, 723715, 708304, 694286, 681614]
50687F81614j1289r976q814p720o589n482m614m147m040m093m179m348m623m774
50673E96926m541m038l750l935m266m289l980l618l279k807k210j684j277q54
50659E52398m21p5L91J418L010M542N526O274P439R122J0811J2126J3223J4433
50645F40217J5846J7343J8799K0123K1242K2130K2802K3227K3311K3062K2690
50634H70792K2449K2346K2063K1256J9965J8711J7997J7755J7374J6350J4776
50623A081834J3115J1626J0219Q709P003N081L020J051o15k094l755n756p785
50610A121653r398j0540j1595j2904j4384j5617j6312j6580j6761j7020j7237
50599I63305j7257j7172j7197j7381j7562j7599j7477j7186j6646j5887j5169
$$ y = [681614, 670325, 660349, 651535, 643815, 637226, 631744, 627130, 622983, 618943, 614850, 610671, 606323, 601700, 596926, 592385, 588347, 584597, 580662, 576396, 572107, 568127, 564509, 561230, 558423, 556213, 554529, 553252, 552398, 551977, 551902, 552293, 553711, 556721, 561263, 566789, 573063, 580502, 589624, 600435, 612561, 625784, 640217, 656063, 673406, 692205, 712328, 733570, 755700, 778502, 801729, 825040, 848102, 870792, 893241, 915587, 937650, 958906, 978871, 997582, 1015579, 1033334, 1050708, 1067058, 1081834, 1094949, 1106575, 1116794, 1125503, 1132506, 1137587, 1140607, 1141658, 1141043, 1138949, 1135194, 1129438, 1121653, 1112255, 1101715, 1090120, 1077216, 1062832, 1047215, 1030903, 1014323, 997562, 980542, 963305, 946048, 928876, 911679, 894298, 876736, 859137, 841660, 824474, 807828, 791941, 776772]
50588G76772j4786j4735j4670j4199j3183j1772j0225q721p333o125n127m219
50576F51677l146j781l20R48J940K776L483L963M265M602N016N245N142N000N210
50561F94020N699O020N909N561N276N150N146N245N379N422N319N182N140N242
50547G69710N534O074O782P443P966Q477R007R289R101Q656Q343Q203P950P476
50533H80011P038O849O791O663O466O259N953N446M842M311L814L135K174J077
50519I50829M1q84j812k864m045n208o204p050p864q629r184r490r775j0263j0917
50504H56681j1533j2005j2318j2434j2407j2501j2957j3670j4276j4587j4732
50493G13261j4853j4927j4896j4781j4592j4316j4059j3967j3919j3517j2549
$$ y = [776772, 761986, 747251, 732581, 718382, 705199, 693427, 683202, 674481, 667148, 661023, 655896, 651677, 648531, 646750, 646430, 647378, 649318, 652094, 655577, 659540, 663805, 668407, 673423, 678668, 683810, 688810, 694020, 699719, 705739, 711648, 717209, 722485, 727635, 732781, 738026, 743405, 748827, 754146, 759328, 764468, 769710, 775244, 781318, 788100, 795543, 803509, 811986, 820993, 830282, 839383, 848039, 856382, 864585, 872535, 880011, 887049, 893898, 900689, 907352, 913818, 920077, 926030, 931476, 936318, 940629, 944443, 947578, 949752, 950829, 950870, 949986, 948174, 945310, 941265, 936057, 929853, 922803, 914939, 906310, 897126, 887636, 877861, 867598, 856681, 845148, 833143, 820825, 808391, 795984, 783483, 770526, 756856, 742580, 727993, 713261, 698408, 683481, 668585, 653804, 639212, 624896, 610837, 596870, 582951, 569434, 556885]
50482E56885j1253j0014q881p647o269m975l952l098k158r88L44J651K756L607
50468E06008M299N007N844O781P674Q347Q728Q896Q983R036R036R018R092R347
50454F16096R759J0241J0677J0938J0998J1036J1307J1819J2307J2581J2786J3225
50442G53770J4014J5000J5933J6623J6999J7160J7360J7809J8468J9097J9522
50431I41755J9800K0105K0442K0508J9916J8667J7265J6247J5662J5129J4383
50420A139879J3476J2464J1210R671Q073O582N014L102R60j006k526l627m475
50407A198797n260o157p195q173q867r315r700j0092j0464j0884j1422j1917j2105
$$ y = [556885, 545632, 535618, 526737, 519090, 512821, 507846, 503894, 500796, 498638, 497650, 497994, 499645, 502401, 506008, 510307, 515314, 521158, 527939, 535613, 543960, 552688, 561584, 570567, 579603, 588639, 597657, 606749, 616096, 625855, 636096, 646773, 657711, 668709, 679745, 691052, 702871, 715178, 727759, 740545, 753770, 767784, 782784, 798717, 815340, 832339, 849499, 866859, 884668, 903136, 922233, 941755, 961555, 981660, 1002102, 1022610, 1042526, 1061193, 1078458, 1094705, 1110367, 1125496, 1139879, 1153355, 1165819, 1177029, 1186700, 1194773, 1201355, 1206369, 1209471, 1210431, 1209425, 1206899, 1203272, 1198797, 1193537, 1187380, 1180185, 1172012, 1163145, 1153830, 1144130, 1134038, 1123574, 1112690, 1101268, 1089351, 1077246]
$$ [...]
##END NTUPLES=NMR SPECTRUM
##END=
