##TITLE=AC1535_ROEFFECT0009_8214612_rDq8SoKwYn
##JCAMPDX= 6.0         $$ Bruker NMR JCAMP-DX V2.0
##DATA TYPE= NMR SPECTRUM
##DATA CLASS= NTUPLES
##ORIGIN= BRUKER
##OWNER= Administrator
$$ 1.72 TOPSPIN		Version 2.1
$$ 2013-10-11 16:17:28.216 -0700  Administrator@X
$$ Compression mode = diff/dup
##.OBSERVE FREQUENCY= 400.02188249412
##.OBSERVE NUCLEUS= ^1H
##.ACQUISITION MODE= SIMULTANEOUS (DQD)
##.ACQUISITION SCHEME= undefined
##.AVERAGES= 8
##.DIGITISER RES= 22
##SPECTROMETER/DATA SYSTEM= spect
##.PULSE SEQUENCE= zg30
##.SOLVENT NAME= COFFEE_meoh
##.SHIFT REFERENCE= INTERNAL, COFFEE_meoh, 1, 14.98509
##AUDIT TRAIL= $$ (NUMBER, WHEN, WHO, WHERE, PROCESS, VERSION, WHAT)
$$ ##TITLE= Audit trail, TOPSPIN		Version 2.1
$$ ##JCAMPDX= 5.01
$$ ##ORIGIN= Bruker BioSpin GmbH
$$ ##OWNER= Administrator
$$ $$ E:\/data/COFFEE/nmr/AC1535_ROEFFECT0009_8214612_rDq8SoKwYn/10/pdata/1/auditp.txt
$$ ##AUDIT TRAIL=  $$ (NUMBER, WHEN, WHO, WHERE, PROCESS, VERSION, WHAT)
(   1,<2013-10-11 16:17:21.419 -0700>,<Administrator>,<X>,<go>,<TOPSPIN 2.1>,
      <created by zg
	started at 2013-10-11 16:16:15.481 -0700,
	POWCHK enabled, PULCHK disabled,
       configuration hash MD5:
       C8 4E 4E 5D D3 5C D8 9E 9F 52 82 E0 59 8A DE 15
       data hash MD5: 64K
       13 82 02 4B 90 FF 0E ED D9 80 99 9F A4 FD B0 16>)
(   2,<2013-10-11 16:17:24.356 -0700>,<Administrator>,<X>,<proc1d>,<TOPSPIN 2.1>,
      <Start of raw data processing
       efp LB = 0 FT_mod = 6 PKNL = 1 PHC0 = 0 PHC1 = 0 SI = 32K 
       data hash MD5: 32K
       42 9F 70 61 21 01 2A 99 D7 A1 77 1F 10 34 8D 76>)
(   3,<2013-10-11 16:17:24.669 -0700>,<Administrator>,<X>,<proc1d>,<TOPSPIN 2.1>,
      <pk PHC0 = 96.55334 PHC1 = 0 
       data hash MD5: 32K
       4C E2 41 23 C9 8A 32 09 2C 8C 72 03 F2 86 C2 2F>)
(   4,<2013-10-11 16:17:24.747 -0700>,<Administrator>,<X>,<proc1d>,<TOPSPIN 2.1>,
      <abs ABSG = 1 
       data hash MD5: 32K
       53 17 75 9A 31 9C 57 17 07 06 B8 CE 47 76 91 CF>)
(   5,<2013-10-11 16:17:24.809 -0700>,<Administrator>,<X>,<proc1d>,<TOPSPIN 2.1>,
      <abs ABSG = 2 
       data hash MD5: 32K
       A5 5F 50 D6 48 26 C8 90 EC 05 F5 74 E2 A4 28 0E>)
(   6,<2013-10-11 16:17:24.856 -0700>,<Administrator>,<X>,<proc1d>,<TOPSPIN 2.1>,
      <abs ABSG = 3 
       data hash MD5: 32K
       80 CF 45 61 76 36 99 3D 5D 67 57 23 E9 0F 46 F0>)
(   7,<2013-10-11 16:17:24.934 -0700>,<Administrator>,<X>,<proc1d>,<TOPSPIN 2.1>,
      <abs ABSG = 4 
       data hash MD5: 32K
       ED C9 29 4A 07 A2 81 3C 91 5F 13 AB C4 96 1F CA>)
(   8,<2013-10-11 16:17:24.981 -0700>,<Administrator>,<X>,<proc1d>,<TOPSPIN 2.1>,
      <abs ABSG = 5 
       data hash MD5: 32K
       F1 24 18 14 DA F8 F4 27 F5 C0 1E 75 D4 35 69 0F>)
$$ ##END=
$$ 
$$ $$ hash MD5
$$ $$ FC 73 10 81 75 BE A1 39 5D BB 92 50 57 99 82 DF
##$RELAX= 
##$RELAX= 
##$RELAX= 
##$RELAX= 
##$RELAX= 
##$RELAX= 
##$RELAX= 
$$ Bruker specific parameters
$$ --------------------------
##$DU= <E:\>
##$EXPNO= 10
$$ [...]
##$TP= (0..7)
150 150 150 150 150 150 150 150
##$TP07= 0
##$TPNAME0= <>
##$TPNAME1= <>
##$TPNAME2= <>
##$TPNAME3= <>
##$TPNAME4= <>
##$TPNAME5= <>
##$TPNAME6= <>
##$TPNAME7= <>
##$TPOAL= (0..7)
0.5 0.5 0.5 0.5 0.5 0.5 0.5 0.5
##$TPOFFS= (0..7)
0 0 0 0 0 0 0 0
##$TUNHIN= 0
##$TUNHOUT= 0
##$TUNXOUT= 0
##$USERA1= <user>
##$USERA2= <user>
##$USERA3= <user>
##$USERA4= <user>
##$USERA5= <user>
##$V9= 5
##$VALIST= <valist>
##$VCLIST= <CCCCCCCCCCCCCCC>
##$VD= 0
##$VDLIST= <DDDDDDDDDDDDDDD>
##$VPLIST= <PPPPPPPPPPPPPPP>
##$VTLIST= <TTTTTTTTTTTTTTT>
##$WBST= 1024
##$WBSW= 4
##$XGAIN= (0..3)
0 0 0 0
##$XL= 0
##$YL= 0
##$YMAX_a= 640243
##$YMIN_a= -544328
##$ZGOPTNS= <>
##$ZL1= 120
##$ZL2= 120
##$ZL3= 120
##$ZL4= 120
##$ABSF1= 14.98509
##$ABSF2= -5.573092
##$ABSG= 5
##$ABSL= 3
##$ALPHA= 0
##$AQORDER= 0
##$ASSFAC= 0
##$ASSFACI= 0
##$ASSFACX= 0
##$ASSWID= 0
##$AUNMP= <proc_prof1d_extract_pilot.lims>
##$AXLEFT= 0
##$AXNAME= <>
##$AXNUC= <1H>
##$AXRIGHT= 0
##$AXTYPE= 0
##$AXUNIT= <>
##$AZFE= 0.1
##$AZFW= 0.1
##$BCFW= 0
##$BC_mod= 0
##$BYTORDP= 0
##$COROFFS= 0
##$CY= 15
##$DATMOD= 1
##$DC= 0
##$DFILT= <>
##$DTYPP= 0
##$F1P= 0
##$F2P= 0
##$FCOR= 0.5
##$FTSIZE= 32768
##$FT_mod= 6
##$GAMMA= 0
##$GB= 0
##$INTBC= 1
##$INTSCL= 1
##$ISEN= 128
##$LB= 0
##$LEV0= 0
##$LPBIN= 0
##$MAXI= 10000
##$MC2= 0
##$MEAN= 0
##$ME_mod= 0
##$MI= 0
##$NCOEF= 0
##$NC_proc= -8
##$NLEV= 6
##$NOISF1= 0
##$NOISF2= 0
##$NSP= 0
##$NTH_PI= 0
##$NZP= 0
##$OFFSET= 14.98509
##$PC= 1
##$PHC0= 96.55334
##$PHC1= 0
##$PH_mod= 1
##$PKNL= yes
##$PPARMOD= 0
##$PPDIAG= 0
##$PPIPTYP= 0
##$PPMPNUM= 2147483647
##$PPRESOL= 1
##$PSCAL= 4
##$PSIGN= 0
##$PYNMP= <proc.py>
##$REVERSE= no
##$SF= 400.02
##$SI= 32768
##$SIGF1= 0
##$SIGF2= 0
##$SINO= 400
##$SIOLD= 32768
##$SPECTYP= <>
##$SREGLST= <1H.CDCl3>
##$SSB= 0
##$STSI= 32768
##$STSR= 0
##$SW_p= 8223.68421052631
##$SYMM= 0
##$S_DEV= 0
##$TDeff= 65536
##$TDoff= 0
##$TI= <>
##$TILT= no
##$TM1= 0
##$TM2= 0
##$TOPLEV= 0
##$USERP1= <user>
##$USERP2= <user>
##$USERP3= <user>
##$USERP4= <user>
##$USERP5= <user>
##$WDW= 1
##$XDIM= 32768
##$YMAX_p= 449842305
##$YMIN_p= -660638
##$CURPLOT= <Network HP LaserJet P1505>
##$CURPRIN= <$Network HP LaserJet P1505>
##$DFORMAT= <normdp>
##$LAYOUT= <+/1D_H.xwp>
##$LFORMAT= <normlp>
##$PFORMAT= <normpl>
##$SURQMSG= 1
$$ End of Bruker specific parameters
$$ ---------------------------------
##NTUPLES= NMR SPECTRUM
##VAR_NAME=  FREQUENCY,     SPECTRUM/REAL,   SPECTRUM/IMAG
##SYMBOL=    X,             R,               I
##VAR_TYPE=  INDEPENDENT,   DEPENDENT,       DEPENDENT
##VAR_FORM=  AFFN,          ASDF,            ASDF
##VAR_DIM=   32768,         32768,           32768
##UNITS=     HZ,            ARBITRARY UNITS, ARBITRARY UNITS
##FACTOR=    0.250966925370066, 1,           1
##FIRST=     8223.43324360094, 71075,        53660
##LAST=      0,             -202367,         -343825
##MIN=       0,             -660638,         0
##MAX=       8223.43324360094, 449842305,    0
$$ Real data points
##PAGE= N=1
##DATA TABLE= (X++(R..R)), XYDATA
$$ [...]
19545c9254o5034A37087b5354o9935M5693A19255a19930A90229G2607d44709H8764
19533b29719f3024B1788b20285R0400c9105o2391A0377c67806a26475J1801l55231
19522d69905a99590D8011N6245c82028B11320e8226j21955a597A46558b25296
19511E6825g8275B5123P4459b3279A2376b92596e2569l4209B1045J32436J10102
19500B63583d8151a1865A25730a47433e5328G4764N9722c2730j96426g6223l2508
19489a08731m3755e6430C394L87664F8863b81623d1219B73727I0527b04919h9749
19477c9897k24076a17932B84840O1433A32085f06415D6021J00525P898G3097a40381
19465e7240k03524a9483j56239f4191k76206a03884c3669A8847J78856a09963
$$ plain form
19545 -39254 -104288 137087 -25354 -95289 -49596 119255 -119930 190229 72607 -444709 88764
19533 -229719 -63024 21788 -220285 -129885 -39105 -101496 10377 -367806 -126475 -114674 -469905
19522 -469905 -199590 48011 104256 -382028 211320 -58226 -180181 -1597 146558 -225296
19511 56825 -78275 25123 99582 -23279 12376 -292596 -52569 -86778 21045 153481 263583
19500 263583 -48151 -11865 125730 -147433 -55328 74764 134486 -32730 -229156 -76223 -108731
19489 -108731 -152486 -56430 3394 391058 68863 -281623 -41219 273727 90527 -204919 -89749
19477 -39897 -263973 -117932 284840 346273 132085 -606415 46021 146546 154444 73097 -140381
19465 -57240 -260764 -19483 -175722 -64191 -340397 -103884 -33669 18847 197703 -109963
19454A70432b86520j8154g5762b7070k97457c8926m1155E2385a5536H1313Q2274
19443A63587b40875B6066f2431A75836b9967l76599J32932l3552R7678A54753
19432B71404A30556a22700k20183H4651N0247E1778c05524a01911b8818j28171
19422a56989A29632b09128A6189J02761f8028I0952e1589n5069d9851p394k1191
19411g8436f120m30243J39358j73560A11572K8305O621J00958c9037j29609j16642
19400b85288E6773b23266K7332e9748A59815c43637A34292b87382g5045A02213
19389c22056A68573J07574a72127P9842j78605g7633l96424f6283j86913b5643
19378B02580i3310j31400E5078N973b16862B5349L3070O4263a2039m1957l45406
$$ plain form
19454 170432 -286520 -304674 -75762 -27070 -324527 -38926 -80081 52385 -15536 81313 163587
19443 163587 -240875 26066 -62431 175836 -29967 -406566 -273634 -307186 -209508 154753
19432 271404 130556 -122700 -342883 84651 134898 51778 -305524 -101911 -28818 -156989
19422 -156989 129632 -209128 16189 118950 -68028 90952 -51589 -106658 -49851 -57245 -78436
19411 -78436 -6120 -436363 -297005 -470565 111572 139877 146498 247456 -39037 -168646 -285288
19400 -285288 56773 -223266 -195934 -59748 159815 -343637 134292 -287382 -75045 102213
19389 -322056 168573 276147 -172127 -92285 -270890 -77633 -474057 -66283 -253196 -25643
19378 202580 -93310 -224710 55078 61051 -216862 25349 58419 122682 -12039 -53996 -399402
19367c99402J84943a01954A18711a80974a5710A08799a75262N9217d3280j09040
19357a52320k4764c5114l8748F4428b68585C49825a97088C139c26696a9508D03220
19345h1411j85486A65415P7507b85594d8457C91845a89475C05711a53343n6522
19335b09865j20121A226a41990j63141P2286l411A2383h6085j37736G592c24382
19323b36569k098B06744c0761C2658A907J00718c69590M2333G7720l6320Q2658
19312A24058a45012A55752b67793R5956I929f4166j57067B03245b63674H6423
19301A12375a10110H7679M9952B1923b15442b4895j84713P8225k58496G0117q128
19290F1989b09579B1585L457a62642h0858k50550L2740C3167c61935j08149G693
$$ plain form
19367 -399402 -214459 -101954 118711 -180974 -15710 108799 -175262 -116045 -43280 -152320
19357 -152320 -177084 -35114 -73862 64428 -268585 349825 -197088 3139 -326696 -19508 403220
19345 -81411 -266897 165415 242922 -285594 -48457 391845 -189475 305711 -153343 -209865
19335 -209865 -329986 1226 -141990 -305131 -232845 -236256 12383 -86085 -223821 7592 -324382
19323 -236569 -238667 206744 -30761 32658 1907 102625 -369590 -327257 77720 41400 124058
19312 124058 -145012 155752 -267793 -171837 9929 -64166 -221233 203245 -263674 86423
19301 112375 -110110 87679 137631 21923 -215442 -24895 -209608 -131383 -389879 70117 61989
19290 61989 -209579 21585 25042 -162642 -80858 -331408 -298668 33167 -361935 -470084 7693
19278a08988h121A24138g4269G1876K7220a9025k5038n5853C9299a59744A6244
19266a75391m9137j08762F6821O048a80572B321f3147K5197A06902e1693G1849
19254A69036K7359Q0795c10743A91358b29014o1929h3405n6069e1242q8965A63022
19242B77538I8567c44917P1250a19632D2489b21132B17722F3420h0364j55553
19232b35917j25112h8604n5868L3341M3151k6307J7901B03130b22864A97579d9192
19220B6151a74152Q017g9289C6531a13916M9704k72739a61795r8884A6037a96092
19208e7492A14555C098c9565J5831A02782O5100K1049E0378b25141d9981n35l1290
19196h1806g648j7573j9061H8627K782B9539o654b06959i0559k08213j13864e2145
$$ plain form
19278 -108988 -8121 124138 -74269 71876 99096 -19025 -44063 -99916 39299 -159744 16244
19266 -175391 -224528 -333290 66821 72869 -180572 2321 -63147 -37950 106902 -51693 71849
19254 169036 196395 277190 -310743 191358 -229014 -290943 -83405 -139474 -51242 -140207 163022
19242 277538 98567 -344917 -273667 -119632 42489 -221132 217722 63420 -80364 -235917
19232 -235917 -361029 -88604 -144472 -111131 -67980 -94287 -76386 203130 -222864 197579 -49192
19220 26151 -174152 -166135 -79289 36531 -113916 -64212 -336951 -161795 -260679 16037 -196092
19208 -57492 114555 3098 -39565 -23734 102782 167882 188931 50378 -225141 -49981 -50516 -81806
19196 -81806 -7648 -25221 -44282 88627 91409 29539 22885 -206959 -90559 -298772 -412636 -52145
19183c65270A42057i0545o1704B18520a2283m2419m4797B99594J62681B08113
19172A45601a04314J3640K1411I6605l0014B9105a5741j78216A09323B9137a794
19160a07382e2938k81675a50703a1019H5238a77104C0879c75758C554i2344j91245
19149b83589d1384k59148b7712n0271b4914A59218k7750c1602j38952A08072b72990
19137a16524k6981A39194h2106B27060a59573r1298E9924b29651a03213B6998
19126a29325n103b9819p3978j10089b4139j28844O0445G8965d26137D3218a58732
19114b94308h8528A4909a1331B79799a32594r8214R9215d6311q3985j93732C6915
19102a50206c5699q751B38240c3977F6912b25749d6118j49091a4456H5447N092
$$ plain form
19183 -365270 142057 -90545 -152249 218520 -12283 -54702 -99499 299594 462275 208113
19172 145601 -104314 -90674 -69263 96605 66591 29105 -15741 -193957 109323 29137 -1794
19160 -107382 -52938 -334613 -150703 -11019 85238 -177104 30879 -375758 3554 -92344 -283589
19149 -283589 -41384 -300532 -27712 -77983 -24914 159218 131468 -31602 -170554 108072 -272990
19137 -116524 -143505 139194 -82106 227060 -159573 -250871 59924 -229651 -103213 26998
19126 -129325 -134428 -29819 -103797 -213886 -24139 -152983 -92538 78965 -426137 43218 -158732
19114 -294308 -88528 14909 -11331 279799 -132594 -230808 -131593 -46311 -130296 -324028 36915
19102 -150206 -35699 -44450 238240 -33977 66912 -225749 -46118 -195209 -14456 85447 90539
19091I0539i4268G3074h2409H4190A0224J06347e8523r5230G3159l0055I790N4644
19079F4434a88408j5853F5765L2827b28057B15470I1003d35162J92267C15182
19068A08955A4763A100c9393b133o7737k11784b0488r5919l2457c4195B0941a586
19055a6450k39723Q8248l5550n8804J00400A56338b76340a294m4619p7917H1275
19043E8219L8256J89698g7967a4703B5518d7033n5422a7371j42359k3165A03631
19031b50505D1654e3777A07185b22996i0361D27363F5177b18100B4705L03468
19021C28173q9666I4386O6562b5692l9908D08047e9371G8677J00798J24416c3740
19009e4070B27104C2207a12904M3390A94221A8041a0587j43276A78866n8879d21410
$$ plain form
19091 90539 -94268 73074 -82409 84190 10224 116571 -58523 -153753 73159 43104 9790 64434
19079 64434 -188408 -204261 65765 98592 -228057 215470 91003 -435162 -242895 315182
19068 108955 14763 1100 -39393 -2133 -69870 -281654 -20488 -116407 -148864 -34195 20941 -1586
19055 -16450 -256173 -167925 -203475 -262279 -161879 156338 -276340 -1294 -45913 -123830 81275
19043 58219 96475 286173 -77967 -14703 25518 -47033 -102455 -17371 -159730 -182895 103631
19031 -250505 41654 -53777 107185 -222996 -90361 427363 65177 -218100 24705 328173
19021 328173 238507 94386 160948 -25692 -65600 408047 -59371 78677 179475 303891 -33740
19009 -54070 227104 32207 -112904 -69514 194221 18041 -10587 -153863 178866 119987 -421410
18997C8196d7964r3657A22679j1560Q3040b29756j55878b8778j86955A14310a74858
18985c79924B05755h0461J292k6890b4268k31683N6742R0830j02408i8765r394
18974a08159D071O2921a89661P0484B82771c2270j30794e598A30664a14637L9498
18963g5139l58189a62446M3554A98695b26000n2710j85952A86670b06769i299
18952b10417D21762c07212B66557b3407k12460M4867g936j12676A63840n4266
18942A09574i7763K9476j97479M9402j8811a00115G1720J63358a11598M9568B911
18930a23407r7396C08L4180A6560a55576e0972G1362a72336I3066K88552B275
18918F6088a38094I6389b69545a00533A57453m8243a17627B77785c2315A40731
$$ plain form
18997 38196 -47964 -141621 122679 111119 194159 -229756 -385634 -28778 -215733 114310 -174858
18985 -379924 205755 -80461 -79169 -106059 -24268 -255951 -199209 -108379 -210787 -98765 -108159
18974 -108159 4071 66992 -189661 -119177 282771 -32270 -163064 -5598 130664 -114637 -75139
18963 -75139 -433328 -162446 -118892 198695 -226000 -278710 -464662 186670 -206769 -9299
18952 -210417 421762 -307212 266557 -23407 -235867 -191000 -7936 -120612 163840 109574
18942 109574 -97763 -68287 -265766 -216364 -235175 -100115 71720 235078 -111598 -62030 2911
18930 -123407 -220803 308 34488 16560 -155576 -50972 71362 -172336 93066 381618 2275
18918 66088 -138094 96389 -269545 -100533 157453 109210 -117627 277785 -32315 140731
18907A32454M18798b13232A204O8625a56226A62523a03573A49840a82650r5496
18897b78146M5957E6368f4734j17168B4551d0658l12140c5778A6613a8424j23147
18886a41571M5053m37652f307l56979Q0998A5380b11248K8762k50691a06199j18706
18875b24905A53325L1171a9436A67218e7087j64265D0360b38845Q8213F0683J24047
18864A84730i4766A22749E9128d15926e6296k68444f981C64114a23110A06174
18853a82863B04612F3145B6325b576B37176b5639j06896K7111M5387B97456a47831
18841e4846n6516L766p9946h5489B47792H3104c07596I9884G414J61240a82953
18829b08467E0095C904e4844B9634a2419k37132A33695g8335B994K44528P5701
$$ plain form
18907 132454 551252 -213232 1204 69829 -156226 162523 -103573 149840 -182650 -278146
18897 -278146 -232189 56368 -64734 -181902 24551 -40658 -352798 -35778 16613 -18424 -141571
18886 -141571 -96518 -534170 -6307 -363286 -282288 15380 -211248 -182486 -433177 -106199 -224905
18875 -224905 153325 184496 -19436 167218 -57087 -221352 40360 -238845 -150632 60683 184730
18864 184730 -94766 122749 59128 -415926 -56296 -324740 -6981 364114 -123110 106174
18853 -182863 204612 63145 26325 -2576 237176 -25639 -132535 -105424 -60037 297456 -147831
18841 -54846 -111362 -107596 -187542 -85489 247792 83104 -307596 99884 7414 168654 -182953
18829 -208467 50095 3904 -54844 29634 -12419 -249551 133695 -78335 2994 247522 323223
18818C23223c20426B4192J58000i9502K3393M216C6789j4548K13048b1219m1683
18807f2902C83992h3550A04664a430D3953A9609f7331A20092f479D9390c04954
18795e1792j82474R9401A66972c2333j50049k08435B54443a48730B48154a8751
18784f2835i985D056b70159E0974c13389J32962d7369j2816j31366j08477P0375
18773b29653D7175c4993j03533l0318N0987B58643d2839A65384i4545a4918A47459
18761a76364A5002c49122a12164k31235a29170j3803I1868c06838i8736F0601
18750f541A37958D5023a59434H7716J08349E0292b93155l8419L3813C02848a53391
18738b10566b2627B25868a54940q4918K5057A33236J19205o9574d1353A1706Q7358
$$ plain form
18818 323223 -320426 24192 182192 -99502 -76109 -71893 36789 22241 235289 -21219 -62902
18807 -62902 383992 -83550 104664 -1430 43953 19609 -67331 120092 -6479 49390 -304954
18795 -51792 -234266 -134865 166972 -32333 -182382 -390817 254443 -148730 248154 -18751
18784 -62835 -9985 4056 -270159 50974 -313389 -180427 -47369 -60185 -191551 -300028 -229653
18773 -229653 47175 -34993 -138526 -168844 -117857 258643 -42839 165384 -94545 -14918 147459
18761 -176364 15002 -349122 -112164 -343399 -129170 -142973 91868 -306838 -98736 60601
18750 -6541 137958 45023 -159434 87716 196065 50292 -293155 -331574 -297761 302848 -153391
18738 -210566 -22627 225868 -154940 -239858 -214801 133236 252441 182867 -41353 11706 99064
18727I9064a62294a0227k00835d3770j40137K7215I0373C8032a03724B45596a89182
18715A61587c7705J0135j79678J2998C40876a47842o597g6719m1601b1408l11602
18704c33010g8525B38602G1458c21574A61829e3638H6336a48738E5952K02888
18694B58840b24340b7044j30711l6583A42214n9498a46758C349i3250A38586a16774
18682A26611B012a57020r0475j27408B08544b84990A9729a16083L1960J0550F147
18670C57839c05993A65236h9362j01826k0066A25447c31013F4250p755I501h1314
18658a13647L0533p9336D7671c4111D8743c7303C026L46687a09489E6237j1925
18647D4312c0513H7428a0992A21825b36637i0360H803d1412j23123A2035c78209
$$ plain form
18727 99064 -162294 -10227 -211062 -43770 -183907 -156692 90373 38032 -103724 245596 -189182
18715 161587 -37705 -27570 -207248 -194250 340876 -147842 -154439 -76719 -118320 -21408 -333010
18704 -333010 -78525 238602 71458 -321574 161829 -53638 86336 -148738 55952 258840
18694 258840 -224340 -27044 -157755 -194338 142214 82716 -146758 3349 -93250 138586 -116774
18682 126611 2012 -157020 -247495 -374903 208544 -284990 19729 -116083 -84123 -73573 6147
18670 357839 -305993 165236 -89362 -191188 -211254 125447 -331013 64250 56495 9501 -81314
18658 -113647 -83114 -162450 47671 -34111 48743 -37303 3026 349713 -109489 56237 44312
18647 44312 -30513 87428 -10992 121825 -236637 -90360 8803 -41412 -164535 12035 -378209
18635C44965b5361G1445a43151l3444M1758L2113b2411A22057C9550b93410D2470
18623c8179G11a86207F7791J05164a00678q447B01411a56236J5502M4473A18454
18611A93703a99306j3760F2231K743f6565n335A45031l5310b28518A47445a08020
18599F2162J59441g6111m68644f4302C55080b28684J9047e9525B04096c55284
18588a3650j34875j73045a25933F0175a10688B01207D100b08026P5493d3529B19343
18576b04749B49217a69058d6852K953j83651J13757B1090N3166j6251R6108o2873
18565I1240g2765F7352P451e13441a19661A39962a63340D8062i054l6555j53396
18554a99005b9850l0057J4247j33401E440J17252k8424d02277a15247F0771b15568
$$ plain form
18635 344965 -25361 71445 -143151 -176595 -134837 -102724 -22411 122057 39550 -293410 42470
18623 -38179 711 -186207 67791 172955 -100678 -109125 201411 -156236 -140734 -96261 118454
18611 193703 -199306 -213066 62231 64974 -66565 -71900 145031 109721 -228518 147445 -108020
18599 62162 221603 -76111 -544755 -64302 355080 -228684 -209637 -59525 204096 -355284
18588 -13650 -148525 -321570 -125933 60175 -110688 201207 4100 -208026 -132533 -43529 219343
18576 -204749 249217 -169058 -46852 -43899 -227550 -113793 21090 74256 58005 154113 91240
18565 91240 -72765 67352 74803 -513441 -119661 139962 -163340 48062 -9054 -45609 -199005
18554 -199005 -29850 -59907 -45660 -179061 5440 122692 94268 -402277 -115247 60771 -215568
18542b32545a4940A12169c31723O7286j19637a64508d7926k2179D1177h101B3745
18530b99379Q9686A15148c57497A4385i6272A94929A5265a09771n1190a5540A90687
18518f6026r0564j39310E9858L22594e9766A47962a17831e4951k39279E171d6784
18506c77914J69559E4431c66820g5430n3531N8788q3530A02470c7945j55992B78183
18494a58210b2466j22772N4606j28250J00570e0641q6215A37662E99J18965h0798
18482A26082J26796a61700L3361M752A8247J38085H439b71314A57499N3302b48159
18470a29303d9850A14100M5618f5859A19878K43990c1163F0293a02319B4434M44806
18459D69240B8670b54126d0072o3606A88264h0264p8959C59699d03843a40378
$$ plain form
18542 -232545 -14940 112169 -331723 -264437 -384074 -164508 -47926 -70105 41177 -8101 23745
18530 -299379 -209693 115148 -357497 14385 -96272 194929 15265 -109771 -160961 -15540 190687
18518 -66026 -156590 -295900 59858 382452 -59766 147962 -117831 -54951 -294230 5171 -46784
18506 -377914 -208355 54431 -366820 -75430 -128961 -70173 -153703 102470 -37945 -193937 278183
18494 -158210 -22466 -145238 -90632 -218882 -118312 -50641 -136856 137662 599 119564 -80798
18482 126082 252878 -161700 -128339 -123587 18247 156332 8439 -271314 157499 210801 -248159
18470 -129303 -49850 114100 159718 -65859 119878 363868 -31163 60293 -102319 24434 469240
18459 469240 28670 -254126 -40072 -103678 188264 -80264 -159223 359699 -403843 -140378
18448f8826F3701a88979a1214q8595j31705G958K41228b9819n273k95439E9660
18436B65830a65671G8291r121a14951o1655g3870d073l15243B348O5438K20282
18425B88068I9240f7739A8204P0178h1776G4444A9812K3296c87534A06538b78822
18413B30616A05755a6949F3202L0294a4332B34494b24423e1938G7453J31050a54295
18401B09661b04125A0294L0403G314b05567f5030o1016l6239g239p0536k31272
18390c09047a48693n8867j8353R3878J3336B49003G7718P6690g1998p5452A0318
18378A29928M1373a03557A28234d4827e157A90646d637l65776A02363c95804A66446
18366A40203n5284k0181M3633a99699j1039M4811D3306E476L90142a57874c2230
$$ plain form
18448 -68826 63701 -188979 -11214 -99809 -231514 7958 249186 -29819 -35092 -330531 59660
18436 265830 -165671 78291 69170 -114951 -176606 -73870 -4073 -319316 2348 67786 288068
18425 288068 99240 -67739 18204 88382 -81776 74444 19812 43108 -387534 106538 -278822
18413 230616 105755 -16949 63202 93496 -14332 234494 -224423 -51938 77453 208503 -154295
18401 209661 -204125 10294 40697 7314 -205567 -65030 -126046 -162285 -7239 -77775 -309047
18390 -309047 -148693 -207560 -225913 -132035 -118699 249003 77718 154408 -71998 -147450 10318
18378 129928 171301 -103557 128234 -44827 -5157 190646 -4637 -370413 102363 -395804 166446
18366 140203 84919 64738 108371 -199699 -210738 -165927 43306 5476 395618 -157874 -32230
18354H331N301b31888f1993B1867a5420j31872c5272j38025A05150g7500B02476
18342a78894Q6402n0604j86647H2551L2077d19618E824J24345a2650l1198j70931
18331b14779A3633e6495H9883b03306R7642j96621a5250l29177C7386a89161b0932
18319e9158l05867g2479j87598B22065d3526k2516A01465j4629e37683a49146
18308A29329b10602b9395m2736o130B3685a69498k01721A06079a39052d7316j29952
18297a77268C242b55041q6649E9554j1212g9965j52789E8841c253H2037e8785
18285C35395h9464H7710b22852O4303P0756J9949E7227b4528E971g7700j413B88940
18272A591i8543A15335a98951H189J57599a70569l3480R8619K5M4566A07819i3124
$$ plain form
18354 8331 13632 -231888 -61993 21867 -15420 -147292 -35272 -173297 105150 -77500 202476
18342 -178894 -92492 -143096 -329743 82551 114628 -419618 5824 130169 -12650 -43848 -214779
18331 -214779 13633 -56495 89883 -203306 -105664 -302285 -15250 -344427 37386 -189161 -20932
18319 -59158 -365025 -72479 -260077 222065 -43526 -66042 101465 86836 -537683 -149146
18308 129329 -210602 -29395 -72131 -78261 23685 -169498 -371219 106079 -139052 -47316 -177268
18297 -177268 3242 -255041 -341690 59554 48342 -79965 -232754 58841 -3253 82037 -58785
18285 335395 -89464 87710 -222852 -158549 -87793 -67844 57227 -24528 5971 -77700 -79113 288940
18272 1591 -98543 115335 -198951 8189 165788 -170569 -204049 -105430 -105405 -60839 107819 -93124
18259C05886a50946a0967A84K88291c18547p7425a9802q0641B2059K37855J94548
18248D54462d8772q844A41108l6984K09685c17008N0671J20121B74140J54851
18238D28991A6454a72212j01015d6270F9162b5984c078C0687J02313a0831B68546
18226C811P4500i5241j350K1798K0017k7873A22777f4745j21651M4834O1916j39323
18214b18969O8782A13023E1624N5943a98705K5101P1791a9913A6829K30761a41004
18202a57854j64301c2523D1174N784a67483j98743I9180f8677M036A10013j3092
18191I6921K25333p2336a40926N788j7295a7030k36138B16812a34523b3125l92453
18180d15578A58533b1220p899j8776k09610a2604j82601k6444Q2001H2914L49750
$$ plain form
18259 305886 -150946 -10967 184 288475 -318547 -395972 -19802 -100443 22059 259914 454462
18248 454462 -48772 -57616 141108 104124 313809 -317008 -266337 -146216 274140 428991
18238 428991 16454 -172212 -273227 -46270 69162 -25984 -3078 30687 133000 -10831 268546
18226 3811 78311 -95241 -96591 -74793 -54776 -82649 122777 -64745 -186396 -141562 -79646 -218969
18214 -218969 -150187 113023 51624 107567 -198705 -173604 -101813 -19913 16829 247590 -141004
18202 -157854 -322155 -32523 41174 46958 -167483 -366226 99180 -68677 -64641 110013 96921
18191 96921 322254 249918 -140926 -135138 -152433 -17030 -253168 216812 -134523 -23125 -415578
18180 -415578 158533 -21220 -29119 -47895 -257505 -12604 -195205 -221649 -139648 82914 432664
18169D32664A81488A434O3745j7075f683k47955I1478b37476c7219A742a48065
18157a72727e7807C80138H8290a85244b4148n9002B50661f7210j35925f5449m37019
18146e02468a19888m9481A30208E2338o660c58491h5299I3956d2904o9480j02746
18135b15130j5453j13378A76913P051o8600r481a42800A54292R0482b54275B23550
18123D8732B628b36482A58053b06472Q5648c0250j98644a12988F9386i7235B20391
18111b20447a1177A84880h5083H3472b17794C3399K4049h8536j03279b4086A86287
18099a35008L811a9461j87641h0146A77567G5478d02657I6160g0180I9866Q978
18088A08844c669k68234i3699A1502N6595c8624j53489N2702j42378F0390f4514
$$ plain form
18169 432664 181488 1434 65179 48104 -6683 -254638 91478 -237476 -37219 1742 -148065
18157 -172727 -57807 380138 88290 -185244 -24148 -83150 250661 -67210 -203135 -65449 -502468
18146 -502468 -119888 -169369 130208 52338 45678 -358491 -85299 93956 -42904 -112384 -215130
18135 -215130 -230583 -343961 176913 183964 115364 105883 -142800 154292 244774 -254275 223550
18123 48732 2628 -236482 158053 -206472 -120824 -30250 -228894 -112988 69386 -97235 220391
18111 -220447 -11177 184880 -85083 83472 -217794 33399 57448 -88536 -191815 -24086 186287
18099 -135008 -131197 -19461 -207102 -80146 177567 75478 -402657 96160 -70180 99866 108844
18088 108844 -3669 -271903 -93699 11502 68097 -38624 -192113 -139411 -281789 60390 -64514
18076a40423a4647B19290g323k81630c1904A31568j0834i41B4920J1723g2634
18064b51301J8981d6112A10056D9849a95834a5996F9443a56882n7478E726a93656
18052C106J21514d06602A21352P1624A4923a15366M4601K5285k77265B9335a00543
18040b10395B44536c05446R4319R2839l9105K0490j45804A81682a49925L9397
18030a10528r1501h2426J7784J4085A7498a85789g8656B03039a49919j36119h3906
18018i7094d3924B79716N7587a74296N6480A86373a44866p1298P9673K5715A92451
18006a47347p8541A56141L0435a34190j00111B0095Q461e625C9684J25753a47613
17994b6120j3352j24719n0900f301F2656c72390a49368j45585c6809B70487J49505
$$ plain form
18076 -140423 -14647 219290 -7323 -288953 -31904 131568 120734 -941 24920 36643 -72634
18064 -251301 -232320 -46112 110056 49849 -195834 -15996 69443 -156882 -214360 5726 -193656
18052 3106 124620 -406602 121352 192976 14923 -115366 -70765 -45480 -322745 29335 -100543
18040 -210395 244536 -305446 -211127 -118288 -157393 -136903 -282707 181682 -149925 -110528
18030 -110528 -202029 -82426 -64642 -50557 17498 -185789 -78656 203039 -149919 -286038 -83906
18018 -97094 -43924 279716 337303 -174296 -117816 186373 -144866 -216164 -136491 -110776 192451
18006 -147347 -225888 156141 186576 -134190 -234301 20095 28556 -5625 39684 165437 -147613
17994 -26120 -39472 -164191 -215091 -6301 62656 -372390 -149368 -294953 -36809 270487 419992
17983D19992a52888N3305A89860r4082g0584l6013B1324a63688K4517d3089k70837
17972c13926A20045m5744P8681D6111L56345j79941E1834a00171l0148E3111b69623
17960a93512i799l8055j26348l6058B6423a40132n2037K5305O0591k27841a51528
17948a23134d7230p6664i661o7450j75252A56786E5896J15611e13769a43366N2425
17937i0941l1017j2563o9501j89418B94844E1251J93573i9969A06250d577p0921
17926g5498R46C15496j41396a46542f7818F1056b69874e1285o0575r4563P5232
17915a31191A69102c34977i8414A57983M2178d81203D6897c19754F7419a56295
17904C73802E3013j0788a46733A66522a2160B14446C5163L39926b11907k6747
$$ plain form
17983 419992 -152888 -99583 189860 95778 -70584 -106597 21324 -163688 -139171 -43089 -313926
17972 -313926 120045 74301 152982 46111 402456 222515 51834 -100171 -130319 53111 -269623
17960 -193512 -9799 -47854 -174202 -210260 26423 -140132 -192169 -166864 -106273 -334114 -151528
17948 -123134 -47230 -123894 -9661 -77111 -252363 156786 55896 171507 -513769 -143366 -90941
17937 -90941 -121958 -134521 -204022 -393440 294844 51251 244824 -99969 106250 -4577 -75498
17926 -75498 -74552 315496 174100 -146542 -67818 61056 -269874 -51285 -111860 -206423 -131191
17915 -131191 169102 -334977 -98414 157983 200161 -481203 46897 -319754 67419 -156295
17904 373802 53013 42225 -146733 166522 -12160 214446 35163 375089 -211907 -238654
17894b38654N3504p065C9573K14857J8641a00762j21842E2858L28629A328J36556
17883A37884b8653j28774c4964b656k40648E8831a05388A19290J0078a66806A74
17871a82669G4496J87159a85473J4137k4829A4294P8684b70503A03670b68213
17860A0062d70780B79446A34759a17473k92131B78283a51316o5344a002j25121
17850a26123m0027C89578i8974A14481a53818H1083R4227m5375J89467D0822a11112
17838A68495b0219I6487c21455A92800c72893A09451b076A3267J71799H7755J85473
17827B73228A4554K55572n3816b09342c4072l092j30843A95167k0276e1267G3456
17815B8669K50054G5721K58036A21483k9201b86842H8455a50159H4575a32342
$$ plain form
17894 -238654 -185150 -192215 39573 254430 273071 -100762 -222604 52858 381487 1328 137884
17883 137884 -28653 -157427 -34964 -2656 -243304 58831 -105388 119290 129368 -166806 174
17871 -182669 74496 261655 -185473 -171336 -196165 14294 92978 -270503 103670 -268213
17860 10062 -470780 279446 134759 -117473 -409604 278283 -151316 -216660 -1002 -126123
17850 -126123 -166150 389578 -98974 114481 -153818 81083 175310 129935 319402 40822 -111112
17838 168495 -20219 96487 -321455 192800 -372893 109451 -2076 13267 185066 87755 273228
17827 273228 14554 270126 216310 -209342 -34072 -37164 -168007 195167 174891 -51267 73456
17815 28669 278723 75721 333757 121483 92282 -286842 88455 -150159 84575 -132342
17804G1639J81293j26232M7817F8960B642b10573C50303g9554A40328m3016a36754
17792a4907B6827N238g1829k69323A77254D1201K5402j2831j0976L98820b3442
17780A52831b2533l39505G3718a30813G3454a10972l1273A25221a87670A38431
17769c4725k94230a45309L4848L5304b3798k99981a6848k79590K3878E5064K9773
17758H4837c64587J14072g026C50356d37974A5619L59858G1001K07115j38722
17748A39394b09845I5278c87355B20738b9912A98096h4956H8166J76454e4529
17737c36783B41409J5276f7370I2268H26i4940m9008A62991D7805Q673L9630a3182
17724B60979J9884i1034A96832a4242C12912b81177J17674B34498I1259d7354
$$ plain form
17804 71639 252932 126700 174517 68960 2642 -210573 350303 -79554 140328 97312 -136754
17792 -14907 26827 32065 -71829 -341152 177254 41201 66603 53772 42796 441616 -23442
17780 152831 -22533 -362038 73718 -130813 73454 -110972 -142245 125221 -187670 138431
17769 -34725 -328955 -145309 -110461 -75157 -23798 -323779 -16848 -296438 -272560 55064 84837
17758 84837 -364587 -250515 -7026 350356 -437974 15619 375477 71001 278116 139394
17748 139394 -209845 95278 -387355 220738 -29912 198096 -84956 88166 264620 -54529
17737 -336783 241409 256685 -67370 92268 826 -94940 -143948 162991 47805 56478 96108 -13182
17724 260979 280863 -91034 196832 -14242 312912 -281177 -163503 234498 91259 -47354
17713a21954L0978j77740C3500a97511r47n7427a16497A99037D2796a22628A72971
17701B5230J03385L3867a3492j85142A21994J07781J29954E813J88427a10497
17690a06464C31805i2197A77788J10839r0901J67719a59898G7657f3319B77696
17679c817B44697a72138e4846l29218a31773D7616a16167A25962i3840C992b07958
17667I1236J07887a49204O3521B91915A11730a30387A76752N3279R86m617J63713
17656C90113A8156a80930A16798a90800D6737J77884M353B5812a91746j44600
17646c36346a18668m00791E0048h7130a5906A36095H484h9381A58814A380b43264
17634d5233A61281J30776E8040f1684D0560c6953A16520a91945g5098B98083b59532
$$ plain form
17713 -121954 -90976 -268716 33500 -197511 -198458 -255885 -116497 199037 42796 -122628 172971
17701 25230 128615 162482 -13492 -198634 121994 229775 359729 5813 194240 -110497
17690 -106464 331805 -92197 177788 288627 197726 365445 -159898 77657 -63319 277696
17679 -3817 244697 -172138 -54846 -384064 -131773 47616 -116167 125962 -93840 3992 -207958
17667 91236 199123 -149204 -85683 291915 111730 -130387 176752 230031 231017 226400 390113
17656 390113 18156 -180930 116798 -190800 46737 224621 228974 25812 -191746 -336346
17646 -336346 -118668 -519459 50048 -87130 -15906 136095 8484 -89381 158814 1380 -243264
17634 -45233 161281 292057 58040 -61684 40560 -36953 116520 -191945 -75098 298083 -259532
17622B1865b18285c0105A94539g2071l8371C42681j46815R016G8161c2360j89083
17611b21443A53377a36798C6440i7962C2782i6676C71188d316C9522a28463B3650
17599A44653m2950i642k26592L6795A04737B229O2693J98682B5498a08600j25807
17588b34407f9310H9690H465L7747A334g9992k30004E1151O1776H148Q3643A0296
17575C19398A07327b60806g6487B84463r2264B0834K7209h1338A94739j518l9449
17564A53772F4006j4706J00953n0308a42339A04412L4604D2927a74337C6067M1830
17553G7897J3742K10984A03140L531a06095C0896a40625A25172K07894i2264D10731
17541a18372B46050k1032A4888i6150p8700L3366E5997M54117B21287L9714A7711
$$ plain form
17622 21865 -218285 -30105 194539 -72071 -110442 342681 195866 204882 78161 -32360 -221443
17611 -221443 153377 -136798 36440 -97962 32782 -96676 371188 -4316 39522 -128463 23650
17599 144653 101703 -9642 -236234 -199439 104737 2229 64922 263604 25498 -108600 -234407
17588 -234407 -69310 89690 8465 46212 1334 -79992 -309996 51151 112927 8148 91791 10296
17575 319398 107327 -260806 -76487 284463 192199 20834 48043 -81338 194739 193221 153772
17564 153772 64006 49300 150253 99945 -142339 104412 139016 42927 -174337 36067 77897
17553 77897 91639 302623 103140 106671 -106095 30896 -140625 125172 333066 -92264 410731
17541 -118372 246050 225018 14888 -96150 -174850 -141484 55997 510114 221287 261001 17711
17529B41755d1793A50376K71028b17193a05642G408a35430A5241P0752N4326l2552
17518A07767l7683C2521K9408J98260m4545n7134l719m8292J63664M3208a21681
17506A15398c9283A31353J2095m7733B4112K48763J2564I3052J88409A22797C1962
17494B92957H5514N4743B5474r693K29668q5542O6997G1776j3323N15576F749
17482D0578c16320E0844c3027B98201B0045J09367K12946A65731E2545K42427
17472B94972b23748A16010R9043G5721O6334K21919b5210B91325f4888A05054
17461B53117K64207I9739L8954a30801A65704g7933j26305D3753J36355M50599
17451F30707k62368j9042H2277M62449A80471R3673n6072R9971M2088q9120j06742
$$ plain form
17529 241755 -41793 150376 421404 -217193 -105642 7408 -135430 15241 85993 140319 107767
17518 107767 70084 32521 61929 260189 215644 158510 154791 106499 270163 313371 -121681
17506 115398 -39283 131353 143448 95715 24112 272875 285439 93052 281461 122797 31962
17494 292957 85514 140257 25474 15781 245449 159907 226904 71776 58453 574029 6749
17482 40578 -316320 50844 -33027 298201 20045 129412 342358 165731 52545 294972
17472 294972 -223748 116010 215053 75721 142055 363974 -25210 291325 -64888 105054
17461 253117 517324 99739 138693 -130801 165704 -77933 -204238 43753 180108 630707
17451 630707 368339 349297 82277 544726 180471 274144 218072 318043 360131 271011 164269
17440A64269J7844E3802P1135J20115a73576B92462p4714J72107L05395B52843
17429B29971L9045J51909J09583B36595K2927K37922j99393Q042N1287J30798
17419D88178k10819J92750r8773J2499F8971L74305j53281D9937K60632D211L17780
17408C21991Q5848J4058g6911a8427H9207a27452H1564M1832N4035b46514a47
17396B24888r0679K00997a59636A44557Q4834C0764O5116O7081E0245L79442A87201
17384B20071H628L56392b43646c7513B8660a715o1934B13733R1887j41731A296
17372D62185F9473A6474Q409J83747i586A43406N7209o4029J1481g8736A40609
17360A31677a16594B27647Q0777F1986R8901R9206p1218j9868J25497g3088c1120
$$ plain form
17440 164269 182113 53802 124937 245052 -173576 292462 217748 389855 695250 252843
17429 229971 269016 420925 530508 236595 259522 497444 298051 306093 357380 488178
17419 488178 277359 470109 371336 383835 68971 443276 289995 49937 310569 4211 321991
17408 321991 407839 421897 -76911 -18427 89207 -127452 81564 123396 177431 -246514 -147
17396 224888 134209 335206 -159636 144557 229391 30764 95880 162961 50245 429687 187201
17384 220071 8628 365020 -243646 -37513 28660 -1715 -63649 213733 305620 163889 1296
17372 462185 69473 16474 24883 208630 -9586 143406 200615 136586 148067 -78736 140609
17360 131677 -116594 227647 308424 61986 160887 260093 188875 169007 294504 -73088 -31120
17348h5231I847c3393B90226A07489a80073A55200O9745E3235K17257b226A28674
17336f0180D10613j97753F4400K50498A26009J31181L5696K970A1624L7857i0557
17324B02256a1343H3754Q4034C889L07582A40909P7186O0998a63478C02626k1528
17313B81098A9445J32961o5244P6227Q1716G5268K63730N1554A65893K7863M0658
17302B34414J83319k3277q3412j50138a74198B78915K380J36020j76765j3627
17292B26923N7066k5505Q5770j07293J48212e9838C4512a4511A54466a41451f171
17280A62200E0831e8778C38937O9440k03974a61965B39663N9936A7039a31242
17269b5309g135A46399B6754c0129j22395F1849R0013K44413C4733K25056A13957
$$ plain form
17348 -85231 9847 -33393 290226 107489 -180073 155200 224945 53235 270492 -2226 128674
17336 -60180 410613 212860 64400 314898 126009 257190 292886 295856 11624 49481 -90557
17324 202256 -11343 83754 167788 3889 311471 140909 218095 279093 -163478 302626 281098
17313 281098 19445 152406 87162 163389 245105 75268 338998 390552 165893 193756 234414
17302 234414 417733 394456 311044 160906 -174198 278915 281295 417315 240550 226923
17292 226923 283989 258484 344254 236961 385173 -59838 34512 -14511 154466 -141451 -6171
17280 162200 50831 -58778 338937 408377 204403 -161965 239663 299599 17039 -131242
17269 -25309 -7135 146399 26754 -30129 -152524 61849 151862 396275 34733 259789 113957
17257A32035L72271a01298C93599F9422K83416A30260j4414O116J54427p8706
17247A97683J97911q8315j34819K65088j31540A06206J9014R4659d7926C44909
17236b84B41144j10956J73288j42732M7174N614J32910L5045j45960I7428D0796
17224B30585A14291J43951D8569N4357K28471E1159L05035j02301J01092J73308
17214E28293k01288k7543d2558C57845p3518E8173J82501K47026h5469A56454
17203D6056J87720c54286C64814j29027L5206q2237L22277j72520M6737m9250
17193C36000q6522Q1468q0051r1240J33249b4152E63223B76069j7413A19252R0387
17182B09639J54422N4797A44277K60270r1962J11392j99948R5741A58327M01287
$$ plain form
17257 132035 504306 -101298 393599 69422 352838 130260 115846 121962 276389 197683
17247 197683 395594 307279 172460 437548 306008 106206 125220 219879 -47926 344909
17236 -284 241144 130188 303476 160744 207918 213532 346442 381487 235527 97428 40796
17224 230585 114291 258242 48569 102926 331397 51159 356194 253893 354985 528293
17214 528293 327005 299462 -42558 357845 284327 58173 240674 487700 -85469 156454
17203 46056 233776 -354286 364814 235787 270993 188756 511033 338513 385250 336000
17193 336000 249478 330946 250895 159655 292904 -24152 563223 276069 258656 119252 209639
17182 209639 364061 418858 144277 404547 312585 423977 224029 319770 158327 559614
17172E59614k19145K3261C1736L01523J96991k48468M9145j15750J75066N5201
17162D45444A29006M49517B40080K52688j02583k9334N5111j62352K92944k65818
17152B80736j38353K31449L03180C31713O051A16065J14336L01791B51539J66840
17142D18379J70690j91743c9653A61387K08448o0445j1172m6209Q4334K5549q4384
17131B77508J55900a33869C36154m0601j22940a0596D69253j60814m7903R0791
17121C51327j5389K59610k55920J21776A60867K19514J61262M5877B49176q4990
17111A64186K03719L76949k11982k09663A6887J41004m2241L40522A54314K20912
17101C75226K00104o9314B46997J84583p6378l6074l3817L44312L5425k81636
$$ plain form
17172 559614 340469 363730 31736 333259 530250 281782 330927 215177 390243 445444
17162 445444 129006 578523 240080 492768 390185 360851 415962 253610 546554 280736
17152 280736 142383 373832 677012 331713 337764 116065 230401 532192 251539 418379
17142 418379 589069 397326 -39653 161387 369835 309390 298218 252009 336343 361892 277508
17131 277508 433408 -133869 336154 295553 172613 -10596 469253 308439 260536 351327
17121 351327 335938 595548 339628 461404 160867 380381 541643 587520 249176 164186
17111 164186 367905 744854 532872 323209 16887 157891 115650 456172 154314 375226
17101 375226 575330 506016 246997 431580 355202 319128 285311 629623 665048 383412
17091C83412j48001L76375J01697l0659j68632J16250k18317J49559j14981J98412
17081F45115k55721K23251k81226J64729r9734J26899o1387L0822j24936K0659
17071C88471J94839q288K8677J68101C57495P2653j47471L7980J53338p7947n1598
17060C44450N8315J51594k42547J85787k17738K64377n7117j41969L75208B69307
17049D76453J23457B14609O27045k38379B79599K61553k9624J12981P3295B05316
17038E66599j87491J41333j53944L44757C08738L72680A78704L29015K97813q5077
17028G20455n9402j08802K10534q853j30351l2370r4119L50084m11117p2452J46760
17017E10367L22150l18629R8268P4104k04770m83J43156J88182j76317K28066
$$ plain form
17091 383412 235411 611786 713483 682824 514192 630442 412125 561684 446703 645115
17081 645115 389394 612645 331419 496148 396414 523313 461926 492748 367812 388471
17071 388471 583310 575022 603699 771800 357495 430148 282677 320657 473995 396048 344450
17060 344450 402765 554359 311812 497599 279861 544238 487121 345152 720360 269307
17049 476453 599910 214609 841654 603275 279599 541152 511528 624509 697804 205316
17038 566599 379108 520441 366497 711254 308738 681418 178704 507719 805532 720455
17028 720455 661053 552251 762785 753932 623581 591211 497092 847176 436059 363607 510367
17017 510367 832517 513888 612156 686260 481490 481007 624163 812345 636028 864094
17007H64094k67152K48793j96692O1320n0126r727K31635j03294j67129J17736
16997G29458k85057K57087O67Q0632P004L66575n02935J46611n2236J59229q0059
16986H26976J25151k20924K84477k99742J33163j85151K11740l7957k39901j07675
16976D90157N28248p0658r8621K94175l54708R4418n8139K74323j62647J47382
16966A083930l80018K51430j68830M62670k66452q0781O3079j54277J9148K06988
16956A036887J4947l05885L90192R4962q3061J39844k41130l28830J7973O54938
16946A390837k88043J64275j18275j24596M39111l39917m0738J19261J56770m51110
16936I07575L75380Q2513p2496j65065L44284k51351K58627m46153M44858l26007
$$ plain form
17007 864094 596942 845735 649043 710363 660237 650510 882145 778851 611722 729458
16997 729458 444401 701488 702155 782787 789791 1156366 653431 800042 747806 907035 826976
16986 826976 952127 731203 1015680 715938 849101 663950 875690 837733 597832 490157
16976 490157 1018405 947747 849126 1143301 788593 883011 824872 1099195 936548 1083930
16966 1083930 703912 955342 786512 1249182 982730 901949 965028 810751 829899 1036887
16956 1036887 1051834 745949 1136141 1231103 1148042 1287886 1046756 717926 735899 1390837
16946 1390837 1102794 1267069 1148794 1024198 1463309 1123392 1082654 1201915 1358685 907575
16936 907575 1282955 1365468 1292972 1127907 1472191 1220840 1479467 1033314 1478172 1152165
16926A152165R5791r4919K31612M9032P9653N8169R0411m06093J37110J88943
16916A581874j17458q2765J84804m34042L06018J42981M7165L7245j87576K71375
16906A749621j15556K16666l49714L54876J04312j15286k62472J20533M0635J8529
16896A762144M18991l91949L31833n39070N74809l89459K30172k8338l2880K86651
16886B222904m21210J36037K09767k46540K23273%L70435l08584L39681P7562
16876B603325m09258Q0102N033K71204m49910N54895n64708R13837l77355J49831
16866B776996K61198m67530j2778M72750k96036j91432L00080J14407j42389J93435
16856C008701L17971P6965l54724L68279j13113j97033R1726K62636L03808k61918
$$ plain form
16926 1152165 1247956 1153037 1384649 1433681 1513334 1571503 1661914 1255821 1392931 1581874
16916 1581874 1464416 1381651 1566455 1132413 1438431 1581412 1628577 1665822 1478246 1749621
16906 1749621 1634065 1850731 1501017 1855893 1960205 1844919 1582447 1702980 1743615 1762144
16896 1762144 2181135 1789186 2121019 1581949 2156758 1767299 1997471 1969133 1936253 2222904
16886 2222904 1801694 1937731 2147498 1900958 2124231 2124231 2494666 2186082 2525763 2603325
16876 2603325 2194067 2274169 2279202 2550406 2100496 2655391 2090683 3004520 2627165 2776996
16866 2776996 3038194 2570664 2557886 3030636 2734600 2543168 2843248 2957655 2815266 3008701
16856 3008701 3326672 3403637 3048913 3417192 3304079 3107046 3198772 3461408 3765216 3503298
16846C503298Q8810r9692J92359K8525K12928k80219J93358K37912p9245K39595
16836D237629j41499K89192j606K7881J38552K08348j07537P6098k44J89647J55464
16825E071925l9013n4897K76205J01959O1180R6761K17416K4809j4959Q6580J72450
16814F000416j62700J72586N52138j58727M40056o3822l2376N97021j17527N87045
16804G814110m06576N90413J06522K39023j09289K43719M33665K7090J96813K94976
16794I430466M51739J10358L63795J81028K78239K90209q5429Q59427j58980M88874
16784A2209726J17557O44006N46086J85869K95234K09852O57323L63720Q10926
16775A6040299L22446N60630N74353N84463R68037Q2006O36909R18677P58297
$$ plain form
16846 3503298 3592108 3492416 3684775 3713300 3926228 3646009 3839367 4077279 3998034 4237629
16836 4237629 4096130 4385322 4383716 4411597 4550149 4758497 4650960 4727058 4726814 4916461 5071925
16825 5071925 5032912 4978015 5254220 5356179 5417359 5514120 5731536 5756345 5741386 5827966 6000416
16814 6000416 5837716 6010302 6562440 6403713 6843769 6779947 6747571 7344592 7227065 7814110
16804 7814110 7407534 7997947 8104469 8343492 8234203 8477922 8911587 8938677 9135490 9430466
16794 9430466 9882205 9992563 10356358 10537386 10815625 11105834 11020405 11879832 11720852 12209726
16784 12209726 12327283 12971289 13517375 13703244 13998478 14208330 14865653 15229373 16040299
16775 16040299 16362745 16923375 17497728 18082191 19050228 19132234 19769143 20687820 21446117
16766B1446117R09772N92261J217910Q19325R93609J106150Q04114J426237J322167
16757C0637662J147417J262296J410930J245553J766516J872587J998369K061119
16749D3402449J762044K534178K278895K586507K635146K948343L328709L354198
16741F4830469L446982M019652M198604M344556M443785N234928N018751N671442
16733A01209169N813361N984246O411124O692599O795914O901040O902624O687171
16725A53397248O638378N856993N801765N167163L989864K751199J873943J143145
16717A86619698o32301j542309l060767l134847n005091n380723o053592o461313
16709A55348755o808749p148653o888070p009008p103053o135963o433162o201528
$$ plain form
16766 21446117 22355889 22948150 24166060 24985385 25978994 27085144 27889258 29315495 30637662
16757 30637662 31785079 33047375 34458305 35703858 37470374 39342961 41341330 43402449
16749 43402449 45164493 47698671 49977566 52564073 55199219 58147562 61476271 64830469
16741 64830469 68277451 72297103 76495707 80840263 85284048 90518976 95537727 101209169
16733 101209169 107022530 113006776 119417900 126110499 132906413 139807453 146710077 153397248
16725 153397248 160035626 165892619 171694384 176861547 180851411 183602610 185476553 186619698
16717 186619698 185987397 184445088 181384321 178249474 173244383 167863660 161810068 155348755
16709 155348755 148540006 141391353 134503283 127494275 120391222 114255259 107822097 101620569
16701A01620569n757710n490892n477689m706319m580822m023570l682788m251696
16693F3649083l426636l111379k894414l186888k346687k633685j965016k069957
16685D2014421k330968j875843j735808j878686q73681j882042j538088p56007
16677B9143298j636454j022938j187303q10524j260605m85317j385987o18364
16669B0735806p69480r48978p28264j81259p95692m89573q79430m67359k00783
16660A5274988p51689q4911p77097k69165l89436p24065o8430l70739m73723o43140
16650A0722593j6982m99838J34075n81313m77008j01032k85593J52838n12225
16641H535515k73799Q0384j99692l22908k10954j07472m57249J43372k23191k80913
$$ plain form
16701 101620569 95862859 90371967 84894278 80187959 75607137 71583567 67900779 63649083
16693 63649083 60222447 57111068 54216654 51029766 48683079 46049394 44084378 42014421
16685 42014421 39683453 37807610 36071802 34193116 33319435 31437393 29899305 29143298
16677 29143298 27506844 26483906 25296603 24486079 23225474 22740157 21354170 20735806
16669 20735806 19966326 19017348 18289084 18107825 17312133 16822560 15943130 15475771 15274988
16660 15274988 14523299 14438388 13661291 13392126 13002690 12278625 12210195 11839456 11365733 10722593
16650 10722593 10705611 10205773 10339848 9758535 9281527 9180495 8894902 9047740 8535515
16641 8535515 8261716 8342100 8142408 7819500 7608546 7501074 7043825 7187197 6964006 6683093
16631F683093l07621L628j63572j46121j67749k31972J53996k96848K6832k1963
16621E531703k58377l42561L73359m94500J60426l17961j70026J70239P2417o61208
16611D063511J97522k05344r3736K79610k97064j07876R9619l72409N5885J86773
16601C806491r9845l36995o8768K86442j22335o3210l0440m73560l23600J00171
16591B674351M38337n819m46743K99776q4328J76595k18235M9990Q5688k23750
16581B745862k83831K7574n5764Q0392j70696j84899O2695J89532j84411J4183
16571B240637L2991j28563M0863N3444J14560n59433N00102r5152m30357R6994
16561A866086k48720K39766K72531J67386m52466l22402M7780L99135l11874k73015
$$ plain form
16631 6683093 6375472 6379100 6215528 6069407 5901658 5669686 5823682 5526834 5553666 5531703
16621 5531703 5273326 4930765 5304124 4809624 4970050 4652089 4482063 4652302 4724719 4063511
16611 4063511 4261033 4055689 3961953 4241563 3944499 3836623 3936242 3563833 3619718 3806491
16601 3806491 3706646 3369651 3300883 3587325 3464990 3401780 3371340 2897780 2574180 2674351
16591 2674351 3112688 3106869 2660126 2959902 2875574 3052169 2833934 2883924 2969612 2745862
16581 2745862 2462031 2489605 2433841 2514233 2343537 2158638 2221333 2410865 2226454 2240637
16571 2240637 2273628 2145065 2185928 2239372 2353932 1794499 2294601 2199449 1769092 1866086
16561 1866086 1617366 1857132 2129663 2297049 1844583 1522181 1569961 1969096 1657222 1384207
16551A384207J6508L53515j06355j57058O1840J04857P809j7954j53015R9025
16541A593379l283j90849J72094k75588K6288P0281N6451r5141M09467m30749
16531A332350k1150K46041j79450k917j42381j77174K63024J78483m09979J45795
16521A232642M7314k4314J52209l79399M57906o18097L23080k38684K14087j43748
16511A022996J77068k21995J15768o0926j79907L73020n15545L53876l63159J99108
16501I00304K63277n51049q5368P38147n13778j37767N04213l29247j28968N02265
16491A162029m66830l9806J30278N5267n754J0144J4844J50408j45529J10014
16481I75065k23305K02098k88326j8239N7145j16628J28470J5121O766P2910J19849
$$ plain form
16551 1384207 1400715 1754230 1647875 1490817 1552657 1657514 1665323 1647369 1494354 1593379
16541 1593379 1590096 1399247 1571341 1295753 1322041 1392322 1448773 1353632 1763099 1332350
16531 1332350 1311200 1557241 1377791 1374874 1232493 1055319 1318343 1496826 1086847 1232642
16521 1232642 1279956 1255642 1407851 1028452 1486358 868261 1191341 952657 1166744 1022996
16511 1022996 1200064 978069 1093837 1032911 853004 1226024 710479 1064355 701196 900304
16501 900304 1163581 612532 527164 1265311 751533 613766 1117979 788732 659764 1162029
16491 1162029 695199 655393 785671 840938 835184 845328 860172 1010580 865051 975065
16481 975065 751760 953858 665532 647293 704438 587810 716280 731401 738167 811077 930926
16470I30926r6565P991p1219Q3012l55626M34945j90080l27602L93542m4984j36724
16459F27616K26682k05796N2069J70580m22632K29473C10248J04409M65888k23015
16449F57530r6275k48220L62757o7963K8093j67114J83645B50953K6690L16164
16439E93807J3529j97071J44539N3325k99086K96244J87942l01418q2314L81118
16429G90615j01225k43806o0948K21764j09107m4539J28483j6013k00913N2460
16419D16771A99437o3636J54064Q1681K84305A90409O29836k94399O8722r0226
16409E04342G3409L69934l430o2824q1035j12657M07375j71093j32406R0352m2165
16398C35460O065K08187A81431J82670J03490K4748j35140J96454k62896l8443
$$ plain form
16470 930926 834361 842352 771133 854145 498519 933464 743384 415782 809324 764340 627616
16459 627616 854298 648502 700571 871151 448519 677992 310248 414657 880545 657530
16449 657530 561255 313035 675792 607829 635922 468808 652453 250953 277643 593807
16439 593807 607336 410265 554804 608129 309043 605287 793229 491811 409497 790615
16429 790615 689390 445584 384636 606400 497293 452754 581237 565224 364311 416771
16419 416771 199437 135801 289865 371546 655851 190409 820245 525846 594568 504342
16409 504342 73409 443343 439913 377089 296054 183397 590772 419679 287273 377625 335460
16398 335460 341525 549712 181431 364101 467591 492339 357199 553653 290757 252314
16388B52314M8653J67268I0067L39451m739j4293L54833l34468P2032j21242A77995
16376E04872J73637H0535L33163A88480o4937J40236j21225D9254N14647A66261
16365D77649k20623d1539D66378p7565O4635k24009K23308k12665p6291K62668
16355D26459O5735j05526A77218J40955R477A39632J92690q7172N9691J62473
16345D67314p1568I4530J26645J41748n0570A18169a18659d8011D11914j44909
16335B67005o4479J00164A23721L0634Q5531q6683N1180r1889J70366A26383b081
16323A62067F1589R6803O7530n9498K71109A17076a55160A23210J89055R7439
16313D09704H3307J6395g7531H9454a00285B9502K06517P8532a32594H1316J86347
$$ plain form
16388 252314 300967 468235 90067 429518 424779 410486 765319 430851 502883 381641 177995
16376 504872 678509 80535 413698 188480 123543 263779 142554 49254 563901 166261
16365 477649 257026 -41539 466378 388813 453448 229439 452747 240082 163791 426459
16355 426459 492194 386668 177218 318173 327650 139632 332322 245150 304841 467314
16345 467314 395746 94530 221175 362923 312353 118169 -118659 -48011 411914 267005
16335 267005 202526 302690 123721 154355 239886 153203 204383 112494 282860 126383 -2081
16323 162067 61589 158392 225922 166424 437533 117076 -155160 123210 312265 409704
16313 409704 83307 99702 -77531 89454 -100285 29502 236019 314551 -132594 81316 267663
16302B67663a0214j4667o1375C12086A26818C643M21286j99191K5870E6945J62951
16291B19896G2904K23357I2590K41169p2877G1413L29915n6133m3342n2005o2811
16280A87037D2320N8133J59675O5396J53838B31907q9340M0445J68177a09404
16269d8424I5600G973K42812r873p0757R6032J2741A18755J89523J75077A54376
16257a3318B41183n9275C591K51711J1749q4588k3759j4916K23350a54808B1021
16245C28112M3546A58370N918J31810l6779a37275B28065n0513L3268K08425A10232
16233B34712p2569a31211E94778B76976H8847M684O6061G286J79062c7073C36501
16221C53166I3491L35952A90188b24694f1381D58559q3274D6893a21382A49410
$$ plain form
16302 267663 -10214 -24881 -86256 312086 126818 3643 424929 225738 251608 56945 219896
16291 219896 72904 296261 92590 333759 260882 71413 401328 345195 301853 249848 187037
16280 187037 42320 100453 260128 325524 479362 231907 142567 183012 351189 -109404
16269 -48424 95600 7973 250785 240912 170155 266187 278928 118755 308278 483355 154376
16257 -13318 241183 181908 3591 255302 267051 182463 158704 143788 367138 -154808 21021
16245 328112 371658 158370 164288 296098 259319 -137275 228065 177552 210820 419245 110232
16233 234712 162143 -131211 594778 276976 88847 93531 159592 7286 186348 -37073 336501
16221 353166 93491 429443 190188 -224694 -61381 458559 375285 46893 -121382 149410
16210C4844a62294B04480p6024J67566n449p3489j03354m1381f2790D13466b20370
16198B94258l4456a04389C23094j57144o3138i9781l2845H6986q933J0N0428J35385
16186B63876H8178a1416A54380C2375J54120E594J59954N1776e3456A49374J66368
16175C15742G8369f4795r9445i834k1466C73627G8125b58559A861L81109A90304
16163A76903a3157C4453J75350a63323B03586g0443H4860a49185A24768P9461
16153B04229c03313b8084A36918K34084G9538C7609M7377e4911G9572a28038B34375
16141A12741l4105a64316N1220A5726a73841A5140L00416j03424c14360a27912
16130a82128P4136I751J74968l1844g893D70631d9937d827D8884a95349o1734
$$ plain form
16210 34844 -162294 204480 128456 296022 290573 217084 113730 72349 -62790 413466 -220370
16198 294258 259802 -104389 323094 165950 102812 -99781 -132626 86986 78053 78063 128491 263876
16186 263876 88178 -11416 154380 32375 186495 5594 165548 217324 -53456 149374 315742
16175 315742 78369 -64795 -164240 -9834 -31300 373627 78125 -258559 1861 382970 190304
16163 176903 -13157 34453 209803 -163323 203586 -70443 84860 -149185 124768 204229
16153 204229 -303313 -28084 136918 371002 79538 37609 84986 -54911 79572 -128038 234375
16141 112741 78636 -164316 -113096 15726 -173841 15140 315556 212132 -314360 -127912
16130 -182128 -107992 9751 184719 152875 -7893 470631 -49937 -4827 48884 -195349 -257083
16119b57083E6964i9167N117d4133k51966c5438C1570K09347K5839h2254E5537
16107G7032a15913j7908B63983h2445H0955h5219b7398C48079I6723j1982c2286
16095B20463q4216c97722a892m81206d274p9165j98044B44809D8551a4712C54058
16083b137k08252c0615A76412p8892f1027p2593B51522J16438j50889H2663a93385
16071A36734c67322A72372i7610b0249A04541a36995c4282B16475I7565b29523
16060B1938a05374H4946b10395B52290G8089J92841i0648D9924c6250C10588d42205
16048C9162N2120O1327e46189A3026c8657k47518A08177a51901P3570r4811C08828
16036b3543n6496k06388R2485A24512a23185c2529k9924m2480k64531J44950B474
$$ plain form
16119 -257083 56964 -99167 -94050 -44133 -296099 -35438 31570 240917 266756 -82254 55537
16107 77032 -115913 -133821 263983 -82445 80955 -85219 -27398 348079 96723 84741 -32286
16095 220463 136247 -397722 -1892 -483098 -4274 -83439 -281483 244809 48551 -14712 354058
16083 -2137 -210389 -30615 176412 97520 -61027 -133620 251522 367960 217071 82663 -193385
16071 136734 -367322 172372 -97610 -20249 104541 -136995 -34282 216475 97565 -229523
16060 21938 -105374 84946 -210395 252290 78089 270930 -90648 49924 -36250 310588 -442205
16048 39162 91282 152609 -546189 13026 -38657 -286175 108177 -151901 -78331 -173142 308828
16036 -23543 -80039 -286427 -193942 124512 -123185 -32529 -62453 -104933 -369464 -224514 2474
16024E7060I896L192e0803k37178a10467L5750I7115k8753L1039A2891b30864
16012H8583J06314A5565n841a43347E064a92114a796A89913j704O3854a90248
16000A53088b30350b0410B70894f1662j47633C7806a65148a5670l1571j78163
15990b25404i7686l6206j91186A05336E1758J1360i2199H11704A79254L32897
15980E12151I300f2491A28587K2949a75318f5982A1468L1112b61D4337K02234
15969B46571a05418J1206k7284D737c37676G0154L0530m706c39742A48347a95797
15957C1650b56672a6028j14870c1853h665k18536A93180c08948B46782b29535
15946c95836B9156J73405C9913a60148D9365c39928A20966m4293J9568m36A4817
$$ plain form
16024 57060 9896 13088 -50803 -287981 -110467 -74717 97115 68362 99401 12891 -230864
16012 88583 194897 15565 9724 -143347 5064 -192114 -1796 189913 188209 252063 -190248
16000 153088 -230350 -20410 270894 -61662 -209295 37806 -165148 -15670 -47241 -225404
15990 -225404 -97686 -133892 -325078 105336 51758 63118 -92199 811704 179254 512151
15980 512151 9300 -62491 128587 151536 -175318 -65982 11468 42580 -261 44337 246571
15969 246571 -105418 -94212 -121496 4737 -337676 70154 100684 95978 -339742 148347 -195797
15957 31650 -256672 -16028 -130898 -31853 -8665 -227201 193180 -308948 246782 -229535
15946 -395836 29156 202561 39913 -160148 49365 -339928 120966 76673 96241 95805 14817
15934a3872B45398l2949a70197N699H3186b573C4815C817J19227l6323b95439
15922E6221a29906l812a4726B0660b35858d9975A12915K41424a90122C724K70851
15911B74575i8709I0044b59193J15369e1438l6566j90126e5035j58523n6802K7162
15900b43198A75004c04440c0583k65378Q4454D52996a03187p1143k4180A03103
15889d57087A13498b7175a2013B04907r2652C3576F946a68748A36964L4222E2238
15877a7268G7527j45J19158b6666j2584n1254D77169B03674O0338r0225e6541
15865C623c5460D01g4624p4125d1156J7620n6869F9028A2056K2643P5064a04238
15852A4709Q4951J96157J33169a47091N5276C825Q8563L0004a90417M6090e0178
$$ plain form
15934 -13872 245398 212449 -170197 -164498 83186 -2573 34815 3817 123044 86721 -295439
15922 56221 -129906 -133718 -14726 20660 -235858 -49975 112915 354339 -190122 3724 274575
15911 274575 -98709 90044 -259193 -143824 -51438 -88004 -278130 -55035 -213558 -270360 -243198
15900 -243198 175004 -304440 -30583 -295961 -211507 452996 -103187 -174330 -198510 103103
15889 -457087 113498 -27175 -12013 204907 112255 33576 6946 -168748 136964 171186 52238
15877 -17268 77527 77382 196540 -26666 -39250 -90504 477169 203674 264012 173787 -56541
15865 3623 -35460 401 -74624 -148749 -41156 -23536 -80405 69028 12056 34699 109763 -104238
15852 14709 99660 295817 428986 -147091 -91815 3825 92388 122392 -190417 -144327 -50178
15840a60550J1605f8710p5503M7894B7591a3934C7201K9856C468M3975a88436
15828a47092R339b9233I8081d87173H9917J21278g3695A73878e54301A70791d03765
15816C1174e1203A44668a15649j82303C11398c8075B71548a49165g1859A72327
15805C85499G3933O9683K7215a26885G8127a06224N518a1680l55832i8879j02899
15794b01778q2824C79437g092B85669b06040J4280m3004I5337c9047A56476n9834
15783I6642f4226k71191q4611g4915K9832A88443a81705Q4069A01488J43058e4121
15771D9238J03730a15836M5336a2110p8745j75116b0185A25871a75335p0317f2328
15759a30213A05801m4173r66e5212G3508E386R3237L8819a22403d9745A98758
$$ plain form
15840 -160550 -148945 -68710 -144213 -96319 27591 -13934 37201 67057 3468 47443 -188436
15828 -147092 -137753 -29233 98081 -487173 89917 211195 -73695 173878 -554301 170791 -403765
15816 31174 -51203 144668 -115649 -297952 311398 -38075 271548 -149165 -71859 172327
15805 385499 73933 143616 170831 -126885 78127 -106224 -100706 -11680 -367512 -98879 -201778
15794 -201778 -284602 379437 -7092 285669 -206040 -191760 -234764 95337 -39047 156476 96642
15783 96642 -64226 -335417 -420028 -74915 -45083 188443 -181705 -97636 101488 244546 -54121
15771 49238 152968 -115836 -70500 -12110 -90855 -265971 -20185 125871 -175335 -245652 -62328
15759 -130213 105801 61628 60662 -55212 73508 5386 98623 137442 -122403 -49745 198758
15747a87358C12834g5374L7026B33293b39299A44313F5803b75191J26844A05392
15736H4401J54476g1283j1330l89655b04461M4810B12505I8463j9719A7163K81255
15725B98418b50770c1111F3786g8739H303a00633M2906A48263F079N3664R2176
15714A51919l658b4066H9274A7013a36132B3966d9282j8217a7055D0361e5915
15702b20351J09746M7632p013B14120D5997b72413h6708k68399R7226G5838d9551
15690C58144A26746K4381e3493o0470M224H1608c7933n5176r1280e9877K3044
15679c6833j56864K5851H9502a55679a0205C30862c86352C59372A50148l5826
15669A14322a06423d4236E7651a98361j72845C1950f6900m04086e0959A72319
$$ plain form
15747 -187358 312834 -75374 -38348 233293 -239299 144313 65803 -275191 -148347 105392
15736 84401 238877 -71283 -82613 -472268 -204461 -159651 212505 98463 78744 17163 298418
15725 298418 -250770 -31111 63786 -78739 8303 -100633 -57727 148263 6079 59743 151919
15714 151919 148261 -24066 89274 17013 -136132 23966 -49282 -67499 -17055 40361 -55915
15702 -220351 -110605 -62973 -69986 214120 45997 -272413 -86708 -355107 -257881 75838 -49551
15690 358144 126746 151127 -53493 -113963 -109739 81608 -37933 -93109 -184389 -59877 -36833
15679 -36833 -193697 -167846 89502 -155679 -10205 330862 -386352 359372 150148 114322
15669 114322 -106423 -44236 57651 -198361 -371206 31950 -66900 -470986 -50959 172319
15658a91160D9277c50015A37686l4337K00145e4661H0401d4079j61156I1733a72083
15646A36340b92835i2123C1923d9296j31113h1297A61753m4548J83090a37950
15635c82003d9425j13084r9488L8174C18797f155A43512a56787b3559l84213A71864
15623b96719a21755B09594a9802l07208i0156d0833C6871J50178c2215p0365B45817
15611c53970a49740B52972a03463a1093A32562a33095b1499r1681j2760O620A99562
15599B68993b56997D53835A14104a36694H0896d16071a01574d8559A08647c59459
15588h7985j67589B10614a41435N3831m5291C2093g2631l78031a09545H8115f6477
15576a7866A1561a60466j02237g8841I8333b4620j12458j65236C19560b22110
$$ plain form
15658 -191160 49277 -350015 137686 103349 303494 -54661 80401 -44079 -205235 91733 -172083
15646 136340 -292835 -92123 31923 -49296 -180409 -81297 161753 117205 300295 -137950
15635 -382003 -49425 -162509 -261997 -223823 318797 -6155 143512 -156787 -23559 -407772 171864
15623 -296719 -121755 209594 -19802 -327010 -90156 -40833 36871 187049 -32215 -102580 245817
15611 -353970 -149740 252972 -103463 -11093 132562 -133095 -21499 -113180 -125940 -119320 199562
15599 268993 -256997 453835 114104 -136694 80896 -416071 -101574 -48559 108647 -359459
15588 -87985 -255574 210614 -141435 -87604 -132895 32093 -72631 -450662 -109545 88115 -66477
15576 -17866 11561 -160466 -262703 -78841 98333 -24620 -137078 -302314 319560 -222110
15565E3592J41072D0141J1701O8673c7399B57527l826A01742G140c58166a47873
15553f0717o9222m5368E1658d13026A29386A6787N0010m456J89140b22579B28646
15541g0130B63397j13665a96465a6670F5176a11823A95405a61169p5924b1089
15530B82468A04985N5270o7102J1797e244r7135l4964b0761B11034d8911A47121
15518a20867a4704j10040L1076K441b4149m1931D23355A07159i3074C3686b04809
15506a2143B28084i8886b1411A93381l3063L1950c01065N0066C07000i6558B78602
15494a89715p3137q996B0315J83242a63540A5149O3094K3977K4725J38988J05474
15483C71407d6988p4687I8552K08136c62586a54629o5285L1634c1515D52382j92308
$$ plain form
15565 53592 194664 40141 51842 120515 -37399 257527 253701 101742 7140 -358166 -147873
15553 -60717 -129939 -175307 51658 -413026 129386 16787 66797 62341 251481 -222579 228646
15541 -70130 263397 149732 -196465 -16670 65176 -111823 195405 -161169 -237093 -21089
15530 282468 104985 160255 93153 104950 -5244 -102379 -137343 -20761 211034 -48911 147121
15518 -120867 -14704 -124744 -93668 -91227 -24149 -66080 423355 107159 -93074 33686 -204809
15506 -12143 228084 -98886 -21411 193381 160318 192268 -301065 -250999 307000 -96558 278602
15494 -189715 -262852 -271848 20315 203557 -163540 15149 78243 102220 126945 265933 371407
15483 371407 -46988 -121675 98552 306688 -362586 -154629 -219914 -188280 -31515 452382 260074
15472B60074d6616j69864A6109f3554r6029j4340A25140B4534h6327K494B33048
15460D7000P7937a03270a1049m3738B75350H9891R4741J53604b5248j79796d0112
15448g5k22964K5581A15941B256a07474m2025A17719J62592B4597J13627J38094
15437B76318E3522a29731A2352M15773C5938J29423n3203M5514l4408D200J13276
15426A17476f8333p6653C23002A3837e7186k93893B36236a74013P5886j45713
15416b43840B8625K5488d1554j62458b4862A09077f1671k06556A22406A4112J67648
15405A81760D749c72376B82475I1549B4842a15026A20118P0553D1856a6571B03188
15393a79250P2756j94891J37087Q0613G1929J5053a64616j17901a7409j53696
$$ plain form
15472 260074 -46616 -216480 16109 -63554 -159583 -173923 125140 24534 -86327 -83833 233048
15460 47000 124937 -103270 -11049 -54787 275350 89891 184632 338236 -25248 -205044 -40112
15448 -75 -223039 -197458 115941 2256 -107474 -149499 117719 280311 24597 138224 276318
15437 276318 53522 -129731 12352 428125 35938 165361 112158 157672 123264 4200 117476
15426 117476 -68333 -144986 323002 13837 -57186 -351079 236236 -174013 -98127 -243840
15416 -243840 28625 54113 -41554 -204012 -24862 109077 -61671 -268227 122406 14112 181760
15405 181760 4749 -372376 282475 91549 24842 -115026 120118 190671 41856 -16571 203188
15393 -179250 -106494 -301385 -164298 -83685 71929 86982 -164616 -282517 -17409 -171105
15383a71105N0706B16816B3384K09385A42a96603g5394B26888J55235c0331o4767
15372i5098j20902e8918B58414M9231d01498a56819r7981A36857a25267n8516
15362a83783O8172j25592B22145K009b32452g2712k7278K7000A30985A3082d1077
15350A80216b16584A12798a17625j4369N8259k8279r1404G2421b2972A8142P7182
15339I5324b07648a03026c5285D66794B28512a05356j40460B52640C0761e51o5842
15328f6393A03515K11356d8178o2869F2361E315P8650b45663J15447D9626L4803
15317H4429a04063D3133J33750b036I9691f1453C78571b01042I5901L3551a09070
15305A8130K91224q4592p2045c8474A06414a54027B68218a46370C56685n5241
$$ plain form
15383 -171105 -120399 216816 23384 232769 142 -196603 -75394 226888 382123 -30331 -95098
15372 -95098 -216000 -58918 258414 307645 -401498 -156819 -254800 136857 -125267 -183783
15362 -183783 -115611 -241203 222145 224154 -232452 -72712 -99990 -72990 130985 13082 -41077
15350 180216 -216584 112798 -117625 -131994 -73735 -102014 -193418 72421 -22972 18142 95324
15339 95324 -207648 -103026 -35285 466794 228512 -105356 -245816 252640 30761 -551 -66393
15328 -66393 103515 314871 -48178 -111047 62361 5315 83965 -245663 -130216 49626 84429
15317 84429 -104063 43133 176883 -2036 99691 -61453 378571 -201042 95901 129452 -109070
15305 18130 309354 224762 152717 -38474 106414 -154027 268218 -146370 356685 301444
15295C01444p7765A1094J40720o8149L35747j94527d20561a67557a2082D8283
15284D08718E3420k1226h1816A1912K07561K6919a19997A33466j588c1250A93013
15272B86542c17192e9276g254k7587A79823j0589F728J98362J05953G3804f1676
15260D54318g3600A23268b0895B99622c5518B99609k6431H3421J04006J21908
15250C09335N8090L02116R05777m02075K8278M15309n86899B01801J43302A40170
15239A58301a1676j21536d7842E5135b5010p587A96582N004I0827f1459A10431
15227A25027C0407f6458l8281l514A2950M2252K5467g3956B19022a38610E2672
15215d1683o1863H6545h0129A45321D9490J35640M6705l9483G3170j9368K18971
$$ plain form
15295 301444 223679 11094 151814 83665 419412 224885 -420561 -167557 -12082 48283
15284 408718 53420 32194 -81816 11912 219473 246392 -119997 133466 131878 -31250 193013
15272 286542 -317192 -59276 -7254 -34841 179823 169234 6728 205090 311043 73804 -61676
15260 454318 -73600 123268 -20895 299622 -35518 299609 273178 83421 187427 309335
15250 309335 367425 669541 1575318 1173243 1201521 1616830 1029931 201801 345103 140170
15239 158301 -11676 -133212 -47842 55135 -25010 -32597 196582 201586 90827 -61459 110431
15227 125027 30407 -66458 -104739 -108253 12950 55202 80669 -73956 219022 -138610 52672
15215 -41683 -103546 86545 -80129 145321 49490 185130 231835 192352 73170 53802 272773
15204B72773m3570o6856L9351A8384d2447j4820A7191B797K70299j33935e2776
15192A51707K24353e7795C74283A0134J30928e0471A99100f2376j5246B14143
15181C06717b44543q1993B80098G0985J05026C6343J00214a75742N2983A06048
15170B00830c06073h464I3851C5902b07339D60352a44625A49308Q5727j8425a34620
15158C55974b9579B32797A07349j4944A0927K68984G9750C8618K56494j18194
15148A76918J67322a13664A60035A826K05442m3279n6311l4156L07609A82342
15137a21074C62395A44019c02671A45659J03898I9843J83932e8382J4147j31214
15127a75449B28734m2305A8187P4971J50194J17010B9835L03357E8213J2310J17712
$$ plain form
15204 272773 229203 162347 201698 18384 -42447 -57267 17191 2797 273096 139161 -52776
15192 151707 376060 -57795 374283 10134 141062 -50471 199100 -62376 -77622 214143
15181 306717 -244543 -326536 280098 70985 176011 36343 136557 -175742 -122759 106048
15170 200830 -306073 -8464 93851 35902 -207339 460352 -144625 149308 235035 216610 -134620
15158 355974 -29579 232797 107349 92405 10927 279911 79750 38618 295112 176918
15148 176918 344240 -113664 160035 1826 207268 163989 107678 73522 381131 182342
15137 -121074 362395 144019 -302671 145659 249557 99843 283775 -58382 -44235 -175449
15127 -175449 228734 186429 18187 93158 243352 360362 29835 333192 58213 70523 188235
15116A88235M836D6798a76892A74407h0109A13766a19397H7216Q338J52409a14793
15104A42538g4128C39858i4138A86496J75419I9286d478o0259C30331e7729C71597
15092C47782k3590I1530P3286K40544j81748n3924D8690J97767C4278J36357K27730
15081C98365j70622C6607j1890M00843A01753J07219N4557j19196J428J31428
15071B77189j33409J55281A0434M12305D9018j9373L30794A34231K7301r887k5786
15060A25859e8546A77263J21654j13730a15715C58581j71661G1980N6050J97767
15050C25797A08076N13500B52363J1672J40411o8306J51700A78276K87389A49489
15039E37593I4572a43317A18130C5304L17810A47641q600M910i9513d5547F5203
$$ plain form
15116 188235 193071 46798 -176892 174407 -80109 113766 -119397 87216 95554 247963 -114793
15104 142538 -74128 339858 -94138 186496 361915 99286 -4478 -64737 330331 -57729 371597
15092 347782 324192 91530 164816 405360 223612 169688 48690 246457 34278 170635 398365
15081 398365 227743 36607 24717 425560 101753 208972 263529 144333 145761 277189
15071 277189 143780 299061 10434 422739 49018 29645 360439 134231 161532 151645 125859
15060 125859 -58546 177263 298917 185187 -115715 358581 186920 71980 128030 325797
15050 325797 108076 621576 252363 264035 404446 336140 487840 178276 465665 149489
15039 537593 94572 -143317 118130 35304 353114 147641 139041 143951 -99513 -45547 65203
15027b134D03243l5330j25152K57858f4133Q174A40344n4964K56424A16939a09060
15015A90653m5232e1691C67661D7697c354D45015i4922A91816I693J03407Q6360
15004A99460J15823K6285I1670K26730E0151J98528r3450R188a71913C52000j09444
14993B42556A00080Q9287m8678J97025K31809G1480K43253j24697J28626A40343
14982a17516B4826D525c3681g389B138K95711J86723A95699J60004J6797J92383
14971E64883A6008K46302a97600C45211K2930j20207l4926g2514D10950j52040
14961B58910K07914J1590J1155j44441J8604K1756J00253A41881J58748J33758
14951D34387j69018H7829K96654J90665G4577L51172a83437C05190A49374D3716
$$ plain form
15027 -2134 403243 367913 242761 500619 -64133 -55959 140344 85380 341804 116939 -109060
15015 190653 145421 -51691 367661 47697 -3354 445015 -94922 191816 9693 113100 199460
15004 199460 315283 341568 91670 318400 50151 248679 155229 164417 -171913 352000 242556
14993 242556 100080 189367 140689 337714 569523 71480 314733 190036 318662 140343
14982 -117516 24826 4525 -33681 -7389 2138 297849 484572 195699 355703 372500 564883
14971 564883 16008 262310 -197600 345211 368141 247934 213008 -72514 410950 258910
14961 258910 466824 478414 489569 345128 363732 385488 485741 141881 300629 434387
14951 434387 265369 87829 384483 575148 74577 425749 -183437 305190 149374 43716
14940B0141L06858J16687A16520R2573K73590p5207j45747J27665r4381L16686
14930F11699A95401J51209A46360J04883K92016k25425J04119B09006F7056K60490
14920C27546K3981J08863j28800L35001B58672J69703j56773p1715o7249K39367
14910C72005L8530j66251p4983M10368A95167M2018j395k3138F2112K94588k2428
14899C34272J10478m92l6136c884C52085K36321A10054J70207N0646J12751A65070
14887C21046L26601k91444R1540J64276j74239j04139A02240M8623J10260K29036
14877D90159j01537O3824k12857K59453B33543J78459A97473l0731J06886J05066
14867C78694J94224k34302j40046M4413K33397K21595l26395L24582B29931L69435
$$ plain form
14940 20141 326999 443686 116520 209093 482683 407476 261729 389394 295013 611699
14930 611699 195401 346610 146360 251243 543259 317834 421953 209006 67056 327546
14920 327546 351527 460390 331590 666591 258672 428375 271602 199887 132638 372005
14910 372005 410535 244284 169301 579669 195167 237185 235790 212652 62112 356700 334272
14899 334272 444750 444258 408122 -3884 352085 588406 110054 280261 330907 443658 165070
14887 321046 647647 356203 447743 612019 437780 333641 102240 150863 261123 490159
14877 490159 388622 452446 239589 499042 233543 412002 197473 166742 273628 378694
14867 378694 572918 338616 198570 242983 476380 697975 371580 696162 229931 599366
14857E99366q2606j94057N5869J36070k34846r423N03176B32656L28211A53844
14846E14750j18754j9923p321j68430K50263m8759K27313B94207O9636L70532
14836G34375k73779m6209p8085J99125j18500k0690K72552B35825o0004k4263
14826A51558L57922A96009K89534j81032P8752K62423j60546Q006J08040J35227
14816G36413m5651A88572Q1751Q7586A67421N60047C52353L9883L40337j55795
14806E76778o1178B39056K26391m4085J87896J8823B04617K37764j63428M65704
14796G44657o5659k46521K07444j70512m9007M63227k54693J34563C62855L34802
14786F97657q7524O440L30310l42723K41980l71686J08407O271Q6437K9216j85460
$$ plain form
14857 599366 516760 322703 378572 514642 279796 270373 773549 232656 560867 153844
14846 514750 395996 376073 368752 200322 450585 401826 629139 294207 363843 734375
14836 734375 460596 414387 336302 535427 416927 396237 668789 235825 175821 151558
14826 151558 509480 196009 485543 304511 383263 645686 485140 493146 601186 736413
14816 736413 690762 188572 270323 357909 167421 727468 352353 392236 732573 576778
14806 576778 515600 239056 465447 421362 609258 628081 204617 442381 278953 744657
14796 744657 678998 432477 639921 469409 420402 883629 628936 763499 362855 697657
14786 697657 610133 616573 946883 604160 846140 474454 582861 589132 675569 704785 519325
14775E19325J55067j83711J46930K47777K1964D19074j73817M55934B78045N42581
14765H20626l15419K66373j77394J62815k10382L64015D28408J63042J96459j54591
14755F33318k3115K89765l68726K23551k07916j90609O55625C54235M25541q0663
14745F99113j63390o8321Q0173J16185J94110j53005q2804R2122l35932L16114
14735F94365J74428j92574L69384J025m65706k1097K59222r8152j80883n3411
14725D86601J70577L72447l6529l71279K8191K88875N7327l94956N49620E73946
14714H17042P1500P5598k56847L89638l45252N321J13054p5806P371M08206k2112
14703A187713n87729L67124J89528k66599J70856l9310l9489R7407k87768j92553
$$ plain form
14775 519325 674392 490681 637611 885388 907352 419074 245257 701191 278045 820626
14765 820626 505207 771580 594186 757001 546619 910634 428408 591450 787909 633318
14755 633318 610203 899968 531242 754793 546877 356268 1011893 354235 779776 699113
14745 699113 535723 467402 547575 663760 857870 704865 622061 714183 378251 694365
14735 694365 868793 676219 1045603 1046628 580922 559825 819047 720895 540012 486601
14725 486601 657178 1029625 993096 621817 650008 938883 996210 601254 1150874 573946
14714 817042 888542 964140 707293 1096931 751679 757000 870054 794248 801619 1209825 1187713
14703 1187713 599984 967108 1156636 890037 1060893 1021583 982094 1079501 791733 599180
14693E99180L99266j76284L29509M6683m81266K5270P355j83587M20926l6638
14683I50414K14346J23103j47099l30617L12075J51862m98122P1502K0774J40132
14673A008370Q6397p7453J42169K21068n00885J34618J28103M5798l73505J44613
14663I59293J18358K81179n35959M96216m80807L14281O6539k46656j42451J89115
14653A019108K00250j03411L15896m54930K06436J44833j54341L17386J23169
14644A614396l88586L5823l29225P16203k08135j76260O275l26342N68501q3308
14634A429342n0379k35472K40725k41914k8934J43627M52118k83709J58377k92895
14624A290886J16802J36087K5688k49430L07892r8228K9409n0503J19357k00668
$$ plain form
14693 599180 998446 822162 1151671 1198354 717088 742358 749713 566126 987052 950414
14683 950414 1164760 1287863 1140764 810147 1122222 1274084 775962 847464 868238 1008370
14673 1008370 1094767 1017314 1159483 1380551 879666 1014284 1142387 1188185 814680 959293
14663 959293 1077651 1358830 822871 1319087 838280 1152561 1219100 972444 829993 1019108
14653 1019108 1219358 1115947 1431843 976913 1183349 1328182 1173841 1491227 1614396
14644 1614396 1225810 1261633 932408 1648611 1440476 1264216 1270491 944149 1512650 1429342
14634 1429342 1378963 1143491 1384216 1142302 1113368 1256995 1709113 1425404 1583781 1290886
14624 1290886 1407688 1543775 1569463 1320033 1627925 1529697 1559106 1508603 1627960 1427292
14614A427292K06595j19028r0028n7824J72735N1425P4707j14943q1920J57953
14604A626964j32439K50235M1353J38629l05955M3258J69293k768k59616M04950
14594A973904k93778L90450k68191o6087L825j91285J71910K42121j8799k21356
14584A722714J22399Q5154J25303O7401J42971j92736p419K23829l5210J2873
14574B267279p7222j1511n12668N98710J92733k91710N46963k20845K16408k09722
14564B498415J24878J19227p5965p8311q8563J37977M51335l2925j49854K13892
14554C120106N33431J52883M35512P73825P39570J535066L856039R395358J7662645
14545C8204435L316352j8560909A0265211m365579k219183r19220m64819j23897
$$ plain form
14614 1427292 1633887 1514859 1424831 1367007 1539742 1591167 1665874 1550931 1469011 1626964
14604 1626964 1494525 1744760 1786113 1924742 1618787 1662045 1831338 1828570 1568954 1973904
14594 1973904 1680126 2070576 1802385 1736298 1740123 1548838 1720748 1962869 1944070 1722714
14584 1722714 1845113 1930267 2055570 2122971 2265942 2073206 2065787 2289616 2254406 2267279
14574 2267279 2190057 2178546 1665878 2264588 2457321 2165611 2712574 2491729 2708137 2498415
14564 2498415 2623293 2742520 2666555 2588244 2499681 2637658 3088993 3056068 2906214 3120106
14554 3120106 3653537 3806420 4241932 5015757 5755327 7290393 11146432 20541790 38204435
14545 38204435 41520787 22959878 10265211 5899632 3680449 2761229 2296410 2172513
14537B172513R8721N2088q7252k11489l0531L69339k48543K56637j73827j00410
14527B097246r124J72438J39409L51339l78253j95906M71280q6681J49095J58954
14517B869797L1560m3325r9995k29197q1015K90754J22664k76439K69821J22046
14507B976671M2312l24436L35990k6138L89524k44854j93539N5634Q1416L41934
14497C434514k66669R5460K10052j32853J81393k55915k84683O26376K54899m13998
14487C448576N38749n50753L1489M87826P3560j10538M5530J05048k60457K27804
14477D036834K08097m15272J81582J20312j6752O5955K39148K14707J50602L0366
14467D815579m05624L20443l10981O3907l4133K71978R8316K34753m30235L73873
$$ plain form
14537 2172513 2271234 2323322 2236070 2024581 1994050 2363389 2114846 2371483 2197656 2097246
14527 2097246 2088122 2260560 2399969 2751308 2373055 2177149 2648429 2561748 2710843 2869797
14517 2869797 2901357 2858032 2758037 2528840 2447825 2738579 2861243 2584804 2854625 2976671
14507 2976671 3018983 2694547 3030537 3004399 3393923 3149069 2955530 3011164 3092580 3434514
14497 3434514 3167845 3263305 3473357 3340504 3521897 3265982 2981299 3607675 3862574 3448576
14487 3448576 3987325 3436572 3468061 3955887 4029447 3918909 3964439 4069487 3809030 4036834
14477 4036834 4244931 3829659 4011241 4131553 4114801 4180756 4419904 4634611 4785213 4815579
14467 4815579 4409955 4730398 4419417 4483324 4449191 4721169 4819485 5054238 4624003 4997876
14457D997876l907J923N6059J00205K88574k98536L87441k22373L3061M71718
14447E812041n4436j08456L26917m4585l94840M81206J76338o8602j13017M3517
14437F056083M42220j2306K12998J12875J05770p3345L05635k28657M35597k12432
14427G144438j56645K75608J42438O4212M5476K69681J76649j21709J19707J81536
14417H141391M27326j6318K47660l48453N42715N0091M8995J36506K09234p7019
14407I362128J16341L26623n8810L86052K55775J89934K93867k28851N55255j50584
14397A1047730N78154r3004l8746L67559L97377j48990M91105P4846Q1816N37367
14387A3295214j63294K65907M12617K20269K47723O29166k43915K77727M97145
$$ plain form
14457 4997876 4993969 4995892 5051951 5152156 5440730 5142194 5529635 5307262 5340323 5812041
14447 5812041 5757605 5649149 5976066 5931481 5536641 6017847 6194185 6125583 6012566 6056083
14437 6056083 6498303 6485997 6698995 6811870 6917640 6844295 7149930 6921273 7356870 7144438
14427 7144438 6987793 7263401 7405839 7470051 7515527 7785208 7961857 7840148 7959855 8141391
14417 8141391 8568717 8552399 8800059 8451606 8994321 9044412 9093407 9229913 9439147 9362128
14407 9362128 9478469 9805092 9746282 10132334 10388109 10578043 10871910 10643059 11198314 11047730
14397 11047730 11625884 11532880 11494134 11861693 12259070 12110080 12601185 12676031 12757847 13295214
14387 13295214 13131920 13397827 13810444 14030713 14278436 14907602 14663687 14941414 15438559
14378A5438559K81473J59592J90227K47154N54921L64608L46357K97845M21002
14369A8301738M42251J74358P07185j23844N31613N35229J17343P37815O97551
14360B2121239L98835N91995K77964L65530N11732O78001Q13009L82458N15593
14351B6656356R80325L30591Q29325N73883Q51989N42166J290192K15874J176637
14342C3447338J090876P25191J056038R25869R47972J326471O53730J269988J196996
14333D2640469J205317J273783J306549J426368J718834J332254J692149J460894
14325E4056617K022623J639543K068397J904436K154706K064691K344785K634013
14317G0889811K126202L209062K806790K942178L346048L078357L571749L728380
$$ plain form
14378 15438559 15720032 15879624 16069851 16317005 16871926 17236534 17582891 17880736 18301738
14369 18301738 18743989 18918347 19625532 19501688 20033301 20568530 20685873 21423688 22121239
14360 22121239 22520074 23112069 23390033 23755563 24267295 24945296 25758305 26140763 26656356
14351 26656356 27636681 27967272 28796597 29370480 30222469 30764635 32054827 32270701 33447338
14342 33447338 34538214 35263405 36319443 37245312 38193284 39519755 40173485 41443473 42640469
14333 42640469 43845786 45119569 46426118 47852486 49571320 50903574 52595723 54056617
14325 54056617 56079240 57718783 59787180 61691616 63846322 65911013 68255798 70889811
14317 70889811 73016013 76225075 79031865 81974043 85320091 88398448 91970197 95698577
14309I5698577L784252M171777M404275M518110M771499N218486N428318N714337
14301A33709631N954107O813022O371261P513946P620748P911319Q727248Q825369
14293A93446651R622164J0019367J0527688J0911597J1447013J2010047J2803379
14286B70787906J2659978J3644171J4006175J3747075J4373103J4388244J4104173
14279C67710825J3978660J3650182J2623455J1972103J0092426R291966O868832
14272D46188449L653856j98972o49706j371731l265041m125765m877476o949191
14264D28404423r033773j0969631j1932877j3505213j3902026j4901761j4890410
14257C39268732j5199031j4870256j3957780j3760717j3188538j3287596j2507242
$$ plain form
14309 95698577 99482829 103654606 108058881 112576991 117348490 122566976 127995294 133709631
14301 133709631 139663738 146476760 152848021 160361967 167982715 175894034 184621282 193446651
14293 193446651 203068815 213088182 223615870 234527467 245974480 257984527 270787906
14286 270787906 283447884 297092055 311098230 324845305 339218408 353606652 367710825
14279 367710825 381689485 395339667 407963122 419935225 430027651 439319617 446188449
14272 446188449 449842305 449643333 448993627 447621896 444356855 440231090 435353614 428404423
14264 428404423 419370650 408401019 396468142 382962929 369060903 354159142 339268732
14257 339268732 324069701 309199445 295241665 281480948 268292410 255004814 242497572
14250B42497572j1932272j1546646j0623079r919537r978201q935540q035838
14243A71526459q166358p850213p040402o642206o769866n166302o057323n372732
14235A18461057m939293m739068m955913l807943m095263l605519l740352l584558
14227H4993148l323727l271217k912687k837030k253484k501890k451300k379445
14219F3062368k086370k045075k051083j770801j769431j639521j097742j777629
14211D8824716j596141j750759j291195q91673m71702j503080j453074j069834
14203C8797258q77952j314227j096899k45071r79798j240608j077632q97677q20242
14194C0247152k74744n48377j085384n35115j117717k96774p95852o18682m14230
$$ plain form
14250 242497572 230565300 219018654 208395575 198476038 188497837 179562297 171526459
14243 171526459 163360101 155509888 148469486 141827280 135057414 129891112 123833789 118461057
14235 118461057 113521764 108782696 103826783 100018840 95923577 92318058 88577706 84993148
14227 84993148 81669421 78398204 75485517 72648487 70395003 67893113 65441813 63062368
14219 63062368 60975998 58930923 56879840 55109039 53339608 51700087 50602345 48824716
14211 48824716 47228575 45477816 44186621 43294948 42823246 41320166 39867092 38797258
14203 38797258 37919306 36605079 35508180 35263109 34283311 33042703 31965071 31067394 30247152
14194 30247152 29972408 29424031 28338647 27803532 26685815 26389041 25593189 24974507 24560277
14185B4560277p90816m89269n23584m93653m11956l75743n44861l02109n16408
14176B0111878o53062k433n95697m58637o54132J2551l94187n48364R6245n92205
14166A6321957m88378j15725n95059J13704j16727n58965j88277j74285l67681
14157A3830564j90518r1692j10079n67709K4908n25851J05806m04877k18647p4573
14147A1777332l02683J37905r4025n38506j64859L192p50396L86832k00379j66035
14137A0088378k43440j1458j29894l97994k6332J65329k92457j46547J5406k86413
14127H734578J54111l85531l31406L17200k85039k52669l6994l16147K97307k25810
14117G669600N7398j85839L9831j20638m154j96394l56964J08369m76754M44826
$$ plain form
14185 24560277 23769461 23280192 22756608 22262955 21850999 21475256 20930395 20628286 20111878
14176 20111878 19458816 19456383 18860686 18402049 17747917 17760468 17366281 16817917 16914162 16321957
14166 16321957 15833579 15717854 15122795 15236499 15119772 14560807 14372530 14198245 13830564
14157 13830564 13640046 13548354 13438275 12870566 12895474 12369623 12475429 12070552 11851905 11777332
14147 11777332 11474649 11612554 11518529 10980023 10815164 10818356 10067960 10454792 10254413 10088378
14137 10088378 9844938 9833480 9703586 9305592 9279260 9444589 9152132 9005585 9020991 8734578
14127 8734578 8888689 8503158 8171752 8488952 8203913 7951244 7914250 7598103 7895410 7669600
14117 7669600 7726998 7541159 7580990 7460352 7456198 7259804 6902840 7011209 6534455 6979281
14107F979281l22834j1843n9809J49295l56813j31692k17667N11974l98978j60557
14097E980357O0184k73186Q5569j94307l2591L6827k84088J56339k23202j47682
14087E164220J65434j06117O9516j51009O6161l82206L35721n24022N28867l56193
14077D810372l84705M21378k95348J70343j29611j46218q748k46350M52023k68161
14067D374975k76948J39022K25681k86672j74438r8718K35414j45757M93819j58066
14057D328312j71667m11130j60075M91905r2145k01413l66394L47493m34942j6717
14047C313227o4045R8481L57211n68499K56057J62234l51988J9176l72166L71441
14037C221129q9040M9133J35667n03243K98816j62367J66049j95342J42686p3784
$$ plain form
14107 6979281 6656447 6644604 6584795 6734090 6377277 6245585 6027918 6539892 6140914 5980357
14097 5980357 6040541 5767355 5852924 5658617 5626026 5662853 5378765 5535104 5311902 5164220
14087 5164220 5329654 5223537 5293053 5142044 5208205 4825999 5161720 4637698 5166565 4810372
14077 4810372 4425667 4847045 4551697 4722040 4592429 4446211 4437463 4191113 4643136 4374975
14067 4374975 4098027 4237049 4462730 4176058 4001620 3902902 4138316 3992559 4486378 4328312
14057 4328312 4156645 3745515 3585440 4077345 3985200 3783787 3417393 3764886 3329944 3313227
14047 3313227 3249182 3347663 3704874 3136375 3392432 3554666 3202678 3221854 2849688 3221129
14037 3221129 3132089 3181222 3316889 2813646 3112462 2950095 3116144 2920802 3063488 2989704
14027B989704l8334l60821J26038L3633j45729m3655J25970Q456J74804p9723
14017B790343k13692J47930p8017O7897o170j43569n8775j14686p8723P300J16389
14006B436227o1788k61343L46370k82477P9720L3357j87317k9657k75125K32858
13996B030825o2318K56527N1497l55847M18059p2210M89729O71849K474331P855142
13986A3757584J7603264J1254563j6893231j1704764m973818k828115j205250
13979E010233o13118m21742o25908r6781j79523j61142m73829K31330J18821j99729
13969B588612l6589q7925J38352k18036k47189J90708k23025j55103J69757K27999
13959B347561m06669K84570j44381l37598M30576j07401J42412l23420L72279
$$ plain form
14027 2989704 2951370 2590549 2716587 2750220 2604491 2560836 2686806 2695262 2870066 2790343
14017 2790343 2576651 2724581 2646564 2714461 2708291 2564722 2505947 2391261 2312538 2319838 2436227
14006 2436227 2374439 2113096 2459466 2176989 2256709 2290066 2102749 2073092 1797967 2030825
13996 2030825 1968507 2225034 2276531 1920684 2338743 2266533 2756262 3428111 5902442 13757584
13986 13757584 31360848 42615411 25722180 14017416 9043598 6215483 5010233
13979 5010233 4397115 3975373 3349465 3252684 3073161 2912019 2438190 2669520 2788341 2588612
13969 2588612 2552023 2464098 2602450 2384414 2137225 2327933 2104908 1949805 2119562 2347561
13959 2347561 1940892 2225462 2081081 1743483 2174059 2066658 2209070 1885650 2257929
13950B257929k47218l75780K85443m3151R0843K32464n48685O3272L05077l61166
13940A659028N8923K22550j63777m11259M05926j21050J14081K18226k08462k32394
13930A541792j17504Q2154L05927j65605k91887R3360o9265M74663n21678o9711
13920A262246L55747l95949L17093j07906k2862q458O05650m09735l77035K78447
13910A497238o7529j63379l2438L79165j28298K82043o00106J62475j1450K45258
13900A562979k25844K976J86737j61599k60819J78273l17037J91813n2420K44453
13890A349512K93101n55302M05941O9390o5210j44142j64847J36775l4537j39422
13880A151259k22629K39749m25563O52980l74658Q5327j44041n3544R2115q3390
$$ plain form
13950 2257929 2010711 1634931 1920374 1877223 1968066 2200530 1651845 1715117 2020194 1659028
13940 1659028 1717951 1940501 1776724 1365465 1771391 1650341 1764422 1982648 1774186 1541792
13930 1541792 1424288 1506442 1812369 1646764 1354877 1448237 1378972 1853635 1331957 1262246
13920 1262246 1617993 1222044 1539137 1431231 1408369 1399911 2005561 1595826 1218791 1497238
13910 1497238 1429709 1266330 1233892 1613057 1484759 1766802 1166696 1329171 1317721 1562979
13900 1562979 1337135 1340111 1526848 1365249 1104430 1282703 965666 1157479 1105059 1349512
13890 1349512 1642613 1087311 1493252 1562642 1497432 1353290 1188443 1325218 1290681 1151259
13880 1151259 928630 1168379 742816 1395796 1021138 1106465 962424 908880 1000995 917605
13870I17605O26863j34488m36903J90942k40532J60010J03153k73887q4197K83960
13860A112526l01955L72872n5250k88265J6624K91265l17687K46059j2848L7664
13850A101005k75127J1535K68277J27441m47597N1701J14872m7075j3232L76875
13840A268675k52339q8014j62708L14880K6458j18066K11917l64850o5914K33188
13830A003227m0209J28611j77997k45870K93813k8373Q9482k36186K0797J20385
13820I27680l40848L32587k72437L42341j94947J12076J41673l53229M00201j94470
13810I00627o5437Q5739J4796k9230k26001K60633j38657j89804Q1674j7262L17109
13799I94187j80558R8412k7283j68843O8252Q2397k40273O09311n42194k780k6262
$$ plain form
13870 917605 1544468 1409980 973077 1164019 923487 1083497 1186650 912763 828566 1112526
13860 1112526 810571 1183443 1128193 839928 856552 1147817 830130 1076189 1063341 1101005
13850 1101005 825878 837413 1105690 1233131 785534 837235 952107 905032 891800 1268675
13840 1268675 1016336 928322 765614 1080494 1106952 988886 1200803 835953 770039 1003227
13830 1003227 963018 1091629 913632 667762 961575 933202 1022684 786498 807295 927680
13820 927680 586832 919419 646982 989323 794376 906452 1048125 694896 1095097 900627
13810 900627 835190 920929 935725 906495 680494 941127 802470 612666 694340 677078 994187
13799 994187 813629 912041 884758 715915 784167 866564 626291 1235602 693408 690628 664366
13788F64366K26468K50538m41155K51970l37589L55785j41853j79300J0370j7037
13778F42563q0710m2384J97546p3055N5389L5332L91620E36533J50877J12980
13768H00390q5601j7853j85840l2468p8586M37776n5973N9205r4834C63813L27449
13757F91262O4256k5669k66923L42407j62194n7047B03490M25032j86776K77306
13747G19052l7788N4207k74003l0137J53885J95206k91534l4778K59137k19319
13737D93928J339j34335M28247k13933K45072C60097M51316j66131m0784j70377
13727D34121L03207k62793L47336G2639O79736C70691O14336l32128Q5887C61528
13716F70682m2129L9931K32828k82167r0410L18923C71715M07953k98973Q9350
$$ plain form
13788 664366 890834 1141372 700217 952187 614598 970383 828530 649230 659600 642563
13778 642563 561853 519469 717015 643960 699349 734681 1126301 536533 687410 800390
13768 800390 714789 696936 511096 478628 400042 837818 781845 841050 746216 363813 691262
13757 691262 755518 729849 462926 805333 643139 586092 203490 628522 441746 719052
13747 719052 681264 735471 461468 431331 585216 780422 488888 454110 713247 493928
13737 493928 495267 360932 789179 575246 820318 360097 811413 645282 604498 434121
13727 434121 737328 474535 821871 72639 752375 370691 985027 652899 738786 361528
13716 670682 628553 668484 901312 619145 528735 847658 371715 779668 480695 570045
13706E70045B13159K62727O886n6742K5066J66505k27300j4663k0034K18924l7172
13695E37356p6759r3369K18392M1538k13249o0553O2178J48416l168j32500R7005
13684E25287k00268J91154L19221D01557L0973K40528k95837J63569j31987j0102
13674C98701P1191K30362B66229N9198j23414M05351k40570r2547R4944J01248
13664D70439j69416L74906j45055B60260J43959r0777L1317A71173K29187J49906
13654E50266a9140F5419K81639K3085j19739P1084j47021K60533j76032K71727
13644E30695j14227D4571M59028m3830q5963J95737B32202J77493k8356p4653
13634C06686k6552M79802C39510K60441a3691j3977C01230N4118R5782J61092
$$ plain form
13706 570045 213159 475886 482772 426030 451096 617601 390301 375638 355604 574528 537356
13695 537356 460597 367228 585620 627158 413909 353356 415534 563950 560782 428282 525287
13684 525287 325019 516173 835394 401557 432530 673058 377221 540790 408803 398701
13674 398701 469892 700254 266229 325427 202013 607364 366794 274247 369191 470439
13664 470439 301023 675929 530874 260260 404219 313442 344759 171173 400360 550266
13654 550266 -19140 65419 347058 370143 250404 321488 174467 435000 258968 530695
13644 530695 416468 44571 503599 459769 373806 569543 232202 409695 381339 306686
13634 306686 280134 759936 339510 599951 -13691 -27668 301230 355348 451130 612222
13624F12222R9273o7427D5176J66643M44862D9991L37749q816g3248E25841k9208
13613D96633B07006K80129J11547B73739K87695C6953N97279B45178M30602k88463
13603C87317J1868M2108A1092L47270k3361l9435K91622A54397K96255k3686j65875
13592B61091h6426A86294J80997n8541J34889J97079j20251B19671J696K85965
13582E07332k53204J7260J0020J45313B00800J86605J14610A57706E5675M03242
13572D58917l6244m9085Q3314j02756j07241J59244r2532A43798K42677G0629
13561C12937q6603m5995J74468M16809k26110F8834K37147F7896J97488p793L1668
13550B89259K81098j90893n6404j51155h9417F87145B14801a64225E30996E0241
$$ plain form
13624 612222 711495 644068 45176 211819 656681 49991 387740 378924 -73248 525841 496633
13613 496633 207006 487135 598682 273739 561434 36953 634232 245178 675780 387317
13603 387317 399185 441293 11092 358362 335001 295566 587188 154397 450652 426966 261091
13592 261091 -86426 186294 367291 308750 443639 640718 520467 219671 221367 507332
13582 507332 254128 271388 281408 426721 200800 387405 502015 157706 55675 458917
13572 458917 422673 373588 456902 354146 246905 406149 313617 143798 386475 70629
13561 312937 226334 180339 354807 771616 545506 68834 305981 67896 265384 257591 289259
13550 289259 570357 379464 323060 171905 -89417 687145 214801 -164225 530996 50241
13539A97972J35909b1030A39421J24819h9770B94401L16760I4498b3013A95293
13528A03710L16591j99188J40472H9348L63488A65597L12233A81409h9283L2633
13518e6650A98756J10423J89884A84442G1074M0098K55294j07780K07257F6709
13507E91333B02971n6136K18930q2011j5122j3982J04164g63B23863O4303J28574
13496D16740M0220k17253J42688C1084K82690l2759J26235j25716j293B5464N2031
13485G7495P9777K25172a1242C23794j706n9387J58052j90146K58781j30866J88386
13474E46908B31115K0377b0151D27602A8678b39827B40950A16773D6147K09167
13464B55314M3676P0429D4161L99708A44003j502K53198A0942K48379K5565J31641
$$ plain form
13539 197972 333881 -21030 139421 264240 -89770 294401 611161 94498 -23013 195293
13528 103710 420301 221113 361585 89348 452836 165597 477830 181409 -89283 -56650
13518 -56650 198756 309179 499063 184442 71074 111172 366466 258686 465943 66709
13507 591333 202971 146835 365765 283754 268632 254650 358814 -763 223863 288166 416740
13496 416740 456960 239707 382395 31084 313774 281015 407250 281534 280241 25464 77495
13485 77495 157272 382444 -11242 323794 322088 262701 420753 230607 489388 358522 546908
13474 546908 231115 251492 -20151 427602 18678 -239827 240950 116773 46147 255314
13464 255314 298990 369419 44161 443869 144003 142501 395699 10942 259321 284886 416527
13453D16527r0643o1958J61349e7665C41713d8807F4698K26499K5545a51552n9229
13442b10781A3042e6512A7229M78493k31647j23575n3052N4925J51658O6795M8515
13431D09341H6507J66474m9545a10779O413E2033K46083q0399a9317C73675h1527
13419C72485b0094C49960J754j31450D1915M72075A51292c9898A28452J39429
13409B67881a39758D31271A99939b4796E99883A33518L08903B11557a02163F29475
13398G2389M10717B25713q9746A0353d8062H6234C0008K05819F7551A4556M10285
13387D24841a20157c3781A99408O8219o2258C028J58857J9202L53491A89679K27133
13376D16812i0708B67604J90018E8921K06004F8493B5368J68042I4751L81136
$$ plain form
13453 416527 325884 263926 425275 -57665 341713 -48807 64698 291197 316742 -151552 -210781
13442 -210781 13042 -56512 17229 495722 264075 140500 87448 142373 294031 360826 409341
13431 409341 86507 252981 203436 -110779 -104366 52033 298116 217717 -19317 373675 -81527
13419 372485 -20094 349960 351714 220264 41915 513990 151292 -39898 128452 267881
13409 267881 -139758 431271 199939 -24796 599883 133518 442421 211557 -102163 629475
13398 72389 483106 225713 135967 10353 -48062 86234 30008 235827 67551 14556 424841
13387 424841 -120157 -33781 199408 267627 205369 3028 161885 181087 534578 189679 416812
13376 416812 -90708 267604 457622 58921 264925 68493 25368 193410 94751 475887
13366D75887a84408D31498j77427L7116O6033A46214d595B87983I7534j149d4571
13354A62543m0146O3533L20770A72860a57696G4984K86428L0662q7256A38314
13343C45372j50173J99221m2980D9205J93898m2708o7607M32150A12062J92598
13333C04660Q2402A44631J81237j02741o3033k7606F3601K25038B3589J72122
13323A95711G6516L13677G064L24167j08781R6909A03536J78415n4524P6241j32553
13312A71115l8576a23074C6582M38443G7893M05367A38870a30940i71A7552a46970
13300b7226C18059j40795e1613k9296B54570d1701B7393P1756J54156f6960n7368
13289a24328G3410J20780n4449K54905e8074E6274R2147l6035E074J85841a65018
$$ plain form
13366 475887 -184408 431498 254071 291187 357220 146214 -4595 287983 97534 96385 -44571
13354 162543 122397 185930 506700 172860 -157696 74984 361412 392074 304818 138314
13343 345372 195199 394420 351440 49205 243103 200395 132788 564938 112062 304660
13333 304660 387062 144631 325868 223127 160094 132488 63601 288639 23589 195711
13323 195711 76516 390193 7064 331231 222450 319359 103536 281951 227427 303668 171115
13312 171115 132539 -123074 36582 475025 77893 483260 138870 -130940 -971 17552 -146970
13300 -27226 318059 177264 -51613 -80909 254570 -41701 27393 99149 253305 -66960 -124328
13289 -124328 73410 194190 139741 394646 -58074 56274 148421 112386 5074 190915 -165018
13277B78K88988A284J33616J16017q2171p3440J88514c54735f5010j8712B69522
13265C06839E9387C408M58579A48391a57431C18476D7444e4647B61492J00286
13255C61778j44492j8698J04402A23570B6231J90720j0834J49653A32383d5090
13244f5874A90740b50291A26652Q0144b1625A49589L26505B4544K6351K68519
13234C19414A56551J88258g904C07293C7514K36494J0923E6249f2518A28942L4706
13223A63648k4796O3899J18628A02587K90198A43505b07076e0400C02555I8479
13212E7605a36709C59016A62841M8511A413M877R3253b30410f4025A13J35353
13201A35466m000D7590J56119h867C96104d26513A4819f1690D4942b3156j21967
$$ plain form
13277 278 289266 1284 134900 250917 168746 95306 283820 -354735 -65010 -83722 269522
13265 306839 59387 3408 461987 148391 -157431 318476 47444 -54647 261492 361778
13255 361778 217286 198588 302990 123570 26231 216951 206117 355770 132383 -45090
13244 -65874 190740 -250291 126652 206796 -21625 149589 476094 24544 50895 319414
13234 319414 156551 344809 -7904 307293 37514 274008 284931 56249 -62518 128942 163648
13223 163648 138852 202751 321379 102587 392785 143505 -207076 -50400 302555 98479
13212 57605 -136709 359016 162841 211352 1413 6290 99543 -230410 -64025 113 135466
13201 135466 131466 47590 203709 -8867 396104 -426513 14819 -61690 44942 -23156 -145123
13190a45123M383E7933b50287F9249K82746b18464H4396Q736J02921G3394L72343
13179D45737A5352g1788k4195F4888m063d0760B35868R3542A22474a90889J9928
13168a70961n9554A71859p8821O5031O682j4605k1825J6822B2944J07409D7337
13156B81660A35839f3464B7041K28576h8492B99741g2785B56820a07394a3670
13145i518l97240B84517H9882b79813A24997L18526j95708H2341b70062A79833
13134a20836B41785i4747a8995j78118E13311C0793Q1577a40233D2669J38214
13124A80883J1901p839P3775k9127g9205j26858B1879K38268L4016C5677h1643
13112g9173j15673h8471G7720A5668a08824A11241m9269J59535a64186A73667
$$ plain form
13190 -145123 -140740 57933 -250287 69249 351995 -218464 84396 93132 196053 73394 445737
13179 445737 15352 -71788 -95983 64888 60825 -40760 235868 329410 122474 -190889 -170961
13168 -170961 -230515 171859 93038 158069 164751 150146 128321 145143 22944 130353 47337
13156 281660 135839 -63464 27041 255617 -88492 299741 -72785 256820 -107394 -13670
13145 -9518 -406758 284517 89882 -279813 124997 443523 247815 82341 -270062 179833
13134 -120836 241785 -94747 -18995 -197113 513311 30793 112370 -140233 42669 180883
13124 180883 192784 184945 258720 229593 -79205 -206063 21879 260147 294163 35677 -81643
13112 -79173 -194846 -88471 77720 15668 -108824 111241 61972 221507 -164186 173667
13101A94716i721E6124J98223b0823B45550e5771B06345G7444k8072J36906f5401
13089c17062A33350J30108a7478D96303f4913A41092o5179b52949N6276A22229
13078B43999E8081M3521L99851B4892R4678L12115A39219B86Q8218K6672N1927
13067A67103E1711j0138L59876A43411b10537a5510A04487R9552G841P0047K62833
13056C40721b02235O5333A06129a62094l8080A04894a21669A52894O1385I9763
13045a32491D4958L17234A56701e1909B82505F4840K39359i6929d2838F5727a12203
13033c9873o8256a7498B83524K06675k02262J9879b3165f391F9937J12575A54
13021a54625A50229J55989P3209j38010D235L1080b2718F7011K15977D2297j4070
$$ plain form
13101 194716 -9721 56124 254347 -20823 245550 -55771 206345 77444 49372 186278 -65401
13089 -317062 133350 263458 -17478 496303 -64913 141092 75913 -252949 -196673 122229
13078 243999 58081 101602 501453 24892 119570 431685 139219 286 88504 115176 167103
13067 167103 51711 41573 401449 143411 -210537 -15510 104487 204039 7841 77888 340721
13056 340721 -202235 -136902 106129 -162094 -200174 104894 -121669 152894 214279 99763
13045 -132491 44958 362192 156701 -51909 282505 64840 304199 -96929 -42838 65727 -112203
13033 -39873 -108129 -17498 283524 490199 287937 307816 -23165 -6391 69937 182512 154
13021 -154625 150229 306218 379427 241417 4235 35315 -22718 67011 282988 42297 28227
13010B8227a9279B0843M29016A46193J73034J029l6369b58493A92808a17259g114
12998B89587i9078a8135C9801L02550a38830B27719e7178C40029B5321L64248
12988C89569j72930K08680C2059a12820A8906Q4765e1499I7889K16571C7106J34771
12977A71877J43656d1673A48388j0742B9511J84787o4887d2292H4980K3782A7096
12965a84372D73659C0436c9102A03318f1703I129M618J7483K07351a45202F2828
12953B19826i9015A23005J06673a03378e297I5665L2768D9136J63666r5032N0975
12942A68745G2768d70120J42589H9487b25685H8650C5915P0236J93688B4346h4759
12930B44673C5312N940f2606A3715P5143a49741B69723F2948J33184c9394j3209
$$ plain form
13010 28227 -19279 20843 449859 146193 319227 320256 283887 -258493 192808 -117259 -7114
12998 289587 -99078 -18135 39801 342351 -138830 227719 -57178 340029 25321 389569
12988 389569 216639 425319 32059 -112820 18906 103671 -51499 97889 314460 37106 171877
12977 171877 315533 -41673 148388 137646 29511 214298 149411 -42292 84980 108762 17096
12965 -184372 473659 30436 -39102 103318 -61703 9129 13747 31230 238581 -145202 62828
12953 219826 -99015 123005 229678 -103378 -5297 95665 128433 49136 212802 117770 168745
12942 168745 72768 -470120 -327531 89487 -225685 88650 35915 106151 299839 24346 -84759
12930 244673 35312 41252 -62606 13715 88858 -149741 269723 62948 196132 -39394 -52603
12919e2603B29635a32024o4642C90688d288j27805B32296E871e1482n6783j27093
12908b35358f4333a0304j74934C5278a16738B07096J04293d7590C1027P1038h152
12896a48906M6471B14130p9325a33096G1517M9315E8722J94246e700B28612b11924
12884b4992m6117B10921b55313B33050A0657J22625h4635A9882e2823j33201D5521
12872A03277M8905e6335l0246L4661B03114j0375G7098L9519b73172a8482B46849
12860a93801f3715k2352j01325B06564N703b18077a923j56890N5442B05141a1113
12848a32232B32818F8481j2451J48597C0093L70585j89758B9440K84153A05389
12837b43360N4886c4023j05577j21056C7711a2597q1791j00324A20481L0754D4524
$$ plain form
12919 -52603 229635 -132024 -196666 390688 -4288 -132093 232296 5871 -51482 -108265 -235358
12908 -235358 -64333 -10304 -185238 35278 -116738 207096 311389 -47590 31027 102065 -8152
12896 -148906 -102435 214130 134805 -133096 71517 120832 58722 252968 -5700 228612 -211924
12884 -24992 -71109 210921 -255313 233050 10657 133282 -84635 19882 -52823 -186024 45521
12872 103277 152182 -56335 -86581 -51920 203114 192739 77098 116617 -273172 -18482 246849
12860 -193801 -63715 -86067 -187392 206564 212267 -218077 -1923 -158813 -103371 205141 -11113
12848 -132232 232818 68481 56030 204627 30093 400678 210920 29440 313593 105389
12837 -243360 -188474 -34023 -139600 -260656 37711 -12597 -94388 -194712 120481 151235 44524
12825a81829b3369F2410K1873b43974B03093b51426C5195N1131J47563J01241
12815C35130j22167b40635B81895a56098d97A23093a26048d6044q4720A72102
12804B77867D0663g6482J775H1945b0835q8390j6096B04896f6944I2863J55646
12793B48509A7452P1458h454n834j53352B1308e0579G6940i6226D6195K9726J67108
12781B43029A21385a162H6194a28840e2871A65209k8356b26500o3839p7704A66971
12769a58470L98A11830a87393A42619a82061j88533A58940c03057A45229M2808
12759A88037b8509G2489a52124G9537d7229j7427f709D28626G7572f6522o9268
12748a35790A22678f10H1294A6558n110a56525o3199i4856q2743c7139C4591M9283
$$ plain form
12825 -181829 -23369 62410 84283 -243974 203093 -251426 35195 86326 233889 335130
12815 335130 212963 -240635 281895 -156098 -497 123093 -126048 -46044 -130764 172102
12804 277867 40663 -76482 -74707 81945 -20835 -109225 -125321 204896 -66944 92863 248509
12793 248509 17452 88910 -8454 -14288 -167640 21308 -50579 76940 -96226 46195 75921 243029
12781 243029 121385 -1162 86194 -128840 -52871 165209 136853 -226500 -290339 -368043 166971
12769 -158470 -158072 111830 -187393 142619 -182061 -370594 158940 -303057 145229 188037
12759 188037 -28509 72489 -152124 79537 -47229 -64656 -6709 428626 77572 -66522 -135790
12748 -135790 122678 -610 81294 16558 11448 -156525 -219724 -94856 -177599 -37139 34591 83874
12736H3874a2448C01349k6648g2341A16840l3139N1110a18330G9892b75782P99
12725b74983G6837G754P8252k5273d8984B03471N5094a74192K162E3919P5611
12714A29530i2291H2409b63443G5893C1477R5046K95433j03809l0612l8203m0666
12703B08666J55396j70218J38907A34421J85844M3027j81091j945m3147b32377
12692e3618A66154E2264D107L03859j51492f5991j56775A46550J8395C096M86155
12681D89251H1232a9368P569C37824a84306A18469h1051a9009D01540A13539d116
12669A24110f1119A11285B8770J99290f4869a696C13366b21181D14905b2891A37980
12657e6786o4940B23427F7901R6403M1748a2288E6724L08686A21730A8083J29917
$$ plain form
12736 83874 -12448 301349 274701 -72341 116840 83701 134811 -118330 79892 -275782 -274983
12725 -274983 76837 7754 86006 60733 -48984 203471 258565 -174192 -172030 53919 129530
12714 129530 -92291 82409 -263443 75893 31477 126523 421956 318147 287535 249332 208666
12703 208666 364062 193844 332751 134421 320265 363292 182201 180256 137109 -232377
12692 -53618 166154 52264 4107 307966 156474 -65991 -222766 146550 164945 3096 489251
12681 489251 81232 -19368 -11799 337824 -184306 118469 -81051 -19009 401540 113539 -4116
12669 124110 -61119 111285 28770 228060 -64869 -1696 313366 -221181 414905 -22891 137980
12657 -56786 -121726 223427 67901 164304 206052 -12288 56724 365410 121730 18083 148000
12646A48000b1369A59457c5377B63239A10168N4031Q0523N4306a61519A35146
12635b2290l02818B36487I3012J9113C8479J89654A07694K81492j59460N7854
12625B87580q1373p9787b17571A46239c1995A02211L28131m0853j44871G7092
12614a24350j20787h6852F3440d16257J61109A19649b4782l2061B34828L8599
12604B73427A34132O899d6899A24535b69968B90003a08827O001M7300k27146J03601
12593a79071B64871m3734h2889A85931a04571E7143R8647b25486c3212j356F1703
12581a6365e08j67276A47023a04025m0064D8460a4223B76527R5924a6208A76984
12569B7995a05469A74840d093k22385G6023g4174A11577k2000h0482G3931A2408
$$ plain form
12646 148000 -21369 159457 -35377 263239 110168 164199 244722 299028 -161519 135146
12635 -22290 -325108 236487 93012 112125 38479 228133 107694 389186 229726 287580
12625 287580 206207 126420 -217571 146239 -31995 102211 430342 389489 244618 77092
12614 -124350 -245137 -86852 63440 -416257 -255148 119649 -24782 -56843 234828 273427
12604 273427 134132 141031 -46899 124535 -269968 290003 -108827 -102826 -55526 -282672 -179071
12593 -179071 264871 221137 -82889 185931 -104571 57143 155790 -225486 -33212 -34568 61703
12581 -16365 -508 -167784 147023 -104025 -144089 48460 -14223 276527 372451 -16208 176984
12569 27995 -105469 174840 -4093 -226478 76023 -74174 111577 89577 -80482 73931 12408
12557A75630m5878c73313A94454J07081J36984b1032A37131a19188n3599c5575
12546A37061R2441b42874g2758b7792j66984d7160r5227i388j92458A43451m8586
12535I4865C8800j3786Q7673K08668B823c4547p8465D8056J7294a90946l7420
12524b28366g6804A18409a00776d0377k3309A48883d295C23656c07299A03932
12513b1645m7959r0531k44923B68240a32949n7847D8333J87198a34822C42442
12502b39579A32379J43357p6006J3417r0726R2399n8222a25194m9539F2262M76
12491F2738a516j7305j89692J131D6469b87831B58505b02504N5226A09735M328
12480A14063l0312a06692b7121A66757a81434C0280K22541a02968A01155e06709
$$ plain form
12557 175630 129752 -373313 194454 301535 438519 -21032 137131 -119188 -172787 -35575
12546 137061 229502 -242874 -72758 -27792 -194776 -47160 -142387 -9388 -201846 143451 94865
12535 94865 38800 25014 112687 321355 2823 -34547 -113012 48056 65350 -190946 -228366
12524 -228366 -76804 118409 -100776 -40377 -63686 148883 -4295 323656 -307299 103932
12513 -21645 -69604 -160135 -405058 268240 -132949 -190796 48333 235531 -134822 342442
12502 -239579 132379 275736 199730 213147 122421 214820 156598 -125194 -174733 62262 62738
12491 62738 -1516 -18821 -208513 -207382 46469 -287831 258505 -202504 -147278 109735 114063
12480 114063 83751 -106692 -27121 166757 -181434 30280 252821 -102968 101155 -506709
12469B51187c33809N6471A2955b80818G1936k299a70847M3539L2095b4380k94402
12458c18782A50595f0649A63112h4946A74061h2101B99790A24585c11648A68251
12447A50266a86159I3194e2836l04296A08285b6447F923K07036a0428j67401h3156
12435a27914A49099c6884i790F7984D888P6670f6307B59504B320L1715P2855c2936
12422g3022j4024J2132o9826A64097K37898l5287G1683b40362e7574p9491e0852
12410b35316h550l63202E6273J65796J0851M5890a6113m9966j34309R4192k29863
12399c36059a23623p8815e2174K5246o3266A53074b70445r2330d9414A84539a27165
12387A605J10062B819N8463a06447C05943e0061k14420f4557a2037A60784e9537
$$ plain form
12469 251187 -333809 -277338 12955 -280818 71936 69637 -170847 -127308 -95213 -24380 -318782
12458 -318782 150595 -60649 163112 -84946 174061 -82101 299790 124585 -311648 168251
12447 150266 -186159 93194 -52836 -357132 108285 -26447 6923 213959 -10428 -177829 -83156
12435 -127914 149099 -36884 -9790 67984 4888 81558 -66307 259504 2320 34035 106890 -32936
12422 -73022 -87046 -74914 -144740 164097 401995 366708 71683 -240362 -57574 -137065 -50852
12410 -235316 -8550 -371752 56273 222069 232920 278810 -16113 -66079 -200388 -106196 -336059
12399 -336059 -123623 -202438 -52174 -26928 -90194 153074 -270445 -362775 -49414 184539 -127165
12387 1605 111667 2819 61282 -106447 305943 -50061 -264481 -64557 -12037 160784 -59537
12375B43557E09K4246a45930A11010a58972j5005j77233h614n4178j0424o7028
12364a40244A0074J34912Q6074A03144b53383d6596D49882C0350j0371J65139
12354A85118J79799a18679k5290R846C2416K00735e9381D0624A707d00882A03742
12342a33884A83510a34302B50193b06845A37787k1880g5197B36743N8571f790
12331A70352C2469N0046e5738a2730A14386K24801b99228b68A95606L9783A15550
12319A41800a56640l9403j15735B61495C649a16278B02496f8602j79295i2447
12308b35682E8465K41563d1217E9855P9306a57664A17200J86725D582b54449a624
12296c30279A29160F1042j4835a04843A12605d8504q783m18506K07990a8706o7056
$$ plain form
12375 243557 509 24755 -145930 111010 -158972 -173977 -351210 -8614 -62792 -73216 -140244
12364 -140244 10074 144986 231060 103144 -253383 -46596 449882 30350 19979 185118
12354 185118 364917 -118679 -143969 -134123 32416 233151 -59381 40624 1707 -400882 103742
12342 -133884 183510 -134302 250193 -206845 137787 115907 -75197 236743 295314 -6790
12331 170352 32469 82515 -55738 -12730 114386 339187 -299228 -268 195606 235389 115550
12319 141800 -156640 -196043 -311778 261495 3649 -116278 202496 -68602 -247897 -92447
12308 -235682 58465 300028 -41217 59855 139161 -157664 117200 303925 4582 -254449 -1624
12296 -330279 129160 61042 46207 -104843 112605 -48504 -57287 -475793 -267803 -18706 -85762
12285h5762B87628r9032J2785o565p4410a68795b915A60017m3235a43113D42283
12273A64459Q5696o7879J3306D8180f8293F7375K52416a68382K4046A92119E4631
12261B4171L46084A84835n2532o4851L2079J01152H805J13932K46261b07746C10477
12249H1747B5190Q9640f1203C57356j62642b7071o4477n5754C270K81173A08836
12237a60031E63442A00286J17034G7966C6894K84331a00522A65473B4753N4178
12227G8931c1793B55981K47923H0561K48809D2055b1557A66460K31721d422E6914
12215b79843A48804f3869A25577J3286f6434A36972J95488I7685L6472a01935
12204g6330b4204A83679Q2177K13868F5204e4272I7071k9550K22008L5657I0775
$$ plain form
12285 -85762 287628 188596 201381 194816 120406 -168795 -2915 160017 116782 -143113 442283
12273 164459 250155 182276 195582 48180 -68293 67375 319791 -168382 -144336 192119 54631
12261 24171 370255 184835 132303 67452 99531 200683 8805 122737 368998 -207746 310477
12249 81747 25190 114830 -61203 357356 194714 -27071 -91548 -147302 3270 284443 108836
12237 -160031 563442 100286 217320 77966 36894 321225 -100522 165473 24753 78931
12227 78931 -31793 255981 503904 80561 329370 42055 -21557 166460 398181 -4422 56914
12215 -279843 148804 -63869 125577 138863 -66434 136972 332460 97685 134157 -101935
12204 -76330 -24204 183679 265856 479724 65204 -54272 97071 67521 289529 325186 90775
12192A299a81213A4740J44155c9939l56121A61736m1071L6200q541R1376p81F7090
12179a12362B36486a14279A92803B6669f7251B54719F7501J35466q4446C1916
12168B31621r3371a74807E994L32849a75002B85469D4234K2131j2710b48809J15559
12157a33250A7314M4330g9258L3232a9167o1127I0821C6857a13270l753B33960
12145A70458e7076A41958c32161a48523G3402d5967l828m4462I9885a94312Q4092
12134a10220k3499q8820F3485j7583K32632i6593J9316B26566a13464A16165e036
12122D4918N4546j5117h1125j04469A87187e6250A8725K12052Q011D0151K60638
12111C00789g6405A70819d30384D9655P670a8899l5099B04575l0703j047N0729
$$ plain form
12192 1299 -181213 14740 158895 -39939 -396060 161736 120665 156865 148324 239700 238919 67090
12179 -112362 236486 -114279 192803 26669 -67251 254719 67501 202967 118521 31916
12168 231621 138250 -174807 5994 338843 -175002 285469 44234 66365 53655 -248809 -133250
12157 -133250 17314 61644 -79258 -46026 -19167 -80294 90821 36857 -113270 -117023 233960
12145 170458 -57076 141958 -332161 -148523 73402 -45967 -49795 -94257 99885 -194312 -110220
12134 -110220 -133719 -222539 63485 45902 278534 -96593 -77277 226566 -113464 116165 -5036
12122 44918 99464 84347 -81125 -185594 187187 -56250 18725 230777 238788 40151 300789
12111 300789 -76405 170819 -430384 49655 57325 -18899 -53998 204575 173872 172825 223554
12100B23554a09280k4103E1593a36724A1877L06998d762A74125e6780A77901a86993
12088a11357A91564g6959J4662d73j45833B517b25161H9567d6321A99042e5179
12076b03651o5366o7862B26347O7446O50962Q96037F78196H7773i5861c5723A28109
12064I8470o504f6821G5089a68400D84a65248A72079f9792A8502a04155A87216
12052b8939a0318A9174J6730E436N0934Q0238e36116F1242L012a37815B32241
12040A0229a60175a0431A61430K67275a46033B57403a29102G3379b03659E1185
12029a91864E3483a75147B1261J30143h2360A74326G0346a38034C2060K1994g4184
12017b77194A22478J1956a36054L993M0423q4441A07583N2377b50810E2046i6860
$$ plain form
12100 223554 -109280 -133383 51593 -136724 11877 318875 -4762 174125 -56780 177901 -186993
12088 -111357 191564 -76959 -62297 -473 -146306 2517 -225161 89567 -46321 199042 -55179
12076 -203651 -269017 -336879 226347 293793 944755 1840792 678196 87773 -95861 -35723 128109
12064 98470 91966 -66821 75089 -168400 484 -165248 172079 -69792 18502 -104155 187216
12052 -28939 -10318 19174 35904 5436 56370 136608 -536116 61242 64254 -137815 232241
12040 10229 -160175 -10431 161430 428705 -146033 257403 -129102 73379 -203659 51185
12029 -191864 53483 -175147 21261 151404 -82360 174326 70346 -138034 32060 54054 -74184
12017 -277194 122478 134434 -136054 -132061 -91638 -176079 107583 159960 -250810 52046 -96860
12005d1122k71005A62273d7461A33740b09729a01310j47066A0589a39054l03015
11995d42069b4442C8852b83488C1077b24687A04704i0337M948A34082e6278C1892
11983d3454A77554c33073a9851B72436A1367c40392A11081b20581g7430k29710
11973c07140d3924D7122a39955A44210M4764b12761G0086a67348P8356j80426
11963b69418B9814J09588l0707P9019c196o0513I772a76087f4274o3080A17006
11951B19277F6432i0013Q966n1600D65910E3454c12467g0008E2619a28920A62919
11939h2132b2496G2798b54722J7979a3182C14797a45672A63496A1876Q50K41710
11928B54436G1447d8870A20511P1853q625b48780R3594a0639H2831J70225G0692
$$ plain form
12005 -41122 -312127 162273 -47461 133740 -209729 -101310 -248376 10589 -139054 -442069
11995 -442069 -24442 38852 -283488 31077 -224687 104704 -90337 -85389 134082 -56278 31892
11983 -43454 177554 -333073 -19851 272436 11367 -340392 111081 -220581 -77430 -307140
11973 -307140 -43924 47122 -139955 144210 188974 -212761 70086 -167348 -88992 -269418
11963 -269418 29814 139402 108695 187714 -3196 -63709 9772 -176087 -64274 -127354 117006
11951 219277 66432 -90013 -81047 -132647 465910 53454 -312467 -70008 52619 -128920 162919
11939 -82132 -22496 72798 -254722 -236743 -13182 314797 -145672 163496 11876 12726 254436
11928 254436 71447 -48870 120511 192364 183739 -248780 -155186 -10639 82831 253056 70692
11916A23452J36653f400C1120j3397b32150e1254d55n2891A84675n3256b82014
11904B43672A6006b42924b9216j9759j36814A20739a75806l7339g0272K3860J8194
11893b8218A8181b9541E855K7599j2446b21462i923l31456J57208A40690a45943
11881B54145q5540n0413k173b87066M6862H3153i4624K2604A76509c4601l3456
11870f8057j78755Q4801A31750K1534a44630B21291g3751B74727a1008q7177C01910
11858G3889K67771b90556A56333a27177A27266A4528b7660A0699M6864B1950R7331
11847A19281C2270f3903H37N0179h2798q9796N6992B33971a48773b5973k31846
11836b57819M4450E6593c9337l109j04930C7316c3544A0688J98755K33651E28
$$ plain form
11916 123452 260105 -6400 31120 17723 -232150 -51254 -455 -53346 184675 131419 -282014
11904 243672 16006 -242924 -29216 -48975 -185789 120739 -175806 -213145 -70272 -46412 -28218
11893 -28218 18181 -29541 5855 33454 21008 -221462 -9923 -341379 -184171 140690 -145943
11881 254145 168605 118192 116019 -287066 -240204 83153 -94624 -72020 176509 -34601 -68057
11870 -68057 -246812 -162011 131750 153284 -144630 221291 -73751 274727 -11008 -98185 301910
11858 73889 341660 -290556 156333 -127177 127266 14528 -27660 10699 57563 21950 119281
11847 119281 32270 -63903 837 51016 -82798 -172594 -115602 233971 -148773 -25973 -257819
11836 -257819 -213369 56593 -39337 -42446 -147376 37316 -33544 10688 209443 443094 528
11824a13364L8949j56810n8239m2822C8747c1184k8076H841b05j87369d7930l05090
11812c53020A11095m1312c84865D7434a1120I7348D8246c5569k04664d6975k7202
11801g4177M846j68874A66231b4590j1189E2163a22253l9945A80510c85395a27705
11789A37902c20234J44307D6679j0405a4941k78134d5222j60514P1280e4858j38592
11778a93450d9480k57764A13556b31442B87010E7245d0354C7508J80900a14298
11767H039c27363R4415J9868f0543F671b63384B21737M8050a25980K3017C0399
11755A11800f7897C77187a10959j6728k389c2256A15056a40654I1984a20503F4269
11743a38142f8675B68412c69911a19515e039j06227A40985a89045A0525R0805
$$ plain form
11824 -113364 -74415 -231225 -289464 -332286 38747 -31184 -59260 8841 -205 -187574 -47930 -353020
11812 -353020 111095 69783 -384865 47434 -11120 97348 48246 -35569 -240233 -46975 -74177
11801 -74177 -69331 -238205 166231 -24590 -35779 52163 -122253 -162198 180510 -385395 -127705
11789 137902 -320234 -175927 46679 36274 -14941 -293075 -45222 -205736 -134456 -54858 -193450
11778 -193450 -49480 -307244 113556 -231442 287010 57245 -40354 37508 218408 -114298
11767 8039 -327363 -232948 -213080 -60543 6671 -263384 221737 269787 -125980 -102963 30399
11755 111800 -67897 377187 -110959 -127687 -130076 -32256 115056 -140654 91984 -120503 64269
11743 -138142 -68675 268412 -369911 -119515 -5039 -111266 140985 -189045 10525 101330
11733A01330a4121k1327n5502B12012I2004f0179B40596A06229Q8137I1315D0422
11721A81732b4079j6902j6859j1773r7495J393l9773A14976l7521r949d1313G6626
11708a63533A84757p0262A9983a83538E1785Q1825a09853c9729r9171F8521J32429
11697B00950C9470a5107p7515A07728M6587D9778J89532l2156a60224B09362p7472
11686A31890R2528a50304A82125p2529J0973K15996n5754A05654b1579A65661
11675B25179m9686i267j8972A48007L3442l5820i4746B24275h5489j76155E3549
11663A31767b05175C64839j19534l0878r2045C4388J7267K61796A50081M2836
11653A92917d3957A65358a4416A06344a94533J0718A66749A0645K90109E3131
$$ plain form
11733 101330 -14121 -35448 -90950 212012 92004 -60179 240596 106229 194366 91315 40422
11721 181732 -24079 -40981 -57840 -69613 -167108 -165715 -205488 114976 77455 67506 -41313 76626
11708 -163533 184757 114495 19983 -183538 51785 133610 -109853 -39729 -138900 68521 200950
11697 200950 39470 -15107 -92622 107728 154315 49778 239310 207154 -160224 209362 131890
11686 131890 224418 -150304 182125 109596 120569 336565 280811 105654 -21579 165661
11675 225179 175493 -9267 -28239 148007 181449 145629 -94746 224275 -85489 -261644 53549
11663 131767 -205175 364839 245305 214427 122382 34388 51655 313451 150081 192917
11653 192917 -43957 165358 -14416 106344 -194533 -183815 166749 10645 300754 53131
11642C74898a63527A60858J10225E1386a05442B5106K29672a79042A93649a37990
11631B60707I0783c71144F24184A9957J34371d78869d3169e45j55351A06966b7453
11619e39358a44486n8406E6163K6992K61153k5617j39334b14571a05180e0096
11608c5302j36523B91752o5274a37485I796M7778b00815A5621Q4530L101K38595
11597C41847A46898b9567A09085J73579b4779j68991D54341A35490D5320N9734
11587A05054d1339C3239L88658E1411L17953A62870O9728A9589J51464L1565a70256
11575C5037K40028J01625B758R1564i868B51645c42265D92565a70957E7904K5046
11564H2950A6737J49197P3490H6257K5301f8276C07745b13060L6007b7546D08898
$$ plain form
11642 374898 -163527 160858 271083 51386 -105442 25106 254778 -179042 193649 -137990
11631 260707 90783 -371144 624184 19957 154328 -478869 -43169 -545 -155896 106966 -27453
11619 -539358 -144486 -202892 56163 83155 344308 318691 179357 -214571 -105180 -50096
11608 -35302 -171825 291752 226478 -137485 9796 57574 -200815 15621 100151 103252 341847
11597 341847 146898 -29567 109085 282664 -24779 -193770 454341 135490 45320 105054
11587 105054 -41339 33239 421897 51411 369364 162870 232598 19589 171053 202618 -170256
11575 35037 275065 376690 2758 94322 -9868 251645 -342265 492565 -170957 57904 82950
11564 82950 16737 165934 239424 86257 111558 -68276 307745 -213060 -177053 -27546 408898
11552B09596h0814B72489b03569c008j31022A04936j2596i7482L2974E8547g2119
11540A36422c09237A94881o6241J61666a52905B99801a41740f824F10809I7955
11529f0158A42657a65506F1079c76460F5294J99227i2851j8334L2679D30028a97558
11517A7652b25044A1852g2429I0988b50474J04640A7952c1295a787A76216c9229
11505i1696B89579E2342J84823h9263H1269K18291A20193R6314L9975J49160a1093
11493C5679b91767E7862c22518B47366D6043a97859B02083m439G5286g6349D5215
11481c50327C16623G8327J75784n6407O8762a63888E4050b5837I6722b04647A51330
11469E5142N7608l8611J26061G9528a54520D48801j88754q7416c3535A482f2930
$$ plain form
11552 209596 -80814 272489 -203569 -3008 -134030 104936 92340 -97482 -64508 58547 -72119
11540 136422 -309237 194881 128640 290306 -152905 299801 -141740 -6824 610809 97955
11529 -60158 142657 -165506 61079 -376460 65294 264521 -92851 -111185 -78506 430028 -197558
11517 17652 -225044 11852 -72429 90988 -250474 -145834 17952 -31295 -1787 176216 -39229
11505 -91696 289579 52342 237165 -89263 81269 299560 120193 216507 256482 405642 -11093
11493 35679 -291767 57862 -322518 247366 46043 -197859 202083 197644 75286 -76349 45215
11481 -350327 316623 78327 254111 197704 266466 -163888 54050 -25837 96722 -204647 151330
11469 55142 112750 74139 200200 79528 -154520 448801 260047 172631 -33535 1482 -62930
11457D69385k15629E9735L18630J32615A54924C9536J66888F7853P6350a36413
11446a36396C87788j27715c185B1396K27299N7827m1184R123a15448B28176a58981
11434G7068J49903c07993A93511E030N4212K3812i9247c4431B7599b25894D1812
11422A09780b20062o6290a16871B65517a82695g259A50287n0124A6416J47091
11412A63507J4808a79821D5685p35J88776j16070g1587B7819m386C998K27520
11401B31518O0101b83359J23690g7099A4881a67960N7834j11298c4956B14322
11390A7706K99838A54215a14948G2490a80885B56498d18597J75751Q9639B34851
11379H5250P7299e0j03597C36866o8467D7319b9081r6858N7234j65456c9463k06228
$$ plain form
11457 469385 253756 59735 378365 510980 154924 39536 206424 67853 144203 -136413
11446 -136396 387788 260073 -3185 21396 248695 306522 265338 274461 -115448 228176 -158981
11434 77068 226971 -307993 193511 5030 59242 83054 -99247 -34431 27599 -225894 41812
11422 109780 -220062 -286352 -116871 265517 -182695 -7259 150287 100163 16416 163507
11412 163507 178315 -179821 45685 44950 233726 117656 -71587 27819 23433 3998 231518
11401 231518 291619 -283359 -159669 -77099 14881 -167960 -110126 -221424 -34956 214322
11390 17706 317544 154215 -114948 72490 -180885 256498 -418597 -242846 -153207 234851
11379 85250 162549 -50 -103647 336866 268399 47319 -29081 -125939 -68705 -234161 -39463 -245691
11367b45691A80112b19609P0709B8651K82413r6390q4933j0360m4045b75539A49435
11355a81534D5598J94533i825A30506e7610j20588P1447l5184F5603a84327P3403
11344a10924L8433r3147I3773c88935a60673A79740H5184c7146l8371o7590B23340
11332A75035i7980l3157k65864f4988h220A200c0906F2586J69963E5163a08939
11320d8860H6725b9508j01025D1275a3996A26326i4004A77000a68512l1431d4548
11308C07112a19596B5941b86490I0436a13210j27200a01317R866r8543c3164N618
11297b7546k04606J14049p4243B4599c36366B02985j1375E685a97145I4207R7266
11286A91473n5837a49216B33417d4949j9481F0593P6686a5950G3048g2896k30249
$$ plain form
11367 -245691 180112 -219609 -148900 28651 311064 214674 129741 119381 75336 -275539 149435
11355 -181534 45598 240131 -9825 130506 -57610 -178198 -106751 -141935 65603 -184327 -110924
11344 -110924 -72491 -165638 93773 -388935 -160673 179740 85184 -37146 -75517 -143107 223340
11332 175035 -97980 -131137 -397001 -64988 -8220 1200 -30906 62586 232549 55163 -108939
11320 -48860 86725 -29508 -130533 41275 -13996 126326 -94004 177000 -168512 -199943 -44548
11308 307112 -119596 25941 -286490 90436 -113210 -240410 -101317 -91451 -189994 -33164 -27546
11297 -27546 -232152 -118103 -192346 24599 -336366 202985 191610 5685 -197145 94207 191473
11286 191473 135636 -149216 233417 -44949 -64430 60593 137279 -15950 73048 -72896 -303145
11275c03145i1597B34239e2505B04175I1836i6070E9903b4942A20113E0971J93913
11264B44884d9236A37442a47124p8060R6560K782A35951m834o3667a35106A6689
11252c4612D51e9813k36847B71348c4228C41507A51552b13117c6705B79222A0939
11240b19568B63164p8019E9907e6973I2082M31a11170A40656c6005m966l3814
11229g4785k0167j525A36149p456b96130D0969b12697j56419h7926C20068A40647
11217b59880A9796r477L499L10475B5247a35256j8800L8848L8766j99950a07715
11205a08116C7183f5482A37743i1044A9032J57640A3249R0653A3170a7799j12600
11194a30399l3396K4387A7089a08117D3504D165b8445j84520B09616i1119j23162
$$ plain form
11275 -303145 -91597 234239 -52505 204175 91836 -96070 59903 -24942 120113 50971 244884
11264 244884 -49236 137442 -147124 -225184 -128624 -125842 135951 131117 67450 -135106 16689
11252 -34612 451 -59813 -296660 271348 -34228 341507 151552 -213117 -36705 279222 10939
11240 -219568 263164 185145 59907 -56973 92082 92513 -111170 140656 -36005 -40971 -74785
11229 -74785 -94952 -96477 136149 128693 -296130 40969 -212697 -369116 -87926 320068 140647
11217 -259880 19796 10319 13818 324293 25247 -135256 -154056 -115208 -76442 -276392 -107715
11205 -108116 37183 -65482 137743 -91044 19032 176672 13249 103902 13170 -17799 -130399
11194 -130399 -163795 -139408 17089 -108117 43504 4165 -28445 -212965 209616 -91119 -214281
11183b14281I9572G812L4122b5885B7416L7353a7933B63718a17951I5983a13139
11171C50422j07353r1252C269J21053a25455E222K52702c6167m0074J1483k5541
11160i0299j46437g215n0306j04723A19597a6363A38932L9242o3330a01319A13994
11148i8033L8252o818D7278g1634B17680i8002b5622l98548G1067R3420a04147
11136i9165l0534k4952e1854l8022A16134b25774R0319O3754A67a4827j34511
11125a49338A19328m0730d2828A01126b49513a12678k3894A03401a50406P3095
11115g7311k1251B10954h5319R261A11448K22063b45220B61403K899q1013F8749
11103A11609b21442D4439P8554J73702E4044K88179L0023m6646K66550A00465
$$ plain form
11183 -214281 99572 7812 41934 -25885 27416 64769 -17933 263718 -117951 95983 -113139
11171 350422 243069 151817 3269 124322 -125455 5222 257924 -36167 -76241 -64758 -90299
11160 -90299 -236736 -7215 -57521 -162244 119597 -16363 138932 178174 114844 -101319 113994
11148 -98033 -59781 -66599 47278 -71634 217680 -98002 -25622 -424170 71067 164487 -104147
11136 -99165 -129699 -154651 -51854 -89876 116134 -225774 -135455 -71701 167 -14827 -149338
11125 -149338 119328 78598 -42828 101126 -249513 -112678 -136572 103401 -150406 -77311
11115 -77311 -98562 210954 -85319 -76058 111448 333511 -245220 261403 264302 183289 68749
11103 111609 -221442 44439 122993 296695 54044 342223 372246 325600 592150 100465
11092A85059r306a06276c479A12938a32377D61736n2918A94355K8645D2573K21513
11081B64086a6407C00343N2671r6592J06460A7896L5015c5859C74768H7199J58612
11070B45811a9639F20832G5976M62559A31436Q2687K40123R0080A00686N20161
11060F20847j86997P4615J01010q4287K71428C82337K15052K09023j17704j2876
11050F75832L41066j50530K7179k96165L00807J09057D66629K50270J06972l061
11040H20810l52878M31349j05591K1529j42216J79786k71590K85500j37661K05555
11030I34593j44118l19422J65004m5280l6496N19254l46068Q7986j76905j28260
11020E10288m8087Q2539K3872J83521j72454J82057J54170j84202C41063K08167
$$ plain form
11092 185059 175753 -106276 -3479 112938 -132377 461736 408818 194355 223000 42573 264086
11081 264086 -16407 300343 353014 256422 362882 17896 52911 -35859 374768 87199 245811
11070 245811 -19639 620832 75976 538535 131436 214123 454246 544326 100686 620847
11060 620847 433850 508465 609475 525188 796616 382337 597389 806412 688708 675832
11050 675832 1016898 866368 893547 597382 898189 1007246 466629 716899 823871 820810
11040 820810 467932 899281 793690 815219 673003 852789 581199 866699 729038 934593
11030 934593 790475 471053 636057 590777 554281 1073535 727467 815453 638548 510288
11020 510288 462201 544740 568612 752133 579679 761736 915906 731704 341063 549230
11010E49230O6807P2172N9595l45645K03095B56657N81129k98730M1413J91507
11000G71976k6111j97804K73827j12669L46646j42236j95886q5149J87573j59282
10990F60885j02987L08483k0338R7025R2823j90348J21802D55315O72891l62752
10980G65454M30474n619Q9500Q4547O67222j59737m8687L32209O35072j94803
10970B595632P0074L7138m87155K62336n58070j32236R5609k72678J05416M3152
10960A759218J71577o7917J46676K08989N1652o59672k02075K46969l59492j22319
10950A173606p8059l76266k66342K06493j43614k1410B30167I5996M51595j6168
10940E31423B48611H3846L9676J46684l2463I485b36327f1562A84763a24338B04676
$$ plain form
11010 549230 616037 688209 747804 402159 605254 256657 837786 539056 580469 771976
11000 771976 745865 548061 821888 709219 1055865 913629 717743 632594 820167 660885
10990 660885 557898 866381 846043 943068 1035891 845543 967345 455315 1128206 765454
10980 765454 1195928 1190309 1279809 1364356 2031578 1871841 1823154 2155363 2790435 2595632
10970 2595632 2665706 2702844 2215689 2478025 1919955 1787719 1883328 1610650 1716066 1759218
10960 1759218 1930795 1862878 2009554 2218543 2270195 1610523 1408448 1655417 1295925 1173606
10950 1173606 1095547 719281 452939 659432 515818 494408 230167 95996 547591 531423
10940 531423 248611 83846 123522 270206 237743 9485 -236327 -61562 184763 -124338 204676
10928e7762G6373M29734H4642L906a30498b6133l38006G2051K23941A9452J00598
10917A20050c62208H8242j430J382e7460n7446a4098C9790a727p6805A24360R5794
10905B20154J64891a33121C01160I0995A5191p253P1217e6653A09001a60798g3817
10893h3697A48557B4446Q0443i0654A7974a9205k12253r1331r473a56637d4633
10881b29998l1307C6221d8299j03611j98406A09114J89954e081m59935a09939
10870g5912C12483b32832D32941A11847h6820L4663A7036M1352J13378b97494
10859a34606G1323K08943A7640b31710B57530D1087O8486b6980o1599c3219C15556
10847I3557L000a74393A19152a1491B95981A05002O2065g3632A3185b49882f145
$$ plain form
10928 -57762 76373 506107 84642 88548 -130498 -26133 -364139 72051 295992 19452 120050
10917 120050 -362208 88242 86812 88194 -57460 -114906 -14098 39790 -1727 -78532 124360 220154
10905 220154 385045 -133121 301160 90995 15191 7938 79155 -56653 109001 -160798 -73817
10893 -83697 148557 24446 104889 -90654 17974 -19205 -231458 -322789 -332262 -156637 -44633
10881 -229998 -261305 36221 -48299 -151910 -350316 109114 299068 -5081 -465016 -109939
10870 -75912 312483 -232832 432941 111847 -86820 -52157 17036 58388 171766 -297494
10859 -134606 71323 280266 17640 -231710 257530 41087 109573 -26980 -88579 -33219 315556
10847 93557 96557 -174393 119152 -11491 295981 105002 167067 -73632 13185 -249882 -6145
10835B35787i5012k2569p64B67c9207l455E6082N9887a83466A97905E8943f4615
10822g7827k64244B33639a18749k88824J58600g9869j39540f8504D7204J4346
10812F1550b3264A65319n2921b15245N0905j00718J02566J7196A21551b5029a1737
10800h5621j95761A29437e2029k216a982D7509b39203E9359B4148b65288A48528
10788A24287a54689l08083o8384e4576f600j9742B30636b2247k65097a11294A1765
10776b80288A45039d6464G8642L5334B8520d6168G1819j099K54959A17466L48156
10765D65622F0450a9883q8686A79690b78338e854k35190a10147l4542d5945A52700
10753d3833H4855M8686O6395a34035G2165A6900a29718H29h8329C6291Q9077b7962
$$ plain form
10835 235787 -95012 -117581 -118345 267 -39207 -42662 56082 115969 -183466 197905 58943 -64615
10822 -77827 -342071 233639 -118749 -407573 -248973 -79869 -219409 -68504 47204 61550
10812 61550 -23264 165319 112398 -215245 -164340 -265058 -162492 -145296 121551 -25029 -11737
10800 -85621 -281382 129437 -52029 -54245 -1982 47509 -239203 59359 24148 -265288 148528
10788 124287 -154689 -462772 -531156 -54576 -6600 -26342 230636 -22247 -287344 -111294 11765
10776 -280288 145039 -46464 78642 113976 28520 -46168 71819 70720 325679 117466 465622
10765 465622 60450 -19883 -108569 179690 -278338 -5854 -241044 -110147 -144689 -45945 152700
10753 -43833 84855 133541 199936 -134035 72165 16900 -129718 829 -88329 36291 125368 -27962
10740G7144f1708j22136b2184k04551G9474q861C3922a66777A05999a30094r7981
10729b28075J4226Q5605b5954C6104c56342g0774E7028J01534M8535d46759d3783
10717c58439i9000b9544j6073l9305A0410b2558F7951L6792a45669c0k77931H9149
10704a26832A06035f6666j09358d5821j76436k76538D6368Q5855d64467B47151
10693a47349O1436n4701G6656a76106m5068R2497A48471g5477l4059d8930n32095
10682e81025c2252k59782A20032g7728L5361l87712A75908g3826j87948K3886
10672b37888G0723Q3479d588B0642b07056J02466r1934C3142a29823A07754m3953
10661F3801b93908A9288N2327j2927a54633k66390I099Q8348b77365R4008P1111
$$ plain form
10740 77144 -61708 -183844 -22184 -226735 79474 70613 33922 -166777 105999 -130094 -228075
10729 -228075 -213849 -128244 -25954 36104 -356342 -70774 57028 158562 207097 -446759 -43783
10717 -358439 -99000 -29544 -45617 -84922 10410 -22558 67951 104743 -145669 -30 -277961 89149
10704 -126832 106035 -66666 -176024 -45821 -222257 -498795 46368 132223 -464467 247151
10693 -147349 -85913 -140614 76656 -176106 -221174 -128677 148471 -75477 -109536 -48930 -581025
10682 -581025 -32252 -292034 120032 -77728 -42367 -430079 175908 -73826 -261774 -237888
10672 -237888 70723 154202 -4588 20642 -207056 -104590 -196524 33142 -129823 107754 63801
10661 63801 -293908 19288 71615 58688 -154633 -421023 9099 97447 -277365 -183357 -112246
10650a12246B20565c62065r0637A75176l2075b19411D9748a13704j11142k1784
10640b46630A6584P8778a22326B49011c3567j84460e1674p7455E5520d578B371
10628a60983p5941P9619H9929b0729I0315a65106B21212d0711l58395G8152b97169
10616a6759j41609k42989A81138c9094B1055g7004q2290E1224K0832D101a56014
10604F33a51766f0109a6493k65803O9187A07829b40992a07749A25197J89554H2482
10592i6021G3107b98989h4227A809a59304m6963c6702B58313h0592G9725K13986
10581B93711a46355g1359A60923J5574d4145k5395K0414G0431a09717m8894N6938
10570a01673j07885A16516b2191j45039A54039D7282a75862G2b40370A05155b0405
$$ plain form
10650 -112246 220565 -362065 -452702 175176 143101 -219411 49748 -113704 -224846 -246630
10640 -246630 16584 95362 -122326 249011 -33567 -218027 -51674 -129129 55520 -4578 2371
10628 -160983 -236924 -157305 89929 -20729 90315 -165106 221212 -40711 -399106 78152 -297169
10616 -16759 -158368 -401357 181138 -39094 21055 -77004 -159294 51224 72056 4101 -156014
10604 633 -151766 -60109 -16493 -282296 -213109 107829 -240992 -107749 125197 314751 82482
10592 -96021 73107 -298989 -84227 1809 -159304 -206267 -36702 258313 -80592 79725 293711
10581 293711 -146355 -71359 160923 176497 -44145 -69540 -49126 70431 -109717 -158611 -101673
10570 -101673 -209558 116516 -22191 -167230 154039 47282 -175862 72 -240370 105155 -20405
10558F1154i3018j2348A51737L6543a61156g4203k36540H3654R6063a17466B73037
10546b27422Q2169K0645m7261f9061A52024l993a47454A05733a3661A74361a51845
10534a29140f0511B44508J028b24624A43185e1787k23550g5945j35479H7207G883
10522e0070j57432B08172k5574b19541l4766A54538E6517J38904c36449J52386
10512a84063A2759b02159G124R2552a31814a2830n8498A80035a0853k1080j51921
10501a83854h1278j41294a00016c7696C425R0640a71919H9602J19649i8503r3316
10490a91819E9278%e6252p1981H3967j4461N232K13368j01391L76150M11276B14655
10477D24983r5348e8743B38671c8855A88068q8412K511a01493A14263l3492b8263
$$ plain form
10558 61154 -93018 -105366 151737 188280 -161156 -74203 -310743 83654 179717 -117466 273037
10546 -227422 -145253 -124608 -171869 -69061 152024 148031 -147454 105733 -13661 174361 -151845
10534 -129140 -60511 244508 245536 -224624 143185 -51787 -275337 -75945 -211424 87207 7883
10522 -50070 -207502 208172 182598 -219541 -254307 154538 56517 195421 -336449 -184063
10512 -184063 12759 -202159 7124 99676 -131814 -12830 -71328 180035 -10853 -31933 -183854
10501 -183854 -81278 -222572 -100016 -37696 3425 94065 -171919 89602 209251 -98503 -191819
10490 -191819 59278 59278 -56252 -128233 83967 69506 74738 288106 186715 562865 974141 214655
10477 424983 329635 -58743 238671 -38855 188068 99656 102167 -101493 114263 80771 -28263
10465A23399B1581K81421A06683b14361B55695f9687K0195I8493f7090j36207
10455b03297q535j00855A31750i2373C49512f2911A45710F8503P2814P8273J1437
10444B31027a61288j99364b1084m8763j01564P3421G6311a8654p8485b8746H266
10432A64928D5970K07848a09674F6345a51373f660m8155k32415A28661n2914e2281
10420d18946i4702A17666B688a42198B8026R0056a35728d2979B10039l2511a44224
10408B44381L861c905m47676H8935J04316c37404C283M48595c61954A49567D4566
10396f933B27348d7032C39805j07169a29866E9925J15658e1585G9274A2177a67927
10384D7711J1944J81634J54110a4841H590J39586d811F6492P5509J81853j8737
$$ plain form
10465 123399 21581 303002 106683 -214361 255695 -69687 -49492 98493 -67090 -203297
10455 -203297 -211832 -312687 131750 -92373 349512 -62911 145710 68503 141317 219590 231027
10444 231027 -161288 -360652 -21084 -69847 -171411 -97990 76311 -18654 -97139 -28746 8266
10432 164928 45970 253818 -109674 66345 -151373 -6660 -54815 -287230 128661 75747 -52281
10420 -418946 -94702 117666 2688 -142198 28026 118082 -135728 -42979 210039 177528 -144224
10408 244381 248242 -3905 -451581 88935 193251 -337404 3283 451878 -361954 149567 44566
10396 -6933 227348 -47032 339805 232636 -129866 59925 175583 -51585 79274 12177 -167927
10384 47711 59655 241289 395399 -14841 8590 148176 -4811 66492 142001 323854 305117
10373C05117H3229L9660P28K32586L2238o460R4042L0672G9849J595j7083K14966
10361B79327d8962o6002B58939m0188J35934o6589a2185B67464I3309M81150B30130
10349E54286j50609J36554k55263j6046J73795J10035B46799K41672A31868C4109
10338C70510j64677J50702A45465J95400A07129A3672g8267B7294J73635B3603
10327A31150a50942C0475P6358c2234I3717m871G311R4488L8362a54525B613a41929
10314d7909E07107A2310J8958g082A54719n9817N5647d8120q9794n7714A35677
10302a23090B37617a07734q9519i1311k47900d2037r6928o1396B06460B901N1018
10291E3919O5737J1740o2938a30421A07259e2130A89621J00703F8352b06254A364
$$ plain form
10373 305117 83229 122889 123617 356203 388441 381981 476023 506695 79849 81444 64361 279327
10361 279327 -48962 -114964 258939 218751 354685 288096 -12185 267464 93309 574459 230130
10349 554286 403677 540231 284968 268922 442717 552752 246799 488471 131868 34109
10338 370510 205833 356535 145465 340865 107129 13672 -78267 27294 200929 23603
10327 131150 -150942 30475 106833 -32234 93717 88846 7311 101799 140161 -154525 2613 -141929
10314 -47909 507107 12310 31268 -7082 154719 94902 150549 -48120 -137914 -195628 135677
10302 -123090 237617 -107734 -197253 -91311 -339211 -42037 -138965 -200361 206460 2901 53919
10291 53919 119656 131396 68458 -130421 107259 -52130 189621 290324 68352 -206254 1364
10279C2732M8509O5045c12887a51268B78791k0754H3326C1638d7601B43096a56598
10267a51429A27729b1964o3790A36747K2943N1409q7834K64349K15215k45593
10257C57236m327o697A22463J70296m6282o7735a25504A37608j6963a82550d8436
10245A8086a62913j6760A89891a24656C1655i2737j18964P0373A4015J9676b66566
10233A16700D195b23473m1259D1722K09937c87010O057a82802J5164n0808Q4252
10222a34194A13728j5808J4879i2630k28197k0905a20456j5489o2590A56271a79872
10210A79552N4782b30627a13760k0685B2711L4947e085k5992j97621F9960K4308
10199I4268k1321a83070F3929h6694j41820K4140I2609b03636A55634a67173m9797
$$ plain form
10279 32732 81241 146286 -312887 -151268 278791 258037 83326 31638 -47601 243096 -156598
10267 -151429 127729 -21964 -85754 136747 159690 211099 123265 387614 602829 357236
10257 357236 352909 346212 122463 292759 246477 178742 -125504 137608 120645 -182550 -48436
10245 18086 -162913 -179673 189891 -124656 31655 -92737 -211701 -141328 14015 33691 -266566
10233 116700 4195 -223473 -264732 41722 251659 -387010 -380953 -182802 -167638 -218446 -134194
10222 -134194 113728 97920 112799 -92630 -320827 -341732 -120456 -135945 -198535 156271 -179872
10210 179552 234334 -230627 -113760 -134445 22711 57658 -5085 -31077 -228698 69960 94268
10199 94268 72947 -183070 63929 -86694 -228514 -204374 92609 -203636 155634 -167173 -216970
10188b16970e2210j3537p6932D1553a25213A31451o3997c5295o4258D2024a54061
10176a50174d129C24547D4665c3111j45635p079d3232A92031b31154l9133A44450
10164d7439k13737a28692j24258J15184a4477j61104b3257A66016k1518a16976
10153a99680N9247j04872E4374N0163a21553j47036c2810G4542P7813e5921j13840
10142a69761A35447D5376f0485b3344B39397f3027j90202d8542j53986P1932e8892
10130B2184d5863A4765L7619M1856b01975a4956j734j90026B64542d93787D0763
10118B07466a06771o6769K2754F6645a22693B09617a9612j88445B9663J01316
10108A30979K2796c76161a70653r9167R0107Q9692n3074J5323G0980b13762a1159
$$ plain form
10188 -216970 -52210 -65747 -142679 41553 -125213 131451 67454 -35295 -99553 42024 -154061
10176 -150174 -4129 324547 44665 -33111 -178746 -185825 -43232 192031 -231154 -270287 144450
10164 -47439 -261176 -128692 -252950 -137766 -14477 -175581 -23257 166016 144498 -116976
10153 -199680 -140433 -245305 54374 104537 -121553 -268589 -32810 74542 152355 -55921 -169761
10142 -169761 135447 45376 -60485 -23344 239397 -63027 -253229 -48542 -202528 -130596 -58892
10130 22184 -45863 14765 52384 94240 -201975 -14956 -16690 -206716 264542 -493787 40763
10118 207466 -106771 -173540 -150786 66645 -122693 209617 -19612 -208057 29663 130979
10108 130979 153775 -376161 -170653 -269820 -179713 -90021 -143095 -127772 70980 -213762 -11159
10096B59757e6305A6406b98099a25130G3617b36276B24503h6526F939a3082j679
10085a4761p0421A37882b87584e7346A21058K1543b07649j06573H4974c07017
10074b51222B6929J92986b80457J14945d7060Q713A14520c15114a47143E9397
10063a6798G72d9591A68816c47887C951a12548F8587j0318J88943j10421f15924
10051c7708a2730k59407L7844f0500l49780C60952d7574n1261A40058b5654j62253
10040a87907E0071P128O2566h1869j02289A32905b71371A07001c85147B63717
10029f9142Q044n4055e6971A48568c91595c955A91689d5895j51446D7601b41815
10017b5991j74100A71287l9574h2879m8162q8839G5279a98748p4259A43648A928
$$ plain form
10096 259757 -56305 16406 -298099 -125130 73617 -236276 224503 -86526 6939 -13082 -14761
10085 -14761 -85182 137882 -287584 -57346 121058 142601 -207649 -314222 84974 -307017
10074 -251222 26929 219915 -280457 -165512 -47060 -38347 114520 -315114 -147143 59397
10063 -16798 772 -49591 168816 -347887 3951 -112548 68587 58269 247212 136791 -615924
10051 -37708 -12730 -272137 -234293 -60500 -410280 360952 -47574 -98835 140058 -25654 -187907
10040 -187907 50071 57199 119765 -81869 -184158 132905 -271371 107001 -385147 263717
10029 -69142 -61098 -115153 -56971 148568 -391595 -3955 191689 -45895 -197341 47601 -241815
10017 -25991 -200091 171287 131713 -82879 -131041 -219880 75279 -198748 -273007 143648 1928
10005A870f8831k29603Q1438J6184i5350k02194f3428k15084H6052f1363E1056
9993i2665j75417k2535c3698j85081F6761K5832A8039f2253H6102C1852E766J98848
9981B04614f4987B01512a05639r3656p0033B53645k321d5968k7589A35651a08382
9969c0557k05694E7804d3979k22978B20021i7867l6339c6335j79535P0816B96826
9957B27014b9352k75764a5601k44375I5717b86195i0508F0547a41034C6426j3163
9946B3263a98862K9276C7244M544g205D9703J13773g8858A47605j9845c34517
9934B27351a32836A72686a27771R624A2263d63484J83574H7906b06721l0648A1248
9922D9929a10107c7184D174f7787A52620g4750A00487l2856a37993D4713b25669
$$ plain form
10005 1870 -68831 -298434 -216996 -200812 -95350 -297544 -63428 -278512 86052 -61363 51056
9993 -92665 -268082 -290617 -33698 -218779 66761 92593 18039 -62253 86102 31852 5766 204614
9981 204614 -64987 201512 -105639 -199295 -269328 253645 251324 -45968 -73557 135651 -108382
9969 -30557 -236251 57804 -43979 -266957 220021 -97867 -134206 -36335 -215870 -145054 296826
9957 227014 -29352 -305116 -15601 -259976 95717 -286195 -90508 60547 -141034 36426 23263
9946 23263 -198862 -169586 37244 41788 -7205 49703 163476 -78858 147605 127760 -334517
9934 227351 -132836 172686 -127771 -118147 12263 -463484 -279910 87906 -206721 -237369 11248
9922 49929 -110107 -37184 4174 -67787 152620 -74750 100487 67631 -137993 44713 -225669
9910a4553B70501a12321j42180E5K4876D260b59039J22033K3293A25448a37534
9898a25034N7144j22676I8028g4157A88260d48661a60199B10538a4159G2460M2710
9887A15170i7983l65255B5366h1355j73958B650a24275j73881H8943D4019b5566
9875a61893N4079k16150d2200m21664a34686A92940A5474P5866A7051b68803f5488
9863D8932Q9381a90119l2333P4353j99631G8594f2938o222C557c9607j5446l6364
9851i1417o9510j11084I5343d18774A24940b6746B04230b54363k734j7453j6128
9840b90678L6231F4804d4630p2741f85n15549a84723a8466D326P3071c855G0738
9827A06710c96392A19379B8950a25588B1431M0625P5211m6360b70339a21631K0775
$$ plain form
9910 -14553 270501 -112321 -254501 55 24931 4260 -259039 -137006 -113713 125448 -137534
9898 -125034 -67890 -190566 98028 -74157 188260 -448661 -160199 210538 -14159 72460 115170
9887 115170 -97983 -463238 25366 -81355 -255313 2650 -124275 -298156 88943 44019 -25566
9875 -161893 -107814 -323964 -42200 -463864 -134686 192940 15474 91340 17051 -268803 -65488
9863 48932 138313 -190119 -222452 -148099 -347730 78594 -62938 -69160 3557 -39607 -55053 -91417
9851 -91417 -160927 -272011 95343 -418774 124940 -26746 204230 -254363 -257097 -274550 -290678
9840 -290678 -254447 64804 -44630 -117371 -685 -516234 -184723 -18466 4326 77397 -3855 70738
9827 106710 -396392 119379 28950 -125588 21431 62056 137267 90907 -270339 -121631 -100856
9816a00856j58925A53918m9046M286K7681a415k25772B29492o8296b51685A04671
9804e1524k5522L2237D2297d4887D9213a20442m7191J721k37996a83840j6833
9793b00673f1443j26738J1696l1641d1778k0060e676F1115J56879J7986I8307
9781c29613a0087B2379a95078g619B0593b29298A4530i6834L4693k30344A72681
9769b4750j06884A31850b85645a08919n0402B1224h3480j03924Q6463j66261B27935
9757e3995A28550i8688k52934D06441f0718k64010J32038B76673A532a39859B3477
9745b9207k6255J0374l60912J00762P7815M3005I9900J15812c3592r0700M7501
9734g6791a9402E3950i2202k18845H2880C6810a31165p8483A84792a37794O1560
$$ plain form
9816 -100856 -259781 153918 104872 109158 136839 -1415 -227187 229492 161196 -251685 104671
9804 -51524 -77046 -44809 42297 -44887 49213 -120442 -167633 -165912 -403908 -183840 -200673
9793 -200673 -61443 -188181 -176485 -208126 -41778 -61838 -5676 61115 217994 235980 98307
9781 -329613 -10087 22379 -195078 -7619 20593 -229298 14530 -96834 -62141 -292485 172681
9769 -24750 -131634 131850 -285645 -108919 -159321 21224 -83480 -187404 -100941 -267202 227935
9757 -53995 128550 -98688 -351622 406441 -60718 -324728 -192690 276673 1532 -139859 23477
9745 -29207 -55462 -45088 -406000 -305238 -227423 -184418 99900 215712 -33592 -124292 -76791
9734 -76791 -19402 53950 -92202 -311047 82880 36810 -131165 -209648 184792 -137794 -76234
9723g6234A9960J01772a65161K2568A29725a73837a5949I1016h2496j48807c7795
9711a49088j45131Q0533O8389J6936K0104M8638m7669a2320n5969n0296A17066
9699a00760B81688c2169j12506j13151g331F9486J1284a91917j14611B41690i4374
9687A66194d9451o947H8359A0420J15605m4442C2609b56878b8593B07329r8292
9676A09037N094c11313K7461e547k48697J21750q3489L7145A57280a30035B74664
9664a81877L2207A11097a11264K4548A39431J34828C3917c17092f9396m4990k6367
9653a40753o8254f9590E0433L297L0270g2064o4862b1101o2511A09032a55236
9641B5494a69953J6591r9399f9789n2059H7790b7757A32299b5528B63204a60772
$$ plain form
9723 -76234 19960 121732 -165161 -142593 129725 -173837 -15949 91016 -82496 -231303 -37795
9711 -149088 -294219 -213686 -145297 -128361 -108257 -59619 -107288 -12320 -68289 -118585 117066
9699 -100760 281688 -32169 -144675 -257826 -7331 69486 80770 -191917 -306528 241690 -94374
9687 166194 -49451 -56398 88359 10420 126025 81583 32609 -256878 -28593 207329 109037
9676 109037 114131 -311313 -283852 -5547 -254244 -132494 -215983 -178838 157280 -130035 274664
9664 -181877 -149670 111097 -111264 -86716 139431 274259 33917 -317092 -69396 -114386 -140753
9653 -140753 -209007 -69590 50433 53730 84000 -72064 -136926 -21101 -83612 109032 -155236
9641 25494 -169953 -153362 -252761 -69789 -121848 87790 -27757 132299 -25528 263204 -160772
9629I617b91651o1106N3090k098e9818l23058B33967a26731H9547J17038b17800
9617B9692N901K22872j11589d22960i5470A12241e7052o6739B4794K35785b6362
9605C31789p18A19129a03330J3562n2514j95602c2378B3484d63662a39543K2048
9594a17495A79386C3654f716l52987J67322A43593a35990a9809j1874k59747A14221
9582e6639J5474B25594a03960l4358a7590n4614k61186A69576c18965D699a98696
9570A84778i2943b1321j40029L3700n5201N3172G1105c86374a74340h3410a5006
9558b4162l13530A75724a40540D3738c8561A3539a83697f0283D4877Q402b8248
9546a53040a2616A6265a46473J7594B15269b56834O3856A27693a16064k7962m5507
$$ plain form
9629 9617 -291651 -352757 -299667 -301765 -59818 -382876 233967 -126731 89547 206585 -217800
9617 29692 35593 258465 146876 -422960 -95470 112241 -57052 -123791 24794 260579 -26362
9605 331789 331071 119129 -103330 -89768 -142282 -337884 -32378 23484 -463662 -139543 -117495
9594 -117495 179386 33654 -6716 -359703 -192381 143593 -135990 -19809 -31683 -291430 114221
9582 -56639 -41165 225594 -103960 -138318 -17590 -72204 -333390 169576 -318965 4699 -198696
9570 184778 -92943 -21321 -161350 -127650 -182851 -129679 71105 -386374 -174340 -83410 -15006
9558 -24162 -337692 175724 -140540 43738 -38561 13539 -183697 -60283 44877 53279 -28248
9546 -153040 -12616 16265 -146473 -128879 215269 -256834 -192978 127693 -116064 -144026 -189533
9535a89533j15041a08556A6513J23203e4460k44620A2001R258p819a25121C2725
9523e4401m3774D5967a42578L572A43365b00581H9430K2099a63778j12721A41458
9511D8223b31510D4292a2233D60647b57355i4734k5272H0380a95737F2910M464
9500F7374Q4884a22409q8607D9205A500L10012d7013k14619A54193a02109b7352
9488d7283J1346N735B80532a55729B82625p3767a57356j42658G5470a19535b1016
9476b08444o0589R0369G8380h4171k85174j18947d5838D31170j92253b80870a04047
9464b63118a0683p528k28822E0423a69126B71436D8688j8227d71837a00778E0030
9452B8678e2291l3265j28335P2231c9569j68788p7592n0829A20462a78062f6723
$$ plain form
9535 -189533 -304574 -108556 16513 139716 -54460 -299080 12001 21259 13440 -125121 32725
9523 -54401 -98175 45967 -142578 -139006 143365 -200581 89430 111529 -163778 -276499 141458
9511 48223 -231510 44292 -12233 460647 -257355 -94734 -120006 80380 -195737 62910 67374
9500 67374 152258 -122409 -211016 49205 1500 311512 -47013 -261632 154193 -102109 -27352
9488 -47283 -35937 -30202 280532 -155729 282625 208858 -157356 -300014 75470 -119535 -21016
9476 -208444 -269033 -178664 78380 -84171 -369345 -488292 -45838 431170 238917 -280870 -104047
9464 -263118 -10683 -18211 -247033 50423 -169126 271436 48688 30461 -471837 -100778 50030
9452 28678 -52291 -85556 -213891 -141660 -39569 -208357 -285949 -336778 120462 -178062 -66723
9440b65906e3566B62961i7242j08526L2499B24450b31512c1148j98459A61221
9429A32887h2840j9051D3347h4582B9472I097O7979f293m4728j76786r8341B39229
9416d1543n5970k39447C48197D4135b09389B6921b12420A41184C2147a34238A15981
9404C7303b70143B6069a76081g393A89589b66736R8184K7076J5239N4426c733
9392a07585B23115b42911n2474q5087R0684a19346E0917C069J13570b3864J936
9381b1928k27288C9617L01501a43484o7463F167L1477p679b13026I6434l9049
9370E7385J92720c23380a22544B6958c2515C2657O5295a56409j05828i5377k77108
9359c72485A39144R4945j07445a87293B9885a01724F3326K0640q738J89323h6492
$$ plain form
9440 -265906 -53566 262961 -97242 -205768 -173269 224450 -231512 -31148 -229607 161221
9429 132887 -82840 -101891 43347 -84582 29472 9097 77076 -6293 -51021 -227807 -326148 239229
9416 -41543 -97513 -336960 348197 44135 -209389 26921 -212420 141184 32147 -134238 115981
9404 37303 -270143 26069 -176081 -7393 189589 -266736 -168552 -141476 -126237 -71811 -3733
9392 -107585 223115 -242911 -295385 -380472 -289788 -119346 50917 3069 116639 -23864 -21928
9381 -21928 -249216 39617 341118 -143484 -210947 6167 37644 29965 -213026 96434 57385
9370 57385 250105 -323380 -122544 26958 -32515 32657 97952 -156409 -262237 -95377 -372485
9359 -372485 139144 234089 126644 -187293 29885 -101724 63326 83966 75228 264551 -86492
9347f5307o2924E9034J41184b09935h6334L5486n27221C68066E6158J34829r1319
9336I9668a28428g333A09124a42335b8411l12686a25734K2189M3194k90398H1687
9324F788b70196A82361a71171m9598d2369g842A78111d13098a68849C90977A79517
9312a55547j3476g2182I9328a96823B5622J48435a5027A33011f2655A25579A4427
9300F3465G46c0727n891k48438a05509A43923a07280A16519b1013A95643a75630
9288H8957J63089f735A15100a13536F199K0600h6386B7067b17637j1998j81919
9277d11554A31954C4328K37010A01852a70649M449j52606c4406A20726a35572
9266g8500j11509A3103e869j52527P3532A19279n2778d11635a4823A7309f559
$$ plain form
9347 -65307 -128231 59034 200218 -209935 -86334 -50848 -578069 368066 56158 190987 99668
9336 99668 -128428 -7333 109124 -142335 -28411 -341097 -125734 -103545 -60351 -350749 81687
9324 6788 -270196 182361 -171171 -220769 -42369 -7842 178111 -413098 -168849 390977 179517
9312 -155547 -169023 -72182 99328 -196823 25622 174057 -15027 133011 -62655 125579 14427
9300 63465 746 -30727 -36618 -285056 -105509 143923 -107280 116519 -21013 195643 -175630
9288 88957 252046 -6735 115100 -113536 6199 26799 -86386 27067 -217637 -229635 -411554
9277 -411554 131954 34328 271338 101852 -170649 -166200 -318806 -34406 120726 -135572
9266 -78500 -190009 13103 -5869 -158396 -84864 119279 66501 -411635 -14823 17309 -6559
9254A0814J94959r5991h4770G1303g7774A74533a58131A5412c63536o6817J84237
9243b46116J03150d2218r4757A9559b11536O1568j80435e2305j6862o4634A8643
9231B64705b37735a5059n518q7373A27198b56031E7582b21992B97432c12275I4926
9219A38782O7820g4710q7611d1096n2136l22539b781m5564H4132g6145j46685
9208b22830F6293i1085j19861a3140k06691e9819k44584C1838a19379k3309j763
9197a44451j17487J22939j25292G036K51020P1154b33505e7363k84939A22064
9186I753a2197B0540d20203F972c19207A7498K33096J9377a62477B23092j9939
9175B03153a0775H387a58807j14026i9170k52018Q9064B25198a87912j8736A98268
$$ plain form
9254 10814 205773 109782 -84770 71303 -77774 174533 -158131 15412 -363536 -430353 -246116
9243 -246116 -142966 -42218 -136975 19559 -211536 -149968 -330403 -52305 -69167 -133801 18643
9231 264705 -237735 -15059 -20577 -107950 127198 -256031 57582 -221992 297432 -312275 94926
9219 138782 206602 -74710 -162321 -41096 -93232 -415771 -2781 -48345 84132 -76145 -222830
9208 -222830 66293 -91085 -210946 -13140 -219831 -59819 -304403 31838 -119379 -142688 -144451
9197 -144451 -261938 -138999 -264291 7036 258056 329210 -233505 -57363 -342302 122064
9186 9753 -12197 20540 -420203 6972 -319207 17498 250594 269971 -162477 223092 203153
9175 203153 -10775 8387 -158807 -272833 -99170 -351188 -262124 225198 -187912 -206648 198268
9163C9563b78835C14056a06235M4845j39422C0421g7044j34730H3994a27367D4029
9151A64336a36364j33695g3125D9673c25189L612d3655G0377K45255a91349O9125
9140a22224C7855c07027B84784h6290I387b00681e1808k7893d0A8536O6982J71155
9128B56673c78583h6833A42168a32837j21818B03432d7314G3458a40152j63482
9118c03634a31936B34795Q0090H3608b3502q9988j67487p5328J65090G8525a27341
9106a08824B98333a63195A11079a02134k6709B4524J68071i4095i219B39712E2308
9094e97566J44411J90056N4317A1359i0483m9233a9493p7217l6895q9304L6893
9083a86016A4489d44445B26965a64273g6741K8927n977n7121n8124e9798M787
$$ plain form
9163 39563 -278835 314056 -106235 -61390 -200812 30421 -77044 -211774 83994 -127367 44029
9151 164336 -136364 -270059 -73125 49673 -325189 -321577 -43655 70377 315632 -191349 -122224
9140 -122224 37855 -307027 284784 -86290 9387 -200681 -51808 -79701 -40 18536 85518 256673
9128 256673 -378583 -86833 142168 -132837 -254655 203432 -47314 73458 -140152 -303634
9118 -303634 -131936 234795 314885 83608 -23502 -113490 -280977 -356305 -191215 78525 -127341
9106 -108824 298333 -163195 111079 -102134 -128843 24524 192595 -94095 -9219 239712 52308
9094 -597566 -453155 -263099 -208782 11359 -90483 -139716 -19493 -96710 -133605 -222909 -186016
9083 -186016 14489 -444445 226965 -164273 -76741 -47814 -53791 -110912 -169036 -59798 -55011
9072e5011A98645a2055B7569J44332H4781O2771c6848n8615j10024L1639B26491
9060g1898A74224d36488b09039l9542i4809D9565J06926c41772A35307b54912
9049B08f8013j37452E9634b22842K3013M8537H0163b66354A72491d88062J18760
9038c69302a39123A4530K9999b90940R8838L9488A8482i2269A66568b12394f6614
9026G9342L2770f2179j37173A26637b1260m63842A20546b14168A61125a58311
9015a30946A38838a22572B05217I566c63736b0957j33308A7820J08974i3670j47623
9004b41293m3556c3826A62024I929a23379p2778h0998j29854A98682c87500A32705
8992a93080B38192j12187b4679A2224L20490A465O8752f1122C0446g9644l16862
$$ plain form
9072 -55011 198645 -12055 27569 171901 84781 147552 -36848 -95463 -205487 -173848 226491
9060 -71898 174224 -436488 -209039 -248581 -94809 49565 156491 -341772 135307 -254912
9049 208 -68013 -205465 59634 -222842 -199829 -151292 80163 -266354 172491 -488062 -369302
9038 -369302 -139123 14530 44529 -290940 -192102 -152614 18482 -92269 166568 -212394 -66614
9026 79342 112112 -62179 -199352 126637 -21260 -485102 120546 -214168 161125 -158311
9015 -130946 138838 -122572 205217 9566 -363736 -20957 -154265 17820 126794 -93670 -241293
9004 -241293 -284849 -33826 162024 9929 -123379 -196157 -80998 -210852 198682 -387500 132705
8992 -193080 238192 126005 -24679 12224 332714 1465 70217 -61122 30446 -79644 -396506
8981c96506J61880a07466j05189a4567C06011a16397J0559k30540a0348j23831
8971a34179A54344h2509a7761q8452C09878p7779H5499b41750J20367c4158k1775
8960e5933l76846r2460g6693A94634d5852j68002Q0409L9671D51270F2382K4636
8949H7018A229J68215a48826j59235G7878a9319j7180C7359F257b06925P7043
8938a29882j7830B16942q2153N35264A08685C0579L2229K0931J21629k8604J45351
8927C22115M504K13281L26688M21534K990959J0007467m186028C441148A529440
8917E20298j60815r3609a35248c3890r7760c6609C68121a79818A03996J66371
8907B70367q2543e4461A2321c00159E6147e00708a71692A50065b10137J6570B30301
$$ plain form
8981 -396506 -234626 -107466 -212655 -14567 306011 -116397 -105838 -336378 -10348 -134179
8971 -134179 154344 -82509 -17761 -106213 309878 232099 85499 -241750 -121383 -34158 -55933
8960 -55933 -432779 -525239 -76693 194634 -45852 -213854 -133445 -93774 451270 62382 87018
8949 87018 1229 169444 -148826 -308061 77878 -19319 -36499 37359 6257 -206925 -129882
8938 -129882 -147712 216942 134789 670053 108685 30579 62808 83739 205368 176764 322115
8927 322115 326619 539900 866588 1288122 4279081 14286548 10100520 3441148 1529440
8917 520298 359483 265874 -135248 -33890 -131650 -36609 368121 -179818 103996 270367
8907 270367 187824 -54461 12321 -300159 56147 -500708 -171692 150065 -210137 -193567 230301
8895A55857b65487o2531c9105j02846a3887H6611b92973a02979r3869d0237j98803
8884b39040e0730A26979a60399J8359B14919r9225a30115A5604b59382m7931a48668
8872B77065j25129a7376l52417H5279O278h671j31009K963a7977A75698n8359
8861A17339a05604m8850p6293Q1094g510j36279a2851k57838l612A00581g7830
$$ plain form
8895 155857 -265487 -328018 -39105 -141951 -13887 86611 -292973 -102979 -196848 -40237 -239040
8884 -239040 -50730 126979 -160399 -142040 214919 115694 -130115 15604 -259382 -307313 -148668
8872 277065 151936 -17376 -369793 85279 91557 -8671 -139680 -136717 -17977 175698 117339
8861 117339 -105604 -154454 -230747 -149653 -7510 -143789 -12851 -270689 -274301 100581 -77830
$$ [...]
##END NTUPLES=NMR SPECTRUM
##END=
