##TITLE=AC1535_ROEFFECT0009_8214612_rDq8SoKwYn
##JCAMPDX= 6.0         $$ Bruker NMR JCAMP-DX V2.0
##DATA TYPE= NMR SPECTRUM
##DATA CLASS= NTUPLES
##ORIGIN= BRUKER
##OWNER= Administrator
$$ 1.72 TOPSPIN		Version 2.1
$$ 2013-10-11 16:30:27.797 -0700  Administrator@X
$$ Compression mode = diff/dup
##.OBSERVE FREQUENCY= 400.02188249412
##.OBSERVE NUCLEUS= ^1H
##.ACQUISITION MODE= SIMULTANEOUS (DQD)
##.ACQUISITION SCHEME= undefined
##.AVERAGES= 64
##.DIGITISER RES= 22
##SPECTROMETER/DATA SYSTEM= spect
##.PULSE SEQUENCE= noesygpps1d.comp
##.SOLVENT NAME= COFFEE_meoh
##.SHIFT REFERENCE= INTERNAL, COFFEE_meoh, 1, 14.96082
##AUDIT TRAIL= $$ (NUMBER, WHEN, WHO, WHERE, PROCESS, VERSION, WHAT)
$$ ##TITLE= Audit trail, TOPSPIN		Version 2.1
$$ ##JCAMPDX= 5.01
$$ ##ORIGIN= Bruker BioSpin GmbH
$$ ##OWNER= Administrator
$$ $$ E:\/data/COFFEE/nmr/AC1535_ROEFFECT0009_8214612_rDq8SoKwYn/12/pdata/1/auditp.txt
$$ ##AUDIT TRAIL=  $$ (NUMBER, WHEN, WHO, WHERE, PROCESS, VERSION, WHAT)
(   1,<2013-10-11 16:30:22.641 -0700>,<Administrator>,<X>,<go>,<TOPSPIN 2.1>,
      <created by zg
	started at 2013-10-11 16:18:52.577 -0700,
	POWCHK enabled, PULCHK disabled,
       configuration hash MD5:
       C8 4E 4E 5D D3 5C D8 9E 9F 52 82 E0 59 8A DE 15
       data hash MD5: 64K
       9F 4E DB 80 39 58 24 8E 22 25 5A 8B D4 9D AC AA>)
(   2,<2013-10-11 16:30:25.781 -0700>,<Administrator>,<X>,<proc1d>,<TOPSPIN 2.1>,
      <Start of raw data processing
       efp LB = 0.3 FT_mod = 6 PKNL = 1 PHC0 = 0 PHC1 = 0 SI = 128K 
       data hash MD5: 128K
       B9 A1 1C 8C 6B B7 5A 36 8E 1E 79 1F 02 07 66 A8>)
(   3,<2013-10-11 16:30:26.781 -0700>,<Administrator>,<X>,<proc1d>,<TOPSPIN 2.1>,
      <pk PHC0 = -81.31531 PHC1 = 0 
       data hash MD5: 128K
       6A 8B F9 FD 99 06 1C 46 89 BA AA 30 7B 57 A2 18>)
(   4,<2013-10-11 16:30:27.188 -0700>,<Administrator>,<X>,<proc1d>,<TOPSPIN 2.1>,
      <abs ABSG = 1 
       data hash MD5: 128K
       D6 99 89 DF B4 91 47 3E 25 86 C4 4C A5 58 21 DE>)
(   5,<2013-10-11 16:30:27.313 -0700>,<Administrator>,<X>,<proc1d>,<TOPSPIN 2.1>,
      <abs ABSG = 2 
       data hash MD5: 128K
       F8 9A 31 B8 59 66 36 9C 05 4B D0 57 0D 39 C1 E4>)
(   6,<2013-10-11 16:30:27.391 -0700>,<Administrator>,<X>,<proc1d>,<TOPSPIN 2.1>,
      <abs ABSG = 3 
       data hash MD5: 128K
       6E D5 C5 8E C3 49 22 18 80 B2 76 F1 68 B9 45 3A>)
(   7,<2013-10-11 16:30:27.485 -0700>,<Administrator>,<X>,<proc1d>,<TOPSPIN 2.1>,
      <abs ABSG = 4 
       data hash MD5: 128K
       A6 EA BD D7 44 40 C0 16 D9 A4 87 27 49 D3 14 4A>)
(   8,<2013-10-11 16:30:27.610 -0700>,<Administrator>,<X>,<proc1d>,<TOPSPIN 2.1>,
      <abs ABSG = 5 
       data hash MD5: 128K
       FD 9A E6 6A 14 46 5C 0D F2 FE 65 1C FB 7F 39 8E>)
$$ ##END=
$$ 
$$ $$ hash MD5
$$ $$ 02 47 8C 4B 91 C6 D8 66 24 C9 A8 0D BA 53 C9 00
##$RELAX= 
##$RELAX= 
##$RELAX= 
##$RELAX= 
##$RELAX= 
##$RELAX= 
##$RELAX= 
##$RELAX= 
$$ Bruker specific parameters
$$ --------------------------
##$DU= <E:\>
##$EXPNO= 12
$$ [...]
##$TP07= 0
##$TPNAME0= <>
##$TPNAME1= <>
##$TPNAME2= <>
##$TPNAME3= <>
##$TPNAME4= <>
##$TPNAME5= <>
##$TPNAME6= <>
##$TPNAME7= <>
##$TPOAL= (0..7)
0.5 0.5 0.5 0.5 0.5 0.5 0.5 0.5
##$TPOFFS= (0..7)
0 0 0 0 0 0 0 0
##$TUNHIN= 0
##$TUNHOUT= 0
##$TUNXOUT= 0
##$USERA1= <user>
##$USERA2= <user>
##$USERA3= <user>
##$USERA4= <user>
##$USERA5= <user>
##$V9= 5
##$VALIST= <valist>
##$VCLIST= <CCCCCCCCCCCCCCC>
##$VD= 0
##$VDLIST= <DDDDDDDDDDDDDDD>
##$VPLIST= <PPPPPPPPPPPPPPP>
##$VTLIST= <TTTTTTTTTTTTTTT>
##$WBST= 1024
##$WBSW= 4
##$XGAIN= (0..3)
0 0 0 0
##$XL= 0
##$YL= 0
##$YMAX_a= 6189738
##$YMIN_a= -12981667
##$ZGOPTNS= <>
##$ZL1= 120
##$ZL2= 120
##$ZL3= 120
##$ZL4= 120
##$ABSF1= 14.96082
##$ABSF2= -5.597362
##$ABSG= 5
##$ABSL= 3
##$ALPHA= 0
##$AQORDER= 0
##$ASSFAC= 0
##$ASSFACI= 0
##$ASSFACX= 0
##$ASSWID= 0
##$AUNMP= <proc_prof1d_extract.lims>
##$AXLEFT= 0
##$AXNAME= <>
##$AXNUC= <1H>
##$AXRIGHT= 0
##$AXTYPE= 0
##$AXUNIT= <>
##$AZFE= 0.1
##$AZFW= 0.1
##$BCFW= 0
##$BC_mod= 0
##$BYTORDP= 0
##$COROFFS= 0
##$CY= 15
##$DATMOD= 1
##$DC= 0
##$DFILT= <>
##$DTYPP= 0
##$F1P= 0
##$F2P= 0
##$FCOR= 0.5
##$FTSIZE= 131072
##$FT_mod= 6
##$GAMMA= 0
##$GB= 0
##$INTBC= 1
##$INTSCL= 1
##$ISEN= 128
##$LB= 0.3
##$LEV0= 0
##$LPBIN= 0
##$MAXI= 10000
##$MC2= 0
##$MEAN= 0
##$ME_mod= 0
##$MI= 0
##$NCOEF= 0
##$NC_proc= -2
##$NLEV= 6
##$NOISF1= 0
##$NOISF2= 0
##$NSP= 0
##$NTH_PI= 0
##$NZP= 0
##$OFFSET= 14.96082
##$PC= 1
##$PHC0= -81.31531
##$PHC1= 0
##$PH_mod= 1
##$PKNL= yes
##$PPARMOD= 0
##$PPDIAG= 0
##$PPIPTYP= 0
##$PPMPNUM= 2147483647
##$PPRESOL= 1
##$PSCAL= 4
##$PSIGN= 0
##$PYNMP= <proc.py>
##$REVERSE= no
##$SF= 400.020009709769
##$SI= 131072
##$SIGF1= 0
##$SIGF2= 0
##$SINO= 400
##$SIOLD= 131072
##$SPECTYP= <>
##$SREGLST= <1H.CDCl3>
##$SSB= 0
##$STSI= 131072
##$STSR= 0
##$SW_p= 8223.68421052631
##$SYMM= 0
##$S_DEV= 0
##$TDeff= 65536
##$TDoff= 0
##$TI= <>
##$TILT= no
##$TM1= 0
##$TM2= 0
##$TOPLEV= 0
##$USERP1= <user>
##$USERP2= <user>
##$USERP3= <user>
##$USERP4= <user>
##$USERP5= <user>
##$WDW= 1
##$XDIM= 131072
##$YMAX_p= 399812725
##$YMIN_p= -14455
##$CURPLOT= <Network HP LaserJet P1505>
##$CURPRIN= <$Network HP LaserJet P1505>
##$DFORMAT= <normdp>
##$LAYOUT= <+/1D_H.xwp>
##$LFORMAT= <normlp>
##$PFORMAT= <normpl>
##$SURQMSG= 1
$$ End of Bruker specific parameters
$$ ---------------------------------
##NTUPLES= NMR SPECTRUM
##VAR_NAME=  FREQUENCY,     SPECTRUM/REAL,   SPECTRUM/IMAG
##SYMBOL=    X,             R,               I
##VAR_TYPE=  INDEPENDENT,   DEPENDENT,       DEPENDENT
##VAR_FORM=  AFFN,          ASDF,            ASDF
##VAR_DIM=   131072,        131072,          131072
##UNITS=     HZ,            ARBITRARY UNITS, ARBITRARY UNITS
##FACTOR=    0.0627417313425164, 1,          1
##FIRST=     8223.62146879497, 1976,         -64744
##LAST=      0,             3216,            -64770
##MIN=       0,             -14455,          0
##MAX=       8223.62146879497, 399812725,    0
$$ Real data points
##PAGE= N=1
##DATA TABLE= (X++(R..R)), XYDATA
$$ [...]
63924E095835m6176q3714j19374j51728j79595k02263k19397k30886k36907k37970
63914C387825k34802k28154k18655k06761j92898j77693j61910j46086j30534
63905A690332j15821j02808r1844q2262p3205o4693n7280n0960m5136l9601l4789
63894I31933l0994k8005k5606k3796k2357k0843j9273j8167j7677j7274j6515
63883F91426j5483j4172j2146r342o541m401k494QL056N809P857R656J1826J4462
63869F79521J7181J9460K0982K1911K2696K3420K3687K3415K3258K3572K3475
63858I22578K1726J8465J5153J2726J0612P864M478J090k077n335q844j2334j5431
63845I70671j7930j9864k1570k3561k5971k8210k9546l0008l0354l1066l1713
$$ y = [5095835, 5049659, 4965945, 4846571, 4694843, 4515248, 4312985, 4093588, 3862702, 3625795, 3387825, 3153023, 2924869, 2706214, 2499453, 2306555, 2128862, 1966952, 1820866, 1690332, 1574511, 1471703, 1379859, 1297597, 1224392, 1159699, 1102419, 1051459, 1006323, 966722, 931933, 900939, 872934, 847328, 823532, 801175, 780332, 761059, 742892, 725215, 707941, 691426, 675943, 661771, 649625, 640283, 633742, 629341, 626847, 626855, 629911, 635720, 643577, 653233, 665059, 679521, 696702, 716162, 737144, 759055, 781751, 805171, 828858, 852273, 875531, 899103, 922578, 944304, 962769, 977922, 990648, 1001260, 1009124, 1013602, 1014692, 1012615, 1007280, 998436, 986102, 970671, 952741, 932877, 911307, 887746, 861775, 833565, 804019, 774011, 743657, 712591, 680878]
63834F80878l1500l0203k8303k6432k4936k3867k3036k2063k0612j8737j6831
63823D14358j5187j3794j2624j1822j1439j1217j0887j0489j0120r476q055n906
63811B83342l886k966l303m081m274l552k514j997k239k782l069k888k281j469
63797B42041q97r30j325j453j226j305j989k544k243j518j342j823k276k420k529
63782B16221k541k006j052m18l67l87k34l21q26j207j081p78o43m96k34j60k77
63765B03193p8M90O66J21k88K28J136J405R67M39M6k49p4P71J486J141R9m60k46
63746B10793K1L8L07J038J718J986J997J800J252O76P32J336J679J534J665K521
63730B31093L407L486K858K180J824J926K646L767M564M522L930L330K868K577
$$ y = [680878, 649378, 619175, 590872, 564440, 539504, 515637, 492601, 470538, 449926, 431189, 414358, 399171, 385377, 372753, 360931, 349492, 338275, 327388, 316899, 306779, 297303, 289248, 283342, 279456, 276490, 273187, 269106, 264832, 261280, 258766, 256769, 254530, 251748, 248679, 245791, 243510, 242041, 241144, 240214, 238889, 237436, 236210, 234905, 232916, 230372, 228129, 226611, 225269, 223446, 221170, 218750, 216221, 213680, 211674, 210622, 210204, 209837, 209450, 209216, 208895, 208069, 206862, 205781, 205003, 204360, 203864, 203630, 203470, 203193, 203115, 203605, 204271, 204392, 204104, 204332, 205468, 206873, 207840, 208279, 208325, 208076, 208002, 208773, 210259, 211400, 211499, 211039, 210793, 210814, 210852, 211159, 212197, 213915, 215901, 217898, 219698, 220950, 221626, 222358, 223694, 225373, 226907, 228572, 231093, 234500, 237986, 240844, 243024, 244848, 246774, 249420, 253187, 257751, 262273, 266203, 269533, 272401, 274978]
63716B74978K719L241L362K370O46p38j269j372j622k062k361k284j892j451j181
63701B71084j032q27n89m75l99qQ12J691K240K442K497K553K764L243L781L913
63685B93690L503K926K487J979J062j54j207j733j646j109n18k39j84P5O45J095
63669C00672J066P69O19P60J104J447J388N76o66j491j637j826k640l569l797
63654B92775l475l434l921m301m008l164k265j732j657j689j295m65K02M07O93
63639B62671J503K262K189J679J838K812L610L652L452L590L971M463N324O464
63625C09480P090O755O162O325P324Q488R380J0066J0661J1218J1909J2940J4333
63612D32131J6066J8120K0242K2084K3780K5856K8210K9772K9750K8642K7235
$$ y = [274978, 277697, 280938, 284300, 286670, 287316, 286578, 285309, 283937, 282315, 280253, 277892, 275608, 273716, 272265, 271084, 270052, 269225, 268636, 268161, 267762, 267754, 268566, 270257, 272497, 274939, 277436, 279989, 282753, 285996, 289777, 293690, 297193, 300119, 302606, 304585, 305647, 305493, 304286, 302553, 300907, 299798, 299280, 299041, 298857, 298932, 299577, 300672, 301738, 302507, 303126, 303886, 304990, 306437, 307825, 308401, 307735, 306244, 304607, 302781, 300141, 296572, 292775, 289300, 285866, 281945, 277644, 273636, 270472, 268207, 266475, 264818, 263129, 261834, 261369, 261571, 261978, 262671, 264174, 266436, 268625, 270304, 272142, 274954, 278564, 282216, 285668, 289258, 293229, 297692, 303016, 309480, 316570, 323325, 329487, 335812, 343136, 351624, 361004, 371070, 381731, 392949, 404858, 417798, 432131, 448197, 466317, 486559, 508643, 532423, 558279, 586489, 616261, 646011, 674653, 701888]
63601G01888K5130K1224J5512R408M234L05k463l990m504m786n358n976o339o878
63587G37407q306j0744j3734j6813j9598k1616k2578k2790k2838k2867k2390k0815
63575E12318j8001j4456j1148q893p596o336m443k247m11J045K490L818M629N190
63561D55959O234P670Q367P738O790O910Q131R428J0400J1644J3538J5615J7564
63548E85988J9982K3535K7861L1936L5206L7522L8191L5992L0559K3038J4972
63537I04782P032n37o803j0418j1080r946q428p139o180n753o103p388r911j3935
63523H08193j8833k3098k5858k7822k9985l1907l2270l0788k8466k6045k3374
63512E09747k0456j7947j6217j4911j3781j3048j2486j1275r371q008p899p946
$$ y = [701888, 727018, 748242, 763754, 773162, 777396, 777701, 775238, 771248, 766744, 761958, 756600, 750624, 744285, 737407, 729101, 718357, 704623, 687810, 668212, 646596, 624018, 601228, 578390, 555523, 533133, 512318, 494317, 479861, 468713, 459820, 452224, 445888, 441445, 439198, 438787, 439832, 442322, 446140, 450769, 455959, 462193, 469863, 478230, 485968, 492758, 499668, 507799, 517227, 527627, 539271, 552809, 568424, 585988, 605970, 629505, 657366, 689302, 724508, 762030, 800221, 836213, 866772, 889810, 904782, 911814, 911277, 904474, 894056, 882976, 873030, 864602, 857463, 851283, 845530, 839427, 832039, 822128, 808193, 789360, 766262, 740404, 712582, 682597, 650690, 618420, 587632, 559166, 533121, 509747, 489291, 471344, 455127, 440216, 426435, 413387, 400901, 389626, 380255, 372247, 364348, 356402]
63500C56402o762m794l608l606l776l455l002k707k236j441p48m68m72p21j286
63485C17320j720j260M2J212J644J783K218K867L389L704L693L115K275K055K677
63470C45014L028J902m58k644l585l289k487j994k159k531k344j605j234j706
63456C23908k205j705l92P21J220J489J760J884J934K295L028L794M506N454O660
63441C54351P726Q481R288J0474J1927J3496J5437J8113K1354K4328K6008K5803
63429E46786K3889K0920J7327J3113Q598M993L665M784P282J0158J3310J6928
63417F91753K0777K4469K8023L1563L4616L6169L5475L2468K7464K0897J3494
63406I97168O430Q66k792m981o251o701o387o061o899r340j2705j6255k0150k4758
$$ y = [356402, 349640, 344846, 341238, 337632, 333856, 330401, 327399, 324692, 322456, 321015, 320267, 319799, 319327, 318606, 317320, 315600, 314340, 314382, 315594, 317238, 319021, 321239, 324106, 327495, 331199, 334892, 338007, 340282, 342337, 345014, 348042, 349944, 349486, 346842, 343257, 339968, 337481, 335487, 333328, 330797, 328453, 326848, 325614, 323908, 321703, 319998, 319606, 320327, 321547, 323036, 324796, 326680, 328614, 330909, 333937, 337731, 342237, 347691, 354351, 362077, 370558, 379846, 390320, 402247, 415743, 431180, 449293, 470647, 494975, 520983, 546786, 570675, 591595, 608922, 622035, 630633, 635626, 639291, 644075, 651357, 661515, 674825, 691753, 712530, 736999, 765022, 796585, 831201, 867370, 902845, 935313, 962777, 983674, 997168, 1003598, 1004464, 1001672, 996691, 990440, 983739, 977352, 971291, 964392, 955052, 942347, 926092, 905942, 881184]
63392H81184k9395l2588l3711l3656l3547l3338l2132k9577k6406k3601k1443
63381E51790j9454j7091j4303j1503r102p209n698m390l034j329Q23L066M932
63368D67498O361P741R400J1304J3281J5268J7260J9204K1091K2990K4915K6833
63356F63146K8816L0956L3092L4797L5711L5628L4185L0810K5331J8462J1400
63345I82334N026k42m124o451p548q146q745r286r700j0449j2163j4901j8136
63332H77469k1440k4784k7991l0384l1306l0823k9473k7507k4772k1399j8029
63321E89561j5107j2317r155n942l874l974o184r475j2655j4997j6342j6877j6849
63308D45813j6388j5456j3974j2062j0170q777p843o739n019l186k272k627l414
$$ y = [881184, 851789, 819201, 785490, 751834, 718287, 684949, 652817, 623240, 596834, 573233, 551790, 532336, 515245, 500942, 489439, 480337, 473128, 467430, 463040, 460006, 458677, 459500, 462566, 467498, 473859, 481600, 491000, 502304, 515585, 530853, 548113, 567317, 588408, 611398, 636313, 663146, 691962, 722918, 756010, 790807, 826518, 862146, 896331, 927141, 952472, 970934, 982334, 987360, 987118, 982994, 976543, 968995, 960849, 952104, 942818, 933118, 922669, 910506, 895605, 877469, 856029, 831245, 803254, 772870, 741564, 710741, 681268, 653761, 628989, 607590, 589561, 574454, 562137, 552982, 547040, 543166, 539192, 533008, 523533, 510878, 495881, 479539, 462662, 445813, 429425, 413969, 399995, 387933, 377763, 368986, 361143, 354404, 349385, 346199, 343927, 341300, 337886]
63295C37886l519k675j493p05o47j236k033k420k097j423j050j180j450j479j315
63280C13164j224j333j564j831k052k044j574o82J50L85N7k50j50O3N3J56R39
63263C02263K134K815K708K597L076L668L690L394L474L922M194M261M611N280
63249C52087N680N563N439N830O719P961R620J1550J3075J3594J3376J3453J4739
63236D78686J7301K0296K2575K3568K3735K4022K4965K6433K8084K9604L0524
63225G49793L0369K9227K7893K7154K7119K7341K7390K7169K6937K7095K7782
63214A055269K8507K8472K7230K4822K1227J6120R447J844n786j2928j9464k5240
63202A149520l0070l3982l7134l9380m0218l9282l6800l3435k9738k5858k1810
$$ y = [337886, 334367, 331692, 330199, 329494, 328847, 327611, 325578, 323158, 321061, 319638, 318588, 317408, 315958, 314479, 313164, 311940, 310607, 309043, 307212, 305160, 303116, 301542, 300860, 301010, 301395, 301452, 301202, 301052, 301115, 301168, 301324, 302263, 304397, 307212, 309920, 312517, 315593, 319261, 322951, 326345, 329819, 333741, 337935, 342196, 346807, 352087, 357767, 363330, 368769, 374599, 381318, 389279, 398899, 410449, 423524, 437118, 450494, 463947, 478686, 495987, 516283, 538858, 562426, 586161, 610183, 635148, 661581, 689665, 719269, 749793, 780162, 809389, 837282, 864436, 891555, 918896, 946286, 973455, 1000392, 1027487, 1055269, 1083776, 1112248, 1139478, 1164300, 1185527, 1201647, 1211094, 1212938, 1207152, 1194224, 1174760, 1149520, 1119450, 1085468, 1048334, 1008954, 968736, 929454, 892654, 859219, 829481, 803623, 781813]
63191G81813j7817j4125j0606o901l069L05K967N493Q560J1912J4646J6384J7647
63178H07209J9032K0525K1731K2346K2303K1777K1151K0666K0097J9068J7695
63167A033600J6428J5267J3571J0744O751J891l468q853j3925j8856k3999k8973
63155A000178l2717l4663l5377l5621l5356l4129l2076k9946k8238k6678k4578
63144F50799k1543j7992j4929j2964j1660j0205q595p462o813n888m572l877m391
63131E19908n127m792l543k537k195j926j329o09J61J243K518L364L477L235L092
63116E14940L124L269L559L940M218M298M098L452K469J850K232L209L682L238
63102E61578K544K236K102J619P82K9k39J51R97J583J202J03n77j50P82J214R70
$$ y = [781813, 763996, 749871, 739265, 732364, 729295, 729600, 732567, 738060, 746620, 758532, 773178, 789562, 807209, 826241, 846766, 868497, 890843, 913146, 934923, 956074, 976740, 996837, 1015905, 1033600, 1050028, 1065295, 1078866, 1089610, 1096361, 1098252, 1094784, 1085931, 1072006, 1053150, 1029151, 1000178, 967461, 932798, 897421, 861800, 826444, 792315, 760239, 730293, 702055, 675377, 650799, 629256, 611264, 596335, 583371, 571711, 561506, 552911, 545449, 538636, 532748, 528176, 524299, 519908, 514781, 509989, 506446, 503909, 501714, 499788, 498459, 497850, 498011, 499254, 501772, 505136, 508613, 511848, 514940, 518064, 521333, 524892, 528832, 533050, 537348, 541446, 544898, 547367, 549217, 551449, 554658, 558340, 561578, 564122, 566358, 568460, 570079, 570861, 570890, 570651, 570802, 571799, 573382, 574584, 574687, 574110, 573960, 574742, 575956, 576926]
63085E76926N65K93J11K11R29K058K890L182L604M838O518P483P099O056N676
63070F28439O579Q205R612J0510J1337J2557J4203J6116J8207K0348K2245K3786
63058H02144K5428K7924L1531L5608L9214M2167M5254M9229N3722N7586O0311
63047A270118O2615O5259O7795O9132O9125O8812O9019O9393O9250O8728O8605
63036B017851O9228P0116P0585P0403O9743O8711O6818O2937N5941M5626L2817
63025B700776J8440K754j4105l1189m6979o0587p2166q1853q8871r2195r1956
63014B142069q9578q6420q2597p7324p0193o1805n3198m4876l6531k7652j8308
63003A493587r283j393N257J1201J6803K1801K5798K8953L1790L4395L6223L6877
$$ y = [576926, 577491, 577784, 577895, 578106, 579035, 581093, 583983, 587165, 590769, 595607, 602125, 609608, 616707, 622763, 628439, 635018, 643223, 652835, 663345, 674682, 687239, 701442, 717558, 735765, 756113, 778358, 802144, 827572, 855496, 887027, 922635, 961849, 1004016, 1049270, 1098499, 1152221, 1209807, 1270118, 1332733, 1397992, 1465787, 1534919, 1604044, 1672856, 1741875, 1811268, 1880518, 1949246, 2017851, 2087079, 2157195, 2227780, 2298183, 2367926, 2436637, 2503455, 2566392, 2622333, 2667959, 2700776, 2719216, 2721970, 2707865, 2676676, 2629697, 2569110, 2496944, 2415091, 2326220, 2234025, 2142069, 2052491, 1966071, 1883474, 1806150, 1735957, 1674152, 1620954, 1576078, 1539547, 1511895, 1493587, 1484304, 1482911, 1488168, 1499369, 1516172, 1537973, 1563771, 1592724, 1624514, 1658909, 1695132, 1732009]
62991A732009L6730L6553L6743L7127L7297L6826L5288L2452K8447K3583J7904
62980B090959J1150L130o037j6038k6541l7090m7002n5505o2087o6710o9682p1226
62968A647321p1247o9597o6542o2785n8962n5294n1724m8157m4463m0598l6856
62957A041096l3742l1397k9442k7584k5997k4824k3705k2313k0992k0265j9893
62946G60942j9134j7904j6943j6696j6624j5945j4554j2918j1442j0240r228q162
62934E91152o810n369m384m049l850l157j941o67K98Q18P81J25r37j989k710k944
62918E54367k694k233k089k583l463m133m302m149l974l924l997m100m070l851
62904E04805l712m031m797n425n238m075k427j005k60j94n07q34r21o75k30J21
$$ y = [1732009, 1768739, 1805292, 1842035, 1879162, 1916459, 1953285, 1988573, 2021025, 2049472, 2073055, 2090959, 2102109, 2105239, 2099202, 2083164, 2056623, 2019533, 1972531, 1917026, 1854939, 1788229, 1718547, 1647321, 1576074, 1506477, 1439935, 1377150, 1318188, 1262894, 1211170, 1163013, 1118550, 1077952, 1041096, 1007354, 975957, 946515, 918931, 892934, 868110, 844405, 822092, 801100, 780835, 760942, 741808, 723904, 706961, 690265, 673641, 657696, 643142, 630224, 618782, 608542, 599314, 591152, 584342, 578973, 574589, 570540, 566690, 563533, 561592, 560925, 561223, 562041, 562822, 562947, 562010, 560021, 557311, 554367, 551673, 549440, 547351, 544768, 541305, 537172, 532870, 528721, 524747, 520823, 516826, 512726, 508656, 504805, 501093, 497062, 492265, 486840, 481602, 477527, 475100, 474095, 473835, 473641, 473134, 472300, 471379, 470704, 470474, 470595]
62888D70595J50r6l28l09k5M18R89J721K467K775K166P12p20j087k32Q68J129
62871D81193M83k82o26q05j283k065k753k982k612j782r57o63r46j219r22j40
62855D61639O44J187J602J934K021J827J590J514J459J129N19Rr2J9k06r57j673
62838D74165j678j121r37j681k770l148k491j371m45J13L72M54O19J190K055K612
62822D65938K499K108K017K175K154K021K286K976L409L275L269M133N449O100
62808E09809N766N261N434O317P490Q614R406R670R658R972J0779J1580J2040
62795F21796J2577J3677J5092J6252J7137J8303K0257K3318K7620L2708L7449
62784H56186M1210M4864M9864N6414O3421P0215P7288Q5086R3013J00127J06088
$$ y = [470595, 470745, 470649, 470321, 470012, 469987, 470405, 471394, 473115, 475582, 478357, 480523, 481235, 480515, 479428, 479196, 480064, 481193, 481676, 481394, 480768, 479963, 478680, 476615, 473862, 470880, 468268, 466486, 465529, 464866, 463920, 462701, 461779, 461639, 462283, 463470, 465072, 467006, 469027, 470854, 472444, 473958, 475417, 476546, 477065, 477074, 476982, 477001, 476795, 475838, 474165, 472487, 471366, 470429, 468748, 465978, 462830, 460339, 458968, 458523, 458636, 459008, 459462, 460081, 461271, 463326, 465938, 468437, 470545, 472562, 474737, 476891, 478912, 481198, 484174, 487583, 490858, 494127, 498260, 503709, 509809, 515575, 520836, 526270, 532587, 540077, 548691, 558097, 567767, 577425, 587397, 598176, 609756, 621796, 634373, 648050, 663142, 679394, 696531, 714834, 735091, 758409, 786029, 818737, 856186, 897396, 942260, 992124, 1048538, 1111959, 1182174, 1259462, 1344548, 1437561, 1537688, 1643776]
62773A643776J10805J13738J14198J11992J07253R9886Q9649P6593O1017M3219
62763B572126K3651L233j6890l5835n3100o8329q1170r1323r8587j03032j05115
62752A945629j05357j03901j00740r6343r1583q6868q1853p6220p0238o4277n8383
62741A009866n2657m7554m3279l9356l5273l1173k7460k4119k1032j8490j6787
62730F52686j5567j4279j2941j1794j0485q445n925l812k412j259j98K70N6J23
62716E66018J486M030O770Q995J0753J2432J4277J6269J8256K0198K2294K4766
62704G26544K7631L0889L4814L9696M5287N0870N5960O0631O5174O9761P4375
62693A281632P8728Q2149Q3961Q4041Q2630P9560P4071O5561N4197M0715K6000
$$ y = [1643776, 1754581, 1868319, 1982517, 2094509, 2201762, 2301648, 2391297, 2467890, 2528907, 2572126, 2595777, 2599010, 2582120, 2546285, 2493185, 2424856, 2343686, 2252363, 2153776, 2050744, 1945629, 1840272, 1736371, 1635631, 1539288, 1447705, 1360837, 1278984, 1202764, 1132526, 1068249, 1009866, 957209, 909655, 866376, 827020, 791747, 760574, 733114, 708995, 687963, 669473, 652686, 637119, 622840, 609899, 598105, 587620, 579175, 573250, 569438, 567026, 565767, 565569, 565839, 565895, 566018, 567504, 571534, 578304, 587299, 598052, 610484, 624761, 641030, 659286, 679484, 701778, 726544, 754175, 785064, 819878, 859574, 904861, 955731, 1011691, 1072322, 1137496, 1207257, 1281632, 1360360, 1442509, 1526470, 1610511, 1693141, 1772701, 1846772, 1912333, 1966530, 2007245, 2033245]
62682B033245J0872m179j9149l3978m7818n9395o8281p5159q0527q3901q4754
62671A486976q3619q1465p8499p4377o9340o4224n9385n4461m9285m4313l9897
62660G88111l5864l2149k9207k7314k5819k3714k0762j7599j4889j2880j1694
62649E36220j1472j2002j2578j2528j1677j0226q383o426m862m119m034l937l358
62636D30618k462j678j152o96j28N46J172J506J281M41o28j299j206n66K5J30
62620D25904j65l47j3P27J387J703J908K384L214M194N156O110P122Q208R296
62605D76788J0262J1086J2021J3399J5194J7029J8816K1071K4306K8280L2241
62594F80493L5845L9392M3235M7287N1158N4338N6283N6595N5268N2434M7877
$$ y = [2033245, 2044117, 2039938, 2020789, 1986811, 1938993, 1879598, 1811317, 1736158, 1655631, 1571730, 1486976, 1403357, 1321892, 1243393, 1169016, 1099676, 1035452, 976067, 921606, 872321, 828008, 788111, 752247, 720098, 690891, 663577, 637758, 614044, 593282, 575683, 560794, 547914, 536220, 524748, 512746, 500168, 487640, 475963, 465737, 457354, 450928, 446066, 441947, 437913, 433976, 430618, 428156, 426478, 425326, 424630, 424502, 425048, 426220, 427726, 429007, 429448, 428820, 427521, 426315, 425749, 425774, 425904, 425739, 425392, 425379, 426106, 427493, 429196, 431104, 433488, 436702, 440896, 446052, 452162, 459284, 467492, 476788, 487050, 498136, 510157, 523556, 538750, 555779, 574595, 595666, 619972, 648252, 680493, 716338, 755730, 798965, 846252, 897410, 951748, 1008031, 1064626, 1119894, 1172328, 1220205]
62583A220205M1236L2731K3250J3485L474o765j6614k5306l2598l8548m2955m5675
62571A125920m7251m8468m9202m8455m5918m2761m0431l9011l7440l4997l1924
62560F60062k8629k5132k1491j8170j5522j3360j1400r773q669p859p070o480
62548D86507o249n882m785l327k521k594k699k160j212k80N81J146Q05m61j650
62533D55219j920j605j321q25L49J726K485K897M022O146Q555J0729J2733J4473
62519E13663J5767J7208J9840K3631K7359L0334L3196L6561L9952M2714M5021
62508H45246M7173M8681M8802M7441M4762M0530L4683K8014K1409J4717P168j272
62496A227354r675j7055k2948k7221k9971l1408l1450k9725k6378k2414j8604
$$ y = [1220205, 1261441, 1294172, 1317422, 1330907, 1334381, 1327616, 1311002, 1285696, 1253098, 1214550, 1171595, 1125920, 1078669, 1030201, 980999, 932544, 886626, 843865, 803434, 764423, 726983, 691986, 660062, 631433, 606301, 584810, 566640, 551118, 537758, 526358, 516585, 507916, 500057, 492987, 486507, 480258, 474376, 469591, 466264, 463743, 461149, 458450, 456290, 455078, 454798, 455379, 456525, 457330, 456869, 455219, 453299, 451694, 450373, 449548, 449897, 451623, 454108, 457005, 461027, 467173, 475728, 486457, 499190, 513663, 529430, 546638, 566478, 590109, 617468, 647802, 680998, 717559, 757511, 800225, 845246, 892419, 941100, 989902, 1037343, 1082105, 1122635, 1157318, 1185332, 1206741, 1221458, 1228626, 1227354, 1217679, 1200624, 1177676, 1150455, 1120484, 1089076, 1057626, 1027901, 1001523, 979109, 960505]
62485I60505j4616r902m970p54K882O852J1189J4828J7150J8584J9349J8698J6024
62472A055819J1960P658L485j017o235j2084j8172k3943k8827l2560l5252l7009
62460H83823l7777l7712l7218l6342l4527l1414k7599k4157k1523j9207j6546
62449E59801j3466j0426p878n858m023k108k28J327K558L733M986O165P083P660
62435E49326P772P353O632N935N100L590J278j243l418n381p440r359j0601j1076
62421E38468j1119j0940j0510r954r570r393r151q717q264p904p431o642n643
62408D23230m703l943l307k736k238j866j687j734j905j973j743j170l62M73J106
62393C95442J424J543J649J758J719J461J137R54R96J276J801K461K985L228L488
$$ y = [960505, 945889, 935987, 931017, 930263, 933145, 939997, 951186, 966014, 983164, 1001748, 1021097, 1039795, 1055819, 1067779, 1075437, 1078922, 1077905, 1071670, 1059586, 1041414, 1017471, 988644, 956084, 920832, 883823, 846046, 808334, 771116, 734774, 700247, 668833, 641234, 617077, 595554, 576347, 559801, 546335, 535909, 528031, 522173, 518150, 516042, 515814, 517141, 519699, 523432, 528418, 534583, 541666, 549326, 557098, 564451, 571083, 577018, 582118, 585708, 586986, 585743, 582325, 576944, 569504, 560145, 549544, 538468, 527349, 516409, 505899, 495945, 486375, 476982, 467831, 459114, 450850, 442946, 435515, 428873, 423230, 418527, 414584, 411277, 408541, 406303, 404437, 402750, 401016, 399111, 397138, 395395, 394225, 393863, 394336, 395442, 396866, 398409, 400058, 401816, 403535, 404996, 406133, 407087, 408083, 409359, 411160, 413621, 416606, 419834, 423322]
62378D23322M193N263O091O341O486P190Q295Q959Q819Q575R151J0586J2060J2862
62364E38193J3083J3486J4931J7770K1502K5131K8175L1208L5121L9954M4832
62353H23386M8934N2047N4150N4935N3974N1067M6197L9552L1717K3520J5460
62342A294939P553m9o736j2107j6661k1260k6104l0603l4179l6664l7955l7847
62330A042327l6415l4208l1792k9252k6301k2761j8908j5522j3588j3621j5142
62319G84817j7002j8327j9013j9362j9565j9634j9502j8972j7927j6701j5953
62308E82859j5813j5556j4479j2805j1243r916q389o589n028l955l028k030j352
62295D72676j346j688j768j368n74N49J754K452K324J855J748K003K162K143K230
$$ y = [423322, 427515, 432778, 438869, 445210, 451696, 458886, 467181, 476140, 484959, 493534, 502685, 513271, 525331, 538193, 551276, 564762, 579693, 597463, 618965, 644096, 672271, 703479, 738600, 778554, 823386, 872320, 924367, 978517, 1033452, 1087426, 1138493, 1184690, 1224242, 1255959, 1279479, 1294939, 1302492, 1302443, 1295707, 1283600, 1266939, 1245679, 1219575, 1188972, 1154793, 1118129, 1080174, 1042327, 1005912, 971704, 939912, 910660, 884359, 861598, 842690, 827168, 813580, 799959, 784817, 767815, 749488, 730475, 711113, 691548, 671914, 652412, 633440, 615513, 598812, 582859, 567046, 551490, 537011, 524206, 512963, 503047, 494658, 488069, 483041, 479086, 476058, 474028, 472676, 471330, 469642, 467874, 466506, 465932, 466481, 468235, 470687, 473011, 474866, 476614, 478617, 480779, 482922, 485152]
62280D85152K363K187J819J806K277K745K948L122L316L170K745K806L803N261
62266E25520O670Q329J0653J3248J5456J7430J9933K3261K7097L1185L5494L9872
62254G74148M4217M8768N3551N7686O0003O0190N8599N5140M9334M1536L3100
62243A336272K5055J7325R507J550o603j5205k3972l1865l8170m3242m7590n0832
62231A132230n2178n1498m9298m5957m1696l7046l2627k8571k4579k0581j6872
62220G31327j3675j1034r015p684o882o314n830n424n124n081n494o193o618o610
62206F30349o847p928r352r961r373q353p719p476p127o340n075l449j685l9J331
62191E40956K319K805K891L128M068N597P049P987Q551Q995R333R499R431Q852
$$ y = [485152, 487515, 489702, 491521, 493327, 495604, 498349, 501297, 504419, 507735, 510905, 513650, 516456, 520259, 525520, 532190, 540519, 551172, 564420, 579876, 597306, 617239, 640500, 667597, 698782, 734276, 774148, 818365, 867133, 920684, 978370, 1038373, 1098563, 1157162, 1212302, 1261636, 1303172, 1336272, 1361327, 1378652, 1388159, 1389709, 1383106, 1367901, 1343929, 1312064, 1273894, 1230652, 1183062, 1132230, 1080052, 1028554, 979256, 933299, 891603, 854557, 821930, 793359, 768780, 748199, 731327, 717652, 706618, 697603, 689919, 683037, 676723, 670893, 665469, 660345, 655264, 649770, 643577, 636959, 630349, 623502, 615574, 606222, 596261, 586888, 578535, 570816, 563340, 556213, 549873, 544798, 541349, 539664, 539625, 540956, 543275, 546080, 548971, 552099, 556167, 561764, 568813, 576800, 585351, 594346, 603679, 613178, 622609, 631461]
62177F31461P388N188L176K356K904M176N507O886Q815J1642J5107J8656K2102
62164G45364K5779K9881L3955L7319L9768M1397M1873M0434L6741L1309K5000
62153A128820J8373J1801N811Q57l214p184j1796j6997k1938k5821k8693l1151
62141A018868l3202l3941l2690k9972k6813k3466j9590j5427j1920r503p739o276
62129G68329n327m813l943k340q40l86n88k46J010K467L651N030P071R261J0425
62114G88761R802P597M624J646r50k951m044m040l358k837k929l452m319n854
62100G77696p973r626r739q428o613m738k603k58J792L342M675N896O704O979
62086G57106O943O646O034N651O409Q266R905J0301R966J0044J0737J1449J1988
$$ y = [631461, 638849, 644037, 647213, 649569, 652473, 656649, 662156, 669042, 677857, 689499, 704606, 723262, 745364, 771143, 801024, 834979, 872298, 912066, 953463, 995336, 1035770, 1072511, 1103820, 1128820, 1147193, 1158994, 1164805, 1165662, 1162448, 1155264, 1143468, 1126471, 1104533, 1078712, 1050019, 1018868, 985666, 951725, 919035, 889063, 862250, 838784, 819194, 803767, 791847, 782344, 774605, 768329, 763002, 758189, 754246, 751906, 751066, 750680, 750092, 749846, 750856, 753323, 756974, 762004, 769075, 778336, 788761, 798563, 806160, 810784, 812430, 811480, 808529, 804485, 800445, 797087, 794250, 791321, 787869, 783550, 777696, 769723, 760097, 750358, 741930, 735317, 730579, 727976, 727718, 729510, 732852, 737527, 743423, 750127, 757106, 764049, 770695, 776729, 782380, 788789, 797055, 806960, 817261, 827227, 837271, 848008, 859457, 871445]
62073H71445J2794J4041J5297J6095J6329J6077J5581J5351J5846J6925J8072
62062A043853J9142K0464K2150K3754K4693K4656K3452K0878J6911J1902O448
62051A258303J252l045o343r380j3174j7999k3222k8103l2407l6084l8931m0787
62039A010080m1791m2092m1650m0401l8417l5728l2435k9133k6700k5253k3737
62028F32743k1139j7820j5084j3611j2878j2067j0974r854q909q146p524p061
62016D87676o864o995p199o899n800m353l300k815k428j720o96N43J970L389M429
62001D48938N002N434N992O548O873O949O796O292N377M231L078K001J037K21
61987E14769n90j678l129m687n983o786p093p262p853q842r236q157o255n152
$$ y = [871445, 884239, 898280, 913577, 929672, 946001, 962078, 977659, 993010, 1008856, 1025781, 1043853, 1062995, 1083459, 1105609, 1129363, 1154056, 1178712, 1202164, 1223042, 1239953, 1251855, 1258303, 1259555, 1256510, 1250167, 1240787, 1227613, 1209614, 1186392, 1158289, 1125882, 1089798, 1050867, 1010080, 968289, 926197, 884547, 844146, 805729, 770001, 737566, 708433, 681733, 656480, 632743, 611604, 593784, 578700, 565089, 552211, 540144, 529170, 519316, 510407, 502261, 494737, 487676, 480812, 473817, 466618, 459719, 453919, 449566, 446266, 443451, 441023, 439303, 438607, 439150, 441120, 444509, 448938, 453940, 459374, 465366, 471914, 478787, 485736, 492532, 498824, 504201, 508432, 511510, 513511, 514548, 514769, 514179, 512501, 509372, 504685, 498702, 491916, 484823, 477561, 469708, 460866, 451630, 443473, 437218, 432066]
61973D32066n276n402m689m002m336m927m311k534r71k65Q6J93o16k251l306k756
61957C86703j336m48m21m86M7J217K621L647L848L475L295L686M377N238O591
61942D22054Q328R593R946J0170J1019J1897J1787J1042J1016J2053J2979J2746
61930E54630J1587J0313R296Q544Q015P386O077M012J874K50j099k709m546o104
61916F07526p084p471p126n852l877j901l96R50K850N493Q174R997J0852J1384
61902F23519J1913J1842J0446P930N195K736L37k174m452o093p079p626q010q525
61888F29959r179r401q646p395o802p098p193o345n368n386o115o387o031n969
61874E32644o545o928o472n646n082m487l229j492j21N19Q54J357K027K695L458
$$ y = [432066, 426790, 421388, 416699, 412697, 408361, 403434, 399123, 396589, 395618, 395353, 395439, 395632, 395016, 392765, 389459, 386703, 385367, 384919, 384498, 384012, 384059, 385276, 387897, 391544, 395392, 398867, 402162, 405848, 410225, 415463, 422054, 430382, 439975, 449921, 460091, 471110, 483007, 494794, 505836, 516852, 528905, 541884, 554630, 566217, 576530, 585826, 594370, 602385, 609771, 615848, 619860, 621734, 621984, 620885, 618176, 613630, 607526, 600442, 592971, 585845, 579993, 576116, 574215, 573819, 574769, 577619, 583112, 591286, 601283, 612135, 623519, 635432, 647274, 657720, 665650, 670845, 673581, 673918, 671744, 667292, 661199, 654120, 646494, 638484, 629959, 620780, 611379, 602733, 595338, 588536, 581438, 574245, 567900, 562532, 557146, 551031, 544644, 538613, 532644, 526099, 519171, 512699, 507053, 501971, 497484, 494255, 492763, 492642, 493161, 494015, 495372, 497399, 500094, 503552]
61859E03552M576O096P732R092J0032J0823J1887J3362J4999J6549J8048J9598
61847F46346K1023K1999K2389K2293K1704K0419J8278J5402J2061Q498M878J339
61835H36629k017n097p714r554j0358j0137r171p762n993l784j144J673M353O749
61821G76673Q748R908R525P328M015O98k192n168q719j2476j5575j7650j9080
61808G36035k0318k1372k1936k1692k0475j8462j6341j4890j4173j3455j2138
61797E40783j0463r025p948p006o187n623n087m230l234k624k342j817j076j005
61783D73116j988k972k688j363l82l79o01k89J62j1o70r04l35L91M93j0m79n06
61765D60585k18J52O12J177J608J709J730K136K976L769M083L861L170K057Q44
$$ y = [503552, 508128, 514224, 521956, 531048, 541080, 551903, 563790, 577152, 592151, 608700, 626748, 646346, 667369, 689368, 711757, 734050, 755754, 776173, 794451, 809853, 821914, 830412, 835290, 836629, 834612, 829515, 821801, 812247, 801889, 791752, 782581, 774819, 768826, 765042, 763898, 765571, 769924, 776673, 785421, 795329, 804854, 812182, 816197, 816895, 814703, 809535, 800816, 788340, 772765, 755115, 736035, 715717, 694345, 672409, 650717, 630242, 611780, 595439, 580549, 566376, 552921, 540783, 530320, 521295, 513347, 506341, 500154, 494531, 489444, 485214, 481980, 479356, 477014, 475197, 474121, 473116, 471128, 468156, 465468, 464105, 463723, 463344, 462743, 462454, 462616, 462605, 461935, 461031, 460696, 461087, 461580, 461570, 461091, 460585, 460367, 460519, 461131, 462308, 463916, 465625, 467355, 469491, 472467, 476236, 480319, 484180, 487350, 489407, 490251]
61750D90251J37J72M13J76n92j487k319l126l731l800l402k936k564k093j546
61735D63553j320j651k255k646k504j683k38J352K376K557K230J797J341R55R58
61720D64822J422J819J646J184J190J900K706K904K447J914J785J853J414J53
61706D89159j283j935j751j703k455l499l944l696l281k895k372j872j832k170
61692D54471k302k129k268l021l751l787l414l364l657l691l294l001l170l422
61678D10200l301k931k701k548k059j144k55Q5k65j068j860k096j509m96Q5k44
61662C87893j097j682j618j065l16L90P89P88P68J242K097K567K139J222O50P46
61646C95513J119J240J008Q25J187K089K872K873K260J761J540R68k21j205j124
$$ y = [490251, 490388, 490560, 490973, 491149, 490557, 489070, 486751, 483625, 479894, 476094, 472692, 469756, 467192, 465099, 463553, 462233, 460582, 458327, 455681, 453177, 451494, 451256, 452608, 454984, 457541, 459771, 461568, 462909, 463864, 464822, 466244, 468063, 469709, 470893, 472083, 473983, 476689, 479593, 482040, 483954, 485739, 487592, 489006, 489159, 487876, 485941, 484190, 482487, 480032, 476533, 472589, 468893, 465612, 462717, 460345, 458473, 456641, 454471, 452169, 450040, 447772, 444751, 441000, 437213, 433799, 430435, 426778, 423087, 419793, 416792, 413622, 410200, 406899, 403968, 401267, 398719, 396660, 395516, 395261, 395346, 395081, 394013, 392153, 390057, 388548, 388052, 388137, 387893, 386796, 385114, 383496, 382431, 382115, 382505, 383294, 384082, 384850, 386092, 388189, 390756, 392895, 394117, 394767, 395513, 396632, 397872, 398880, 399705, 400892, 402981, 405853, 408726, 410986, 412747, 414287, 415255, 415034, 413829, 412705]
61631D12705m01k43j031k021k563k800l017l055k748k350k165k153k224k443k590
61616C80901k048o42O45N59r50k613l322l223l227l787m506m800m553m109l787
61601C40538l617l513l474l533l588l463l090k562k084j921k259k874l171k812
61587B98577k215k068k423k643k264j493q13m96o17j067j457j396j069j042j342
61572B76172j227k45J002J595J366P22j33j135j830j667p55K44R48J389J547J358
61556B79351J156J313J482R87J11L3J137K257K259J572J378J794J917J350P35
61541B98832O13P06O03N10P96J291J462J150P19N37N84N62K41k91o92p80q53j358
61523C04632k169k511j884q52m67r53j443j108j85M38L64L2m7J16K13J22n7k22
$$ y = [412705, 412304, 412061, 411030, 409009, 406446, 403646, 400629, 397574, 394826, 392476, 390311, 388158, 385934, 383491, 380901, 378853, 378211, 378856, 379415, 378465, 375852, 372530, 369307, 366080, 362293, 357787, 352987, 348434, 344325, 340538, 336921, 333408, 329934, 326401, 322813, 319350, 316260, 313698, 311614, 309693, 307434, 304560, 301389, 298577, 296362, 294294, 291871, 289228, 286964, 285471, 284658, 284162, 283545, 282478, 281021, 279625, 278556, 277514, 276172, 274945, 274700, 275702, 277297, 278663, 279385, 279252, 278117, 276287, 274620, 273865, 274109, 275057, 276446, 277993, 279351, 280507, 281820, 283302, 284289, 284400, 284433, 285570, 287827, 290086, 291658, 293036, 294830, 296747, 298097, 298832, 299445, 300151, 300754, 301264, 302060, 303351, 304813, 305963, 306682, 307219, 307803, 308365, 308606, 308315, 307623, 306843, 305990, 304632, 302463, 299952, 298068, 297216, 296749, 295796, 294353, 293245, 293060, 293498, 293862, 293894, 293847, 293963, 294176, 294298, 294241, 294019]
61505B94019l16l02l11o83j506k226k104j154k61j68o08o87L6J129J808J654R06
61488B89226K64L03Q83J211P91J20J00Q51J602J804J745J841J908J598J135R83
61472C06365J091J019O84L11k01j092j881j586j29J201J272M52j49k27k48l06
61456C06576j4N29O19J7o20o54k30K30O30R59R82O32L19L79O01P15R13J434J972
61437C15989K137K167K457K682K232J480J579K756L704L227J803Q94J054J526
61423C45687J515J100Q21R46J337J675J640J184P75J072K071K887K661J577N70
61408C67518J61rm18r19j087r70j041j477j917k007j825j646j504j240q40n14
61392C50265n28r44j435j424p46p9k68j113j355l15J026J171l0j329j703j264
$$ y = [294019, 293703, 293401, 293090, 292407, 290901, 288675, 286571, 285417, 285156, 284988, 284380, 283693, 283729, 284858, 286666, 288320, 289226, 289490, 289793, 290676, 291887, 292678, 292798, 292898, 293749, 295351, 297155, 298900, 300741, 302649, 304247, 305382, 306365, 307456, 308475, 309159, 309470, 309269, 308177, 306296, 304710, 304581, 305782, 307054, 307506, 307357, 307130, 306882, 306576, 306562, 307091, 307710, 307727, 307107, 306453, 306223, 306453, 307083, 308042, 309024, 309656, 309975, 310354, 310955, 311670, 312583, 314017, 315989, 318126, 320293, 322750, 325432, 327664, 329144, 330723, 333479, 337183, 340410, 342213, 343107, 344161, 345687, 347202, 348302, 349123, 350069, 351406, 353081, 354721, 355905, 356680, 357752, 359823, 362710, 365371, 366948, 367518, 367679, 367670, 367252, 366333, 365246, 364276, 363235, 361758, 359841, 357834, 356009, 354363, 352859, 351619, 350779, 350265, 349737, 348793, 347358, 345934, 345188, 345109, 344841, 343728, 342373, 342058, 343084, 344255, 344225, 342896, 341193, 339929]
61376C39929m76N92J907L030L540L565L401K969K087J091O04P71J139J326J444
61361C66919J733K079K133J790J391J364J789K362K837L333M028M718M999M914
61347D06389M976N333N346M445L179K808L769N054N340M484L507L285L619L692
61333D65226L118K259J601J191P52J07p04j494j907j516l51Q24J184Q13N60R40
61317D72603J637K201K664L182L584L810M336N571P142Q393R439J0919J2777J4089
61303E62347J4318J4015J3800J3312J1837R504P054M699K043p39k645l223l516
61290F42806m859p143r064r931j0328j0837j1120j0749j0134r857r575q526o845
61277E23838n443m622l741k432j191m88n1M73R07J120J511K271K759K428J893
$$ y = [339929, 339453, 340045, 341952, 344982, 348522, 352087, 355488, 358457, 360544, 361635, 362239, 363010, 364149, 365475, 366919, 368652, 370731, 372864, 374654, 376045, 377409, 379198, 381560, 384397, 387730, 391758, 396476, 401475, 406389, 411365, 416698, 422044, 426489, 429668, 432476, 436245, 441299, 446639, 451123, 454630, 457915, 461534, 465226, 468344, 470603, 472204, 473395, 474147, 474254, 473550, 472056, 470149, 468633, 468282, 469106, 470290, 471103, 471663, 472603, 474240, 476441, 479105, 482287, 485871, 489681, 494017, 499588, 506730, 515123, 524562, 535481, 548258, 562347, 576665, 590680, 604480, 617792, 629629, 639133, 646187, 650886, 652929, 652190, 649545, 646322, 642806, 637947, 630804, 621740, 611809, 601481, 590644, 579524, 568775, 558641, 548784, 539209, 530683, 523838, 518395, 513773, 510032, 507600, 506409, 505921, 505870, 506343, 507250, 508370, 509881, 512152, 514911, 517339, 519232]
61262E19232K270L713N331O384O743O508N953N777O420P173O846N413M059L478
61248E95300L119K382J572J092N72l99j435j923j971j983j823j232p18j053k020
61233E89480k538k110j323p42j39Q61J989K717L063L572M595N979P324Q319Q821
61218F29868Q888Q763Q710Q817Q948Q874Q422P574O516N569M990M771M624M244
61204G29578L614L018K720K763L138L946N139O315P091P670Q602R974J1228J1864
61190H16660J1927J1571J0597Q831O673M858L702K851J748J50j723l408m632n532
61176H64273o276o663o535o554p715r799j1088j0395q763q241r398j1007j1971
61163G49868j2410j2720j2712j2238j1776j1742j1696j0977r752q790q388q036
$$ y = [519232, 521502, 525215, 530546, 536930, 543673, 550181, 556134, 561911, 568331, 575504, 582350, 587763, 591822, 595300, 598419, 600801, 602373, 603465, 604037, 603638, 602203, 600280, 598309, 596326, 594503, 593271, 592553, 591500, 589480, 586942, 584832, 583509, 582767, 582628, 583489, 585478, 588195, 591258, 594830, 599425, 605404, 612728, 621047, 629868, 638756, 647519, 656229, 665046, 673994, 682868, 691290, 698864, 705380, 710949, 715939, 720710, 725334, 729578, 733192, 736210, 738930, 741693, 744831, 748777, 753916, 760231, 767322, 774992, 783594, 793568, 804796, 816660, 828587, 840158, 850755, 859586, 866259, 871117, 874819, 877670, 879418, 879568, 877845, 874437, 869805, 864273, 857997, 851334, 844799, 838245, 830530, 820731, 809643, 799248, 790485, 782244, 772846, 761839, 749868, 737458, 724738, 712026, 699788, 688012, 676270, 664574, 653597, 643845, 635055, 626667, 618631]
61151F18631p125n536l502j321O09J756J686L78j708l854n430o144o073n580n128
61136E71659m964m823m121k635q69M88J327K070K985L904M642N317O250P701R697
61121E98628J1857J3577J4746J6062J8222K0784K2576K3191K3502K4402K5704
61110H13251K6600K6733K6279K5388K4073K2447K0694J8857J6892J4781J2377
61099A048372R388N843K316p06l586p188j1736j6287j9498k0877k1187k1686k2905
61086I20263k4273k4860k4377k3259k2017k0844j9736j8601j7232j5609j4135
61075F95320j3225j2599j1521r819q102o859n893m836l752k852k060j244m83J43
61061F12218P65J540K489L582M689N501N930O533P893R662J0969J1700J2455J3280
$$ y = [618631, 611506, 605970, 602468, 601147, 601756, 603512, 605198, 605576, 603868, 600014, 594584, 588440, 582367, 576787, 571659, 566695, 561872, 557751, 555116, 554247, 554735, 556062, 558132, 561117, 565021, 569663, 574980, 581230, 588931, 598628, 610485, 624062, 638808, 654870, 673092, 693876, 716452, 739643, 763145, 787547, 813251, 839851, 866584, 892863, 918251, 942324, 964771, 985465, 1004322, 1021214, 1035995, 1048372, 1057760, 1063603, 1065919, 1065213, 1061627, 1054439, 1042703, 1026416, 1006918, 986041, 964854, 943168, 920263, 895990, 871130, 846753, 823494, 801477, 780633, 760897, 742296, 725064, 709455, 695320, 682095, 669496, 657975, 648156, 640054, 633195, 627302, 622466, 618714, 615862, 613802, 612558, 612075, 612218, 612983, 614523, 617012, 620594, 625283, 630784, 636714, 643247, 651140, 660802, 671771, 683471, 695926, 709206]
61047G09206J3620J3771J4967J7483J9971K1429K2622K4523K6616K7939K8752
61036I40899K9898L1328L2573L3970L5985L8137L9857M1726M4411M7088M8533
61025A364405M9049M9742N0573N1004N1856N4475N8553O3013O8517P6596Q6579
61014B024362R6072J04609J14167J26053J40495J59671J87679K26498K75509L36215
61004C791330M13624N11372O29839P71268R41556J143514J374134J630964J905869
60995A3113470K151793K260486K108601J660258J028040M15649j0555j97482j75761
60986B2354499J707K63314M82361M94542J97033l62658j008745j553473j896831
60977A8971749k036435k017502j891337j704430j496078j291580j101178r28910
$$ y = [709206, 722826, 736597, 751564, 769047, 789018, 810447, 833069, 857592, 884208, 912147, 940899, 970797, 1002125, 1034698, 1068668, 1104653, 1142790, 1182647, 1224373, 1268784, 1315872, 1364405, 1413454, 1463196, 1513769, 1564773, 1616629, 1671104, 1729657, 1792670, 1861187, 1937783, 2024362, 2120434, 2225043, 2339210, 2465263, 2605758, 2765429, 2953108, 3179606, 3455115, 3791330, 4204954, 4716326, 5346165, 6117433, 7058989, 8202503, 9576637, 11207601, 13113470, 15265263, 17525749, 19634350, 21294608, 22322648, 22738297, 22727742, 22530260, 22354499, 22356206, 22619520, 23101881, 23596423, 23793456, 23430798, 22422053, 20868580, 18971749, 16935314, 14917812, 13026475, 11322045, 9825967, 8534387, 7433209, 6504299]
60969F504299p78994o53151n47856m58389l83189l22189k73597k34639k03496
60960B648799j78481j57020j37316j19703j04826r1763p9212o7205n6269m6199
60950A610805l7043k9993k5837k3445k1160j8783j6890j5203j2988j0320p683
60939A391460n068k641j374j715k410k168j726k716n082p256q579r841j1571j3357
60925A315956j5013j7019j9530k2007k4138k6084k7741k8670k8970k9257k9589
60914A047938k9255k7959k6365k5184k4341k3311k1798j9815j7642j5814j4737
60903H01717j4174j3489j2361j0894r176p326n879n446n931o527o579o087n408
60890F92440m962n087n727o335o566o810p497q191q119p529p573q680r854r915
$$ y = [6504299, 5725305, 5072154, 4524298, 4065909, 3682720, 3360531, 3086934, 2852295, 2648799, 2470318, 2313298, 2175982, 2056279, 1951453, 1859690, 1780478, 1713273, 1657004, 1610805, 1573762, 1543769, 1517932, 1494487, 1473327, 1454544, 1437654, 1422451, 1409463, 1399143, 1391460, 1386392, 1383751, 1382377, 1380662, 1378252, 1376084, 1374358, 1371642, 1366560, 1359304, 1350725, 1340884, 1329313, 1315956, 1300943, 1283924, 1264394, 1242387, 1218249, 1192165, 1164424, 1135754, 1106784, 1077527, 1047938, 1018683, 990724, 964359, 939175, 914834, 891523, 869725, 849910, 832268, 816454, 801717, 787543, 774054, 761693, 750799, 741623, 734297, 728418, 722972, 717041, 710514, 703935, 697848, 692440, 687478, 682391, 676664, 670329, 663763, 656953, 649456, 641265, 633146, 625617, 618044, 609364, 599510, 589595]
60876E89595q787p316o309o062o397o799o816o461o069n737n264m583l917l444
60862E05634l189l144l149k755j745o73l88r82j755k145k200k140k021j969k184
60847D75195k568k751k589k214j737j301j352k155l140l448l179l276m043m633
60833D36809m370l721l434l358k884k018j361j182j141p91N4J359K840L928M089
60818D24819L325K201J385J115J054O62j73r48j154r35q38j079j402j638j848
60803D24546k020k037k001k078j994j254j9Q06N92l85j459k266k666k595k328
60788D02842k457l200m057m452m432m392m470m494m308l868l279k834k741k686
60774C51172k092j042m14p80j660k182k051j443m37Q73K034K582K652K705K835
$$ y = [589595, 580808, 573492, 567183, 561121, 554724, 547925, 541109, 534648, 528579, 522842, 517578, 512995, 509078, 505634, 502445, 499301, 496152, 493397, 491652, 490979, 490591, 489609, 487854, 485709, 483509, 481369, 479348, 477379, 475195, 472627, 469876, 467287, 465073, 463336, 462035, 460683, 458528, 455388, 451940, 448761, 445485, 441442, 436809, 432439, 428718, 425284, 421926, 419042, 417024, 415663, 414481, 413340, 412549, 412603, 413962, 416802, 420730, 424819, 428144, 430345, 431730, 432845, 433899, 434561, 434388, 433440, 432286, 431351, 430513, 429434, 428032, 426394, 424546, 422526, 420489, 418488, 416410, 414416, 413162, 413143, 413949, 414541, 414156, 412697, 410431, 407765, 405170, 402842, 400385, 397185, 393128, 388676, 384244, 379852, 375382, 370888, 366580, 362712, 359433, 356599, 353858, 351172, 349080, 348038, 347624, 346844, 345184, 343002, 340951, 339508, 339071, 339944, 341978, 344560, 347212, 349917, 352752]
60759C52752K802K691K973L804M655M855M316L577L170L107L030K776K623K794
60745C99925L010K878K477K102J519J98j712l295m054m540n392o314o522n882
60731C74398n089m878n397o169o494o043n206m571m098l285k122j222q04l82K18
60716C18856M25j0l72j71j24r69j988j897q14j20m85j145j222o97Q7R45J505J248
60698C13052K63n79n61K37J324K297K798K643K206K185K704L193L315L436L858
60683C42371M261M304M275M584N033N119M780M336L989L823M083M859N577N452
60669D06846M446L315K538J759M94j042k261l071l844m629m929m495l809l448
60655C87870l338l100k808k768k708j987p01J84J43j52J14P03P98K65l43p57j203
$$ y = [352752, 355554, 358245, 361218, 365022, 369677, 374532, 378848, 382425, 385595, 388702, 391732, 394508, 397131, 399925, 402935, 405813, 408290, 410392, 411911, 412109, 410397, 407102, 403048, 398508, 393116, 386802, 380280, 374398, 369309, 364431, 359034, 352865, 346371, 340328, 335122, 330551, 326453, 323168, 321046, 319824, 319020, 318638, 318856, 319281, 319271, 318899, 318728, 318604, 317635, 315647, 313750, 312936, 312816, 312331, 311186, 309964, 309267, 309354, 310299, 311804, 313052, 313315, 312736, 312175, 312412, 313736, 316033, 318831, 321474, 323680, 325865, 328569, 331762, 335077, 338513, 342371, 346632, 350936, 355211, 359795, 364828, 369947, 374727, 379063, 383052, 386875, 390958, 395817, 401394, 406846, 411292, 414607, 417145, 418904, 419398, 418356, 416095, 413024, 409180, 404551, 399622, 395127, 391318, 387870, 384532, 381432, 378624, 375856, 373148, 371161, 370460, 370644, 370787, 370635, 370749, 371452, 372250, 372515, 372172, 371415, 370212]
60638C70212j811k483l338m495n347m886l032j089l93r00j505j432q93n01l76
60623C37731o1Q25J944K455J950R34K28L9m7l30o23o04j83M10P33L84m78j084
60605C44223q57j44L21M39P30J360J840J809J519J370J392J421J388J251J012
60590C59074Q66J016J290J348J232J259J351J046K93l99p41r50j034n63M73J282
60574C66843J325J224J915L356M723N632O437P486Q707R873J0765J1107J0755
60561D50148R970R128Q192O786M723K148o97l432n466o339o206n644n010m257
60547D54044l209j735K49K491M284N097N325N939P361R147J0774J2232J3654J4890
60533E40543J5656J5772J5005J3138J0440P666N172K448r78m416o538o995o847
$$ y = [370212, 368401, 365918, 362580, 358085, 352738, 347852, 344820, 343731, 343338, 342438, 340933, 339501, 338608, 338107, 337731, 337670, 338495, 340439, 342894, 344844, 345778, 346006, 346045, 345998, 345668, 345045, 344441, 344258, 344668, 345401, 345785, 345307, 344223, 343366, 343222, 343543, 343982, 344712, 346072, 347912, 349721, 351240, 352610, 354002, 355423, 356811, 358062, 359074, 359940, 360956, 362246, 363594, 364826, 366085, 367436, 368482, 368775, 368376, 367635, 366685, 365651, 365088, 365561, 366843, 368168, 369392, 371307, 374663, 379386, 385018, 391455, 398941, 407648, 417521, 428286, 439393, 450148, 460118, 469246, 477438, 484224, 488947, 491095, 490398, 486966, 481500, 475161, 468955, 463311, 458301, 454044, 450835, 449100, 449349, 451840, 456124, 461221, 466546, 472485, 479846, 488993, 499767, 511999, 525653, 540543, 556199, 571971, 586976, 600114, 610554, 618220, 623392, 625840, 624862, 620446, 613908, 606913, 600066]
60520F00066p155p724p683o823n759m890l952k716j534q45n39k36R4L66R98K628
60504E54296N116P386Q681R536J1164J4169J8247K2826K7501L1939L5839L9092
60492G85792M1618M3054M3023M1701L9626L6762L2325K5830J7964R824J617p261
60480A111875j6878k6127l3707l9210m2903m4903m5127m3903m1969l9782l7236
60469G00130l4178l0828k7475k4184k1021j8333j6390j4977j3635j2246j0989
60458D75874r865q663p402o410n828n359m716m058l711l657l551l255k984k909
60444D03506k817k447k030k100k709l098k534j314m72m82p06l66L35M83l33j469
60428C81447j945j401l86K06rn15n08J33P14O81L03J57M04Q82J529K180K341J798
$$ y = [600066, 592911, 585187, 577504, 570681, 564922, 560032, 556080, 553364, 551830, 550985, 550446, 550210, 550304, 550670, 551668, 554296, 559412, 566798, 575479, 585015, 596179, 610348, 628595, 651421, 678922, 710861, 746700, 785792, 827410, 870464, 913487, 955188, 994814, 1031576, 1063901, 1089731, 1107695, 1117519, 1119136, 1111875, 1094997, 1068870, 1035163, 995953, 953050, 908147, 863020, 819117, 777148, 737366, 700130, 665952, 635124, 607649, 583465, 562444, 544111, 527721, 512744, 499109, 486863, 475874, 466009, 457346, 449944, 443534, 437706, 432347, 427631, 423573, 419862, 416205, 412654, 409399, 406415, 403506, 400689, 398242, 396212, 394112, 391403, 388305, 385771, 384457, 383985, 383503, 382797, 382431, 382766, 383249, 382916, 381447, 379502, 378101, 377715, 377921, 377912, 377397, 376889, 377022, 377736, 378417, 378720, 378877, 379281, 380163, 381692, 383872, 386213, 388011]
60410C88011J157J090J313J063M15J74M90O14K81K90J170K153K239J614J242J478
60394D04794J901K178K336K283J866J391J512K346L223L429K944K316K062K292
60380D36873K736L000K877K444J911J497J440J873K518K781K364J616J082Q69
60366D65881P24N48N06O90R33J007Q68P00P45J087J605K232L151M487N925O999
60350D98088P762Q661R659J0071R543Q656Q108P735O785M803J833j871n626q216
60336E65991q808p983p204p226p483p175o285n381m844m616m456m210l888l635
60322D82797l530l514l554l712l818l382k191q14k8J41L58J044K038L206M689
60307D69730O469Q262J0097J2423J5301J7983J9661K0181J9529J7224J2946P458
$$ y = [388011, 389168, 390258, 391571, 392634, 393049, 393223, 393713, 394327, 394608, 394898, 396068, 398221, 400460, 402074, 403316, 404794, 406695, 408873, 411209, 413492, 415358, 416749, 418261, 420607, 423830, 427259, 430203, 432519, 434581, 436873, 439609, 442609, 445486, 447930, 449841, 451338, 452778, 454651, 457169, 459950, 462314, 463930, 465012, 465881, 466605, 467153, 467659, 468349, 469282, 470289, 471157, 471857, 472602, 473689, 475294, 477526, 480677, 485164, 491089, 498088, 505850, 514511, 524170, 534241, 543784, 552440, 560548, 568283, 575068, 579871, 581704, 579833, 574207, 565991, 557183, 549200, 541996, 534770, 527287, 520112, 513827, 508446, 503602, 498986, 494530, 490320, 486432, 482797, 479267, 475753, 472199, 468487, 464669, 461287, 459096, 458282, 458254, 458395, 458753, 459797, 461835, 465041, 469730, 476199, 484461, 494558, 506981, 522282, 540265, 559926, 580107, 599636, 616860, 629806, 637264]
60295F37264K037k983q165j3356j7125j8393j7819j6808j5648j3606j0683q103
60283D96612o755o108n198m033l289l087k883k403j987k029k534l245l750l636
60269D45675k964k434k518k682k151j234r80j546j943j613j204j359j696j612
60255D19739j286j178j113p28k25k1%J87N04Q13J275J806J703O72l00r7Q62J184
60237D23797N76J54O55J515J963J968J751J233N26K32P11J562K163K398K463K408
60221D46075K216J995J870J969K589L885N275N803N360M968N486O515P120P084
60207E08210O903O856O790O650O653O781O658O065N339M992N081N195M994M576
60193E91743M201L785K994J781N92j91o94j212j720k048k387l145m324n370n706
$$ y = [637264, 639301, 636318, 628153, 614797, 597672, 579279, 561460, 544652, 529004, 515398, 504715, 496612, 489857, 483749, 478551, 474518, 471229, 468142, 465259, 462856, 460869, 458840, 456306, 453061, 449311, 445675, 442711, 440277, 437759, 435077, 432926, 431692, 430712, 429166, 427223, 425610, 424406, 423047, 421351, 419739, 418453, 417275, 416162, 415434, 415209, 415188, 415188, 415375, 415879, 416692, 417967, 419773, 421476, 422148, 421848, 421751, 422613, 423797, 424373, 424527, 425182, 426697, 428660, 430628, 432379, 433612, 434138, 434370, 435081, 436643, 438806, 441204, 443667, 446075, 448291, 450286, 452156, 454125, 456714, 460599, 465874, 471677, 477037, 482005, 487491, 494006, 501126, 508210, 515113, 521969, 528759, 535409, 542062, 548843, 555501, 561566, 566905, 571897, 576978, 582173, 587167, 591743, 595944, 599729, 602723, 604504, 605096, 604905, 604211, 602999, 601279, 599231, 596844, 593699, 589375, 584005, 578299]
60178E78299n243m412l863l962m374m366l703k938k588k459k179j918j933j918
60164E32443j549j256j573j997j632q04p63j688k218j460k61J74n9j09K36O10
60148E18094J014J712K404K387J538N93L59J008K141L220L929M295M507M645M751
60133E56597M977N352N485N025M364M234M527M272L043J636R77R99J101J073J058
60118F04720J083J243J865K896L545L134K019J101P45O82O62N88K66l78r84j175
60102F22012j184j615k674l999n048n360m715l472k471k160k022j299m5J002J410
60087E88360J367J189J051J108J477K062K648L036K998K306J132N4o19j192k033
60072F04944l063m162n534p180q476q814q352p696p204p081p494q051p772o357
$$ y = [578299, 573056, 568644, 564781, 560819, 556445, 552079, 548376, 545438, 542850, 540391, 538212, 536294, 534361, 532443, 530894, 529638, 528065, 526068, 524436, 523632, 522869, 521181, 518963, 517503, 517242, 517416, 517357, 517248, 517484, 518094, 519108, 520820, 523224, 525611, 527149, 527742, 528101, 529109, 531250, 534470, 538399, 542694, 547201, 551846, 556597, 561574, 566926, 572411, 577436, 581800, 586034, 590561, 594833, 597876, 599512, 600489, 601488, 602589, 603662, 604720, 605803, 607046, 608911, 611807, 615352, 618486, 620505, 621606, 622351, 623033, 623695, 624283, 624549, 624171, 623187, 622012, 620828, 619213, 616539, 612540, 607492, 602132, 597417, 593945, 591474, 589314, 587292, 585993, 585948, 586950, 588360, 589727, 590916, 591967, 593075, 594552, 596614, 599262, 602298, 605296, 607602, 608734, 608788, 608169, 606977, 604944, 601881, 597719, 592185, 585005, 576529, 567715, 559363, 551667, 544463, 537382, 529888, 521837, 514065, 507708]
60058E07708m911m530m752m424l607l343l770l864l075j887o35R81K831M063M442
60043D81227M883N954O784O265M694L371L046L388L696L530K892K192J882J786
60029E35590J223Pj186j830k388l590n238o421o705o527o463o581o554o101n225
60014D72011m191l334k834k792l344m357n064m627l259k227k333k871k642j579
60000D26557p15p09j129j218q15l01J1J29K52N92J206J975K689L215L526L688
59984D38953L853M133M355M077L047J610M02k93p28j223j733k005k042k149k499
59969D47758k809k611j808p90JM48O52P34Q92J339J973K314K117J827K038K579
59953D56654K682K032J136M87q2r15j746j925j322n49k43l26k51J76M21j78j492
$$ y = [507708, 502797, 498267, 493515, 489091, 485484, 482141, 478371, 474507, 471432, 469545, 468910, 469891, 472722, 476785, 481227, 486110, 492064, 498848, 505113, 509807, 513178, 516224, 519612, 523308, 526838, 529730, 531922, 533804, 535590, 536813, 536820, 535634, 533804, 531416, 527826, 522588, 516167, 509462, 502935, 496472, 489891, 483337, 477236, 472011, 467820, 464486, 461652, 458860, 455516, 451159, 446095, 441468, 438209, 435982, 433649, 430778, 428136, 426557, 425842, 425133, 424004, 422786, 421971, 421670, 421681, 421810, 422062, 422654, 423860, 425835, 428524, 431739, 435265, 438953, 442806, 446939, 451294, 455371, 458418, 460028, 460430, 460137, 459409, 458186, 456453, 454448, 452406, 450257, 447758, 444949, 442338, 440530, 439740, 439741, 440189, 440841, 441575, 442467, 443806, 445779, 448093, 450210, 452037, 454075, 456654, 459336, 461368, 462504, 462991, 462909, 461994, 460248, 458323, 457001, 456452, 456209, 455883, 455632, 455808, 456229, 456051, 454559]
59936D54559k593k723k039j195n20R8O87J008J000R94J353K085K932L651M209
59921D63506M783N597O641P594Q154Q298Q131P737P335P246P324O739M885K348
59907E56318L89m14n02l92k12j56o17j543k233k231j944k047k623l224l427l054
59891E32088k075o38R77K552L885M568M346L720L631M260M767M540M145M493N603
59876E80862O764P475P627P044N662M021K820J999Q80p57k352l418m126m728n025
59861F04748m811m464m571n117n381m740l331j891j112j102j274p57R12L340N592
59846E76041P001P586P654P119N571K974M7k173l007k429r70N22J347J358P61
59831F09402n11k694n324p115p316o683o432o554o073m727l403k843k824k888
$$ y = [454559, 451966, 449243, 447204, 446009, 445489, 445587, 446274, 447282, 448282, 449276, 450629, 452714, 455646, 459297, 463506, 468289, 473886, 480527, 488121, 496275, 504573, 512704, 520441, 527776, 535022, 542346, 549085, 553970, 556318, 556707, 556293, 555791, 555399, 555187, 555031, 554414, 552871, 550638, 548407, 546463, 544416, 541793, 538569, 535142, 532088, 530013, 529375, 530352, 532904, 536789, 541357, 545703, 549423, 553054, 557314, 562081, 566621, 570766, 575259, 580862, 587626, 595101, 602728, 609772, 615434, 619455, 622275, 624274, 625154, 624397, 622045, 618627, 614501, 609773, 604748, 599937, 595473, 590902, 585785, 580404, 575664, 572333, 570442, 569330, 568228, 566954, 566197, 567109, 570449, 576041, 583042, 590628, 598282, 605401, 610972, 613946, 613993, 611820, 608813, 606384, 605414, 605936, 607283, 608641, 609402, 608891, 606197, 600873, 593758, 586442, 579759, 573327, 566773, 560700, 555973, 552570, 549727, 546903, 544015]
59817E44015k987l048k673j791r64n77l55j26m39j702l237l934l574k880k456
59802E13272k350k453k735l053l243l373l533l505l012k217j560j217j007p59
59788D79255m02J04O03P01K60k79m67n16q61j325j308p45j67J52M90J019J494
59771D78008J792K193K755K992K502J630J070J076J412J811K199K558K952L526
59757E08476M208M538M242L782L912M668N294N361N419O090O991P191O550N842
59743E82564N551N311M804M409M475M578M134L274K420J476K61o62o10m4j03q46
59727F20992j149n37N3j77p15q08o65q32j156j275j488k140k735k625k130j997
59711F00616k125j911j509j632k145k051r80K39Q17R25J112J567K232L027L574
$$ y = [544015, 541028, 537980, 535307, 533516, 532552, 531975, 531620, 531494, 531055, 529353, 526116, 522182, 518608, 515728, 513272, 510922, 508469, 505734, 502681, 499438, 496065, 492532, 489027, 486015, 483798, 482238, 481021, 480014, 479255, 478853, 478957, 479560, 480261, 480521, 480242, 479775, 479259, 478398, 477073, 475765, 475020, 474853, 475005, 475495, 476514, 478008, 479800, 481993, 484748, 487740, 490242, 491872, 492942, 494018, 495430, 497241, 499440, 501998, 504950, 508476, 512684, 517222, 521464, 525246, 529158, 533826, 539120, 544481, 549900, 555990, 562981, 570172, 576722, 582564, 588115, 593426, 598230, 602639, 607114, 611692, 615826, 619100, 621520, 622996, 623257, 622595, 621985, 621941, 621838, 620992, 619843, 619306, 619359, 619182, 618467, 617659, 616994, 616162, 615006, 613731, 612243, 610103, 607368, 604743, 602613, 600616, 598491, 596580, 595071, 593439, 591294, 589243, 588263, 588502, 589319, 590244, 591356, 592923, 595155, 598182, 601756]
59696F01756L361K468J677J530J702J605J153O19J37k80n34n23l38j76k00m98
59680F13459r44j204j197j465k553m075m961m834m509m840n578n813n162m099
59666E62225l352l281l694l956l457k194q23P8N57R61J326J462J486J818K610
59651E51766L456L814L567L026K492J950J286N39k17j137k343l500m077m130m372
59636E52120n117n715n441m579l942l701l373k783k258j882j420j035j287k185
59622E07402k956l115l035l125l101k668k297k685l664m381m325l667k726j646
59608D64011o00J81O60R93J267J485J710J947J942J468P97M74O05O46J52n47o78
59591D76513N4J129J726J457N69l92r94j138j025r32r49r02o39l64n04j201k119
$$ y = [601756, 605117, 607585, 609262, 610792, 612494, 614099, 615252, 615871, 616008, 615728, 615194, 614671, 614333, 614157, 613957, 613459, 612515, 611311, 610114, 608649, 606096, 602021, 597060, 592226, 587717, 582877, 577299, 571486, 566324, 562225, 558873, 555592, 551898, 547942, 544485, 542291, 541468, 541546, 542103, 543064, 544390, 545852, 547338, 549156, 551766, 555222, 559036, 562603, 565629, 568121, 570071, 571357, 571896, 571679, 570542, 568199, 564699, 560622, 556492, 552120, 547003, 541288, 535847, 531268, 527326, 523625, 520252, 517469, 515211, 513329, 511909, 510874, 509587, 507402, 504446, 501331, 498296, 495171, 492070, 489402, 487105, 484420, 480756, 476375, 472050, 468383, 465657, 464011, 463411, 463592, 464252, 465245, 466512, 467997, 469707, 471654, 473596, 475064, 475861, 476335, 476940, 477586, 477738, 477191, 476513, 476567, 477696, 479422, 480879, 481448, 481056, 480062, 478924, 477899, 476967, 476018, 475116, 474477, 474113, 473609, 472408, 470289]
59574D70289k799l069l022k772k423k086j790j481j224j170j204r29l29n7o09
59559D45325j397j285k9J305J578Q18J8jP00J519J999K150K242K421K641K907
59543D62911L293L782M370N378P245R872J2665J5407J8382K1040K1306J7290R623
59530F12564J245n135q698r834r001o778m164k101q65k79j56l00l45p4K16l6j077
59513E65182k562l790m306m374m729n683o747p358p618p814p638o636n177m133
59499D86617l608k939k041j704k232k697k168r86j88j74n51q77j004r20o87l92
59483D63449J33J166K428L066K658J861J629K136K895L558M101M480M565M320
59469E02445L745K811J705Q35L92J97K01O30J432K024K067K043K595L620M581
$$ y = [470289, 467490, 464421, 461399, 458627, 456204, 454118, 452328, 450847, 449623, 448453, 447249, 446320, 445991, 445934, 445325, 443928, 442643, 442614, 443919, 445497, 446315, 446333, 446332, 447032, 448551, 450550, 452700, 454942, 457363, 460004, 462911, 466204, 469986, 474356, 479734, 486979, 496851, 509516, 524923, 543305, 564345, 585651, 602941, 612564, 613809, 608674, 599976, 590142, 581141, 574363, 570199, 568098, 567233, 566954, 566798, 566498, 566153, 566079, 566295, 566259, 565182, 562620, 558830, 554524, 550150, 545421, 539738, 532991, 525633, 518015, 510201, 502563, 495927, 490750, 486617, 483009, 480070, 478029, 476325, 474093, 471396, 469228, 468242, 468054, 467880, 467329, 466452, 465448, 464528, 463841, 463449, 463582, 464748, 467176, 470242, 472900, 474761, 476390, 478526, 481421, 484979, 489080, 493560, 498125, 502445, 506190, 509001, 510706, 511541, 511933, 512130, 512331, 512961, 514393, 516417, 518484, 520527, 523122, 526742, 531323]
59454E31323N346O128O888P389P756Q332Q969Q990P993O265M345K428L05k218
59440F10239m886o964p804p548p031o900p078p172o971o384n237l575j843m99
59426E30347L61Q49J128J683L183N638Q089R639J0547J1827J3919J6251J7965
59413F31426J8810J9451K1000K3753K5969K4529J7635O852l950j1535j4978j5056
59401G43906j3041j0009o417j991L412Q532J0688P630l82j0302j8195k1781k1466
59388F70584j9138j6237j3199j0322q206p040o208n164m123l326k272m67J564
59375E76446K816L152L253L447L422L134L093L526L957L928L655L717M351N285
59361F27182N960N918N225M570M617N232N742N919O260P187Q356Q985Q781Q353
$$ y = [531323, 536669, 542797, 549685, 557074, 564830, 573162, 582131, 591121, 599114, 605379, 609724, 612152, 612457, 610239, 605353, 598389, 590585, 583037, 576006, 569106, 562028, 554856, 547885, 541501, 536264, 532689, 530846, 530347, 530708, 531557, 532685, 534368, 537551, 543189, 551278, 560917, 571464, 583291, 597210, 613461, 631426, 650236, 669687, 690687, 714440, 740409, 764938, 782573, 789425, 785475, 773940, 758962, 743906, 730865, 720856, 714439, 712448, 715860, 724392, 735080, 742710, 742328, 732026, 713831, 692050, 670584, 651446, 635209, 622010, 611688, 603482, 596442, 590234, 585070, 580947, 577621, 575349, 574882, 576446, 579262, 582414, 585667, 589114, 592536, 595670, 598763, 602289, 606246, 610174, 613829, 617546, 621897, 627182, 633142, 639060, 644285, 648855, 653472, 658704, 664446, 670365, 676625, 683812, 692168, 701153, 709934, 718287]
59347G18287Q716J0333J2578J4209J4449J3551J2254J1027R905Q743P356N626
59335H47034L720J966M19j193k990m817o689q822j0873j1926j1665j1012j0946
59322G72206j1174j0745r538q367p753p430o948o214n366m606m077l654l012k167
59308F81155j598j511j478j137o53MJ482M003O619Q430R841J1564J2859J2037
59294G41617Q413K703m152j1284j7243k0499k0866j9490j7350j4814j2439j0911
59282F03685r925q372n972l688k253j298k11J127K785M966P392R339J0609J1626
59268F19810J2470J2760J2588J2438J2050J0563Q112N934M475K731N1k753m852
59255G06377o562q204r007q394p280o874o985o720o095n683n325m420l149k171
$$ y = [718287, 727003, 737336, 749914, 764123, 778572, 792123, 804377, 815404, 825309, 834052, 841408, 847034, 850754, 852720, 853139, 851946, 848956, 844139, 837450, 828628, 817755, 805829, 794164, 783152, 772206, 761032, 750287, 740749, 732382, 724629, 717199, 710251, 704037, 698671, 694065, 689988, 686334, 683322, 681155, 679557, 678046, 676568, 675431, 674778, 674782, 676264, 680267, 686886, 695316, 705157, 716721, 729580, 741617, 750030, 752733, 748581, 737297, 720054, 699555, 678689, 659199, 641849, 627035, 614596, 603685, 593760, 585388, 579416, 575728, 573475, 572177, 571966, 573093, 575878, 580844, 588236, 597575, 608184, 619810, 632280, 645040, 657628, 670066, 682116, 692679, 700791, 706725, 711200, 713931, 713982, 711229, 706377, 699815, 691611, 682604, 674210, 666930, 660056, 653071, 646351, 640256, 634573, 629248, 624828, 621679, 619508]
59241F19508j428l62R67J983K617L241L743L710L406L611M450N182N213M578L481
59226F63900K067O51m41j352k433l628m557n096n363n297m794m127l672l350k883
59211F19625k402k215k192j992j707j691j859j882j890k241k692k551j713q73
59197E91725o10q30j201j524j640j493j373j556j706j234k32N33P36R03J510K295
59181E84303K842L262L823M331M419M280M547N423O320O515N976N338N184N534
59167F52097O105O729P301P548P355P171P516P996P498N625L281J404k31k289
59153G25106m541o171p126q164r542j0494j0301r236q138p520p363p496p833q335
59139F12846q873r157q896q155p367o799o252n514m842m589m547m173l362k485
$$ y = [619508, 618080, 617718, 618685, 620668, 623285, 626526, 630269, 633979, 637385, 640996, 645446, 650628, 655841, 660419, 663900, 665967, 666618, 666177, 664825, 662392, 658764, 654207, 649111, 643748, 638451, 633657, 629530, 625858, 622508, 619625, 617223, 615008, 612816, 610824, 609117, 607426, 605567, 603685, 601795, 599554, 596862, 594311, 592598, 591725, 591115, 590285, 589084, 587560, 585920, 584427, 583054, 581498, 579792, 578558, 578326, 578859, 579595, 580498, 582008, 584303, 587145, 590407, 594230, 598561, 602980, 607260, 611807, 617230, 623550, 630065, 636041, 641379, 646563, 652097, 658202, 664931, 672232, 679780, 687135, 694306, 701822, 709818, 717316, 722941, 726222, 727626, 727395, 725106, 720565, 714394, 707268, 699104, 689562, 679068, 668767, 659531, 651393, 643873, 636510, 629014, 621181, 612846, 603973, 594816, 585920, 577765, 570398, 563599, 557347, 551833, 546991, 542402, 537855, 533682, 530320, 527835]
59125E27835j728q92J00R85J640K360L476M895O212P147P763Q290Q783R030Q896
59110E94792Q624Q498Q266P457O348N884O241O219M787K670J461J524J744J245
59096F65760K97n78j391k199k662k607k437k512k556k149j423q63p16r64j609
59081F41391k567l410l737l724m006m886n935o480o305n741n136m523l897l557
59067E77487l809m369m501l921l198l009l348l773m113m434m557m140l234k348
59053E24733j872j802j950k061j788r82j00J29m41j104j082k99O99J334J350Q24
59037E15588R0l85k59L91J104J405J286J219J631K443L327M212N229O287P255
59022E50823Q497J0536J2934J4302J3881J2495J1372J0544R151O923M474K278
$$ y = [527835, 526107, 525215, 525315, 526300, 527940, 530300, 533776, 538671, 544883, 552030, 559793, 568083, 576866, 585896, 594792, 603416, 611914, 620180, 627637, 633985, 639869, 646110, 652329, 657116, 659786, 661247, 662771, 664515, 665760, 666057, 665479, 664088, 661889, 659227, 656620, 654183, 651671, 649115, 646966, 645543, 644680, 643964, 643000, 641391, 638824, 635414, 631677, 627953, 623947, 619061, 613126, 606646, 600341, 594600, 589464, 584941, 581044, 577487, 573678, 569309, 564808, 560887, 557689, 554680, 551332, 547559, 543446, 539012, 534455, 530315, 527081, 524733, 522861, 521059, 519109, 517048, 515260, 514278, 514178, 514307, 513866, 512762, 511680, 511381, 512080, 513414, 514764, 515588, 515678, 515293, 515034, 515425, 516529, 517934, 519220, 520439, 522070, 524513, 527840, 532052, 537281, 543568, 550823, 559320, 569856, 582790, 597092, 610973, 623468, 634840, 645384, 654535, 661458, 665932, 668210]
59010F68210K21j777l326l971l666k810k063j972k362k290j088P88K352L238L659
58995F53143L605K925K135K123K907L517L355K866K522J968P43p10j531j584j460
58980F76524j423r99K76K116L760M837N655O709Q094R543J0869J2019J2793J2903
58966G63676J2452J2013J2020J2408J2892J3210J2918J1548R309P107N447L766
58954H88766J351j631m621p581j0668j3450j5289j6234j6680j6567j5761j4871
58942G56764j4571j4313j2975j0690q791p832o983n711m665m280l744k320o73
58929F59216J18K56P72J808K384J839O55k86n92m47k10j86n25j114j684k029k136
58912F57839k072j787j060J33J295J801J848K496M290O373P664Q493R970J1989
$$ y = [668210, 668431, 666654, 663328, 659357, 655691, 652881, 650818, 648846, 646484, 644194, 643106, 643894, 646246, 649484, 653143, 656748, 659673, 661808, 663931, 666838, 670355, 673710, 676576, 679098, 681066, 681809, 681099, 679568, 677984, 676524, 675101, 674102, 674378, 676494, 680254, 685091, 690746, 697455, 705549, 715092, 725961, 737980, 750773, 763676, 776128, 788141, 800161, 812569, 825461, 838671, 851589, 863137, 872446, 879553, 885000, 888766, 890117, 888486, 883865, 876284, 865616, 852166, 836877, 820643, 803963, 787396, 771635, 756764, 742193, 727880, 714905, 704215, 695424, 687592, 680609, 674898, 670233, 665953, 662209, 659889, 659216, 659334, 659590, 660362, 662170, 664554, 666393, 667048, 666762, 666170, 665723, 665513, 665327, 664802, 663688, 662004, 659975, 657839, 655767, 653980, 652920, 653053, 654348, 656149, 657997, 660493, 664783, 671156, 678820, 687313, 697283, 709272]
58898G09272J3052J2462J1410J1348J2162J2809J3013J3362J4103J4855J5477
58887H53325J6437J8050J9837K0868K0603J9219J7281J5155J2830J0168P171L936
58875A034880N91k550n096p077r010j1059j2527j2749j2137j1578j1070r928q199
58862I22491o931o757p214p678q092q436q392q046q083q768r426r548r684j0435
58848H05001j1228j0949r489p857o984p089q027r483j0763j1142j0615r935r692
58835F81748r625r026p642o069n183n277n722n648m780l555k464j619q60mJ025
58820F15299K129L119M093N409O961P796P106N408M075L742L894L934L800L404
58806F80169K403Q57n76j469k023k445k673k961l936n546o688o502n563n157n768
$$ y = [709272, 722324, 734786, 746196, 757544, 769706, 782515, 795528, 808890, 822993, 837848, 853325, 869762, 887812, 907649, 928517, 949120, 968339, 985620, 1000775, 1013605, 1023773, 1030944, 1034880, 1035471, 1032921, 1027825, 1020748, 1011738, 1000679, 988152, 975403, 963266, 951688, 940618, 930690, 922491, 915560, 908803, 901589, 893911, 885819, 877383, 868991, 860945, 852862, 844094, 834668, 825120, 815436, 805001, 793773, 782824, 773335, 765478, 758494, 751405, 743378, 733895, 723132, 711990, 701375, 691440, 681748, 672123, 663097, 655455, 649386, 644203, 638926, 633204, 627556, 622776, 619221, 616757, 615138, 614278, 614274, 615299, 617428, 620547, 624640, 630049, 637010, 644806, 651912, 657320, 661395, 665137, 669031, 672965, 676765, 680169, 682572, 683429, 682853, 681384, 679361, 676916, 674243, 671282, 667346, 661800, 655112, 648610, 643047, 637890, 632122]
58791F32122o767p324p122o358n398m385l128j589l24R0oL90J638L102M189M960
58775F04090N515N549M865L650J953l29k687m129m500m821n792o803p012o599
58761E82950o203n888n369m679l870k621r16M76R52R74J289J764J774J328R63
58746E62924R28J150J668K368K746K677K943M177N670O258O052O136O696O679
58732F19072N573M432M471N356N689M890L882L809M581N103M792M243M187M398
58718F84478M285M133M857O552Q179Q887Q832Q482P920P123O177M845K710k4k578
58703G64858m732o996r426j1297j2424j3643j5400j6956j7689j8074j8453j7967
58691F01801j5924j3325j1686j0965r923q085o163m824m125l970m153m119l521
$$ y = [632122, 625355, 618031, 610909, 604551, 599153, 594768, 591640, 590051, 589727, 589817, 589811, 590201, 591839, 594941, 599130, 604090, 609605, 615154, 620019, 623669, 625622, 625293, 622606, 618477, 613977, 609156, 603364, 596561, 589549, 582950, 576747, 570859, 565490, 560811, 556941, 554320, 553404, 553880, 554832, 555806, 557095, 558859, 560633, 561961, 562924, 563852, 565002, 566670, 569038, 571784, 574461, 577404, 581581, 587251, 593509, 599561, 605697, 612393, 619072, 624645, 629077, 633548, 638904, 644593, 649483, 653365, 657174, 661755, 666858, 671650, 675893, 680080, 684478, 688763, 692896, 697753, 704305, 712484, 721371, 730203, 738685, 746605, 753728, 759905, 764750, 767460, 767436, 764858, 760126, 753130, 743704, 732407, 719983, 706340, 690940, 673984, 656295, 638221, 619768, 601801, 585877, 572552, 560866, 549901, 539978, 531893, 525730, 520906, 516781, 512811, 508658, 504539, 501018]
58678E01018k826k700l058l348l325k855j583M13K133K763K810L332M522N907
58664E03203P368Q916R982J0001R354Q671P628N481K507k14k230l809m925n277
58650E56656n249n719o828p766p840p063n817m609l880l466k641j316n10q11j102
58635D92039o4J715K537K114J761K210K725K608K188J948J724J226O10J91J41
58620E15673M98J043J282J130J257K166L353M119M652N423O065N948N369N014
58606E62992M681L726K439J707J531J188N78J58k25j109k144k427j951j503j213
58591E68428n75K27M78M60J328L345N545P286Q820J0182J0896J1000J1082J1077
58577F49579J0300Q820P559O786N884M866M711N722O876P423P990R495J1921J4658
$$ y = [501018, 498192, 495492, 492434, 489086, 485761, 482906, 481323, 481736, 483869, 486632, 489442, 492774, 497296, 503203, 510571, 519487, 529469, 539470, 548824, 557495, 565123, 570604, 573111, 572897, 570667, 566858, 561933, 556656, 551407, 545688, 538860, 531094, 523254, 516191, 510374, 505765, 501885, 498419, 495778, 494462, 493952, 493141, 492039, 491975, 493690, 496227, 498341, 500102, 502312, 505037, 507645, 509833, 511781, 513505, 514731, 515341, 515532, 515673, 516171, 517214, 518496, 519626, 520883, 523049, 526402, 530521, 535173, 540596, 546661, 552609, 557978, 562992, 567673, 571399, 573838, 575545, 577076, 578264, 578842, 579000, 578775, 577666, 575522, 573095, 571144, 569641, 568428, 567853, 568080, 568558, 569018, 570346, 573691, 579236, 586522, 595342, 605524, 616420, 627420, 638502, 649579, 659879, 668699, 676258, 683044, 688928, 693794, 698505, 704227, 711103, 718526, 726516, 736011, 747932, 762590]
58563G62590J7285J9589K1534K3384K5196K6201K5574K3670K1486J9064J5592
58552A001165J1010O247J885k144n517p577q509r106r312q447o994o584p943j0264
58538I37910j2806j5540j8004j9257j9427j9703k0282j9934j8103j5815j3827
58527G45212j1642r090p154o220n167l343j943k062k729k397j331r88j663k245
58513F87238j999j362j130j594k445k997k773k117j845k139k362k053j434p87
58499F60201j73J11k96j018j188o76j35K08P79J548J877J716J832K591L554M486
58483F75417N599O761P616Q614J0563J3053J4695J5169J5509J6071J5870J4289
58471H19226J1902R071N346Q61l110n714p322q316q409p683o897o241n106l468
$$ y = [762590, 779875, 799464, 820998, 844382, 869578, 895779, 921353, 945023, 966509, 985573, 1001165, 1012175, 1018422, 1020307, 1018163, 1012646, 1005069, 996560, 987454, 978142, 969695, 962701, 956117, 948174, 937910, 925104, 909564, 891560, 872303, 852876, 833173, 812891, 792957, 774854, 759039, 745212, 733570, 724480, 717326, 711106, 705939, 702596, 700653, 698591, 695862, 693465, 692134, 691146, 689483, 687238, 685239, 683877, 682747, 681153, 678708, 675711, 672938, 670821, 668976, 666837, 664475, 662422, 660988, 660201, 660028, 660139, 659843, 658825, 657637, 656961, 656826, 657034, 657813, 659361, 661238, 662954, 664786, 667377, 670931, 675417, 681016, 687777, 695393, 704007, 714570, 727623, 742318, 757487, 772996, 789067, 804937, 819226, 831128, 840199, 845545, 846406, 843296, 837582, 830260, 821944, 813535, 805852, 798955, 792714, 787608, 784140]
58457G84140j949k68K602O257Q813R629J0205J1463J2156J0969Q443N594K288
58444H70342j707n433p881r255j0121j0403j0091r716r297q055n891l896k688
58431G75908j585o5J408K636M219O211P789Q836J0180J1714J2120J1105R929R022
58417H69427P165L929Q19j102k648m493n798o078o339p143p523p074p057q091
58403H17994q823q237p202o403m898k231J69J259J990L116L593K803K199K898
58389G98227L740L531L157L613M001L388K724K962L270K906K860L859M786M854
58375H47878N199O596P903Q488R586J1392J1689R620P900Q692J0204J0186R826
58362I65159J0961J2271J1848J1108J2317J4299J4448J3134J2469J2233J0788
$$ y = [784140, 782191, 781923, 784525, 790782, 799595, 809224, 819429, 830892, 843048, 854017, 862460, 868054, 870342, 868635, 863202, 855321, 846066, 835945, 825542, 815451, 805735, 796438, 788383, 782492, 778596, 775908, 774323, 774258, 775666, 778302, 782521, 788732, 796521, 805357, 815537, 827251, 839371, 850476, 860405, 869427, 876592, 880521, 881340, 880238, 877590, 873097, 867299, 861221, 854882, 847739, 840216, 833142, 826085, 817994, 809171, 800934, 793732, 787329, 782431, 780200, 780369, 781628, 783618, 786734, 790327, 793130, 795329, 798227, 801967, 805498, 808655, 812268, 816269, 819657, 822381, 825343, 828613, 831519, 834379, 838238, 843024, 847878, 853077, 859673, 867576, 876064, 885650, 897042, 908731, 918351, 926251, 934943, 945147, 955333, 965159, 976120, 988391, 1000239, 1011347, 1023664, 1037963, 1052411, 1065545, 1078014, 1090247, 1101035]
58351A101035Q589P224O260M446K745K741L476L124K500L470N317O151O521Q105
58337A171704J0164J0858J0865J2145J4310J5713J6808J8868K0654K0136J8316
58326A340541J7578J7443J5761J3009J1434J0879R402P236O255O284N712M997
58314A466531N829P653Q655R313J1250J3560J4097J3482J3950J5262J5630J5625
58302A610837J7066J9072J9392J8698J9332K0753K0592J9360J9641K1300K1923
58291A827966K1426K1929K3599K4787K5640K7502K9567L0114L0093L1475L3338
58280B127436L3715L3780L5723L8184L8572L8137L9736M2393M3290M3402M5536
58269B559904M8636M9858N0391N3162N6627N7410N7244O0397O5789O8851O9857
$$ y = [1101035, 1109624, 1116848, 1123108, 1127554, 1130299, 1133040, 1136516, 1139640, 1142140, 1145610, 1150927, 1157078, 1163599, 1171704, 1181868, 1192726, 1203591, 1215736, 1230046, 1245759, 1262567, 1281435, 1302089, 1322225, 1340541, 1358119, 1375562, 1391323, 1404332, 1415766, 1426645, 1436047, 1443283, 1449538, 1455822, 1461534, 1466531, 1472360, 1480013, 1488668, 1497981, 1509231, 1522791, 1536888, 1550370, 1564320, 1579582, 1595212, 1610837, 1627903, 1646975, 1666367, 1685065, 1704397, 1725150, 1745742, 1765102, 1784743, 1806043, 1827966, 1849392, 1871321, 1894920, 1919707, 1945347, 1972849, 2002416, 2032530, 2062623, 2094098, 2127436, 2161151, 2194931, 2230654, 2268838, 2307410, 2345547, 2385283, 2427676, 2470966, 2514368, 2559904, 2608540, 2658398, 2708789, 2761951, 2818578, 2875988, 2933232, 2993629, 3059418, 3128269, 3198126]
58258C198126P2854P7541P9858P9920Q1605Q4897Q6319Q6388Q8816R2907R4695
58247D123926R5052R8591J05138J10578J15303J23139J32699J38945J42864J50207
58237E336442J61126J70702J79110J91126K05976K18223K28530K42738K60574
58228G194547K76476K91208L10884L34784L56525L77114M03856M36542M68505
58219A0450441N01233N43343N94869O47825P02592P67797Q43840R23707J010483
58210A6986130J115816J240782J377747J531504J717536J939488K191677K484166
58202C0584846K840529L271829L782601M403504N187157O172985P393108Q910558
58194G2547117J0805150J3118164J5857057J9045492K2695049K6716811L0909130
$$ y = [3198126, 3270980, 3348521, 3428379, 3508299, 3589904, 3674801, 3761120, 3847508, 3936324, 4029231, 4123926, 4218978, 4317569, 4422707, 4533285, 4648588, 4771727, 4904426, 5043371, 5186235, 5336442, 5497568, 5668270, 5847380, 6038506, 6244482, 6462705, 6691235, 6933973, 7194547, 7471023, 7762231, 8073115, 8407899, 8764424, 9141538, 9545394, 9981936, 10450441, 10951674, 11495017, 12089886, 12737711, 13440303, 14208100, 15051940, 15975647, 16986130, 18101946, 19342728, 20720475, 22251979, 23969515, 25909003, 28100680, 30584846, 33425375, 36697204, 40479805, 44883309, 50070466, 56243451, 63636559, 72547117, 83352267, 96470431, 112327488, 131372980, 154068029, 180784840, 211693970]
58187B11693970L4936816L8060135L8816322L5371668K6771430J4076826Q5558
58180C99812725j2297010k1529850k7558515l0954975l2227360l1768322l0024354
58173B13452339k7480574k4542817k1509872j8602126j5954534j3612248j1575780
58166H0174388r839903q383368p159897o125938n259140m538527l930686l409028
58158C1527901k966229k596058k281118k008069j776793j584940j419560j272155
58150A5622979j146386j042782r50472q61676p80637p10930o46905n84614n28873
58141H369704m82542m39975l97619l60623l32838l10112k88897k71938k60094
58132E225066k47897k32417k17924k07044j95784j81834j69343j60819j52326
$$ y = [211693970, 246630786, 284690921, 323507243, 358878911, 385650341, 399727167, 399812725, 387515715, 365985865, 338427350, 307472375, 275245015, 243476693, 213452339, 185971765, 161428948, 139919076, 121316950, 105362416, 91750168, 80174388, 70334485, 61951117, 54791220, 48665282, 43406142, 38867615, 34936929, 31527901, 28561672, 25965614, 23684496, 21676427, 19899634, 18314694, 16895134, 15622979, 14476593, 13433811, 12483339, 11621663, 10841026, 10130096, 9483191, 8898577, 8369704, 7887162, 7447187, 7049568, 6688945, 6356107, 6045995, 5757098, 5485160, 5225066, 4977169, 4744752, 4526828, 4319784, 4124000, 3942166, 3772823, 3612004, 3459678]
58123C459678j41263j31230j24706j18307j09634j01801r6924r1929q4863p8777
58113B380244p5477p1752o5693o0567n8678n7293n4228n1789n1571n1004m8472
58102A733720m6526m6686m6292m3638m1186m0656l9928l7655l5894l5444l3611
58091A286204k9397k5972k5270k4976k3367k2180k2184k1024j8148j6771j8194
58080A038721j9239j8138j7828k0255k2449k1675j9906j9711j9936j8898j7833
58069H22853j7888j7471j5583j4169j4331j3960j1726r622r011q178o393o160
58057F78361q555j0540j0006r343j0817j2369j1540r814r402r147p316n325n107
58044E59080n503m669l426l220l262k695k824m405n419m409l269l931n061m974
$$ y = [3459678, 3318415, 3187185, 3062479, 2944172, 2834538, 2732737, 2635813, 2543884, 2459021, 2380244, 2304767, 2233015, 2167322, 2106755, 2048077, 1990784, 1936556, 1884767, 1833196, 1782192, 1733720, 1687194, 1640508, 1594216, 1550578, 1509392, 1468736, 1428808, 1391153, 1355259, 1319815, 1286204, 1256807, 1230835, 1205565, 1180589, 1157222, 1135042, 1112858, 1091834, 1073686, 1056915, 1038721, 1019482, 1001344, 983516, 963261, 940812, 919137, 899231, 879520, 859584, 840686, 822853, 804965, 787494, 771911, 757742, 743411, 729451, 717725, 708103, 699092, 690914, 684521, 678361, 669806, 659266, 649260, 639917, 629100, 616731, 605191, 595377, 585975, 576828, 569512, 564187, 559080, 553577, 548908, 545482, 542262, 539000, 536305, 533481, 529076, 523657, 519248, 515979, 512048, 506987, 502013]
58030E02013m953o577q360q264p223p073p319o864o679p839q946q330o817n732
58016D01037m383k148p00j384k530k187j409k027l245l356k896l261l879l531
58002C64101k835k831k716j449oL21K62R79J894K182K537L352L194J373j94M3
57986C70207N94k83j412j065k70q56k095k274j883k339l094k884k365k768l386
57971C43827l101k783l523m018k687q63q64k123k240q91K27M50N20O25N01O46
57955C23703J264J047p68k486k346j436j735k733k658j785j607j835j136N6L20
57940C05865J03J027K971M440N248O305P338P289O510O258O566O629O492O250
57926C79291M717J298j914k608j814k249m006m915m496m393n074n124m031k970
$$ y = [502013, 497060, 490483, 482123, 473859, 466636, 459563, 452244, 445380, 438701, 430862, 421916, 413586, 406769, 401037, 396654, 394506, 393806, 392422, 389892, 387705, 386296, 384269, 381024, 377668, 374772, 371511, 367632, 364101, 361266, 358435, 355719, 354270, 354264, 354585, 354847, 355826, 357720, 359902, 362439, 365791, 368985, 370358, 370164, 370207, 370801, 370518, 369106, 368041, 367771, 366915, 364820, 362546, 360663, 358324, 355230, 352346, 349981, 347213, 343827, 340726, 337943, 334420, 330402, 327715, 326852, 325988, 323865, 321625, 320734, 320961, 321411, 321931, 322556, 323057, 323703, 324967, 326014, 325246, 322760, 320414, 318978, 317243, 314510, 311852, 310067, 308460, 306625, 305489, 305545, 305865, 305968, 306995, 309966, 314406, 319654, 325959, 333297, 340586, 347096, 353354, 359920, 366549, 373041, 379291, 384008, 385306, 383392, 380784, 378970, 376721, 372715, 367800, 363304, 358911, 353837, 348713, 344682, 341712]
57912C41712k539k070j391j138j142n30N09R08N84K62j86j374k695l008k727l203
57896C21972m341m819m405m024l809l095k146j885k018j408k02K92k07o71n41
57881B88693j83K01N94M57m27r84k84P37O89Pl2L56K19M2Q33J792J408K82K71
57862B94671J361J935J805K193K921K472J039O88K015L153K700J457O25K90K50
57847C19575M89M81l99j526j776j544k176l477l875l102k575k970l472l585l704
57832B86364l731l087k330k654l654l617k225q47L4J360L104L768K904K028K234
57817B79651K818K966K868K543J359m42j606j897k576m185n597o037o241o805
57803B56819o931n859m159k754j795j109o99l07M54J218J292R57J086J490J232
$$ y = [341712, 339173, 337103, 335712, 334574, 333432, 332902, 333411, 334319, 334903, 335165, 334979, 333605, 330910, 327902, 325175, 321972, 317631, 312812, 308407, 304383, 300574, 297479, 295333, 293448, 291430, 290022, 289820, 290112, 289905, 289234, 288693, 288510, 288711, 289305, 289762, 289335, 288351, 288067, 288804, 289493, 289500, 289468, 289824, 290043, 290085, 290918, 292710, 294118, 294400, 294671, 296032, 297967, 299772, 301965, 304886, 307358, 308397, 309085, 311100, 314253, 316953, 318410, 319035, 319325, 319575, 320064, 320545, 320146, 318620, 316844, 315300, 313124, 309647, 305772, 302670, 300095, 297125, 293653, 290068, 286364, 282633, 279546, 277216, 274562, 270908, 267291, 265066, 264219, 264253, 265613, 268717, 272485, 275389, 277417, 279651, 282469, 285435, 288303, 290846, 292205, 291763, 290157, 288260, 285684, 281499, 275902, 269865, 263624, 256819, 249888, 244029, 239870, 237116, 235321, 234212, 233513, 233206, 233660, 234878, 236170, 237127, 238213, 239703, 240935]
57788B40935N72Q57K277L486L799M013M660N166N175N100N017M525L945M063M454
57773B98044L863K399J481J386R30j39o28l29p10k365l874m109l798l852m002
57758B84297l985m286m792m360k715j105k97L30J088J242Q48J288K891M043L768
57743B78255L308L764M178L454K427K279K453J845Q29M16N00M42L57M65J71q06
57727C04337j411p08N39J038P17J60o78j859k506j948j046j087j993k755l017
57712B87783l040k771k092j526j657k273k812l135l228k865k223j977k177j903
57698B54104p64K89M02J28L48Q29Q09K51m05j041j653j986k021k099k118j418
57682B43655N1J491K560L745N036N684N915P318J0611J4611J8443K3117K9587
$$ y = [240935, 241507, 242364, 244641, 248127, 251926, 255939, 260599, 265765, 270940, 276040, 281057, 285582, 289527, 293590, 298044, 301907, 304306, 305787, 307173, 308103, 307964, 307336, 307007, 306297, 303932, 300058, 295949, 292151, 288299, 284297, 280312, 276026, 271234, 266874, 264159, 263054, 262757, 263087, 264175, 265417, 266265, 267553, 270444, 274487, 278255, 281563, 285327, 289505, 292959, 295386, 297665, 300118, 301963, 302792, 303208, 303708, 304150, 304507, 304972, 305143, 304337, 302926, 302218, 302757, 303795, 304512, 304672, 303994, 302135, 299629, 297681, 296635, 295548, 293555, 290800, 287783, 284743, 281972, 279880, 278354, 276697, 274424, 271612, 268477, 265249, 262384, 260161, 258184, 256007, 254104, 253340, 253629, 254031, 254159, 254507, 255336, 256145, 256396, 255991, 254950, 253297, 251311, 249290, 247191, 245073, 243655, 243706, 245197, 247757, 251502, 256538, 262222, 268137, 275455, 286066, 300677, 319120, 342237, 371824]
57669C71824L6806M3371M9745N6801O2803O3661N6087L9672J6804p995k9418m3934
57657G16227n1400n3626n2039m7494m1371l5348l0217k5911k2234j8895j5437
57646C22255j2000r553q485p756o309m619l725l513l009j939q51q5M84R59J390
57631B63244J847K032J398J47o34l90J87K88o6p45j894l016k936j558l77l58o92
57614B56477o50j052k455l401k340k70N92l5m95R8R74J353J278R09K67l05n10
57597B50435p16j351k032k204k128k286k362j914j396j427j589j122k75K03L36
57582B30172N33M91k47j127j189n37l9j7k42p94j749k451k196j269l73L92J038
57565B20396R67j02j203j339r17p87o48J24R27Q71N69J181K207K131J034O62J814
$$ y = [371824, 408630, 452001, 501746, 558547, 621350, 685011, 741098, 780770, 797574, 789579, 760161, 716227, 664827, 611201, 559162, 511668, 470297, 434949, 404732, 378821, 356587, 337692, 322255, 310255, 300702, 292217, 284461, 278152, 273533, 269808, 266295, 263286, 261347, 260496, 260411, 260895, 261854, 263244, 265091, 267123, 268521, 268668, 268034, 267644, 267831, 268119, 268053, 267308, 265414, 262398, 259462, 257904, 257527, 257169, 256477, 255827, 254775, 252320, 248919, 246579, 246309, 246901, 246866, 246371, 246469, 247443, 248796, 250074, 250983, 251250, 250945, 250435, 249719, 248368, 246336, 244132, 242004, 239718, 237356, 235442, 234046, 232619, 231030, 229908, 229633, 229836, 230172, 230705, 231196, 230949, 229822, 228633, 228096, 228057, 228040, 227798, 227004, 225255, 222804, 220608, 219339, 218966, 219358, 220396, 221363, 221261, 220058, 218719, 217802, 217015, 216367, 216491, 217418, 218289, 218858, 220039, 222246, 224377, 225411, 226073, 227887]
57548B27887L390M181M079L315J939L99n25p17p21p04l57L36J061J774K393K321
57532B50051J323L71M71J116J195Q79J126J749J683R86Q63J642K334K330K066
57517B70185J906J726J712K229K801K610J998K108K963L439L194L053L229K852
57503C06005J730R61J162J493J109L92j8k28m64m17mJ43l27p47l95M36Q97P21
57485C12449L69L62Q19J408J675J593J650K066K372K199J979K146K221J632Q95
57470C35835Q60J228J096O03O95J420J918J951K087K320K019J340J282K068K773
57455C59495K842K793L051L318L367L371L200K534J856K141L340M288M386M169
57441D04151M073L852L522L542L768L454K678K482L186L832L751L433L399L377
$$ y = [227887, 231277, 235458, 239537, 242852, 244791, 245190, 244665, 243948, 243227, 242523, 242166, 242502, 243563, 245337, 247730, 250051, 251374, 251745, 252216, 253332, 254527, 255406, 256532, 258281, 259964, 260950, 261813, 263455, 265789, 268119, 270185, 272091, 273817, 275529, 277758, 280559, 283169, 285167, 287275, 290238, 293677, 296871, 299924, 303153, 306005, 307735, 308696, 309858, 311351, 312460, 312852, 312834, 312606, 312142, 311725, 311721, 311864, 311537, 310790, 310395, 310831, 311728, 312449, 312818, 313180, 313999, 315407, 317082, 318675, 320325, 322391, 324763, 326962, 328941, 331087, 333308, 334940, 335835, 336695, 337923, 339019, 339622, 340317, 341737, 343655, 345606, 347693, 350013, 352032, 353372, 354654, 356722, 359495, 362337, 365130, 368181, 371499, 374866, 378237, 381437, 383971, 385827, 387968, 391308, 395596, 399982, 404151, 408224, 412076, 415598, 419140, 422908, 426362, 429040, 431522, 434708, 438540, 442291, 445724, 449123, 452500]
57427D52500L162L118L321L361L344L865M595M323L043K449L485M812M718L464
57413E03560K491K356K610K992L581M253M895N678O422O324N106L723L189L293
57399E60473L309L333L952N074N986O429O832P542Q401R038R245R150R167R590
57385F57521J0160J0405J0331J0241R929Q924P530O741O869P135P001O920P339
57372G67046P814P690P051O392N957N809O026O420O608O611O875P420P731P675
57358H63125P728Q023Q051P689P692Q579R817J0655J1072J1354J1383J1018J0590
57345I86776J0461J0490J0353J0006R523Q965Q616Q878R643J0374J0821J1145
57333A106051J1211J0691R966R969J0896J1878J2330J2615J3069J3321J3149J3032
$$ y = [452500, 455662, 458780, 462101, 465462, 468806, 472671, 477266, 481589, 484632, 487081, 490566, 495378, 500096, 503560, 506051, 508407, 511017, 514009, 517590, 521843, 526738, 532416, 538838, 545162, 550268, 553991, 557180, 560473, 563782, 567115, 571067, 576141, 582127, 588556, 595388, 602930, 611331, 620369, 629614, 638764, 647931, 657521, 667681, 678086, 688417, 698658, 708587, 717511, 725041, 731782, 738651, 745786, 752787, 759707, 767046, 774860, 782550, 789601, 795993, 801950, 807759, 813785, 820205, 826813, 833424, 840299, 847719, 855450, 863125, 870853, 878876, 886927, 894616, 902308, 910887, 920704, 931359, 942431, 953785, 965168, 976186, 986776, 997237, 1007727, 1018080, 1028086, 1037609, 1046574, 1055190, 1064068, 1073711, 1084085, 1094906, 1106051, 1117262, 1127953, 1137919, 1147888, 1158784, 1170662, 1182992, 1195607, 1208676, 1221997, 1235146, 1248178]
57321A248178J3346J3719J3747J3682J3887J4320J4925J5811J6697J6940J6541
57310A411793J6283J6531J6758J6633J6629J7119J7789J8443J9342K0239K0186
57299A607745J9028J8028J8237J9153J9819K0316K1116K1799K1572K0590J9786
57288A827189J9652K0020K0665K1413K1933K2067K2152K2525K3043K3430K3759
57277B067848K4223K4811K5420K5943K6108K5851K5790K6535K7455K7228K5781
57266B352993K4575K4554K4986K4888K4464K4357K4501K4527K4508K4561K4456
57255B623370K4250K4567K5619K6738K7359K7644K7750K7422K6884K6931K7589
57244B916123K7803K7098K6374K6255K6006K5022K4124K4142K4354K3652K2341
$$ y = [1248178, 1261524, 1275243, 1288990, 1302672, 1316559, 1330879, 1345804, 1361615, 1378312, 1395252, 1411793, 1428076, 1444607, 1461365, 1477998, 1494627, 1511746, 1529535, 1547978, 1567320, 1587559, 1607745, 1626773, 1644801, 1663038, 1682191, 1702010, 1722326, 1743442, 1765241, 1786813, 1807403, 1827189, 1846841, 1866861, 1887526, 1908939, 1930872, 1952939, 1975091, 1997616, 2020659, 2044089, 2067848, 2092071, 2116882, 2142302, 2168245, 2194353, 2220204, 2245994, 2272529, 2299984, 2327212, 2352993, 2377568, 2402122, 2427108, 2451996, 2476460, 2500817, 2525318, 2549845, 2574353, 2598914, 2623370, 2647620, 2672187, 2697806, 2724544, 2751903, 2779547, 2807297, 2834719, 2861603, 2888534, 2916123, 2943926, 2971024, 2997398, 3023653, 3049659, 3074681, 3098805, 3122947, 3147301, 3170953, 3193294]
57233C193294K1466K1089K0545J9685J8725J7547J6286J5911J7034J8721J9713
57222C400016K0129K0823K1651K1756K1147K0693K0740K0861K0767K0601K0471
57211C629655K0360K0217J9656J8208J6305J5091J4608J3339J0454P306N520M797
57199C795516M042L546M299N960P306Q168R225J0238J0295R546R081R189R229
57186C895640R198R893J1463J3173J4630J6010J6973J6630J4821J2314R669O830
57174D047244L894J318o92k209l161l628m264n536o862p440p571q160r245j0254
57160C983434j1224j2518j3497j2969j0904q466o313m048j479P87K237L014L397
57147C911451L569L867M529N213N431N263M955M157K454K66j716l571n648p485
$$ y = [3193294, 3214760, 3235849, 3256394, 3276079, 3294804, 3312351, 3328637, 3344548, 3361582, 3380303, 3400016, 3420145, 3440968, 3462619, 3484375, 3505522, 3526215, 3546955, 3567816, 3588583, 3609184, 3629655, 3650015, 3670232, 3689888, 3708096, 3724401, 3739492, 3754100, 3767439, 3777893, 3785199, 3790719, 3795516, 3799558, 3803104, 3807403, 3813363, 3820669, 3828837, 3838062, 3848300, 3858595, 3868141, 3877222, 3886411, 3895640, 3904838, 3914731, 3926194, 3939367, 3953997, 3970007, 3986980, 4003610, 4018431, 4030745, 4040414, 4047244, 4051138, 4052456, 4051764, 4049555, 4046394, 4042766, 4038502, 4032966, 4026104, 4018664, 4011093, 4002933, 3993688, 3983434, 3972210, 3959692, 3946195, 3933226, 3922322, 3913856, 3907543, 3903495, 3902016, 3902803, 3905040, 3908054, 3911451, 3915020, 3918887, 3923416, 3928629, 3934060, 3939323, 3944278, 3948435, 3950889, 3951155, 3949439, 3945868, 3940220, 3932735]
57133C932735q308q172p529o135l579m42K373N050Q324J1975J5182J7900K0454
57120C979828K2261K2596K2369K3479K6585L1131L7272M5979N7367P0645Q5816
57109D425328J03589J23642J44849J67430J93208K23732K60060L04555L60821
57100F307214M31423N17533O21294P46738Q98035J078816J293409J546085J837507
57091A5278054K163000K514205K880047L245841L594469L909989M178380M385127
57083D2149112M516248M561450M507317M319938L940736L316289K444899J395919
57075G1151908K81232p94569j763650k591460l260304l761238m095735m276661
57067E0889523m323938m259146m103477l878002l603351l298630k980868k664746
$$ y = [3932735, 3924427, 3916255, 3908726, 3902591, 3899012, 3898570, 3900943, 3905993, 3914317, 3926292, 3941474, 3959374, 3979828, 4002089, 4024685, 4047054, 4070533, 4097118, 4128249, 4165521, 4211500, 4268867, 4339512, 4425328, 4528917, 4652559, 4797408, 4964838, 5158046, 5381778, 5641838, 5946393, 6307214, 6738637, 7256170, 7877464, 8624202, 9522237, 10601053, 11894462, 13440547, 15278054, 17441054, 19955259, 22835306, 26081147, 29675616, 33585605, 37763985, 42149112, 46665360, 51226810, 55734127, 60054065, 63994801, 67311090, 69755989, 71151908, 71433140, 70638571, 68874921, 66283461, 63023157, 59261919, 55166184, 50889523, 46565585, 42306439, 38202962, 34324960, 30721609, 27422979, 24442111, 21777365]
57059B1777365k361728k079323j821782j591482j389249j213956j062981r33390
57051I323474q22290p26595o43632n72015n10922m58622m12729l71911l36048
57042D468710l04595k76146k49937k26321k05246j85646j66956j49819j34400
57033B569644j19326j03428q7317p1953n6711m0314k2752m683J3911L1897M3696
57022B152664M0705J8335j8627n8515r0585j10306j18598j18184j11560j01218
57012A484111q9869p9484p0529o2606n5486m9165m3390l7950l3262k9974k7985
57001I04411k6486k4933k3360k1798k0152j8688j7886j7553j6761j4962j2651
56990F89181j0602q929p202n131k803m03K061M663O994P744N495L53n808j1142
$$ y = [21777365, 19415637, 17336314, 15514532, 13923050, 12533801, 11319845, 10256864, 9323474, 8501184, 7774589, 7130957, 6558942, 6048020, 5589398, 5176669, 4804758, 4468710, 4164115, 3887969, 3638032, 3411711, 3206465, 3020819, 2853863, 2704044, 2569644, 2450318, 2346890, 2259573, 2187620, 2130909, 2090595, 2067843, 2063160, 2077071, 2108968, 2152664, 2193369, 2211704, 2193077, 2134562, 2043977, 1933671, 1815073, 1696889, 1585329, 1484111, 1394242, 1314758, 1244229, 1181623, 1126137, 1076972, 1033582, 995632, 962370, 932396, 904411, 877925, 852992, 829632, 807834, 787682, 768994, 751108, 733555, 716794, 701832, 689181, 678579, 669650, 662448, 657317, 654514, 654111, 656172, 660835, 667829, 675573, 681068, 681421, 675613, 664471]
56976F64471j5343j8709k0706k0623j9045j7285j5625j3426j0747q434o588m391
56964D93549j592J180L683O328R049J1262J3164J5586J8105J8670J5735R621J541
56951F15881p288j5160k0180k2086k2534k2816k2349k0239j7033j3873j1003q146
56939D13174n516l365j167J853N843J0559J5756K0816K4733K7015K7633K5694
56927E63028J9480Q835l542j4297k2118k7378l0185l0259k8169k5316k2647k0210
56915C67222j7760j5182j2523j0222q887q429p914o752n428m552l897k970j903
56902B60803j076m47J87P38J246K087L283M225M617N031O031P527R422J2003J5113
56887C30790J7807J9524K0641K1198K0053J6190J0116L184l619r449j3156j4205
$$ y = [664471, 649128, 630419, 609713, 589090, 570045, 552760, 537135, 523709, 512962, 504528, 497940, 493549, 491957, 493137, 496820, 503148, 512197, 523459, 536623, 552209, 570314, 588984, 604719, 614340, 615881, 608593, 593433, 573253, 551167, 528633, 505817, 483468, 463229, 446196, 432323, 421320, 413174, 407658, 404293, 403126, 404979, 410822, 421381, 437137, 457953, 482686, 509701, 537334, 563028, 582508, 591343, 587801, 573504, 551386, 524008, 493823, 463564, 435395, 410079, 387432, 367222, 349462, 334280, 321757, 311535, 302648, 294219, 286305, 279553, 274125, 269573, 265676, 262706, 260803, 259727, 259280, 259467, 260205, 261451, 263538, 266821, 271046, 275663, 280694, 286725, 294252, 303674, 315677, 330790, 348597, 368121, 388762, 409960, 430013, 446203, 456319, 459503, 455884, 446435, 433279, 419074]
56875D19074j3375j1697r401o568l822j381J631N767J0054J3390J6394K0545K6109
56862D66720L2242L8613M5373N1600N4919N2860M4107K9136J0587p488k1894l1779
56850G64996l7599l9518l7746l3511k8266k2360j5586q463j692N167J3122K2189
56838E80733L1603M1277N1762O2900P3651Q2810Q8427Q6829P4202N0163J8975
56827A243332j2983m0461o0494p2184p6363p4947o9804o2233n3329m4219l5640
56816F40675k7582j9485j0703r97R184J9058K8339L7416M6526N4961O0982O1932
56804I00306N4810L8202J4489j0747l2281m7903n7692o2239o2381n9392n4215
56793F20957m7157l9037l1481k5188j9082j2310n880r22L467Q951J5412K1401
$$ y = [419074, 405699, 394002, 384601, 378033, 374211, 372830, 374461, 380228, 390282, 403672, 420066, 440611, 466720, 498962, 537575, 582948, 634548, 689467, 742327, 786434, 815570, 826157, 818669, 796775, 764996, 727397, 687879, 650133, 616622, 588356, 565996, 550410, 541947, 540255, 545422, 558544, 580733, 612336, 653613, 705375, 768275, 841926, 924736, 1013163, 1099992, 1174194, 1224357, 1243332, 1230349, 1189888, 1129394, 1057210, 980847, 905900, 836096, 773863, 720534, 676315, 640675, 613093, 593608, 582905, 581908, 591092, 610150, 638489, 675905, 722431, 777392, 838374, 900306, 955116, 993318, 1007807, 997060, 964779, 916876, 859184, 796945, 734564, 675172, 620957, 573800, 534763, 503282, 478094, 459012, 446702, 440822, 439900, 443367, 452318, 467730, 489131]
56781D89131K6321L0257L2057K9521K1682R667m385j8060k8838l5262l7992l8584
56769D75515l7531l4716l1060k7958k5373k2198j8443j5330j3281j1493r644q394
56757B20094p918p383o313n176m364l749l441l765m338m302l643l175l129k948
56743A56450k500k237k132j698j167j267j719j339P8J287J317M79o09j691k280
56728A40972j722l21O84O95L03R0J5K24J152K371K652J657N29K37M24M50M84Q92
56710A51788J420J638J562J349J019P76Q87J010M56o19j191q21k40j85m70o33
56694A57746o42n81m19l13n09p08l66K75L23l53q55o82m43p22j148j089m86M26
56676A49454J513K491K885K618K094J441M02q85j695j608r95l90J03N92J167J930
$$ y = [489131, 515452, 545709, 577766, 607287, 628969, 638636, 634251, 616191, 587353, 552091, 514099, 475515, 437984, 403268, 372208, 344250, 318877, 296679, 278236, 262906, 249625, 238132, 228488, 220094, 212176, 204793, 198480, 193304, 188940, 185191, 181750, 177985, 173647, 169345, 165702, 162527, 159398, 156450, 153950, 151713, 149581, 147883, 146716, 145449, 143730, 142391, 142469, 143756, 145073, 145552, 144943, 143252, 140972, 139250, 138929, 139613, 140308, 140611, 140701, 140716, 140940, 142092, 144463, 147115, 148772, 149301, 149538, 149962, 150412, 150896, 151788, 153208, 154846, 156408, 157757, 158776, 159552, 160439, 161449, 161905, 161286, 160095, 159274, 159034, 158849, 158379, 157746, 157104, 156523, 156104, 155791, 155282, 154574, 154208, 154483, 154806, 154453, 153598, 152916, 152473, 151751, 150603, 149514, 149028, 149454, 150967, 153458, 156343, 158961, 161055, 162496, 162898, 162013, 160318, 158710, 157715, 157325, 157428, 158020, 159187, 161117]
56660A61117K740L029K446J502R68Q25O18M43O94J089J040P23P64J054J019Q08
56644A80879R12Q95K2j016o80R47K006J514N89M19N99K73l74p07p50q53j008j070
56626A82597j066r41o30m97q97j305r02n9J6q21j411j211j057j570k118j975j382
56609A64771q60m80k94n53j008r44k78K73L50L35M10K81po8r6n57j019n90M34
56590A60100R08P76J018J509R85m96j150k55O51L69j23M42J550K096K112K012
56574A72504J500N40J93J108K264K444K055K224L001L670M050M445M962N756P210
56559B17926R124J0610J1329J1760J1698R912O218K477L98m57j310k073j998j363
56545B84251j097j358j704j997k212k099j835k170l117l547k968k516l150m039
$$ y = [161117, 163857, 166886, 169332, 170834, 171802, 172627, 173245, 173688, 174382, 175471, 176511, 177234, 177998, 179052, 180071, 180879, 181791, 182686, 182708, 181692, 181012, 181959, 183965, 185479, 186068, 186487, 187086, 187359, 186985, 186278, 185528, 184675, 183667, 182597, 181531, 180590, 179960, 179463, 178566, 177261, 176359, 176300, 176316, 175495, 174084, 172873, 171816, 170246, 168128, 166153, 164771, 163911, 163431, 163137, 162584, 161576, 160632, 160354, 160627, 160977, 161312, 161722, 162003, 161996, 161928, 161832, 161275, 160256, 159666, 160100, 161008, 161784, 162802, 164311, 165296, 164800, 163650, 163395, 164046, 164415, 164292, 164734, 166284, 168380, 170492, 172504, 174004, 174544, 174737, 175845, 178109, 180553, 182608, 184832, 187833, 191503, 195553, 199998, 204960, 210716, 217926, 227050, 237660, 248989, 260749, 272447, 282359, 288577, 291054, 291452, 290995, 289685, 287612, 285614, 284251, 283154, 281796, 280092, 278095, 275883, 273784, 271949, 269779, 266662, 263115, 260147, 257631, 254481, 250442]
56531B50442l970l262k936k955k694k332k353k381j836j164j141j487j352p56
56517B19823m12n73r58j396j740j663j269j276j947k572k566k285k113j737r97
56502A96319m09k14QK39k13j173j343l90L28Pl29J9k0j104j704m65J310J600P73
56483A93239N20Q56N38l06l40N91J339J430J314R75kj139j445q90j98M34J115
56466A98031J415J139J171K122K807J861J27l94N16J264J022M79K58K33L96Q07
56450B13254Q44r0j254j340l38O56J131J343J227N42k14m37n14j030j402q21N2
56433B11609n5r32j300q91m69j75M56J137J145P79Q99J284J030K59j93l80r29
56416B13274j407r27J6J44l29k3J084J488O41k69l54r8%K02N65O08L22K52L65
$$ y = [250442, 246472, 243210, 240274, 237319, 234625, 232293, 229940, 227559, 225723, 224559, 223418, 221931, 220579, 219823, 219411, 218838, 217880, 216484, 214744, 213081, 211812, 210536, 208589, 206017, 203451, 201166, 199053, 197316, 196319, 195910, 195696, 195704, 195943, 195730, 194557, 193214, 192824, 193152, 193159, 192830, 192849, 192829, 191725, 190021, 189556, 190866, 192466, 193239, 193759, 194615, 195153, 194847, 194507, 195098, 196437, 197867, 199181, 200156, 200154, 199015, 197570, 196680, 196482, 196916, 198031, 199446, 200585, 201756, 203878, 206685, 208546, 208673, 208279, 208795, 210059, 211081, 211560, 211818, 212051, 212447, 213254, 214098, 214008, 212754, 211414, 211076, 211732, 212863, 214206, 215433, 215975, 215761, 215324, 214810, 213780, 212378, 211557, 211609, 211554, 210622, 209322, 208431, 207962, 207787, 208243, 209380, 210525, 211304, 212203, 213487, 214517, 214776, 214583, 214203, 213274, 211867, 210940, 210956, 211100, 210771, 210748, 211832, 213320, 213961, 213692, 213338, 213240, 213240, 213442, 214007, 214615, 214937, 215189, 215554]
56397B15554J10k39L01J783L071L407L101K554J803J152J038J232J139R21J200
56382B38127J878K262K164J856J243K44m69l53m2k90m65L68J508J530O45K59N77
56365B51042N43M5J34J017J708J758J671J466O18m63n59M98J508J690J414J122
56349B65212Q85J038J835K564K326J597J596K375K937K945K847K651K131J793
56335B94732K122K407J914J508K189K922K122O32O62K236L429L780M557N554M805
56320C35571K059k55m86K23L16l2r4K3J78P04J344J266O91Q62K004K933L048L019
56302C53374L243L357L497M212M975M684L772L801M795N142M382L875M300M744
56288D12153M706M948N832O757P632Q904R996R929R557J0690J2862J3657J2639
$$ y = [215554, 215664, 215425, 215726, 217509, 220580, 223987, 227088, 229642, 231445, 232597, 233635, 234867, 236006, 236927, 238127, 240005, 242267, 244431, 246287, 247530, 247774, 247305, 246952, 246910, 246620, 246155, 246523, 248031, 249561, 250206, 250465, 251042, 251585, 251630, 251764, 252781, 254489, 256247, 257918, 259384, 260002, 259539, 258980, 259478, 260986, 262676, 264090, 265212, 266097, 267135, 268970, 271534, 273860, 275457, 277053, 279428, 282365, 285310, 288157, 290808, 292939, 294732, 296854, 299261, 301175, 302683, 304872, 307794, 309916, 310548, 311210, 313446, 316875, 320655, 325212, 330766, 335571, 337630, 337375, 336889, 337112, 337428, 337396, 337302, 337325, 337503, 338207, 339551, 340817, 341508, 342370, 344374, 347307, 350355, 353374, 356617, 359974, 363471, 367683, 372658, 377342, 381114, 384915, 389710, 394852, 399234, 403109, 407409, 412153, 416859, 421807, 427639, 434396, 442028, 450932, 460928, 470857, 480414, 491104, 503966, 517623, 530262]
56275E30262J2067J3071J4068J3979J4132J5637J7435J8411J9275K0956K3067
56264G12360K5178K7771L0900L3773L6456M0096M4814M9376N3690N9316O6890
56253A180620P5293Q4119R4503J06673J19120J31082J43404J56080J67506J77044
56243B435444J85675J93099J96927J95815J90721J81974J67963J48071J24021
56234D019710R6932O6004L1734k501l3914o2736q9449j12549j31015j46212j59063
56223C476941j67858j71221j70829j68968j65567j59886j52942j45873j37900
56214B035897j28216j18105j09070j00652r2014q3862p6950p0551o4241n9116
56204A133120n5487n1525m6072m0641l6694l3241k9198k5693k3827k2357k0050
$$ y = [530262, 542329, 555400, 569468, 583447, 597579, 613216, 630651, 649062, 668337, 689293, 712360, 737538, 765309, 796209, 829982, 866438, 906534, 951348, 1000724, 1054414, 1113730, 1180620, 1255913, 1340032, 1434535, 1541208, 1660328, 1791410, 1934814, 2090894, 2258400, 2435444, 2621119, 2814218, 3011145, 3206960, 3397681, 3579655, 3747618, 3895689, 4019710, 4116642, 4182646, 4214380, 4211879, 4177965, 4115229, 4025780, 3913231, 3782216, 3636004, 3476941, 3309083, 3137862, 2967033, 2798065, 2632498, 2472612, 2319670, 2173797, 2035897, 1907681, 1789576, 1680506, 1579854, 1487840, 1403978, 1327028, 1256477, 1192236, 1133120, 1077633, 1026108, 980036, 939395, 902701, 869460, 840262, 814569, 790742, 768385, 748335]
56193G48335j8065j7601j7235j5225j2521j0939j0122q820p420o778o135m624
56181F12850l252l161l505l104k566k665k520j394m90p54q99K91J669J918J934
56166E94352K783L461L010K698L641M543M244M275O110Q156Q347P698Q318R836
56152F71472J0681J1123J2242J3679J5026J7590K2109K6852L0561L5100M2293
56141I08728N0592N7819O4752P2641P9479Q2473Q2125Q0308P6353O8887N9762
56130A683919N2272M6886M2300L8983L7777L6430L1632K3614J5245P721N52n477
56118B011854r197j2179j7495k5938l6178m7478n9248o9273p5457p8267p8824
56107A502320p6180o9396o0511n2361m5074l7611l0834k5870k1523j6517j2272
$$ y = [748335, 730270, 712669, 695434, 680209, 667688, 656749, 646627, 637807, 630387, 623609, 617474, 612850, 609598, 606437, 602932, 599828, 597262, 594597, 592077, 590683, 590193, 589439, 588540, 588831, 590500, 592418, 594352, 597135, 600596, 603606, 606304, 609945, 614488, 618732, 623007, 629117, 637273, 645620, 653318, 661636, 671472, 682153, 693276, 705518, 719197, 734223, 751813, 773922, 800774, 831335, 866435, 908728, 959320, 1017139, 1081891, 1154532, 1234011, 1316484, 1398609, 1478917, 1555270, 1624157, 1683919, 1736191, 1783077, 1825377, 1864360, 1902137, 1938567, 1970199, 1993813, 2009058, 2016779, 2017331, 2011854, 2002657, 1990478, 1972983, 1947045, 1910867, 1863389, 1804141, 1734868, 1659411, 1581144, 1502320, 1426140, 1356744, 1296233, 1243872, 1198798, 1161187, 1130353, 1104483, 1082960, 1066443, 1054171]
56096A054171j0207q557n321j978o61j17J715L660L888L955N992Q339Q480P872
56082A071231R200J1266J1376J0603J1593J3345J3181J1974J2271J3225J2511
56071A201776J1292J2141J3939J4098J3743J5356J7475J7278J6320J7810K0308
56060A371536K0245J8698J9376K1616K1817K0233J9989K0779J9969J8496J9155
56049A591909K0601J9612J7744J8987K2333K3608K3159K4553K7157K7522K6729
56038A843914K8789L2807L4478L4204L5973L9243M0017L9029M0629M4294M5601
56027B258978M4836M6255M9399M9924M8506N0069N4522N7138N7842O1050O6541
56016B845060O9715P0717P4081P9590Q2865Q4581Q9313R5765R8305R7747J00165
$$ y = [1054171, 1043964, 1035407, 1030086, 1028108, 1027447, 1027330, 1029045, 1032705, 1036593, 1040548, 1046540, 1054879, 1063359, 1071231, 1080431, 1091697, 1103073, 1113676, 1125269, 1138614, 1151795, 1163769, 1176040, 1189265, 1201776, 1213068, 1225209, 1239148, 1253246, 1266989, 1282345, 1299820, 1317098, 1333418, 1351228, 1371536, 1391781, 1410479, 1429855, 1451471, 1473288, 1493521, 1513510, 1534289, 1554258, 1572754, 1591909, 1612510, 1632122, 1649866, 1668853, 1691186, 1714794, 1737953, 1762506, 1789663, 1817185, 1843914, 1872703, 1905510, 1939988, 1974192, 2010165, 2049408, 2089425, 2128454, 2169083, 2213377, 2258978, 2303814, 2350069, 2399468, 2449392, 2497898, 2547967, 2602489, 2659627, 2717469, 2778519, 2845060, 2914775, 2985492, 3059573, 3139163, 3222028, 3306609, 3395922, 3491687, 3589992, 3687739, 3787904]
56005C787904J05593J08813J10705J17095J26733J32628J35300J42149J53481
55996D920401J62251J68097J78090J92752K05118K14671K28136K45528K60030
55987F775074K72671K91766L16623L37977L55887L80325M12426M43088M72075
55978A0057912N09741N57301O05024O52804P12105P84351Q59067R36916J031872
55969A6707093J147009J272502J411515J581953J788561K022063K290904K623189
55961C0844789L032840L519271M107190M849103N782873O931474Q351868J0130795
55953G7550203J2318662J4921774J7963517K1470275K5370419K9473825L3495764
55946B32564439L6833530L8172762L5634273K7893289J5477474Q83247j2757957
$$ y = [3787904, 3893497, 4002310, 4113015, 4230110, 4356843, 4489471, 4624771, 4766920, 4920401, 5082652, 5250749, 5428839, 5621591, 5826709, 6041380, 6269516, 6515044, 6775074, 7047745, 7339511, 7656134, 7994111, 8349998, 8730323, 9142749, 9585837, 10057912, 10567653, 11124954, 11729978, 12382782, 13094887, 13879238, 14738305, 15675221, 16707093, 17854102, 19126604, 20538119, 22120072, 23908633, 25930696, 28221600, 30844789, 33877629, 37396900, 41504090, 46353193, 52136066, 59067540, 67419408, 77550203, 89868865, 104790639, 122754156, 144224431, 169594850, 199068675, 232564439, 269397969, 307570731, 343205004, 371098293, 386575767, 387459014, 374701057]
55939C74701057k3248061k9876567l2972151l3287273l1686220k8990635k5827979
55932A68812171k2580983j9476355j6663681j4208514j2095201j0288385q769006
55925F4730046p506653o446006n542937m782730m150048l612494l146495k750459
55917B6792224k419856k134481j880885j663365j482403j323979j179525j055617
55909A3652113r54745q65567p80876p07192o48213n95452n43254m97224m60332
55900G599258m25483l88967l57080l32725l08975k82322k59162k42920k27332
55891D774292k08679j92497j82085j71958j58597j46577j38335j28798j15746
55882C331020j05033r9975r5754q9758q7218r0760r4119r2158q8258q6094q2959
$$ y = [374701057, 351452996, 321576429, 288604278, 255317005, 223630785, 194640150, 168812171, 146231188, 126754833, 110091152, 95882638, 83787437, 73499052, 64730046, 57223393, 50777387, 45234450, 40451720, 36301672, 32689178, 29542683, 26792224, 24372368, 22237887, 20357002, 18693637, 17211234, 15887255, 14707730, 13652113, 12697368, 11831801, 11050925, 10343733, 9695520, 9100068, 8556814, 8059590, 7599258, 7173775, 6784808, 6427728, 6095003, 5786028, 5503706, 5244544, 5001624, 4774292, 4565613, 4373116, 4191031, 4019073, 3860476, 3713899, 3575564, 3446766, 3331020, 3225987, 3126012, 3030258, 2940500, 2853282, 2762522, 2668403, 2576245, 2487987, 2401893, 2318934]
55871B318934p6910p2145p1340p0396o6216o2249o1161n9459n4537m9985m8688
55860A625848m7462m3553l9946l9291l8845l6147l3601l2980l1452k7516k4847
55849A230208k5830k7090k5741k4284k5087k5761k4337k3419k4807k5479k3211
55838I55162k0919k1117k1276j8971j6536j6263j6007j3833j2219j3266j4442
55827G70313j3332j2059j2791j3369j1690j0018j0692j1719j0924j0263j1834
55816F41622j3529j2950j1793j2187j2420j0463q070p275o384l501n69K22O00
55803E43303K754N087N519N762P994J0364J0042Q013O795N956L855J312k49j839
55789F14668m571o776o909o683p863q769p546o168p293r746j0934j1373j2848
$$ y = [2318934, 2242024, 2169879, 2098539, 2028143, 1961927, 1899678, 1838517, 1779058, 1724521, 1674536, 1625848, 1578386, 1534833, 1494887, 1455596, 1416751, 1380604, 1347003, 1314023, 1282571, 1255055, 1230208, 1204378, 1177288, 1151547, 1127263, 1102176, 1076415, 1052078, 1028659, 1003852, 978373, 955162, 934243, 913126, 891850, 872879, 856343, 840080, 824073, 810240, 798021, 784755, 770313, 756981, 744922, 732131, 718762, 707072, 697054, 686362, 674643, 663719, 653456, 641622, 628093, 615143, 603350, 591163, 578743, 568280, 560210, 552935, 546551, 543050, 542481, 542703, 543303, 546057, 551144, 556663, 562425, 570419, 580783, 590825, 598838, 605633, 611589, 615444, 616756, 616507, 614668, 610097, 603321, 596412, 589729, 581866, 573097, 565551, 559383, 552090, 542344, 531410, 520037, 507189]
55776E07189j4367j3831j1833j0115q192m937j601J38J153K606K892L62l093m660
55762D41711m900n862p001o612n573n784o486n681l855k909k821k658l258n570
55748C72741p805p745o489o583p756p904o901o125n390l772k305k574l595l323
55734B94474k132j798k146j832j301j822k713k677k711m433o602o729n161m179
55720B48238l940k813j064o33j547j885j097l70R6J201K549K824K316K435L033
55705B49343K770J822J544J836J367J9j347k934n189o748o013m209l889m930n026
55690B18416l743k870k893k411j217p96j286q44J256L428M324M377M246L854L434
55675B27275L537L606K380%j938k599k541k274j873j805k371k647j686l15R3K5
$$ y = [507189, 492822, 478991, 467158, 457043, 448851, 443914, 442313, 442451, 443604, 446210, 449102, 449464, 446371, 441711, 436811, 430949, 423948, 417336, 411763, 405979, 399493, 393812, 389957, 387048, 384227, 381569, 378311, 372741, 364936, 357191, 350702, 344119, 336363, 328459, 321558, 315433, 310043, 306271, 303966, 301392, 297797, 294474, 292342, 290544, 288398, 286566, 285265, 283443, 280730, 278053, 275342, 270909, 264307, 257578, 252417, 248238, 244298, 241485, 240421, 239788, 238241, 236356, 235259, 234889, 234985, 236186, 238735, 241559, 243875, 246310, 249343, 252113, 253935, 255479, 257315, 258682, 258701, 257354, 254420, 249231, 242483, 236470, 232261, 228372, 223442, 218416, 214673, 211803, 208910, 206499, 205282, 204486, 203200, 202356, 203612, 207040, 211364, 215741, 219987, 223841, 227275, 230812, 234418, 236798, 236798, 234860, 232261, 229720, 227446, 225573, 223768, 221397, 218750, 217064, 216749, 216842, 216867]
55659B16867Q63K174K362J520J175J518J443J057J537K511K293Q87J60O88R33
55644B37988Pj082j523j845k457l013l681n075o600o811n762n058n288n401m882
55629A79517m452m240l414k136j786k599l046k220j067n08j69L28L89l54j298
55614A52945j864k132k073j466p93r05j580j760j318j127j398j482j332j525j817
55599A30373j344l34R5j61k25r7o05j478j513p75n28q29l88Q47J239J87q87r28
55581A22649n89m52kQ41J132P74J020K262L099K664K054K383L154L639M212N051
55565A53891N046L359Q82r88k014k614k833k774k972l502l669l250k937l051l032
55550A29542k754k868l285k898j591q73j462j802m07J768K754K279J626J521J612
$$ y = [216867, 217730, 219904, 222266, 223786, 224961, 226479, 227922, 228979, 230516, 233027, 235320, 236207, 236367, 237055, 237988, 237995, 236913, 235390, 233545, 231088, 228075, 224394, 219319, 212719, 205908, 200146, 195088, 189800, 184399, 179517, 175065, 170825, 167411, 165275, 163489, 160890, 157844, 155624, 154557, 154049, 153880, 154208, 154597, 154243, 152945, 151081, 148949, 146876, 145410, 144617, 143712, 142132, 140372, 139054, 137927, 136529, 135047, 133715, 132190, 130373, 129029, 128695, 128790, 128629, 128404, 128307, 127702, 126224, 124711, 123936, 123408, 122579, 122191, 123038, 124277, 124464, 123577, 122649, 122060, 121608, 121606, 122447, 123579, 124353, 125373, 127635, 130734, 133398, 135452, 137835, 140989, 144628, 148840, 153891, 158937, 162296, 163178, 162190, 160176, 157562, 154729, 151955, 148983, 145481, 141812, 138562, 135625, 132574, 129542, 126788, 123920, 120635, 117737, 116146, 115273, 113811, 112009, 111602, 113370, 116124, 118403, 120029, 121550, 123162]
55535A23162J517J266R38P05Q72J346J562J307R77O52j31j342k184k356k546l121
55519A22624l368k702j686j109r29q66j099j691k069j784j178p06l16J03L01J42
55503A03667k24p87j522j785j000M5q6j223j642o91K33K7n10l36J49J99J82N76
55485I5272P31n3j047j076k69L80N58O63P86O91M95M56M60L62L90N81M05m38j378
55466I7969j752j677j536j254p19l32m44o75m57J22N01L32l01r71j087m52K80
55449H7547L15j45k69L6J34rK03O92O65J23l1K79R0o95q23O6N28l73j354q29P30
55428H6880J735J685J137L93m26p70l22K66L26K40N84R37N92j74n05j88L59Q09
55410I3558Q61J24j207k127j993j259n33K53J066J216M34l49l09M9j34o54p61
$$ y = [123162, 124679, 125945, 126883, 127588, 128460, 129806, 131368, 132675, 133652, 134304, 134173, 132831, 130647, 128291, 125745, 122624, 119256, 116554, 114868, 113759, 112830, 111964, 110865, 109174, 107105, 105321, 104143, 103437, 103121, 103224, 103525, 103667, 103443, 102656, 101134, 99349, 98349, 98394, 98308, 97085, 95443, 94752, 94985, 95012, 94502, 94166, 94315, 94514, 94696, 95272, 96003, 95950, 94903, 93827, 93558, 93938, 94496, 95159, 95945, 96636, 97131, 97587, 98047, 98409, 98799, 99380, 99785, 99347, 97969, 96217, 94540, 93004, 91750, 91031, 90699, 90255, 89580, 89123, 89245, 89746, 90078, 89777, 88806, 87719, 87267, 87547, 87862, 87717, 87448, 87484, 87618, 87609, 87812, 88504, 89169, 89292, 89261, 89540, 89630, 88935, 88112, 88178, 88706, 88333, 86979, 86150, 86880, 88615, 90300, 91437, 91830, 91404, 90634, 90312, 90578, 90904, 91144, 91728, 92665, 93257, 93083, 92578, 92390, 92749, 93558, 94419, 94543, 93336, 91209, 89216, 87957, 87424, 87677, 88743, 89959, 90393, 90044, 89735, 89784, 89650, 88996, 88235]
55393H8235m07l7J98K60o6n61m84J88M35j99o71o2J000J560J821K282K418J559
55375I7469K10p51j321j702j405l45K40n38j604j496o85n36r23p48k05m01j169
55358H4090j326q96j034j702j484m6J114R26J54j19N1J73L14O42Q44O39K31j69
55340H2402o31j072j154q13l33J69P22J049Q07K82J13L69N92O50Q17J052R66N38
55322H6525J70J6p8j07M6J48p8l47j68L64P47Q70R42R00N45P5k24n76j278j923
55302H6569j859j101j43Q25J729K047J410M37L6R3j64p54r29m66M5J49n0l44n66
55283H6964m11J14L24k55r88r72l83l3MJ78K32m21j285j153M0R50P00j25n85m66
55263H2429m5L80M77J64j1M83J199J183L19p14j557k254k345j238M90J380R50
$$ y = [88235, 87828, 87791, 87989, 88249, 88183, 87622, 87138, 87326, 87761, 87562, 86891, 86829, 87829, 89389, 91210, 93492, 95910, 97469, 97679, 96928, 95607, 93905, 92500, 92155, 92395, 91857, 90253, 88757, 88072, 87536, 86613, 85865, 85660, 85259, 84090, 82764, 81868, 80834, 79132, 77648, 77602, 78716, 79642, 79796, 79677, 79728, 79901, 80215, 80857, 81701, 82340, 82571, 82402, 81771, 80699, 79545, 78732, 78399, 78568, 79290, 80339, 81146, 81428, 81541, 81910, 82502, 83152, 83969, 85021, 85987, 86525, 86695, 86711, 86633, 86526, 86572, 86720, 86642, 86295, 86127, 86491, 87238, 88108, 89050, 89950, 90495, 90570, 90346, 89770, 88492, 86569, 84710, 83609, 83466, 84291, 86020, 88067, 89477, 89914, 89950, 90043, 89879, 89125, 88196, 87730, 87775, 87924, 87874, 87530, 86964, 86553, 86667, 86991, 86736, 85748, 84776, 84393, 84360, 84364, 84542, 84774, 84353, 83068, 81915, 81955, 82905, 83605, 83480, 82895, 82429, 82384, 82764, 83241, 83405, 83394, 83877, 85076, 86259, 86578, 85864, 84307, 82053, 79708, 78470, 78960, 80340, 81290]
55246H1290J94OJ60J34m3j72k43j38L12Q13R14Q07J004J286R59P5o74j157j714
55227H3813j923r58O44J184K65m52K93J571J856J236R06J238J559J306N70k95
55211I2813r55j239j352j588j715j214k73K29n0n06o84q49j079p81L19J502K017
55194H4595K025J984J781J155M00o3l05n36n58j53L80N35J48n94j315j443o93
55177H7343K86M84o6k30N11J276J186N71J63m9l38m27p6J80j85o49l93M01R03
55158I0891J011J290J761J710Q31l03j013j102o71J15Q16R04L59k71n34m81l14
55141I4999n3K91M75L00JM2M69P31L39m00p09l55N6M3m6K74O79M73k59p32o43
55120I5975n27p58r35n42L42J236J775J779J258N28rk88n27p32p41o20n48l10
$$ y = [81290, 81484, 81490, 81650, 81784, 81741, 81569, 81326, 81188, 81500, 82313, 83227, 84034, 85038, 86324, 87283, 87358, 86684, 85527, 83813, 81890, 80932, 81576, 82760, 83025, 82573, 82866, 84437, 86293, 87529, 88435, 89673, 91232, 92538, 93108, 92813, 91858, 90619, 89267, 87679, 85964, 84750, 84477, 84706, 84656, 84150, 83466, 82617, 81538, 80757, 81076, 82578, 84595, 86620, 88604, 90385, 91540, 91940, 91877, 91572, 91036, 90478, 90325, 90705, 91240, 91388, 90794, 89479, 88036, 87343, 87629, 88113, 88047, 87817, 88328, 89604, 90790, 91361, 91524, 91475, 91137, 90710, 90634, 90814, 90629, 89980, 89587, 89988, 90891, 91902, 93192, 94953, 96663, 97494, 97191, 96178, 95076, 94405, 94520, 95336, 96240, 96599, 96328, 95794, 95313, 94999, 94946, 95237, 95712, 96012, 96013, 96055, 96524, 97255, 97594, 97194, 96485, 96130, 96186, 96229, 96183, 96457, 97136, 97609, 97350, 96618, 95975, 95448, 94690, 93755, 93213, 93555, 94791, 96566, 98345, 99603, 100131, 100122, 99834, 99307, 98575, 97834, 97214, 96666, 96356]
55102I6356M42J368J613J015M37N90J079J034K58o35r63n48K51R43J330J488J275
55085A07333L65r56j653j191l44J2K16Q87J396P75k56qJ418K030R72k13j57L10
55067A10936j21j047j291r33q40j008q12l83l50n52k78L96O84L62qj06k14n22
55049A03913q10q97q22o14l40l05o64j022q95m04m1Q9K86O11P57M91j1l20q3O21
55029I9540J189J076M75N0l9j61k89Q6Q22Q56k50j392j295j78P97J108J046P89
55011A04230L19nK66R20J340J388J427J601J664J427Q65l9j038j507j127l93M8
54994A11386K04L69L56r7n49l57K31L27k39o13r2J010J829J799R79p9p37p92o13
54975A14322m85j48O73J503J517N82o02j310j387j064o56m36m96o63o57k94M65
$$ y = [96356, 96798, 98166, 99779, 100794, 101231, 101821, 102900, 103934, 104192, 103557, 102594, 102046, 102297, 103240, 104570, 106058, 107333, 107698, 106742, 105089, 103898, 103554, 103566, 103782, 104669, 106065, 106840, 106584, 106576, 107994, 110024, 110996, 110783, 110626, 110936, 110815, 109768, 108477, 107544, 106704, 105696, 104884, 104501, 104151, 103599, 103321, 103717, 104401, 104763, 104755, 104649, 104435, 103913, 103103, 102206, 101384, 100770, 100430, 100125, 99461, 98439, 97544, 97140, 97099, 97188, 97474, 98085, 98842, 99333, 99322, 99002, 98919, 99540, 100729, 101805, 102280, 102330, 102291, 102130, 101841, 101927, 102749, 103605, 103355, 101963, 100668, 100490, 101287, 102395, 103441, 104230, 104549, 104544, 104810, 105730, 107070, 108458, 109885, 111486, 113150, 114577, 115442, 115403, 114365, 112858, 111731, 111338, 111386, 111590, 111959, 112315, 112218, 111669, 111312, 111543, 111870, 111631, 111018, 110926, 111936, 113765, 115564, 116543, 116464, 115727, 114935, 114322, 113837, 113689, 114362, 115865, 117382, 117964, 117362, 116052, 114665, 113601, 112945, 112509, 112013, 111350, 110693, 110399, 110864]
54958A10864J319J553P01o03j134o95m11r61j427p00P62J586J369Q30M55J06j60
54941A13454J0M53N16J20n8L30P40N55r5o42p23l58K29O87P92O73O43Q43J292
54922A19461K131L376M599N253N396N659O433P358P679O953N423L767K421J123
54908A87032o52k812m601n484n670n603n466n374n455n437m755l389k009j064
54894A29261l83j5m37j496k076j559p17l04J49J115J701R50k70l25P44J453J380
54877A29171J671K977M510N453N970O376O477O162N650M774L011N59j595k989
54863A78177m089n049n252m554l925m056m294l730k612j814j516j330j264j680
54849A33012k452k922k690j976j239p98p80j076j387j540j658j892k073j816r94
$$ y = [110864, 112183, 113736, 114437, 113834, 112700, 112005, 111594, 110633, 109206, 108506, 109268, 110854, 112223, 113053, 113508, 113614, 113454, 113464, 113917, 114433, 114553, 114495, 114825, 115565, 116120, 116025, 115383, 114660, 114302, 114531, 115218, 116010, 116683, 117326, 118169, 119461, 121592, 124968, 129567, 134820, 140216, 145875, 152308, 159666, 167345, 174298, 179721, 183488, 185909, 187032, 186380, 183568, 178967, 173483, 167813, 162210, 156744, 151370, 145915, 140478, 135723, 132334, 130325, 129261, 128878, 128863, 128426, 126930, 124854, 123295, 122578, 122274, 122423, 123538, 125239, 126189, 125919, 125594, 126338, 127791, 129171, 130842, 133819, 138329, 143782, 149752, 156128, 162605, 168767, 174417, 179191, 182202, 182761, 181166, 178177, 174088, 169039, 163787, 159233, 155308, 151252, 146958, 143228, 140616, 138802, 137286, 135956, 134692, 133012, 130560, 127638, 124948, 122972, 121733, 120935, 120155, 119079, 117692, 116152, 114494, 112602, 110529, 108713, 107719]
54834A07719J5N99M68K0q2K60N01L48L18R15J709J807J052R0n52q48q81p27o03
54815A12128n47j35P99J397O94p97j459o61M96P95L36n9n9J90O05J054J156P17
54797A16650R9j61O9N26Q00N30k86j077j237r00o59m90K38J490K156J434M8o07
54779A18623j56N37O27K39R6N45J189J409J175J134J796K917L912M590N059N300
54763A48992N353N686O602P449P180N664L744J969J32j848l434m292m847n577
54749A72773o239o192n215l781k718k593l105l231k384j239q16j080j207r70q18
54734A31185p02p6Q37R53l5j068j206p03o5Q67K173L184L409L481M278N623O551
54717A58686O486N532M097K775K068J701P27j141k897l597l694m249n305n911
$$ y = [107719, 107734, 108333, 108801, 108821, 108739, 108999, 109500, 109848, 110166, 111081, 112790, 114597, 115649, 115739, 115187, 114339, 113458, 112731, 112128, 111581, 111446, 112245, 113642, 114336, 113539, 112080, 111419, 111915, 112710, 113046, 112987, 112928, 113118, 113723, 114777, 115933, 116650, 116749, 116588, 116657, 117183, 117983, 118513, 118227, 117150, 115913, 115013, 114354, 113864, 114102, 115592, 117748, 119182, 119230, 118623, 118467, 119004, 119631, 119870, 119966, 120511, 121700, 123109, 124284, 125418, 127214, 130131, 134043, 138633, 143692, 148992, 154345, 160031, 166633, 174082, 181262, 186926, 190670, 192639, 192771, 190923, 187489, 183197, 178350, 172773, 166534, 160342, 155127, 151346, 148628, 146035, 142930, 139699, 137315, 136076, 135260, 134180, 132973, 132003, 131185, 130483, 130407, 131244, 132197, 132162, 131094, 129888, 129185, 129120, 129987, 132160, 135344, 138753, 142234, 146512, 152135, 158686, 165172, 170704, 174801, 177576, 179644, 181345, 182072, 180931, 178034, 174437, 170743, 166494, 161189, 155278]
54703A55278n524m551l616k915k314j671j034p30r82j403j330q30p02j175j436
54688A25065r14k28j51l73k43o4n77j486j662p73K51M82l6p09j083r50l31L74
54670A16592N68L3q55j418j177k36O31N97k44q11l05Q11J445J177M46k32o83q18
54652A15521n23J30Q42J254J070K79o69j182j160j004q28k87O12J121O78k93r58
54635A14603j074q92n74j95M9J70N19J146J492J221Q10P27O67K86P2N57J138P80
54617A21502l55j095r30m31k4N58J369J817J531R65P12P76Q11N72p1j050j811
54600A24846j622m83O77J000N99J91J99M82O82N14j32j076j836j939j336n08q0
54583A20178k24m90l97p7n9m64q46r50j042j264j207n90J25L08J7k35j93J37Q12
$$ y = [155278, 149754, 145203, 141587, 138672, 136358, 134687, 133653, 132923, 131941, 130538, 129208, 128378, 127676, 126501, 125065, 124151, 123923, 123772, 123399, 123156, 123092, 122515, 121029, 119367, 118594, 118845, 119327, 119291, 118582, 117499, 116549, 116218, 116592, 117160, 117193, 116338, 114920, 113743, 113507, 114138, 114735, 114491, 113680, 113375, 114186, 115631, 116808, 117254, 117022, 116339, 115521, 114998, 115128, 115970, 117224, 118294, 118573, 117904, 116722, 115562, 114558, 113730, 113443, 114055, 115176, 115854, 115561, 114603, 113529, 112637, 112063, 111868, 111917, 112087, 112606, 113752, 115244, 116465, 117275, 118002, 118669, 118955, 119027, 119584, 120722, 121502, 121147, 120052, 119122, 118691, 118667, 119225, 120594, 122411, 123942, 124907, 125619, 126395, 127206, 127778, 127707, 126657, 124846, 123224, 122741, 123418, 124418, 125017, 125208, 125407, 125889, 126571, 127085, 126953, 125877, 124041, 122102, 120766, 120258, 120178, 119954, 119464, 119067, 118990, 118931, 118467, 117621, 116671, 115629, 114365, 113158, 112568, 112693, 113001, 113018, 112783, 112590, 112727, 113539]
54564A13539J669K031J443M94J53M61N46po44p66m80j05L67R14J069M36n03o55
54546A19962L76J574J518J48r79n04J070K111J916J189O35J73j87N0Q14J043J77
54529A31086q39r27m93n78j109j205p53l92j86L94J240J546J061L12l55r88j262
54512A26552p20J98M49n7l17Q8L92Q9k21J0K54j07o66o20KN67P49O21K17l34n84
54491A26562k80J42R9l01m12Q0Q35J302J192O17l9m45n66m91j44N10J100J136
54473A30897P00L41K96L26L48N61Q59P94L31jL0M3j07O2P08J076N14m29o91j14
54453A36544M75M46n2n42p61p33o37o10m78Q8R22J228M90p16j347j085n30k60
54435A32442k27j38K8Pl60q49r42l27N96R87N10j82j81O09J492J887J826J570
$$ y = [113539, 115208, 117239, 118682, 119176, 119329, 119790, 120336, 120329, 119685, 118919, 118439, 118334, 118701, 119615, 120684, 121120, 120617, 119962, 120338, 121912, 123430, 123578, 122599, 122095, 123165, 125276, 127192, 128381, 129016, 129189, 129002, 129052, 129866, 130909, 131086, 130247, 129320, 128827, 128249, 127140, 125935, 125182, 124790, 124604, 124998, 126238, 127784, 128845, 129157, 128802, 127814, 126552, 125832, 126030, 126479, 126422, 126105, 126193, 126585, 126674, 126453, 126463, 126717, 126610, 125944, 125324, 125326, 125893, 126642, 127263, 127480, 127146, 126562, 126282, 126424, 126523, 126222, 125810, 125890, 126725, 128027, 129219, 129836, 129797, 129352, 128786, 128295, 128151, 128661, 129761, 130897, 131597, 131938, 132234, 132560, 132908, 133469, 134328, 135122, 135453, 135452, 135482, 135525, 135418, 135480, 136188, 137264, 137778, 137349, 136658, 136544, 137019, 137465, 137413, 136871, 136110, 135377, 134740, 134130, 133652, 133740, 134662, 135890, 136380, 135664, 134317, 133232, 132702, 132442, 132215, 132077, 132105, 132112, 131752, 130903, 129961, 129634, 130230, 131217, 131727, 131545, 131364, 131973, 133465, 135352, 137178, 138748]
54417A38748J197P53M98O34R08P50j00j202j822j607p83K61J214J699J309J77
54401A42634p82o69L85J397J717J576J441J309R90O70P43J154J339R23K55m5P4
54384A55111po66j397j458j015r52j490j665o90Q04J513J116M87M48R96J706K228
54367A55069K333K043J721J656J555J013K93N7L74P58J166K064L334L987L488
54352A80911K592K336K690K845K392J590O70m77j920l381m427m814m617m111l481
54337A68798k710j845j225j138j348j360j070q25q36j003j249j548j640j245o23
54322A49133l30l59j09O09J184J060M80M3K0L21O96O61j84j491k284k018j099
54305A46333j20Q01J592J835J317M73j80o87j251j659j600j232q81n30q6J86k4
$$ y = [138748, 139945, 140698, 141196, 141830, 142738, 143488, 143388, 142186, 140364, 138757, 137974, 138235, 139449, 141148, 142457, 142634, 141852, 141183, 141568, 142965, 144682, 146258, 147699, 149008, 149998, 150668, 151411, 152565, 153904, 154827, 155082, 155037, 155111, 155104, 154438, 153041, 151583, 150568, 149616, 148126, 146461, 145771, 146575, 148088, 149204, 149691, 150139, 151135, 152841, 155069, 157402, 159445, 161166, 162822, 164377, 165390, 165683, 165740, 166114, 166872, 168038, 170102, 173436, 177423, 180911, 183503, 185839, 188529, 191374, 193766, 195356, 196026, 195549, 193629, 190248, 185821, 181007, 176390, 172279, 168798, 166088, 164243, 163018, 161880, 160532, 159172, 158102, 157277, 156441, 155438, 154189, 152641, 151001, 149756, 149133, 148803, 148444, 148335, 148944, 150128, 151188, 151668, 151711, 151731, 152052, 152748, 153409, 153225, 151734, 149450, 147432, 146333, 146213, 147014, 148606, 150441, 151758, 152231, 152051, 151364, 150113, 148454, 146854, 145622, 144741, 144211, 144125, 144311, 144287]
54288A44287n74j060j224q32L76K125L360L228K022P04j67n24l65Q0N7q50j832
54271A48811j720o53M9k14n54r5P53J099R39Q79R87Q26M61N69J318J922J691J023
54253A58091P34Q08N11k87p21j61Q30J265R51L61k79j001j482j250n91l53p45
54236A56681j069r11p94j183j606j411q61o97r61r68l94K89N95O98J047J595J731
54219A51781J066L0n11l12l4k95q27j029j001j252j584j261l60P5l82p78k08P90
54201A43908J042L74m00p58q84r94r43n37K37J222K008K029J206K58j7L71Q28
54184A48950R81Q42M15k48p37o10n7K02k26r50j256q18L9O61P01M70M62O42N66
54165A50029K27J20L61L64k15q41r09n86l28r4L12N63K76j82j05M71Q20N75J14
$$ y = [144287, 143713, 142653, 141429, 140597, 140973, 143098, 146458, 149686, 151708, 152412, 152245, 151721, 151356, 151436, 151493, 150643, 148811, 147091, 146438, 146487, 146273, 145719, 145624, 146377, 147476, 148415, 149294, 150281, 151107, 151568, 152137, 153455, 155377, 157068, 158091, 158825, 159633, 160144, 159857, 159136, 158975, 159805, 161070, 162021, 162382, 162103, 161102, 159620, 158370, 157779, 157426, 156681, 155612, 154701, 153907, 152724, 151118, 149707, 148846, 148149, 147188, 146220, 145826, 146115, 146710, 147408, 148455, 150050, 151781, 152847, 152877, 152366, 152054, 152020, 151725, 150898, 149869, 148868, 147616, 146032, 144771, 144411, 144486, 144104, 143326, 143118, 143908, 144950, 145324, 144924, 144166, 143282, 142288, 141345, 140808, 141045, 142267, 144275, 146304, 147510, 147768, 147751, 148122, 148950, 149931, 150773, 151188, 150940, 150203, 149593, 149536, 149738, 149512, 148562, 147306, 146488, 146527, 147188, 147889, 148359, 148821, 149463, 150029, 150256, 150376, 150737, 151101, 150886, 150045, 149136, 148550, 148222, 148128, 148440, 149003, 149279, 149097, 148992, 149463, 150283, 150858, 150972]
54146A50972q3R1M83Q35Q76O12L89L54J34m95j011p23K15R52R16K36n75r16m03
54127A52859O46J261R35L10K38N83O44L95M55R79J442J452J100N63M9j11R1k2
54109A63869q78j703j388j81O05M77K52N40Q93Q31O02N14M07K91N71J128J072
54092A67902O1q59o13M08J040R86Q55Q65O40J78J19O95J246J232J180J949L334
54075A81218M121L707L031L442M979O401O717N971M498K369m5j792k464k905m005
54060B15243n258n522m802m104l709k847j297pL35L11P11J262J215O21K36N11
54044A92899J259K129K877L340L572L942M748N827O704O979O524N568M710M489
54030B55567M767M817M254L530L265L438L562L389L119K955K758K223J273K94
$$ y = [150972, 150889, 150980, 151463, 152298, 153174, 153786, 154175, 154529, 154663, 154168, 153157, 152434, 152649, 153601, 154517, 154753, 154178, 153262, 152859, 153505, 154766, 155701, 156011, 156249, 156832, 157476, 157871, 158326, 159305, 160747, 162199, 163299, 163862, 163911, 163800, 163891, 163869, 162991, 161288, 159900, 159719, 160324, 160801, 161053, 161593, 162486, 163317, 163919, 164433, 164840, 165131, 165702, 166830, 167902, 167963, 167104, 166491, 166899, 167939, 168925, 169780, 170645, 171285, 171463, 171582, 172277, 173523, 174755, 175935, 177884, 181218, 185339, 189046, 192077, 195519, 200498, 206899, 213616, 219587, 224085, 226454, 226409, 224617, 222153, 219248, 215243, 209985, 204463, 199661, 195557, 191848, 189001, 187704, 187697, 188032, 188343, 189054, 190316, 191531, 192152, 192388, 192899, 194158, 196287, 199164, 202504, 206076, 210018, 214766, 220593, 227297, 234276, 240800, 246368, 251078, 255567, 260334, 265151, 269405, 272935, 276200, 279638, 283200, 286589, 289708, 292663, 295421, 297644, 298917, 299211]
54016B99211k00k06l77j246k475l279l415l275l085k695k193k076k514k987k942
54001B66246k422j824j381j188j307j632j896k082k480l206l956m461m784m998
53987B28629m883m239l265k393j935j936k130j973j127k5M31j10j099j766j819
53972B00360j330n24J51K73N8K50J077J789J674J047P34Q69P94J03p50r07m1J358
53954B06985K447K781K567K199J754J212Q82J119J696K023J995K149K848L836
53940B36493M730N459O062O530O987P576Q099Q273Q385R010R981J0494J0423J0710
53926C49212J1908J3119J3015J1228Q185M256n8l621n339n193m027k510r69J89
53912C89395P29J176K311M022N283N338M386L043J698N08m52j279k111k836l152
$$ y = [299211, 299011, 298805, 298428, 297182, 294707, 291428, 288013, 284738, 281653, 278958, 276765, 274689, 272175, 269188, 266246, 263824, 262000, 260619, 259431, 258124, 256492, 254596, 252514, 250034, 246828, 242872, 238411, 233627, 228629, 223746, 219507, 216242, 213849, 211914, 209978, 207848, 205875, 204748, 204723, 205154, 205044, 203945, 202179, 200360, 199030, 198506, 198657, 198930, 198988, 199238, 200315, 202104, 203778, 204825, 205559, 206428, 207222, 207325, 206575, 205668, 205627, 206985, 209432, 212213, 214780, 216979, 218733, 219945, 220827, 221946, 223642, 225665, 227660, 229809, 232657, 236493, 241223, 246682, 252744, 259274, 266261, 273837, 281936, 290209, 298594, 307604, 317585, 328079, 338502, 349212, 361120, 374239, 387254, 398482, 406667, 410923, 410865, 407244, 401905, 396712, 392685, 390175, 389206, 389395, 390124, 391300, 393611, 397633, 402916, 408254, 412640, 415683, 417381, 417889, 417437, 416158, 414047, 411211, 408059]
53897D08059l000k672k482k557k962l728m767n938p147q230q819q633p891p166
53883C32067o843o893p116p304p213o593n431m069l007k549k583k754k970l522
53869B63220m502n301n135m102l133k799k702k343j970k095k597k832k466j796
53855B19447j347j406j799j996j661j218j370j978k051j159j84p9n60p72o32o48
53839B00587p59m30K58N92L89K62N39P50M44j46o18r37j022m81P60J884J906Q44
53821B04822k92o11j13O02J048J233J449J843K167K045J534J190J486K262K953
53806B23618L313L602M039M345M176L830M002M802N461N366M922M945N423N536
53792B87380M846L845L167K829K497K059J652J385J286J224Q27j90j534k570l160
$$ y = [408059, 405059, 402387, 399905, 397348, 394386, 390658, 385891, 379953, 372806, 364576, 355757, 347124, 339233, 332067, 325224, 318331, 311215, 303911, 296698, 290105, 284674, 280605, 277598, 275049, 272466, 269712, 266742, 263220, 258718, 253417, 248282, 244180, 241047, 238248, 235546, 233203, 231233, 229138, 226541, 223709, 221243, 219447, 218100, 216694, 214895, 212899, 211238, 210020, 208650, 206672, 204621, 203462, 203278, 203199, 202639, 201867, 201235, 200587, 199828, 199398, 199656, 200248, 200637, 200899, 201438, 202188, 202632, 202486, 201868, 200931, 199909, 199428, 200188, 202072, 203978, 204822, 204530, 203919, 203806, 204408, 205456, 206689, 208138, 209981, 212148, 214193, 215727, 216917, 218403, 220665, 223618, 226931, 230533, 234572, 238917, 243093, 246923, 250925, 255727, 261188, 266554, 271476, 276421, 281844, 287380, 292226, 296071, 299238, 302067, 304564, 306623, 308275, 309660, 310946, 312170, 312997, 312807, 311273, 308703, 305543]
53777C05543l768m619n330n608n645n538m978l971l265l406l835l625k726j837
53763B47392j377j317j738k735l815m173l613k708k013j664j707k188k733k632
53749B12979j580j35P79O47k60j138j289p35j22R1K6j30n21j110j224l29J036
53732B06985J781J642J285J094O66k34r10m81R04K074K073J181N56Q40J396J246
53716B22098N50M65J379K199J931J175J137J814K213K055K012K267K143J449J083
53701B45970J749K883L488L417L229L273L476L707L796L446K608J776J458J527
53687B85803J437J003N22J79k70j028j720j691q22Q6O9r19j957k270k014j782
53671B74626j725j585j307j084q82m80mN3n46j471k134k092j163L31J525J665
$$ y = [305543, 301775, 297156, 291826, 286218, 280573, 275035, 270057, 266086, 262821, 259415, 255580, 251955, 249229, 247392, 246015, 244698, 242960, 240225, 236410, 232237, 228624, 225916, 223903, 222239, 220532, 218344, 215611, 212979, 211399, 211264, 212043, 212690, 212430, 211292, 210003, 209268, 209146, 209237, 209263, 209133, 208612, 207502, 206278, 205949, 206985, 208766, 210408, 211693, 212787, 213453, 213219, 212309, 211828, 212732, 214806, 216879, 218060, 218616, 219456, 220852, 222098, 222648, 223113, 224492, 226691, 228622, 229797, 230934, 232748, 234961, 237016, 239028, 241295, 243438, 244887, 245970, 247719, 250602, 254090, 257507, 260736, 264009, 267485, 271192, 274988, 278434, 281042, 282818, 284276, 285803, 287240, 288243, 288765, 288944, 288674, 287646, 285926, 284235, 283413, 283499, 283568, 282649, 280692, 278422, 276408, 274626, 272901, 271316, 270009, 268925, 268043, 267563, 267559, 267612, 267066, 265595, 263461, 261369, 260206, 260537, 262062, 263727]
53655B63727Q87N9j85R5N64R95J246J257J227J348J393R92L76K43P73J289J168
53638B77454N86J02kK79R33J758K266K240K094K306K647K436J543P22Q14J835
53622C00013K993L501L273K831K692K960L495M158M749M988M829M713N095N804
53608C56094O246O184N994N993N950N475M605L687K831J791N16m89o22o1K15m50
53592D03959j478j743j040k47J7Q7K93J26r55k386l035k623j904j541j481j441
53576C84608j309j072q15p50q49o77o5K65m59j775k314j501j63O43O71K68j73
53559C74533k78J30O34N00l15r68p60N3P44R48Q23P25R59J586K220K404K165J974
53541C88077K159K696L470M298M770M651M383M652N452O230O813P512Q287Q667
$$ y = [263727, 264614, 264673, 264488, 264583, 265147, 266142, 267388, 268645, 269872, 271220, 272613, 273605, 273981, 274224, 274997, 276286, 277454, 278040, 278142, 278140, 278419, 279352, 281110, 283376, 285616, 287710, 290016, 292663, 295099, 296642, 297364, 298178, 300013, 303006, 306507, 309780, 312611, 315303, 318263, 321758, 325916, 330665, 335653, 340482, 345195, 350290, 356094, 362340, 368524, 374518, 380511, 386461, 391936, 396541, 400228, 403059, 404850, 405366, 404877, 404255, 404194, 404409, 403959, 402481, 400738, 399698, 399451, 399468, 399555, 399848, 399974, 399019, 396633, 393598, 390975, 389071, 387530, 386049, 384608, 383299, 382227, 381412, 380662, 379813, 379136, 379071, 379336, 378877, 377102, 374788, 373287, 373124, 373767, 374438, 374706, 374533, 374255, 374385, 375019, 375519, 375204, 374236, 373476, 373529, 374273, 375221, 376044, 376769, 377728, 379314, 381534, 383938, 386103, 388077, 390236, 392932, 396402, 400700, 405470, 410121, 414504, 419156, 424608, 430838, 437651, 445163, 453450, 462117]
53527D62117Q665Q913R659J0408J0868J1448J2418J3342J3769J3881J3994J4048
53515F03530J4066J4485J5535J6810J7939J9147K0693K2259K3398K4149K4729
53504H16740K5076K5164K5234K5300K4971K4148K3413K3104K2627K1349J9610
53493A076736J8120J6918J5730J4961J5318J6563J7646J8068J8342J8919J9500
53482A266821J9636J9450J9319J9194J8687J7620J6240J4823J3312J1431R117
53471A445650O594L987J199j632l917n371o607q344j0306j1686j2487j3323j3971
53458A369786j3498j2169j1776j3298j5505j6850j7610j8824k0151k0420j9710
53447A189975j9222j9215j8745j7523j6508j6212j5756j4230j1968r776p780n778
$$ y = [462117, 470782, 479695, 489354, 499762, 510630, 522078, 534496, 547838, 561607, 575488, 589482, 603530, 617596, 632081, 647616, 664426, 682365, 701512, 722205, 744464, 767862, 792011, 816740, 841816, 866980, 892214, 917514, 942485, 966633, 990046, 1013150, 1035777, 1057126, 1076736, 1094856, 1111774, 1127504, 1142465, 1157783, 1174346, 1191992, 1210060, 1228402, 1247321, 1266821, 1286457, 1305907, 1325226, 1344420, 1363107, 1380727, 1396967, 1411790, 1425102, 1436533, 1445650, 1452244, 1456231, 1457430, 1455798, 1451881, 1446510, 1439903, 1431559, 1421253, 1409567, 1397080, 1383757, 1369786, 1356288, 1344119, 1332343, 1319045, 1303540, 1286690, 1269080, 1250256, 1230105, 1209685, 1189975, 1170753, 1151538, 1132793, 1115270, 1098762, 1082550, 1066794, 1052564, 1040596, 1030820, 1023040, 1017262]
53435A017262m090l202k942k588j687l38J116K311K996L285L701M707O275Q015
53421A034821R594J0894J1968J2982J4092J5265J6367J7466J8792K0373K1944
53410A204558K3391K4964K6863K8787L0245L1205L2158L3471L4988L6429L7943
53399A545002L9952M2504M5126M7467M9656N1716N3028N3021N2269N2168N3289
53388B085198N4648N4974N4198N3168N2238N0880M8653M5946M3461M1271L8728
53377B623363L5324L1365K7575K4124K0404J5926J1042O387J850l287r267j5597
53365B769209k1888k8253l4593m0127m4169m6876m8816n0084n0439n0093m9764
53354B304107m9872m9972m9114m6783m3540m0653l8963l8228l7785l7458l7407
$$ y = [1017262, 1013172, 1009970, 1007028, 1004440, 1002753, 1002415, 1003531, 1005842, 1008838, 1012123, 1015824, 1020531, 1026806, 1034821, 1044415, 1055309, 1067277, 1080259, 1094351, 1109616, 1125983, 1143449, 1162241, 1182614, 1204558, 1227949, 1252913, 1279776, 1308563, 1338808, 1370013, 1402171, 1435642, 1470630, 1507059, 1545002, 1584954, 1627458, 1672584, 1720051, 1769707, 1821423, 1874451, 1927472, 1979741, 2031909, 2085198, 2139846, 2194820, 2249018, 2302186, 2354424, 2405304, 2453957, 2499903, 2543364, 2584635, 2623363, 2658687, 2690052, 2717627, 2741751, 2762155, 2778081, 2789123, 2795510, 2797360, 2794073, 2784806, 2769209, 2747321, 2719068, 2684475, 2644348, 2600179, 2553303, 2504487, 2454403, 2403964, 2353871, 2304107, 2254235, 2204263, 2155149, 2108366, 2064826, 2024173, 1985210, 1946982, 1909197, 1871739, 1834332]
53343A834332l7370l6879l6094l5524l4961l3649l1661k9989k8890k7229k4140
53332A477946k0415j7407j5412j3951j2956j2682j2967j3460j4208j5279j6230
53321A312979j6703j6998j7306j6967j5429j3373j1840j0719r211p398o065n199
53309A165771m016k448j292o43M35K340M129M972N451O666Q718J0779J2329J3616
53295A226807J5075J6839J8830K1027K3415K5731K7385K7908K7520K6953K6547
53284A484037K5830K4216K1696J8679J5560J2796J0733R016O684L438J13k590
53272A630208n073p769j0044j1290j2346j4485j7471j9990k1723k3407k5080k5869
53260A435661k5711k5746k6553k7375k7560k7491k7593k7489k6849k6133k5806
$$ y = [1834332, 1796962, 1760083, 1723989, 1688465, 1653504, 1619855, 1588194, 1558205, 1529315, 1502086, 1477946, 1457531, 1440124, 1424712, 1410761, 1397805, 1385123, 1372156, 1358696, 1344488, 1329209, 1312979, 1296276, 1279278, 1261972, 1245005, 1229576, 1216203, 1204363, 1193644, 1184433, 1177035, 1170970, 1165771, 1161755, 1159307, 1158015, 1157372, 1157807, 1160147, 1164276, 1169248, 1174699, 1181365, 1190083, 1200862, 1213191, 1226807, 1241882, 1258721, 1277551, 1298578, 1321993, 1347724, 1375109, 1403017, 1430537, 1457490, 1484037, 1509867, 1534083, 1555779, 1574458, 1590018, 1602814, 1613547, 1622563, 1629247, 1632685, 1632798, 1630208, 1625135, 1617366, 1607322, 1596032, 1583686, 1569201, 1551730, 1531740, 1510017, 1486610, 1461530, 1435661, 1409950, 1384204, 1357651, 1330276, 1302716, 1275225, 1247632, 1220143, 1193294, 1167161, 1141355]
53249A141355k5614k5135k4402k3516k2457k1622k1727k2702k3527k3543k3069
53238H84041k2380k1041j8948j6985j5871j5146j4076j2842j1942j1051r522p641
53226G06596o482o689q006r796j1382j2209j2323j2535j3554j5047j6019j5948
53214E66606j5175j4309j3665j3229j2823j2323j1755j1095j0067q565p181o689
53202D29730o996p268p190p322p975q578q619q418q420q440q090p372o319m837
53188C23886l390k997l768m290l461k101j664k043k020j500j649k766l579l148
53174B85510k220j918k086j841j237j268k333l455l380k015m90M9n41j525k122
53159B59128k030j413p02m24q22j526j845j469p14o3K67K25k05q73j429j629j470
$$ y = [1141355, 1115741, 1090606, 1066204, 1042688, 1020231, 998609, 976882, 954180, 930653, 907110, 884041, 861661, 840620, 821672, 804687, 788816, 773670, 759594, 746752, 734810, 723759, 714237, 706596, 700114, 693425, 685419, 675623, 664241, 652032, 639709, 627174, 613620, 598573, 582554, 566606, 551431, 537122, 523457, 510228, 497405, 485082, 473327, 462232, 452165, 443600, 436419, 429730, 422734, 415466, 408276, 400954, 392979, 384401, 375782, 367364, 358944, 350504, 342414, 335042, 328723, 323886, 320496, 317499, 313731, 309441, 305980, 303879, 302215, 300172, 298152, 296652, 295003, 292237, 288658, 285510, 283290, 281372, 279286, 277445, 276208, 274940, 272607, 269152, 265772, 263757, 263267, 263316, 262775, 261250, 259128, 257098, 255685, 254983, 254559, 253737, 252211, 250366, 248897, 248183, 248120, 248387, 248612, 248407, 247534, 246105, 244476, 243006]
53142B43006j072o42m76n91m79K74J149J216N01L9L55P48N00j9q1K50M15L27L15
53123B45735M03L14J2k47k52J26R08J663J671Q19k2j5O13J081J053O79O1o60j149
53104B52793j361j750k380k419j359j98l12j493k203j673o47nK32K86Q4l03m29
53087B36863j76nj42q9N36J270J401R45N29N32P46Q16O46L69J14j79o36j139j271
53068B41130q02j23J06k51p23q97q35p88q47r86j155j197j000p47p66r55p61N8
53050B28461R24J051M12k71m91m76o18p57m62J63N47N65P45J238J262K42j016
53033B31519j222m31J04j58m04j9M22L27K19P69J546J713J365J159J047N17k31
53016B38242m24l2J58j21k21K50P50P00L46K18K95K07j9L5N85J331J735J487O73
$$ y = [243006, 241934, 241292, 240816, 240225, 239746, 240020, 241169, 242385, 242886, 242925, 243280, 244028, 244528, 244509, 244428, 244678, 245093, 245420, 245735, 246138, 246452, 246464, 246217, 245965, 246091, 246999, 248662, 250333, 251152, 251130, 251115, 251728, 252809, 253862, 254541, 254602, 253942, 252793, 251432, 249682, 247302, 244883, 243524, 243326, 243014, 241521, 239318, 237645, 236998, 236993, 237225, 237511, 237595, 237292, 236863, 236687, 236682, 236540, 236451, 236987, 238257, 239658, 240603, 241132, 241664, 242410, 243226, 243872, 244241, 244355, 244176, 243540, 242401, 241130, 240328, 240205, 240311, 240060, 239337, 238440, 237605, 236817, 235970, 234984, 233829, 232632, 231632, 230885, 230119, 229164, 228403, 228461, 229385, 230436, 230848, 230577, 230086, 229610, 228992, 228235, 227773, 227936, 228483, 229048, 229793, 231031, 232293, 232535, 231519, 230297, 229866, 229970, 229812, 229408, 229389, 229811, 230138, 230357, 231126, 232672, 234385, 235750, 236909, 237956, 238473, 238242, 237818, 237786, 237944, 237823, 237602, 237852, 238602, 239302, 239648, 239866, 240161, 240368, 240349, 240384, 240969, 242300, 244035, 245522, 246195]
52997B46195l50j247j749j558n77O79J271Q08j12o90p67n68m2Q44J609J712J375
52980B46833J268J505J650J634J899K571L158L240K888K305J572Q56M00J17l42
52965B71554r69j368j336j090p88l41J38K51r9m71n18m71p31j264j667j665j365
52948B57800j137j256j591j639j105l04J69M7n42j326j870j637o14L98O47M17
52932B46457N12R17Q25l3r01j078q16p63j050j299j122m24N10J116J020M50j11
52915B44210n65j005j121m94N15J048R05O66N16r3j264k078j779q33j62Q6L23
52898B38875N89N82L27J46J11Mk24m35n40n15k61K29P90J319J848K193K015J377
52880B48430Q14M93j02j169j870j324N1J005J079R61J242J617J493Q52J31k99
$$ y = [246195, 245845, 244598, 242849, 241291, 240714, 241393, 242664, 243472, 243360, 242670, 241903, 241335, 241293, 242137, 243746, 245458, 246833, 248101, 249606, 251256, 252890, 254789, 257360, 260518, 263758, 266646, 268951, 270523, 271379, 271779, 271896, 271554, 270585, 269217, 267881, 266791, 266003, 265662, 265800, 266051, 265952, 265481, 264963, 264492, 263761, 262497, 260830, 259165, 257800, 256663, 255407, 253816, 252177, 251072, 250768, 250937, 250984, 250442, 249116, 247246, 245609, 244995, 245393, 246040, 246457, 246969, 247886, 248711, 248678, 247777, 246699, 245883, 245120, 244070, 242771, 241649, 241225, 241735, 242851, 243871, 244321, 244210, 243645, 242640, 241519, 241025, 241540, 242588, 243493, 244159, 244675, 244582, 243318, 241240, 239461, 238628, 238466, 238552, 238875, 239464, 240046, 240373, 240519, 240630, 240634, 240410, 239975, 239435, 238920, 238659, 238888, 239678, 240997, 242845, 245038, 247053, 248430, 249244, 249737, 249635, 248466, 246596, 245272, 245323, 246328, 247407, 248368, 249610, 251227, 252720, 253572, 253703, 253404]
52864B53404l23Q6Q64J728K233K030J199K84j60j23q4l27o31p63r23j397k022
52847B55075k436k642k976l541m075m282m022l218j943o32J49K21j09m57o15n09
52831B23988k12lj26m46o01n42n76q35j033r77r12j085j204p33L63J537K241K303
52813B21147J759P95k6M9J166K504L113K898K411J831Q00p07k002k479k335k159
52797B28765k123j988j697j503j555j679j558r49J17J210J734J512R70N72L24
52782B22152P7k9J96N56O91N64L91K50J71L01N54M00l88j068p47K65P24J41o23
52763B24578o65j57K51M52P23J008R00L26k34k29L95J056J028J40j027j727j655
52746B25163q67N10K027K793K309J287R19J384J849J867J883K184K311J947J516
$$ y = [253404, 253081, 253167, 254031, 255759, 257992, 260022, 261221, 261505, 261345, 261222, 261138, 260811, 260180, 259417, 258494, 257097, 255075, 252639, 249997, 247021, 243480, 239405, 235123, 231101, 227883, 225940, 225308, 225457, 225678, 225569, 225112, 224497, 223988, 223776, 223773, 223647, 223201, 222600, 222058, 221482, 220647, 219614, 218637, 217725, 216640, 215436, 214703, 215066, 216603, 218844, 221147, 222906, 223701, 223675, 223724, 224890, 227394, 230507, 233405, 235816, 237647, 238447, 237740, 235738, 233259, 230924, 228765, 226642, 224654, 222957, 221454, 219899, 218220, 216662, 215713, 215830, 217040, 218774, 220286, 221256, 221828, 222152, 222229, 222200, 222396, 222952, 223643, 224207, 224598, 224848, 225019, 225320, 225874, 226274, 225886, 224818, 224071, 224336, 225060, 225201, 224578, 223913, 223756, 224007, 224459, 225182, 226190, 227090, 227416, 227182, 226953, 227348, 228404, 229432, 229572, 228545, 226818, 225163, 224296, 224806, 226833, 229626, 231935, 233222, 234141, 235525, 237374, 239241, 241124, 243308, 245619, 247566, 249082]
52731B49082J381J137L15p72j474j664j539j049j81N31M95r4m63k77N9M1l84q97
52713B44247j139r96o80m73k72K19Q57J031O02K81O49J233J146L65l46n72o80
52696B45472j048j444j372o96L24J257J700J409N29l40m65L56J474J849J103p2
52680B50036p19o97n89p58j051j328j630j691j030J65R28O91Rl16k64k85m13l90
52662B40668k84l30l81j31K71L67J15o1J29O46J384K189K652K363J402K88n46
52645B50741r01o22L11J407J902J498O78J18l6j84o40j103q89K53J664K401K293
52628B58891K091K586L832N229N926N143K772j74k278l110l490m086m481m038
52614B64813l049k338k201k324k425k332j765o98K94O28N08N49Q64J053R38O64
$$ y = [249082, 250463, 251600, 251915, 251143, 249669, 248005, 246466, 245417, 245236, 245767, 246262, 246168, 245705, 245428, 245487, 245528, 245144, 244247, 243108, 242112, 241432, 240959, 240687, 240906, 241763, 242794, 243396, 243677, 244326, 245559, 246705, 247070, 246724, 246152, 245472, 244424, 242980, 241608, 240912, 241236, 242493, 244193, 245602, 246131, 245791, 245326, 245682, 247156, 249005, 250108, 250036, 249317, 248620, 248031, 247273, 246222, 244894, 243264, 241573, 240543, 240708, 241636, 242327, 242336, 242020, 241756, 241471, 241058, 240668, 240384, 240054, 239673, 239542, 239813, 240180, 240295, 240234, 240363, 241009, 242393, 244582, 247234, 249597, 250999, 251287, 250741, 249840, 249218, 249529, 250936, 252838, 254336, 255014, 255132, 255096, 254912, 254272, 253169, 252280, 252533, 254197, 256598, 258891, 260982, 263568, 267400, 272629, 278555, 283698, 286470, 286296, 284018, 280908, 277418, 273332, 268851, 264813, 261764, 259426, 257225, 254901, 252476, 250144, 248379, 247681, 247975, 248603, 249111, 249660, 250524, 251577, 252515, 253179]
52598B53179K66k67n79j74Q64J843K112J492K68p94p98L67J643J931J396J018
52582B63767J108J070N25j67n69n95j61P92J721J688N21q46j554j758j987k161
52566B61394j855j184p92r22j058n86M10J214J285Q54N94P27P53J32r31j687j646
52549B56702r87k49Q7j20n41o37k73P8p9o67j225j450j196l55Q38J626J415N00
52531B53467l07n78l87J25P11P96Q9p37o91J86Q63P40L36L63Q23J265J326R05
52513B59295K96K60J320K826L468K959K434K779L325K877J428K3o80r71j336j828
52497B78475k279k574k611k322j860j548j542j671j648j263m98M12J004R16K49
52482B61240m59p21n32k92k66k33K23J067J747J811J378Q67N13L89N67R92J307
$$ y = [253179, 253445, 253178, 252599, 252425, 253289, 255132, 257244, 258736, 259004, 258210, 257412, 257779, 259422, 261353, 262749, 263767, 264875, 265945, 266470, 266303, 265734, 265139, 264978, 265770, 267491, 269179, 269700, 268854, 267300, 265542, 263555, 261394, 259539, 258355, 257563, 256641, 255583, 254997, 255407, 256621, 257906, 258760, 259354, 260081, 260834, 260966, 260035, 258348, 256702, 255715, 255466, 255553, 255433, 254892, 254255, 253982, 254060, 253981, 253314, 252089, 250639, 249443, 249088, 249926, 251552, 252967, 253467, 253160, 252582, 252195, 252320, 253031, 253827, 253916, 253179, 252488, 252674, 253537, 254277, 254613, 254976, 255799, 257064, 258390, 259295, 259591, 259851, 261171, 263997, 267465, 270424, 272858, 275637, 278962, 281839, 283267, 283290, 282610, 281639, 280303, 278475, 276196, 273622, 271011, 268689, 266829, 265281, 263739, 262068, 260420, 259157, 258659, 259071, 260075, 260991, 261240, 260781, 260060, 259528, 259236, 258970, 258737, 258960, 260027, 261774, 263585, 264963, 265830, 266343, 266732, 267299, 268291, 269598]
52465B69598J272J166J452K150K894L432L680L431K555J379L67n13j547k471k639
52450B86206k125j872k428l160l195k598k092j932j794j560j542j813j805r37
52436B57353N85J855K109J344J54q16j197r07k14L56M90N07Q96J486J517P78J09
52419B66405K96J033J465J386J233J144Q86O10Q79J791K729L219L578M455O041
52404B97150P918R419J0125J0087R490P968M794J73m112o232o264n851n996o191
52390C22478n726m816l986l221k305j371o73j84J76L81N66J002J552J717J481
52375C07071J534K299L315L955M221M407M468M307M226M534M948M819L819K124
52361C60047K60j091j493j268j160j323j170m59K29M73P40J461K085J933J424
$$ y = [269598, 270870, 272036, 273488, 275638, 278532, 281964, 285644, 289075, 291630, 293009, 293376, 292863, 291316, 288845, 286206, 284081, 282209, 279781, 276621, 273426, 270828, 268736, 266804, 265010, 263450, 261908, 260095, 258290, 257353, 257938, 259793, 261902, 263246, 263400, 262584, 261387, 260480, 260266, 260622, 261112, 261619, 262515, 264001, 265518, 266296, 266405, 266701, 267734, 269199, 270585, 271818, 272962, 273848, 274458, 275337, 277128, 279857, 283076, 286654, 291109, 297150, 305068, 314487, 324612, 334699, 344189, 352157, 356951, 357124, 353012, 346780, 340516, 334665, 328669, 322478, 316752, 311936, 307950, 304729, 302424, 301053, 300380, 300196, 300372, 300753, 301319, 302321, 303873, 305590, 307071, 308605, 310904, 314219, 318174, 322395, 326802, 331270, 335577, 339803, 344337, 349285, 354104, 357923, 360047, 360307, 359216, 357723, 356455, 355295, 353972, 352802, 352343, 352572, 353045, 353785, 355246, 357331, 359264, 360688]
52346C60688J521K284K932L182L538M240M814M862M585M314M177M407N357O873
52332D17774Q261R147R877J0825J1846J2756J3903J5655J7623J8999J9611K0106
52320E86383K1019K2051K2519K2216K1587K1209K1315K1806K2407K2783K2720
52309H28015K2390K2205K2339K2426K2005K1083K0116J9389J8700J7678J6211
52298A052557J4517J2889J1485J0177Q616O531M011J398j119l678o447r198j1252
52285A090487j1966j1384j0285r426q756p716o173m628l434k384j279k25R75K959
52271A016765N749Q207R476J0344J2084J4334J5416J4791J3833J3908J4803J5562
52259A165272J5864J5882J5573J4891J4249J4085J4264J4339J4091J3436J2154
$$ y = [360688, 362209, 364493, 367425, 370607, 374145, 378385, 383199, 388061, 392646, 396960, 401137, 405544, 410901, 417774, 426035, 435182, 445059, 455884, 467730, 480486, 494389, 510044, 527667, 546666, 566277, 586383, 607402, 629453, 651972, 674188, 695775, 716984, 738299, 760105, 782512, 805295, 828015, 850405, 872610, 894949, 917375, 939380, 960463, 980579, 999968, 1018668, 1036346, 1052557, 1067074, 1079963, 1091448, 1101625, 1110241, 1116772, 1120783, 1122181, 1121062, 1117384, 1110937, 1101739, 1090487, 1078521, 1067137, 1056852, 1047426, 1038670, 1030954, 1024781, 1020153, 1016719, 1014335, 1013056, 1012831, 1013806, 1016765, 1022514, 1030721, 1040197, 1050541, 1062625, 1076959, 1092375, 1107166, 1120999, 1134907, 1149710, 1165272, 1181136, 1197018, 1212591, 1227482, 1241731, 1255816, 1270080, 1284419, 1298510, 1311946, 1324100]
52248A324100J0060P243L975O91j973l688n075p157r885j1991j2673j2677j3189
52235A267761j4353j5416j5853j5640j4887j3903j3257j3197j3213j2672j1608
52224A113762j0459r388q270p072n794m390l088k405k407k366j619l92P00J531
52210A058343K386L368M367N219N532M880L638K959L342L852L548K988L370M679
52196A112471N813O185O137N901N306M529M087L949L589L045K984L437L411K218
52182A173062M09j134k391l905n796p630r078j0119j0681j0540r649q392p321
52169A086835o613n862m581k894j513q34m66J03P10Q79P67J099K188L461M065
52154A077344L637K432J033Ml81k47J19N22Q27Q86P14N94P97J305J884K223J932
$$ y = [1324100, 1334160, 1341403, 1345378, 1346069, 1344096, 1340408, 1335333, 1328176, 1318291, 1306300, 1293627, 1280950, 1267761, 1253408, 1237992, 1222139, 1206499, 1191612, 1177709, 1164452, 1151255, 1138042, 1125370, 1113762, 1103303, 1093915, 1085645, 1078573, 1072779, 1068389, 1065301, 1062896, 1060489, 1058123, 1056504, 1056112, 1056812, 1058343, 1060729, 1064097, 1068464, 1073683, 1079215, 1084095, 1087733, 1090692, 1094034, 1097886, 1101434, 1104422, 1107792, 1112471, 1118284, 1124469, 1130606, 1136507, 1141813, 1146342, 1150429, 1154378, 1157967, 1161012, 1163996, 1167433, 1170844, 1173062, 1173471, 1172337, 1169946, 1166041, 1160245, 1152615, 1143537, 1133418, 1122737, 1112197, 1102548, 1094156, 1086835, 1080222, 1074360, 1069779, 1066885, 1065372, 1064538, 1064072, 1064175, 1064885, 1065764, 1066531, 1067630, 1069818, 1073279, 1077344, 1080981, 1083413, 1084446, 1084450, 1084069, 1083822, 1083941, 1084463, 1085290, 1086176, 1086890, 1087484, 1088281, 1089586, 1091470, 1093693, 1095625]
52137A095625Q65l80p32J89J560K456L069M319O580R351J2024J4444J6854J9621
52123A185845K2934K6396K9165L0830L1901L3022L4079L4496L4126L3323L2349
52112A528466L1206K9827K8059K5691K2891K0223J7884J5408J2618J0222Q778
$$ y = [1095625, 1096490, 1096110, 1095378, 1095567, 1097127, 1099583, 1102652, 1106971, 1113551, 1122902, 1134926, 1149370, 1166224, 1185845, 1208779, 1235175, 1264340, 1295170, 1327071, 1360093, 1394172, 1428668, 1462794, 1496117, 1528466, 1559672, 1589499, 1617558, 1643249, 1666140, 1686363, 1704247, 1719655, 1732273, 1742495, 1751273]
$$ [...]
##END NTUPLES=NMR SPECTRUM
##END=
