##TITLE=AC1535_ROEFFECT0009_8214612_rDq8SoKwYn
##JCAMPDX= 6.0         $$ Bruker NMR JCAMP-DX V2.0
##DATA TYPE= NMR SPECTRUM
##DATA CLASS= NTUPLES
##ORIGIN= BRUKER
##OWNER= Administrator
$$ 1.72 TOPSPIN		Version 2.1
$$ 2014-08-05 00:36:35.373 -0700  Administrator@X
$$ Compression mode = diff/dup
##.OBSERVE FREQUENCY= 400.02188249412
##.OBSERVE NUCLEUS= ^1H
##.ACQUISITION MODE= SIMULTANEOUS (DQD)
##.ACQUISITION SCHEME= undefined
##.AVERAGES= 8
##.DIGITISER RES= 22
##SPECTROMETER/DATA SYSTEM= spect
##.PULSE SEQUENCE= zg30
##.SOLVENT NAME= COFFEE_meoh
##.SHIFT REFERENCE= INTERNAL, COFFEE_meoh, 1, 14.98509
##AUDIT TRAIL= $$ (NUMBER, WHEN, WHO, WHERE, PROCESS, VERSION, WHAT)
$$ ##TITLE= Audit trail, TOPSPIN		Version 2.1
$$ ##JCAMPDX= 5.01
$$ ##ORIGIN= Bruker BioSpin GmbH
$$ ##OWNER= Administrator
$$ $$ E:\/data/COFFEE/nmr/AC1535_ROEFFECT0009_8214612_rDq8SoKwYn/20/pdata/1/auditp.txt
$$ ##AUDIT TRAIL=  $$ (NUMBER, WHEN, WHO, WHERE, PROCESS, VERSION, WHAT)
(   1,<2014-08-05 00:36:27.678 -0700>,<Administrator>,<X>,<go>,<TOPSPIN 2.1>,
      <created by zg
	started at 2014-08-05 00:35:21.731 -0700,
	POWCHK enabled, PULCHK disabled,
       configuration hash MD5:
       16 EA D6 F4 BB 67 03 14 9B FF E7 A0 43 5B 48 2E
       data hash MD5: 64K
       9A FC 8E B9 D1 BC 25 34 12 96 AB 5F 4F 02 37 F5>)
(   2,<2014-08-05 00:36:31.076 -0700>,<Administrator>,<X>,<proc1d>,<TOPSPIN 2.1>,
      <Start of raw data processing
       efp LB = 0 FT_mod = 6 PKNL = 1 PHC0 = 0 PHC1 = 0 SI = 32K 
       data hash MD5: 32K
       DE 27 70 53 29 D3 B5 DE 1D AD 23 D8 62 B8 96 EF>)
(   3,<2014-08-05 00:36:31.451 -0700>,<Administrator>,<X>,<proc1d>,<TOPSPIN 2.1>,
      <pk PHC0 = 90.51636 PHC1 = 0 
       data hash MD5: 32K
       33 AF 27 0D A5 DD E5 14 57 7E B7 A5 42 DA 7E B7>)
(   4,<2014-08-05 00:36:31.670 -0700>,<Administrator>,<X>,<proc1d>,<TOPSPIN 2.1>,
      <abs ABSG = 1 
       data hash MD5: 32K
       DB 25 F2 EA DF 79 8B 67 46 7F AE EB 9B 46 D9 49>)
(   5,<2014-08-05 00:36:31.779 -0700>,<Administrator>,<X>,<proc1d>,<TOPSPIN 2.1>,
      <abs ABSG = 2 
       data hash MD5: 32K
       CA 0A 56 C7 CC 46 2C C9 0E EF D1 E0 2D 52 7B 59>)
(   6,<2014-08-05 00:36:31.857 -0700>,<Administrator>,<X>,<proc1d>,<TOPSPIN 2.1>,
      <abs ABSG = 3 
       data hash MD5: 32K
       35 CA BF 04 27 82 15 90 0A CE A3 FC 89 9F 4F 41>)
(   7,<2014-08-05 00:36:31.951 -0700>,<Administrator>,<X>,<proc1d>,<TOPSPIN 2.1>,
      <abs ABSG = 4 
       data hash MD5: 32K
       7E 47 66 95 DD 27 9B 69 16 5D 64 74 A7 5E 0E 65>)
(   8,<2014-08-05 00:36:32.029 -0700>,<Administrator>,<X>,<proc1d>,<TOPSPIN 2.1>,
      <abs ABSG = 5 
       data hash MD5: 32K
       A5 49 90 04 88 50 24 EF 22 22 A3 17 12 78 FE 85>)
$$ ##END=
$$ 
$$ $$ hash MD5
$$ $$ A6 DC D1 6E 23 54 24 60 F9 BE 3E D7 36 B1 56 78
##$RELAX= 
##$RELAX= 
##$RELAX= 
##$RELAX= 
##$RELAX= 
##$RELAX= 
##$RELAX= 
$$ Bruker specific parameters
$$ --------------------------
##$DU= <E:\>
##$EXPNO= 20
$$ [...]
##$TP= (0..7)
150 150 150 150 150 150 150 150
##$TP07= 0
##$TPNAME0= <>
##$TPNAME1= <>
##$TPNAME2= <>
##$TPNAME3= <>
##$TPNAME4= <>
##$TPNAME5= <>
##$TPNAME6= <>
##$TPNAME7= <>
##$TPOAL= (0..7)
0.5 0.5 0.5 0.5 0.5 0.5 0.5 0.5
##$TPOFFS= (0..7)
0 0 0 0 0 0 0 0
##$TUNHIN= 0
##$TUNHOUT= 0
##$TUNXOUT= 0
##$USERA1= <user>
##$USERA2= <user>
##$USERA3= <user>
##$USERA4= <user>
##$USERA5= <user>
##$V9= 5
##$VALIST= <valist>
##$VCLIST= <CCCCCCCCCCCCCCC>
##$VD= 0
##$VDLIST= <DDDDDDDDDDDDDDD>
##$VPLIST= <PPPPPPPPPPPPPPP>
##$VTLIST= <TTTTTTTTTTTTTTT>
##$WBST= 1024
##$WBSW= 4
##$XGAIN= (0..3)
0 0 0 0
##$XL= 0
##$YL= 0
##$YMAX_a= 619628
##$YMIN_a= -510429
##$ZGOPTNS= <>
##$ZL1= 120
##$ZL2= 120
##$ZL3= 120
##$ZL4= 120
##$ABSF1= 14.98509
##$ABSF2= -5.573092
##$ABSG= 5
##$ABSL= 3
##$ALPHA= 0
##$AQORDER= 0
##$ASSFAC= 0
##$ASSFACI= 0
##$ASSFACX= 0
##$ASSWID= 0
##$AUNMP= <proc_prof1d_extract_pilot.lims>
##$AXLEFT= 0
##$AXNAME= <>
##$AXNUC= <1H>
##$AXRIGHT= 0
##$AXTYPE= 0
##$AXUNIT= <>
##$AZFE= 0.1
##$AZFW= 0.1
##$BCFW= 0
##$BC_mod= 0
##$BYTORDP= 0
##$COROFFS= 0
##$CY= 15
##$DATMOD= 1
##$DC= 0
##$DFILT= <>
##$DTYPP= 0
##$F1P= 0
##$F2P= 0
##$FCOR= 0.5
##$FTSIZE= 32768
##$FT_mod= 6
##$GAMMA= 0
##$GB= 0
##$INTBC= 1
##$INTSCL= 1
##$ISEN= 128
##$LB= 0
##$LEV0= 0
##$LPBIN= 0
##$MAXI= 10000
##$MC2= 0
##$MEAN= 0
##$ME_mod= 0
##$MI= 0
##$NCOEF= 0
##$NC_proc= -8
##$NLEV= 6
##$NOISF1= 0
##$NOISF2= 0
##$NSP= 0
##$NTH_PI= 0
##$NZP= 0
##$OFFSET= 14.98509
##$PC= 1
##$PHC0= 90.51636
##$PHC1= 0
##$PH_mod= 1
##$PKNL= yes
##$PPARMOD= 0
##$PPDIAG= 0
##$PPIPTYP= 0
##$PPMPNUM= 2147483647
##$PPRESOL= 1
##$PSCAL= 4
##$PSIGN= 0
##$PYNMP= <proc.py>
##$REVERSE= no
##$SF= 400.02
##$SI= 32768
##$SIGF1= 0
##$SIGF2= 0
##$SINO= 400
##$SIOLD= 32768
##$SPECTYP= <>
##$SREGLST= <1H.CDCl3>
##$SSB= 0
##$STSI= 32768
##$STSR= 0
##$SW_p= 8223.68421052631
##$SYMM= 0
##$S_DEV= 0
##$TDeff= 65536
##$TDoff= 0
##$TI= <>
##$TILT= no
##$TM1= 0
##$TM2= 0
##$TOPLEV= 0
##$USERP1= <user>
##$USERP2= <user>
##$USERP3= <user>
##$USERP4= <user>
##$USERP5= <user>
##$WDW= 1
##$XDIM= 32768
##$YMAX_p= 383803318
##$YMIN_p= -677952
##$CURPLOT= <Network HP LaserJet P1505>
##$CURPRIN= <$Network HP LaserJet P1505>
##$DFORMAT= <normdp>
##$LAYOUT= <+/1D_H.xwp>
##$LFORMAT= <normlp>
##$PFORMAT= <normpl>
##$SURQMSG= 1
$$ End of Bruker specific parameters
$$ ---------------------------------
##NTUPLES= NMR SPECTRUM
##VAR_NAME=  FREQUENCY,     SPECTRUM/REAL,   SPECTRUM/IMAG
##SYMBOL=    X,             R,               I
##VAR_TYPE=  INDEPENDENT,   DEPENDENT,       DEPENDENT
##VAR_FORM=  AFFN,          ASDF,            ASDF
##VAR_DIM=   32768,         32768,           32768
##UNITS=     HZ,            ARBITRARY UNITS, ARBITRARY UNITS
##FACTOR=    0.250966925370066, 1,           1
##FIRST=     8223.43324360094, 52748,        30606
##LAST=      0,             -86006,          -258724
##MIN=       0,             -677952,         0
##MAX=       8223.43324360094, 383803318,    0
$$ Real data points
##PAGE= N=1
##DATA TABLE= (X++(R..R)), XYDATA
$$ [...]
23759 132690 -81514 -130841 379453 158085 -210379 -132883 -125375 60638 136367 44084 138098
23748 138098 61327 17639 -85525 -87158 -98967 -106987 -212880 163925 -276985 -206889 -172961
23737 -172961 -226070 84728 -94255 107925 184056 156539 156699 211895 208564 164339 -74676 6793
23724 110284 317759 -123134 -33458 -108446 -275531 -141310 -319632 123090 260107 179020
23714 179020 202167 288365 96684 -230758 110687 -248480 -20738 -97765 136818 60307 -131591
23702 -101608 -215128 -280482 11660 -9337 114844 34050 -437331 -26306 431096 128650 42815
23690 52102 -321512 -26933 72998 69836 206596 -69049 -126656 127912 -144648 -46329 31247
23678 36381 114207 -108175 110056 99179 -39242 -261008 115827 149725 -45175 -145070 -104308
23667 -104308 -160476 -231412 -369405 -103834 158546 24098 -27889 48078 -17804 -142016 146189
23655 197595 -72821 184700 -148585 287442 249836 -170257 -127888 74076 -145739 -349019
23645 -349019 -166925 -107837 147042 53897 100743 233466 -4511 -283335 -106379 -183308 -11009
23633 -95233 112291 102419 -42407 59912 47704 55544 -194 -192718 -200873 90899 300769 -44178
23620 -151017 -81355 159141 -69324 -57587 79069 -74063 -96883 -4115 -113338 363069 395084
23609 395084 -95145 -158737 224220 179502 277233 -197200 -17838 -7221 -20817 -58662 -102332
23598 -102332 -104375 -15467 -125869 -156309 256389 -78097 -131780 -339411 -207396 -70388 323904
23586 -30054 135390 -110246 92199 282095 105617 -188526 123377 -56451 -7165 -43084 -98279
23575 -98279 253044 -128060 323 -322993 -372724 -42115 40698 211293 -96015 203649 26431
23563 164077 -88528 151953 -189979 119711 -55544 -72828 52519 4967 2464 244304 112815
23551 104229 249603 -86866 -73540 176490 -53451 -2309 24838 -200364 100462 -15096 39456
23539 344717 -48531 -32961 270395 -175463 151427 126905 -152379 41626 -73047 -100993 -250335
23528 -250335 -306766 -18093 -101548 6916 90259 -256006 -224446 146856 -289193 265027 64820
23516 -452048 -171532 263850 -15356 -172031 103087 -74764 -226424 10831 -223499 32699
23505 -338483 -36579 36300 64923 -34856 -137149 -205995 125510 217859 -70419 122277 405922
23494 405922 -59854 -69806 -168373 -46463 102660 -122002 -195170 -42514 -100773 -50410 -188358
23483 -188358 243605 -202801 -2811 201439 -16975 138876 16409 32431 -261291 -118350
23472 -238098 141985 -131582 52006 -258114 -215519 -281491 41262 13799 -28189 -56682 -404647
23461 -404647 -30526 -62468 -23456 333392 -88963 -47634 -111163 76375 -94475 204704 138006
23450 138006 114231 -133425 -303570 -18379 44100 -3779 -291565 -104847 214884 -96740 59088
23438 -85017 13029 152082 -71000 195363 -354542 -218920 -6897 -168952 -81130 167726 -115439
23426 265084 60618 -86916 -113802 382547 23906 89857 18975 -206362 -131538 144552 -298448
23414 145215 62390 -31559 34846 6279 -217140 -89721 -330618 -132094 141921 -321232 -23121
23402 -117553 -157512 -41877 76842 81421 -128368 25981 -87932 -43360 -63715 312701 51268
23390 -54954 258648 71526 -355924 -149510 249316 -208210 173059 293783 -60002 -82435
23380 -82435 8607 -85086 -353161 194234 -147495 21087 -115566 -192436 -37089 31894 -100997
23368 71643 -141103 60229 137294 -189687 166643 64893 274912 -206577 105425 128866
23358 128866 179060 32321 -124047 -39426 -181444 -235576 -133734 96910 -118794 14188 44692
23347 44692 -78747 -169596 135807 272019 109799 -41792 -63803 -14531 82404 207699 194617
23336 194617 147743 193033 56303 54884 67374 110038 -115522 -136791 119495 16251 75561
23325 75561 19982 74301 78863 -113411 -155901 11112 20317 52082 250387 -331394 47631
23313 -188013 67840 -164903 -67869 -31718 115767 101492 -241346 -249454 61522 43689 15331
23301 59207 -178965 -123679 167621 -104545 78940 303075 -257923 -86088 68 -81149 -85296
23290 -85296 -95238 -44436 -193061 205831 -90504 144729 -26274 58874 -220058 -87535 -74396
23279 -74396 -229549 -159035 -98582 -22910 106866 -182441 -132881 -135094 -32506 -338104 144925
23267 -60616 -252393 221583 35477 -215036 -25844 -170008 -121757 218884 -21123 143362
23256 -360515 143993 92086 269258 -196889 135581 -378809 139156 127260 76682 -7288
23245 105304 -56371 -285219 -46456 203424 259271 -241504 27093 5666 -129160 267959 -111420
23233 57737 -229428 238710 170958 -72511 -244368 89730 -416271 -214372 114209 45533
23222 -258978 -155988 37225 -128233 -20615 49154 93610 -222297 291384 97374 89057 93851
23211 93851 31295 -22886 -42775 -7110 -103633 -134233 -107295 182081 9149 -29062 -122268 32461
23198 -177724 23715 214017 -39047 -187814 63214 159817 -442789 330121 265499 -120682
23187 -109909 7790 101575 85301 542942 -36098 -69601 -154235 -17071 -184947 -224115 395773
23175 57742 76980 173873 -56157 -89969 -211890 -126201 -79099 37971 -28229 85535 -18144
23163 -254860 243489 85323 -345027 -213381 120916 -64626 52798 13759 -113311 -107737 -198428
23152 -198428 -234036 -151937 -187667 -128501 -167365 -154640 175759 -441935 -30928 20491 -145740
23140 49139 190456 -387799 61403 161040 -112181 -33256 54279 34299 32019 189981 -210776
23128 -50387 70222 -19976 -171956 126378 -53922 97348 26390 -50877 69959 45690 -226670
23116 -91926 65192 206426 -109883 360604 108174 24122 87684 -250831 -236888 -26995 21806
23104 -35480 16128 61603 -70090 103125 190005 -278894 142544 -90928 -1698 -198323 -279310
23093 -279310 228516 -79347 229299 -109347 60702 -213760 100728 296146 28088 29046 75556
23082 75556 37747 182101 4643 55504 -73426 150095 -41755 459649 96962 44971 46327
23071 46327 145117 -110646 -91940 21570 271780 -15274 -86717 -77449 -70686 29174 -99312 -343775
23059 -343775 195533 -208204 200977 212319 -216762 -178016 -205106 292328 36004 49602
23049 49602 -164841 -2947 50252 -166787 29081 -225287 -78231 -266573 97347 -149866 372452
23037 150776 95150 -234125 213888 -62904 -18237 55767 -11099 104214 -83466 68443 -139155
23025 -60788 -72237 -321252 4557 -77724 149231 -248099 -91961 -46299 -11784 -339981 -155073
23013 344009 393480 14406 -67496 -239802 -6558 -163071 63943 100963 -76344 -68386 -167251
23002 -167251 157462 -39404 97945 -14967 -5382 -315663 -266045 88514 -21600 -18179 -80049
22991 -80049 29564 -173851 442772 -193536 60973 45317 65058 -282672 -175598 36298 -10143
22979 37210 252951 106305 108168 -198545 145201 27115 55176 40898 -202260 -366610 160879
22967 -142397 118613 118494 39700 -218223 200040 -219322 -188774 117654 93262 -136632 -182914
22956 -182914 -231014 -121434 37060 130386 22049 31890 -70894 -49511 -199417 81801 259772
22945 259772 -285719 -44370 244483 -19579 106240 329242 51689 -25494 -107623 58138 -2571
22933 165077 -142940 -163626 -14763 -1781 -10643 -138859 286189 319290 -100186 149346 -249255
22921 -164704 -179524 -147633 55255 53191 -52576 -33901 -48554 50721 45784 -182321 218023
22909 -256280 129646 -57414 -144237 179923 218538 -28697 -251381 -333444 -186427 -317052
22899 -317052 -53630 -86905 182392 219241 124720 -259626 -268333 123048 -52504 4617 -237718
22887 125619 -175987 52659 162711 217313 -262386 -184916 -125892 27896 -431882 -110616
22876 -85360 179402 -152418 57175 -105562 159089 -289022 91602 -197980 -180882 -215949
22866 -215949 -279365 202626 -151200 -15724 -158736 52109 -117789 92828 130643 -88399 157096
22854 99168 14793 168657 327077 204729 -35973 43085 -135327 255257 -485928 -59508
22843 -184100 17251 -22920 -299147 159291 -277176 -16480 60656 -46001 6853 -18171 -174631
22832 -174631 138500 151455 -47278 -84731 197109 401909 -101503 -147528 -75363 -4958 40067
22820 -55944 46584 -129188 -45162 -59826 192764 -13462 201097 60186 69344 -256419 269783
22808 -62515 -207468 -422330 -169008 187557 -220254 -154831 58629 18943 -109226 -105025 -186790
22797 -186790 6557 103456 -144643 175524 -132447 -128542 541717 180981 -58402 279629 -161560
22785 54344 55680 20625 9715 133484 -18762 -140817 9951 -56117 23752 55987 -76576 -82701
22773 -82701 121989 -99343 -322820 -5911 -7070 -38142 150629 -186792 -115185 -36917 94525
22761 -58720 -60381 -180818 470666 -241607 102831 48455 132224 -332380 -118984 50989 -48727
22749 -29395 160262 -6744 301691 47588 -187121 74396 -238227 -110998 102135 -206359
22738 -335612 174725 -91357 -183107 -134711 310908 -169890 -20538 -20299 -140037 239136 91226
22726 79986 -100214 -151281 34840 -55271 -135737 -211242 -79713 -250090 -141514 -28756 -302912
22715 -302912 -5786 88472 -146712 226215 -44355 264720 249000 -527937 164593 -69369 -193724
22704 -193724 108849 -244383 41728 -261109 42283 118092 22356 -378304 -110697 -102566 -385410
22693 -385410 -34996 -6461 197679 -205445 -62430 -36009 -127291 -269087 -65058 99599 -161695
22681 -26122 122425 -139514 -198336 -260635 -122948 -275573 -146747 15623 205592 -119769
22670 -435067 -68102 -365399 -75034 183718 7135 -131089 -34319 -109695 383889 -132281 -75534
22659 -75534 135963 56097 194696 -78488 -5478 -5985 188282 146557 -72710 -90785 -48906 -79677
22647 -79677 -179243 -104362 -22876 -169288 70911 197583 93260 -14409 207470 -23333 -66678
22636 -66678 504177 -266169 -41803 -18905 -88641 75365 116007 -66376 377397 96828 78880
22625 78880 -58232 -365374 92267 -93788 -348647 -87563 50490 56364 -27140 -82999 24442
22613 -156556 -348708 -219485 -134878 30334 -155631 84184 49964 160695 207422 41347 3684
22601 -21599 -256251 7299 -168453 -353271 -179941 -130829 -103893 66795 -202127 -132119 -248050
22590 -248050 -86711 65353 -11360 -117791 102980 -233815 -249494 433508 -24196 -136019
22580 -136019 -36725 -185396 180742 -178680 143280 -20926 -211572 1437 134775 -84974
22569 -10276 -151604 14269 -261951 -196641 37338 10835 -30733 -104990 -38349 330668 -7881
22557 -86808 -134440 48644 296610 18331 -46104 35232 -88980 3670 101025 241786 -180789
22545 15191 -182640 -56819 -17464 219201 152172 -276610 164213 122782 -31450 -336897 -208001
22534 -208001 182842 -414747 210975 146609 -163757 -152534 373410 -21855 205266 61061
22523 -63802 109067 58221 -293643 6942 -40282 -23618 -412418 -658808 -132417 69244 -85352
22511 -108920 -175153 -28546 -88268 -349672 158464 -64615 -31733 -328457 170578 104522 21066
22499 -94408 -46563 -77651 128566 90177 -122426 -122094 -182880 -270905 -186242 14306 -214118
22487 -54655 -236903 11055 -219000 -330133 -32225 -85666 -237786 105966 -49766 -200299
22477 -200299 131516 -330717 222007 -32654 146244 114538 147185 -275885 -210572 -259720
22467 -259720 27758 189817 197134 -73101 -73321 -109851 240328 125716 114673 333489 333882 61949
22454 20407 -75937 62157 10629 -57890 -223035 150593 34931 40786 32584 -11549 -45805 -178405
22442 -178405 -73606 -7353 -61720 -312342 81583 147906 -208027 -10816 -75811 -75733 187928 -396770
22429 200250 -138590 56334 -85990 -120927 -133049 -179002 -10504 114936 58123 -36145 -113887
22418 -113887 -94178 -123035 -29177 -57924 -27205 -194882 52836 183879 78319 254362 -112378
22406 -136407 -138928 69770 -255337 188726 -128616 14882 -296068 -31975 -375326 -151735
22395 -128150 56537 -19960 53143 148584 255120 -27616 -299698 64788 25788 -252160 48882
22383 -127517 64693 143566 193974 -118761 247219 -141417 22371 -168707 -117113 -198744 -202143
22372 -202143 254147 -107997 -96791 -177246 -78368 -76777 136293 -12431 -223535 -223477 34982
22360 120362 264726 -30260 -97531 26488 17326 -295924 -98601 -43904 -119336 -135894 241550
22348 -56194 -186141 -426987 174566 -208881 -127752 -80114 -73131 -307158 -99213 -148898 78293
22336 -123862 -92773 25267 -296976 -128582 -25958 107363 64569 145843 -181897 -58191 -13542
22324 -141567 -230729 13105 -157547 50456 -140824 -116660 56880 26602 6456 176887 257380
22313 257380 93949 -369962 -192972 72104 -33382 -275718 107125 -485717 -145774 407281
22302 -243417 2261 -310948 -80146 233472 -269425 127384 76398 -118334 -218697 -216555 -80656
22290 -329930 -188207 -50994 221285 -388688 -188381 52770 121095 113149 -47143 217890 154801
22279 154801 -234065 -229091 315662 -269302 71070 -107292 -8211 25231 -249470 176475 49061
22267 -130009 -300397 -21676 7559 -95528 158894 -221390 9795 -97716 -21667 -41787 -133971
22256 -133971 -18172 157189 -283899 122259 335661 -449576 -6921 4543 17099 -159545 -79239
22244 220205 204983 207028 -249991 73355 -41337 16779 16471 195820 -84420 78762 -130665
22232 -96804 -75757 281 -56987 67545 333993 -337249 109668 15192 -130835 -134116 -323085
22221 -323085 -334082 -310949 -16807 -91761 -27613 -181743 -39878 -203034 362168 -96485 -74812
22210 -74812 -12415 94084 -29305 -83651 -143342 -254951 -8101 -394011 576315 216519 -361388
22198 -10567 105580 -116405 58375 89579 -132554 65424 182958 187517 -27740 87643 -81302
22186 -25964 210758 211793 29759 286028 -170921 -218602 23963 -276042 97955 -383860 -229862
22175 -229862 79019 -4556 -178883 534960 -189148 -9730 -61834 -146553 138448 99890 -126286
22163 -467561 -145098 266084 -311520 268087 163739 -121166 -83899 -113598 119213 59042
22152 -175324 40194 -99838 -195169 203311 -486685 22920 -23955 -145435 -212304 -66366 -359662
22141 -359662 -102859 -47150 -7059 -79672 345039 -464981 36345 -422081 -167127 -251396 66820
22129 52501 56448 -37850 176021 296154 -13148 -25638 149183 -109196 -506124 31931 -235869
22117 -430163 -23698 -54675 31676 105124 -149452 -402361 -44656 -88671 16867 -69736 -198999
22106 -198999 272136 -110042 244217 277120 59551 -179109 141375 -120468 -168943 247901
22095 -144513 -210868 -111155 -116407 103492 78413 -18384 5854 22743 -60892 330235 -163071
22083 -252219 -353966 -63040 -74653 70386 146019 140566 -307742 -78523 -376923 -203610 -72426
22071 254538 -49143 -22005 -219397 -280850 -383318 -216541 75929 -340974 11895 -95871 -148506
22060 -148506 -44066 93864 57362 121945 24707 -228780 358823 -284201 -176399 10753 -2430
22048 -68925 -13115 -121656 124943 -368986 -19556 -145818 158073 -125898 27932 44249
22038 44249 -187804 -347467 -248229 -38915 308165 273814 -97507 254564 203305 -14178 -9740
22027 -9740 -166146 -84343 -97839 -18930 1452 -35347 -22297 -238543 -31073 59651 59227 -33051
22014 264931 27542 68646 46827 -170412 -69398 -290769 -170069 387983 -230832 190846
22003 280506 130166 46455 -372454 26118 89123 -11012 -137371 -11735 -109389 -244084 -333903
21992 -333903 72125 -153182 -168660 -203942 -230737 -374613 27433 -261850 -36475 174886 267109
21981 267109 9514 -180312 73167 -45377 -7191 -214617 395501 9732 -102519 -112757 10960
21969 93050 -23588 6002 136732 -95783 55255 225580 -366301 -257687 158162 -57486 13559
21957 173229 136352 41649 -34355 -232943 -110608 -222498 -67857 -233774 28612 -86994 -232391
21946 -232391 -21624 -4276 212210 121352 44476 -318641 28794 -291683 -157461 184185 -179926
21934 320760 -213768 113810 163052 -29703 -22050 202047 -179575 37553 -267367 -174762 179029
21922 -132938 4430 163912 207034 100669 274989 -327899 -194546 -114554 89540 -561994
21911 -64561 -14258 -99186 -89459 104954 -127936 132421 56034 -5679 293636 -213986 -91177
21899 46405 -402081 70519 -22834 -238132 -159261 150635 42239 3345 62421 -45433 228268
21887 -70853 139812 -195181 91830 -225121 -136375 -216418 203338 -233365 143026 -113033
21876 83005 -156035 9541 403354 223008 -231390 79325 -2159 -353328 -309669 -197723 -389111
21865 -389111 -106385 -500157 -203624 -87552 75037 114741 -156039 -17523 -144029 -111721
21855 -111721 -122641 23114 -273206 -195442 -465615 -13526 250048 195806 -2991 -195378 81950
21843 142343 -423470 46254 -190167 -156031 116362 -225447 -461095 -355786 -49155 -141585
21833 -141585 -470016 283617 127476 -2025 61763 -36417 -264957 152909 176995 -46304 34785
21821 170524 203444 -208832 40319 108979 -34742 -96089 46392 -117676 -116849 324661 107428
21809 23983 -97089 -314304 -108118 254343 -136066 -279461 -180054 277101 -145125 228711
21798 -140840 -72385 -101696 -63175 -49872 -237720 -185751 79618 -181612 -357112 164416 -75160
21786 284274 -28423 65728 257650 -218127 -163760 -73622 -315728 -24249 86321 116458 -283014
21774 -168645 192307 -32056 -41442 -143784 -121260 -60534 -314711 -204648 -212127 -29916 71456
21762 124105 136669 -234512 154315 -35186 -302666 -279451 48167 -131237 -76922 194838
21751 -28898 204424 -161255 349417 -218122 -158530 -15985 37007 -46139 -91019 199708 -563840
21739 57790 -6340 5401 166309 -110624 25049 -23552 -149472 -218936 142227 -41595 -25799
21728 -25799 44350 -536913 -227862 27790 -274158 252443 -35969 -48823 105055 -104370
21717 -202153 -296371 34315 46507 177321 -149894 -367930 -25654 -228920 -288109 -15388 -43423
21706 -43423 -9784 63139 -84710 -94462 -303708 210951 -140124 -74816 -147993 -58934 -62302 69283
21693 90830 -274591 -120757 -275231 -1841 -130586 29317 78133 -293963 204184 -76311 344491
21681 -74473 209212 -260174 401930 -96414 -24012 23440 169343 -43010 199551 -58380 -221626
21670 -221626 -17035 -218590 -153013 -28748 55180 37010 -74856 -339 209824 -331421 202547
21658 -139757 -1787 -245964 137255 -173145 1279 4175 -140246 131481 47135 66511 -55172
21646 290250 62740 -106491 -153666 -84333 -28184 166212 64751 -38096 145686 -86816 -99323
21635 -99323 233983 45141 -117484 -104082 162674 -60040 -210320 -57268 -183575 -47062 -26663
21624 -26663 293369 38949 -71629 138668 -137798 24058 -103661 57196 85656 183748 -62412
21612 65901 -107041 67657 14538 250969 -350970 203628 -142290 -122626 -348520 -267564
21602 -267564 194324 -34965 130786 152838 176993 -63603 25924 -35914 -91097 350565 -19900
21590 -451575 111848 -1412 8048 -285055 -109357 -53962 110634 -438457 -326172 -251846 -4259
21578 144898 -168975 -13910 -41147 -54020 -191017 -78184 -48253 -202422 -148614 234120 75693
21566 52418 49014 -48571 -59885 21966 -210569 -165391 27542 -85613 -152792 -136610 -102276 -273279
21554 -273279 -264824 -102801 -191035 -254509 -419017 -20090 54911 172998 131123 -99959 -14736
21542 -274074 153483 -170281 -435062 -43982 -77663 78410 -170482 -332190 -21238 -44084
21532 -44084 132748 -105533 -230540 -59519 169221 157677 -79734 -138431 184316 342975
21522 342975 157351 -103856 -54251 -172203 -116726 -1930 188055 -55639 -205041 -71385 -22284
21510 -122060 -113813 161553 -417107 6095 127402 127033 314312 -99875 -226270 10993 -178014
21498 165965 -124408 -120921 145957 -218507 108058 81199 -29322 314393 349783 -100092
21487 113086 57579 -108882 -10711 -21503 31729 127795 270777 -91806 72860 28847 -178433
21475 -310807 224279 102819 233322 -29427 -207769 -137517 31271 159495 134207 45880
21464 -106282 189368 159599 -71486 -309739 -260491 -80954 24095 -145135 -92654 -151118 -187008
21453 -187008 113885 -295680 79461 -170143 -226365 -20654 209145 -19418 -118827 -97226 -362587
21442 -362587 -3498 137640 -392263 -153965 -35358 265140 -93873 -15897 153647 -33394 -232831
21431 -232831 -50999 -44160 -314522 320226 258940 -164439 134332 215269 16367 31494 -137403
21419 142877 94405 -104115 -104097 66511 352198 -247954 16940 -328551 96640 268510 62750
21407 -65662 127524 193135 -32916 -47805 199203 -84418 -164077 4272 149051 -102842 49766
21395 38818 139361 -64329 57584 236641 171160 55652 -57724 91625 -233490 -182247 -362048
21384 -362048 -287366 -348678 -113782 -58432 -387688 -294810 -259822 -213041 -342308 -57024 -250414
21373 -250414 327924 115043 -264036 91431 -240827 -169232 191744 27388 -34720 102381
21362 -373192 -137845 -89525 -44386 -215723 -162939 53820 -22337 -127046 -183958 -21853 -229151
21351 -229151 149914 368339 -110843 87153 138857 201304 -91371 31160 -131855 -140476 289101
21339 -226369 -70215 72072 52627 -85982 -146388 -138312 87773 -50705 66746 139621 223270 -254376
21326 -163012 -12086 -78210 55482 -161977 -29873 74844 -175136 -196645 -423867 92007 30268
21314 56389 102738 10134 25480 -183798 -311942 68159 -45722 17342 -218022 152827 -132096
21302 -33596 165254 -171944 -230433 172945 223956 -274743 -76112 -119247 -188837 89779 -20585
21290 103098 -165726 -28003 -87498 -169775 1706 -69408 140917 -180640 -85516 -62742 -111622
21279 -111622 -81834 -59358 369025 -160532 56169 -51506 -53969 71537 63260 -206982 -211458
21268 -211458 -31278 -59468 -584346 23604 -354778 -290154 -89659 288634 -231937 -181408 101327
21256 -137607 -198708 8309 5979 -195175 122531 58147 116782 -100447 14368 -217391 -130160
21245 -130160 23274 -27065 -304592 -39711 143638 191324 170308 43266 -111702 161839 -37546
21233 -23694 34369 -296678 -201249 -504524 -87537 135024 -149431 -288486 -391672 -217621
21223 -217621 -362346 -219112 -59309 -65539 -135143 201052 -222821 210593 -35201 -261323
21213 -261323 -355936 -1629 267208 -44508 149006 -174832 -327124 36865 343447 -2021 -40373
21202 -40373 28925 158562 -479595 -147822 135699 91559 58850 -57838 -248644 -91977 -80198
21191 -80198 -369673 151404 -198278 223191 -215994 303785 -146764 -12239 314096 -26434
21180 -49117 -169104 -123560 -63419 330935 -255675 -154020 1485 43586 -402537 18683 -218185
21168 407407 85115 91160 -61941 -104566 -50139 -175214 151949 -128160 354069 -144594 216667
21156 -91836 -219681 -251811 -164279 -272975 -68235 -57939 -68894 214934 15254 35694 -87168
21144 -397926 -126460 -131394 -165142 -235041 326674 78374 -85210 61948 -243158 -255994 138781
21132 -90390 -96504 229184 -53487 -30460 -231845 271007 104338 226715 -296402 226493
21121 -132631 -114426 -385910 5215 -121392 11326 -224012 37060 -121810 -191992 -141136 120420
21109 -36850 71803 -1442 -115596 33161 -148491 -235366 -128378 202800 146796 227368 279311
21098 279311 -275899 -51661 -304212 -189359 185365 -80688 -262979 -238394 -8006 38085 -33534
21086 -80491 -138548 128213 24626 -343060 -46540 -92665 -298044 130856 -189233 -150513 235852
21074 47919 32109 -78023 -56939 118497 -79639 -421970 124086 -299554 -302068 169198 -195913
21062 -67941 -185427 -157283 43416 -37279 -133857 73238 -160416 -171662 -200452 -10315 228971
21050 -18510 -167 -181936 -232619 -253017 -146887 120048 -242887 44301 -71401 -446619 -192355
21038 51407 -184282 -364925 -101157 -90071 71496 -81600 -294754 -138378 21555 -93409 -53281
21027 -53281 -407903 -98684 125677 57761 28103 -141847 -83720 -231464 230644 -30988 -4574
21015 -195162 -36787 -303142 131667 229889 69188 -77507 -61779 -276084 -202390 -113208 -413
21003 -217946 187664 30058 110498 79077 -396381 -52956 -118355 -85586 52703 -217366 12142
20991 74552 -92361 -272270 -81711 215607 1834 -43702 134519 191039 20548 -103793 -88983
20980 -88983 -13873 59771 -32154 71009 -19271 107477 34878 -17724 -119395 -138596 -389488
20969 -389488 -148805 122798 75500 -120137 -54906 -88176 50923 -42520 -71645 -228107 -88254
20957 -212769 -66002 67838 -197924 -289505 -119352 -394597 -31134 -195351 -95662 -81006 -180002
20946 -180002 -240510 155734 -128453 -330166 -16151 52138 -143123 -105547 165001 -187607
20935 19817 202147 -98776 -355944 -17608 221648 -141336 138838 -60860 169752 75810
20924 -354936 -50553 97340 -168141 -27769 -185081 -14777 168239 90807 159615 -201510 717
20912 -98283 -253064 -263092 104356 -34332 -267656 328765 -244667 -89961 -323011 -229761
20902 -229761 58378 -150902 1765 -137125 127288 -184988 -73787 -268135 116302 -178065
20891 -138647 113702 -73324 -74396 -186304 -278534 -224623 35759 -311942 234438 -145456 109977
20879 96742 -277062 60380 -109286 -138285 177190 338536 168792 74068 -153253 308118
20868 -185404 -12130 -54832 -112382 -28682 260993 -392757 -103232 -93528 -65168 91587 -262
20856 -328374 -30372 -24985 -24976 -150222 92032 254192 -124767 276085 1315 -97524 -155846 14372
20843 -304829 -357078 -192019 -1513 -70616 -235358 105387 -76850 235995 8256 -45849 -9514
20831 75892 -200881 -140573 -154036 -11087 -85831 30498 -244861 -103661 -2608 -216098 -130712
20820 -130712 7461 -63788 58419 -144695 -110610 -117816 -170749 -73140 136485 -8837 -76024 -289919
20808 -289919 -48379 32794 178107 -69802 27012 151002 -633815 -234076 85641 -293803
20797 28378 -281553 170943 36166 -113116 61477 193847 -80067 663 -93184 -112748 -217492
20786 -217492 -224369 -70929 45485 -208456 299362 -173001 -26140 22575 -65214 -323536 -38357
20774 -49896 124440 -137991 -258726 -60632 -273123 282861 -350815 -44831 18420 -66436
20763 -335303 -33677 -64179 -12217 -161608 89001 -129267 -254682 -537841 25831 -109984
20752 196187 -433922 -94846 -67395 -350592 -241799 94865 -131796 147286 86186 -51620
20741 -174870 -172908 119094 -56776 -173079 -43910 206707 -323138 -60511 -122588 -39376 165513
20729 94226 -139844 106967 105159 -73071 -36552 -27577 -228493 -67834 -9024 207298 -52780
20717 38838 -449307 178876 103881 -182245 25671 -48086 230108 -132877 -202095 -73265 209560
20705 -93426 -8585 -75128 -3211 55790 -101012 -71161 76452 157154 -288450 68383 -9325 -202635
20693 -202635 257698 -190809 -138268 -164275 67060 -122328 -74037 -397321 -132026 154506
20682 -133294 -404465 -174302 -109732 -137064 32322 1411 176234 -65308 65611 23389 39368
20671 39368 232791 -101062 -355 -501358 -177865 -185928 -47108 -84489 11207 155184 -205116
20659 166580 -216215 -249488 -90312 -203779 -273867 29654 -285005 -124511 -441092 115077
20648 -93087 -116979 -301336 303632 213146 45678 -135760 -268366 -315458 108174 -222893
20637 -19144 24976 207632 112846 -38707 54014 -73652 13544 -21720 116696 38177 23316
20626 23316 -107620 -16331 270107 -85842 -138321 373516 -311447 -23690 -221229 45497 330247
20615 330247 -25874 128195 -57903 -273797 -105680 -243541 264914 249979 -127322 -178575
20605 -178575 130816 112099 196113 -99835 116351 -134886 12631 -66381 -139834 315271 -117910
20593 -395490 -298886 -59330 -136536 22704 -12551 -56782 -314648 111911 118332 -43041 -221893
20582 -221893 -15502 73133 -128524 -153687 164099 -360879 -111443 254390 -22655 -96805
20572 -96805 103937 -285246 70810 -75897 -88602 -48486 5630 207153 -358048 15658 -135922
20560 -76822 178595 -429161 -270989 -127204 196581 -39604 -61113 -1104 156854 33942 112867
20549 112867 -274822 -310145 90950 -271683 -368479 -102216 -121018 2458 -135280 -167143 -114883
20538 -114883 128305 21421 -112571 -16947 -166117 -244830 119036 -53525 71549 -180231
20527 -151501 74126 -355819 -423571 231631 36231 206871 8385 -44988 -287471 -246706 290352
20515 -119386 -194937 -59921 181466 104180 25024 177650 -413490 -89099 62664 -77919 -260272
20504 -260272 199669 75870 -10075 70909 140545 -368778 -116063 -12398 -240655 -144261 -246460
20493 -246460 -429677 -38991 178605 92684 130660 -385433 -148933 38026 -291819 -165075
20483 -165075 -85179 -202179 -73257 66808 -132790 -362910 -87234 -113780 -302096 -125526
20472 78515 -171297 267844 80632 -223662 -116249 -300846 -148878 112552 -67031 -125241
20462 -125241 -542995 17766 -291670 -350658 -285602 92168 190383 -185813 -97013 -23647 393914
20450 -158352 -24786 -64331 -276329 79941 116879 -68479 -182189 -62348 -470673 -273179 23826
20438 100007 79582 47351 -149962 -26642 -284967 -171338 -46877 -39150 126349 -16107 -43478
20427 -43478 138070 277959 -30627 8005 -108546 -124111 45533 -357636 -170057 17103 267678
20416 267678 -68177 -38597 20349 -73698 -286710 -79026 -122516 -353798 -411783 410082 -139623
20404 231472 -293230 -245003 -30822 17054 217084 -109964 124819 -308774 -75982 -204332
20394 -204332 134585 55466 -89914 -172147 269361 -75647 182887 -230550 14258 38755 237946
20383 237946 -56069 -118628 -95217 50463 241770 105544 -93615 135823 385848 280180
20373 280180 -25476 -30749 300106 78671 -198022 -375866 -112816 -203691 -76030 2868 -101731
20361 165089 -416013 -322493 262189 -24884 -99780 168736 34593 -277169 40076 109484 297795
20350 297795 67090 -380182 -190156 164879 -167701 -15566 88199 -385541 -116284 356855
20339 18022 -184508 -169891 -277537 208004 -223541 -205921 -241987 -134571 -210817 -104707
20328 -268268 38261 -16988 386014 -107593 -218895 169429 166397 -207456 62949 -234602
20317 122860 -251737 50543 62173 -294495 48610 -236937 285064 -205838 46921 -46951
20306 -72250 -485640 -619852 48880 -2315 -190320 93055 -104028 -77055 35514 94243 5491
20294 -66839 96433 328622 -532889 -79422 107479 -324729 -94409 -173748 125175 -220340
20283 -134874 120152 27212 16710 -44725 187338 23502 65389 -336279 -219411 -122533 -48401
20271 211635 -60955 -268690 -54975 29221 -36569 -240019 51445 -171808 -77108 83515 -195950
20259 -68953 -474018 -353731 -63325 19532 -89971 -6494 76988 -111687 192570 94766 -183890
20247 -113052 93273 128466 -130312 22222 202066 73078 107356 -152187 -184923 -231582 -56610
20235 -99524 -301589 72592 -208471 -63748 -2188 343444 -85406 -227661 -501403 -310872 -301015
20224 -301015 83667 85192 -103149 -128414 -182845 135997 145343 -84595 56305 16369 -138874
20212 -168478 -227850 -255805 13065 -113446 50618 -67490 -227305 96085 -240638 198391 124590
20201 124590 164082 -288865 65464 140882 -83032 27864 177313 64520 -78523 -169493 150588
20189 85317 -64620 148663 1905 -187806 -139176 -36703 -16571 126086 116939 -181869 -273121
20178 -273121 -90000 -61797 138891 -560092 168865 -213740 -32171 -367701 -383402 -282183
20168 -282183 -49470 61585 -217970 -303225 -462599 2113 -258508 -163901 -129819 -278468 -90210
20156 24041 210555 -107994 36112 -20329 321637 -25262 -86455 -72195 -319629 60372 216088
20145 216088 147017 -572626 -304517 -95650 36214 -35101 -78969 -23016 129763 48058 -189726
20133 351932 -146966 -76785 -193706 30931 217046 -72131 -44926 24103 38293 -94051 19088
20121 -190968 -237779 253555 -120865 -259439 106123 134719 52749 -28209 -215345 276727
20110 -306038 -156025 146225 -106263 2811 229350 65824 98773 120887 117871 -31610 -189948
20099 -189948 -307736 68901 -204065 89172 214195 -61843 151373 139336 57583 8094 -109897
20087 -24357 -269393 -139867 -96368 -41631 257378 -392851 -98621 152949 -186297 9594 -359323
20075 88024 -172365 -173813 62327 151492 89339 7372 64076 -197672 -264946 -72005 -266012
20064 -266012 -111268 -165396 86325 -44877 -254100 69882 -175350 -132350 15200 -60688 -106510
20053 -106510 128595 -100223 405451 -149407 -222572 -200017 -134116 -232447 56687 -9807 36664
20041 -363699 -72485 7034 -153618 256040 62642 -224549 -270530 190718 -245533 361336
20030 241494 -9112 225587 -218986 -289493 177124 38614 15880 -77643 -35701 -60726 -67800
20019 -67800 -245651 182829 -96078 98668 -155308 -75499 260420 159490 272463 69648
20008 -84486 141106 -7479 468315 125939 -105184 -215204 -109283 -173556 82629 57950 -86015
19996 -36288 -35751 32389 -210094 -126304 124034 11230 -232098 176105 198422 -24530 -302815
19985 -302815 -86326 90016 170505 -44061 298181 -279038 -153897 -269297 -165552 -14741
19974 -401044 -209420 -122532 -73607 40711 64914 85844 221923 -88811 -80618 -206379 -183259
19963 -183259 -339570 178593 -345400 67120 321000 -27286 -57527 -211034 214977 -49356
19952 -49012 49034 -182096 -151294 -26925 -194989 -99134 200121 -95596 -247527 -212365 460081
19940 147316 92712 214786 -41802 184237 -410554 -403288 -564186 -156991 8661 -227837 -127816
19929 -127816 -200785 -80975 -120551 -24154 191231 349497 -305280 61117 97113 -321740 87654
19917 -204077 18454 29997 114488 -1082 116307 91159 -344747 58807 110634 83678 -2666
19905 -117833 -349384 82797 -98006 -104120 -27699 -267659 -266919 244143 -103736 77994 -57370
19893 91885 -123155 -35916 -8816 -151407 101706 -94839 -110753 -269779 -109947 130680 -187367
19881 -29796 -120913 47094 203046 -18386 -145397 -179115 -117651 -110716 -215752 213568 16680
19869 44086 -202805 -207503 6228 179754 140962 -124124 -167372 134749 -20930 299124 295458
19858 295458 -1952 98095 -189536 91341 -294145 26652 344303 112982 7466 127231 -211248
19846 127063 63451 -186349 -261092 -191250 -460483 -87586 -109487 -257006 35502 57227 -199225
19834 -326640 -348313 -52520 -157425 213690 -265234 -188636 -109730 189798 -178909 71670
19823 90305 67525 -196775 280195 -401096 -168578 -99481 -51411 -258738 173080 183902
19813 183902 -285859 -185252 -153711 -198333 -56595 21333 -239825 -181244 -425513 -234334
19803 -234334 -30280 -157129 128130 65935 -123531 -253812 -40735 -298731 -114679 -178190
19793 -178190 -67327 -329997 -109175 -122063 -105639 105327 -37844 -378665 -262887 -157135
19783 -157135 10713 -271977 113154 -54161 56003 -37762 -385717 80714 -167159 -63725 -13929
19771 -126356 -73032 50970 -17828 -73631 -255466 -105924 -61768 -62874 -40034 -269409 64086
19759 -88350 -269660 153519 -290348 -40126 -108065 -78743 73880 -353683 -69065 -12525 -200842
19748 -200842 -278606 37331 -111836 -2879 -287752 -146855 -26600 -78786 -19810 155853 31418
19736 -163589 -151200 -107422 230011 61667 -50814 -63086 -85737 123978 -114799 -202587 5425
19724 -261866 56026 -42292 -216716 75268 -380384 -166484 177832 99975 -34642 274991
19713 -154482 -89601 -77825 -306555 -232766 -269369 38329 -199117 1377 162858 9795 -452900
19701 -12596 -74566 -259829 19277 -80098 135865 -250613 -87266 84083 -31398 -42723 -86904
19690 -86904 88962 -29874 -213301 -31558 27762 -60690 -68345 15922 -148448 -87835 67723
19678 73551 -473215 146983 158272 -115483 -43099 -210540 -99957 69292 -169676 -29229 -35647
19667 -35647 -140711 -215495 55453 -134261 261136 56775 -359997 -138855 -41823 -170618
19657 -170618 218266 -122056 -229017 -91049 -268479 -17445 16943 -64801 56921 95370 256312
19646 256312 -143337 -196350 25161 -251430 16894 8846 212774 -55430 -106912 30714 48607
19635 48607 241402 -163080 -279947 -212964 -56338 -141407 -98399 26472 -234932 86379 -281861
19623 70762 134822 -8449 -264363 265390 -282840 -231088 -231628 -140434 -155377 -207274 12104 -42261
19610 -186479 -95567 -265896 -280098 153554 -280248 -3349 -160715 -159924 -75193 -291808 102227
19598 116078 253741 -168324 -284052 -399998 -9448 -368321 103188 3120 69705 -116920
19587 87629 -5039 -161354 -192334 -260549 -119427 -255276 20558 200155 42010 -63215 -182118
19576 -182118 -259474 -179759 -120786 -159411 265464 -70206 -25443 -199172 -323545 153090 155778
19565 155778 -114999 -182782 14153 -299005 218949 55135 200201 34531 -195603 54546
19554 217281 -326 46995 -86211 -127658 -171930 -63634 77445 82277 -357607 33446 106399 -127022
19541 -212000 -59077 107563 -243201 -88211 99749 -70259 88418 -179722 150036 -441541
19530 108329 255831 -190900 337075 -49330 -161532 -45311 -205917 -68008 156410 628 210511
19519 210511 -166530 -36891 166291 -35223 -140728 -378603 -16476 -75248 188824 345442
19509 345442 108989 -95379 -17553 -186669 -152125 1225 71326 165535 -27095 43098 -51585
19497 124402 -323465 -53250 145075 250101 -40524 44967 115275 -60894 -47435 21228 -156517
19485 64960 15226 70240 -320791 -147747 -414773 73588 32343 -322658 -193838 -1598 175985
19473 -48709 -160898 -78407 -98705 -265102 -94234 19636 88171 193079 109408 -296096 -121946
19461 -32374 -157228 -90042 -137618 -259227 -195376 -51110 -17488 -282073 137897 -106480 -188171
19450 -188171 133855 -23348 -182042 12566 -259445 -215427 -24346 -112927 2734 -288672 -127443
19438 193581 -44830 47121 47207 7547 72246 -250997 51399 -36835 -157481 -41802 -319189 -388673
19426 -388673 55730 -237454 -47038 -295855 -59675 -369415 23283 -47896 -222214 278612
19415 48291 -98714 -110195 -34280 -171830 -169956 -121646 -148359 -44335 48695 -16666 -367584
19404 -367584 -4800 -10060 86367 31455 -93523 -353938 -600691 52727 -193034 -162181 -181658
19393 -181658 210116 150448 -221397 -413683 -8675 92299 -50942 -203557 -76146 -242306 -184980
19382 -184980 188021 -107136 68565 -196107 -133685 -20519 -101109 97598 -110073 -296310
19372 -296310 126321 -239036 -43311 52392 -115214 -19682 -186076 273571 -314213 31779
19361 306172 -158339 -102362 -41512 -122940 -216139 -124314 -132636 -22985 92016 78585 -208540
19349 17637 -30833 -214143 186992 -155396 165048 -341428 -26211 79213 -206841 -103144
19338 -76898 -196844 140921 -174241 141329 -134743 -110976 -111855 -31216 -204003 -421620 286903
19326 -403878 271692 -121823 -195637 -76770 -165721 -188846 3609 -316651 -133084 -247583 210593
19314 -9368 -264276 -8521 -156515 246653 150515 -61291 220420 -199106 -140186 238732 -379470
19302 -68664 -115433 150635 162575 -80051 -184100 35552 -28372 -380965 75028 4127 -63401
19290 160449 -192687 -40951 92474 -78768 -93252 -41757 -161627 123407 -313891 51079 -221144
19278 -168039 -125352 137003 -401214 -94020 252811 -261260 76209 -335843 -285456 -1858 228905
19266 160317 -323157 -50791 3 61349 32379 -318440 -113278 164005 -245667 67780 -89186
19254 -275142 -357185 9389 86267 -63780 -716 23497 -400528 21270 27030 147467 -187567 61138
19241 -436710 123279 -207574 45315 -245016 -99898 78974 123037 -47094 -35044 1667 116571
19230 116571 90908 140573 -298611 -100169 -31842 -423422 206173 -87509 -330927 -283948
19220 -283948 36903 204232 -339401 130695 -116134 -94125 -195786 238013 -99090 31061
19209 -108840 -256905 -423247 -187714 179532 38351 -139093 18525 -155559 -64473 177773
19198 166340 -158436 -248973 -169375 172404 -65000 107260 122251 202518 -17669 -90178 -342216
19187 -342216 22081 -120075 -259816 -135853 -10973 140687 -193831 39917 -166735 -79139
19176 163999 139572 -242783 -527993 -280894 -236435 -148647 -44650 -20030 96668 71421 26135
19164 -261910 -246598 -49173 -201687 -218595 -136828 63652 -67460 -230314 360455 91665 -65392
19152 -304798 116623 65879 -210128 -61547 38706 -1757 -203410 -271947 97390 -53636 68324
19140 -99341 -100914 -454948 202601 252777 136869 -168168 -211431 -93221 62598 -146640 -317027
19129 -317027 205 -166562 97643 -242846 91831 130595 236195 -138930 47068 -32176 -68780
19118 -68780 -68744 -69170 110599 -12292 242318 -38879 35809 266097 120875 -120881 75583 -300087
19105 -124725 -60007 78846 -233103 -177751 -196525 -36350 -147271 45202 -155658 -215333 -299885
19094 -299885 -25237 48673 -231826 -444653 -107457 205548 -343217 68795 81772 110315
19084 110315 191460 -69348 411475 -165482 -409500 -585367 -231432 -268468 -127966 -329050
19074 -329050 -393113 -45765 362554 48784 107568 -13240 -243458 61174 -149878 147859 171842
19063 171842 -170197 50291 -208925 73014 -247641 98015 67643 80852 3232 -256250 -266926
19052 -266926 48355 -183439 -346128 -66593 232817 -213411 -332935 -54575 10770 163973
19042 163973 120856 163441 47938 -93576 -151309 37236 -319122 159733 -77916 -160915 28103
19030 -203377 -30366 157969 -16863 248370 24229 -131743 -93383 -149297 -304304 -113064
19019 -235049 223249 137144 -220556 -360964 -252221 -268740 -212933 144634 -110006 -498374
19009 -498374 57916 78021 239471 -163913 -454595 74785 -214421 -41208 -23559 29243 -5970
18997 -177283 -250682 -79093 -123217 -403360 -251954 78264 19257 136452 -30342 236462 -118702
18985 -69005 174340 -77859 200971 27070 -315420 -143496 -106185 106304 76718 238219
18975 238219 -4314 7251 -75397 -374291 -17645 -186683 142887 -246779 -266455 -157919 -40890
18963 243420 -40286 218961 -243893 56742 -244424 75131 302842 -141830 -475967 -32322
18952 -39162 118143 305373 -666442 100719 153652 -219355 -60805 109922 -1787 -307239
18942 -307239 102043 30236 134209 -412491 -141841 -338323 -280184 114002 12946 -176355
18931 135162 29911 -283578 -66321 -102351 -72450 -129754 107962 -278903 -199661 -192904 -7233
18919 310404 40046 340967 221730 231766 -216113 -224582 -12073 -119541 -149807 178795 -168621
18907 -417855 -116121 202900 -295961 104651 29840 -306117 86359 -87107 -66895 -109600
18897 -109600 -470236 -49752 -21961 107800 81238 79962 -33037 54754 -158009 -128715 -110860
18886 -110860 157233 -342612 -112113 165639 -149955 -111368 -195330 -288213 -130530 -66482
18876 -66482 157473 138539 3631 -75074 -117566 104346 -185042 -283141 197960 -155053 -411661
18865 -411661 188367 -76373 -161563 -163047 189162 -287139 -190109 -149752 -229048 -216694 -365654
18854 -365654 -366316 327446 26481 -204550 68209 -178268 -243272 -190924 120271 -124060 271668
18842 -132474 -30642 13839 186334 1234 273793 25085 74368 -327917 89131 -100468 -220844
18831 -220844 106037 525 -45033 60089 -169292 -317086 223909 -121098 -56946 -98081 -61986
18820 -61986 -370655 69941 -166961 190022 -106697 -204813 -9394 -61795 25054 42336 36893
18809 36893 11640 -314952 -224752 -89949 206413 204695 76608 -365861 -75742 76940 114399
18798 114399 -281559 78397 196883 -229170 292060 131125 -29997 -330921 -109205 63105
18787 -28900 -334963 -263685 123517 25211 -74977 -51311 -356313 -60583 66734 194640 343493
18776 343493 -245484 96416 -143836 -202885 -188200 -195078 3095 -10601 -248146 -147087 -35050
18764 -432815 26971 -492299 -251772 -3567 -163384 -50475 -328728 -73490 89802 244009 22002
18752 -108440 -174422 115322 126180 18768 40758 102949 -260529 -111236 213911 175781 -265659
18740 111063 -18707 -126799 -23436 -129686 -241648 -156315 -146660 -166679 235608 -120307 17793
18728 78259 -72161 480131 278000 191108 -309356 -190220 -46942 12591 252072 348106 -118664
18716 19994 -677952 198395 -265117 -87702 -331100 110495 -58291 -80607 140659 -51690
18705 132905 -73249 -60194 -71165 -72273 -263479 -50671 94982 -165354 -433395 65874 -72076
18693 -75769 -101361 129618 -292727 -311467 -294739 101016 -227493 -155117 -71782 33854 86435
18682 86435 126549 55553 140115 -24846 -152738 183283 178795 29088 -23236 81028 -31993
18670 -71275 -236224 -215813 -297192 -299430 -153212 -71417 -200593 -144070 112871 105042 -184316
18658 -109279 -52823 -104442 181281 26123 69056 -295204 -125965 -102796 -151814 -300665 -41449
18646 -65591 60358 112538 156001 -17809 -52241 52652 -105364 -343939 -286167 -218526 -114760
18635 -114760 125999 -166279 -135086 -329547 184072 -234877 -96699 133115 -269477 -211444
18625 -211444 -257121 34599 -18285 253124 65926 160931 -86939 46749 -212386 14105 -247094
18613 99977 138683 -8719 -217049 240399 124720 -323846 -30222 -84717 131683 -177154 -80725
18601 -52816 -34787 -235372 -9208 -12954 -313975 249155 44794 -52855 93579 -54138 11537
18589 -335310 -79658 -142479 149726 -52015 146524 -184093 -191089 25376 -88171 136856 336481
18578 336481 -64591 38820 -233352 -11293 -217249 -109710 -265957 160181 -15562 14809
18567 53 -187678 -70718 -162921 84802 -269212 182501 -238847 222636 -160041 329066 -4314
18555 132470 -61265 26355 -102453 -231857 -222418 -100502 -4699 147202 -78314 -99563 -2424
18543 -121846 -10526 78938 929 -138657 -182114 -1307 -77200 -267631 -351111 9667 -199913 -120542
18531 -120542 -138974 -133452 -73362 -38957 -15978 -53097 40126 249221 -333344 -132858 -46056
18519 29785 51250 -34291 -62116 -2084 -55664 63329 57234 -98257 -316144 -145022 182998
18507 -126713 -350805 -12530 -113607 198456 74949 -14852 -264601 -114764 -297490 21854
18496 -7858 -208957 -296330 -328718 -50173 -174149 159259 115371 70813 153269 180108 113282
18485 113282 -98768 -221073 121194 102990 -163529 70668 140389 -95911 -120345 -243964 74604
18473 -209729 70447 51926 -244648 -238580 55967 -258955 19812 -210572 168052 215557 209378
18462 209378 107357 -96084 -78224 -21868 -5387 -41315 -13691 -222741 -67059 -114986 -106770
18451 -106770 -155659 -288453 69972 -269982 -84343 -280280 -185354 368737 68938 12519 -49483
18439 108298 28083 -149853 -39387 216140 -111813 -370920 -279822 -81056 -175912 81734 17544
18427 17874 43682 347427 -74635 -171299 -284496 24535 32462 -364550 -331515 -196676 27799
18415 -133432 260635 -141723 47448 -51030 -133144 287170 161618 -13059 67794 -276288
18404 176630 -72266 -48373 -152615 -160343 -328436 36627 35955 -67156 154096 2026 -109895
18392 79581 -133197 -247658 -155015 -66591 -159354 56070 -216413 -147375 53237 -109228 21706
18380 231095 129 -87329 -102898 -28397 -102380 38381 -286006 67737 -361850 83062 88902 -232221
18367 199302 61086 -52457 99040 76812 -163940 -113854 -156312 43004 26552 -137261 -43185
18355 2135 122949 -97136 -89278 -299136 -52912 309473 106105 -155741 -373269 -350756 -105345
18343 -168954 -132585 -35822 42462 231750 277574 261614 -296176 -234955 -89989 -21913 14168
18331 182880 -126406 -139893 -60960 -137054 317347 194232 -308903 -15708 65686 -103864
18320 31825 36208 -179070 -199458 80749 -380197 -152130 -86374 -44883 -66394 18926 -91356
18308 -46775 -345169 -158565 202105 174013 -57396 611 -84662 -115218 -66385 170105 -124346
18296 -167439 237064 -247715 -181122 -399740 -122108 -160716 -153212 -195201 147774 -271313
18285 213837 44910 -108993 -193062 -375446 -208259 49600 -21417 2328 -113093 -268087 -315631
18274 -315631 -99291 -61261 -94727 219954 152308 9168 -1222 -2094 43640 -313694 16559 -49826
18261 -60769 -19003 77022 184097 38247 -87686 -8748 -197749 250660 -99112 -124680 83712
18249 118132 112243 198856 -156998 296515 -153537 -94952 292929 -170921 296506 137647
18238 25818 55559 -53594 -77597 -181679 -106699 -173122 -122275 -322685 25111 -281938 -277318
18227 -277318 179500 -91595 -63441 -102745 -60730 -164489 4687 76402 -50997 118581 -354203
18215 90305 -7590 -618505 104777 -83614 -185766 -181982 218068 -176827 22620 -31339 197795
18203 -42882 209337 -65176 -368674 -140538 9886 -215937 118855 -122474 8917 -144810 -48189
18191 -352915 -367094 18406 -179041 44446 -51915 124589 -19025 -150183 -175817 -83192 377067
18179 299544 -103860 -190449 9455 58172 -18647 -251531 27952 76820 179996 -40679 65534
18167 -222188 -140331 -24187 27513 -170021 -11292 127652 -263909 -154039 -287634 -56988
18156 -194631 111988 -371593 -382183 -55009 -262356 -202014 275160 -255811 -52852 -164055
18146 -164055 126133 174073 3004 21712 258651 -49436 -75470 238369 202 -76524 236530
18134 -267359 -391085 -63499 -183523 67317 -22575 185935 72977 -66241 -480507 33281 345038
18123 345038 -148201 -158333 -183898 195474 -38004 88685 254043 51632 128803 91028 -479173
18111 261121 -143811 57200 -166951 -26097 99817 -100890 154161 86720 115551 30743 -427180
18099 131096 -116406 -72634 -282649 369952 -165642 160239 140405 -158655 -22033 -264664
18089 -264664 168258 -51831 119092 -103196 3474 -292600 -36798 -170594 74136 -470862
18078 -470179 111370 -48458 147277 -12228 -405618 -117516 -133463 -41156 -65670 167185
18067 155787 176733 -92550 108695 108667 87261 -39529 85594 219731 225116 123340 37024 -184585
18054 -47978 321131 -268302 -81928 -34066 -35640 303721 166732 169340 64340 -445513 -11134
18042 -140757 -297954 -101742 -79331 98519 84319 82942 226688 -308655 156172 -104402
18031 -14985 -49531 27005 149102 89037 -49723 -190311 -42104 -63538 165260 -240267 31146
18019 -538353 282138 436609 -204668 139349 -186022 150821 340484 24156 -88367 -4380
18008 -24947 -268226 -20863 341131 -301694 -156350 12965 29684 -427 -22800 83204 -134143
17996 27752 -35412 -117739 -219011 59978 -245079 -265698 158403 -310974 35141 64673 -3097
17984 -134133 -42327 209170 27769 -218827 94490 59227 51388 -16966 47017 129292 236609
17973 236609 -109560 -195133 -34455 -331595 -266198 -116723 160387 77917 -105626 -470861
17963 -470861 13027 -131466 -347724 48565 -356393 -31346 -337582 10039 245927 -219822
17952 -44191 -7834 -269940 -296385 138321 -207841 193021 68915 -195356 355515 5310 -130855
17940 -239045 88771 -204794 -26201 20887 16279 71548 -417470 -5746 -56926 79709 -353719
17928 -169200 236819 135036 -53913 134689 232578 250450 -81124 -22579 166864 -17699 -31405
17917 -31405 237190 -199341 239913 30115 13711 233644 -281312 135357 -235842 -28278
17906 -36323 247625 70574 -89563 33154 47315 -204522 86382 -55334 -119052 -23535 -123113
17895 -123113 370384 148350 45495 256258 33046 -237151 54545 -201870 -72319 96689
17884 202903 127828 -53773 28915 -25195 -81966 -189941 -89945 -87244 -141869 -29863 48026
17872 209972 58307 46538 -211850 -35531 -267815 -63184 220491 136555 -202861 -96972 -37555
17860 76642 -159358 -359284 -382022 289251 136833 -25789 10128 9949 223454 -300020 133940
17848 45125 -67469 -65966 560177 18934 -64542 272006 -30970 -31940 -166457 314403 194378
17837 194378 -353165 -225458 35135 -241987 -140502 405230 272899 233438 314933 -21117
17826 27173 79648 -78825 -24268 -300236 -175879 39067 23106 128121 119100 -94090 165557
17814 -78999 48026 -283014 132586 37500 221872 -11346 523 -310003 853 -42583 -328546
17803 -328546 -114768 -73295 129367 -206897 72841 -15102 -320005 92321 30309 -7565 -117768
17792 -117768 142418 -14029 -1375 142047 -229748 159825 301167 12375 252947 252299 177048
17781 177048 60211 876 -27541 -44400 -80287 178590 -207664 -70260 11135 135180 -132146
17769 345190 39898 -144788 150682 -92947 -8764 -124774 -152831 210327 -55222 52135 40851
17758 40851 -29178 3637 -4354 16361 256413 208785 -274215 81942 -72740 37737 -65662 233105
17745 59682 -135983 -90719 -200214 -283279 -289847 -70860 147332 -69890 -284963 -112553 23869
17733 58562 72097 -219171 -50463 239087 -66754 216726 -115881 -254248 87655 82825 161236
17722 161236 245114 88716 -392267 9128 303450 -40839 135407 59247 -213990 -2815 -478481
17711 -478481 76578 1638 -50332 178959 -120311 335934 55364 109161 137134 164364 -221372
17699 13646 -110929 376424 338351 66250 73967 -102111 -96668 -280204 5148 -357646 36600
17687 -11727 -10518 186679 -144634 -175041 94398 -21326 193411 33612 114545 63148 -68889
17675 -70880 374426 -35586 -25035 35442 179140 226837 -209901 393680 -54084 188596 -70931
17663 -74185 -151457 84950 -52973 -146599 21100 191524 -127763 39374 -10177 -11603 -2624 72204
17650 50994 -187495 1036 -182502 107632 -300617 -101110 297672 -290537 68537 -68920
17639 -34134 61315 58551 -20017 74319 -3058 -26670 -184802 82066 -419450 201653 189864
17628 189864 -76174 -193265 395555 33431 -27918 43083 -308917 246697 128275 59374
17617 -222868 267067 192085 -183910 176382 58394 -358064 -140403 113773 -164410 146374
17606 16984 245437 3415 -2538 180950 317735 -144534 156403 235013 167068 128235 -261151
17594 247569 -269880 54602 -104827 4430 41350 -2272 -31179 -18402 -101770 121139 -9363
17582 118915 161036 29130 -219534 -266862 -197434 -128901 -330026 -8071 173266 157010 292966
17571 292966 65757 64093 178345 185622 -11002 207520 313746 88927 -182303 216000 -280242
17559 203319 115981 91155 -133126 142604 -102597 255570 80980 32194 142108 17971
17548 211732 377638 -130506 64374 -62112 -180673 88112 -23170 204493 192140 65005 373081
17537 373081 152301 255168 270780 46609 292477 226294 51658 -44971 -39446 100550 -241286
17525 -78756 88341 -29639 133593 32499 80106 233548 -21848 273457 -52842 121890 446068
17514 446068 66896 53914 17527 97752 206508 400856 42645 -31021 348663 81383 -43321
17502 -180426 132118 87708 291631 116824 -213944 197777 37047 -2061 336330 124905
17491 193006 -87717 373727 149496 21805 327941 161316 151462 234259 -54784 234613 -148904
17479 74104 -101657 270346 266580 254761 -118863 191804 353878 231877 -28890 196125
17468 157966 361150 192058 120104 50063 238340 171727 477432 168514 77806 146328
17458 146328 -94533 -71711 -28986 11619 43089 162223 131840 -2946 -131704 315935 189514
17447 189514 83383 225093 328614 -39142 26315 533769 -184143 255589 159368 -33035
17436 288076 115984 165078 498743 384206 246261 90170 128635 214758 192372 111349 73803
17425 73803 88856 111009 155894 -25170 22807 126860 522835 415551 106087 8231 150283
17414 150283 -30692 352572 31618 255070 240878 267851 -50542 165701 651830 87707 200186
17403 200186 247729 297455 186332 305348 277719 387089 269066 262416 107991 163960 303330
17392 303330 153144 129618 91902 481607 353605 -61739 193833 6404 188612 98250 385386
17381 385386 467345 221632 404007 68198 381198 163082 105696 351426 508376 258449
17371 258449 464619 476087 497304 20903 189487 119343 295248 574878 -77440 -63973 86374
17359 -47965 270736 153526 394354 -177949 -39051 265150 418908 150097 143057 183556
17349 183556 416500 34318 393873 89664 185044 204516 159484 305815 285645 -35819 465667
17337 366356 68778 160285 373954 389638 112849 224302 92277 314472 257224 252480 219782
17326 219782 280450 317460 28361 193955 -92196 103711 226597 328851 193611 514769
17316 514769 -33192 359018 51548 292682 10583 223168 -166435 358455 103164 107459
17306 107459 188908 11715 17988 104370 333863 532046 27885 385414 161744 466947 380837
17295 380837 249784 293408 123152 286186 119689 32616 293897 327106 254191 83326
17284 338310 197637 247916 578427 347034 343808 208811 -96993 444635 428673 200486
17273 233050 136041 444834 222604 350849 193971 91189 445667 455121 512194 323572
17263 323572 461352 396244 -59352 130179 232320 169514 -123577 385923 336291 420188
17253 420188 123565 -200793 268204 195953 115979 200459 408926 229587 214046 639846
17243 639846 465610 271692 379363 78129 108164 280522 249021 197610 461350 582042
17233 582042 86841 227972 145902 235640 47068 248977 209985 279455 75108 369561 408590
17222 408590 265616 352889 -20695 358543 374088 432045 267703 286908 239388 378819 406584
17211 406584 267293 497077 17334 374482 525155 388794 511853 144676 56154 397778
17201 397778 162032 386631 683256 171098 402335 621143 267328 344966 100388 193130
17191 193130 351099 390642 390693 491538 35793 425043 309017 183825 506993 -55383 350681
17179 293470 265951 365327 208261 452759 622160 253777 387672 406190 336910 746978
17169 746978 686361 265273 423569 160268 337382 381100 589479 218586 430049 52464
17158 396786 426051 480588 623748 547243 174400 472476 256243 425355 657322 696510
17148 696510 140399 603321 272170 851417 597848 209854 -4767 522107 496704 515221
17138 515221 417623 124597 578637 485195 453174 523285 557973 371570 265814 436082
17128 436082 303914 560811 799741 558646 344776 430561 607117 634786 379362 446069
17118 446069 341828 741007 235499 601279 538238 672336 509026 562012 578789 507980
17108 507980 684120 378947 567853 457473 556003 914044 744182 659938 628437 473713
17098 473713 382638 373992 650347 763077 541244 636935 632026 724157 854771 519856 660440
17087 660440 591515 572000 649551 495795 617498 202400 551528 593360 473035 596940
17077 596940 747446 718908 756576 307310 729060 942928 729577 861471 1087903 815596
17067 815596 589170 820004 927849 642913 521987 632080 755956 715352 729660 793611
17057 793611 1055505 747227 865529 718291 744286 686697 907826 432229 628504 1028028
17047 1028028 709784 933270 625419 806169 877818 1058499 1294163 554508 753522 1166051
17037 1166051 1061154 777470 843484 969466 707187 723227 965165 1349390 850223 949251
17027 949251 1019322 1087979 991120 807461 870747 644417 1005612 971925 1116876 927074
17017 927074 994358 1000398 1076121 903569 1062358 1020880 1393767 979985 1079486 1284535 1206970
17006 1206970 998307 1014253 1261561 1317814 988932 963435 1099021 1332277 1423076 1094829
16996 1094829 1180174 1135637 910462 1008325 981139 1322678 1199220 1660749 1406547 1050870
16986 1050870 1314061 1363442 922532 1400265 1286573 1351752 1381963 1150481 1351577 1348145
16976 1348145 1498942 1357583 1450447 1392882 1343802 1276631 1317917 1616616 1527344 1505992 1241865
16965 1241865 1610596 1487337 1725146 1454070 1519111 1409973 1503659 1498799 1449822 1660133
16955 1660133 1579753 1178390 1799867 1913871 1898891 1612146 1408724 1807187 1719028 1789503
16945 1789503 1548406 2036673 1850999 1565363 2047819 1912963 1912951 1776162 2192586 1603567
16935 1603567 1632673 1810615 2135164 2102523 1870475 1916997 1964333 2269435 1970325 2081133
16925 2081133 2006218 2214728 1953262 1783839 2016053 2173934 2493822 2283953 2248133 2230273
16915 2230273 2015582 2422004 2392864 2501530 2455482 2317316 2296783 2828219 2163686 2579502
16905 2579502 2420576 2482195 2457944 2372788 2854151 2458942 2720814 2673868 2608944 2791417
16895 2791417 2922131 2755705 2742891 2959889 2761714 2835737 2946759 2779677 3381408 2815245
16885 2815245 2850229 2729012 3129065 3194965 3302202 2972556 3294049 3059999 3469764 3209146
16875 3209146 3282578 3411259 3325475 3826002 3329698 3217061 3273151 3546143 3394429 3677178
16865 3677178 3912927 3828289 3942424 3835830 3822967 3935834 4120092 4063533 4040852 4042913
16855 4042913 4020009 4276497 3898563 4369320 4305277 4718352 4337241 4745289 4710804 4838939
16845 4838939 4487048 4968511 5292720 4807539 4656224 5200356 5131107 5196997 5226833 5449148
16835 5449148 5173699 5546535 5381261 5396763 5623076 5607201 5912912 5769220 5974101 5932598
16825 5932598 5970955 6174598 6387306 6639713 6420901 6687137 6723898 6535018 6498196 6711735
16815 6711735 6998898 7352216 7378576 7291027 7599559 7500841 7610547 8157225 7586753 8076785
16805 8076785 8378084 8528477 8364518 8692742 8547355 9026619 8995350 8994558 9323973 9364369
16795 9364369 9807251 9634855 9902843 10233001 10486498 10341311 11027288 10622927 11189474
16786 11189474 11243573 11755141 11920577 11997038 12286851 12093855 12993000 12915877 12994027 13521011
16776 13521011 13648673 13846759 14183139 14490327 14623552 15063871 15183551 15482800 15967106
16767 15967106 16265067 16421999 17223875 17538968 17641786 18104609 18534831 18956800 19447064
16758 19447064 19686334 19642164 20529551 21147500 21524769 22092844 22702396 23193348 23841664
16749 23841664 24832217 24768119 25325280 26456986 26683914 27271021 28404655 29313770 29606283
16740 29606283 30816471 31547054 32091237 33015175 33959873 34943160 35759379 36750582 37730151
16731 37730151 39303854 40514164 41376337 42829587 44174625 45502794 46868518 47891419
16723 47891419 49796184 51145727 52835304 54712906 56019806 58272934 59916880 61905698
16715 61905698 64222103 65785437 67759767 70153929 72048329 74353929 76338038 79159043
16707 79159043 81196187 83683194 85655650 88256057 90415121 92473786 94329035 96396971
16699 96396971 98168838 100168893 101989239 103752427 105100376 106283207 107554304 108768633
16691 108768633 109177211 109881276 110280651 109942225 109530173 108893130 107884501 106718489 105473106
16682 105473106 103722478 102080847 100155844 97835952 95563069 93327175 90692875 88141316
16674 88141316 85425550 83029273 80428426 77890070 75377251 72733918 70235303 67343920
16666 67343920 64762515 62756373 60465160 58261959 55672512 53909900 52022285 49929446
16658 49929446 48503817 46778417 44745313 43255444 41780621 40341418 39013869 37514772
16650 37514772 36442020 35070962 33873319 32805994 31918256 30938090 29786476 29116750
16642 29116750 28223971 27084402 26484481 25701751 25222225 24090972 23293382 22899511 22034416
16633 22034416 21384935 20856601 20430983 19943043 19632377 18948365 18504469 18109241 17701608
16624 17701608 17025706 16566111 16058694 15860061 15597219 14987419 14780653 14549769 14048092
16615 14048092 14045122 13511802 13160847 13020007 12444392 12136748 12038599 12071368 11496987 11385859
16605 11385859 11093778 10794641 10767359 10860315 9954400 9999278 9988086 9460448 9285978 9649419
16595 9649419 9176282 9025543 8465856 8844180 8256557 8271626 8343307 7863922 7672105 7693640
16585 7693640 7551928 7635020 7153950 7093108 7361516 7320465 6790887 6937176 6904299 6628186
16575 6628186 6395444 6276284 5905656 5930385 5969232 6136915 5611938 5702276 5813195 5647390
16565 5647390 5423195 5810371 5728160 5213239 5301365 4789968 4946385 4911418 4959952 4797820
16555 4797820 4752035 4708840 4686428 4610382 4462279 4817416 4405465 4108298 4086759 4310483
16545 4310483 4216686 4115845 4320768 4127812 3894410 3852868 3534330 3649045 3740124 3745696
16535 3745696 3877869 3132655 3527521 3489370 3384976 3357264 3406293 3219881 3429350 3471053
16525 3471053 3242544 3142777 3283297 3130143 3018201 3282962 3042969 2782506 2579522 2707263
16515 2707263 2650799 3410837 2897684 2724392 2593232 2981541 2870525 2642571 2549076 2780311
16505 2780311 2841231 2609216 2382485 2412849 2588614 2452687 2255137 2545399 2429702 2342546
16495 2342546 2242462 2327349 2426226 2456719 2263775 1914850 2318106 2078768 2272129 2093312
16485 2093312 2190656 2086249 1837285 2218718 1768987 2180460 1865284 1757748 1806091 2073749
16475 2073749 2163130 1862574 1480090 1696207 1789244 2026015 1883211 2126872 1751156 1910268
16465 1910268 1811116 1692579 2033616 1705630 1732684 1475389 1655428 1466142 1442843 1583840
16455 1583840 1546151 1598462 1520882 1384496 1405725 1284208 1116304 1648992 1565741 1547266
16445 1547266 1432679 1766090 1470390 1059360 1539573 1299668 1436742 1057390 1341925
16436 1341925 1373331 1182462 1395506 1531926 1592053 976012 1193006 1502058 1298874 892626
16426 892626 1076822 1180231 1032813 1178875 1274259 1228070 1490236 878383 1099018 1333616
16416 1333616 900444 975837 1074028 1352106 1133100 1366967 873322 1060725 782781 1384885
16406 1384885 1191148 1043025 1073541 941306 983793 890127 943538 1182383 648957 718161
16396 718161 698411 810263 1078304 1277004 1178471 1199520 661656 1259272 632238 1008206
16386 1008206 989149 1337806 793137 783161 822679 872127 935399 667076 723460 887266 836107
16375 836107 803520 1064313 894110 706918 976144 586913 853217 676345 787606 669066
16365 669066 645346 686451 989601 664766 972755 679613 720936 785461 973559 627336
16355 627336 757142 632631 684123 770421 1221938 744943 613788 830387 887120 774303
16345 774303 760861 592026 652696 977563 480212 770647 658909 813347 928316 534228
16335 534228 523507 575542 633217 735123 671497 584629 449196 790958 488670 733707
16325 733707 636226 480145 662473 712984 422825 573645 742870 386758 613779 760730
16315 760730 739975 985916 663021 705525 714719 164404 526758 428871 823736 337437
16304 266276 619434 531911 498969 616537 502109 700760 438731 427264 371802 618085
16294 618085 799697 610921 560237 272921 468849 654855 344142 349749 610889 670635
16284 670635 322066 261125 736146 354577 306201 385667 491078 597514 507170 398485
16274 398485 259545 449551 385039 205422 298407 324830 471891 66872 620143 380728
16264 380728 381996 389703 662131 77431 679028 293673 580859 403419 376775 294440 223632
16253 223632 325723 315149 327353 327542 499741 321454 371206 174051 619511 235498 162480
16242 162480 519943 336967 277273 354098 361964 331004 140008 537145 147901 686724
16232 686724 274457 668911 255334 486987 489411 417521 349209 353802 498754 471939 644141
16221 644141 535061 1025486 412714 72668 22763 483216 133716 374833 144523 194659
16211 194659 336437 40655 53533 392261 453716 128512 97913 309519 404538 314326 579636
16200 579636 746283 239095 363301 480878 391176 6238 462639 724200 387288 782913
16190 782913 333318 88783 220378 327287 402892 197718 210233 85787 380364 170866
16179 117216 338343 248893 60447 228057 295904 449625 280547 175252 -62655 10910
16168 19277 466926 201055 96523 218044 171277 -126434 243953 395107 751928 296718
16157 -112348 209517 357000 38650 127829 614941 163996 159936 -26057 338452 590328
16147 590328 41698 374231 -97228 43783 197405 -95398 365652 488690 383268 53389
16136 138313 121091 144491 51987 448480 404670 219590 122686 -62011 1186 371337 153288
16124 161972 185599 409268 483873 123840 300006 223393 -29817 107487 -147187 275685
16113 238115 107182 86106 -142906 39420 -77918 64175 -29999 -114535 180143 191483 197739
16102 197739 -212066 56037 136343 44347 -148908 -133229 153233 434811 320816 207742
16092 207742 172433 180681 184517 179954 85154 -62128 13627 311275 70908 298398 386926 119695
16079 76380 51439 -200891 433410 133145 156324 165169 186476 223466 50907 371721 143053
16067 -214411 -57717 208236 38618 159464 -135232 297318 90136 575912 825 57612 380333
16056 380333 112971 66552 349625 -114031 143993 177865 83151 348509 308354 -165731
16045 153844 414214 103418 -59576 16123 61514 150015 -157178 328359 144588 93787
16035 93787 84831 -39175 56785 180168 201016 507496 412040 85708 190170 274394 91587
16023 136155 -179453 144245 218633 -40259 187799 143979 125682 38145 -58311 113370 4940
16011 102654 282685 -74865 -203516 106795 82487 -71721 319778 129574 -95730 245237
16000 -87420 289115 -175876 325384 -67922 304979 83795 78116 233138 165295 112277 246651
15989 246651 -182547 -111821 198733 207785 -211444 46183 108077 89316 213985 13205 1030
15977 323910 -22339 136684 172804 -75316 74447 221179 -129457 492742 117935 322517
15967 322517 262955 114968 103679 -32711 -207879 -31645 -39377 147697 84639 -59722 340864
15955 -211463 364209 252259 -130171 27521 58141 307549 -153804 -15674 -251468 303953
15944 23634 -58396 79340 43527 352694 156235 -97596 85223 184298 163538 -252518 280039
15932 336178 -28084 -99100 -78119 98914 -128650 182227 346662 116600 5822 277188 -16493
15920 118074 -206825 -102288 -454452 -102975 23385 240029 370388 181668 362033 96478
15909 -106944 -36401 365167 262942 294888 162949 34869 -185880 -10353 -243252 256599
15898 -10081 -245271 -131664 243228 -134308 96141 116674 52364 -32635 -17490 340569 -17194
15886 120311 -60840 -178939 -195180 -86282 -12541 136028 -76736 129365 199467 20209 -194949
15874 -27626 51684 110482 98883 46229 314831 75886 164522 -45015 -67742 149143 141821
15863 141821 -74565 -137510 118422 -180567 282217 -92114 -80354 200158 107680 192147 -152923
15851 207935 -14251 179248 -97253 155924 -100096 90588 -262054 -56225 179546 122742
15841 122742 117792 126430 49474 129670 85795 102430 -141589 -253095 -292048 98622 42440
15829 -209072 103406 270414 267644 12815 168094 -19739 -100146 -27103 217900 -377130 95065
15817 147273 -11288 -25610 232031 32525 12315 -113584 -301256 -201314 175236 -131919
15806 -220652 144638 122948 388531 -211989 69429 -116785 51335 40249 182947 3475 97620
15795 97620 -38144 264138 32050 24346 34166 150820 80280 -194868 -114145 5772 -287181
15783 1576 244420 -131858 -140533 253701 149149 -204216 -494571 -483143 296191 229335 241740
15772 241740 322014 7030 72143 -211900 -164709 28106 182414 -58170 -127490 244104 43146
15760 -3441 89049 -39935 58769 -263698 2020 -131891 130425 -43703 160991 155730 270815
15749 270815 59985 86675 39935 -25534 149165 33381 -30559 347231 320518 111185 60672
15738 60672 -16191 326422 123481 -55413 128145 155710 -291992 -12060 -15935 232498 7795
15726 -5019 245937 119594 36085 -39301 142193 -45716 384484 190711 68310 -124125 95685
15714 -166608 413893 440112 242498 189958 98315 -87712 178103 -92390 -237349 2296 -63335
15702 -116331 126667 153673 213702 -14676 -68617 -148397 193375 -204596 -234377 510651 15345
15690 247085 -56355 1938 -106692 205614 -47499 278425 -18706 265430 80233 -153079 -193426
15679 -193426 9383 5124 116233 141182 -82058 54920 206072 369867 -60186 143985 -103920
15667 -76046 13296 219 -199015 -158488 -88070 367243 -41286 5352 148129 -56237 211711
15655 135668 -204846 399002 -143439 -82694 -62927 35654 -1773 148074 -46247 224281 80298
15643 -207733 -288020 -323850 221076 160371 -237794 79834 177659 -300355 25814 -221827 113153
15631 -200274 -141737 -314489 -177814 -22914 306226 -98132 61841 183019 -66919 -102323 203017
15619 -29084 162823 -222469 192750 13141 61962 26381 14440 286136 42889 51077 14656
15607 63958 -72393 -324449 235362 -152414 210093 150382 74489 141110 -486 -129344 -155923
15596 -155923 97874 186307 237622 459472 -6963 3055 -38506 -87035 17915 24800 -54454 -146012
15584 -146012 5906 268045 54601 -76985 -42739 272424 60074 231352 16795 -212754 7710
15572 257246 85650 -94525 134742 -135939 -18260 36688 -221814 140793 -268021 -162532
15562 -162532 -32964 -109061 -150351 -45419 84910 -9879 -184747 269829 257713 24379 3719
15550 -32683 285337 446923 211582 270793 -282101 51563 84524 269644 -59518 -90807 252691
15538 -15857 206238 -47843 -164266 -123323 -163416 97888 -173584 -265292 30408 -349519 -64996
15526 153044 -130291 67723 -63595 257322 26480 -140751 -485770 -287016 -23146 520621
15515 226053 -147242 93863 -75057 -136656 -129483 81114 6750 76048 110728 263739 -147154
15503 87115 157120 197486 -6480 277072 78647 334149 56331 18755 -5726 -90084 -153142 333697
15490 54763 102907 179684 -77776 -21873 151425 138571 -48860 -179378 -101947 96815 299637
15479 299637 -497511 -25088 -257227 221346 153406 30448 31366 -37900 106016 -4786 159894
15467 21480 -221271 206516 -158324 -143074 274638 322118 148069 -65508 85030 -188733
15456 2430 276900 108256 23656 -153092 119529 171433 167764 -42155 -47210 13243 -124082
15444 -114015 -179943 73087 39384 110966 313503 -54639 145356 186083 76769 -166476 -14548
15432 -407379 91678 -133694 143419 -389272 -70376 503021 33127 337486 53461 33868
15422 33868 -116811 84521 -114999 -49846 165825 -45007 31763 99236 -21034 19082 263886
15411 263886 -96253 51514 352980 149623 47391 -386258 233533 -94920 240523 -93048
15400 75216 -16958 116141 238601 135541 177362 2962 72670 106655 213160 -95123 -94685
15389 -94685 -218080 63276 -248008 -169857 -358206 378407 42053 -116649 -215543 -157021 -151852
15378 -151852 3480 -90786 -115705 -99273 38894 -124635 -89322 150662 -1030 103593 9566
15366 -207828 -111223 -36248 -157627 -83866 101664 221531 61223 64332 71175 -221238 -234600
15355 -234600 -189109 112239 -361540 321483 70492 -16294 -56811 -263347 78956 161962 15358
15343 191544 -232710 128192 -106427 39438 197781 -373973 44061 -230248 147372 -55616
15332 14675 24214 118259 390483 -8597 -66162 100696 -159875 106989 349003 67407 226626
15321 226626 206409 77309 85265 108547 236170 123900 64579 -130188 241497 -1157 154137
15309 -109647 22785 83551 307822 88665 161175 -212327 -143178 -161944 214744 212614 -84040
15297 222483 18321 435846 69346 -55421 364726 -33254 -116752 -29798 16205 442107 -184232
15285 181513 91183 161885 100995 299032 -54075 22027 201282 -231977 139558 404136
15275 404136 117323 -12653 73826 -188299 -182141 58386 36307 -180170 380886 103610 97021
15264 97021 111697 178510 213199 54549 -285686 107765 -269048 -134527 -93858 171215 132901
15253 132901 -174581 55528 141162 33473 292788 121034 -5430 421775 225838 101198
15242 112842 309006 -100682 -9634 404529 399487 -15600 3816 360568 396937 260662 26918
15230 228682 252106 522952 -57945 236262 160384 -92607 -121145 617569 275590 263526 289912
15219 289912 304578 277319 -21754 327299 534218 497467 203479 321301 328410 192946 332097
15208 332097 112729 81406 67104 181456 -68683 169987 309056 435619 144543 126374
15198 126374 30997 289026 -183339 -132493 -95993 149423 214051 242317 177633 172829 -61609
15186 11064 127545 153430 223371 96579 7617 191266 142017 7406 81476 267254 209500
15175 209500 390711 382093 171021 277486 195583 216295 323025 -61427 324500 114883
15164 432250 229494 271346 218027 162183 305009 82236 -190712 -81886 177747 -96987 56036
15152 90650 -22254 57063 230819 368145 7837 -120343 256872 157218 -176919 412364 104001
15140 -66943 418790 -26581 -126798 13271 326835 163843 -126024 148432 131150 -201220
15129 87108 283451 -74735 98574 118942 -142115 -141213 57393 -270150 405030 352221 -244325
15117 200767 -176945 538398 48123 -197907 -106959 222538 146678 572556 152844 356192
15107 356192 129325 -135422 369870 341564 494749 320788 58498 273580 -100991 -25152
15096 217644 303193 89027 264974 227147 -70060 350642 160763 -35196 28439 -22527 288604
15084 27214 331472 -125752 294708 226522 -189494 350417 459445 -184390 164795 312547
15074 312547 188009 146894 370083 303229 99600 62965 151481 235762 304205 -218269 305323
15062 303266 113698 142814 127852 175214 108729 340063 360456 155311 -2544 -52022 211293
15050 140019 12285 330668 306470 -251377 386711 362854 36170 225016 133671 121073 308305
15039 308305 314396 247910 252748 180569 129211 476693 264734 112517 -38742 300584 251281
15028 251281 381580 258010 113400 590678 373733 157424 74592 176943 250879 311155
15018 311155 541399 145575 121670 44285 -223326 -96017 302611 305457 183051 201502 440861
15007 440861 174618 532035 90690 112150 428234 276251 159947 196685 45961 464814
14997 464814 294666 -93522 131853 192701 398138 278098 166344 87893 188782 136762
14987 136762 427506 457118 242711 242976 125651 145525 181287 285640 298365 145666 51134
14975 69093 400189 258014 17372 262967 516204 209612 56827 160136 228988 361155
14965 361155 266924 426125 317033 184569 143943 263303 158760 334132 513247 696823
14955 696823 508488 268813 192840 255888 154834 529883 573656 655974 228688 473012
14945 473012 144168 417805 223641 224186 106640 470740 465489 455052 574914 246253 53319
14933 251932 174346 281913 259230 384053 261024 283669 530710 213952 323409 200135
14923 200135 388861 491781 302362 473373 170440 400259 210536 180395 302274 516908
14913 516908 59166 415339 230120 605092 216114 313667 664652 359992 221796 406178
14903 406178 592314 221776 620341 120949 523362 289274 324629 564496 842270 573149
14893 573149 796924 749754 551626 567093 221738 500919 425059 197433 187610 390183
14883 390183 585885 347505 385270 823375 558237 396098 589209 713954 411925 575106
14873 575106 553530 565742 194439 241553 566551 860932 460118 399455 421156 312687
14863 312687 434189 326592 431068 325081 531774 488419 777077 565197 522959 -70152
14852 391033 666126 471433 549358 547434 823933 490335 648923 729451 845922 550621
14842 550621 512820 185644 569057 484726 412426 205713 604903 477986 373267 689430
14832 689430 603685 483127 612259 500289 681217 546306 504731 734509 788976 745693
14822 745693 408727 549780 511322 239650 748849 405126 620221 601014 726261 740538
14812 740538 428845 683436 867347 572362 813575 671511 320937 487363 612584 937951
14802 937951 857319 926237 808696 819805 592909 629416 1021503 841230 879652 492998
14792 492998 674172 715842 547677 741595 1005277 884346 762786 1007160 613032 426061
14782 426061 808319 883312 910578 570110 732641 686004 610785 669427 621620 756640 616191
14771 616191 690313 481469 731443 891123 783306 793764 576425 825936 645447 900905
14761 900905 901354 846257 960267 920455 923732 870801 1055671 1130592 794326 730185 819282
14750 819282 680993 923517 852938 835211 681528 601509 981707 712908 780292 744073
14740 744073 542770 882187 723003 944437 963626 861589 948331 950175 1061551 929055
14730 929055 865438 1202256 735206 1085892 1006788 1103563 910831 539514 881379 862601
14720 862601 1062181 900124 957049 1053823 1118636 804306 804409 1101924 1253036 928499 1011974
14709 1011974 845212 898256 1069772 705581 1161185 1039563 1042149 1308310 1258028 1423110
14699 1423110 1296043 1335989 1152139 1408758 805426 1194273 1059097 1076160 1256191 1195344
14689 1195344 1084404 1341517 1244913 856492 1178790 1156828 1396967 1078784 1478840 1677849
14679 1677849 1300472 1100888 1367461 967188 1255028 1196015 1385488 1255194 1494475 1185700
14669 1185700 1365406 1711714 1300090 1732411 1225717 1142553 1326574 1369617 1478819 1449336
14659 1449336 1353655 1426978 1452885 1144914 1401260 1526283 1306609 1618314 1492687 1700005
14649 1700005 1245078 1786995 1594150 1697541 1780308 1539108 1659423 1448680 1542665 1775806
14639 1775806 1780670 1410915 1419567 1753124 1581241 1392712 1601471 1664531 1952340 1590833
14629 1590833 1485477 1575404 1642917 1765889 1802519 1772233 1937156 1783873 1841822 1798336
14619 1798336 1482462 1918121 1489512 1950830 1786929 1908877 2008067 2092864 1675250 2088059
14609 2088059 1833094 1950032 1834302 1812894 1923885 1838281 2049161 1982887 1954525 1966583
14599 1966583 2181463 1776111 2295016 2383914 2128157 2406059 2165112 2422614 2081445 2334764
14589 2334764 2455058 2498251 2379062 2548538 2345247 2710421 2683139 2536068 2737027 2585783
14579 2585783 2728423 2395894 2388534 2143757 2638558 2486482 2696370 2865577 2792137 2741156
14569 2741156 2393684 2798221 2945523 2774897 3014034 2913356 3086927 3169061 2832376 3233386
14559 3233386 3240462 3185259 3141594 3203491 3431822 3503842 3227401 3486048 3759066 3670369 3386582
14548 3386582 3685871 3692590 3733138 3741782 3819330 3670602 4115797 4228816 4314966 4014743 4388223
14537 4388223 4613052 4668069 5052460 5772431 6138547 6335009 6294532 5918763 5708073 5875525
14527 5875525 6090339 6178285 6538445 7093250 8026197 9084461 11652989 11779356 9917747
14518 9917747 9260828 8471166 8356542 7363158 6980764 6805073 6626301 6047021 5899800
14509 5899800 5717866 5562167 5214138 5377210 5449662 5429105 4935478 4974299 4808625 5056546
14499 5056546 4613588 4345537 4620952 4523542 4459055 4648198 4438440 4646702 4884005 4825137
14489 4825137 4800882 4792863 5098932 4792739 4906418 4699188 4914401 4773325 5271662 5295188
14479 5295188 5354509 5172073 5255004 5657016 5598147 5765440 5383585 5816169 5790292 5586759
14469 5586759 5912105 5839957 5813255 5736235 6077019 6525074 6058111 5975696 6406732 6148818
14459 6148818 6288268 6784537 6847390 6380448 6569989 6681146 6742807 7000672 6593642 6842347
14449 6842347 7009804 6724141 6837933 7060803 7319662 7040825 7093679 7398721 7204314 7345156
14439 7345156 7607637 7811971 7843912 7436060 7982895 7874703 8163629 7918033 8440928 8021492
14429 8021492 8167236 8120272 8637063 8787763 8538525 8796752 8552957 9156275 9569186 9471545
14419 9471545 9430971 9307217 9679436 9853918 9874152 10030504 10092656 10251211 10567713 10435618
14409 10435618 10644111 10698457 10849580 11131868 11026350 11390160 11319653 11982172 11374444 11875580
14399 11875580 12139008 11731548 12370574 12490920 12701083 12900005 13405004 13388074 13574009
14390 13574009 13382115 13971189 14327091 14340610 14570402 14562325 14741442 15059314 15651780 15159897
14380 15159897 15556291 16177421 16318682 16322528 16419178 16815176 17003853 17289749 17127343 18027937
14370 18027937 17971191 18138740 18403845 18755469 19013495 19319339 19439891 20107083 20058074 20584969
14360 20584969 21006489 21623739 21402873 22153623 22187011 22552571 22849275 23467418 23722834
14351 23722834 24445183 24898465 25218523 25288099 26427114 26476492 27013538 27828378 28302713
14342 28302713 29024458 28927022 29810432 30563513 31005005 31320690 32048484 32429319 33234038
14333 33234038 33878152 34816202 35272181 36209547 36900845 37794382 38255496 39183393 40052045
14324 40052045 40702014 41807986 42572701 43700618 44430125 45560741 46108052 47708692 48638930
14315 48638930 50005143 51104946 51966473 53075623 54662324 55584529 57136564 58287047
14307 58287047 59523054 61162807 63037485 64231497 66142160 67712390 69078018 71090533
14299 71090533 73149709 74680021 77147205 79007829 81338730 83544802 85662939 88341260
14291 88341260 90971338 93295869 96504311 98827005 102048339 104910728 107929965 111100174
14283 111100174 114771545 118499041 121651712 126010231 129964188 134383670 138782633 143906083
14275 143906083 148730930 153769097 158824037 164176246 170056120 175812134 182109042 188761686
14267 188761686 195206097 202877469 211113170 219237214 228691468 238977500 250426149 263492734
14259 263492734 278882812 292701378 306209354 316438180 287919548 259445548 262981102
14252 262981102 268915894 278336012 290549444 306102377 323111362 340781813 359322037
14245 359322037 377634937 383803318 364912111 341690697 335107116 332913429 317811342
14238 317811342 307547386 299054328 290405903 283140520 276159762 270388223 264271366 257684169
14230 257684169 252460089 246660644 241291062 236357069 230981512 226127716 218838578 207717392
14222 207717392 193169837 179421712 168837654 160346737 152443814 145540172 139148767
14215 139148767 133190147 127396029 122403077 117395644 113241453 109019420 105060097 101701043
14207 101701043 97923998 94523534 91624766 88338070 85356845 82697621 79980799 77457266
14199 77457266 75351426 72762574 70758209 68532509 66846754 64569237 63198075 61287813
14191 61287813 59370022 57910888 56470864 54606222 53096815 51885233 50688013 49535019
14183 49535019 48322838 47094861 45623680 44651000 43521217 42797556 41903592 40476756
14175 40476756 39646703 39072708 37950476 37115367 36022119 35517023 34409414 33458520 33201864
14166 33201864 32442870 31849008 30884258 30255981 29774651 29119331 28273508 28185772 27623697
14157 27623697 26856106 26390727 26073666 25284463 24950757 24583494 24067319 23833051 23303033
14148 23303033 22950684 22636655 22073838 21888488 21238942 21062581 20704936 20240306 19844088
14139 19844088 19511869 19259426 18987437 18933079 18495431 18274067 17604902 17803419 17137158
14130 17137158 17141080 16809272 16634742 16509776 16079035 15672577 15536934 15459733 14949978 14932858
14120 14932858 14551881 14842296 14219645 14149501 13777289 13543602 13171840 13164043 13195027 12731945
14110 12731945 12354907 12354569 12247715 12633284 11519223 11737398 11548381 11377533 11543303 11627715
14100 11627715 11130817 11015961 10666171 10624346 10771668 10273372 10209538 10273622 9959365 10327293
14090 10327293 10035340 9917583 9517495 9301695 9384758 9583106 9118492 8990994 9124066
14081 9124066 8837107 9017064 9034588 9050921 8710121 8486029 8238314 8278988 8318754 8202041
14071 8202041 8094279 8047303 7753759 7933820 7947260 7474441 7398738 7891580 7313682 7123016
14061 7123016 7423195 7307263 6981466 6966099 6943946 6738121 6800450 6580992 6782244 6606318
14051 6606318 6579616 6360414 6430599 6614373 6223423 6311613 6073808 6116456 6004203 6146495
14041 6146495 5827155 6039992 5736211 5829063 5881282 6067909 5419862 5640970 5587558 5736530
14031 5736530 5569704 5451135 5140366 5187685 5240729 5073977 5361648 5163345 5084652 5066867
14021 5066867 5072969 4843930 5065557 4805260 4979156 4866483 4791690 4854642 5004550 4866365
14011 4866365 4622280 4680611 4707023 4595068 4460629 4429067 4785984 4456009 4520226 4458615
14001 4458615 4403233 4219027 4516639 4220227 4376970 4250141 4300580 4285170 4138693 4253316
13991 4253316 4316956 3929795 4224356 3936369 4140967 3982558 4164911 4383549 4132767 3911832
13981 3911832 4064433 3978764 4187472 4492696 4392491 4363712 4625086 4691809 5352438 5962532
13971 5962532 5604101 5496184 4960811 5101255 4973418 5190496 5355897 5712883 6389696
13962 6389696 7175631 9348090 11027612 9628045 8596278 8275703 8261417 7305622 6751749
13953 6751749 6318181 6326524 5865221 5590180 5691242 5256393 4769110 4939294 4755829 4579575
13943 4579575 4444029 4101014 4118600 3651927 3641779 3272754 3226131 3679432 3344546 3245648
13933 3245648 3237160 3048134 3195217 3460398 3138567 3153191 3171091 2917132 2745873 2966662
13923 2966662 2845783 2772398 2744923 2930535 2977136 2918145 2704523 2566792 2638264 2793766
13913 2793766 2681766 2714392 2593644 2571684 2767822 2356938 2422113 2688641 2553959 2887629
13903 2887629 2428812 2510450 2852782 2351290 2410185 2235789 2289646 2455863 2377181 2268190
13893 2268190 2319121 2220575 2445447 2195023 2457585 2435059 2158419 2316321 2280985 2170762
13883 2170762 2291448 1988535 2372612 2004606 2052136 2179012 2076798 2086230 2212289 2124795
13873 2124795 2041892 1722752 2050451 2311612 1629158 2036701 2078544 1705537 2155272 2054323
13863 2054323 2041750 1777073 1958614 1596719 1734077 2235028 1868270 1937799 1722548 2029541
13853 2029541 2108311 1707122 1589459 1775842 1710422 1750996 2074794 1620017 2034247 1573220
13843 1573220 1946266 1634202 1760525 1709972 1745219 1786451 1851485 1846689 1747203 1680143 1433540
13832 1433540 1825599 1874146 1233235 1690221 1473771 1440501 1498850 1641182 1568397 1651490
13822 1651490 1903692 1482141 1786413 1309154 1223259 1771213 1679088 1418931 1404978 1563928
13812 1563928 1722993 1459606 1420316 1439431 1477136 1349834 1427081 1371060 1442951 1574704
13802 1574704 1486505 1571718 1340111 1713472 980078 1224355 1448581 1486034 1568074 934487
13792 934487 1230912 1327078 1405996 1063446 1738424 1335693 1338186 1091075 937356 1197277
13782 1197277 794918 1158839 1258311 1280874 1014299 1405606 1338421 1451763 1450556 913853
13772 913853 1152879 1179236 1205094 931358 1169249 1251809 1201784 1321684 1223545 1118799
13762 1118799 1159248 1356744 1317015 1169098 880940 1151224 1390213 1032764 878769 816957
13752 816957 1111223 1148993 1052791 1408216 989220 1016312 992340 886244 1056486 1326854
13742 1326854 1168146 972288 1217425 1052888 747917 946842 1037224 939233 1386730 990607
13732 990607 774123 955899 999318 1158604 975505 1155953 941350 1163164 1059981 1081660
13722 1081660 919155 667059 849421 907782 978691 958766 723909 734437 1043074 639220
13712 639220 1052915 1050614 765449 823891 750752 902963 979407 1075531 889987 802049 1025855
13701 1025855 994939 700297 747633 852889 1055494 739181 1001371 926144 970953 1150608
13691 1150608 852618 755363 764746 811160 885144 994478 612637 934621 863569 593075
13681 593075 866594 761350 646257 1004615 649027 870660 787553 920186 911884 653825
13671 653825 523994 573716 1070886 514894 788126 1089350 883521 551587 701307 752193
13661 752193 798950 804876 919298 702797 543959 852080 832304 972577 453800 852295
13651 852295 749452 881488 809936 598735 576386 973153 787746 575568 597966 559300
13641 559300 490213 941115 489472 659992 385359 633070 674525 715759 799002 666254
13631 666254 705518 696320 352353 722537 571133 385338 623024 369605 343926 427212
13621 427212 766311 350897 803386 631686 617679 541594 617771 418148 561897 1046102
13611 1046102 730886 632950 390608 395354 412731 541596 583491 432825 519337 685378
13601 685378 686378 639014 558862 638011 551142 528984 331555 704781 355912 648360 704184
13590 704184 419480 346326 340510 648007 567955 356519 605534 829437 321683 367672
13580 367672 473647 197983 489961 531879 205677 494366 595245 521782 784921 458224
13570 458224 301062 689400 580782 576315 210633 444828 533984 764339 356060 679368
13560 679368 465893 338195 674463 285429 491431 445134 822736 578561 541838 1046272
13550 1046272 542853 148311 555277 393334 632087 671188 374384 557056 979128 738969
13540 738969 592621 538227 562312 570021 438734 379956 229152 296067 246283 742536 355149
13528 328293 221582 258606 587621 434575 215403 672797 318037 155478 635916 538315
13518 538315 618814 819712 570495 593486 665362 96669 412669 658688 589224 190184
13507 410950 616256 612437 767113 200755 224069 382922 396982 55967 433129 208597
13496 480381 456629 151591 436800 567873 81755 572715 448962 487052 579670 823488
13486 823488 273559 443910 560432 536244 525504 783554 250106 469559 359873 430697
13476 430697 381410 425643 573714 228661 420181 501141 265444 277320 710729 442618
13466 442618 104235 428864 406713 386049 618246 165844 635183 475378 334320 630595
13456 630595 604863 221086 303160 465879 499603 -44194 433412 88471 822187 655371
13446 655371 265198 218709 371019 632131 172082 539737 589642 586573 294273 493460
13436 493460 331401 511760 289166 366532 399599 481351 156659 192566 293717 144721
13425 247741 363505 519221 336272 184927 418981 128108 421341 189538 471217 202016
13414 8024 -38641 460590 193210 542067 619952 486261 770902 75567 493603 332812
13404 332812 656764 418214 351261 541561 154346 400506 179511 383548 248157 106600
13393 82963 383828 104321 -140399 545383 166746 292531 41931 41487 244434 363467
13383 363467 519078 306266 167497 485934 485471 273242 -46917 210813 533617 112944
13372 486354 -24931 316841 211890 343053 389804 500287 114040 483330 428170 189049
13361 8809 481949 549554 496046 169410 329380 262558 408254 504964 281491 -464 106638
13349 226485 523250 109085 196304 420475 210836 209609 273182 259984 222927 188328 433736
13338 433736 434915 220703 114966 277681 274316 41286 384793 269046 646704 328154
13328 328154 199111 330074 48518 431371 234111 551054 237019 281921 382169 136920
13317 458982 671049 258179 279960 247719 340598 407075 623226 194038 488057 262566
13307 262566 202680 369591 568391 370231 -16951 408982 590199 373502 -175878 93921
13296 131894 471528 327326 494298 426110 377381 584458 363933 437333 514230 307968
13286 307968 318065 311399 -48518 322895 302458 194333 258736 1666 399492 496676 100577
13274 -32794 347711 14702 306492 114123 121380 187378 -22814 75264 448365 -153641 169926
13262 210889 250166 335514 112314 394461 114122 -13629 206954 219192 -17732 465452
13251 158295 114510 173134 240672 353994 -88486 359858 396549 93434 366540 267729 74868
13239 173013 471140 145823 160045 27022 329392 360911 248854 -157737 -23907 181649
13228 75427 -20097 164791 -236799 264819 -142584 69639 28154 51449 500836 209303
13217 244039 91047 122333 194863 -31353 4703 105110 11472 648597 408817 112110 495835
13206 495835 390780 4627 166797 224579 78598 243029 296628 68326 17881 7643 5486
13195 5486 -31075 411953 -142593 509397 92759 26337 16595 314321 -139831 233235 94583
13183 252600 55574 260164 20990 74319 308802 164590 304327 344083 268604 -56223 -99273
13172 -99273 226059 89298 143321 31719 64353 37647 63534 141804 199530 -78249 429612
13160 259916 133504 237320 52488 -49693 323418 292783 269738 298389 117179 243849
13150 243849 200557 462314 159602 229292 -36080 98214 235194 -237816 71844 122359 134222
13139 134222 17820 196746 183561 183893 99180 119296 53513 168393 241811 -297235 321896
13127 314827 -49396 211385 31369 296927 257799 -12220 365964 131810 -69456 120293
13116 -81243 53261 136107 248204 425442 49010 179085 -64488 228206 448926 173838
13105 499701 43183 486196 -127487 107144 -52739 81748 304056 261312 110429 61949
13095 61949 118233 242441 214921 -82878 -68135 75578 207569 488479 -221117 217748 260314
13084 260314 -92828 226149 83143 270305 284844 -21397 454371 308231 58548 49679 297725
13073 297725 19651 220152 -63586 492317 -52402 -41437 92113 382916 217901 116092
13063 116092 -25044 -17656 241409 675410 188091 8472 106556 338458 419015 238063 348722
13052 348722 -85009 416448 226915 -164747 260733 -90122 119589 226977 152139 331940
13042 331940 269802 72006 163098 211214 147905 54259 5082 -10562 40831 152365 253646
13031 253646 -60444 -69710 125564 273868 133614 240539 53093 121112 -57991 123202 -53723
13019 126084 9774 352485 -84398 372636 435690 243814 129904 84708 319209 249186 17613
13007 -352857 120013 37744 99876 27762 638079 31685 -65459 219877 77112 -14769 55452
12995 -97012 113470 129374 206873 398936 432031 59150 35265 -63042 37995 95216 126229
12984 126229 311083 48907 242796 398089 -208775 184425 275071 293552 129355 216788
12974 216788 215961 371249 212849 160426 135240 5904 115408 159385 193229 -16352 -167789
12963 -167789 661394 -58353 291589 278267 -272026 -131239 571953 -22551 -39217 -52212
12953 -52212 26009 -156512 190138 211037 155993 87032 95394 38986 205127 -78240 193953
12941 268223 50510 136937 -40463 87909 -94126 -166392 -193737 48579 -3923 44109 -79724 -8339
12928 156377 185817 266770 -67579 -171483 199636 168639 -7530 162018 -199031 -263979 189584
12916 290817 286354 -28151 115402 325908 234212 -65645 116305 45034 332419 -28172 -8315
12904 267996 -167078 -125891 44037 -174258 267394 251764 -82700 500837 132349 165767
12894 165767 387896 261024 -218813 -127903 285736 -123197 -17064 211502 324665 200929
12884 200929 -136044 -206662 227507 -35702 304835 -27228 -191599 -224551 263622 277332
12874 277332 96731 -28222 -51764 -49115 -107569 46027 -137719 131598 -56715 -41673 -274789
12863 -274789 118935 -75568 105257 -5303 206118 88394 215436 -88849 207241 -82882 -314133
12852 -314133 40457 33445 -97881 308495 208735 532453 -14121 -55273 78352 152377 65669
12840 13279 104503 -171411 196426 -38703 92295 -29734 -175146 -207403 108533 176673 297374
12829 297374 -150232 295037 224964 67398 294393 133076 492235 227829 105679 -75383
12818 65585 111768 -196540 56320 126542 -180740 157757 252089 -17991 276712 -362539 -36798
12806 14013 38146 -140905 -109070 115139 22256 -117325 296410 92289 250298 3553 -169948
12794 59436 -80483 -55459 -16417 -81153 -25304 159874 317036 129138 82774 209506 296543
12783 296543 58543 45994 87314 -260613 333795 227834 222740 29928 47077 145294 230512
12772 230512 -30026 157773 28987 60678 218800 -48277 78497 103345 -78940 237650 111606
12760 207269 279673 -29233 48222 -120498 -30423 -31487 144210 -81736 -200700 -196252 362382
12748 -29739 42121 69019 248208 -37631 279494 56072 59783 -85626 -11296 117055 -181425
12736 -96784 19377 -94684 -51638 498941 -93309 -79510 181207 77631 -129328 226034 -65150
12724 322484 493942 162344 483404 -9036 -60480 -14373 -7156 -132141 14202 85549 -90053
12712 358672 151839 158384 186542 -138000 73599 56772 60235 123000 57428 -14258 250037
12700 208519 138429 -84148 377005 59679 -118718 -105207 -175554 74949 -209528 271883 13772
12688 222161 -109075 -30633 396726 132190 145407 150686 101435 281097 -75464 255994 -178395
12676 309805 2958 -367973 261137 164328 362096 392960 -10468 233435 81649 204394 207665
12665 207665 57569 192164 -96419 169706 -125836 296104 138752 197831 143050 180129
12655 180129 238823 144608 26184 -244866 -7578 198064 71101 -33975 297215 -29852 139356
12643 -241297 -77454 -269103 -92962 92664 -56934 68344 73563 208462 203369 3439 10405 435945
12631 435945 -77977 43882 -195443 -64606 38511 205216 231102 32342 23451 68633 -17918
12619 64714 -22935 22887 159107 109952 242156 3758 125049 69706 -108043 173198 -35781
12607 230852 79083 -18440 137152 109187 -55353 168601 74540 168659 335639 -50283 276339
12595 -247910 -81965 104110 22288 240182 -70803 234206 -101939 118257 255120 -243622
12584 -83327 -61593 -181836 219571 -65428 -31695 110533 305291 101184 -42730 201476
12573 -138033 188544 24272 46581 13133 244327 -107551 222941 39865 42731 -102792 90639
12561 -38633 151475 -61872 110876 5716 315004 201809 79496 -85035 76340 119736 21381
12549 71868 -268294 226471 -283371 93952 -363650 -34696 -28476 114400 -120904 130785
12538 169081 128479 -34198 -39007 -114443 -190807 198537 37699 -51389 121841 -38414 -72336
12527 -72336 -170609 -7978 170268 196320 172770 -54653 121085 -51558 293775 -61684 -55903
12516 -55903 -235678 -84909 155162 145687 82738 -179748 -33546 119200 83719 -86501 -72848
12505 -72848 -134622 61367 16255 397433 298750 126870 -63073 -186091 -19973 195058 -64792
12493 252337 35409 -180953 119521 -150902 -177790 180105 152108 2537 147542 302553
12483 302553 -103280 236803 85743 264713 -106623 267856 80067 -241971 11796 -54983
12472 115107 312642 -74238 201247 -72210 -1414 272811 40821 -448808 262198 260646 206304
12461 206304 137202 379439 172170 308650 293054 -194332 -198550 72590 51735 170031 156219
12450 156219 97387 -29375 -132414 175169 201730 -85791 -22787 -187181 -14689 -37302 240614
12438 70304 163129 -90799 -102432 97796 -205528 -165332 217897 -116057 2381 -68860 214359
12426 329762 65707 -454494 -8389 157683 -42179 -266250 -35078 -100713 173654 97362 22838
12414 -111227 -91910 100413 16272 -80186 -380103 -166587 6946 58710 -260001 229375 64494
12402 250430 -275195 205967 56235 -199018 136199 -90352 -168924 295052 -57969 -30796
12392 -30796 -56678 217880 -203818 41601 -83800 83108 28396 71123 323920 291392 74492
12380 -167419 -275733 133794 31987 -155663 313405 -40294 -211 -102221 176154 -322188
12369 -44940 -385057 -417817 -214722 -212363 -222164 159649 -36974 -272787 -321719 -328536 -70837
12357 -117800 331713 525463 -41568 244279 -163532 168250 -113445 -93096 -174624 43823
12346 173553 -809 66908 -194949 209355 287698 -79543 -233140 58248 166728 72604 -81310
12334 -133944 173783 227755 36221 -50094 5352 23984 1912 15791 182992 131012 -12401
12322 105351 87202 226601 -144219 176458 267196 77100 -176009 -49364 7143 45912 -232078
12310 -10043 -52977 513539 -115547 45390 -71623 -1548 38870 -216995 -93304 105696 10957
12298 17751 209221 51910 44189 -2596 -214920 -15844 4112 -182180 -113041 -46045 -219253
12287 -219253 -253607 90464 379888 -236898 81987 -27712 445697 -117989 -132181 -50939 103632
12275 8007 151920 -170118 86966 -112582 162411 -19641 -81987 25881 134394 -36876 78967
12263 9502 88893 24424 155928 228595 292388 144793 46884 167466 -266341 260874 219728
12252 219728 -75845 148722 12446 -113659 -121778 -133873 -140349 48604 12348 37197 17180
12240 605498 -287484 -147506 -79112 294497 -21873 321796 50709 335921 144129 -185784
12229 182115 127661 444771 -21900 174033 -62023 -22190 125721 138240 -252063 22341 4674
12217 317296 246583 102851 62461 -129212 9781 403869 -137800 403279 -25111 296332
12206 177141 -130631 -101490 129201 41590 209312 132707 33743 -88765 -97894 311835 182255
12195 182255 290311 300797 346606 24153 67550 -146116 -215276 90872 116627 372848 149903
12183 -44941 130434 296312 301942 323030 -11588 304815 -57216 -47408 121579 340784 173884
12172 173884 -194645 314988 62809 85732 141811 263992 -37829 -158680 155459 -125724
12161 164557 7904 -29378 156957 151700 57048 269732 121555 183163 202756 166639 -5644
12149 92067 -150548 -53574 305391 -33511 211838 216906 -43363 78009 277427 159371 225756
12138 225756 105034 -114744 103625 21411 125957 63135 -38771 388469 -64355 98356
12127 71021 -35270 205153 -92848 338695 105853 358154 112548 236323 168107 326419
12117 326419 -13441 233869 -273160 9978 306801 49064 -77076 31512 110625 -185828 78743
12105 -116040 7361 -108580 -513681 -39058 -125250 -102769 158156 -366954 58304 11974 446832
12094 446832 245628 102988 163564 153990 -170736 181595 -65631 -45434 157671 92048 344134
12083 344134 154470 -4738 -185551 -36087 -279340 -127161 138174 -32119 -20712 27437 202675
12072 202675 -121179 80691 140969 12503 392363 -150326 281695 119077 -18142 -242406
12062 -242406 -164372 96032 -99057 -158630 -185064 536786 -187032 104159 235989 233990 356018
12051 356018 25512 276474 135892 103068 410202 176986 412070 156109 218597 -304178
12040 -106785 17365 -83832 60251 -61316 19191 -270133 -65724 233298 -108883 22661 -3444
12028 -49274 55873 -251217 -50609 -121893 22410 -203325 106399 -228087 -65694 -195250 -205109
12017 -205109 239390 907 -169084 -149861 -2660 171367 176443 324779 224962 -166119 12079
12005 -120282 -5294 49796 83338 -124959 57145 71997 95420 -198945 -241832 136308 93233
11994 93233 53578 -190222 29124 -337568 -303684 95220 -181563 159794 220957 210126 88437
11982 25927 2979 -99317 -60788 16719 -202133 56848 45396 12543 -55141 -45786 127304 72666
11970 72666 51297 63493 243529 -72881 -25496 -45760 -164366 -210894 -20792 61293 -8377
11958 -115022 -145608 -18878 -167120 70185 22398 -7950 -87 150783 -55868 -100881 -100866 8355 -14225
11944 178837 26857 293095 -8802 32845 174034 -91952 -110658 -102421 206988 6361 -117202
11932 -12277 104826 138474 164695 30488 -114209 -90002 -50358 -43586 -334217 125354 80921
11921 80921 -174550 -332906 43495 146031 -387828 -153852 132521 -159496 -168979 114751
11910 -205063 -142212 -103540 -30139 -249162 77415 61370 -100558 188948 -114005 -103280 174571
11898 81413 -288493 2197 144645 -141072 236126 -60982 -277321 18413 -29985 -46905 56823
11886 -11789 -160446 134008 -234032 -37007 -238264 251769 -235313 174385 -91336 -86127
11876 -86127 298356 -132205 211760 -77386 -60168 441491 -336985 72869 -211199 -260924
11866 -260924 -202300 -310728 65862 -148054 -208534 220296 -95113 -149734 -5739 206424 2828
11854 -78872 -43107 91185 -197347 379848 -40297 56620 73499 -423271 46179 -196082 -87530
11842 5445 220757 59811 -150100 -234954 -271186 -107102 -31505 -57905 -274653 -105422 2535
11830 347298 211250 -242239 -480138 -63798 97609 -239931 160506 51437 -97834 -24318
11819 222202 85023 -51926 -302944 -71838 -257663 -28403 212462 25507 -29389 2229 71613
11808 71613 -139638 -275987 263528 -127109 31751 -43039 105515 -59585 -124409 -2206 -34434
11797 -34434 -122753 -25155 -301909 -39911 147449 -168663 -42875 75609 123558 1542 -412998
11785 -262585 37339 37475 -20989 -144289 161972 69075 109549 11873 37923 -64210 96089
11773 -206635 410533 148256 151999 88188 -99981 94059 -87394 38632 93840 -286582 -270315
11762 -270315 -68597 -64938 78646 12564 -189537 -33517 88478 -11591 -41496 26477 189238
11751 189238 -54429 -49073 56252 -181899 152340 -366383 -373734 43262 -176952 -242086 171130
11739 -172160 107272 -336103 18532 316739 -29040 -116191 -63047 421275 320239 272584
11729 272584 162791 183149 -64982 137612 -90969 -114284 -103152 282471 30433 -12457 136117
11717 3984 -10360 6797 50087 299089 -142197 -127551 -155228 285835 134779 46506 348186
11706 348186 -46161 -109792 -15425 -355950 -132919 161206 -173286 214079 -195854 71560
11695 -229352 -17396 -220850 -5229 153291 -124804 -52551 -140549 217125 46054 -212342 672139
11683 244136 217981 219155 -341932 -83426 12930 -263083 96468 148180 78454 -120283 146031
11671 100434 -134062 20827 -390387 -66058 210931 -76535 90618 108880 13240 -76761 -107908
11660 -107908 113194 166048 -397774 -97159 -14615 125129 35634 6830 285034 58073 159197
11649 159197 -422892 125667 261060 -95649 -30898 -123203 53630 -208467 174268 -45703
11638 66116 -274956 -98783 -180861 -193613 286199 -230373 204633 54581 392598 123833
11627 115448 18869 160329 -55083 967 77208 245374 -15749 -12966 -141827 -286219 -210865
11616 -210865 19056 290582 -164220 -150395 35847 79109 -16699 127885 19720 119027 -39533
11604 -74241 107729 -525358 14524 -279185 13020 354758 96712 -56709 229731 58056 -267241
11592 35113 147765 64653 -140226 190879 146428 200418 -445863 -79678 -17597 -102054 -33972
11580 -184267 261234 171288 -37530 -132288 -106870 337244 -281841 -216894 -300941 -170231 371135
11568 125893 3797 109384 224991 -76353 -245695 81721 36255 209222 64508 61577 8268
11556 106565 40635 310515 -5852 29959 109484 -26335 144374 -138139 -196134 179541 -198911
11544 596077 126074 209487 37736 86097 196628 -47597 158004 167605 52145 -186564 3134
11532 318616 -3882 175668 372677 10880 114070 276789 397826 168126 -147711 85698
11521 332700 -9197 162354 137378 86649 -33230 -68939 28724 133329 65263 48331 -48871
11509 35976 -145549 365600 70938 -330743 180440 -21745 163371 64940 139881 -42705 87001
11497 299308 54859 218457 65606 290548 323080 -157907 67230 13442 23909 -72034 74768
11485 -132515 -106570 130559 261710 -81688 156791 -98031 14162 77737 33589 207844 115351
11474 115351 221875 81533 27602 164571 400678 -29558 186374 174207 -156407 -55189
11463 -5403 215728 101934 47346 10006 -2763 217151 89133 313175 -97959 268847 216709
11452 216709 279405 163696 305225 183882 190086 8305 4951 217478 190473 157436 337940
11441 337940 -98865 25872 136639 2048 -67119 120430 215295 37532 478786 72051 -122415
11429 -174502 -275884 107507 242343 -107309 341323 -70474 88552 230823 -6544 181978
11418 94882 236738 118028 -155551 34073 133070 216864 26429 156693 134381 102302 -35880
11406 149928 -121333 -208666 48380 160212 121872 105731 264016 102333 -89194 183187
11395 46357 48746 -4434 344692 -41719 56283 -15850 184071 -433788 -188533 -116084 176528
11383 24684 -198975 -136149 -309811 -426781 162442 -7707 33211 124175 -189659 211972 245142
11372 245142 -30121 144119 173032 213855 362597 -16585 75561 -41279 -95419 -185272 -134257
11361 -134257 -153967 35123 -168670 -22797 181148 16624 -151600 88024 123138 -11132 119581
11349 -47112 -60622 466589 -116063 161212 15587 -153425 79416 198411 232639 -6831 113831
11337 -193470 -110245 -61591 -77081 261337 -310391 233481 -58100 -87235 -35105 86624 -221699
11325 117273 -148498 118476 -177330 322348 -5512 126539 302943 -77689 46664 283591
11315 283591 108295 -140647 187195 -15301 49150 -71981 79706 -154962 -97271 36646 262394
11304 262394 4095 69152 -89312 270610 -270521 120661 -137407 137658 128765 -182273 -17506
11292 -85204 -60443 94725 -293983 -67809 -367039 -226295 330980 15129 288101 -53074 291267
11280 -195672 81758 98135 -285066 -74854 54409 107770 -401705 325713 -80321 -124147 262450
11268 132861 -237734 7674 54749 21652 -262857 -9601 -53132 151613 312504 -46079 -245739
11257 -245739 246988 -27249 -258326 -222813 -194024 -174185 145318 -55632 -394415 -169744
11246 -480608 235112 75795 -227539 -137750 105212 146003 -177135 -105174 67264 -105794
11235 -234961 -113970 -224577 224154 110445 -139421 14849 -241923 -81862 195790 -25265
11224 -7283 213037 -88970 330270 -307027 -227231 579236 -190139 -197267 2114 -79800 -388027
11213 -388027 38103 -140274 75327 5964 -193709 -237072 12457 245430 -87460 -323277 -56439
11201 61020 161949 -118133 27655 52173 -150830 -12455 111692 -160465 107102 -228270
11190 35858 24585 -114880 150863 103763 -74304 207883 -61094 110475 -182973 -381526
11180 -381526 121645 -94054 -116728 -299849 21156 -203272 -107062 -35890 51028 22012 -68009
11168 -100699 207150 141162 130632 208492 172273 -189781 -149721 232619 -52022 -190504 -204466
11157 -204466 -68392 -154958 26427 183455 -77453 93368 102405 -265730 141259 12066 -380978
11145 -298228 -230518 -288459 -223249 -307538 161227 11722 -167746 -73162 -9246 -387789 -41402
11133 65670 -137832 59547 -3465 -53655 26206 -274704 14483 -159711 -27892 -58556 -109667
11122 -109667 -816 -165626 -50649 67067 192592 79673 -104066 -1072 32198 262332 -100908
11110 71904 -300328 -261373 21757 -255544 37007 195393 -209783 -158694 11250 66496 189675
11099 189675 -8104 329307 269291 49047 -109441 162879 308919 -31357 181270 85552 -7916
11087 180519 -214651 144728 -60466 196260 249142 81832 68795 118636 388666 485793 247275
11076 247275 92150 218248 254951 -313304 249906 171125 58050 531464 155884 51210
11065 200380 372331 279003 156071 303467 77774 337446 44758 -124809 280498 320395
11055 320395 284545 -204194 264663 331630 171651 102271 55689 283658 53991 389792
11045 389792 377237 57600 234496 342153 449102 -175197 866131 552337 322191 331233
11035 331233 699941 100711 361964 550019 539455 393588 517321 450048 341644 155436
11024 863141 338473 300159 485710 542919 651815 351002 552687 284763 377525 556400
11014 556400 657575 515370 376301 570133 620016 686514 599331 853775 346431 660723
11004 660723 501476 348430 589576 437747 314209 709040 443472 322438 512037 889585
10994 889585 739363 530587 256431 334160 675224 595813 608330 451144 643400 645853
10984 645853 359132 738157 441342 549397 375561 315252 768851 607923 538726 126749
10973 642233 716273 489975 587243 708222 580305 656189 609323 653600 276071 868758
10963 868758 758203 688780 994787 878877 849534 636776 1038241 1305734 863330 771543
10953 771543 1148051 756450 1133608 1212952 1101556 954602 1489120 1357763 1483024 932645
10943 932645 1361894 1309578 1242420 1480372 1154450 1463600 1343424 1132455 954667 1345993
10933 1345993 919294 1195539 1103825 1086552 1145949 1219377 670781 866312 770375 675923
10923 675923 842477 768377 823781 611959 180135 690799 363766 806149 566817 657153
10913 657153 602917 448215 423282 253759 245065 287546 69478 -72309 265837 271160 177782
10902 177782 36664 241795 502697 118872 251114 237053 5153 17306 242610 -143129
10891 -20151 194774 -124926 6345 147833 312515 497647 -146002 -64315 69014 156833 390876
10880 390876 95969 104094 515625 85523 203640 2157 -152146 27871 23032 -80855 -13448
10868 -305836 142122 -73812 -157197 119373 -22891 62979 -249959 -27661 118273 -200911
10857 52497 -36970 11037 -59473 285713 14848 -21973 -28467 -190010 -21971 -211917 84024
10845 36485 -43009 88452 390499 -129006 -153877 147381 305243 105818 199795 86017 -342909
10833 259172 -88647 71588 164083 -59398 54991 -35146 -111178 -27430 -129561 -56679 -289873
10822 -289873 92514 -92270 -185159 692468 107606 244095 -18435 -46094 -24057 -163745 133590
10810 -80627 -154882 -177175 104026 63910 -86552 -168106 41161 245163 65048 484527 -126719
10798 -30536 -164429 59438 -27859 507291 41903 -335579 -45388 238646 -413152 -138474
10787 -206770 -273499 -287561 186453 -163189 -205091 -20720 -88480 288965 29359 131279 229581
10776 229581 -247443 -12748 -95114 139500 -76659 -39619 -137743 -75625 -73305 -285922 -90627
10764 -114821 -42697 -18745 62253 29972 -121673 -116833 32345 179834 -33082 -172722 -145912
10753 -145912 -33548 118494 -128772 -314935 46714 286381 110871 180162 -74866 -228651
10743 -228651 19982 -117949 -9387 86008 -6350 129903 136907 304357 275161 -86063 -39555
10731 -192429 111899 -113573 -286679 49281 -128332 -379271 -33519 29691 -6732 40997 87381
10720 87381 166026 -125855 -339682 -46967 145422 -244957 255425 -21754 -116655 2109 8501
10709 8501 74708 -53002 405742 -70159 301257 -197673 311971 19682 -3129 114304 -33572
10697 -27155 31660 -44394 355910 87982 -305572 -75936 -30747 14193 109640 -26635 -245194
10686 -245194 -120289 76206 -133902 -268910 -190588 123190 174875 -222488 -298264 -173829
10676 -173829 46375 -147539 -176637 67302 -172722 -221328 272903 -10773 -138639 153267
10665 -199088 160847 -220954 -248682 -71725 -211519 -1653 -175785 176982 -233654 -57812
10654 -29190 134323 -240617 -125323 -130124 256926 -230838 -205214 97330 88494 -245484 82064
10642 -11111 18589 35531 -134516 -47104 -9089 -134216 71868 82118 189046 55890 -356714
10630 -73635 226480 -58655 -26390 -225671 41692 -363017 -230098 352743 -71598 -129593 -219323
10619 -219323 107310 188757 275969 -196829 55876 -113036 20063 12424 -100655 -215502 -216698
10608 -216698 -8329 -72723 286795 -57621 -203146 -82060 146140 106728 92999 -258882 -291692
10597 -291692 80532 380939 -420834 -251140 452665 -120608 -126104 21110 361580 -151156
10586 -90439 -147641 45857 -97994 -130452 37208 -28713 -262023 84860 -144247 -287162 -187091
10575 -187091 -93147 -45588 -118521 -122208 13610 -118379 -290647 -156213 -62256 -16547 -41696
10564 -41696 -175871 -72713 -286744 -143127 208912 -211290 -27126 157048 -165404 -55681
10553 281010 171432 307256 137688 40098 -199017 -391047 -152548 -294663 -31675 -340849
10543 -340849 -187304 171468 230432 -232922 -46539 -43765 147143 322837 -20278 -79393 141655
10531 -74808 -54460 -192242 37701 -36839 -138508 -87551 -34632 -208603 -204287 25066 -178870
10519 15439 274442 -155298 104540 20030 -43638 206418 8748 154180 -22590 223382 191337
10508 191337 65643 -124538 -390009 108491 -94731 131287 176601 314225 -29369 -37209 323488
10496 -60062 124179 -158837 -7087 -21602 19762 119011 -328818 -66306 30329 -466418 -151978
10484 -31353 -349834 -68899 -14567 -52204 -2146 -279226 -190694 -191340 20938 -130341 259776
10472 4531 -42205 -115567 124108 -276631 103540 -129598 -90887 264028 -12232 345769 100347
10460 -22705 -96737 538247 129692 -35363 344335 34657 -173891 -38323 254748 206579 -156132
10448 -106723 -107083 -36093 245995 151750 -243123 70844 -397709 48625 18875 -46665 -458229
10437 -458229 190122 -51938 -30960 -287725 -45480 223050 -70486 82690 134280 -94183 162413
10425 71922 193920 189694 -101298 19205 -128250 -87341 -184433 203123 -159657 -32561 -124375
10414 -124375 -166911 -232181 -57988 51025 21663 -8851 16116 -451439 -127007 -12584 284282
10402 268985 -398471 -290183 6197 -268237 98892 27636 79488 16570 -74710 -215767 -51458
10390 -5661 162904 49226 -207882 30354 -198194 -31952 120139 145937 188780 86493 223778
10379 223778 -397741 257627 -192157 306819 261394 81828 36627 114186 -150462 -103994
10369 -103994 -96640 -330795 130307 42257 -11166 238510 -25935 -30171 199765 -190519 -54068
10357 44082 322606 170534 -185470 106648 121955 57719 -106953 135960 308672 2221
10346 68196 319687 58477 -63688 25979 219574 295605 354608 270032 484371 38089 -42826
10334 -9857 259918 329997 240194 -83111 332770 150323 -102517 311559 182327 -69668 199540
10322 381399 238934 -236186 285915 -21731 400011 391017 -106607 239851 201584 325843
10312 325843 476146 -247282 403070 440665 141298 -97862 41634 -166896 121849 124405
10302 124405 3059 -72606 232506 270652 85954 263476 62513 152246 140709 -194579 -93507
10290 218197 20413 167503 36172 -25887 -53630 -17102 101504 22352 -190091 -201853 -29980
10278 -79353 -25564 94252 -72389 -75474 55615 -75997 -250740 -188700 118562 -124346 55628
10266 -166040 58774 -27147 211770 -308587 -16938 98998 56761 -37672 282743 -341390 217990
10254 157839 -410160 -494336 158474 36751 258838 -43412 -148908 -40716 179548 193053
10244 193053 -203068 216217 86184 92028 -43180 58028 3098 218966 -193665 273025 61247
10232 25293 62863 33636 -130876 -151276 -85267 47278 -427540 190411 504117 -72009 334682
10220 -175598 -214011 -22585 -49761 2967 -146480 1073 64158 33684 242351 -208673 -100411
10208 -166916 -93820 -97115 161777 388035 -131671 21700 -234607 -67867 323997 -297589
10197 -144973 -319896 -34126 2168 78885 147977 181652 242605 -15129 76672 112129 -251112
10185 -125788 109500 156581 -106579 277204 142578 -208113 96300 32581 -112416 -3862
10174 -332232 -39521 48567 -37600 77061 -17329 -114079 -307109 478693 49037 -92719 -63778
10163 -63778 -147152 99309 -7859 -27332 -56531 6407 49640 -161566 17083 133910 -95069 -95939
10151 -95939 20404 -107980 -252098 -59541 -101388 -261511 221495 -167584 17376 -257413
10140 -72733 21402 -26597 -43 -128366 -135442 -42038 -130677 -298170 -107259 -501906 206686
10128 -192348 66887 -113223 -363023 7589 258288 -147260 -12772 -210971 -60717 -42897 -225872
10117 -225872 -112167 -63231 -42045 158211 -91231 -120128 -316888 170693 -232630 -265484
10107 -265484 140542 -29055 -174445 -181442 -209768 -246312 -210643 -152818 72992 58264 -109395
10095 360181 114471 47189 125673 151805 -294987 54359 -151625 -254159 -56893 10248 -121129
10083 156222 -33365 -276507 13258 286540 58400 -100138 -93551 -263287 -65372 -230587 230200
10071 -227939 -386195 -490292 -246674 -20353 11946 -410289 -92798 -133000 -97055 151343
10060 -172463 -39613 356841 -4497 -149243 -49232 -157905 126654 -371082 17441 151429
10050 151429 -38947 10216 145832 -277357 -133844 -371638 -94179 -68766 -273388 -345132
10040 -345132 25491 -218162 -366294 -130330 24905 387016 123247 -199819 164728 34987
10029 -339843 -37052 -23315 -145936 -333724 15026 -153959 152293 28593 102431 -150595
10018 129874 9919 -106461 -155858 -59780 -379124 -111598 49969 -46696 217765 -292933 100566
10006 157623 5893 -36734 332338 180474 -165233 170999 -41183 -65619 -58660 -103092 -323443
9995 -323443 -69273 -139372 -319017 -36897 45069 -130639 -189342 -159557 158224 -121999 -197994
9984 -197994 -227561 -53045 -12040 -255082 -59489 22530 -412136 -76520 16170 -39320 -246190
9973 -246190 -12513 55770 -168408 -26884 -188801 -231181 -17440 -200535 -12011 -293704 133685
9961 -287953 182369 -230570 40123 -381006 -132929 -23559 6982 -245468 37355 95207 -170223
9949 -195338 24597 -68013 9537 83992 -39557 205590 -222659 -150721 42901 243969 -67705
9937 130075 -29583 -367960 -177322 312741 -278833 -256135 30567 -311820 20276 -11270 -193120
9926 -193120 -246237 78432 -294627 -78600 -40802 225283 217562 -98860 -157221 -177782 -170186 -252931
9914 -252931 -169318 -238068 8452 -51992 -73153 17772 -132215 -266514 -209867 -141456 27613
9902 226129 -57488 -362535 -85057 -464985 165856 -213661 -230975 7627 -104804 -104185 -12887
9890 -264813 -176487 -302823 -54810 10874 -181671 -25959 -430866 -41537 -92974 -298316 -166693
9879 -166693 -29000 -36646 -124358 117564 -71483 -276554 -176614 137194 77773 97551 -23995
9867 -16015 -255603 216829 -350571 22939 -192388 -387913 -249797 -152930 110945 145916
9857 145916 -377292 8826 -60301 108603 73085 -27354 -45554 91172 -113211 -411924 -367236
9846 -367236 191067 -212755 354577 -196486 38644 -150393 109905 -71452 12232 63942
9836 63942 292811 282647 -6197 94963 -178181 29257 -235458 -145312 -43359 8515 73274 -241588
9823 171306 -121611 106708 -62823 155548 129649 -163142 -130332 -60978 -96528 -74316 -23412
9811 -253760 -97166 203947 -246164 -295850 61320 -240805 -21432 -233588 -182111 -275479 66234
9799 22812 -34116 -63558 -36360 -227408 -159461 -64393 -9058 -24626 -131817 25772 151276
9788 151276 -95824 -22823 -32348 85150 -131366 113349 -131388 11970 -64852 -393907 54190
9776 337408 -26198 -162029 -317223 -150745 -115284 -212063 531026 -160158 -86191 35049 -104825
9764 -29718 -169623 -12852 -175185 261289 -311492 70141 -336205 -346489 17194 -91256 85374
9752 53397 -154271 -238678 -638720 34680 -36579 -167065 51296 -151527 346695 -332933 -109884
9740 10810 -202466 -78584 -17778 54262 -107558 -522890 -108474 94037 -92233 -63173 59194
9728 -219715 -169955 -429011 -102996 -174859 -395583 -272691 -131871 42312 -100437 -185311
9718 -185311 -171965 -159425 -144304 22486 234493 -536595 25204 -190587 83697 -152445 -107586
9707 -107586 113798 221388 -135370 -211612 -148679 292706 30662 31722 -285333 488 255487
9696 255487 -244239 -31535 -436712 -238022 103762 -356167 -251791 -149036 -113672 -38805
9685 148815 133331 136981 124876 133005 -487424 -177357 9090 -196485 -150460 -72324 -302694
9674 -302694 196431 -312036 10611 -126676 8119 -167327 -220467 165297 -3727 26161 9301
9662 -223301 142238 167802 -169659 -133739 -317079 -120979 -115881 153509 -56670 -250470 7947
9650 160673 108409 43642 -198186 -153459 -156891 -138171 -244990 -6602 -64490 112601 -114452
9638 -111412 -196229 25161 -220202 -281650 -327442 293340 -198162 -202376 -160874 -137940 48796
9626 37264 17945 -169101 -6890 -99193 143040 -316434 -151590 -284240 -3742 49915 -251638
9614 56986 -21230 39864 -172446 -292700 -419179 228325 230011 183888 -85816 -383988 239127
9602 -97233 -202080 -76031 -149459 31868 261840 -134648 281911 117049 237565 -179777
9591 117216 247130 -283011 -56752 -40768 -114946 57485 32645 -116532 -460719 -64189 254687
9579 8186 -62561 13546 -116069 117784 53725 -65405 -42441 131566 97655 -65546 61392
9567 -337258 -345073 -218040 -295279 -302553 45540 -121871 -37852 -223504 -111216 -75099 64424
9555 -57740 176233 -32285 160470 -286072 45615 -152885 -32336 -164624 -18096 -33044 -68886
9544 -68886 167194 52552 -179320 -70335 -179590 289067 22628 -94448 94855 -271758 -383034
9533 -383034 -296678 -82129 -452878 -54844 -155367 -296732 -5542 3729 215321 -216390 -97422
9521 -97866 -334433 -171639 -99638 -81984 -60667 33284 -313953 -278217 -90865 -156615 -54845
9509 -419504 -321673 -193415 -72289 202067 -180755 -48801 91403 237507 -320671 -116733
9498 -149645 -142570 93436 -372056 -25728 -472078 -23518 -91958 192321 -165573 -84993 38055
9486 -216717 -194091 -102342 -135016 214783 -298112 -58801 -160599 -70717 -21749 -193060 -14881
9474 239802 -8353 -224934 225012 -66874 -129046 -126068 342709 -96302 223203 -48528 -346943
9463 -346943 -183176 -110126 134493 -89604 -75682 50862 -196032 244882 -148599 64062 146053
9452 146053 155960 -167131 -328662 -310665 -145455 -231942 -73533 -200159 -340068 438 72180
9441 72180 -3464 -141503 261463 -271137 15412 60673 -87800 -72754 -11337 -146380 112780
9429 28033 -137755 -119355 -23606 82027 195856 55825 -88466 -33959 -92458 -26212 -265439
9418 -265439 -152124 226658 518985 -293911 -224050 39424 8958 244184 -122198 -53368 7375
9406 -457071 166409 -6054 -278695 68051 120343 -578026 92699 -116391 74215 393759 -48157
9394 154705 114027 -257988 -164705 3040 136266 124263 -157130 -24923 36951 272803 -38990
9382 49807 123280 -63867 -335724 -69911 36395 -516302 -50402 49079 -103080 -483533 -329876
9371 -329876 103829 -89446 -488654 196151 -134056 -174616 92589 348965 -95772 -178417 -122852
9360 -122852 -167316 198094 -118286 -180490 -9181 -136262 -51052 129171 110755 221293 -378314
9348 -127352 -362803 1107 -157965 -342401 -85434 -91301 -64050 -244761 -145752 -233772 -3254
9336 -89321 -95536 -9920 -1736 -179544 -420207 80441 38956 -42613 -263995 111217 62178 -193607
9323 162886 50898 28917 -75000 -102623 11369 -80165 -163255 138396 109395 -139745 40466
9311 -37631 45391 -103996 -120139 97390 63060 -121188 -110508 -323871 -120797 -242223 -156533
9300 -156533 -140317 -98601 185356 -255515 -311616 -228717 -387509 -121234 -137094 -257979 33248
9288 -130173 -384514 168477 -457674 -303411 -221797 45908 -301167 -67302 -18044 -178726
9278 -178726 -129983 -17608 -46789 -399713 -77700 86619 -388275 -28519 243557 -123126 117934
9266 -162983 -263139 -23557 -54211 -58701 -182192 133117 -190148 -2646 101905 -302810 66376
9254 174065 -122311 -261871 -94288 -292391 -91366 -714 -188245 59263 57489 77399 -161959
9242 -299931 -320790 -341455 293146 -270863 -109057 -86542 -413807 -124467 -129208 9021 111345
9231 111345 -13551 -72441 -127925 -297154 176658 -17308 -132913 -81551 -244458 -242834 -59315
9219 -66437 -165732 147316 -110357 -281776 74727 -219851 77730 -191990 -287546 62852 559236
9208 559236 -355007 -192036 -333691 -383286 14432 86257 -222045 234480 -207043 74151
9197 131121 -375218 -66134 -217548 222923 -265580 -81857 131721 49162 -171719 -280813
9187 -280813 112055 -16139 -101746 281309 -12187 39064 -43330 223333 -223010 136121 -58635
9175 127145 -156547 -329326 -22797 121468 88593 34098 -21748 150398 -285683 -186839 -23777
9163 -42643 -255889 -17569 20583 -247838 12739 -25125 -106271 118466 -139677 -288997 25141
9151 -28208 -130788 124357 217934 49334 -18376 -352102 -98182 164789 -112798 -50255 -242372
9140 -242372 236411 3536 125913 -397431 154044 -252185 -58705 -54711 -159848 -140628 -124522
9129 -124522 -195962 -146301 -219636 -119315 -176298 84944 -154778 -315475 -270584 157532 -214809
9117 -242738 122802 -148519 -496248 -29194 -64014 -92843 -39042 -8675 13433 -21891 -82455
9106 -82455 115306 -122531 -38217 -80023 -50152 -17857 -58713 -368298 -185275 -393107 -254327
9095 -254327 -192926 161107 -172564 111753 126979 102570 -86228 -121272 -45602 175667 2881
9083 159674 -218538 -187199 13902 162472 109381 -11680 107763 -245855 -166100 -114080 80966
9071 128485 -67945 -98289 -38020 46373 137110 -224791 -45392 -82978 -198470 -166724 -225480
9060 -225480 -67764 267645 -122312 -88237 -1978 -97451 -66906 -98684 -215769 -93919 -69210
9049 -69210 -434351 180786 -156914 145908 -119028 91627 -17316 26178 45736 -149780 -26904
9037 -74255 -249592 -239303 -475917 16787 -9208 -50852 51049 39948 90962 48994 -335932
9025 -10089 -1672 -132806 -169586 -34565 -92498 -79126 -75311 -375991 -5793 191195 -293447 -235052
9013 -235052 -15327 -318198 -91748 62586 -133702 -149364 36121 -50011 -42821 -92341 -122934
9002 -122934 -211709 12160 93552 102717 -140219 250278 -159928 -26194 42961 -171406 -4055
8990 -153132 -215340 -11886 233363 -97334 91938 90949 -342762 -43132 250030 -48464 -175218
8979 -175218 -90793 -131131 198210 140823 -10729 20787 32792 -55139 -167803 208437 429733
8968 429733 -232311 -37157 -307464 -340178 -117091 203283 -152478 37184 -439709 92028
8957 -1388 -97371 -107528 -162016 9181 -191112 222265 -280171 -378619 -28082 330448 -45470
8945 -33653 -44518 -138281 -115237 -118711 -97041 224414 -215620 -457203 21067 -314033 218524
8933 43875 -182061 -1512 77958 268391 -36914 -517190 -60507 -45477 160218 134665 62995
8921 -366256 226211 -502199 -171942 182476 178334 69630 164276 -64290 -394914 -322987 -401372
8910 -401372 -123322 -99120 190232 -325277 320 -175301 186608 -10955 -347793 -243434 -106423
8898 -499629 -485759 75904 -289901 -76769 -84222 -329832 111988 -121354 -202055 103335 -123246
8886 196249 -187963 103614 127218 145338 -15471 -78057 115984 90635 21231 133459 -71595
8874 -103216 -37791 -250949 -268235 -45787 -75430 31971 -604625 114790 -303237 234265 -228746
8862 95907 -304495 -101016 -42223 77192 98161 -37642 -490629 -44642 76684 -63542 -61226
8851 -61226 -4472 -188541 -127137 -161811 -213554 202808 -263502 94612 69733 68640 -244673
8839 23927 93435 61157 186052 109756 -120207 -96257 -278840 -153868 -45319 2780 58165
8828 58165 -155367 -98139 124546 -322126 -121841 35398 90950 126661 68275 -80237 -162674
8817 -162674 -79338 53330 90625 -6573 -290437 -8153 -50447 14641 269031 -169833 -191667
8806 -191667 179767 -159750 -76402 -79187 -53464 -235418 -421766 191178 7954 -40688 53986
8794 -8210 -37011 158330 -144418 -626908 -180101 149290 -121663 -225239 -11748 -79387 -147037
8783 -147037 -207504 -265845 -1728 264249 112893 -33826 -6532 -214142 -227014 231250 818 -30557
8770 125073 -34458 218340 -80173 -68270 -458276 -230538 -51082 -149634 167117 116832 -26701
8758 -46936 -195036 109525 274195 141142 -376541 -20847 38185 -117804 -62473 -6970 -254626
8747 -254626 189763 -182268 -3679 99678 211697 -301567 400905 -49148 162385 -245257
8736 -154704 -170156 68573 78681 271417 163317 -147788 363596 60461 -247357 -122132
8725 -294913 -176967 52025 -82449 100972 28230 232031 93331 -205593 60785 -87118 -79567
8714 -79567 -207893 -169931 81751 -74322 37114 214935 -422513 -60342 -50226 82778 -80939
8702 -235694 -47081 -80035 -128048 170343 -144212 -471029 12878 -96414 -341949 -249059 -23588
8690 54099 -129602 -202090 223376 2928 -73781 226560 -312582 -77943 -215348 -160032 335125
8678 133204 -303629 -146724 -124153 -36988 -54655 -28108 24326 -222904 542 -263012 -39576
8666 -44180 190125 -34029 -10290 -43353 -72089 -42542 -96561 -5728 -14478 31723 -12603 -329986
8654 -329986 289270 -32156 219696 73216 72322 167760 -378416 -195185 151460 -32401 -477876
8643 -477876 -132224 -340042 -5834 59372 -185328 361432 -4739 -37932 135935 204698 2698
8631 67469 -46778 24297 154588 217441 -151560 -108711 -95563 -316339 -181366 400638 95273
8619 203806 -66645 -58729 -126363 329980 -45869 -249690 -11799 -431368 -162831 -114398 -102588
8608 -102588 116099 228560 -273009 -202751 72977 117884 68033 6544 -55195 -67756 -175163
8597 -175163 -455941 -262485 238563 -179928 -66087 144298 -453394 -166481 171589 -287992
8586 -87526 -82388 -58317 -112658 211548 1310 384397 -26465 -246194 -327049 153555 295670
8575 295670 -260982 69002 68782 12768 45226 -548809 -114616 64958 139745 -178757 -55816
8563 -232441 -296158 184424 74600 -258037 40147 44227 -346710 -67065 -292082 -82104 144214
8551 41221 -137844 -46788 -12478 -224952 242099 -215022 -236022 -22504 -276147 20928 -231702
8539 127414 59470 -13058 -66314 -99764 -94757 -188253 -154149 -403697 352715 -100401 249045
8527 -105455 -156385 94235 -151107 -32410 -336642 4151 131215 -191316 -210524 94358 104845
8516 104845 -3192 -30444 -1282 -85889 229718 128885 -235182 129913 137159 -145269 164875
8504 78917 -36784 65345 100105 42645 -258147 -76451 -158857 79357 -458 177408 -3436 -96777
8492 -96777 210285 156369 248809 124236 -82217 -55603 305988 128385 -266547 97724 -577863
8480 -48199 -152205 121860 5180 -217718 98499 -81485 -61424 230975 94431 -55469 210453
8468 42517 -206547 -31967 -117001 -400727 -102175 -95688 -37729 -51110 185329 -270082 -33059
8456 51133 45380 -75570 48532 61616 -27238 5876 42735 354510 275459 90113 -28062 224981
8443 333802 -162776 -247224 56666 85648 -57996 293487 29497 77701 15116 -32130 60684
8431 -241067 1442 -165031 21091 -103459 -143448 -66776 8850 171084 62433 27818 -570241
8419 -204379 -85691 131356 174703 -233915 67195 -212813 -198008 -142595 61813 -173485 -138638
8408 -138638 157775 189319 -94507 -1038 -168371 -290516 16761 -226283 126060 -59117 -92293
8397 -92293 344589 -206981 108152 -255586 48061 166424 -106314 -148987 -398652 3354 -213025
8385 -115147 25505 127017 2920 -388153 219487 13566 25468 127536 40343 123601 229171
8374 229171 68442 -443249 -7074 -193118 -123737 61979 93044 -424575 224537 3911 -48233
8362 -38610 -147403 -226959 75025 289826 -107099 159472 68527 83110 341978 19616 198281
8351 198281 -290519 104200 32968 -55093 -43546 186843 -24855 -62233 -14007 -12699 83438
8339 -4713 -141490 -337340 97008 -349524 53818 -81045 232138 116676 -229608 -314462 -273181
8328 -273181 269299 95182 -359409 -124307 -157679 174392 123817 8845 -42189 179385 122920
8317 122920 -57796 202092 -132446 -104919 31462 87530 -237426 40106 61376 17994 -461950
8305 -144031 11799 -57594 -449734 -245400 -138844 -133129 -157846 -244818 171003 69442 11542
8293 37805 -31738 44239 37363 9490 -93932 214248 -60177 176561 -70876 -233123 116957
8281 143293 -98551 184703 -51197 11410 -147907 154790 -246290 -148357 -185120 -130041 134108
8269 -124733 118717 308919 154407 -129567 175564 242190 -25110 -110707 -118683 -358185 -208112
8258 -208112 119200 -163105 -329559 -129574 -85819 19988 69546 -259012 -85107 -64916 21870
8246 -47411 -87419 -111784 -103115 191928 -230367 -169202 314224 38304 276933 -330582 -18302
8234 -5326 174399 274954 55012 -154275 -207137 -200819 -87747 288235 38277 24462 -401496
8222 278084 -290283 90558 -102282 -50163 254533 -270072 2942 85898 -83935 218878 -58465
8210 -54422 -18066 -184645 -143872 -274 -11374 -154255 -230777 -296849 -178864 -30402 304412
8198 164727 111033 207385 -267449 107453 -208605 13566 232630 -14904 -187017 -137160 -142193
8187 -142193 -448019 53673 -38356 -104353 -143962 310913 69906 -110133 -122930 197705 -240993
8175 120252 102225 -1018 178599 -42040 179043 -249603 98352 -130674 -116856 -55413 304256
8163 -276614 -104607 -34907 1028 -166993 -176041 77299 -135399 56246 -161902 -191355 49404
8151 -513952 -84211 108825 16096 -55438 44794 25384 4742 -20249 -404623 -150960 206450
8139 70877 -106494 -211960 81305 135058 84786 122197 -70122 -281336 -21527 -175218 -355385
8128 -355385 115597 -247373 209319 -115546 14717 -108713 -82910 -314629 -13139 -189242
8118 -189242 -55553 -72767 -116480 90838 12836 123847 54390 26771 24962 -141564 -26122
8106 -70960 -115306 -77283 206348 -108758 -53728 -207567 -75799 87970 -391183 -120407 -15022
8094 -197333 -32958 296578 134509 -226414 111426 27326 49285 18898 -79651 -321223 -68549
8082 -409802 157671 -330894 -155372 -115472 -23913 -194870 147965 53439 131903 75180 -70610
8070 228116 2612 -302684 -179259 83087 -7934 -75639 -42826 76694 -362074 -20155 -221509
8059 -221509 175669 184295 -93774 -265665 204894 -42175 -122029 218976 11490 342188 -70500
8047 -144636 14357 -64489 -40601 -161489 -40229 -239611 29869 -304313 132985 -215596 3440
8035 -221077 -103333 236501 -325973 565 -284331 -47560 -188301 -176303 73196 -10061 -319828
8024 -319828 -84339 169986 71349 -65930 198329 -316337 -45674 75052 43753 453352 251981
8013 251981 -202928 -40160 -253066 -85382 -146560 -231003 -188944 7692 22883 84626 -141847
8001 -151266 62338 1772 168617 -230884 -147479 104127 -134769 171308 -192739 250849
7990 -72645 -173322 21366 18054 -229793 -174260 -152330 112061 -48809 -246658 17012 -220181
7978 -37474 -99296 254925 -239079 149896 129306 -97846 -232459 -160359 156400 -176054 147722
7966 60651 -324050 -164915 -65835 -425454 -26163 20415 111495 -105875 141882 -124673 -295859
7955 -295859 97467 83270 14579 113468 -40041 39374 106356 -54512 -215585 -45753 -93822
7944 -93822 -368781 47596 -132341 -220083 -32688 -161147 -95512 119737 -65587 -204375 -25156
7932 -165571 70591 212336 -422699 50134 250879 -268655 201849 -259441 -205550 -294552
7922 -294552 126883 64113 -435167 151977 -1626 -182110 49498 -60256 -150603 -221665 -488868
7911 -488868 162159 -191659 -158041 -41772 -109793 -3584 -132170 156858 53072 -145775 -48594
7899 -3797 147814 291103 77100 344843 -74827 198806 -214114 125777 155575 -274474 58628
7887 -86618 101682 124612 304932 -131041 -75692 -122656 254878 9775 170104 -154139 -25017
7875 114479 -175986 -63189 126588 100518 -190616 -302545 -48398 -39908 133260 -418546 -242530
7864 -242530 -38114 87542 -75661 -39321 -520922 -295428 196177 75707 -181788 289176 360157
7853 360157 78617 -48200 183450 -143073 -47193 399463 259816 -46602 -239262 157435
7842 192320 -145740 -41453 48156 6199 -45175 2609 26311 150075 -16001 -94808 -246047
7831 -246047 -202109 -262350 -45852 213956 -43973 -278549 -498225 -347681 -255679 87363 56865
7820 56865 -130573 311230 -148780 39856 210750 -162306 -451030 106697 -80956 -38086
7809 126979 55317 -152071 -49713 -198272 -506345 181035 45587 216406 -39666 -281250
7799 -281250 100749 -194082 42933 -309402 176589 112028 176168 -5191 91015 14754 -209857
7787 -295544 -13242 -144715 370929 -297402 -410127 36840 -245982 -277832 -397147 -117104
7776 -67054 93182 -48141 -99476 -276047 -227460 -245759 112105 56500 -196745 -369881 -56640
7764 -287739 261662 -83633 -125388 219176 -1174 233400 -94932 -112588 -28120 -170968 -23269
7752 -48348 221282 -239029 -366547 -23234 -177333 -275282 -114244 -45111 -39201 -191527 -38636
7740 206648 -293015 -89699 -72173 147 3796 107403 150526 -350711 -139054 188560 -446501
7728 135073 267129 12013 -263211 3866 -236975 -170336 106306 -131831 -94973 -322461 -209847
7717 -209847 -77437 169497 148729 48399 112093 -102741 -84256 85026 115072 136840 128131
7706 128131 232347 340911 -160568 -4341 -113760 -76153 -101104 -9865 -226295 -272425 -116172
7694 -7641 158810 -180104 99289 147625 -303285 189799 -241351 -348372 131529 -192334
7683 107404 288340 222223 116224 247474 -75285 -111754 37723 -22333 7575 209514 19068
7671 14783 42789 95959 -76892 153063 -92824 89993 -24246 -359722 -188292 -99736 -139190
7660 -139190 -174843 -394420 148383 -105905 92461 -217722 -142759 -35522 -359900 -98091 49532
7648 -53491 -130110 300070 57427 -27994 82584 -191720 93826 151882 -144541 -65566 -158294
7637 -158294 -12754 -75684 -154299 -227421 17720 -162408 -17598 -300382 61537 36400 -151839
7625 -157715 -22675 -103598 161623 -268207 -69107 12345 81964 109495 -176290 -184053 -169141
7614 -169141 226482 -314376 -212033 -91187 79512 -28959 89611 63399 -315870 379487 -197066
7602 -99085 225200 169209 -251795 -320249 213638 56753 43017 -106488 34048 177667 12660
7590 51879 158113 -580674 -154598 -60916 69913 -41837 -124808 -41881 -157819 -201649 -79900
7578 29126 -166874 -448176 -172976 27346 35942 241739 -51872 24759 -46447 -14937 -48660
7567 -48660 -99636 -11394 61894 -202704 -100997 -165056 -146699 102542 -51892 173151 -132455
7555 -150074 24672 -164496 -156069 3230 -148691 -37386 -47495 -90481 114997 -33383 361784
7543 -42301 -184850 114935 -138518 -115312 -42405 -358589 83901 -76304 -129726 -233469 42297
7531 160350 -341539 1760 4292 -14890 199322 -44064 194925 164919 153279 45635 -116150
7519 -292655 36581 -118942 -248234 -166115 -128213 103965 -101123 33406 -220405 -46552 138860
7507 40331 30385 -43574 63676 40467 64340 102158 -14196 -21902 389899 -301038 -18010 17036
7494 -284632 226954 138889 99095 487302 63075 -158379 213463 117124 -114609 -213321 33912
7482 207956 -96498 52958 -148559 303134 156088 -243001 -231070 132603 -86737 141463
7471 -158651 -94183 -173294 -367342 -327985 -131732 117856 -232532 -58925 -132364 370430 -249144
7459 191627 -225510 -109508 -311305 69966 14497 187767 -251558 75185 -127981 42074
7448 -76289 -39005 10185 -176623 103727 -33003 139430 -250337 -211638 -20487 -96964 127356
7436 12557 201091 -35545 -115034 27648 -166692 -152317 23164 -57964 -177984 -205037 -218192
7425 -218192 55940 -191078 -169561 -127260 30899 -61996 -117575 245696 -243746 218389 161985
7414 161985 102127 -233826 -397064 70394 205221 142736 294274 -29498 -291194 182762
7403 -6579 34048 -150091 -15275 14661 125715 -244973 -227832 -118866 -234059 4097 -61106
7391 17315 -291778 124091 81905 -135117 -49590 -20894 -255097 -58822 -43380 -264441 -41569
7379 -134958 -123552 128532 -51517 -66417 66489 155734 -96333 -34958 -292136 74564 273400
7368 273400 -259696 -160901 -1301 185578 220078 -140900 -108135 -114212 -29922 32351 -109084
7356 130438 4215 -187986 -189540 -26559 -111130 -122751 142613 11372 -79510 66003 -152186
7344 193505 -130393 64766 210023 -150116 -18575 -300002 -211989 -225684 -7114 -150991 -108536
7333 -108536 -4929 -7837 26520 323084 -134221 -341828 -12201 -11166 -120510 -92388 -41940
7321 -113006 -167045 144095 230862 -36265 -255995 288958 313554 146855 -339270 196578
7310 295375 -213872 441016 -59384 -24878 -280411 -81711 -289778 3382 -274920 94077 17924
7298 92810 -68702 -106057 37115 -166267 105156 -181126 177450 28299 -88721 -137511 172242
7286 -92156 59615 151567 131722 -118969 -138948 -74832 -304737 219516 -84664 -46340 -109593
7275 -109593 145896 66234 115182 101349 269159 307818 -36165 -229404 263432 4993 195971
7264 195971 -90264 -215817 196632 174361 30648 90620 223429 -245249 44466 -146970 -203541
7253 -203541 -115234 51032 -227230 -268668 -271067 184826 79300 57137 -87880 -272458 -21627
7241 -92254 -56661 -223120 -193272 -268585 93099 106347 -329954 -187296 -63747 -127353 111209
7229 -288436 -234862 -398805 16149 -80734 -122469 -173603 -43675 -252912 -35573 -11469 72254
7217 2601 78329 -18916 99686 -321176 -149976 -279620 -24062 325313 -78061 180058 -165500
7205 -150330 -225288 -41984 -328525 -21685 121324 51551 116474 50167 -69181 330938 -370256
7193 -419083 -37582 -297071 87224 -48367 -3090 -110620 -105932 -214242 49951 -199043 -17754
7181 103536 34548 -203837 -154841 -39800 244122 10517 241706 472507 96937 -65715 32707
7169 -28162 143218 -239160 55373 -176751 -49277 321986 -108580 108141 -222400 46752
7158 -169536 219943 88586 255007 -20052 51743 -149501 -165695 -304116 -10291 15920 252057
7147 252057 -67942 38241 275305 148181 -94620 300738 -146970 -155441 -150635 -46578 46076
7135 184593 91856 -3877 -2412 -85715 105699 -27167 56406 92530 -153011 170790 -65067
7123 -153109 -55317 -76842 -63385 -38395 -70047 120188 -195348 -295293 28619 -251513 219598
7111 -56822 -9839 35700 -116014 362825 99397 -260813 -243769 -439969 -43255 -14040 166828
7099 -350737 54972 -166901 79695 -244045 -123203 -134701 314677 418687 -177030 -88865
7089 -88865 13335 112604 -209575 -109133 -75535 2916 164445 -105409 82115 -97606 184299
7077 3359 -172493 100291 -32824 -267598 -62489 -117468 -133550 95277 66206 -296917 -223268
7066 -223268 -131642 -165879 133141 -14558 44130 -48650 48196 75710 141529 -221474 -265741
7055 -265741 9529 16783 -260528 130287 155361 -155047 121327 59155 40772 11093 -210501
7043 252638 113356 -98684 250865 195865 100764 98169 -44806 135187 -193358 147115 -11466
7031 16392 -78927 77901 280284 -72911 -146566 -181596 34661 -252051 -205020 -103426 -103849 197698
7018 -91467 -278002 -50724 -139990 -395006 361789 -243354 -220723 21659 54898 110038 -51141
7006 -47716 -155920 -173334 166874 -78905 244578 -125353 -128979 99736 219477 275261 -152870
6994 144909 41534 95608 -13525 -264934 32741 -129247 -54490 -79214 12310 142092 209011
6983 209011 -54553 17050 205593 -120992 -137703 282165 37004 -59815 116445 -53019 -376648
6972 -376648 113241 -158648 181380 -347466 -9830 -201784 -111362 209568 82784 36049 -272996
6960 131728 -102918 55147 176243 79395 298651 25299 219344 81515 101855 -167396 -324106
6949 -324106 -37192 -199129 -200791 86515 164329 309916 -62314 8505 127029 139227 44612
6937 -43646 39900 -120035 94634 -59924 -357970 94794 -117437 16902 -227379 88032 151156
6926 151156 291421 183329 203213 89869 -310924 -159627 -224210 70565 127645 -239494 47392
6914 44760 60130 -410140 401746 -236824 4115 -118473 257235 -30338 -176608 288917 312591
6903 312591 -242857 199671 -141662 221764 -248993 -122295 -7688 -393161 100752 -370967
6892 115761 -320029 63101 -279916 -42034 -120437 -315627 -36677 62144 -515071 75166 105730
6881 105730 -180837 -808 87810 -15635 -164084 182736 -194672 252209 52068 -245213 24628
6869 -36202 -267276 -54360 -348903 -158223 44527 -5111 46214 606 -118625 -265988 267859
6857 135058 66865 21302 -11338 -53515 -259928 -290753 -147234 -269759 63524 50673 -126943
6845 -49184 94345 -215417 -136572 84239 -229901 143058 217222 -50015 65557 -315431 -113502
6833 313576 -17304 -63134 152298 -80791 12031 112687 41341 101563 -29223 -163681 -88022
6822 -88022 326972 175693 388127 -24204 -12795 121898 -157395 127304 -277805 162649
6811 -184524 57379 -201537 74548 80111 -81841 121315 325194 18827 -36916 140483 198901
6800 198901 97154 -101234 13865 -97878 -124669 -28704 138296 -35944 -20590 -9432 -7452 267976
6787 -334143 -129169 -219232 86167 216738 21934 -249278 -46036 -164606 77333 -166656 368445
6775 124389 22019 -449683 -94468 -266134 -229082 -38425 -163127 -215299 136438 -76489 149680
6763 -12819 -464514 242857 241476 190718 -31183 -57812 -110662 -152646 -100035 156957 101799
6752 101799 -305026 -28701 -417350 114727 -136558 -56806 -63468 -29521 -126568 -128081 43451
6740 -63214 93488 197920 237591 141818 -48349 139771 -3401 -283453 -96513 9366 -257333
6728 -83038 318351 -70703 -73575 -47568 12058 211210 171929 -140224 229269 184206 143575
6717 143575 2309 78454 -8322 -281437 -77045 85735 84663 67964 -47364 -164047 12025 146859
6705 146859 118694 207250 8033 -157009 246796 15307 353329 -9567 -106522 258768 120269
6693 -255480 -512806 87239 -235676 110191 139796 -97205 260085 -175616 192863 -133115
6682 215310 -222351 -192950 -125736 -100763 -99454 158071 -60664 -220786 -80163 -21967 133710
6670 -12455 205729 8499 -60598 121708 -138 -109302 -17704 -157234 45521 -144966 -364227
6659 -364227 78379 -166420 -58036 -30313 -29780 162233 -94236 154265 -46100 -346742 79402
6647 -109146 -165500 -255424 -343783 -57122 -184199 23647 396666 34672 -402774 -248127 -48411
6635 -1264 -231277 -178454 42870 121667 103164 234478 30895 -100083 -50053 -171918 -266824
6624 -266824 -171634 -152842 -16093 -187723 209428 -133293 -104220 -201207 -50916 328169 214166
6613 214166 -166290 241054 36742 -53541 -105771 117718 -57157 109226 -127889 156552
6602 -1443 326965 -71165 30769 218349 -84942 88127 134314 48487 455455 320702 -209294
6590 -184921 -63324 316065 -315824 -152507 142866 31093 281894 222393 -15189 15887 -281333
6578 78223 -275224 372972 -51337 4633 23458 -169894 113569 -150165 11429 -179426 130771
6566 -4270 25606 -125827 37336 78861 139937 -229912 -37806 -44940 3369 57470 -47139 -101966
6554 -101966 194551 56412 -8521 21463 -60031 -199865 93413 -230534 -85900 202705 7508
6542 -28109 -104010 -315443 74440 -85595 504442 -184232 136954 -115525 123443 160218 -87218
6530 -196525 -121659 83324 6624 -229800 -318761 458560 -89400 88547 175576 169036 -65822 -263689
6518 -263689 138550 86656 16503 -170411 170609 -54828 58932 -209203 57574 -125336 -101801
6507 -101801 -101526 -194108 -265205 96488 -152378 -243951 -62129 73330 -449483 -277122 87944
6495 -48257 -122098 -40291 -181867 -104853 46313 -114671 -23373 -151199 219769 269519 -364357
6483 -73138 -114519 -21012 -195307 69547 -77947 -246891 -187755 -18190 -157970 203513 204909
6472 204909 156187 75170 -122632 160039 162457 -314432 -9234 -16763 120927 99445 -60816
6460 326985 -285790 164779 140476 -308630 314093 -199076 -239781 -142010 -95257 -181720 -257489
6449 -257489 -44694 28291 319834 -221260 96992 10984 -352783 400761 151812 182260 -135021
6437 113602 410835 -274197 -87324 -44869 187709 -56158 90246 -241023 254779 185366 -183447
6425 392625 -92018 11958 124891 -179484 -149826 312342 -135941 -242062 -150427 -89753 -108717
6414 -108717 220991 -132126 -194558 -260598 -52006 -238559 -15068 -185825 -466935 -231115
6403 -52296 -185527 90784 -17508 -4056 -213644 -153646 102048 -149892 17219 332024 1290
6391 -66678 -239591 38267 197802 -150615 215191 -83982 111684 98238 -168121 -114211 -73329
6380 -73329 -109905 80582 29857 -279094 -67514 -22750 126592 -21613 -34268 -13859 163172
6368 55173 33688 -153316 -177429 -19926 -171049 -109450 107961 -375523 -145007 -212513 234881
6356 141942 -238372 68314 -195871 -154609 -12021 -260190 -119159 104768 98415 88827 -367315
6344 -194384 -8169 -122269 97555 -184296 -51647 131582 -288050 -293404 -78154 148516 -172596
6332 87982 -115943 -26773 -229123 176369 31667 295953 -139954 -245632 152549 -167963
6321 -201282 220470 -5465 -334976 -253336 16923 109344 1134 153963 -112262 72100 144634
6310 144634 -90336 -55616 -232613 118206 366650 179262 168653 -224709 13522 -202020
6299 -106937 -2775 -186354 23453 188675 -262751 85012 -15766 -193740 -58496 300400 13046
6287 33335 6632 21299 55839 2694 -132278 43156 -111928 -105133 -67667 -84410 -43413 -232276
6275 -232276 79115 358701 -110858 -275131 -283787 158407 -2814 -459701 -325411 -14892 6386
6263 284081 144051 -204349 -35925 -307371 31751 -27093 -181058 -134495 81753 -153338 221771
6251 -233144 -293108 138036 -314491 -75169 44686 -261192 112224 39930 126280 -66895 -72387
6240 -72387 35067 321051 -387 -256314 -279882 172302 -159564 -18239 -227371 -344058 162939
6228 213999 122104 -40530 68107 -174478 68903 -46251 164141 3596 -95419 -305308 -70344
6216 -60799 230603 141542 94819 -270250 148119 -157622 236982 346826 -282021 -136835
6205 391412 273558 -140407 -135659 -137394 -207611 -133033 -128554 964 54 299268 74098 398592
6193 398592 -119542 112790 -139854 99187 -42348 36317 -3199 -196193 855 439 -125612 5656
6180 -15872 -33601 8357 -168891 -169323 126885 -89561 40228 135289 -201903 184407 -23964 157748
6167 -52277 -207749 -261666 -143541 363538 175448 -106383 -244706 83173 -415391 -89152
6156 -36348 -141136 -160521 -101348 222228 -69524 187336 -33265 -163946 3558 -145029 -40486
6144 -244896 9985 -142715 -85368 228928 -513810 301829 77370 118176 301170 -1418 154788
6132 -253108 122198 182875 55986 -172190 -338572 134728 133123 -75660 295387 286180 43265
6120 -185587 253372 406270 -83723 -348678 -87400 -7108 -247117 130386 -84522 -161390 -108334
6109 -108334 -153957 -148560 -188944 143029 53616 -344740 -34941 -103845 -30601 -229142 -50698
6097 -33559 -255425 17242 -105138 -261052 -24383 -251973 53601 1361 19253 178985 -302327
6085 -133207 -279143 281892 155248 294919 554832 -44482 -134988 -180924 47955 137065 -36079
6073 52409 30230 54232 -3492 49071 44007 180008 -71272 45597 63760 17367 -60399 380702
6060 -31679 146880 146403 -94919 -432759 -84362 -182332 -158422 134283 43108 -374375 161992
6048 -70013 -35177 291854 144891 -64444 -215685 79525 -196181 -143542 -208357 -369456 -293329
6037 -293329 -169889 -200677 -33653 -275000 -65031 -150686 -84334 -96963 323461 32643 19687
6026 19687 -30623 -132553 183741 -59687 108237 188992 15400 -69463 47310 60163 94904
6015 94904 -271363 -198679 -11678 160330 60969 77202 362266 -218339 179201 -187808 191390
6003 -108276 -42800 -64249 33172 -143261 215921 66454 12076 -282639 -201437 -112913 -22663
5991 91775 342454 -69129 -68905 70501 -109143 -126046 -167189 271853 -105967 126758 81504
5980 81504 -274791 18259 156993 -139658 137161 63932 356298 207038 -10256 -261967
5970 -261967 -58959 -76167 30735 -25376 306429 -92052 -104520 57713 -306829 -177671 -142007
5959 -142007 -259923 117664 -121708 -82852 -287622 157784 27095 76298 -74880 -405402
5949 -405402 -93233 128223 226988 21551 39475 28426 216417 327958 114158 127218 86453
5938 86453 -51035 125666 328568 -55620 131051 39779 -33522 -78794 -33023 122119 -103716
5926 234324 -73563 118978 33225 -226282 -128708 248343 81859 100788 88727 68792 -37056
5914 112020 -67976 3172 -226435 269170 -7635 -157580 -173207 7446 -219046 352705 179376
5903 179376 70216 -43176 163404 69243 189835 -259593 -104663 -158364 41876 -15287 182584
5891 2759 -123751 -37089 -367457 27399 135095 -19033 -74819 -205987 -257293 -130169 78371
5879 -317226 -21670 -275300 -12700 -174817 -77991 141837 -121595 -298015 231707 95022
5868 -12607 134458 77199 -71429 -107592 51842 -319917 -182603 73736 -96679 -37128 -82864
5857 -82864 118876 259185 267224 98196 152925 332298 -6017 273072 244764 197741 -66044
5845 -10739 193042 228186 -1916 18373 -64554 34259 -29773 205133 -310936 44391 -262768
5833 -125158 165027 174420 -284125 -208903 319817 230945 -70063 83110 -83422 -4443 93889
5821 -309614 -56500 419718 25874 21055 -21208 261478 119696 -129792 -264047 -37748 -23149
5810 -23149 -381267 -71892 -184641 184009 -271476 61411 248296 -47012 -216171 15623 -464311
5798 23139 -63457 -147737 72725 -74868 311717 149131 -331667 227761 -241451 65082 -166360
5786 140466 -81049 110447 -153015 137309 182202 178052 21613 161427 -169544 -84945 184496
5774 -105543 279892 100030 -74002 -132506 132245 156503 389498 295428 -8380 80656 -84577
5762 77838 -345491 -194022 -605 10919 40792 -160174 277141 -174651 643 44885 -43822 221854
5749 -258153 166958 -159034 -169705 111960 39046 -108653 -229163 46253 -150783 -285562
5739 -285562 97088 83397 -37202 109687 160007 -110029 -492187 55628 408909 145765 -168791
5727 31220 -40316 94160 74569 148706 -228395 -46410 -22639 233402 -137195 -178614 112894
5715 183799 -12188 31617 112688 -26128 -223741 232512 -176844 -58301 49857 -27131 86746
5703 -113457 -258043 10105 -182839 228429 -272779 44802 -124860 -107977 -49985 -7047 -112395
5692 -112395 -15777 503636 -40319 172876 -32673 176297 7792 370369 254864 -235967 -16970
5680 28137 -189065 -78516 69825 -74548 141399 221789 34805 -118328 232149 -181446 -314356
5669 -314356 -54469 129767 -122287 324778 -17836 -143916 -174074 -73941 339352 283264 -95248
5657 -114086 -217396 145638 -35096 -310195 -21477 209767 226307 -97313 192592 160827 -340709
5645 66783 -31485 198833 -171275 235397 -159667 -67231 36997 -247960 -56295 145775 47892
5633 579878 -518846 67148 -114322 27650 127387 -103647 -108034 225386 17910 110290 -138254
5621 362 -16624 -35060 244591 9922 -152452 -310471 86122 145936 259724 -383 -71817 -15939
5608 -93671 -131219 -157532 -214214 38133 -108253 287154 -205032 -4942 175709 -222786 -213360
5597 -213360 -128472 175463 -228773 -83715 270170 351485 58263 -156531 -28489 -78151 -253439
5586 -253439 188912 -10156 -313469 278747 -164834 175809 104313 272387 -122117 -491 -97201
5575 -97201 191826 -27935 -48958 -85799 54877 -353803 -220226 108308 -147271 163156 -11062
5563 246439 3424 -62914 23353 -66729 -1820 -170373 -129420 -110422 -43461 -325934 139923
5551 137609 169674 -343667 90129 -285841 -71602 267507 -106472 -272770 -388394 232828
5540 -112833 1813 -169482 -32008 -149295 -169181 -65669 -108895 99637 -25622 -161478 200145
5528 216873 137706 -57368 -88707 -169519 65288 20231 90302 -202632 144903 59020 122121
5517 122121 29750 69408 -61082 48312 -150185 10280 -287632 77068 25660 -116787 228657
5505 141631 -122154 321 104173 338814 23204 -268564 -104093 310877 143728 -37518 -138364
5494 -138364 373564 -65980 825 -31562 3771 -103507 -150151 116091 162534 -57057 -114528 313182
5481 321011 36085 237457 254295 -78161 -169847 71386 45432 -169528 -155361 -244317 -12289
5469 -185985 -33010 -140617 -107193 96412 149441 -154946 134483 -40309 54146 90909 75993
5458 75993 123921 53387 97447 -494842 91779 -113597 -61365 -29193 -7253 235442 163955
5447 163955 241276 -11865 68612 -121200 -215571 -14119 200623 -203951 14448 5266 3094
5436 3094 123501 -113578 107784 137053 -216457 -243645 -53551 -74257 -217634 -18483 -34171
5425 -34171 76404 -47984 158499 8755 212912 -69090 75884 -222164 50130 84527 -65126
5413 94846 275155 -10858 -272417 58358 153281 -100084 367571 -76082 -117905 70588 -92777
5401 111969 -203048 -173723 69907 -92272 -264581 -18070 -91157 86912 -111774 276820 -317513
5389 114568 392916 -22211 -26129 -207834 8725 143709 -165328 284852 126859 298644 204861
5378 204861 -6766 86064 -45463 -36504 -137459 391123 -175729 -74217 50010 87630 -196676
5366 198267 104070 -427094 176879 -181551 456335 -123132 -280370 -52228 449172 -44224
5355 -181441 -110313 103725 121676 -98876 154127 -342655 -49019 217901 -38409 -78665 -118596
5344 -118596 165202 -66796 -100178 -144297 58931 168630 260885 -104497 162769 287185 -107239
5332 -29002 -142968 -169241 51657 -278222 -90284 -219948 14524 200978 199188 -77755 -57614
5321 -57614 -50635 -237228 53507 80910 8768 170599 185084 396777 -235264 -13283 -115112
5310 -115112 75329 -98939 -67601 -256112 29316 -337338 159231 -78377 -160965 60754 -361553
5298 193348 -56050 121583 76442 123396 161261 36279 -10213 409532 142261 -150207 -62918
5286 229308 165950 -63198 422844 160004 -184089 133086 -50532 155015 -62078 1856 152606
5275 152606 50335 127058 93557 111084 40631 1514 285865 80197 -113795 52692 -179528
5263 221445 110018 -146653 -110077 6269 -113268 -30600 518797 -61768 -284320 311961 84086
5251 -145945 168471 -31021 224878 78632 467893 -127654 75475 194221 59458 -110563
5240 179480 -106367 96500 32721 -166946 105383 303800 9068 -93755 -189914 1414 360683
5229 360683 -295819 67488 -38265 23376 -105499 -85220 -48031 -33633 41834 147731 -371755
5217 114577 -96677 170161 242654 -388475 91114 400185 156602 -322687 291168 180765
5207 180765 79441 113938 12866 53455 274658 -224797 -200471 247291 276072 132173 -132663
5195 282694 77516 -95768 481690 -67220 -25215 -254575 -591301 -452051 126668 65777 -44041
5183 -168070 230030 -180215 -49463 228031 92383 205275 -110291 -332564 -214539 -178287
5173 -178287 43781 -237159 9446 -75968 114537 125893 -51992 -101030 -22632 -166 85699 5271
5160 -112136 -227977 -148505 90993 -197379 -170157 169345 312303 -191974 25943 101381 -200293
5148 42400 24674 -1077 197292 -71157 -110731 77047 208163 302126 244324 -77665 132207
5136 -78246 -126612 172273 285297 301886 -43758 -65794 153910 -137165 -26838 89025 -73913
5124 8758 215307 -201902 -100065 -332438 162156 -24968 -96337 30351 89099 -4890 229547
5112 -87189 444098 -138134 -182683 -185911 -133049 -119064 -115236 -55981 -49628 -157491 -43024 -312140
5100 -312140 81225 309765 -305337 166164 203577 120283 -254582 79404 276301 185776 2070
5088 88875 -80672 -227230 155376 -200108 -111764 -170416 -134817 -21753 -25153 102404 -97995
5076 -19577 137718 1519 202548 113715 -42460 26825 270696 -395314 -85301 -131377 5315
5064 -458408 271962 92692 -76063 20153 175477 5241 81788 -109064 -35790 125763 93876
5053 93876 95596 258398 70424 74322 74651 152614 -4264 68687 -7453 -190815 96255 -70966 -237519
5040 -237519 143468 162795 67338 -216688 -266882 -192248 38254 94957 56577 118859 -54530
5028 -159356 42320 79003 259780 171589 -42201 -87050 -257372 118045 28266 -241773 39617
5016 104710 30765 262866 171120 54762 -106344 85355 58991 20524 -2009 17721 41290
5005 41290 -101928 85519 254195 -86104 161405 -269933 6045 7127 270498 -201170 -31348
4993 4873 -181451 90332 -8534 32369 -90817 140171 -70782 152898 -277147 26999 -29200
4981 -67979 -7697 83023 50457 -47494 -15426 72235 193417 -161938 -19157 268332 -91712
4969 -143573 114755 299360 -259283 -122077 293799 275663 -54721 75444 -479093 -184839
4958 316641 14969 -22814 4646 -199532 34324 80273 -146531 144344 -61193 -8686 -141970
4947 -141970 46454 -52506 -77798 85418 70259 -62675 95159 25052 -254462 -61657 -21632
4935 195930 129544 -34576 52281 42681 -183133 -197614 165131 114296 -217443 211769 235223
4924 235223 130901 -9958 122080 -13808 284404 47010 -231271 -158855 -83639 8408 58237
4913 58237 -319470 -356222 -144042 34286 -23443 -117839 -261566 -201092 54215 -229511 -138226
4902 -138226 -202208 135155 -115085 -98338 -141229 45012 99807 -54564 -234482 194335 -34366
4890 -253294 -61086 -93057 -163621 155048 -144469 -21062 318154 310375 -32808 247220 31784
4878 -116697 48671 176668 -11730 -193340 -118515 -116868 558325 -217578 64801 158032 -165302
4866 79923 127714 24855 44356 52549 105899 44244 244601 285269 -251700 -354148 -41219
4854 201504 110359 189270 -217126 -77393 88287 -175802 -20126 152384 134992 240302 6140
4842 206818 -108512 181913 -50615 -171655 62737 40161 -83355 -161766 -161230 150525 -222421
4830 130735 -327388 2933 -86490 -43425 -225512 32608 157459 -306799 -502997 375530 232681
4819 232681 11210 -179993 353874 -123219 -130031 45053 -201089 152798 -98747 -53663 198955
4807 -142678 129428 -119693 -236006 231898 47502 35671 -42774 -247112 270687 148356
4797 148356 -177189 -218319 -156831 93536 -35355 188769 304355 -11789 -80283 327327 39684
4785 338537 340374 61949 420736 23972 -105649 165608 89395 108953 -63317 40630 111611
4774 111611 -405630 -196752 -10380 -320974 -224582 199461 -146099 54836 -29188 50060 -83898
4762 -282264 120886 147703 61797 -216879 -85860 -40220 -189593 -29330 149016 -40221 -230325
4751 -230325 125431 -3125 83618 122346 1051 -188047 -33201 -226645 27398 -133159 199165
4739 -522879 329870 51716 34612 -138223 118661 -131754 -100204 -336701 117692 87653
4729 87653 194405 126183 -49992 241530 -77114 135233 150921 -107199 -139325 274099 15691
4717 -260014 -121659 -173705 -446754 -56044 -95314 -38406 -67348 60550 51400 -120505 -146256
4706 -146256 -85419 -25924 -129354 19394 36179 -93835 -68461 86081 -34120 -173549 -24259
4694 -206955 88378 161146 118613 14241 183262 20177 218015 133717 -91453 91117 30177
4682 78139 -157775 -416485 -10516 71639 154300 -65987 405189 -41512 -210806 -247185 387933
4670 228554 -9403 -126944 297274 -206392 -57273 18407 -39650 76306 188069 195960 -164516
4658 40558 -30562 -16824 255240 128009 111452 40593 171327 179139 47734 -81984 -210144
4647 -210144 -128378 -44303 89093 -19857 -117833 217937 -82750 91112 179562 -65497 23607
4635 206161 -323960 -190118 -131302 287631 -47330 139066 56638 -24938 282545 -149162
4624 133399 -153417 -81786 -139376 -65150 -86339 52837 174264 -62673 -153899 36388 121849
4613 121849 -113693 134611 -295773 -145688 -165109 153462 -61925 297807 -75882 165522
4602 88142 50329 346 156158 195591 33769 26165 -123834 34047 45906 -182717 -86464 84394
4589 -279354 50163 73097 176024 -196781 -136656 -66387 -141769 -68133 400379 55950 74462
4578 74462 -105734 13160 123318 -25533 144770 -97575 -46220 -24322 -107216 416808 -63189
4566 -223348 34526 -213658 63714 -39569 116728 253859 -151508 30139 -27250 58529 -91175
4554 -188751 -91063 191812 77563 -117491 104423 514 127103 -183164 113213 -199535 -251676
4543 -251676 -350866 -192051 90235 -87957 -161684 -363403 167504 -335942 -31812 253542 276014
4532 276014 66696 -55724 138569 40749 -27804 -159403 31377 61286 -132505 938 292074
4521 292074 194353 211368 -50975 263014 -43381 -142465 170612 911 -217966 63650 12258
$$ [...]
##END NTUPLES=NMR SPECTRUM
##END=
