##TITLE=AC1535_ROEFFECT0009_8214612_rDq8SoKwYn
##JCAMPDX= 6.0         $$ Bruker NMR JCAMP-DX V2.0
##DATA TYPE= NMR SPECTRUM
##DATA CLASS= NTUPLES
##ORIGIN= BRUKER
##OWNER= Administrator
$$ 1.72 TOPSPIN		Version 2.1
$$ 2014-08-05 00:49:37.570 -0700  Administrator@X
$$ Compression mode = diff/dup
##.OBSERVE FREQUENCY= 400.02188249412
##.OBSERVE NUCLEUS= ^1H
##.ACQUISITION MODE= SIMULTANEOUS (DQD)
##.ACQUISITION SCHEME= undefined
##.AVERAGES= 64
##.DIGITISER RES= 22
##SPECTROMETER/DATA SYSTEM= spect
##.PULSE SEQUENCE= noesygpps1d.comp
##.SOLVENT NAME= COFFEE_meoh
##.SHIFT REFERENCE= INTERNAL, COFFEE_meoh, 1, 14.97757
##AUDIT TRAIL= $$ (NUMBER, WHEN, WHO, WHERE, PROCESS, VERSION, WHAT)
$$ ##TITLE= Audit trail, TOPSPIN		Version 2.1
$$ ##JCAMPDX= 5.01
$$ ##ORIGIN= Bruker BioSpin GmbH
$$ ##OWNER= Administrator
$$ $$ E:\/data/COFFEE/nmr/AC1535_ROEFFECT0009_8214612_rDq8SoKwYn/22/pdata/1/auditp.txt
$$ ##AUDIT TRAIL=  $$ (NUMBER, WHEN, WHO, WHERE, PROCESS, VERSION, WHAT)
(   1,<2014-08-05 00:49:32.227 -0700>,<Administrator>,<X>,<go>,<TOPSPIN 2.1>,
      <created by zg
	started at 2014-08-05 00:38:02.960 -0700,
	POWCHK enabled, PULCHK disabled,
       configuration hash MD5:
       16 EA D6 F4 BB 67 03 14 9B FF E7 A0 43 5B 48 2E
       data hash MD5: 64K
       AB 53 33 59 E0 8F 04 BD 86 B2 A6 41 B5 4B CF 85>)
(   2,<2014-08-05 00:49:35.074 -0700>,<Administrator>,<X>,<proc1d>,<TOPSPIN 2.1>,
      <Start of raw data processing
       efp LB = 0.3 FT_mod = 6 PKNL = 1 PHC0 = 0 PHC1 = 0 SI = 128K 
       data hash MD5: 128K
       CB 63 B3 96 04 B6 83 CE 12 5C FA 99 7E 70 97 24>)
(   3,<2014-08-05 00:49:36.299 -0700>,<Administrator>,<X>,<proc1d>,<TOPSPIN 2.1>,
      <pk PHC0 = -87.85767 PHC1 = 0 
       data hash MD5: 128K
       BC 60 15 57 7E 8A D6 6A 34 67 E0 28 FC BE 59 06>)
(   4,<2014-08-05 00:49:36.712 -0700>,<Administrator>,<X>,<proc1d>,<TOPSPIN 2.1>,
      <abs ABSG = 1 
       data hash MD5: 128K
       67 EB A5 F0 19 49 03 63 F1 3E 65 0C 56 D9 93 69>)
(   5,<2014-08-05 00:49:36.820 -0700>,<Administrator>,<X>,<proc1d>,<TOPSPIN 2.1>,
      <abs ABSG = 2 
       data hash MD5: 128K
       07 E1 19 F6 F7 2C 63 35 3C 20 AF C5 EB 5D 7C 65>)
(   6,<2014-08-05 00:49:37.141 -0700>,<Administrator>,<X>,<proc1d>,<TOPSPIN 2.1>,
      <abs ABSG = 3 
       data hash MD5: 128K
       61 9C 5D 37 0E 74 C9 2B CC 60 B8 9B 57 EC 92 1D>)
(   7,<2014-08-05 00:49:37.248 -0700>,<Administrator>,<X>,<proc1d>,<TOPSPIN 2.1>,
      <abs ABSG = 4 
       data hash MD5: 128K
       2F E4 13 31 81 37 DA AA F4 21 19 29 30 9D FA 2C>)
(   8,<2014-08-05 00:49:37.356 -0700>,<Administrator>,<X>,<proc1d>,<TOPSPIN 2.1>,
      <abs ABSG = 5 
       data hash MD5: 128K
       B2 DB 13 62 B8 21 41 87 7C 16 08 BA BC 27 7A 00>)
$$ ##END=
$$ 
$$ $$ hash MD5
$$ $$ 78 8E 52 84 15 99 DB 10 CA 90 84 6D CF 49 B8 B3
##$RELAX= 
##$RELAX= 
##$RELAX= 
##$RELAX= 
##$RELAX= 
##$RELAX= 
##$RELAX= 
##$RELAX= 
$$ Bruker specific parameters
$$ --------------------------
##$DU= <E:\>
##$EXPNO= 22
$$ [...]
##$TP07= 0
##$TPNAME0= <>
##$TPNAME1= <>
##$TPNAME2= <>
##$TPNAME3= <>
##$TPNAME4= <>
##$TPNAME5= <>
##$TPNAME6= <>
##$TPNAME7= <>
##$TPOAL= (0..7)
0.5 0.5 0.5 0.5 0.5 0.5 0.5 0.5
##$TPOFFS= (0..7)
0 0 0 0 0 0 0 0
##$TUNHIN= 0
##$TUNHOUT= 0
##$TUNXOUT= 0
##$USERA1= <user>
##$USERA2= <user>
##$USERA3= <user>
##$USERA4= <user>
##$USERA5= <user>
##$V9= 5
##$VALIST= <valist>
##$VCLIST= <CCCCCCCCCCCCCCC>
##$VD= 0
##$VDLIST= <DDDDDDDDDDDDDDD>
##$VPLIST= <PPPPPPPPPPPPPPP>
##$VTLIST= <TTTTTTTTTTTTTTT>
##$WBST= 1024
##$WBSW= 4
##$XGAIN= (0..3)
0 0 0 0
##$XL= 0
##$YL= 0
##$YMAX_a= 17751345
##$YMIN_a= -30629833
##$ZGOPTNS= <>
##$ZL1= 120
##$ZL2= 120
##$ZL3= 120
##$ZL4= 120
##$ABSF1= 14.97757
##$ABSF2= -5.580612
##$ABSG= 5
##$ABSL= 3
##$ALPHA= 0
##$AQORDER= 0
##$ASSFAC= 0
##$ASSFACI= 0
##$ASSFACX= 0
##$ASSWID= 0
##$AUNMP= <proc_prof1d_extract.lims>
##$AXLEFT= 0
##$AXNAME= <>
##$AXNUC= <1H>
##$AXRIGHT= 0
##$AXTYPE= 0
##$AXUNIT= <>
##$AZFE= 0.1
##$AZFW= 0.1
##$BCFW= 0
##$BC_mod= 0
##$BYTORDP= 0
##$COROFFS= 0
##$CY= 15
##$DATMOD= 1
##$DC= 0
##$DFILT= <>
##$DTYPP= 0
##$F1P= 0
##$F2P= 0
##$FCOR= 0.5
##$FTSIZE= 131072
##$FT_mod= 6
##$GAMMA= 0
##$GB= 0
##$INTBC= 1
##$INTSCL= 1
##$ISEN= 128
##$LB= 0.3
##$LEV0= 0
##$LPBIN= 0
##$MAXI= 10000
##$MC2= 0
##$MEAN= 0
##$ME_mod= 0
##$MI= 0
##$NCOEF= 0
##$NC_proc= -4
##$NLEV= 6
##$NOISF1= 0
##$NOISF2= 0
##$NSP= 0
##$NTH_PI= 0
##$NZP= 0
##$OFFSET= 14.97757
##$PC= 1
##$PHC0= -87.85767
##$PHC1= 0
##$PH_mod= 1
##$PKNL= yes
##$PPARMOD= 0
##$PPDIAG= 0
##$PPIPTYP= 0
##$PPMPNUM= 2147483647
##$PPRESOL= 1
##$PSCAL= 4
##$PSIGN= 0
##$PYNMP= <proc.py>
##$REVERSE= no
##$SF= 400.020003009639
##$SI= 131072
##$SIGF1= 0
##$SIGF2= 0
##$SINO= 400
##$SIOLD= 131072
##$SPECTYP= <>
##$SREGLST= <1H.CDCl3>
##$SSB= 0
##$STSI= 131072
##$STSR= 0
##$SW_p= 8223.68421052631
##$SYMM= 0
##$S_DEV= 0
##$TDeff= 65536
##$TDoff= 0
##$TI= <>
##$TILT= no
##$TM1= 0
##$TM2= 0
##$TOPLEV= 0
##$USERP1= <user>
##$USERP2= <user>
##$USERP3= <user>
##$USERP4= <user>
##$USERP5= <user>
##$WDW= 1
##$XDIM= 131072
##$YMAX_p= 391979935
##$YMIN_p= -108120015
##$CURPLOT= <Network HP LaserJet P1505>
##$CURPRIN= <$Network HP LaserJet P1505>
##$DFORMAT= <normdp>
##$LAYOUT= <+/1D_H.xwp>
##$LFORMAT= <normlp>
##$PFORMAT= <normpl>
##$SURQMSG= 1
$$ End of Bruker specific parameters
$$ ---------------------------------
##NTUPLES= NMR SPECTRUM
##VAR_NAME=  FREQUENCY,     SPECTRUM/REAL,   SPECTRUM/IMAG
##SYMBOL=    X,             R,               I
##VAR_TYPE=  INDEPENDENT,   DEPENDENT,       DEPENDENT
##VAR_FORM=  AFFN,          ASDF,            ASDF
##VAR_DIM=   131072,        131072,          131072
##UNITS=     HZ,            ARBITRARY UNITS, ARBITRARY UNITS
##FACTOR=    0.0627417313425164, 1,          1
##FIRST=     8223.62146879497, -6499,        -410457
##LAST=      0,             26084,           -413859
##MIN=       0,             -108120015,      0
##MAX=       8223.62146879497, 391979935,    0
$$ Real data points
##PAGE= N=1
##DATA TABLE= (X++(R..R)), XYDATA
$$ [...]
63395 4269265 4266875 4262222 4258935 4258312 4258541 4257249 4253879 4249950 4247934 4249254 4252283 4253073 4249568 4244446 4242007
63380 4242007 4242902 4244056 4243434 4242212 4241979 4242544 4243588 4246130 4250856 4256752 4262817 4269624 4277671 4285421 4290487
63365 4290487 4292016 4290894 4288557 4286470 4285666 4285812 4285751 4285699 4287407 4291267 4295079 4297220 4299250 4303442 4309064
63350 4309064 4313264 4314601 4313803 4312323 4312531 4317923 4329891 4344637 4356558 4364829 4373468 4384602 4395382
63337 4395382 4403048 4409471 4417875 4427647 4435932 4443087 4452849 4466816 4481756 4493580 4502148 4510972 4523413
63324 4523413 4540230 4559970 4580492 4600354 4619570 4638992 4658536 4676416 4690764 4701721 4711197
63313 4711197 4720801 4730993 4742081 4754495 4767361 4778234 4785725 4791597 4798655 4806845 4813148 4815288 4813845
63300 4813845 4810349 4805173 4798081 4789196 4778399 4765349 4751341 4739582 4731849 4726014 4718672 4709305 4699956
63287 4699956 4691701 4683810 4675931 4668666 4661831 4654350 4646253 4638800 4632235 4625564 4619150 4615394 4615756 4618893
63273 4618893 4622934 4627977 4635051 4644075 4654229 4665109 4676104 4685723 4693118 4699374 4706004 4713087 4720217
63260 4720217 4728151 4737700 4747781 4756488 4763646 4770405 4776657 4780809 4782149 4781700 4780726 4780260 4782055 4787547
63246 4787547 4795031 4799914 4799143 4793898 4786751 4777896 4766124 4752273 4739099 4727690 4716110 4702335 4687023
63233 4687023 4672396 4659304 4646606 4633179 4619491 4606873 4595793 4585166 4573311 4559429 4544325
63222 4544325 4529770 4517002 4505716 4494727 4483854 4474756 4469185 4466364 4462911 4455976 4446097 4436498 4429903
63209 4429903 4426385 4423724 4419049 4410675 4399637 4389587 4384076 4383462 4385186 4387111 4389403 4392458 4394358 4392018
63195 4392018 4384779 4375708 4368987 4366546 4367311 4369182 4371309 4374452 4379246 4384569 4388411 4390348 4391953 4394193
63181 4394193 4395826 4395874 4396544 4401225 4409446 4416345 4418170 4416421 4415087 4415535 4416256 4416527 4417732 4421133 4426652
63166 4426652 4434288 4444697 4457457 4470401 4481802 4492111 4502584 4513320 4523705 4533717 4543571 4552955
63154 4552955 4561711 4570419 4579020 4586038 4590904 4596158 4605098 4617575 4630385 4641864 4653669 4667463 4682236
63141 4682236 4696055 4708462 4719716 4729564 4738594 4749534 4765152 4785490 4808651 4833414 4859278 4884740
63129 4884740 4907813 4928547 4949442 4973087 5000458 5031147 5063654 5095420 5124440 5151421 5179217
63118 5179217 5209709 5242351 5275709 5308798 5340436 5369058 5394269 5417404 5439575 5460168 5478193
63107 5478193 5493954 5508136 5520056 5528297 5532796 5535017 5536045 5535541 5532760 5527897 5522138 5516667 5511627
63094 5511627 5505908 5498212 5488629 5478909 5470878 5464836 5459838 5455249 5451657 5450324 5452052 5456547 5462838 5470201
63080 5470201 5478370 5486760 5494333 5500976 5508150 5516899 5525911 5533441 5540841 5551673 5566702 5582159 5594224
63067 5594224 5603154 5611630 5621254 5632615 5646400 5661350 5672683 5676214 5673683 5670599 5668749 5664296 5654051
63054 5654051 5640230 5627225 5616373 5606136 5595479 5584612 5573459 5561803 5550566 5541085 5533068 5524596
63042 5524596 5514247 5502408 5490545 5479874 5470534 5461541 5451770 5441387 5431735 5423431 5415418 5406658 5398043
63029 5398043 5391475 5387352 5383991 5379650 5374556 5370758 5370097 5372097 5374003 5373481 5371315 5370514 5372761 5377091 5382459
63014 5382459 5389678 5399320 5409022 5414954 5415699 5413281 5410779 5410473 5413998 5422166 5433835 5446066 5456355 5464462
63000 5464462 5471911 5480157 5489234 5497785 5504649 5510888 5519793 5533999 5552774 5572808 5591364 5608016 5624009
62987 5624009 5641151 5660947 5683344 5706175 5726970 5745528 5763896 5783778 5804876 5825744 5845464
62976 5845464 5864486 5884493 5906980 5931064 5953355 5971247 5985904 6000654 6017222 6035213 6054435
62965 6054435 6075137 6096234 6116303 6136760 6161062 6189671 6218591 6244358 6267892 6291756 6316378
62954 6316378 6341565 6369564 6403374 6442965 6485644 6529331 6573344 6617291 6661902 6710074 6764166
62943 6764166 6822647 6881966 6941245 7002094 7064148 7124417 7181819 7239172 7299201 7361080 7422332
62932 7422332 7481866 7539442 7594151 7645402 7693991 7740286 7782390 7817756 7845762 7866943 7880357
62921 7880357 7883660 7876116 7860357 7840619 7819552 7796844 7771000 7742374 7713698 7686853 7660155 7630680
62909 7630680 7598767 7567813 7539543 7512424 7485609 7461190 7440575 7421490 7401532 7382628 7368557
62898 7368557 7359263 7351114 7342341 7334735 7329820 7326735 7324854 7325618 7330180 7337105 7343906 7349510 7354351 7359430
62884 7359430 7366123 7375323 7385489 7392767 7394283 7390587 7384041 7375766 7365059 7350696 7331580 7306812 7276407
62871 7276407 7241788 7204854 7166707 7127371 7085859 7040148 6988396 6931381 6873007 6817250 6764998
62860 6764998 6714593 6664679 6615361 6567187 6520521 6475869 6433551 6392670 6351339 6308380 6264373
62849 6264373 6220855 6178851 6138232 6098155 6057978 6017889 5978651 5940736 5904097 5868825 5835499
62838 5835499 5804528 5775538 5747659 5719942 5691490 5662148 5633581 5608711 5588981 5572537 5555825
62827 5555825 5536640 5515175 5493012 5472107 5453875 5437770 5421031 5401349 5379718 5359299 5341459
62816 5341459 5324568 5307077 5289956 5274907 5261431 5247254 5231153 5213880 5196333 5178321 5159770
62805 5159770 5142207 5127926 5117650 5109624 5101316 5091726 5081840 5073096 5065658 5058136 5048705 5036677 5023285
62792 5023285 5010837 5000751 4992507 4984819 4977336 4970312 4962878 4953127 4940570 4927478 4916929 4910133 4906288
62779 4906288 4904207 4902955 4901355 4898126 4892933 4886971 4882511 4881582 4884164 4887427 4888064 4886037 4884823 4886927
62765 4886927 4890635 4892802 4893455 4895359 4899712 4904772 4908539 4910414 4910045 4907238 4903907 4903789 4908729 4916695 4924508
62750 4924508 4931086 4936958 4942306 4947106 4952112 4958136 4965062 4972735 4981908 4992976 5004572 5014836 5023477
62737 5023477 5031326 5038484 5044460 5049719 5055609 5062740 5070709 5079463 5089856 5102710 5118148 5135723 5154395
62724 5154395 5172695 5189998 5207548 5227161 5248921 5271177 5292757 5313965 5335088 5355031 5372093
62713 5372093 5385605 5396558 5407284 5420611 5438368 5459877 5482098 5501564 5516365 5526781 5534930
62702 5534930 5543800 5555451 5569291 5582402 5592268 5599376 5606888 5617667 5631634 5646174 5659325 5672424
62690 5672424 5689048 5711227 5737498 5765206 5793891 5825265 5860341 5898138 5937550 5979094 6023956
62679 6023956 6072020 6121966 6173204 6227090 6286001 6351277 6421611 6492923 6559939 6618816 6669046
62668 6669046 6712980 6753259 6790614 6824289 6854173 6881210 6904907 6921566 6926961 6921033 6908242 6892612
62656 6892612 6874089 6850942 6824019 6796351 6769153 6740623 6709083 6675433 6641765 6608954 6576603
62645 6576603 6544437 6512842 6482509 6454177 6428302 6404497 6381741 6359451 6337926 6317452 6297492
62634 6297492 6277175 6256239 6235240 6215034 6195985 6177176 6156606 6133112 6108227 6085168 6065653
62623 6065653 6048648 6032604 6017616 6004503 5992934 5981862 5971104 5960940 5950454 5938058 5924074
62612 5924074 5911462 5903275 5900301 5901628 5906306 5913330 5920933 5927740 5934798 5945193 5960857 5980384 6000549
62599 6000549 6019596 6038545 6059664 6084198 6111481 6139903 6168880 6199767 6233957 6269589 6301458
62588 6301458 6325712 6343995 6361022 6378027 6390763 6394702 6390188 6381036 6369688 6355707 6338007 6316117
62576 6316117 6289352 6256898 6219595 6180454 6142581 6106980 6072518 6037419 6000626 5962300 5923257
62565 5923257 5883981 5844733 5806811 5772464 5742334 5713775 5683304 5650404 5617421 5586046 5555828
62554 5555828 5526391 5499143 5475673 5455423 5435830 5414364 5390334 5365516 5343032 5324677 5309360
62543 5309360 5295139 5282362 5272942 5266518 5259599 5249591 5237971 5228274 5222128 5218417 5215195 5211239 5206509
62530 5206509 5201970 5198197 5193571 5185214 5172564 5158649 5146572 5136097 5125102 5113143 5101593 5091076
62518 5091076 5080762 5069975 5058919 5047944 5037597 5029303 5024563 5023287 5023833 5024568 5024578 5023348 5021058 5018924
62504 5018924 5018045 5018050 5018060 5018743 5022026 5028767 5038004 5048680 5060825 5074763 5090322 5107464 5126892 5149449
62490 5149449 5175097 5202431 5228847 5251687 5270088 5285630 5300390 5314622 5327048 5336961 5344850 5350976
62478 5350976 5354560 5354547 5350426 5342351 5331296 5318982 5306931 5295680 5285430 5276538 5268295 5258212 5244528
62465 5244528 5229265 5216839 5209302 5204353 5198110 5188473 5175975 5163112 5152886 5146019 5139367 5129041
62453 5129041 5115268 5101973 5091474 5082602 5074877 5070816 5071625 5073554 5071858 5066551 5060819 5055074 5046552
62440 5046552 5034638 5022715 5013672 5006582 4999358 4992350 4987402 4984748 4982702 4979790 4975841 4971405 4967146
62427 4967146 4963753 4961707 4961048 4961538 4963000 4965686 4970676 4979433 4991975 5005696 5017326 5026429 5035953 5049013
62413 5049013 5066174 5086103 5107338 5128593 5148811 5168274 5188645 5210443 5231203 5247784 5260043
62402 5260043 5270549 5280894 5290227 5297605 5303572 5308168 5309080 5303679 5292437 5278968 5266981 5258203 5252659
62389 5252659 5249082 5244579 5235560 5220406 5201071 5181374 5163756 5147788 5131261 5112325 5091154 5070260
62377 5070260 5052911 5040523 5031412 5022340 5011034 4996855 4979708 4959644 4938011 4918014 4903006 4894008
62365 4894008 4889252 4886191 4883675 4882158 4882143 4882872 4882699 4880590 4877005 4873243 4870115 4867350 4864114 4859934 4855342
62350 4855342 4851758 4850498 4851516 4853241 4854019 4853698 4853533 4854743 4857626 4861866 4866932 4871949 4875989 4879054 4882310
62335 4882310 4886542 4890499 4891459 4887762 4880546 4872777 4866572 4861412 4854862 4845154 4833224 4822126 4814382 4810152
62321 4810152 4808103 4807467 4808476 4811064 4814237 4817110 4819760 4822434 4824605 4825609 4825736 4825744 4825624 4825004 4824795 4827196
62305 4827196 4833551 4843036 4853734 4864030 4872643 4878935 4884273 4891687 4902345 4913128 4919743 4922119 4924806
62292 4924806 4931745 4942420 4953656 4963389 4971504 4978394 4984305 4989834 4996064 5004203 5015109 5028485 5042347
62279 5042347 5054273 5063503 5071067 5077912 5084394 5091709 5101629 5113820 5125411 5134676 5143218 5152792 5162170
62266 5162170 5169841 5178144 5191279 5209831 5230642 5251873 5274643 5299118 5322850 5344745 5367700 5394891
62254 5394891 5425453 5456103 5485469 5514459 5543205 5569835 5592037 5608663 5620493 5630524 5642333
62243 5642333 5656491 5669448 5677731 5682353 5687094 5693051 5697252 5696558 5690637 5680859 5668687 5656172 5645887
62230 5645887 5638680 5632478 5624505 5613842 5600952 5585944 5568756 5550219 5531514 5513092 5495447 5480257
62218 5480257 5468842 5459651 5449308 5436582 5423495 5411804 5400257 5386743 5371607 5357043 5344249
62207 5344249 5333379 5325744 5323679 5327616 5334925 5342202 5347485 5350171 5350590 5350289 5351029 5352540 5352641 5350292 5346689
62192 5346689 5342320 5335166 5324025 5312086 5304585 5303494 5306582 5310969 5315138 5317870 5317965 5315653 5312388 5308936
62178 5308936 5305521 5303891 5306782 5314394 5323395 5330502 5335419 5339224 5341676 5342018 5341785 5345184 5356062 5374354
62164 5374354 5395313 5412923 5425216 5435930 5450047 5468758 5490410 5514769 5542827 5572773 5600344
62153 5600344 5624266 5647596 5671838 5693352 5708342 5718385 5727647 5736789 5743289 5746366 5747938 5749227
62141 5749227 5749592 5748367 5745133 5738534 5727711 5714795 5703247 5693583 5683316 5671288 5659325 5649024
62129 5649024 5639473 5629135 5617953 5606543 5594876 5582662 5569832 5556298 5542540 5530405 5521549 5515125
62117 5515125 5509103 5504033 5502625 5504609 5504942 5499358 5489765 5481754 5478123 5477453 5478273 5481387 5487320 5493948 5498707
62102 5498707 5502114 5506911 5513303 5516913 5513252 5503719 5495241 5493429 5497605 5503187 5507087 5509255 5510765 5512968
62088 5512968 5517732 5525793 5534788 5541059 5543593 5544259 5544473 5544202 5544429 5547517 5553767 5560178 5564500 5568807 5577091
62073 5577091 5590455 5606262 5621370 5634842 5647964 5662494 5678726 5695189 5710823 5726654 5743387
62062 5743387 5758044 5766257 5768607 5771178 5778094 5786791 5793151 5797874 5803813 5809450 5810087 5804998 5798730 5794534
62048 5794534 5790463 5783252 5772819 5761274 5750038 5739828 5731369 5724197 5716187 5706091 5695440 5686572
62036 5686572 5679855 5674222 5669289 5665286 5661697 5657676 5653353 5649273 5644997 5639784 5634458 5631043 5630443 5631760
62022 5631760 5633865 5636160 5637631 5636994 5634676 5633206 5634306 5636702 5638249 5639254 5641578 5644730 5645214 5640628
62008 5640628 5632581 5624390 5617443 5611476 5607089 5605423 5605460 5603885 5598367 5589534 5579294 5568879 5559281 5551972
61994 5551972 5547607 5544854 5541642 5537014 5531048 5524104 5517367 5513077 5512527 5514276 5515818 5516431 5516824 5516745 5515427
61979 5515427 5514284 5516362 5521910 5526964 5528220 5527674 5530162 5537244 5545999 5553552 5560163 5567148 5574094 5579954
61965 5579954 5585668 5593573 5604146 5614824 5622508 5626261 5626857 5624456 5618013 5607271 5594601 5583932 5577487
61952 5577487 5573730 5568763 5559855 5547651 5535121 5524594 5515674 5505641 5491729 5473435 5452903 5432884
61940 5432884 5414168 5395437 5375759 5356401 5339289 5324284 5309197 5292375 5273946 5254499 5234198
61929 5234198 5213884 5195428 5179704 5165240 5150231 5134963 5120762 5107421 5093543 5079111 5065753
61918 5065753 5054227 5043280 5031399 5018474 5005537 4993979 4984866 4977454 4968565 4955636 4940710 4928938
61906 4928938 4922070 4915912 4906063 4894035 4885155 4881727 4880999 4879316 4875626 4870761 4865705 4861339 4858058 4854812
61892 4854812 4849733 4842419 4834630 4828442 4824875 4824553 4827858 4833280 4837018 4836071 4831492 4827329 4826364 4827840 4829232
61877 4829232 4828978 4826970 4823449 4818663 4813498 4809335 4806623 4804052 4799793 4793373 4785748 4777791 4769833 4762932
61863 4762932 4759285 4760153 4763937 4767619 4770111 4772942 4777336 4781992 4784864 4786407 4789478 4795831 4804003 4811468
61849 4811468 4817816 4824520 4832129 4839530 4846215 4853236 4860862 4867227 4871297 4875848 4884732 4897579 4910103
61836 4910103 4920050 4929900 4942478 4956645 4969389 4979932 4989060 4995880 4998482 4997629 4997067 4999797 5006038
61823 5006038 5014923 5025867 5037547 5047789 5055918 5063893 5073739 5084813 5094812 5102802 5110030 5118297 5128658
61810 5128658 5141445 5156245 5171409 5184446 5193663 5199515 5204110 5209355 5215559 5221730 5226947 5231176 5234893
61797 5234893 5238494 5242356 5247069 5252944 5259199 5263878 5264890 5261550 5255463 5249719 5246564 5245736 5245523 5245160 5245189
61782 5245189 5245553 5244823 5241987 5237792 5233660 5230393 5228728 5229687 5233063 5236801 5239323 5241506 5244824 5248718 5251745
61767 5251745 5254302 5257775 5261503 5263362 5263639 5265847 5272850 5283984 5296564 5308483 5318704 5327012 5334246
61754 5334246 5341521 5348824 5355870 5364488 5377890 5396570 5416939 5435301 5451481 5467190 5482608 5496340
61742 5496340 5507438 5515668 5520803 5523218 5524474 5526060 5528427 5532139 5538275 5546100 5552160 5554244 5555119 5559562
61728 5559562 5567989 5575754 5578903 5578284 5577426 5578427 5580632 5581674 5579127 5572536 5564417 5558099 5554267 5550934
61714 5550934 5546724 5542202 5537490 5530894 5521198 5509454 5496944 5483006 5466859 5450295 5436092 5424180
61702 5424180 5411714 5397103 5381958 5368598 5357592 5348701 5342428 5338872 5336028 5331274 5324581 5318577 5314780
61689 5314780 5311019 5303697 5291955 5278443 5266154 5255859 5247055 5239986 5235225 5231643 5226564 5218655 5209734
61676 5209734 5202767 5198533 5195128 5190439 5184087 5176963 5170125 5164774 5162208 5162391 5162804 5160084 5153356 5145216
61662 5145216 5139011 5135866 5134799 5134709 5134895 5134024 5130332 5123659 5116405 5111464 5109344 5107797 5103906 5096068 5084444
61647 5084444 5070594 5056939 5045735 5037715 5031687 5025784 5019114 5011993 5004863 4997599 4990169 4983412 4978457
61634 4978457 4975388 4973160 4971209 4970445 4971930 4974749 4976138 4974082 4969215 4963766 4959210 4955782 4953912 4954695
61620 4954695 4958157 4961909 4962871 4960488 4957229 4955602 4955479 4954797 4951888 4946221 4937881 4927828 4918322 4911462
61606 4911462 4907065 4903230 4898972 4894784 4890527 4884928 4878119 4872611 4870124 4868931 4866166 4861517 4856614 4851850
61592 4851850 4846218 4839624 4832761 4824812 4814027 4801219 4790305 4784359 4782697 4782537 4781651 4778691 4773092 4766329
61578 4766329 4761688 4761044 4762595 4763068 4761340 4758845 4757252 4756925 4757026 4756121 4753311 4749448 4746396 4744405 4741432
61563 4741432 4735980 4729349 4723841 4720057 4717439 4716190 4716632 4717456 4716775 4714610 4712541 4711243 4710328 4710298 4712228
61548 4712228 4715084 4715630 4712190 4707111 4704432 4705945 4710113 4713800 4714390 4711320 4706648 4703663 4704071 4706440 4707402
61533 4707402 4704131 4696219 4686267 4678603 4676047 4677403 4679056 4679291 4679689 4681797 4684197 4684377 4682342 4680345 4679217
61518 4679217 4676919 4671482 4664170 4658754 4658087 4662093 4668562 4674791 4678377 4677677 4672699 4665478 4658713 4653895
61504 4653895 4651107 4650280 4651303 4652601 4651216 4645690 4638063 4631467 4626168 4619718 4611077 4602599 4597008 4593952
61490 4593952 4591121 4587879 4585881 4586018 4586701 4586344 4586525 4590779 4599816 4609320 4613712 4611811 4607644 4605765 4607025
61475 4607025 4609274 4610747 4611481 4612129 4612937 4614021 4615632 4617673 4619250 4618801 4614762 4606939 4597844 4591874 4591871 4596531
61459 4596531 4601935 4605368 4606786 4607193 4607282 4607960 4610653 4616086 4623256 4630133 4635120 4637824 4639080 4640513 4643562
61444 4643562 4648589 4654956 4661513 4666632 4668574 4667092 4664364 4663149 4664156 4666414 4669794 4675288 4682556 4689052
61430 4689052 4692484 4692895 4691838 4690867 4691345 4693951 4697371 4699089 4698744 4699086 4702117 4705790 4706645 4704648 4702988
61415 4702988 4703663 4705806 4708489 4712612 4718885 4725632 4730060 4730977 4729377 4726971 4725043 4724532 4726402 4731419 4739412
61400 4739412 4748838 4757688 4765068 4771208 4775569 4776199 4772343 4766784 4763709 4764427 4767115 4770663 4776177 4783691
61386 4783691 4789931 4791597 4789644 4788160 4789613 4793257 4797873 4803594 4810393 4816753 4821199 4824119 4826944 4830302
61372 4830302 4834125 4838905 4845356 4852708 4858599 4861258 4861248 4860729 4861453 4863856 4867523 4871778 4875927 4879599 4883092
61357 4883092 4886967 4891132 4894773 4897567 4900495 4904623 4909251 4912490 4914307 4918033 4927260 4941313 4955206
61344 4955206 4964687 4970247 4975307 4981547 4987468 4991120 4992564 4993506 4995887 5001327 5010550 5022344 5033777 5042326
61330 5042326 5047485 5050125 5051380 5052797 5056304 5062496 5069597 5075526 5080628 5086980 5095351 5104370 5112483 5119018
61316 5119018 5123391 5125526 5127660 5133239 5142320 5149850 5150847 5146323 5141793 5140631 5141684 5143661 5148578 5158750
61302 5158750 5172216 5183888 5190873 5194611 5197662 5200561 5202806 5205208 5209273 5214661 5219024 5220821 5221245 5222703
61288 5222703 5226019 5229829 5232465 5233951 5236217 5241620 5250939 5262464 5273182 5281170 5286749 5291395 5296240
61275 5296240 5302023 5309591 5319120 5329021 5336887 5341949 5345713 5349697 5353603 5356734 5360621 5368586 5382082 5398271
61261 5398271 5412173 5421129 5426582 5431733 5438472 5446877 5456403 5466237 5475010 5481952 5488546 5497584 5509923
61248 5509923 5523497 5536330 5548864 5561851 5573440 5580945 5585279 5591028 5601243 5613847 5624278 5630447
61236 5630447 5634032 5637901 5643617 5651050 5659146 5666878 5674032 5681247 5688915 5696171 5701329 5703616 5704441 5706793
61222 5706793 5713066 5723226 5735269 5747332 5758730 5768871 5776470 5781085 5784709 5790391 5799511 5811574
61210 5811574 5826026 5842260 5857867 5869389 5876206 5882211 5892230 5907508 5925502 5943001 5958290 5971213
61198 5971213 5982622 5993717 6005067 6016326 6027037 6036956 6045280 6050721 6053209 6054562 6056502 6059021 6061870
61185 6061870 6066543 6074854 6085765 6095419 6100812 6102483 6103339 6105788 6110337 6116186 6122331 6128065 6132878 6136640
61171 6136640 6140460 6146680 6156569 6167832 6176144 6180265 6184420 6194119 6210204 6228208 6243094 6253418 6261307
61158 6261307 6269794 6280336 6292091 6303376 6313650 6323151 6330512 6332906 6330314 6328113 6332842 6345704 6362172
61145 6362172 6377572 6390763 6402546 6413299 6423161 6432517 6441100 6448018 6453600 6459902 6468538 6479038 6489978
61132 6489978 6500580 6510637 6520295 6530751 6543754 6559246 6574514 6586857 6596329 6604962 6614230 6624425
61120 6624425 6635727 6648488 6662704 6678083 6694472 6711675 6729446 6748084 6767936 6787323 6802253
61109 6802253 6810209 6814026 6820222 6833031 6851127 6870421 6888657 6906537 6925555 6946364 6969206 6994405
61097 6994405 7021208 7046583 7066770 7080992 7092786 7106318 7121780 7136036 7147927 7160710 7178018
61086 7178018 7198921 7218860 7234644 7246660 7256635 7265421 7273498 7281792 7290850 7300030 7308441 7316211 7324252
61073 7324252 7333042 7342075 7350197 7356463 7361184 7366336 7374261 7385633 7399148 7413251 7427323 7440938 7453401
61060 7453401 7465228 7479233 7498334 7522134 7546889 7569250 7589071 7608233 7627899 7647794 7667297
61049 7667297 7685960 7703125 7718201 7731752 7745574 7761291 7779100 7798278 7818779 7841988 7869522
61038 7869522 7901164 7934325 7966254 7996698 8027447 8059051 8089480 8117164 8144030 8173597 8206557
61027 8206557 8240489 8273890 8308147 8344855 8383618 8423796 8466294 8511627 8557872 8602743 8646530
61016 8646530 8690651 8734429 8776173 8816993 8860414 8907598 8955738 9002056 9046997 9092214 9137805
61005 9137805 9183318 9229651 9277791 9327032 9376568 9427869 9482936 9540422 9595845 9646311 9693478
60994 9693478 9741029 9790389 9839762 9886642 9930239 9971520 10011593 10050547 10087798 10123141 10156952
60983 10156952 10189572 10221138 10251970 10282381 10312012 10340309 10367868 10396136 10425335 10454105 10482269
60972 10482269 10512578 10547919 10587408 10626937 10663612 10698480 10735222 10777510 10827203 10883313 10942609
60961 10942609 11002921 11066193 11136602 11215247 11298638 11383467 11471161 11566290 11672000 11788952 11917824
60950 11917824 12060506 12218700 12393004 12583768 12791505 13016087 13256396 13510672 13775519
60941 13775519 14043768 14304541 14546845 14763474 14952169 15115281 15259811 15396144 15533242
60932 15533242 15672987 15809191 15932134 16033670 16108704 16154489 16171088 16163038 16139447 16111395
60922 16111395 16088412 16076400 16077856 16093703 16125149 16174150 16242467 16330897 16439556 16568450 16717506
60911 16717506 16886791 17077690 17293668 17539039 17816928 18129361 18479484 18872826 19315849
60902 19315849 19814129 20372699 20997447 21694463 22466902 23311339 24214927 25153204 26089742
60893 26089742 26980465 27783194 28468444 29026304 29467322 29818032 30111733 30375769 30620088
60884 30620088 30833499 30989524 31056702 31007157 30821970 30495248 30036753 29470760 28830569 28151160
60874 28151160 27462840 26787710 26139944 25528715 24959962 24434547 23945896 23481773 23029429
60865 23029429 22579372 22126759 21672995 21226266 20796483 20387075 19993365 19610273 19238880
60856 19238880 18883212 18543571 18216869 17901995 17600626 17313120 17037438 16772300 16517708
60847 16517708 16271778 16030841 15794166 15565390 15347440 15138663 14935661 14737215 14543343
60838 14543343 14353116 14166141 13984226 13808646 13637132 13466574 13297844 13134872 12979187
60829 12979187 12828068 12678400 12529978 12384266 12241628 12100663 11959407 11816771 11673414
60820 11673414 11531204 11391369 11253582 11117365 10983318 10851733 10720753 10587393 10450121
60811 10450121 10309536 10167255 10025253 9885271 9747336 9609631 9471304 9334480 9201766
60802 9201766 9072978 8946541 8823114 8705085 8592973 8485232 8381450 8282819 8189552 8101187
60792 8101187 8019891 7949614 7890344 7836321 7782060 7727707 7676500 7629639 7586279 7546496 7511035
60781 7511035 7479100 7449012 7420479 7393993 7368850 7344191 7321542 7303699 7290790 7279409 7266023
60770 7266023 7249770 7231759 7213206 7194804 7176962 7160216 7145633 7134165 7124789 7114202 7099754
60759 7099754 7082113 7063812 7046043 7028565 7011782 6996524 6982060 6966833 6951292 6937650 6926443
60748 6926443 6915803 6904822 6895117 6887805 6881202 6873112 6863454 6852718 6839702 6823299 6805513 6790091
60736 6790091 6778127 6766866 6752964 6735685 6717215 6701361 6691552 6688034 6686414 6680389 6666825 6647739
60724 6647739 6627600 6609886 6596253 6587035 6581196 6576419 6570547 6563226 6556010 6550896 6548411 6546379 6540750
60711 6540750 6528831 6512311 6496372 6485255 6479186 6475831 6473580 6472247 6471120 6468094 6461761 6453861 6448442
60698 6448442 6447769 6449437 6448740 6444183 6439234 6437434 6437190 6433738 6425826 6417408 6411884 6407578 6401177 6393509 6388651
60683 6388651 6387869 6387612 6384177 6378010 6372215 6368379 6365290 6360827 6354046 6345988 6339337 6336631 6337807 6339669
60669 6339669 6338514 6333214 6325390 6317224 6309963 6304137 6299859 6296340 6292053 6286306 6280376 6276242 6274128 6272260
60655 6272260 6269409 6266638 6265516 6265393 6264136 6261506 6259834 6260731 6262897 6264375 6265232 6266227 6266376 6264349 6261511
60640 6261511 6260811 6262738 6265133 6267300 6271219 6277364 6282186 6282059 6277995 6274095 6272554 6272413 6272351 6272131 6271561 6270418
60624 6270418 6269800 6271485 6275261 6278510 6279357 6279002 6280036 6283472 6288428 6293749 6298476 6301030 6299563 6293890 6286317
60609 6286317 6279892 6276216 6275501 6277990 6283710 6290636 6294888 6294224 6290546 6287480 6286124 6284856 6282920 6281873
60595 6281873 6282935 6284895 6285724 6284799 6282613 6279950 6278498 6280557 6286153 6291487 6292361 6288968 6285730 6286551 6291434
60580 6291434 6297499 6301964 6304104 6305244 6306945 6308949 6309576 6308609 6308344 6310582 6313855 6315352 6314609 6313379 6312714
60565 6312714 6312537 6313691 6317790 6324619 6331736 6337179 6340817 6342642 6341757 6338093 6333755 6331611 6333233 6338487
60551 6338487 6346037 6353820 6359988 6363872 6365693 6365960 6366202 6369248 6376450 6384844 6389480 6388941 6386333 6384499 6383003
60536 6383003 6380861 6379424 6380386 6382787 6384292 6384451 6384896 6387075 6391342 6397630 6405470 6413565 6420398 6425195 6428141
60521 6428141 6430456 6434367 6441348 6449661 6455114 6455330 6452113 6448932 6447802 6449545 6454740 6462377 6469275 6473269
60507 6473269 6476047 6480836 6488387 6497228 6506536 6515896 6523049 6525316 6523824 6523510 6527796 6535117 6541677 6545945
60493 6545945 6549241 6553211 6558287 6564368 6571829 6581226 6591795 6600802 6605761 6607830 6611488 6619540 6629724
60480 6629724 6638046 6644228 6651306 6660570 6670128 6678812 6688330 6700009 6711955 6721553 6729307 6738120 6749647
60467 6749647 6763256 6778138 6794474 6812178 6829725 6844845 6855952 6862797 6866498 6869364 6874205 6882795
60455 6882795 6894447 6906302 6915587 6921776 6926378 6931103 6937140 6945796 6957943 6972135 6985171 6996215
60443 6996215 7008929 7027353 7050343 7072503 7090539 7106459 7124188 7145186 7168214 7191512 7213893
60432 7213893 7234827 7254581 7273827 7292705 7310826 7328065 7344175 7357821 7367761 7375214 7383075 7391972
60420 7391972 7398824 7400284 7396194 7389031 7381949 7378330 7380750 7388116 7395434 7398792 7399540 7401399 7404835 7407222
60406 7407222 7408002 7410229 7416408 7425677 7436441 7449458 7466390 7486649 7507525 7527011 7545244 7563607
60394 7563607 7583533 7605984 7630956 7657210 7683104 7707998 7732528 7757157 7780527 7799682 7812545
60383 7812545 7820236 7826244 7832608 7837414 7836830 7829319 7816801 7801926 7785732 7768394 7750700 7733455 7716179
60370 7716179 7697899 7679120 7661755 7646766 7632776 7617564 7600289 7581698 7562669 7543526 7524820
60359 7524820 7507791 7493292 7480533 7467710 7454061 7440638 7428788 7418450 7408617 7399022 7390366 7382922
60347 7382922 7375775 7367808 7358745 7349043 7339444 7331042 7324781 7320029 7314385 7306220 7297177 7290813 7288514 7287987
60333 7287987 7286279 7283089 7280169 7278345 7276528 7273505 7269558 7266086 7264237 7263994 7264030 7262598 7259238 7255476 7253206
60318 7253206 7252569 7252479 7253009 7255718 7261147 7267405 7272102 7274444 7274556 7272229 7268100 7265084 7266413 7272163 7279434
60303 7279434 7285889 7291247 7295212 7296397 7294576 7292132 7291601 7293025 7295343 7299054 7305257 7312829 7319326 7324831
60289 7324831 7332249 7342669 7352806 7358806 7361030 7362893 7366016 7369080 7371438 7375330 7383264 7394650 7406217
60276 7406217 7415120 7420898 7425140 7430099 7437072 7445212 7452123 7456152 7457791 7458500 7459121 7460282 7463522 7470428
60262 7470428 7480648 7492013 7502853 7513384 7524713 7537434 7551335 7565602 7578959 7590259 7599145
60251 7599145 7605664 7609480 7610489 7610085 7610595 7613099 7616916 7621550 7627860 7636614 7646677 7655390 7660358 7660954
60237 7660954 7659076 7658352 7661034 7665195 7666491 7663403 7659234 7658144 7660797 7664971 7668575 7670495 7670078 7667947
60223 7667947 7666552 7668063 7672321 7678120 7685242 7693357 7700267 7703771 7704637 7705409 7707050 7709245 7713177 7720555
60209 7720555 7729847 7736998 7740749 7744043 7748956 7753469 7755317 7756138 7758986 7763528 7766688 7767137 7766451 7766080 7765444
60194 7765444 7763373 7759757 7755427 7751473 7748997 7748806 7751045 7755318 7760731 7765580 7767815 7766662 7763412 7760122
60180 7760122 7758088 7757865 7759578 7762179 7763344 7761561 7758024 7755395 7754883 7755511 7756059 7756707 7758806 7763859 7772738
60165 7772738 7784888 7797905 7808385 7813879 7814398 7812381 7811239 7813274 7818345 7824315 7828874 7831063 7831623 7832415
60151 7832415 7835226 7840423 7846881 7853704 7861412 7870397 7878997 7884958 7888731 7893240 7900120 7908210 7916286 7924832
60137 7924832 7933784 7940945 7944742 7946868 7949832 7953173 7954614 7954207 7954654 7957616 7962112 7967018 7973100 7981730
60123 7981730 7992941 8005531 8018132 8029655 8039467 8047814 8055808 8064672 8074891 8085772 8095873 8104630
60111 8104630 8113743 8125660 8140000 8152876 8161048 8165619 8170249 8176896 8184981 8193489 8201566 8207786 8211480
60098 8211480 8214750 8220705 8229436 8237912 8244128 8248957 8253377 8256542 8258097 8260311 8265869 8274580 8283717 8290866
60084 8290866 8295391 8298133 8300879 8305317 8311302 8316666 8319654 8320968 8322668 8326016 8331261 8338388 8346415 8352717
60070 8352717 8355078 8354631 8355297 8359730 8366742 8373070 8376853 8378987 8381861 8387309 8395167 8403287 8409422 8413676
60056 8413676 8418713 8426854 8437353 8447336 8455237 8462078 8469135 8475782 8480538 8483230 8484792 8485783 8486779 8489763
60042 8489763 8496981 8507973 8519483 8528971 8536815 8544491 8552228 8559341 8565260 8569314 8571280 8573325 8579265
60029 8579265 8589805 8600231 8605372 8605633 8605509 8607137 8608493 8607716 8605931 8605165 8606184 8609339 8615069 8622160
60015 8622160 8627356 8628291 8625854 8622857 8621457 8622480 8625981 8631437 8638168 8646070 8655303 8665154 8674109 8680980
60001 8680980 8685098 8685981 8684463 8683597 8686267 8691753 8696578 8698812 8699614 8700936 8704242 8711127 8721771 8732527
59987 8732527 8738928 8742123 8748054 8758325 8766359 8765953 8759847 8755471 8755038 8754748 8752067 8748434 8745297 8742611
59973 8742611 8741874 8745901 8753815 8759917 8759652 8754204 8747605 8741905 8737227 8734273 8733941 8735466 8737327 8739651 8743731
59958 8743731 8749133 8753054 8753483 8752015 8752402 8756344 8761782 8765743 8767906 8770083 8772925 8775296 8777181 8780765
59944 8780765 8787133 8793771 8797255 8797205 8795755 8794339 8792990 8791638 8789806 8785978 8779812 8774309 8773032 8775582
59930 8775582 8778556 8780650 8783645 8788238 8792361 8794648 8796587 8799924 8804382 8809004 8813186 8815269 8813081 8807614
59916 8807614 8803520 8803841 8806602 8808702 8810562 8814086 8818226 8820245 8820225 8820979 8823954 8828221 8833099 8838832 8844656
59901 8844656 8849150 8852844 8857821 8864217 8869739 8873467 8877598 8884054 8891440 8897083 8900673 8904343 8910032 8917911
59887 8917911 8926521 8933580 8937589 8939576 8942241 8946668 8951270 8955159 8960749 8970682 8983021 8992326 8995964 8997131
59873 8997131 9000769 9008326 9017749 9026870 9034818 9040979 9045104 9048774 9054836 9064137 9073913 9080623 9083923 9086864
59859 9086864 9092647 9102189 9114378 9127149 9137928 9144486 9146591 9146619 9147873 9152167 9159003 9166611 9173642 9180259
59845 9180259 9187742 9196661 9205587 9212444 9217162 9221908 9228439 9236508 9245395 9255469 9267043 9279006 9290205
59832 9290205 9301207 9312992 9324771 9335183 9344969 9355887 9367049 9375249 9379700 9383623 9389646 9396084
59820 9396084 9400028 9402296 9406629 9414777 9424840 9434079 9441252 9446462 9451063 9457900 9469322 9484102 9498027
59807 9498027 9508217 9515316 9520934 9525161 9528199 9532663 9541736 9555229 9569262 9580052 9586976 9592003 9597338
59794 9597338 9603861 9611042 9618092 9625540 9635438 9649289 9666046 9682977 9698305 9712001 9724210 9734496
59782 9734496 9743238 9752400 9763687 9776482 9788660 9799155 9808770 9818444 9827697 9835272 9840824 9845379 9850206
59769 9850206 9855783 9862197 9870224 9881147 9895007 9909474 9921333 9929266 9934648 9939448 9944211 9948664 9953633
59756 9953633 9961030 9971627 9983725 9994781 10004043 10012751 10021758 10030028 10036269 10041478 10048598 10059437 10072906
59743 10072906 10086811 10100470 10114645 10129498 10143858 10156585 10167746 10178176 10188475 10198541 10207628
59732 10207628 10214865 10220290 10225333 10231620 10239240 10246843 10253460 10259365 10265036 10270048 10273269 10273661 10270995 10266805
59718 10266805 10264572 10267528 10275623 10285625 10294758 10303045 10311448 10319180 10324348 10326442 10326726 10326607 10326924 10328534
59704 10328534 10332239 10337985 10345071 10353131 10362059 10371051 10378650 10383960 10387393 10390352 10394630 10401637 10411501 10423232
59690 10423232 10436213 10450657 10465570 10477357 10482502 10481731 10479823 10480802 10484607 10488869 10492510 10496623 10502723
59677 10502723 10511199 10521148 10531183 10540539 10549668 10559554 10570527 10582110 10593734 10604825 10614292 10620941
59665 10620941 10624852 10627850 10632481 10640659 10652781 10667294 10681515 10693886 10705315 10717604 10731265 10745979
59653 10745979 10762125 10779687 10796185 10808445 10816858 10825399 10836647 10849303 10861619 10874501 10889297
59642 10889297 10905087 10920759 10937749 10957455 10977108 10991780 11000481 11007160 11015152 11023571 11030381 11036485
59630 11036485 11044599 11055391 11066795 11076953 11086222 11095837 11105443 11113020 11117525 11121026 11126997 11136191 11145281
59617 11145281 11150415 11151269 11150710 11151592 11155240 11161951 11170730 11178970 11184801 11190060 11198621 11211190 11223972 11233699
59603 11233699 11241832 11252019 11264941 11277845 11288263 11296051 11302175 11307691 11314254 11323451 11334574 11344268
59591 11344268 11349708 11351538 11352749 11355139 11358029 11360374 11362813 11366880 11372950 11379887 11386517 11392610 11398441 11404279
59577 11404279 11410450 11417025 11422964 11426409 11426497 11424372 11421799 11419474 11417376 11415981 11415920 11416762 11417185 11416215 11413644
59562 11413644 11409891 11406556 11406267 11410355 11416901 11422703 11426859 11430657 11434439 11437132 11439142 11442891 11449375 11456635
59548 11456635 11462972 11469193 11475672 11479705 11478720 11474553 11471394 11470221 11468403 11464571 11460805 11459406 11460183 11461848
59534 11461848 11464021 11466744 11469719 11472945 11476709 11480307 11482647 11484905 11490486 11500579 11511229 11517044 11517311
59521 11517311 11516697 11520100 11528137 11537450 11543941 11545372 11542104 11536362 11530896 11528045 11529418 11535347 11544204 11553077
59507 11553077 11559977 11565163 11570030 11575454 11581712 11588942 11596477 11602470 11605784 11608170 11613124 11622079 11632626
59494 11632626 11640964 11645552 11647978 11650777 11654961 11659783 11664717 11671205 11681605 11696241 11712364 11726825 11739182
59481 11739182 11751287 11764340 11777556 11789502 11799408 11807009 11812272 11815891 11819261 11823495 11828856 11835297 11842854
59468 11842854 11851139 11859128 11866087 11872574 11880148 11889929 11901294 11912053 11920472 11927365 11935331 11945348 11955273
59455 11955273 11963068 11970327 11980368 11993182 12005069 12013923 12022318 12033974 12049210 12065611 12081414 12096159
59443 12096159 12109468 12121792 12135680 12153593 12174395 12194318 12211684 12228513 12246804 12265438 12281976
59432 12281976 12295772 12307635 12317634 12325192 12331006 12337121 12344900 12354184 12364686 12376905 12390847 12404807
59420 12404807 12416646 12426175 12435182 12444880 12454282 12461770 12467557 12473560 12480997 12489041 12496009 12501117 12504985
59407 12504985 12509242 12515779 12525446 12537085 12548677 12559831 12572050 12585937 12599463 12610242 12618562 12626621
59395 12626621 12635334 12643640 12650971 12658709 12668668 12681221 12695507 12710775 12726900 12743839 12760761 12775661
59383 12775661 12786445 12793216 12799173 12808189 12821378 12836685 12851649 12865593 12879260 12893548 12909002 12925569
59371 12925569 12942282 12957805 12971815 12985645 13001264 13019551 13039317 13057968 13073635 13086880 13099638
59360 13099638 13112436 13124134 13135028 13148188 13165956 13186615 13206710 13225176 13242543 13257470 13267944
59349 13267944 13275685 13285260 13298164 13311545 13323878 13337686 13354394 13370537 13382685 13393275 13407389
59338 13407389 13425286 13442258 13455406 13466935 13480397 13496535 13513497 13529155 13542831 13556244 13572765
59327 13572765 13594246 13618829 13643145 13665962 13687972 13709161 13729011 13748970 13771946 13798884 13827755
59316 13827755 13856009 13882013 13904348 13922480 13938704 13956904 13978316 14000396 14020543 14038844 14056335
59305 14056335 14073010 14089075 14106193 14125416 14144984 14161802 14174417 14183473 14190263 14196148 14202503 14209667
59293 14209667 14216173 14220121 14221340 14221705 14223603 14228358 14235452 14242886 14248701 14252456 14255013 14257456 14261140 14267920
59279 14267920 14278299 14289461 14297549 14302435 14307945 14316580 14326492 14334976 14342415 14350575 14359176 14367014 14375266
59266 14375266 14386715 14401864 14418116 14432895 14445980 14458908 14473481 14490450 14508185 14523173 14533526
59255 14533526 14541646 14551879 14566046 14582914 14601137 14620260 14639198 14656618 14673379 14692075 14713245
59244 14713245 14734140 14752306 14768261 14783248 14796173 14804697 14808312 14808682 14807679 14806614 14806802 14809151 14813076
59231 14813076 14816845 14819211 14820246 14820906 14822335 14825126 14828619 14831452 14833598 14837248 14844530 14854619 14864331 14871642
59217 14871642 14877479 14883796 14890952 14897698 14903110 14907689 14912721 14919028 14926386 14933884 14940895 14947878 14956133 14966625
59203 14966625 14979073 14992272 15005082 15016963 15027931 15038682 15050787 15065947 15084352 15103942 15121880
59192 15121880 15136828 15149375 15160487 15170309 15178763 15186541 15194814 15204172 15214389 15225083 15236212 15247933
59180 15247933 15260387 15273682 15287952 15303424 15320206 15337588 15353525 15365769 15374266 15382056 15392932
59169 15392932 15408310 15426908 15446956 15467456 15487312 15504925 15519869 15534201 15550774 15570151 15589868
59158 15589868 15606725 15619087 15627101 15631857 15635063 15638680 15643766 15649865 15656404 15664338 15675100 15687773 15699029
59145 15699029 15706848 15712974 15720255 15728750 15736596 15744030 15753693 15766281 15778522 15787110 15792900 15799324 15807815
59132 15807815 15816839 15824987 15832984 15842401 15853573 15864985 15874091 15879261 15881841 15885682 15893463 15904013 15914445
59119 15914445 15924061 15934247 15945162 15955260 15964522 15975707 15990984 16008792 16025236 16037537 16045323 16050093
59107 16050093 16054638 16061778 16071996 16082891 16092126 16100227 16109281 16119663 16129589 16137496 16143328 16147755 16151842
59094 16151842 16157565 16166825 16179165 16191771 16202710 16213144 16225333 16239255 16252662 16264239 16275291
59083 16275291 16287878 16302285 16316996 16330440 16342057 16352232 16362194 16373660 16387307 16401400 16413114
59072 16413114 16421847 16430393 16442133 16457777 16475293 16492047 16506059 16516363 16523860 16531522 16542145 16555765
59060 16555765 16570354 16584725 16599286 16614253 16628967 16643250 16657590 16671492 16683447 16693262 16702653
59049 16702653 16712551 16721698 16729219 16736896 16746955 16758939 16770913 16782952 16797069 16813841 16831203 16847079
59037 16847079 16861675 16876628 16892885 16909812 16925720 16939286 16951199 16964055 16979642 16996669 17012414
59026 17012414 17026382 17040891 17057876 17076585 17094899 17111757 17127849 17145062 17165681 17190923 17219339
59015 17219339 17247490 17273136 17297360 17322852 17350431 17377972 17402785 17424599 17445857 17468877 17492984
59004 17492984 17515180 17533942 17551280 17570103 17590508 17610192 17627880 17644392 17660373 17675151 17688479
58993 17688479 17701543 17715265 17729158 17742875 17757337 17772964 17788246 17801829 17815022 17830305 17847757
58982 17847757 17864864 17879662 17892447 17904329 17915864 17927584 17940449 17954851 17970069 17985349 18000844
58971 18000844 18016928 18033330 18049764 18067027 18086611 18108984 18132542 18154376 18172238 18186041 18197631
58960 18197631 18209004 18220760 18232298 18243294 18254556 18267506 18283167 18301636 18322047 18342953 18363228
58949 18363228 18382967 18403382 18425438 18448564 18470784 18490271 18506872 18522179 18538045 18555131 18573108
58938 18573108 18592053 18612915 18636145 18660323 18683036 18703381 18723194 18745425 18771186 18798483 18823993
58927 18823993 18846219 18866829 18888789 18913368 18939382 18965124 18990176 19015074 19040088 19064973 19089444
58916 19089444 19113234 19136095 19158462 19181761 19207174 19234158 19260960 19286543 19311165 19334982 19357123
58905 19357123 19376856 19395234 19414838 19437813 19464293 19492610 19520601 19546613 19569762 19590086 19608903
58894 19608903 19628292 19649253 19670594 19690745 19710503 19732350 19756560 19779959 19800102 19819190 19841620
58883 19841620 19868421 19896518 19923400 19949928 19977675 20005638 20031141 20053141 20073662 20096658 20125661
58872 20125661 20161135 20199260 20234551 20264744 20292349 20320865 20350942 20381339 20411885 20443367 20475103
58861 20475103 20504797 20530931 20553956 20575171 20595819 20617150 20639762 20662412 20682767 20700071 20716346
58850 20716346 20734409 20755094 20776597 20796148 20812361 20826424 20840933 20857196 20874133 20890398 20906785
58839 20906785 20925183 20945762 20966862 20987686 21009315 21032565 21056327 21078862 21099596 21119051 21138223
58828 21138223 21158773 21182488 21209228 21236168 21260270 21281166 21300819 21321058 21342427 21364921 21388610
58817 21388610 21413409 21438902 21464379 21488832 21511528 21533079 21555198 21578738 21602742 21626288 21650421
58806 21650421 21676946 21705899 21735767 21766115 21798459 21834107 21871993 21908968 21941971 21970404 21997228
58795 21997228 22027017 22061664 22098462 22133728 22167502 22202493 22239049 22274291 22306821 22338877 22371904
58784 22371904 22402910 22428275 22449437 22471419 22496324 22521459 22543858 22563502 22581352 22597193 22611226
58773 22611226 22625854 22643833 22665543 22689386 22713930 22738497 22762573 22786195 22810309 22835320 22859660
58762 22859660 22881119 22899334 22915835 22931957 22947970 22963947 22979940 22995233 23008951 23021714 23035212
58751 23035212 23049794 23064067 23077706 23092863 23111149 23130313 23145979 23156607 23165053 23174883 23186522
58740 23186522 23197736 23207005 23215513 23226111 23240914 23259804 23280899 23302380 23323935 23346395 23370122
58729 23370122 23394085 23416614 23436900 23455793 23475376 23497727 23523678 23552459 23582496 23612399 23641074
58718 23641074 23667363 23690440 23710846 23730579 23751562 23774032 23796670 23818297 23839278 23861170 23884862
58707 23884862 23909169 23931545 23950603 23967802 23986237 24007872 24032372 24058427 24085263 24112528 24139562
58696 24139562 24165735 24191226 24216592 24241518 24264771 24285731 24305410 24325405 24346295 24367727 24389934
58685 24389934 24414202 24441451 24471119 24502083 24534056 24567032 24599762 24630252 24658188 24685529 24713851
58674 24713851 24742133 24768389 24792780 24817657 24844590 24872662 24899994 24926042 24952010 24979393 25008214
58663 25008214 25036451 25061785 25084562 25108184 25135260 25164056 25190648 25214254 25238093 25264630 25292612
58652 25292612 25320056 25347679 25377178 25407796 25437121 25464561 25491790 25520250 25550230 25582007 25615502
58641 25615502 25648728 25678897 25705878 25732834 25762586 25794797 25827443 25859688 25892294 25926337 25962642
58630 25962642 26001665 26042737 26083833 26123067 26160411 26197597 26236538 26277971 26320968 26363294 26402784
58619 26402784 26438960 26473253 26507675 26543607 26581592 26621259 26661163 26699757 26736961 26773900 26810705
58608 26810705 26845711 26877623 26907393 26936677 26964934 26989416 27008066 27021880 27034561 27050403 27072009
58597 27072009 27099087 27129284 27160425 27191706 27222716 27252563 27280933 27309249 27339276 27370726 27401477
58586 27401477 27430197 27457655 27485383 27514185 27544318 27576148 27609962 27645634 27682762 27720523 27757277
58575 27757277 27791403 27823431 27856741 27894927 27938357 27984073 28029295 28074315 28121352 28170978 28220719
58564 28220719 28267570 28311113 28353195 28394659 28433695 28468027 28498001 28526479 28555943 28586651 28617708
58553 28617708 28648956 28681291 28715542 28751607 28788540 28825070 28860067 28892890 28923656 28953252 28982882
58542 28982882 29013360 29044793 29077011 29110222 29145037 29181971 29221106 29261924 29303039 29342675 29380579
58531 29380579 29419448 29463010 29511911 29562471 29610261 29653982 29695163 29735575 29776655 29820312 29867710
58520 29867710 29917108 29965118 30010862 30057108 30106297 30157036 30205963 30252020 30297241 30343633 30390796
58509 30390796 30436954 30481431 30525539 30571073 30618190 30665150 30710779 30756862 30806837 30861530 30917370
58498 30917370 30969941 31018541 31066003 31114612 31164062 31213509 31263801 31316537 31371889 31428474 31484933
58487 31484933 31540710 31595656 31649842 31703721 31757554 31810666 31862240 31913205 31966211 32022877 32081856
58476 32081856 32140751 32199380 32259491 32321381 32382841 32442417 32501970 32564481 32630492 32698584 32768306
58465 32768306 32839948 32911545 32979137 33041392 33101827 33164570 33229427 33293054 33353828 33413246 33472880
58454 33472880 33532309 33590418 33646899 33701780 33754912 33806682 33858102 33909408 33959588 34008020 34055623
58443 34055623 34103527 34151460 34198453 34244411 34289881 34334981 34380001 34426614 34476747 34529991 34583737
58432 34583737 34636563 34689989 34745768 34802665 34857699 34910097 34962011 35014949 35067296 35116730 35164284
58421 35164284 35214376 35270556 35331958 35394303 35454108 35511757 35570655 35633480 35699259 35764363 35826251
58410 35826251 35885449 35943431 35999790 36053239 36105176 36160043 36220946 36286126 36351128 36413750 36475341
58399 36475341 36537683 36600508 36662636 36724121 36786157 36849538 36914239 36980282 37048191 37118534 37191447
58388 37191447 37266620 37343354 37420614 37497390 37573091 37647492 37720521 37792523 37864559 37937620 38011207
58377 38011207 38083338 38152817 38221272 38292043 38366690 38443277 38518636 38591712 38663994 38737065 38810910
58366 38810910 38884849 38959014 39034116 39110294 39187079 39264470 39343440 39425176 39509811 39595711 39680088
58355 39680088 39761074 39839749 39919445 40002164 40086107 40167855 40246924 40326854 40411308 40500129 40589916
58344 40589916 40677791 40763798 40850025 40938160 41027785 41116538 41202039 41284123 41365304 41449023 41537622
58333 41537622 41631570 41729449 41828260 41925044 42019639 42115266 42215076 42318338 42421476 42522663
58323 42522663 42623524 42725702 42827534 42925796 43019866 43112623 43207496 43305838 43406985 43509397
58313 43509397 43611350 43711805 43811430 43912194 44015316 44120212 44226078 44333834 44445282
58304 44445282 44560266 44675769 44788502 44898006 45006703 45117379 45231439 45349317 45471162
58295 45471162 45596118 45721658 45845137 45966432 46088218 46213071 46340841 46469408 46597488
58286 46597488 46725924 46856457 46990020 47126214 47263696 47400989 47537600 47674635 47813824
58277 47813824 47955768 48099683 48244930 48391932 48541137 48691943 48843549 48996328 49151329
58268 49151329 49308614 49467219 49626817 49788407 49952744 50118912 50285163 50450887 50617249
58259 50617249 50786064 50958475 51134533 51313513 51494556 51677085 51860469 52043369 52224282
58250 52224282 52403520 52584042 52769046 52958542 53149525 53340107 53532292 53729436 53931770
58241 53931770 54136209 54340585 54546139 54754863 54966072 55177571 55389493 55604667 55824726
58232 55824726 56047930 56272130 56498359 56729623 56966711 57207246 57448885 57691587 57936192
58223 57936192 58182726 58431491 58684388 58943147 59206948 59473825 59744392 60021949 60308054
58214 60308054 60599871 60893296 61187677 61485926 61790730 62102120 62418314 62737390 63058266
58205 63058266 63381590 63709810 64045000 64386408 64731545 65079778 65433159 65793257 66159512
58196 66159512 66531913 66913031 67304894 67705160 68109174 68515592 68927587 69348746 69780385
58187 69780385 70223069 70677560 71142738 71615154 72092946 72578575 73075437 73583084 74098468
58178 74098468 74621465 75156380 75707765 76277196 76864980 77472520 78100964 78748773 79412866
58169 79412866 80092017 80787431 81499596 82226063 82963424 83711121 84472750 85254016 86060258
58160 86060258 86895810 87764781 88671866 89622660 90623214 91678457 92790185 93956779 95175327
58151 95175327 96443893 97762005 99130995 100556308 102050037 103630448 105319701 107143627
58143 107143627 109133020 111321979 113743112 116424993 119393529 122671597 126272694 130191809
58135 130191809 134395973 138810219 143298529 147654559 151621939 154946654 157441201 159032900
58127 159032900 159777367 159832237 159403180 158689041 157851524 157012730 156263112 155664920 155252882
58118 155252882 155039573 155024359 155199971 155556354 156085039 156783074 157653370 158703155 159944776
58109 159944776 161398285 163091363 165055577 167321996 169917831 172863573 176171828 179850514
58101 179850514 183909777 188368768 193260008 198632420 204553838 211111422 218408215 226557142
58093 226557142 235677682 245900292 257373013 270246327 284607455 300363659 317121784
58086 317121784 334133663 350349507 364570150 375657598 382758373 385489472 384024460
58079 384024460 379029039 371456311 362290610 352356540 342255546 332401464 323077340 314459020
58071 314459020 306606342 299453775 292825604 286481613 280185769 273778627 267222875 260596764
58063 260596764 254038872 247678683 241591963 235796052 230272017 224990176 219924147 215053461
58055 215053461 210363036 205844765 201498942 197331368 193347440 189548423 185931714 182491967
58047 182491967 179220647 176105471 173131516 170283053 167544675 164902138 162343474 159859628
58039 159859628 157443763 155090001 152792858 150547696 148351926 146206333 144115040 142082955
58031 142082955 140111828 138198119 136334641 134514688 132735128 130995616 129294504 127625906
58023 127625906 125981956 124358294 122756094 121178244 119625230 118095787 116589135 115103472
58015 115103472 113633243 112171287 110714003 109261617 107812907 106362729 104905551 103437814
58007 103437814 101954474 100446448 98905708 97332589 95735592 94124746 92507726 90891947
57999 90891947 89287122 87704865 86158101 84662108 83234318 81891212 80645219 79504367
57991 79504367 78473049 77551602 76735367 76015095 75378845 74814395 74311395 73862079 73459802
57982 73459802 73097131 72766437 72462626 72184035 71929412 71694487 71472646 71259096 71053561
57973 71053561 70858479 70675130 70502315 70338632 70184707 70041946 69909345 69783037 69659626
57964 69659626 69539013 69423171 69313276 69209446 69112473 69023563 68941992 68864695 68789195 68715927
57954 68715927 68646888 68583013 68523792 68468548 68416814 68367959 68321835 68279578 68242272 68208546 68174999
57943 68174999 68140054 68106430 68078453 68057082 68038908 68020289 68001310 67984861 67972708 67963816 67956356
57932 67956356 67949947 67945487 67943964 67946185 67952616 67962156 67971711 67978580 67983481 67989902 68000093 68012854 68025797
57919 68025797 68038350 68051387 68065056 68078893 68094032 68113372 68138659 68168289 68198819 68228011 68255771
57908 68255771 68283028 68311107 68342022 68377852 68418917 68463228 68508323 68553253 68598247 68643188 68687598
57897 68687598 68732034 68778162 68826826 68876960 68927307 68978661 69033136 69091107 69149955 69206561 69260483
57886 69260483 69313993 69369132 69425513 69481185 69535180 69588810 69644557 69703901 69766019 69828384 69888661
57875 69888661 69946436 70003445 70062223 70124322 70189407 70255809 70322146 70388744 70457340 70528795 70601137
57864 70601137 70670733 70735899 70798641 70862179 70927693 70994803 71064407 71138565 71216922 71295340 71369714
57853 71369714 71439974 71508925 71578390 71648699 71721231 71798527 71880913 71964976 72046963 72126833 72207840
57842 72207840 72292787 72381834 72473673 72567534 72663335 72760236 72855971 72948496 73038314 73128161 73219697
57831 73219697 73311506 73401508 73490310 73580223 73671518 73762182 73851722 73942603 74036786 74133229 74230488
57820 74230488 74329605 74432003 74536112 74639026 74741009 74845549 74954551 75065601 75174446
57811 75174446 75278605 75378355 75476089 75575215 75677942 75783160 75887704 75990342 76093267 76198914
57801 76198914 76306765 76414484 76521358 76629183 76739864 76852896 76965201 77073505 77177443
57792 77177443 77280545 77387363 77499382 77614411 77729909 77845475 77961589 78077511 78191810
57783 78191810 78304187 78415596 78527053 78639368 78753411 78869499 78986827 79104491 79222795
57774 79222795 79342500 79463041 79582586 79699923 79815506 79930720 80046793 80164318 80283103
57765 80283103 80402742 80523846 80647925 80774835 80901096 81022852 81140618 81259080 81381370
57756 81381370 81505414 81627128 81745532 81862874 81980872 82099352 82218482 82339978 82464995
57747 82464995 82592073 82718358 82842486 82965725 83090607 83218542 83348325 83476985 83602923
57738 83602923 83728171 83856337 83987990 84119664 84248485 84376156 84506411 84639592 84772542
57729 84772542 84903902 85036462 85172762 85310722 85446227 85579106 85713666 85852909 85994260
57720 85994260 86132257 86264447 86393592 86524500 86659580 86797495 86935525 87072629 87209907
57711 87209907 87348320 87487084 87625050 87762821 87901917 88041801 88179566 88313595 88446411
57702 88446411 88582273 88722170 88862576 88999583 89133312 89267482 89405062 89545308 89685182
57693 89685182 89822737 89958213 90092376 90225460 90358529 90494492 90635845 90781549 90927805
57684 90927805 91072360 91216579 91362687 91510751 91659799 91810435 91963987 92119510 92274174
57675 92274174 92427251 92581518 92739404 92899328 93057502 93212334 93365229 93517831 93670800
57666 93670800 93825296 93983130 94144235 94305994 94466817 94628969 94795660 94966106 95136042
57657 95136042 95303135 95469392 95637437 95807036 95977075 96148838 96324546 96503558 96682868
57648 96682868 96861435 97041230 97223207 97404651 97582339 97756876 97932024 98110381 98291289
57639 98291289 98472522 98652424 98830420 99006980 99183691 99362374 99543516 99725906 99907938
57630 99907938 100088659 100267447 100443548 100616512 100786725 100955225 101123489 101293495 101466992
57621 101466992 101643654 101820418 101993711 102162668 102329852 102499097 102673116 102852364 103034587
57612 103034587 103215227 103389998 103558468 103724374 103891300 104058701 104223443 104384587 104544762
57603 104544762 104706736 104870601 105035284 105201095 105369190 105539253 105709370 105878110 106045630
57594 106045630 106212914 106380968 106550810 106723289 106898573 107076357 107256462 107438606 107621843
57585 107621843 107805310 107989730 108177237 108369241 108564940 108762114 108958871 109154692 109350711
57576 109350711 109549238 109752114 109958936 110167522 110376694 110588071 110804490 111026788 111252540
57567 111252540 111477819 111700107 111919981 112140180 112362518 112585259 112803855 113014518 113216696
57558 113216696 113411918 113601325 113785514 113966405 114147584 114331767 114518423 114704698 114888697
57549 114888697 115071178 115254016 115438012 115622986 115809243 115997253 116185660 116371343 116552677
57540 116552677 116731883 116912831 117097096 117283309 117469626 117655018 117838506 118019394 118198795
57531 118198795 118379071 118560803 118741937 118921103 119100282 119282512 119467774 119652872 119835229
57522 119835229 120015348 120195440 120376803 120559102 120741691 120925058 121110592 121298735 121487766
57513 121487766 121675348 121861367 122048104 122237279 122428294 122620127 122813453 123009349 123207058
57504 123207058 123405171 123604641 123808215 124016096 124224006 124427030 124624732 124821306 125021024
57495 125021024 125224671 125430369 125636381 125841864 126045661 126246448 126445009 126644846 126848792
57486 126848792 127055489 127260786 127462274 127660660 127856974 128050902 128242429 128432525 128620912
57477 128620912 128805674 128987174 129170152 129358917 129551613 129742187 129927459 130109422 130290911
57468 130290911 130472461 130654197 130837656 131023707 131210385 131394685 131575685 131754783 131933599
57459 131933599 132112779 132292358 132472412 132653456 132836394 133021731 133208959 133397461 133587784
57450 133587784 133780848 133975923 134170688 134363577 134554908 134745763 134937378 135131828 135331156
57441 135331156 135534656 135738720 135940760 136141949 136344639 136548500 136751293 136952808 137155734
57432 137155734 137362366 137572059 137782487 137992396 138202466 138414117 138627975 138843463 139059917
57423 139059917 139278141 139500268 139727349 139957374 140186558 140412738 140637133 140862753 141091595
57414 141091595 141323437 141556895 141791121 142026272 142262316 142497952 142731520 142963123 143195095
57405 143195095 143429748 143666969 143904325 144139154 144370356 144598730 144826117 145053841 145281439
57396 145281439 145507048 145729181 145947725 146163081 146375103 146583472 146788451 146990446 147189249
57387 147189249 147384606 147577266 147768488 147958375 148145568 148328967 148509205 148687839 148865272
57378 148865272 149039957 149209742 149373529 149531169 149682011 149824562 149958111 150084027 150204496
57369 150204496 150320244 150430470 150534950 150635068 150732389 150827145 150918741 151007196 151093561 151179202
57359 151179202 151264873 151350233 151434373 151517269 151600455 151685414 151771703 151857913 151944417 152033448 152126083
57348 152126083 152220792 152315900 152412015 152510956 152613601 152720089 152830929 152946341 153065165 153185859
57338 153185859 153308065 153432168 153558169 153686259 153817564 153952475 154088852 154223679 154356496
57329 154356496 154489638 154625196 154763183 154902639 155043074 155184684 155328263 155474628 155622887
57320 155622887 155769722 155912266 156051514 156190969 156331812 156471475 156607297 156739218 156867951
57311 156867951 156992911 157113730 157232149 157350374 157468361 157584154 157695952 157802266 157900955
57302 157900955 157990147 158070157 158143046 158210375 158272760 158331609 158389717 158449330 158510205 158569896 158625638
57291 158625638 158676150 158722435 158767033 158812090 158858264 158905747 158955371 159007240 159058472 159104250 159142136
57280 159142136 159174439 159205312 159236121 159264673 159288639 159308516 159326791 159344896 159361570 159374052 159380474
57269 159380474 159381052 159377339 159370689 159361342 159348415 159330440 159306335 159276658 159244053 159211762 159181156 159150891
57257 159150891 159118650 159083339 159045406 159005670 158964717 158923127 158881282 158838647 158793993 158746637 158696836
57246 158696836 158644718 158589560 158530611 158467594 158399138 158321006 158227247 158113654 157979660 157826862
57236 157826862 157656512 157468647 157262873 157039407 156799737 156546690 156283697 156013826 155739657
57227 155739657 155463741 155188505 154915676 154646707 154383893 154130006 153886131 153650677 153421529
57218 153421529 153198853 152984831 152780419 152582646 152384901 152179748 151961960 151729559 151481977
57209 151481977 151217153 150930693 150617902 150275997 149904121 149502153 149070468 148610514 148124767
57200 148124767 147615997 147086939 146540714 145981603 145415735 144850744 144293828 143750148 143224410
57191 143224410 142724212 142259789 141838926 141463333 141131610 140844873 140607664 140424017 140294431
57182 140294431 140216165 140184253 140192053 140232804 140301121 140391477 140495090 140600365 140697272 140779816 140843313
57171 140843313 140880670 140882328 140838597 140741060 140583292 140362352 140079568 139738571 139342231 138892127
57161 138892127 138390979 137845146 137264607 136660553 136042613 135418137 134794175 134179915 133586927
57152 133586927 133027562 132513593 132055228 131659317 131328313 131062684 130864814 130738920 130686598
57143 130686598 130704449 130787168 130930881 131131289 131379922 131664825 131974892 132301518 132636074
57134 132636074 132968118 133287193 133584865 133853535 134083950 134265511 134389698 134452649 134453528 134390196
57124 134390196 134257255 134049149 133764897 133408677 132985843 132499879 131953714 131352094 130700719
57115 130700719 130003896 129265176 128490516 127689104 126870199 126040118 125202910 124363095 123526692
57106 123526692 122699907 121887933 121095446 120327570 119589257 118883307 118209575 117567099 116957113
57097 116957113 116383213 115848209 115351546 114890656 114464699 114076487 113730998 113432836 113185155
57088 113185155 112990048 112848646 112760610 112724424 112739396 112807305 112930777 113109261 113337176 113606510
57078 113606510 113910172 114241891 114594275 114959380 115330999 115704181 116071825 116423600 116749269
57069 116749269 117041995 117297826 117513609 117686822 117816882 117905825 117958381 117982240 117987960 117988411
57059 117988411 117998556 118035063 118114426 118250984 118457205 118744368 119120013 119584622 120133549 120762537
57049 120762537 121468015 122240863 123063383 123914268 124773092 125617285 126418430 127146544 127778124
57040 127778124 128298443 128697858 128966795 129088424 129028705 128733737 128143589 127216166 125947460
57031 125947460 124382869 122614780 120751277 118851535 116861537 114600175 111809234 108235346
57023 108235346 103710209 98216001 91916858 85122565 78182700 71372543 64843866 58650504
57015 58650504 52797180 47267536 42032987 37061337 32326677 27811289 23500644 19380756
57007 19380756 15440615 11674228 8078460 4648418 1374166 -1759310 -4770184 -7678806
56999 -7678806 -10508810 -13288228 -16050033 -18834343 -21691490 -24679350 -27851748 -31245283
56991 -31245283 -34874040 -38732421 -42801002 -47055122 -51478013 -56073760 -60872299 -65923144
56983 -65923144 -71274996 -76935750 -82821070 -88724801 -94342516 -99337634 -103405385 -106307702
56975 -106307702 -107893065 -108120015 -107072442 -104942300 -101979835 -98434210 -94503164 -90301395
56967 -90301395 -85860944 -81170791 -76232828 -71090763 -65812331 -60451386 -55031788 -49566643
56959 -49566643 -44091066 -38678682 -33428928 -28433796 -23744590 -19357114 -15220006 -11256498
56951 -11256498 -7386227 -3540330 330103 4251028 8227550 12250542 16304715 20374114
56943 20374114 24442675 28492285 32503862 36462972 40364424 44210186 48003205 51744138
56935 51744138 55432185 59065042 62636983 66140207 69571137 72935045 76243485 79508203
56927 79508203 82738035 85938493 89109699 92243062 95321426 98323762 101230271 104024681
56919 104024681 106694438 109230363 111625991 113876770 115979361 117930182 119722720 121345566
56911 121345566 122783500 124020627 125042732 125838198 126398455 126717367 126788529 126602778 126149689
56902 126149689 125422607 124423120 123162894 121663649 119954296 118063209 116009004 113798251
56894 113798251 111433860 108928264 106313400 103644866 101000091 98468818 96136900 94071090
56886 94071090 92312455 90877699 89762745 88947077 88400914 88093331 87996135 88082834 88327461
56877 88327461 88705706 89195649 89776608 90428856 91135634 91884320 92664303 93464167 94271573
56868 94271573 95074848 95863471 96627361 97356640 98041833 98673715 99243392 99743306 100167983
56859 100167983 100513290 100775292 100950313 101035782 101030600 100934994 100750523 100479933 100126949 99696861
56849 99696861 99197565 98638969 98030641 97380767 96697998 95993102 95277346 94559701 93846833
56840 93846833 93145453 92463351 91808295 91187020 90605328 90068310 89580718 89147990 88776274
56831 88776274 88470046 88230092 88055609 87948186 87911972 87949917 88062010 88247511 88506114 88835065
56821 88835065 89227083 89673307 90167300 90704164 91276581 91873897 92484871 93099506 93708379
56812 93708379 94302155 94871846 95407733 95897797 96329384 96693390 96985347 97201705 97337175
56803 97337175 97387663 97354943 97246787 97073188 96844057 96570004 96263052 95935768 95600594 95270124
56793 95270124 94956554 94669872 94416978 94202518 94029485 93898547 93807899 93754631 93735588 93746137
56783 93746137 93779033 93826078 93881314 93942280 94008276 94077867 94147895 94214555 94275625 94331773 94385021
56772 94385021 94435795 94482599 94525396 94567784 94613920 94663854 94713845 94760908 94804488 94843295 94873427
56761 94873427 94891681 94898825 94897225 94886027 94861084 94819585 94763031 94695497 94620590 94540434 94456093
56750 94456093 94368244 94278444 94190420 94109223 94038230 93977319 93924546 93879239 93842878 93816996 93800803
56739 93800803 93791326 93786105 93785424 93791240 93803915 93821088 93840279 93861198 93884115 93906994 93926386 93940914
56727 93940914 93951598 93958353 93958527 93950338 93936225 93921151 93908625 93899694 93894657 93893589 93895296 93897610 93899417
56714 93899417 93901520 93905276 93911166 93918866 93927982 93938367 93950181 93963668 93978400 93992751 94004626 94012543
56702 94012543 94015423 94011579 93999194 93978251 93951133 93920587 93887597 93851781 93813232 93773057 93732291
56691 93732291 93691430 93651390 93613957 93580183 93548515 93515686 93480048 93443389 93408790 93377083 93346346
56680 93346346 93314677 93282410 93251157 93221410 93191630 93159448 93123647 93085376 93047511 93012160 92978668
56669 92978668 92944705 92909474 92874924 92843570 92816187 92792296 92771592 92753738 92737550 92721867 92706962
56658 92706962 92693985 92683231 92673996 92665934 92659387 92654325 92649951 92645571 92641252 92637785 92636520 92638762 92644253
56645 92644253 92650663 92655692 92659473 92663708 92668757 92673150 92676118 92679088 92684297 92693060 92705459 92720145 92734137
56632 92734137 92744503 92751131 92756614 92762905 92769532 92775632 92781871 92789154 92797093 92805173 92813963 92823519 92831820
56619 92831820 92836606 92837882 92836958 92834176 92829653 92825284 92823319 92823121 92821814 92818197 92813536 92808269 92800821 92790952
56605 92790952 92781670 92775779 92772277 92768402 92763974 92761126 92760117 92757947 92751826 92742209 92731429 92720566 92708858
56592 92708858 92695539 92681008 92666276 92652300 92639954 92629620 92619992 92608028 92591353 92570996 92550815
56581 92550815 92533680 92518675 92502401 92482437 92458978 92433805 92408584 92384088 92360374 92337568 92316417
56570 92316417 92297458 92279288 92258805 92234112 92206410 92177886 92148783 92118388 92088206 92061420 92038532
56559 92038532 92015684 91988552 91956555 91922232 91887876 91853928 91819530 91783225 91743956 91702634 91662162
56548 91662162 91624698 91589381 91553668 91516258 91477582 91438193 91398097 91357355 91315915 91273081 91228411
56537 91228411 91182985 91138427 91094731 91050464 91005146 90959875 90915263 90870476 90825129 90780558 90737634
56526 90737634 90694253 90646875 90594699 90540841 90488746 90438468 90387646 90335585 90284675 90236939 90190467
56515 90190467 90141011 90086920 90030648 89975001 89920004 89864875 89811178 89761327 89714565 89667054 89616309
56504 89616309 89563269 89509445 89454476 89398002 89341984 89288884 89238460 89188395 89137791 89087978 89039704
56493 89039704 88991238 88940136 88885819 88829670 88773333 88717807 88663872 88612424 88563873 88517190 88469913
56482 88469913 88419811 88367252 88315682 88268917 88227574 88188701 88149009 88107815 88066238 88024322 87980040
56471 87980040 87931285 87878146 87823143 87769735 87720538 87675991 87634108 87592079 87548883 87506069 87465434
56460 87465434 87426328 87386146 87343347 87298948 87254928 87212267 87171035 87131234 87092590 87054100 87014997
56449 87014997 86975985 86938551 86902924 86867478 86830317 86790879 86749780 86707667 86664735 86621191 86577692
56438 86577692 86534874 86492373 86448814 86403414 86357419 86312976 86270372 86227344 86181587 86132848 86082000
56427 86082000 86029406 85975568 85922285 85871262 85821832 85771657 85719633 85666822 85614651 85563654 85513750
56416 85513750 85464201 85413334 85360035 85305510 85251720 85197978 85141365 85080914 85018967 84957543 84895823
56405 84895823 84832568 84768426 84704002 84638069 84570255 84503406 84440222 84379037 84316219 84251505 84187143
56394 84187143 84122404 84053513 83979895 83906303 83836740 83769640 83701475 83632234 83564072 83496417 83426106
56383 83426106 83352017 83276693 83203122 83132034 83062723 82994545 82926943 82859234 82791008 82721833 82650481
56372 82650481 82575548 82497381 82418578 82342168 82269529 82199788 82130556 82059796 81988069 81918556 81853394
56361 81853394 81790388 81725401 81658105 81592633 81531365 81470730 81405540 81335732 81265945 81199371 81135250
56350 81135250 81072285 81010993 80951416 80891341 80828940 80765557 80703903 80644631 80586485 80528803 80471762
56339 80471762 80414624 80355939 80295745 80236034 80178528 80122941 80067565 80010825 79952507 79894289 79838524
56328 79838524 79785373 79731876 79675538 79618172 79563950 79513753 79464047 79411778 79357636 79303249 79247874
56317 79247874 79190048 79130720 79072334 79015891 78961001 78907891 78857013 78807153 78756170 78703534 78650333
56306 78650333 78596875 78542255 78486337 78430184 78374075 78316972 78258753 78201369 78146535 78093273 78038987
56295 78038987 77982681 77926266 77872655 77822790 77774447 77723935 77669174 77611101 77552172 77494142 77437406
56284 77437406 77381387 77324685 77265977 77205995 77147557 77091997 77036693 76978472 76918883 76862994 76812505
56273 76812505 76762995 76709399 76651817 76593998 76537992 76482770 76427177 76371692 76316917 76261977 76205286
56262 76205286 76146502 76087422 76030789 75977831 75927200 75877118 75828212 75782593 75739925 75696454 75649091
56251 75649091 75598750 75548169 75497969 75447003 75395552 75345625 75297921 75250598 75201641 75151159 75100821
56240 75100821 75052045 75005242 74960095 74916196 74873828 74834020 74797116 74761303 74723476 74681982 74638077
56229 74638077 74594554 74553172 74513344 74472916 74430443 74387097 74346098 74309713 74276978 74244821 74211056
56218 74211056 74175875 74140888 74107503 74075840 74044468 74011538 73976920 73942725 73910893 73880866 73850925
56207 73850925 73821270 73793998 73769780 73746313 73720987 73694119 73668763 73647841 73631884 73618985 73606389
56196 73606389 73592592 73578397 73565983 73556983 73551509 73548188 73544268 73536426 73523345 73507753 73494340 73484872
56184 73484872 73476504 73465496 73451265 73435627 73419382 73401505 73381411 73360027 73337929 73313598 73284780
56173 73284780 73251539 73217219 73185962 73159366 73135805 73112718 73088908 73064664 73040957 73019680 73003822
56162 73003822 72995566 72994001 72996224 73001122 73010711 73027253 73050757 73080313 73116013 73157522 73202053 73246665
56150 73246665 73292791 73345908 73409626 73481693 73556980 73632763 73709252 73785880 73859696 73927959 73990372
56139 73990372 74047248 74096421 74133684 74156265 74164505 74159871 74142823 74113585 74073657 74024744 73966589
56128 73966589 73897709 73818464 73731710 73639937 73543501 73442656 73339415 73235595 73130235 73021220
56118 73021220 72908851 72795567 72682443 72568667 72454979 72344736 72239846 72137781 72034810
56109 72034810 71930934 71829370 71732151 71638906 71549668 71465816 71387203 71310733 71233532 71156142 71081042
56098 71081042 71009125 70939564 70872511 70809688 70751788 70696967 70643045 70590335 70541056 70496101 70453550
56087 70453550 70410965 70368524 70328856 70293703 70261786 70230669 70199849 70170695 70143801 70118120 70092965
56076 70092965 70069021 70046490 70023863 69999910 69975580 69952254 69929263 69905108 69880370 69857085 69835520
56065 69835520 69814084 69792566 69772803 69755381 69738294 69720346 69703483 69689729 69677739 69665013 69652401
56054 69652401 69643565 69640156 69640038 69640683 69642208 69646431 69654850 69668588 69688913 69716259 69749334 69786362 69827155
56041 69827155 69873212 69925876 69984910 70048893 70116306 70185744 70255297 70322609 70386209 70446651 70505787
56030 70505787 70564976 70624627 70685178 70747220 70810102 70871419 70928678 70980963 71028775 71073414 71117195
56019 71117195 71162746 71210562 71258052 71302339 71343145 71381397 71416038 71444689 71467394 71487586 71508837
56008 71508837 71532393 71558319 71587171 71619504 71654982 71692995 71733495 71776924 71824121 71876304 71933752
55997 71933752 71994386 72055420 72117020 72182590 72254620 72331949 72412324 72495924 72584701 72679438 72779281
55986 72779281 72883266 72990548 73099747 73209991 73322483 73439481 73561623 73687613 73816477
55977 73816477 73948754 74085271 74226030 74370938 74520758 74676729 74839310 75007444 75179040
55968 75179040 75352750 75529540 75711722 75899914 76092065 76286483 76484567 76688767 76898974
55959 76898974 77113602 77334024 77564837 77808538 78062361 78321968 78586324 78856852 79133386
55950 79133386 79413860 79697849 79988041 80287714 80598397 80920525 81254722 81601436 81960229
55941 81960229 82330236 82710566 83099717 83495751 83898423 84310609 84736279 85176903 85630689
55932 85630689 86095370 86570938 87059727 87565017 88090162 88638289 89211797 89811909 90438710
55923 90438710 91091476 91769101 92470947 93197439 93949306 94726146 95526864 96352344 97207169
55914 97207169 98097992 99030752 100010427 101043298 102138697 103308705 104566961 105927728
55906 105927728 107405648 109016574 110779013 112713741 114840137 117171690 119714931 122472610
55898 122472610 125448778 128653498 132104688 135821152 139800675 143985762 148232188 152301637
55890 152301637 155894787 158724885 160607443 161522411 161612663 161120524 160302940 159370732 158468022
55881 158468022 157678908 157043342 156574254 156272976 156138809 156171083 156368742 156733041 157271739
55872 157271739 157998742 158928851 160074651 161450087 163075351 164975107 167171763 169683179
55864 169683179 172527484 175726311 179300396 183265009 187635260 192437495 197714641 203523295
55856 203523295 209932075 217025150 224904382 233688420 243518397 254571365 267056347 281157521
55848 281157521 296914779 314076832 331994091 349617480 365631474 378691236 387689982
55841 387689982 391979935 391495597 386750623 378699143 368494398 357233069 345785982 334755544
55833 334755544 324517091 315270722 307065050 299803050 293258815 287123831 281082190 274895505
55825 274895505 268465620 261846569 255199631 248713780 242530225 236704289 231214136 225998834
55817 225998834 220996978 216167454 211492146 206969246 202604491 198404819 194376574 190525789
55809 190525789 186855625 183361263 180028768 176840930 173783955 170848053 168023426 165297904
55801 165297904 162658109 160091509 157587851 155140407 152746018 150403080 148109622 145864127
55793 145864127 143667448 141522103 139429266 137387242 135392822 133442987 131535097 129666641
55785 129666641 127835614 126040659 124280007 122550080 120845365 119159995 117489813 115832938
55777 115832938 114188138 112552763 110922722 109294348 107665443 106034380 104399241 102758297
55769 102758297 101110163 99452241 97779306 96084466 94361435 92606098 90817650 89000325
55761 89000325 87164043 85322098 83487807 81673819 79893888 78163547 76498489 74913218
55753 74913218 73421491 72036567 70769103 69623792 68597522 67680464 66859390 66121106
55745 66121106 65453989 64847325 64290572 63774275 63291490 62837433 62407900 61998962 61608231
55736 61608231 61235103 60878841 60536946 60206031 59883963 59570547 59266530 58972508 58688508
55727 58688508 58413668 58146133 57883933 57626474 57374857 57130426 56893170 56661906 56435652
55718 56435652 56214094 55996651 55782015 55569448 55360190 55156668 54960009 54768834 54580691
55709 54580691 54394274 54209977 54028918 53852010 53679739 53511998 53347733 53184931 53021410
55700 53021410 52855911 52688659 52520968 52354344 52189990 52028861 51871508 51717393 51564899
55691 51564899 51412839 51261914 51113795 50968756 50825273 50682524 50542266 50407056 50276978
55682 50276978 50149230 50021078 49892308 49764473 49638549 49514070 49390028 49265591 49139847
55673 49139847 49012030 48882872 48755198 48631882 48513030 48396169 48279497 48163704 48049936
55664 48049936 47937466 47824917 47712773 47602394 47492894 47381540 47268009 47155897 47048454
55655 47048454 46944395 46839823 46733237 46626647 46522127 46419336 46316850 46214486 46113517
55646 46113517 46015268 45919924 45826317 45732738 45638262 45543326 45448701 45354303 45259604 45165022 45072081
55635 45072081 44982081 44894968 44809470 44724009 44637898 44552106 44468384 44386837 44304772 44219185 44130378
55624 44130378 44042019 43957259 43875729 43794690 43712228 43628623 43545246 43463078 43382368 43303183 43225923
55613 43225923 43151012 43077917 43004816 42929970 42853585 42777853 42704994 42635570 42568596 42502366 42434913
55602 42434913 42364720 42292062 42219236 42148300 42078428 42006422 41930331 41851907 41774835 41701041 41629608
55591 41629608 41559073 41489573 41422295 41357759 41295459 41234523 41173825 41112035 41048853 40986110 40926404
55580 40926404 40870317 40815714 40759740 40700509 40637207 40570344 40502352 40436253 40372805 40310295 40247860
55569 40247860 40187243 40129969 40074530 40018284 39960945 39904137 39848476 39793238 39738162 39683136 39626580
55558 39626580 39566810 39505082 39444723 39386875 39329567 39271436 39213514 39156212 39097431 39035774 38973548
55547 38973548 38914091 38857300 38800046 38740431 38679754 38620567 38564196 38509840 38455143 38398197 38339858
55536 38339858 38283153 38229575 38177354 38124611 38072371 38022296 37972815 37920424 37864276 37806837 37750176
55525 37750176 37694341 37639453 37586380 37534486 37481533 37427249 37374668 37326285 37280768 37235229 37188874
55514 37188874 37142262 37094525 37044134 36991929 36940723 36891578 36842425 36791056 36738061 36686005 36636520
55503 36636520 36588699 36539832 36487559 36431899 36375353 36320720 36268911 36219114 36170360 36122115 36074035
55492 36074035 36026514 35981239 35939726 35900961 35861640 35819141 35773534 35726607 35679992 35634451 35589763
55481 35589763 35544738 35498314 35451166 35405283 35361479 35318456 35274989 35231677 35189395 35147194 35103437
55470 35103437 35058556 35015055 34974769 34937305 34900960 34863847 34824256 34781742 34738469 34697928 34661114
55459 34661114 34624870 34585198 34541736 34497823 34456411 34417055 34377082 34334635 34289897 34244131 34198489
55448 34198489 34153707 34110102 34067585 34026168 33986593 33949686 33914569 33878407 33839146 33798075 33758273
55437 33758273 33720488 33682165 33641193 33598860 33557798 33518135 33477527 33434516 33390067 33345759 33302080
55426 33302080 33258952 33216699 33175820 33136644 33099543 33064515 33030073 32993635 32954087 32913529 32875440
55415 32875440 32840991 32807694 32771915 32732391 32691004 32650250 32610547 32570598 32529991 32490101 32451965
55404 32451965 32414591 32376557 32338438 32302067 32267718 32233673 32198594 32162735 32126477 32089262 32050746
55393 32050746 32011820 31973582 31936142 31899149 31862667 31826748 31790847 31754685 31719378 31686806 31657582
55382 31657582 31629881 31600542 31567857 31533443 31500664 31470490 31439717 31404414 31364355 31322630 31281611
55371 31281611 31241503 31202577 31166081 31132108 31098687 31064203 31029189 30994951 30961898 30929823 30898012
55360 30898012 30864481 30827352 30788016 30750687 30717492 30686232 30654408 30622826 30593042 30563799 30532830
55349 30532830 30500395 30468113 30435880 30402818 30369718 30337267 30303360 30266116 30228762 30197360 30173252
55338 30173252 30151191 30125277 30093618 30057186 30018080 29979932 29946262 29916493 29886165 29852616 29818053
55327 29818053 29785727 29755731 29726161 29695904 29664474 29631339 29597417 29565284 29535959 29507190 29476771
55316 29476771 29445767 29416562 29389433 29363063 29336790 29310030 29280954 29248345 29213959 29180659 29148902
55305 29148902 29117245 29085617 29055476 29026805 28997303 28965176 28931280 28898187 28868069 28841275 28815785
55294 28815785 28788412 28757865 28726354 28696921 28669646 28642034 28612633 28582418 28552575 28522836 28492399
55283 28492399 28460965 28428507 28395478 28363679 28335389 28310807 28287398 28262566 28236150 28209843 28185050
55272 28185050 28161854 28139035 28114402 28086149 28054977 28024245 27996768 27971657 27945245 27914978 27881467
55261 27881467 27846867 27812670 27779692 27748857 27720502 27693369 27665788 27637996 27611922 27588110 27564190
55250 27564190 27537452 27508106 27478828 27451606 27426182 27401135 27375173 27347596 27318862 27290774 27264958
55239 27264958 27241003 27217035 27192004 27166309 27140416 27114362 27088574 27063508 27038172 27010757 26981355
55228 26981355 26952531 26926335 26901987 26877173 26850542 26822356 26793939 26767113 26743132 26721600 26701232
55217 26701232 26681515 26662056 26640736 26615133 26586346 26558653 26534206 26510736 26486006 26461733 26440712
55206 26440712 26422359 26403723 26383106 26359997 26333212 26302290 26269657 26238411 26208639 26178625 26148837
55195 26148837 26121576 26097105 26073264 26048974 26025307 26002879 25980854 25958797 25936849 25913789 25887811
55184 25887811 25860174 25835393 25816148 25799684 25780556 25755914 25727303 25698475 25672065 25647641 25622863
55173 25622863 25597036 25572477 25550716 25528653 25501458 25469062 25436688 25408678 25384915 25363881 25345440
55162 25345440 25328638 25309980 25286842 25260916 25235862 25212908 25190991 25169899 25150576 25132679 25114074
55151 25114074 25093089 25069931 25045792 25021449 24996764 24970951 24943645 24915948 24889858 24866305 24844515
55140 24844515 24823473 24802875 24782385 24761384 24740169 24719897 24700502 24680054 24657282 24633402 24610227
55129 24610227 24587723 24564722 24540966 24516949 24492612 24467740 24443073 24419660 24397477 24375700 24353884
55118 24353884 24331935 24309545 24286503 24263004 24239001 24214310 24190005 24168178 24149033 24129705 24107758
55107 24107758 24084606 24063463 24044949 24027072 24008756 23990626 23972359 23952131 23929516 23906600 23885130
55096 23885130 23864430 23843297 23822221 23802017 23781463 23758308 23732386 23706201 23682341 23661368 23642376
55085 23642376 23624450 23606921 23588931 23569774 23549784 23530133 23511410 23492799 23473084 23452017 23430098
55074 23430098 23407424 23383825 23360176 23338344 23319153 23301091 23281811 23260556 23238605 23217580 23197743
55063 23197743 23177824 23156420 23133768 23111907 23092351 23073875 23053795 23031569 23009615 22989928 22971355
55052 22971355 22951444 22929857 22908472 22888820 22870838 22853842 22837339 22820855 22803957 22786477 22768120
55041 22768120 22748131 22725984 22701966 22676484 22649718 22622926 22599086 22580340 22565034 22549021 22530073
55030 22530073 22509516 22489271 22469207 22448358 22427341 22407824 22390027 22372159 22352718 22332601 22314420
55019 22314420 22299864 22288089 22276626 22263420 22247685 22229323 22208471 22185874 22162983 22141301 22121982
55008 22121982 22105776 22092178 22078309 22060202 22036497 22010182 21985617 21964435 21945250 21926395 21907436
54997 21907436 21888550 21870165 21853125 21837784 21822923 21806982 21790248 21774144 21758177 21739609 21717184
54986 21717184 21693533 21672449 21654738 21638276 21621517 21605240 21590641 21577051 21562184 21544090 21522470
54975 21522470 21498787 21475591 21455202 21438112 21422582 21406347 21388728 21370481 21351749 21331554 21310034
54964 21310034 21289765 21273072 21258577 21242538 21223818 21205401 21190121 21176848 21162482 21146130 21129341
54953 21129341 21113187 21097385 21081914 21067149 21051970 21033910 21012437 20990799 20973133 20960035 20947917
54942 20947917 20932609 20913027 20891444 20870913 20852758 20836191 20819639 20802146 20783779 20765123 20746158
54931 20746158 20725526 20701693 20675789 20652499 20636167 20625789 20615458 20600313 20580596 20559662 20540344
54920 20540344 20524420 20513068 20505171 20496424 20482768 20464445 20444927 20426584 20409419 20393196 20378138
54909 20378138 20363511 20347920 20331444 20315540 20300533 20285124 20268705 20252259 20236579 20221457 20207023
54898 20207023 20193901 20181400 20167519 20151618 20135302 20119859 20104714 20089324 20074478 20060378 20045583
54887 20045583 20029676 20015138 20003997 19993860 19979998 19961187 19941138 19923935 19910001 19896945 19882546
54876 19882546 19865972 19847398 19827775 19808744 19791954 19778202 19767221 19758101 19749817 19741526 19732480 19721797
54864 19721797 19708556 19692252 19673023 19651505 19628975 19607599 19589754 19576325 19565703 19554865 19541679
54853 19541679 19526327 19510666 19496126 19482253 19467637 19452340 19438307 19426594 19415108 19400691 19383103
54842 19383103 19365377 19350242 19337786 19326736 19315991 19304281 19290408 19275345 19262439 19253783 19247350
54831 19247350 19239426 19229012 19218037 19207797 19197316 19185317 19172048 19158592 19145696 19133719 19122497
54820 19122497 19110686 19096356 19079161 19061111 19044225 19027857 19009458 18987966 18965585 18945797 18930072
54809 18930072 18916750 18902669 18885396 18864364 18841047 18818618 18800638 18788725 18781000 18773178 18761658
54798 18761658 18745712 18727022 18707641 18688610 18670265 18653338 18639201 18628694 18620849 18613335 18604324 18593590
54786 18593590 18581953 18570546 18560790 18553667 18547975 18540111 18526933 18508671 18488264 18468511 18450744 18435226
54774 18435226 18421023 18405813 18387757 18367701 18348137 18330033 18312344 18294562 18277590 18261526 18244659
54763 18244659 18226039 18207506 18191764 18179421 18169188 18159988 18151302 18141819 18129287 18112195 18091087 18068172
54751 18068172 18045978 18026363 18010387 17998446 17989786 17982066 17972786 17961853 17951245 17941001 17927532 17908384
54739 17908384 17887069 17869433 17855741 17840619 17821595 17803173 17789998 17779832 17766958 17750283 17734241
54728 17734241 17722640 17714912 17708135 17699960 17689407 17676954 17664234 17652373 17640731 17628276 17615377 17602871
54716 17602871 17590367 17577349 17565095 17555216 17546403 17534746 17517694 17496504 17474803 17455900 17441175
54705 17441175 17429607 17418763 17407095 17395094 17383695 17372719 17362012 17352654 17345087 17336954 17324883 17307985
54693 17307985 17288018 17267038 17246984 17230637 17219994 17213526 17207310 17199130 17189632 17179821 17169839 17160306
54681 17160306 17152328 17145696 17139079 17132163 17125398 17117741 17107554 17096319 17088314 17085207 17083542 17079256 17072398
54668 17072398 17065470 17059116 17051574 17041056 17026768 17008809 16989038 16971029 16957087 16945741 16933722 16920081
54656 16920081 16906949 16896526 16888452 16879833 16866990 16847879 16824185 16800818 16782188 16768777 16757721
54645 16757721 16746185 16733463 16720489 16708568 16698456 16689646 16680239 16667993 16651839 16632658 16612919
54634 16612919 16595322 16580869 16568081 16554867 16541192 16528900 16518873 16509894 16500776 16491782 16482653 16470937
54622 16470937 16454379 16434459 16415501 16400123 16386988 16373267 16358034 16342640 16328660 16316144 16303601
54611 16303601 16289237 16272424 16254314 16236949 16221483 16207322 16193207 16179117 16166328 16154944 16142190
54600 16142190 16124964 16104467 16086178 16073643 16063768 16050503 16032286 16013315 15997740 15985386 15973599
54589 15973599 15960643 15946146 15930571 15915815 15904608 15897591 15891955 15884110 15872694 15858420 15842709 15827450
54577 15827450 15814097 15801478 15786414 15768481 15752325 15742701 15738377 15733579 15724610 15712377 15698964 15685067
54565 15685067 15671438 15659856 15650857 15642084 15630614 15616299 15601702 15589002 15577825 15566270 15553753
54554 15553753 15542260 15534205 15529141 15523750 15515554 15505306 15494797 15483673 15470110 15453711 15435815 15417324
54542 15417324 15398285 15379735 15364152 15353275 15346294 15340408 15332574 15321046 15306313 15290411 15274678 15258834
54530 15258834 15243164 15230109 15221606 15215636 15208026 15197669 15187468 15179835 15173663 15166462 15157032 15145023
54518 15145023 15130308 15114394 15100369 15089453 15078997 15065744 15049949 15034579 15021670 15011361 15003342
54507 15003342 14996728 14989076 14978196 14965384 14954742 14948658 14945500 14942179 14937033 14929369 14918237 14903779
54495 14903779 14888860 14877250 14869806 14863679 14855559 14844802 14833175 14822606 14813885 14806685 14799798 14791580
54483 14791580 14781140 14769225 14757372 14746074 14734513 14722148 14709846 14698971 14689906 14681992 14674458 14667016
54471 14667016 14659880 14653557 14648147 14642475 14634607 14623907 14612000 14600868 14590544 14579561 14567218 14554106
54459 14554106 14540613 14526287 14511143 14496669 14484964 14477178 14472806 14469836 14465691 14458842 14449754 14439740
54447 14439740 14429219 14417985 14406947 14398123 14392516 14388940 14385395 14380608 14373937 14364979 14354073 14342355
54435 14342355 14330627 14318859 14307148 14296032 14285095 14272459 14257128 14241242 14228511 14220324 14214334
54424 14214334 14207080 14197276 14186394 14176617 14168482 14160452 14150615 14138780 14126786 14116944 14110386 14106359 14102352
54411 14102352 14095393 14084674 14072926 14063649 14056779 14048884 14038158 14026881 14017472 14008461 13997050 13984260
54399 13984260 13974178 13968259 13963370 13956197 13947008 13937834 13928918 13918615 13905758 13890909 13876018 13863612
54387 13863612 13855355 13850421 13845978 13840032 13833010 13825927 13818223 13808727 13798104 13788860 13782907 13779827 13777288
54374 13777288 13772542 13764174 13753365 13743171 13735584 13729385 13721728 13711597 13700801 13691545 13683865 13675642 13664647
54361 13664647 13650619 13635835 13623421 13614472 13607002 13598396 13588520 13579521 13572832 13567713 13562883 13558088 13553144
54348 13553144 13546575 13536744 13524356 13512674 13504435 13498875 13492441 13482759 13471363 13461660 13454506 13447266 13437893
54335 13437893 13428330 13422080 13419214 13415983 13409381 13399958 13389539 13378450 13366535 13355275 13346637 13340274 13333626
54322 13333626 13324930 13314908 13305186 13295962 13285786 13273358 13259438 13246928 13238762 13235508 13235213 13235340 13234050
54309 13234050 13229810 13221472 13209648 13196843 13185157 13174648 13164806 13156321 13150041 13145172 13140118 13134395 13128226
54296 13128226 13121074 13112480 13103656 13096099 13088933 13079892 13068882 13058228 13049188 13040643 13031667 13022852 13014313
54283 13014313 13005117 12996096 12990526 12989693 12989769 12985738 12977283 12968288 12961403 12955592 12948655 12939657 12928744 12916834
54269 12916834 12906044 12898640 12894791 12892552 12890511 12888961 12887750 12884461 12876204 12862935 12847952 12835036 12825573
54256 12825573 12818468 12812140 12805969 12799658 12792097 12782021 12770016 12758853 12750997 12746134 12741490 12734136 12722809
54243 12722809 12708533 12694306 12683369 12676533 12671349 12664664 12655810 12646676 12639287 12634094 12630144 12625846 12619902
54230 12619902 12612419 12604915 12598385 12591629 12582446 12570139 12556030 12541864 12528873 12518018 12509688 12502881
54218 12502881 12495733 12487160 12477402 12467160 12457091 12447998 12440467 12434116 12427896 12421048 12413287 12404697 12396407
54205 12396407 12390440 12387083 12382900 12373596 12359293 12344966 12334936 12328575 12322317 12314244 12305306 12297277 12291064
54192 12291064 12286357 12281511 12274185 12263477 12251517 12241908 12236333 12233270 12230042 12225469 12220303 12215661 12211637
54179 12211637 12207260 12201199 12192395 12180818 12168347 12158201 12152029 12147599 12141122 12132379 12125589 12123817 12124423
54166 12124423 12122000 12114395 12103343 12090545 12076631 12063744 12055273 12051688 12049455 12045578 12040750 12036456 12031565
54153 12031565 12024347 12016109 12010084 12007366 12006066 12003931 11999778 11992811 11982725 11970887 11959869 11951232 11944597
54140 11944597 11938889 11933474 11927809 11920846 11911416 11899358 11886354 11875316 11868000 11863116 11857763 11850928 11844087
54127 11844087 11837901 11830360 11819867 11808528 11800007 11794857 11790330 11784684 11779143 11774940 11770691 11764187 11755531
54114 11755531 11746824 11739095 11731012 11720925 11709390 11698952 11691706 11687640 11685344 11683462 11680882 11676363 11669441
54101 11669441 11661579 11654816 11648976 11641690 11631793 11620987 11611103 11601417 11590439 11579104 11569985 11563885 11559357
54088 11559357 11555429 11552501 11550240 11546868 11541835 11537506 11536486 11537949 11538261 11535145 11529792 11524241 11517938 11508448
54074 11508448 11495526 11482757 11473984 11469110 11465160 11461009 11458580 11458696 11458095 11452663 11442484 11431714 11423855
54061 11423855 11418897 11414995 11411202 11407769 11404679 11400683 11393895 11383465 11370595 11357316 11344148 11330085
54049 11330085 11315429 11303220 11296398 11294266 11293063 11289743 11284207 11278471 11274744 11273686 11273325 11270318 11263437
54036 11263437 11255044 11247780 11241091 11233293 11226057 11223502 11226084 11228263 11223995 11213034 11200398 11190753 11184918
54023 11184918 11181212 11178443 11177007 11177666 11179887 11181706 11181175 11177603 11171459 11163979 11157219 11153139 11151389 11148739
54009 11148739 11141936 11130760 11117438 11104139 11092423 11083974 11079604 11077808 11076192 11074032 11071776 11068737 11063658
53996 11063658 11057280 11051682 11046864 11040534 11031761 11022402 11014216 11007208 11001751 10999616 11000961 11002324 10999609 10992173
53982 10992173 10982800 10974870 10970306 10968465 10965798 10958294 10945912 10933302 10924851 10920412 10917164 10913695 10910315
53969 10910315 10906942 10903125 10899298 10895782 10891181 10883957 10875409 10869093 10867032 10867718 10867720 10864057 10855402 10842614
53955 10842614 10828654 10817250 10811097 10810732 10814038 10816827 10815869 10812383 10810864 10813110 10815251 10812680 10806326 10801261
53941 10801261 10799921 10799562 10796473 10790175 10782865 10776816 10773127 10771547 10770637 10768994 10766778 10765322 10765144 10765163 10764020
53926 10764020 10761427 10758253 10755838 10754912 10754536 10752680 10748485 10743237 10738372 10733710 10728860 10724986 10723278 10722499
53912 10722499 10720189 10715661 10709744 10702184 10691913 10679890 10669146 10661425 10655635 10649893 10643316 10635724 10627814
53899 10627814 10621811 10619534 10619178 10616413 10609666 10602239 10598237 10598260 10599868 10600109 10596593 10588586 10578774 10571929 10569896
53884 10569896 10569594 10567677 10565243 10565643 10569164 10572557 10573138 10570988 10567494 10563662 10559754 10555025 10548092 10538802
53870 10538802 10529015 10520204 10511512 10502061 10493851 10489449 10487350 10482822 10473897 10463831 10456775 10453421 10452001
53857 10452001 10451153 10449990 10447204 10442234 10436477 10431628 10427400 10422293 10416078 10410127 10405662 10402903 10401594 10400987
53843 10400987 10399476 10395757 10390649 10386536 10384458 10382816 10379705 10375792 10373869 10375793 10380709 10386260 10390680 10393374
53829 10393374 10394326 10393877 10392828 10391638 10389283 10383953 10375775 10368057 10364586 10365846 10369029 10371531 10372900 10373198
53815 10373198 10371676 10368487 10366063 10366442 10368038 10367500 10364585 10362411 10362093 10360009 10352499 10341248 10331152 10323779
53801 10323779 10316156 10306393 10297423 10293364 10293845 10293967 10289400 10280041 10268836 10258360 10248991 10239630 10229517
53788 10229517 10219224 10209960 10202024 10194134 10184292 10171368 10156180 10141390 10129751 10121676 10114687 10105937
53776 10105937 10094903 10082862 10070670 10058856 10049260 10043742 10040604 10034997 10024372 10011322 9999408 9988544
53764 9988544 9977066 9966115 9958277 9952737 9945630 9935500 9925123 9917189 9911017 9904557 9897006 9888163 9877595
53751 9877595 9866186 9856564 9850119 9844861 9837906 9829033 9820463 9814051 9809792 9806085 9800577 9792085 9782662 9776232
53737 9776232 9773860 9772027 9767105 9759785 9753063 9747682 9742389 9737391 9734042 9731328 9725993 9716872 9706468 9697381
53723 9697381 9689568 9682006 9674618 9667178 9658611 9649317 9642409 9640266 9640989 9640666 9638648 9638012 9640415 9642909 9641307
53708 9641307 9635340 9628708 9624367 9621374 9616964 9610573 9604622 9601542 9601239 9601817 9601888 9601350 9600538 9599744 9599458 9600010
53692 9600010 9600671 9599863 9596742 9592147 9587712 9584370 9581881 9579317 9575637 9570070 9562506 9553802 9545639 9539730
53678 9539730 9536511 9534335 9530576 9524274 9517446 9513120 9512201 9512872 9512855 9511293 9508346 9503950 9497663 9489279 9479256
53663 9479256 9468811 9459621 9452663 9447004 9440423 9431776 9422382 9414675 9409784 9406738 9403557 9398611 9391429 9382995
53649 9382995 9375240 9369572 9365721 9362269 9358250 9353749 9348861 9342866 9335280 9327637 9323278 9324538 9330196 9336136
53635 9336136 9338480 9335710 9328249 9317482 9305883 9296852 9292798 9293167 9295120 9296228 9295970 9294866 9293142 9290617
53621 9290617 9287372 9284147 9282024 9281431 9281355 9280255 9278227 9277218 9278025 9278176 9274898 9269770 9267895 9271554 9276897
53606 9276897 9278515 9275797 9272735 9272176 9272465 9270189 9264713 9258886 9255676 9254880 9253502 9249215 9242857 9237092 9233324
53591 9233324 9231073 9230013 9230834 9233532 9236432 9238027 9238596 9238835 9238091 9235681 9233196 9233497 9237313 9242394 9246326
53576 9246326 9248951 9251530 9254407 9256275 9255615 9252714 9250176 9250746 9254212 9257327 9257596 9256196 9255981 9257654 9259738
53561 9259738 9261572 9263863 9266146 9266225 9263123 9258648 9254906 9252069 9249903 9249658 9252222 9255365 9255219 9250689 9244925
53546 9244925 9242130 9243989 9249190 9255090 9259274 9260434 9258646 9255020 9251191 9249094 9250468 9255629 9262649 9268393
53532 9268393 9270540 9268614 9263719 9258015 9253926 9252658 9253249 9253730 9253346 9253167 9254518 9257430 9260657 9262797 9263466
53517 9263466 9263722 9264897 9266562 9266549 9264151 9262473 9265573 9273193 9280425 9283310 9282922 9282929 9285115 9289058 9294325 9300104
53501 9300104 9303378 9300756 9293036 9285717 9283624 9286472 9290888 9295268 9300821 9308699 9318130 9327483 9335588 9341549
53487 9341549 9344569 9344847 9343955 9343472 9343413 9342556 9340148 9336838 9333900 9332113 9331714 9333205 9337615 9345425 9355261 9364095
53471 9364095 9369233 9370127 9368212 9365248 9362225 9359717 9358509 9359233 9361511 9364043 9366027 9368451 9373479 9382040
53457 9382040 9392148 9400454 9405917 9411257 9419705 9430487 9438784 9440761 9437812 9435099 9436546 9442194 9449849
53444 9449849 9457851 9465917 9474478 9483953 9494022 9502943 9508335 9509750 9510244 9514224 9523330 9535145 9546282
53431 9546282 9556022 9566285 9578657 9592615 9606748 9620768 9635648 9652098 9669541 9686716 9702954
53420 9702954 9718728 9734994 9752156 9769719 9786866 9803101 9818275 9832473 9846450 9861787 9879712
53409 9879712 9899580 9919477 9938821 9959362 9982647 10007180 10029665 10049027 10067775 10088832 10112067
53398 10112067 10134795 10155053 10173564 10192807 10214780 10239364 10264290 10286893 10306396 10324424 10343238
53387 10343238 10363904 10386409 10410578 10435991 10461655 10486987 10512831 10540194 10567859 10592643 10612854
53376 10612854 10630899 10651641 10678075 10708666 10738567 10763526 10783072 10800113 10817480 10835416 10852784
53365 10852784 10869632 10887123 10905344 10923066 10939845 10956512 10973079 10988141 11001292 11014089 11027031
53354 11027031 11037536 11043342 11046592 11051570 11058912 11065105 11067832 11068616 11069326 11069209 11067451 11066086 11067640 11071330
53340 11071330 11074333 11076056 11078531 11082909 11088156 11093378 11099027 11105358 11112011 11119944 11131404 11146510 11161760
53327 11161760 11173748 11182989 11192281 11202643 11213070 11223256 11233772 11243745 11251316 11257208 11265332 11278365
53315 11278365 11294376 11309328 11321736 11333536 11347422 11364671 11384639 11404931 11422787 11437791 11452547
53304 11452547 11469350 11487038 11502931 11517056 11532305 11550817 11572589 11597447 11625412 11654455 11680855
53293 11680855 11703453 11725477 11750609 11779158 11809703 11842196 11876973 11912373 11946259 11979032 12012594
53282 12012594 12047215 12082059 12117973 12156349 12195259 12230422 12261009 12291343 12325302 12361651 12396530
53271 12396530 12427957 12455693 12479039 12497962 12515316 12534771 12556422 12576638 12592431 12604003 12612592
53260 12612592 12617584 12616960 12609939 12598454 12586022 12575205 12565874 12555828 12542942 12526381 12506246 12483352
53248 12483352 12459347 12435381 12410110 12380718 12346931 12312215 12279559 12247847 12214352 12179125 12144402
53237 12144402 12110823 12077161 12043155 12009555 11975438 11938690 11899817 11862424 11828845 11797577 11765977
53226 11765977 11733252 11699728 11665589 11631939 11601070 11573699 11547258 11518545 11487018 11454387 11422389
53215 11422389 11392106 11363976 11337111 11310011 11282888 11257273 11232126 11203281 11169279 11135062 11106328
53204 11106328 11081992 11056232 11026858 10997102 10969275 10941501 10912168 10883467 10858142 10835660 10813918
53193 10813918 10792544 10772243 10752651 10733099 10714156 10696514 10679527 10662422 10645612 10629192 10611889
53182 10611889 10593647 10577496 10566065 10557342 10547163 10535307 10525589 10519573 10513763 10504411 10492106 10479546
53170 10479546 10467118 10453353 10438316 10423655 10409545 10393978 10375468 10354883 10334216 10314689 10296104
53159 10296104 10276791 10253957 10225761 10193886 10162930 10136174 10112648 10088996 10063242 10035609 10006519
53148 10006519 9975565 9942471 9907639 9871567 9834975 9799683 9767808 9739130 9710299 9677797 9641253
53137 9641253 9603069 9565428 9528507 9491151 9452333 9412232 9372697 9336369 9304427 9275206 9245661
53126 9245661 9214009 9180590 9146811 9114055 9082949 9052686 9021647 8989587 8958303 8928916 8899813
53115 8899813 8869458 8840043 8815015 8793134 8768824 8739510 8709037 8681778 8656678 8630123 8601933
53104 8601933 8574554 8547899 8519335 8488435 8457860 8429233 8401742 8375368 8351647 8329591 8304362
53093 8304362 8272577 8236682 8201832 8170503 8142477 8117859 8096706 8076761 8055187 8032494 8011581
53082 8011581 7992607 7972076 7948224 7924534 7905634 7891290 7876773 7858565 7837820 7818121 7801152
53071 7801152 7784888 7765549 7741357 7714864 7691304 7674053 7661865 7650793 7638071 7623537 7608278
53060 7608278 7593453 7580094 7568349 7556467 7542025 7525020 7508730 7496566 7488482 7481108 7470986 7457285
53048 7457285 7441980 7427970 7416397 7405264 7391465 7374897 7359567 7349390 7343584 7337631 7328395 7316715
53036 7316715 7305270 7295850 7289109 7285022 7282547 7280021 7276834 7273741 7271007 7267553 7262779 7257709 7252994 7247125
53022 7247125 7238407 7227824 7218129 7210594 7204334 7198436 7192894 7187615 7182394 7178044 7175616 7173954 7169640 7160111
53008 7160111 7145861 7129541 7114492 7104295 7101321 7104128 7107768 7108183 7105549 7102409 7100030 7098033 7096091
52995 7096091 7093638 7088598 7078996 7066169 7054439 7046991 7043286 7040824 7037918 7034049 7029177 7024047 7020321
52982 7020321 7018928 7018368 7015600 7009030 7000377 6993593 6991775 6994563 6998128 6998153 6993304 6985743 6978282 6971530 6964078
52967 6964078 6954743 6944013 6933723 6925937 6921698 6919947 6917785 6912828 6905563 6898720 6894201 6891439 6888946
52954 6888946 6886245 6883333 6879266 6872867 6864728 6857120 6851620 6847953 6845437 6844202 6844156 6844139 6843443 6843322 6845273
52939 6845273 6848128 6848645 6845249 6839569 6833717 6827700 6820623 6813159 6807085 6802914 6799702 6797316 6797062 6799191
52925 6799191 6800922 6798476 6790991 6781500 6773878 6769695 6768324 6768859 6770606 6772132 6771556 6768501 6764703 6761710
52911 6761710 6758826 6754422 6748674 6743532 6740051 6737180 6733659 6729901 6727266 6726131 6725394 6723622 6720259 6715853
52897 6715853 6711210 6706333 6700630 6694714 6691143 6691948 6695507 6697394 6694692 6688377 6681341 6675645 6672025 6670177
52883 6670177 6668323 6664112 6657453 6651441 6649201 6650623 6653290 6655478 6656959 6657925 6658801 6660430 6662895 6664683
52869 6664683 6664280 6661859 6658201 6653174 6646928 6641421 6638439 6636927 6634627 6631605 6629419 6627278 6622328 6614281
52855 6614281 6606724 6602707 6601484 6600688 6599274 6596925 6592857 6587193 6581963 6579013 6577997 6577714 6578064 6579209 6580021
52840 6580021 6578935 6575685 6571273 6567134 6564883 6565359 6566839 6565767 6560505 6553027 6546015 6540280 6536319 6535737
52826 6535737 6538409 6539944 6535284 6524457 6512538 6504441 6501633 6502713 6504481 6503128 6497441 6491023 6488934
52813 6488934 6491899 6495889 6497235 6495728 6492831 6489566 6486668 6484390 6481598 6477153 6472402 6469795 6468797 6466086
52799 6466086 6460508 6454745 6450972 6448011 6444570 6442092 6441760 6441235 6437489 6431122 6424950 6419784 6414763 6410790
52785 6410790 6410048 6412157 6413967 6413749 6412961 6412973 6412231 6408071 6400278 6391952 6387236 6387985 6391707 6393173 6389493 6383378
52769 6383378 6379921 6380516 6382049 6381972 6381382 6381799 6381346 6376507 6366737 6355349 6346037 6340030 6336598 6334802 6333876
52754 6333876 6332482 6328600 6320833 6310142 6299859 6293149 6290394 6289656 6289497 6289993 6290719 6289472 6284478 6276929
52740 6276929 6269732 6264223 6259623 6255450 6252462 6250754 6248756 6245346 6241684 6239560 6238836 6238155 6237648 6238863 6241756
52725 6241756 6243753 6242785 6239716 6236532 6233510 6229867 6226053 6223064 6219946 6214696 6207988 6203328 6202231 6201581
52711 6201581 6197788 6191774 6187412 6186253 6186545 6186837 6187467 6188000 6186155 6180694 6173437 6166878 6161392 6156341 6152544
52696 6152544 6151583 6153224 6155303 6156023 6154852 6151370 6144904 6135820 6126140 6118398 6114397 6114791 6118672 6123341 6125763
52681 6125763 6125071 6123115 6122227 6122994 6124207 6123963 6120411 6112907 6103604 6096884 6095585 6097858 6098828 6095443 6088890
52666 6088890 6082570 6078975 6078450 6079487 6079506 6076607 6071575 6067642 6067420 6070384 6073723 6074972 6073138 6068265 6061413
52651 6061413 6054900 6051240 6051347 6054307 6058667 6063091 6066047 6066471 6065182 6064275 6064105 6061983 6055346 6045858 6038755
52636 6038755 6037589 6040537 6042586 6040931 6037295 6034852 6033978 6032184 6028111 6023989 6023026 6025309 6027853 6028348 6027024
52621 6027024 6024682 6021138 6016827 6014092 6014645 6016648 6016559 6013814 6011522 6011975 6013425 6012676 6009622 6007548 6009176
52606 6009176 6013765 6018309 6020546 6020042 6016992 6011230 6003135 5994989 5990236 5990501 5993586 5995156 5992729 5987868
52592 5987868 5984328 5984233 5986178 5987015 5985342 5982863 5982022 5982660 5981936 5977699 5971074 5965194 5962130 5961745 5962788 5963891
52576 5963891 5963847 5962122 5959328 5956344 5952902 5947696 5939928 5930109 5919583 5910157 5903878 5901815 5902686 5903749
52562 5903749 5903586 5903248 5904318 5906802 5909449 5911231 5911820 5911310 5910196 5909221 5908680 5908288 5907959 5907901 5907649 5906161 5903756
52545 5903756 5902756 5904778 5908030 5909007 5906682 5903348 5901124 5899507 5897245 5895114 5895004 5896777 5897851 5896383
52531 5896383 5893799 5893302 5896322 5901050 5904180 5903453 5898883 5892584 5887582 5885508 5884563 5880522 5871173 5859548
52517 5859548 5851469 5849573 5850914 5850943 5848700 5847033 5848380 5851748 5854051 5853566 5851491 5850306 5851079 5852548 5852640
52502 5852640 5850492 5846897 5843288 5840693 5839140 5837377 5833509 5826850 5819106 5813004 5809824 5809051 5810053 5812738
52488 5812738 5816685 5821109 5825779 5830271 5832179 5828566 5820443 5813513 5812412 5815753 5819037 5820844 5823202 5826685
52474 5826685 5828806 5827924 5825859 5825341 5826918 5829454 5831732 5832066 5828162 5819496 5809194 5801752 5798948 5798817 5798166
52459 5798166 5795160 5789997 5784367 5780239 5778295 5777464 5776407 5775063 5774189 5773930 5773884 5774281 5775950 5778939 5782014
52444 5782014 5783783 5783725 5782027 5779019 5775116 5770758 5766105 5761288 5757272 5755801 5757803 5761972 5765632 5767048
52430 5767048 5766330 5764099 5760285 5755001 5749861 5747039 5746866 5747617 5748150 5749335 5751698 5752925 5750113 5744623 5742320
52415 5742320 5747465 5757484 5765302 5766442 5762557 5758331 5756595 5757022 5758199 5759352 5760069 5759560 5757258 5754010
52401 5754010 5751774 5751573 5752053 5750744 5746691 5741295 5736495 5732812 5729465 5725868 5722480 5720421 5720635 5723126 5726512
52386 5726512 5728476 5727352 5723730 5720482 5720776 5725450 5731874 5735656 5734142 5728590 5722807 5719758 5719804 5721716 5724333
52371 5724333 5726929 5728951 5730083 5730176 5728874 5726130 5723423 5723244 5726164 5729067 5727910 5722303 5716223 5713892 5715978
52356 5715978 5720109 5724062 5727586 5731721 5737303 5744182 5751307 5757368 5761394 5762819 5761273 5756899 5751039 5745925
52342 5745925 5742992 5741714 5740629 5739515 5739819 5742589 5746552 5748969 5748453 5746340 5745044 5745537 5746931 5748139 5749163
52327 5749163 5750591 5752458 5753992 5754305 5753124 5751255 5750547 5752894 5758597 5765597 5770739 5772144 5770492 5768118
52313 5768118 5766839 5766531 5765883 5764577 5764308 5767161 5773147 5780002 5785407 5788633 5790047 5790192 5789961 5790762 5793534
52298 5793534 5798014 5803560 5809943 5816440 5820980 5821743 5819565 5817520 5817941 5820800 5824916 5829364 5833361 5836331
52284 5836331 5839099 5844092 5853075 5864846 5875921 5883318 5886248 5885722 5883501 5881443 5880970 5882795 5887310 5895048
52270 5895048 5906038 5918670 5930081 5938359 5944164 5949556 5955464 5961126 5966150 5971989 5980280 5990227 5999140
52257 5999140 6005851 6012251 6020671 6030936 6041247 6050973 6060778 6070275 6077706 6082711 6087974 6096889 6110078
52244 6110078 6124934 6138230 6148793 6158192 6169241 6183333 6198849 6212601 6223034 6231394 6239793 6249398
52232 6249398 6260922 6275144 6291410 6306758 6318543 6327778 6338262 6352423 6369432 6387311 6405008
52221 6405008 6421815 6436656 6449559 6462935 6479793 6500694 6523360 6545228 6565669 6585803 6607058
52210 6607058 6630142 6654742 6679674 6703657 6726496 6749509 6774340 6801084 6827922 6853030 6876764
52199 6876764 6901268 6927711 6954606 6979586 7002361 7024911 7048785 7073331 7097123 7120103 7143196
52188 7143196 7166200 7187366 7205546 7221949 7238982 7257672 7276974 7295578 7313328 7330300 7345243
52177 7345243 7356222 7362995 7367926 7374236 7383848 7396892 7412257 7428084 7442765 7456340 7470180 7484463
52165 7484463 7496925 7505588 7512124 7520615 7532909 7546732 7558641 7567494 7574764 7583095 7594975 7610993
52153 7610993 7628416 7643137 7654210 7665074 7679008 7694932 7709435 7721484 7732629 7743518 7753110
52142 7753110 7761603 7771583 7785233 7801935 7819319 7835358 7848925 7859803 7868761 7876485 7882014 7883716
52130 7883716 7882248 7880802 7881628 7884053 7886906 7890709 7895703 7899545 7899681 7897050 7894818 7893737 7891211 7884988
52116 7884988 7875443 7863908 7851243 7838954 7829386 7823405 7819539 7816916 7817399 7822874 7831592 7839297 7843417
52103 7843417 7844216 7842481 7838650 7834442 7832549 7833361 7833992 7832254 7830065 7830925 7835079 7839554 7842356 7843687 7842886
52088 7842886 7837579 7827828 7818599 7815201 7817415 7820870 7823353 7826456 7830885 7833846 7832922 7829925 7828449 7829212
52074 7829212 7830153 7830061 7829462 7828129 7824125 7816059 7804957 7793652 7785218 7781827 7783678 7788747 7794376 7799079
52060 7799079 7802241 7803215 7802495 7802767 7806068 7809913 7809184 7802739 7795578 7793211 7796323 7802312 7809303 7816092 7820587
52045 7820587 7821875 7822949 7828060 7837399 7847060 7854108 7858913 7862307 7863729 7863408 7863696 7866154 7869004 7869452 7867585
52030 7867585 7866181 7867312 7870697 7875145 7880348 7887067 7896115 7907006 7917541 7925692 7932493 7941789 7955913
52017 7955913 7972586 7987698 8000461 8013794 8029664 8046235 8060474 8071998 8083008 8095207 8108185
52006 8108185 8120633 8132217 8143987 8157173 8171591 8185333 8196633 8206306 8217604 8233052 8251979
51995 8251979 8271719 8290433 8307661 8322714 8334368 8342536 8348836 8354679 8359770 8363358 8366172 8369886 8375098
51982 8375098 8380909 8386335 8391077 8394818 8396705 8395906 8392294 8386563 8380144 8374691 8370835 8367436 8362705 8355872
51968 8355872 8347087 8336333 8323957 8312001 8303027 8297126 8291801 8285537 8279664 8275754 8273184 8270935 8269936
51955 8269936 8271257 8273192 8272773 8269668 8266063 8263002 8259432 8254882 8250300 8245592 8239079 8230613 8222852 8217872
51941 8217872 8214499 8210648 8206428 8202806 8198764 8192159 8182437 8170241 8155058 8135829 8113733 8091843 8071506
51928 8071506 8051069 8028786 8005264 7982347 7961153 7941991 7924561 7907017 7886219 7860409 7831019
51917 7831019 7800689 7770257 7739046 7707528 7677853 7651465 7627442 7603625 7578476 7551439 7522510
51906 7522510 7492356 7462448 7434348 7408889 7386123 7365518 7345601 7323965 7298535 7268944 7236370
51895 7236370 7202460 7169120 7138654 7112484 7089436 7066621 7042516 7017761 6992295 6963705 6930323
51884 6930323 6894671 6861178 6830790 6800497 6768731 6738465 6713260 6692138 6670596 6645968 6619899
51873 6619899 6595630 6574350 6554345 6532674 6507441 6479208 6450537 6423932 6400210 6378724 6358520
51862 6358520 6339005 6320354 6303660 6289770 6277558 6264774 6251443 6240749 6234711 6230313 6222463 6210229
51850 6210229 6197568 6187790 6180043 6172130 6164420 6159323 6158397 6161280 6166255 6170496 6170965 6166723 6159731 6151974
51836 6151974 6142504 6128730 6110137 6089047 6067902 6047585 6028673 6012488 5999606 5988241 5975492
51825 5975492 5960178 5943586 5927361 5911506 5895030 5878032 5862034 5847956 5834598 5819917 5803450
51814 5803450 5786674 5771231 5757718 5745980 5735375 5724554 5712136 5697976 5682769 5666269 5647537
51803 5647537 5627689 5610570 5598991 5591336 5583525 5573495 5561958 5549595 5536058 5521874 5509001 5498522
51791 5498522 5489512 5481076 5473925 5468691 5464028 5458093 5451321 5446210 5444320 5444456 5443879 5440666 5434969 5428559
51777 5428559 5423241 5419409 5416173 5412782 5409189 5404996 5398924 5390266 5380341 5371625 5365799 5363262 5363660 5365594
51763 5365594 5366427 5364129 5359453 5354693 5350180 5343796 5334648 5325289 5318694 5314080 5307585 5296758 5282969 5269451
51749 5269451 5258334 5249934 5243797 5239438 5236155 5232605 5227203 5219732 5212530 5208867 5209276 5210419 5208731 5204299
51735 5204299 5199574 5195188 5189364 5181439 5173298 5166507 5160320 5153914 5148486 5145205 5142794 5139396 5135649 5133381
51721 5133381 5131993 5129004 5124041 5119368 5115814 5111051 5103424 5095147 5089569 5086727 5083855 5079483 5074751 5070823
51707 5070823 5067141 5062847 5058526 5055667 5055116 5056623 5059212 5061610 5062860 5063086 5063364 5064400 5065556 5065532 5063788
51692 5063788 5060981 5058216 5056359 5055877 5056552 5056873 5054283 5047026 5036052 5024658 5015844 5010256 5006721 5004096
51678 5004096 5001897 4999635 4996681 4993309 4991268 4992650 4997873 5004617 5008953 5008139 5002890 4996592 4991940 4988849
51664 4988849 4986115 4983989 4983657 4984576 4984170 4980673 4975036 4969638 4966150 4964903 4965000 4964486 4961657 4956891 4951923
51649 4951923 4946875 4939785 4930325 4922050 4918615 4918606 4916535 4909059 4898478 4889806 4885816 4885425 4885782 4885285 4884760
51634 4884760 4885686 4887363 4887059 4883867 4880949 4881813 4885136 4885869 4881640 4875649 4872411 4872894 4875180 4877975 4881293
51619 4881293 4884443 4885369 4882441 4876149 4868977 4863801 4861841 4861548 4859819 4854844 4847808 4841778 4839226 4840457
51605 4840457 4843608 4846106 4846810 4846822 4847728 4849475 4851006 4852351 4854254 4856046 4856339 4856166 4858441 4862777 4863720 4856979
51589 4856979 4845623 4837027 4834587 4835604 4836852 4838438 4841091 4842659 4839589 4830804 4818783 4807647 4800928
51576 4800928 4799909 4802797 4806168 4808161 4809895 4813147 4817528 4820901 4821922 4821118 4819771 4818699 4818030 4817305 4815774
51561 4815774 4813276 4810983 4810760 4813493 4818171 4822720 4825639 4826940 4827850 4829905 4834421 4842336 4853526 4865680
51547 4865680 4874651 4877419 4874991 4871241 4868421 4864786 4857561 4847485 4839017 4835843 4837014 4837850 4834435 4827129
51533 4827129 4819951 4816655 4817270 4818603 4817998 4815962 4814770 4815248 4815976 4815316 4812857 4808643 4802380 4794523 4787380
51518 4787380 4783746 4784417 4787937 4792645 4797843 4802758 4805837 4806383 4806347 4809185 4816523 4826378 4834779 4838943 4839171
51503 4839171 4838274 4839170 4842626 4847222 4851318 4854335 4855849 4854879 4851652 4849162 4850649 4855330 4858852 4858763 4857427
51488 4857427 4858321 4861516 4864750 4867292 4870122 4873048 4874391 4873638 4872206 4871269 4870637 4870168 4870387 4871330 4872591 4875124
51472 4875124 4881136 4891252 4903273 4914601 4924180 4931200 4934129 4932921 4930679 4930938 4934239 4939402 4947118
51459 4947118 4959493 4976056 4992875 5006546 5017195 5026627 5035258 5042254 5047611 5052617 5058586 5066020 5074315
51446 5074315 5081011 5081840 5073366 5056665 5037570 5022129 5011701 5003048 4993009 4981967 4972281 4964586 4957145
51433 4957145 4948430 4938679 4928640 4918503 4908817 4900887 4894927 4889037 4881640 4874020 4868503 4864767 4860172
51420 4860172 4853731 4847391 4842704 4838424 4832628 4825538 4818684 4812559 4806730 4801360 4796749 4791807 4784785 4775682
51406 4775682 4766459 4758466 4750826 4741861 4731445 4721559 4714925 4712980 4714528 4716446 4716499 4715228 4714167 4712662
51392 4712662 4708318 4700880 4693563 4689299 4687406 4685656 4684118 4684365 4685478 4683772 4677107 4667172 4656553 4645644
51378 4645644 4634066 4623436 4616375 4613304 4612078 4610744 4609150 4607873 4607001 4606302 4605401 4603465 4599760 4594982
51364 4594982 4591174 4589670 4589638 4588993 4586417 4582387 4578679 4576951 4577371 4578699 4580071 4582099 4585391 4588777 4590596
51349 4590596 4591382 4593274 4596644 4599462 4600579 4601440 4603351 4605270 4606006 4606661 4608588 4610480 4610288 4609326 4611391
51334 4611391 4617491 4623960 4626629 4625144 4622479 4621729 4624100 4628614 4632847 4634867 4635107 4635689 4637691 4640151 4641889
51319 4641889 4642950 4643788 4644359 4644818 4645886 4647599 4648718 4648385 4647488 4647375 4647944 4648116 4647704 4647552 4648020 4648419 4648202
51302 4648202 4648036 4649406 4653403 4659881 4667448 4674283 4679178 4682105 4684054 4686394 4689935 4694193 4697912 4700668
51288 4700668 4703372 4706769 4710555 4715149 4723113 4736546 4753529 4769779 4784086 4799317 4817066 4834284
51276 4834284 4847420 4857602 4868842 4882338 4895448 4905872 4913936 4920450 4924791 4926086 4924593 4920761
51264 4920761 4914094 4904131 4891958 4879816 4869206 4859772 4850022 4839018 4827243 4815644 4804039 4791273
51252 4791273 4777181 4763470 4752019 4743121 4736162 4730899 4726729 4721525 4713130 4702152 4691808 4684595 4680045
51239 4680045 4675952 4670789 4664453 4657386 4649727 4641390 4632802 4625045 4618489 4611503 4602052 4591179 4583314 4581669
51225 4581669 4584512 4587383 4587799 4585914 4581838 4575132 4566796 4559228 4553789 4550204 4548365 4548549 4549683 4549729 4548354
51210 4548354 4547002 4545598 4541520 4533110 4522337 4512628 4505473 4500165 4495371 4489960 4483789 4478711 4477161 4478837
51196 4478837 4480648 4480958 4481605 4484183 4486900 4487681 4488199 4491497 4496680 4499416 4497575 4493400 4489801 4487172 4484543
51181 4484543 4481620 4478522 4474917 4470520 4465751 4461558 4458975 4458431 4458637 4456949 4452298 4447103 4444480 4444253 4443871
51166 4443871 4442784 4443103 4445684 4448701 4451211 4455175 4461814 4468089 4469571 4465859 4460891 4458394 4458969 4461410
51152 4461410 4464687 4468038 4470654 4472203 4473067 4473506 4473157 4471778 4470104 4469457 4470557 4472868 4474975 4475452 4473640
51137 4473640 4470200 4467116 4466614 4469243 4473078 4475626 4476708 4478617 4483029 4488677 4492714 4493329 4490237 4483916
51123 4483916 4476126 4470436 4469996 4474322 4479643 4482678 4483234 4483463 4485884 4491676 4499093 4503933 4503722 4501431 4502568
51108 4502568 4508296 4514236 4516856 4517775 4519901 4522464 4522960 4521980 4522441 4524812 4526340 4525103 4522251 4519971 4519419
51093 4519419 4520944 4524271 4527878 4529820 4529896 4529832 4531108 4533697 4536974 4540600 4544363 4548230 4552320 4555632 4555407
51078 4555407 4549839 4541295 4534735 4532527 4532790 4533169 4533849 4535897 4538881 4541745 4544487 4547333 4549490 4550138 4549751
51063 4549751 4549295 4549055 4549345 4551160 4554787 4558694 4561033 4561469 4560468 4558033 4554653 4552378 4553183 4556975 4562685
51048 4562685 4570316 4579894 4589283 4595588 4598593 4600572 4602649 4603842 4604203 4606218 4611511 4617848 4621246 4620382
51034 4620382 4617800 4617324 4621043 4628071 4635314 4639901 4641626 4642764 4645266 4648929 4652711 4656835 4662494 4669949
51020 4669949 4677912 4684839 4690325 4695305 4701086 4707931 4714449 4718797 4720701 4721804 4723825 4726939 4730228 4733145
51006 4733145 4736100 4739969 4745325 4751804 4758270 4764033 4769814 4776771 4784928 4793695 4803636 4815815 4828832
50993 4828832 4838577 4842356 4842080 4842013 4844469 4849031 4854820 4861385 4867755 4872591 4875616 4877824 4880218 4883328 4887742
50978 4887742 4893890 4901385 4909458 4917860 4926472 4934662 4942446 4951687 4964449 4980187 4996255 5011289 5026293
50965 5026293 5042084 5057485 5070738 5081206 5088885 5093819 5097225 5102114 5111455 5125783 5142900 5159381
50953 5159381 5172426 5181544 5188906 5197048 5206025 5213968 5220521 5227775 5237140 5247342 5256775 5265989 5276203
50940 5276203 5286891 5296863 5306643 5317634 5329628 5341098 5351490 5361436 5371190 5380798 5391390 5404215
50928 5404215 5418540 5432698 5447331 5465261 5487574 5512023 5536324 5561150 5588327 5617429 5645716
50917 5645716 5670825 5692415 5711725 5730597 5750721 5773111 5798270 5826611 5857826 5889793 5919510
50906 5919510 5945908 5970649 5995341 6019161 6040504 6060072 6080585 6103519 6127591 6150843 6173051
50895 6173051 6195313 6217903 6239587 6259350 6278055 6297472 6317655 6336577 6353397 6371133 6394341
50884 6394341 6424216 6457663 6491285 6524287 6556846 6588132 6617870 6648230 6681746 6718002 6754494
50873 6754494 6790393 6827182 6865570 6904123 6941917 6980912 7024411 7073944 7128240 7184501 7240140
50862 7240140 7294144 7347564 7402248 7458693 7515524 7571028 7624427 7675462 7723789 7769257 7811941
50851 7811941 7851442 7886976 7918564 7947237 7973630 7997479 8019115 8040091 8061250 8081277 8098646
50840 8098646 8113970 8128630 8141508 8149211 8150011 8146234 8142263 8141078 8142698 8144603 8143179 8136017 8123703
50827 8123703 8108718 8092152 8072388 8047728 8019559 7991943 7968272 7948723 7930645 7910992 7888759
50816 7888759 7865512 7843573 7823868 7805953 7789633 7775380 7763265 7753014 7745386 7741647 7740876 7739810
50804 7739810 7736958 7735137 7737705 7743649 7749360 7754712 7764010 7780019 7799938 7818975 7835981 7853595 7874123
50791 7874123 7897435 7922538 7949266 7977986 8008454 8039312 8068437 8094073 8116205 8136587 8157020
50780 8157020 8177772 8198019 8217480 8237175 8258790 8283351 8310131 8336947 8362406 8388151 8417866
50769 8417866 8453484 8493178 8533543 8572831 8611291 8649601 8688412 8728853 8772148 8818812 8868952
50758 8868952 8922849 8980346 9040281 9101727 9165483 9233401 9306707 9385966 9471898 9564618 9662411
50747 9662411 9762890 9865319 9970328 10077462 10184675 10290376 10394293 10496054 10594586 10689223
50737 10689223 10779344 10862057 10932434 10987872 11031059 11066965 11097839 11122874 11142035 11157924 11173392
50726 11173392 11188889 11202983 11214661 11224285 11232665 11239980 11245660 11248712 11247663 11240291 11224225 11198241
50714 11198241 11162611 11117991 11064764 11004152 10938739 10870240 10797416 10718210 10633865 10548691 10465437
50703 10465437 10383397 10301964 10223342 10149728 10080018 10012079 9946882 9887377 9833737 9782640 9731467
50692 9731467 9680551 9630838 9581904 9533493 9486963 9443588 9402894 9364180 9328586 9297872 9271670
50681 9271670 9247535 9223674 9200469 9179169 9159985 9141740 9122946 9103148 9083412 9065096 9047708
50670 9047708 9028424 9004607 8976567 8947097 8918417 8890607 8863054 8836116 8810554 8786257 8762554
50659 8762554 8739398 8717296 8696260 8675798 8655805 8636631 8618267 8600711 8585383 8574931 8570662
50648 8570662 8570850 8572360 8573493 8574689 8577460 8583672 8595040 8611742 8631745 8653003 8676138 8703520 8735651
50635 8735651 8770155 8804645 8838929 8873692 8908894 8944877 8983871 9028504 9078813 9131584 9182405
50624 9182405 9227994 9267412 9302201 9335045 9367452 9398632 9426724 9450372 9468817 9481540 9488877
50613 9488877 9492299 9493247 9492190 9489543 9486733 9485396 9486092 9488350 9490990 9491584 9487063 9476582 9462914 9449330
50599 9449330 9435730 9419405 9398850 9374803 9348134 9318952 9287524 9253723 9215658 9171682 9124345
50588 9124345 9079595 9040857 9006240 8972980 8942088 8916297 8895260 8875651 8855362 8835111 8816242
50577 8816242 8799302 8785149 8775480 8771330 8771979 8775589 8779942 8782680 8782488 8780757 8780837 8784531 8790061 8794447
50563 8794447 8797300 8800935 8806737 8812625 8814872 8812086 8806811 8803209 8803480 8806616 8810388 8814121 8819074 8826208
50549 8826208 8834194 8840437 8843805 8845554 8847479 8850219 8853749 8858128 8862614 8865331 8865704 8866594 8871709 8880866
50535 8880866 8890194 8897521 8905060 8915570 8928242 8940223 8950292 8958985 8966822 8974771 8984788 8996871
50523 8996871 9006619 9009010 9004339 8997342 8990603 8982229 8970467 8957175 8945339 8935960 8928865 8924045 8920639
50510 8920639 8916861 8912606 8909999 8909692 8908866 8904874 8898572 8891672 8882778 8869120 8850886 8830822 8810165
50497 8810165 8787762 8762720 8735192 8704747 8670721 8634493 8599111 8566129 8534807 8504538 8475813
50486 8475813 8448390 8420893 8393322 8367972 8346746 8329122 8313800 8300548 8288998 8277282 8264127
50475 8264127 8251567 8243561 8241750 8244069 8247707 8252147 8258781 8268652 8281608 8297174 8315048 8334408 8353485
50462 8353485 8370644 8385751 8399748 8412961 8424793 8435561 8447692 8464080 8485333 8509156 8532222
50451 8532222 8552256 8568964 8583937 8599623 8617543 8637199 8656971 8675968 8694838 8715276 8739033
50440 8739033 8766718 8796898 8827080 8856433 8886940 8920887 8957812 8995221 9031880 9069021 9108464
50429 9108464 9150952 9196355 9244105 9292974 9341539 9389303 9436612 9483407 9528999 9573025 9615348
50418 9615348 9654884 9689729 9718919 9742921 9762161 9776424 9786149 9792693 9796212 9794536 9785485 9769621
50406 9769621 9749625 9727598 9704158 9679650 9654777 9630000 9605370 9581347 9559214 9540445 9525900
50395 9525900 9515457 9508044 9502064 9496193 9489927 9483342 9476561 9469312 9460516 9448117 9429836 9404558 9372869
50382 9372869 9336265 9296186 9253500 9207870 9157500 9100781 9038935 8975990 8915153 8855934 8795999
50371 8795999 8735049 8675415 8619080 8565755 8514227 8464210 8416194 8370540 8327683 8288540 8253563
50360 8253563 8221397 8189266 8155028 8118819 8082967 8050665 8024339 8004471 7989553 7977337 7966186
50349 7966186 7955230 7943721 7931069 7917493 7903811 7890332 7876732 7863231 7850598 7838119 7822835
50338 7822835 7802707 7780020 7759671 7743706 7729305 7712715 7693535 7674235 7657010 7642262 7628975
50327 7628975 7615277 7599706 7583321 7569618 7560822 7554917 7547918 7538634 7529892 7525630 7528115 7537120 7549960
50314 7549960 7562731 7573483 7584089 7597335 7612535 7626038 7635872 7643707 7652020 7661568 7672076 7683111
50302 7683111 7693268 7700337 7703299 7702949 7700034 7694335 7685867 7675068 7661141 7642199 7617799 7589509 7558467
50289 7558467 7524738 7489685 7456027 7423961 7390208 7353074 7315891 7282812 7253563 7225592 7199459
50278 7199459 7178134 7161687 7146500 7130174 7114216 7101088 7090796 7080979 7068927 7053295 7035246
50267 7035246 7017656 7001825 6985640 6966580 6945552 6925371 6906026 6884168 6857192 6825562 6791339
50256 6791339 6756933 6724997 6696401 6668012 6635451 6598687 6561976 6527790 6494395 6460804 6430369
50245 6430369 6406607 6388019 6370081 6350733 6331078 6311829 6292048 6271152 6249895 6229243 6209735
50234 6209735 6191878 6175711 6160166 6144022 6127518 6112231 6099527 6089577 6081262 6072497 6061502 6048556
50222 6048556 6035852 6025226 6017110 6012090 6011614 6015762 6021735 6026309 6028957 6031212 6034065 6037630 6042371 6048556
50208 6048556 6054915 6059616 6062335 6063855 6064126 6062529 6059851 6058236 6058947 6061394 6064282 6066414 6066544 6063812 6058502
50193 6058502 6051580 6043949 6036987 6032635 6031034 6028944 6022852 6013411 6004479 5997739 5990777 5980987 5969165 5958330
50179 5958330 5950915 5947889 5948685 5950968 5952232 5952773 5955530 5962081 5970691 5979567 5989974 6003982 6020478 6035848
50165 6035848 6048202 6059135 6071388 6086196 6102676 6118563 6131739 6142139 6151994 6163310 6175518
50154 6175518 6186516 6195309 6202241 6207055 6208319 6204962 6197338 6186761 6174695 6162099 6148553 6132484
50142 6132484 6113436 6093733 6076356 6061225 6045246 6026278 6005593 5985906 5968387 5952405 5937018
50131 5937018 5921805 5906911 5892985 5880431 5868401 5855607 5842644 5832124 5825255 5819341 5810339 5797488
50119 5797488 5783828 5772110 5761732 5750114 5735891 5720090 5705046 5692697 5683181 5674335 5663191 5648759
50107 5648759 5633049 5618740 5606331 5594461 5582576 5571914 5563623 5557264 5551911 5547733 5545257 5543609
50095 5543609 5540911 5536526 5531719 5527667 5523796 5518926 5513260 5508315 5505182 5503897 5504399 5506934 5511179 5515834
50081 5515834 5519720 5522650 5524469 5523797 5518906 5509978 5499539 5490279 5483178 5477918 5473982 5470321 5465030 5457137
50067 5457137 5448689 5443328 5442274 5443080 5443002 5442207 5442719 5445514 5450077 5455621 5460993 5464296 5464824 5465191 5469510 5479391
50051 5479391 5493417 5510260 5529811 5551003 5571520 5590959 5611843 5635729 5660436 5683059 5703700
50040 5703700 5723927 5743604 5762395 5782875 5808071 5835889 5859683 5875503 5885876 5895180 5903938 5909355
50028 5909355 5909311 5903480 5891843 5874481 5852757 5829241 5806179 5784451 5763549 5742133 5719264 5695577
50016 5695577 5672570 5650455 5627954 5604906 5583756 5567233 5555174 5544752 5533307 5520182 5506378
50005 5506378 5493315 5481420 5469282 5454952 5438831 5424266 5414109 5407500 5401375 5394377 5387630 5382057
49993 5382057 5376818 5370771 5364082 5357882 5353210 5350562 5349416 5347821 5343430 5335808 5327393 5321680 5320380 5322238
49979 5322238 5324279 5324259 5322481 5321514 5323983 5330459 5339300 5348078 5355183 5360731 5366571 5374818 5385768 5397490
49965 5397490 5407875 5416673 5424982 5433327 5440884 5446203 5448209 5447196 5445416 5445742 5448672 5451490 5451396 5448577
49951 5448577 5444730 5439717 5431946 5421873 5412828 5407943 5407912 5411853 5418322 5424791 5428202 5427514 5424772 5422980
49937 5422980 5423953 5428618 5437496 5449632 5462430 5474124 5485633 5498771 5513643 5529103 5544953 5561978
49925 5561978 5580122 5598150 5615011 5630387 5643871 5654870 5663551 5671195 5679492 5689816 5702623 5716438
49913 5716438 5727581 5732273 5729500 5721309 5710168 5696682 5679986 5659526 5635971 5610754 5585087 5559315
49901 5559315 5533211 5506992 5481791 5458799 5438236 5419600 5402398 5385754 5367664 5346143 5321574
49890 5321574 5296749 5273728 5251529 5227996 5203319 5180194 5160558 5143720 5128268 5114180 5101662
49879 5101662 5088939 5073359 5054940 5037100 5023006 5012324 5002374 4991525 4980240 4969406 4958930
49868 4958930 4947951 4935737 4922508 4909867 4899799 4892549 4886221 4879491 4873796 4871298 4871320 4870683 4867445
49855 4867445 4862292 4856139 4848608 4839673 4830737 4822519 4813244 4800468 4784064 4766315 4749761 4735856 4724779
49842 4724779 4715286 4705106 4692650 4678382 4664067 4651056 4639536 4628796 4617778 4606126 4595055
49831 4595055 4586242 4579435 4572268 4563067 4552700 4542971 4534489 4527047 4520765 4515678 4511370 4508207 4507597 4509628
49817 4509628 4511762 4511721 4510554 4510820 4512522 4513076 4510917 4507047 4503127 4499995 4498018 4497070 4495979 4493771 4491573
49802 4491573 4491562 4493731 4495358 4494100 4490085 4484678 4478783 4473059 4468290 4464495 4460330 4454014 4444769 4433756
49788 4433756 4424185 4419528 4420062 4421716 4420023 4414784 4409019 4404138 4398992 4393576 4390264 4390312 4392105 4394295 4397923
49773 4397923 4403408 4407973 4408775 4406812 4405108 4404310 4403022 4401587 4402276 4405550 4408976 4410788 4412329 4415720 4420751
49758 4420751 4425493 4429040 4432135 4435430 4438293 4439477 4437989 4433051 4424249 4412782 4402144 4395946 4394439
49745 4394439 4394271 4392497 4389704 4387962 4387128 4385444 4383146 4382625 4384640 4387156 4388994 4392145 4398640 4407094 4414412
49730 4414412 4419489 4423055 4424949 4424158 4421394 4419510 4420813 4425089 4430362 4434642 4436976 4437589 4437017 4434959 4430947
49715 4430947 4426493 4424787 4426789 4429112 4427771 4422940 4417715 4413218 4407827 4401068 4395183 4392140 4391587 4392657
49701 4392657 4395370 4398926 4400780 4399174 4395252 4391151 4387258 4382866 4378287 4374435 4371129 4367794 4365471 4366162
49687 4366162 4370069 4375133 4379619 4383570 4387214 4389495 4389460 4388147 4387534 4387862 4387308 4384806 4382196 4382785 4387934
49672 4387934 4395569 4401952 4404586 4403568 4400652 4397356 4393949 4390218 4386886 4385523 4386585 4388243 4388087 4385637
49658 4385637 4382113 4378040 4372779 4366776 4362349 4360965 4361084 4360317 4358721 4358046 4358352 4357686 4355329 4353105 4352489
49643 4352489 4352156 4349838 4345643 4342000 4340695 4341240 4342220 4343121 4344379 4346281 4348535 4350998 4354383 4359797 4367337
49628 4367337 4375411 4381749 4385072 4385672 4384700 4383478 4383277 4384879 4387909 4391076 4393616 4396225 4400049 4404831 4408705
49613 4408705 4410245 4410358 4411442 4414433 4417391 4417770 4415842 4414834 4417331 4422364 4426665 4428239 4427960 4428031 4429706
49598 4429706 4432527 4435139 4436658 4437547 4439259 4442950 4448568 4455212 4462074 4469074 4476988 4486873 4498515 4509369
49584 4509369 4516338 4519330 4521895 4527395 4535502 4543724 4551187 4558906 4566772 4572566 4574627 4573901 4572641 4572160
49570 4572160 4572474 4573123 4573486 4572877 4570870 4567301 4562100 4555935 4550928 4549493 4551952 4556098 4559423 4560776 4559697
49555 4559697 4555635 4549013 4542110 4537334 4534730 4532053 4527471 4521673 4517327 4516629 4519203 4522375 4523778 4523677
49541 4523677 4524151 4526076 4527933 4527987 4526597 4525441 4525126 4524627 4522807 4519588 4515710 4512194 4510092 4509901 4510736 4510699
49525 4510699 4508783 4506327 4505891 4508333 4511598 4513090 4513023 4514369 4519347 4527116 4535345 4542625 4548034 4549717 4546235
49510 4546235 4539315 4533308 4531259 4532687 4535347 4537751 4539632 4541503 4544486 4549317 4554944 4559254 4561694 4563662
49496 4563662 4565820 4566822 4565815 4564426 4564700 4566514 4568698 4571466 4575583 4579936 4582157 4581619 4580099 4579570 4580808
49481 4580808 4583862 4588155 4592239 4595259 4598932 4606257 4617662 4629706 4638319 4642565 4645113 4649910 4659251
49468 4659251 4671832 4683640 4692203 4699899 4711334 4727251 4743131 4754508 4761495 4766895 4772032 4776451
49456 4776451 4780040 4782953 4784190 4782765 4780142 4779463 4782037 4786173 4789659 4791980 4793944 4796747 4801703 4809355
49442 4809355 4818256 4825878 4831266 4835674 4840354 4845297 4850593 4856922 4863662 4868634 4871731 4876915 4887827 4902452
49428 4902452 4915229 4924314 4933508 4946422 4961914 4976829 4990346 5003030 5013663 5020267 5023694 5027229
49416 5027229 5032493 5038122 5042867 5047548 5052788 5057025 5058744 5059589 5063013 5069784 5076448 5078937 5076804 5073187
49402 5073187 5071211 5071200 5071253 5069556 5065713 5060625 5055964 5053418 5053348 5054224 5054556 5055536 5060186 5069019 5078081 5082977
49386 5082977 5084077 5085945 5091903 5100848 5109398 5115367 5118635 5120259 5121622 5123475 5124950 5124270 5121078 5117502
49372 5117502 5116284 5118214 5121641 5124009 5123828 5121730 5119726 5118826 5117783 5115243 5112818 5114137 5120294 5127880
49358 5127880 5132523 5133191 5132155 5131992 5133976 5138367 5144536 5150836 5155525 5158133 5159591 5161346 5164504 5169293
49344 5169293 5174935 5180637 5186858 5194764 5204091 5212650 5218547 5221987 5224368 5226763 5229994 5234962 5241874 5249903
49330 5249903 5258289 5266738 5274312 5279685 5283526 5288768 5296903 5305581 5311685 5315229 5318179 5321018 5323313 5326623
49316 5326623 5333642 5344377 5355817 5365573 5373645 5380785 5387727 5396264 5408279 5422976 5437281 5449697
49304 5449697 5461619 5474305 5487067 5499397 5512287 5525941 5538491 5548778 5558440 5569394 5580994
49293 5580994 5591849 5602825 5615670 5629443 5640897 5648445 5653712 5658995 5664839 5670699 5676745 5684074 5693096
49280 5693096 5701877 5706702 5705463 5700770 5698225 5700832 5706366 5711190 5715043 5720281 5727643 5735057 5740402 5743531
49266 5743531 5745479 5747211 5749276 5751530 5753200 5754284 5756475 5761278 5767480 5772018 5773339 5772473 5771016 5769842
49252 5769842 5769798 5771530 5773990 5774893 5773500 5771258 5768988 5765410 5759759 5754018 5750563 5748979 5747312 5745553 5745348
49237 5745348 5746539 5746547 5743707 5739170 5734692 5730492 5726471 5723870 5723867 5725263 5725334 5722736 5718312 5713210 5707710 5702112
49221 5702112 5697428 5694567 5693558 5694042 5695696 5697783 5699089 5699105 5698626 5698563 5698802 5698965 5699701 5701914 5705018 5707139
49205 5707139 5707325 5706510 5706073 5706342 5706983 5708012 5709764 5712282 5715189 5717848 5719450 5719536 5718727 5718133 5717582 5715377
49189 5715377 5710682 5705388 5702493 5703111 5706092 5709890 5713019 5713070 5707939 5699431 5693773 5696365 5706473 5718780
49175 5718780 5729754 5740482 5753154 5767207 5780562 5793024 5806008 5818996 5828562 5832047 5831062 5830056
49163 5830056 5831908 5836265 5842069 5850098 5861773 5876220 5890262 5901796 5911870 5922273 5932128 5938872
49151 5938872 5942627 5947302 5956005 5967111 5976811 5984569 5993443 6005179 6017658 6028136 6036671 6044740 6052346
49138 6052346 6058793 6065567 6075933 6091407 6110122 6129164 6147195 6164332 6180569 6195423 6209058 6223183
49126 6223183 6240519 6262975 6290012 6318773 6346036 6370145 6391590 6412519 6435419 6460879 6486237
49115 6486237 6507950 6526142 6545284 6569109 6596509 6624395 6652912 6684767 6719871 6754069 6783985
49104 6783985 6810501 6836353 6862593 6888972 6915796 6943566 6971901 7000474 7029973 7060686 7091024
49093 7091024 7119287 7146567 7176322 7210961 7249655 7289343 7326998 7361090 7391826 7420476 7448360
49082 7448360 7476595 7506476 7539114 7574399 7611129 7648490 7686377 7723871 7759005 7791194 7822815
49071 7822815 7856819 7893394 7930351 7966408 8002556 8040147 8078773 8116297 8150344 8179789 8205537
49060 8205537 8230074 8256065 8285324 8318618 8355089 8391576 8424311 8452777 8480909 8512960 8548970
49049 8548970 8585738 8621207 8655722 8689574 8722123 8753818 8786666 8821405 8855965 8888166 8918625
49038 8918625 8949342 8980267 9009221 9035211 9060224 9087141 9116963 9148846 9181942 9215738 9248780
49027 9248780 9278855 9305509 9331224 9358548 9386791 9413568 9439385 9467968 9500967 9534683 9564063
49016 9564063 9588560 9611970 9637702 9666485 9697902 9731221 9764347 9794301 9819721 9841501 9860715
49005 9860715 9877559 9892735 9907995 9924284 9940692 9956048 9970370 9983925 9996200 10006912 10017036
48994 10017036 10027763 10039072 10050153 10060566 10070320 10079561 10088887 10099256 10110863 10122846 10134607 10146500
48982 10146500 10158653 10170314 10181242 10192500 10204593 10215968 10224988 10232533 10240718 10249629 10257580 10264609
48970 10264609 10273358 10285561 10299575 10312769 10324944 10337704 10351112 10362925 10371298 10376871 10381510 10385945
48958 10385945 10389558 10392075 10394453 10397788 10401886 10405500 10407946 10409981 10412789 10416398 10419633 10421633 10422798 10423766
48944 10423766 10423960 10422088 10418252 10414720 10413944 10416178 10419612 10422486 10424430 10426019 10428065 10431340 10435962 10440703
48930 10440703 10443984 10446091 10449524 10456233 10465170 10473439 10479363 10483621 10487924 10493668 10501354 10509932 10516642 10518944
48916 10518944 10517319 10515613 10518138 10526475 10538764 10551377 10561602 10569587 10577728 10587564 10597766 10606257 10613718
48903 10613718 10623140 10635709 10649205 10661447 10673655 10688816 10707757 10728407 10748395 10766881 10784079
48892 10784079 10800424 10816307 10831504 10844782 10855201 10864034 10874094 10886555 10899528 10910780 10920971
48881 10920971 10932806 10947282 10962455 10976155 10988347 10999807 11010055 11018494 11026851 11038110 11052710
48870 11052710 11068020 11082375 11097533 11115618 11135639 11155452 11176003 11200697 11230567 11262595 11293219
48859 11293219 11321324 11347119 11370501 11392134 11414595 11440624 11470673 11503126 11536211 11568959 11601236
48848 11601236 11633946 11668411 11704620 11740825 11775939 11811422 11849529 11890350 11932066 11973705 12015895
48837 12015895 12058947 12102103 12145412 12190832 12240122 12292325 12344634 12395560 12446041 12497373 12549372
48826 12549372 12601416 12654203 12708962 12765285 12821532 12877645 12935713 12996726 13058441 13118138 13176218
48815 13176218 13235043 13295048 13354543 13413035 13472066 13532305 13592471 13652271 13714092 13780083 13848957
48804 13848957 13917094 13981546 14040924 14094983 14145218 14194709 14245561 14296929 14346629 14393631 14437654
48793 14437654 14477900 14514330 14549363 14585893 14623947 14661418 14697865 14735060 14773185 14808842 14838268
48782 14838268 14861397 14881498 14901416 14921011 14937962 14950297 14957948 14962074 14963359 14961793 14958060 14953718
48770 14953718 14949023 14941849 14930447 14916623 14904117 14893814 14882428 14866396 14845585 14822436 14798880
48759 14798880 14775062 14750169 14723231 14693451 14660715 14625980 14590802 14556312 14522806 14490212 14458850
48748 14458850 14429473 14402487 14377394 14353522 14330940 14309788 14288904 14266610 14243320 14221696 14203177
48737 14203177 14185812 14167052 14147349 14129087 14112810 14096904 14080729 14065872 14054089 14045836 14041165
48726 14041165 14040238 14042321 14045534 14048136 14049092 14047510 14043077 14037251 14032392 14029180 14026314 14023093 14020661 14020119
48712 14020119 14021123 14023281 14027341 14033641 14040510 14045618 14048338 14049844 14051459 14053733 14056573 14059306 14060802 14060090
48698 14060090 14056848 14051414 14044870 14038949 14034919 14032532 14031010 14030812 14032884 14036026 14036896 14033392 14026564 14018399
48684 14018399 14009399 13999524 13989974 13982421 13977297 13974207 13972888 13972236 13969210 13960912 13947879 13933820 13921617
48671 13921617 13910623 13898212 13882983 13865623 13846967 13826284 13802312 13775856 13749934 13726336 13702957
48660 13702957 13676200 13645448 13613148 13580762 13547254 13512107 13476928 13442539 13406933 13368410 13328833
48649 13328833 13291370 13256283 13221453 13186002 13150543 13114336 13075144 13032538 12989207 12948319 12911124
48638 12911124 12877475 12846930 12818475 12790479 12761899 12733120 12705282 12679208 12654849 12631130 12606630
48627 12606630 12581164 12556312 12533551 12512515 12492217 12473107 12456183 12440757 12425295 12410255 12397589
48616 12397589 12387025 12375403 12360986 12346272 12334676 12325814 12316063 12303173 12288446 12274461 12262137
48605 12262137 12250463 12238050 12224166 12208476 12190567 12170348 12148967 12128487 12109971 12092363 12074103
48594 12074103 12055336 12037222 12019416 12000105 11979111 11959251 11943455 11931460 11920422 11907927 11893202
48583 11893202 11875995 11855875 11832955 11808417 11783944 11760793 11739484 11719899 11701622 11684270 11667519
48572 11667519 11650846 11633544 11615140 11595536 11574743 11552928 11530818 11509330 11488269 11465818 11440081
48561 11440081 11410987 11380046 11348304 11315415 11281244 11247567 11216819 11188874 11160171 11127099 11089753
48550 11089753 11051242 11013737 10976788 10939608 10902929 10867424 10831979 10795414 10758924 10724636 10692071
48539 10692071 10658000 10620089 10579103 10537405 10496957 10459176 10424812 10392754 10360102 10324606 10286680
48528 10286680 10248393 10211173 10174884 10138507 10101212 10063425 10027024 9993492 9961563 9927952 9891437
48517 9891437 9855252 9824120 9799044 9775805 9748477 9714073 9674263 9633527 9595770 9562261 9532120
48506 9532120 9504002 9476827 9449554 9421427 9392399 9362472 9330847 9296932 9261999 9228318 9196376
48495 9196376 9164539 9131868 9099565 9068831 9038899 9008444 8977569 8947155 8917298 8887785 8859074
48484 8859074 8831496 8804387 8777425 8751882 8729024 8708008 8687099 8666323 8646886 8628290 8608185
48473 8608185 8585702 8563281 8544270 8529357 8515835 8499829 8479260 8455363 8431534 8410260 8391159
48462 8391159 8372148 8351753 8329617 8305687 8280310 8254736 8230212 8206572 8182688 8157986 8132553
48451 8132553 8106298 8079448 8053685 8031225 8012520 7995832 7978990 7960550 7939957 7918370 7899144
48440 7899144 7885176 7875112 7863748 7847045 7825608 7802978 7782202 7764598 7749959 7736669 7722990
48429 7722990 7709383 7698377 7691014 7684826 7676950 7668380 7663223 7664009 7669202 7675262 7679735 7681782 7680658 7674692
48415 7674692 7662283 7643972 7622945 7602676 7584389 7567813 7553895 7544631 7539669 7535294 7528243 7519083
48403 7519083 7510492 7503754 7498674 7495315 7493344 7490586 7484808 7476546 7467744 7457906 7444388 7426630 7407182
48390 7407182 7387720 7367137 7345116 7324815 7309213 7296395 7281244 7261360 7239092 7218098 7199963
48379 7199963 7184131 7169160 7153563 7137029 7121166 7107792 7096302 7084326 7071310 7059591 7050974
48368 7050974 7044044 7036285 7027524 7019374 7012160 7004580 6996116 6987680 6979619 6971279 6963311 6958326 6957526 6957990
48354 6957990 6955171 6947511 6936997 6925878 6914931 6904692 6895788 6887098 6875823 6861005 6845430 6832075
48342 6832075 6819825 6805085 6787222 6769788 6755888 6744819 6734433 6724595 6716084 6707424 6695518 6679510
48330 6679510 6661984 6646018 6632784 6622476 6615456 6611154 6607309 6602211 6596965 6593911 6593133 6592136 6588845
48317 6588845 6583339 6576707 6569989 6564801 6563223 6565883 6571014 6576269 6580586 6583817 6585824 6587124 6589146 6592409
48303 6592409 6595176 6595493 6594113 6593990 6597347 6604486 6614844 6627341 6640081 6651627 6662796 6675493 6689900
48290 6689900 6704801 6720811 6740698 6765731 6794050 6823803 6855589 6890185 6926292 6963020 7003075
48279 7003075 7050750 7107677 7172872 7246029 7328062 7418913 7517773 7625541 7744155 7872876 8007543
48268 8007543 8143769 8277691 8402173 8505325 8575765 8609045 8608305 8581079 8537289 8487927 8441406
48257 8441406 8400274 8362927 8328528 8298861 8276103 8261025 8253684 8253952 8260822 8272751 8289335 8311515
48245 8311515 8339838 8374157 8415488 8466272 8527450 8596819 8672006 8754358 8848138 8956453 9079737
48234 9079737 9218134 9373342 9547513 9741908 9957645 10196926 10462967 10760251 11096059
48225 11096059 11480251 11920289 12414578 12949759 13502098 14038264 14515361 14886642 15115254
48216 15115254 15187207 15112868 14918032 14634978 14298761 13944090 13599091 13280331 12994160 12741452
48206 12741452 12519958 12324301 12147337 11982149 11821271 11655131 11475329 11281560 11083382
48197 11083382 10892980 10716343 10551739 10394583 10241773 10092498 9947599 9808813 9677540
48188 9677540 9554085 9438553 9331615 9233048 9140190 9049820 8961797 8879152 8804021 8734784 8667854
48177 8667854 8601171 8535285 8471960 8412532 8357012 8304310 8253776 8206424 8163528 8123877 8083912
48166 8083912 8041266 7996872 7952780 7909451 7866430 7824235 7783644 7743991 7704047 7664230 7626003
48155 7626003 7589302 7552341 7514099 7475128 7435711 7395063 7353166 7311645 7271610 7231878 7190590
48144 7190590 7147670 7104294 7060527 7014984 6966754 6916339 6864451 6810988 6755989 6700827 6647432
48133 6647432 6596313 6546355 6496911 6449152 6404406 6361946 6320102 6279315 6241958 6208455 6175946
48122 6175946 6142404 6110073 6082278 6058103 6033104 6004792 5974385 5943335 5911390 5878831 5847522
48111 5847522 5818291 5789662 5760447 5731400 5702846 5673162 5641282 5608596 5576584 5544995 5514374
48100 5514374 5487674 5466173 5445931 5421972 5394758 5368899 5346392 5324899 5302277 5278865 5255029
48089 5255029 5230350 5205964 5184210 5164965 5145798 5126862 5111783 5101552 5091082 5074832 5053436
48078 5053436 5031619 5011577 4991828 4971583 4952712 4937198 4925027 4914789 4904591 4892415 4877430
48067 4877430 4861236 4846440 4833730 4821442 4807951 4793422 4779135 4766243 4755488 4747477 4742733 4741187
48055 4741187 4741114 4739055 4732449 4722959 4715564 4713047 4712742 4710077 4703915 4696461 4689179 4681536 4673713 4668052 4666964
48040 4666964 4670488 4676136 4680247 4680039 4675914 4671582 4670433 4671981 4673377 4673753 4674912 4677936 4681934 4686719
48026 4686719 4694013 4704390 4715109 4722848 4727404 4730993 4735041 4739413 4744127 4749879 4756729 4763617 4769635
48013 4769635 4775269 4782144 4791588 4803088 4814177 4822588 4828941 4836502 4847700 4861458 4874484 4884504
48001 4884504 4891725 4897926 4904996 4913812 4923704 4933227 4941905 4950659 4960085 4969269 4977365 4985637 4996618 5011307
47987 5011307 5028268 5045654 5063213 5082051 5102821 5124356 5144078 5160210 5173917 5188584 5206236
47976 5206236 5225150 5241980 5255884 5269421 5285311 5303373 5321095 5336465 5349830 5363231 5378145
47965 5378145 5393682 5407069 5416228 5421718 5425936 5430818 5436878 5443777 5450719 5456458 5460200 5462574 5464560
47952 5464560 5465359 5462969 5457582 5452777 5451700 5452910 5451742 5445655 5436536 5427569 5419496 5410836 5400469 5388610
47938 5388610 5375876 5362804 5350244 5338805 5327566 5314442 5298559 5281402 5264902 5249039 5232310
47927 5232310 5213973 5194638 5174857 5154585 5134238 5114932 5096869 5078475 5057953 5035079 5011015
47916 5011015 4987254 4965456 4946963 4931012 4914222 4893764 4870799 4849070 4830155 4812136 4793210
47905 4793210 4774396 4757381 4741648 4725563 4709202 4693973 4679993 4665844 4651030 4636922 4624705
47894 4624705 4613614 4601786 4588097 4572774 4557026 4542462 4530183 4520032 4511221 4503648 4497858 4493651
47882 4493651 4489865 4485761 4481454 4476498 4469417 4459608 4448679 4438794 4430564 4423502 4417445 4411966 4405409 4396629
47868 4396629 4387310 4380452 4376380 4372370 4366625 4360444 4355383 4350426 4343807 4336300 4330504 4327359 4325124 4321717
47854 4321717 4316493 4309749 4302065 4294705 4289426 4287036 4286661 4287073 4288216 4290860 4295040 4299493 4302800 4304530
47840 4304530 4304895 4303674 4300490 4296606 4295491 4300100 4309622 4320095 4328550 4335246 4341644 4347996 4354115 4360736
47826 4360736 4368209 4375063 4380259 4386169 4396462 4410644 4423354 4430161 4431973 4432354 4432566 4431381 4428294 4424257
47812 4424257 4419548 4413560 4407195 4403260 4403013 4403728 4401421 4395488 4389008 4384460 4380971 4376755 4372699 4371489
47798 4371489 4373390 4375142 4373989 4371262 4370400 4372251 4374131 4373431 4370462 4367293 4365143 4363826 4362991 4362860 4363813
47783 4363813 4365766 4368150 4370469 4372889 4375925 4379279 4381452 4381205 4379270 4378059 4379886 4385996 4396606 4410645
47769 4410645 4425660 4439345 4451311 4462253 4471428 4476570 4476731 4473767 4470305 4467497 4465496 4464698 4465201 4465951
47755 4465951 4465694 4464312 4462361 4460029 4457651 4456537 4457829 4460323 4460368 4454424 4441952 4426312 4412904 4405411
47741 4405411 4403179 4402628 4401463 4400606 4401931 4405615 4410656 4416603 4423400 4430363 4436797 4443028 4449560 4455712
47727 4455712 4460317 4463332 4465570 4467358 4468784 4471032 4476165 4485556 4499176 4515730 4532505 4546119 4555197
47714 4555197 4562005 4569922 4579830 4590645 4602653 4617522 4634772 4650827 4662804 4671254 4677878 4682368
47702 4682368 4683402 4681664 4679829 4679647 4680389 4680306 4678660 4676134 4673895 4672614 4672240 4672573 4673867 4676590 4680628
47687 4680628 4685114 4689022 4691709 4693129 4694107 4696198 4700547 4706734 4713211 4718832 4723663 4728699 4735303 4744188
47673 4744188 4753959 4761277 4763924 4763246 4762125 4761043 4758450 4754882 4753649 4755975 4758072 4755494 4748900 4742839
47659 4742839 4739494 4736476 4731057 4724028 4718158 4714689 4712920 4712045 4711406 4709356 4703989 4695787 4687961 4683070
47645 4683070 4680246 4677211 4674241 4674081 4677920 4683683 4689180 4694988 4702546 4710865 4717205 4720395 4721681 4722944
47631 4722944 4726063 4733566 4747165 4764891 4781627 4793670 4801720 4808819 4816742 4825202 4833436 4841332 4849302
47618 4849302 4857610 4865774 4872806 4878564 4884282 4890821 4896879 4900296 4900661 4899156 4896407 4892462 4888318 4884936
47604 4884936 4880759 4873132 4862667 4853267 4846755 4840442 4831384 4820307 4809573 4800050 4792150 4787278 4785356
47591 4785356 4783086 4777709 4771013 4766693 4765329 4765074 4765936 4769635 4775681 4781262 4785181 4789029 4794236 4800629
47577 4800629 4807969 4816244 4824367 4831402 4839052 4849785 4862134 4871408 4876164 4880488 4888029 4896821 4902571
$$ [...]
##END NTUPLES=NMR SPECTRUM
##END=
