##TITLE=AC1537_ROEFFECT0010_8214656_HnbXCdPfNy
##JCAMPDX= 6.0         $$ Bruker NMR JCAMP-DX V2.0
##DATA TYPE= NMR SPECTRUM
##DATA CLASS= NTUPLES
##ORIGIN= BRUKER
##OWNER= Administrator
$$ 1.72 TOPSPIN		Version 2.1
$$ 2013-10-11 17:26:08.882 -0700  Administrator@X
$$ Compression mode = diff/dup
##.OBSERVE FREQUENCY= 400.02188249412
##.OBSERVE NUCLEUS= ^1H
##.ACQUISITION MODE= SIMULTANEOUS (DQD)
##.ACQUISITION SCHEME= undefined
##.AVERAGES= 8
##.DIGITISER RES= 22
##SPECTROMETER/DATA SYSTEM= spect
##.PULSE SEQUENCE= zg30
##.SOLVENT NAME= COFFEE_meoh
##.SHIFT REFERENCE= INTERNAL, COFFEE_meoh, 1, 14.98509
##AUDIT TRAIL= $$ (NUMBER, WHEN, WHO, WHERE, PROCESS, VERSION, WHAT)
$$ ##TITLE= Audit trail, TOPSPIN		Version 2.1
$$ ##JCAMPDX= 5.01
$$ ##ORIGIN= Bruker BioSpin GmbH
$$ ##OWNER= Administrator
$$ $$ E:\/data/COFFEE/nmr/AC1537_ROEFFECT0010_8214656_HnbXCdPfNy/10/pdata/1/auditp.txt
$$ ##AUDIT TRAIL=  $$ (NUMBER, WHEN, WHO, WHERE, PROCESS, VERSION, WHAT)
(   1,<2013-10-11 17:26:02.398 -0700>,<Administrator>,<X>,<go>,<TOPSPIN 2.1>,
      <created by zg
	started at 2013-10-11 17:24:56.011 -0700,
	POWCHK enabled, PULCHK disabled,
       configuration hash MD5:
       C8 4E 4E 5D D3 5C D8 9E 9F 52 82 E0 59 8A DE 15
       data hash MD5: 64K
       8D F8 8B 8C 58 B7 21 36 36 8B 1D 64 B7 BC F5 B1>)
(   2,<2013-10-11 17:26:05.257 -0700>,<Administrator>,<X>,<proc1d>,<TOPSPIN 2.1>,
      <Start of raw data processing
       efp LB = 0 FT_mod = 6 PKNL = 1 PHC0 = 0 PHC1 = 0 SI = 32K 
       data hash MD5: 32K
       58 CE F5 A6 3D D9 F3 0C 99 C3 11 FC E7 E6 4F 3F>)
(   3,<2013-10-11 17:26:05.538 -0700>,<Administrator>,<X>,<proc1d>,<TOPSPIN 2.1>,
      <pk PHC0 = 96.75659 PHC1 = 0 
       data hash MD5: 32K
       CC D7 75 59 16 24 E5 24 69 2B B0 03 FB 5E 21 64>)
(   4,<2013-10-11 17:26:05.632 -0700>,<Administrator>,<X>,<proc1d>,<TOPSPIN 2.1>,
      <abs ABSG = 1 
       data hash MD5: 32K
       53 E2 E9 ED CF 83 51 68 78 EC AA 8B BF 25 FE 07>)
(   5,<2013-10-11 17:26:05.710 -0700>,<Administrator>,<X>,<proc1d>,<TOPSPIN 2.1>,
      <abs ABSG = 2 
       data hash MD5: 32K
       E3 48 48 94 E1 99 EA 9C FA BA 36 9C AB F4 EC 21>)
(   6,<2013-10-11 17:26:05.773 -0700>,<Administrator>,<X>,<proc1d>,<TOPSPIN 2.1>,
      <abs ABSG = 3 
       data hash MD5: 32K
       10 AA BC 30 8C 19 12 12 03 7C DB EB F7 6B 6F 93>)
(   7,<2013-10-11 17:26:05.835 -0700>,<Administrator>,<X>,<proc1d>,<TOPSPIN 2.1>,
      <abs ABSG = 4 
       data hash MD5: 32K
       77 1F 9F AC 69 BC D6 72 45 B9 B1 17 D0 6B 1F 5E>)
(   8,<2013-10-11 17:26:05.898 -0700>,<Administrator>,<X>,<proc1d>,<TOPSPIN 2.1>,
      <abs ABSG = 5 
       data hash MD5: 32K
       AF 07 96 79 D8 B1 06 48 04 C2 71 B8 B6 1C B4 C8>)
$$ ##END=
$$ 
$$ $$ hash MD5
$$ $$ 22 E8 6B 82 A5 16 DC 91 5A 55 BF CB 41 09 FC 41
##$RELAX= 
##$RELAX= 
##$RELAX= 
##$RELAX= 
##$RELAX= 
##$RELAX= 
##$RELAX= 
$$ Bruker specific parameters
$$ --------------------------
##$DU= <E:\>
##$EXPNO= 10
$$ [...]
150 150 150 150 150 150 150 150
##$TP07= 0
##$TPNAME0= <>
##$TPNAME1= <>
##$TPNAME2= <>
##$TPNAME3= <>
##$TPNAME4= <>
##$TPNAME5= <>
##$TPNAME6= <>
##$TPNAME7= <>
##$TPOAL= (0..7)
0.5 0.5 0.5 0.5 0.5 0.5 0.5 0.5
##$TPOFFS= (0..7)
0 0 0 0 0 0 0 0
##$TUNHIN= 0
##$TUNHOUT= 0
##$TUNXOUT= 0
##$USERA1= <user>
##$USERA2= <user>
##$USERA3= <user>
##$USERA4= <user>
##$USERA5= <user>
##$V9= 5
##$VALIST= <valist>
##$VCLIST= <CCCCCCCCCCCCCCC>
##$VD= 0
##$VDLIST= <DDDDDDDDDDDDDDD>
##$VPLIST= <PPPPPPPPPPPPPPP>
##$VTLIST= <TTTTTTTTTTTTTTT>
##$WBST= 1024
##$WBSW= 4
##$XGAIN= (0..3)
0 0 0 0
##$XL= 0
##$YL= 0
##$YMAX_a= 657601
##$YMIN_a= -559682
##$ZGOPTNS= <>
##$ZL1= 120
##$ZL2= 120
##$ZL3= 120
##$ZL4= 120
##$ABSF1= 14.98509
##$ABSF2= -5.573092
##$ABSG= 5
##$ABSL= 3
##$ALPHA= 0
##$AQORDER= 0
##$ASSFAC= 0
##$ASSFACI= 0
##$ASSFACX= 0
##$ASSWID= 0
##$AUNMP= <proc_prof1d_extract_pilot.lims>
##$AXLEFT= 0
##$AXNAME= <>
##$AXNUC= <1H>
##$AXRIGHT= 0
##$AXTYPE= 0
##$AXUNIT= <>
##$AZFE= 0.1
##$AZFW= 0.1
##$BCFW= 0
##$BC_mod= 0
##$BYTORDP= 0
##$COROFFS= 0
##$CY= 15
##$DATMOD= 1
##$DC= 0
##$DFILT= <>
##$DTYPP= 0
##$F1P= 0
##$F2P= 0
##$FCOR= 0.5
##$FTSIZE= 32768
##$FT_mod= 6
##$GAMMA= 0
##$GB= 0
##$INTBC= 1
##$INTSCL= 1
##$ISEN= 128
##$LB= 0
##$LEV0= 0
##$LPBIN= 0
##$MAXI= 10000
##$MC2= 0
##$MEAN= 0
##$ME_mod= 0
##$MI= 0
##$NCOEF= 0
##$NC_proc= -8
##$NLEV= 6
##$NOISF1= 0
##$NOISF2= 0
##$NSP= 0
##$NTH_PI= 0
##$NZP= 0
##$OFFSET= 14.98509
##$PC= 1
##$PHC0= 96.75659
##$PHC1= 0
##$PH_mod= 1
##$PKNL= yes
##$PPARMOD= 0
##$PPDIAG= 0
##$PPIPTYP= 0
##$PPMPNUM= 2147483647
##$PPRESOL= 1
##$PSCAL= 4
##$PSIGN= 0
##$PYNMP= <proc.py>
##$REVERSE= no
##$SF= 400.02
##$SI= 32768
##$SIGF1= 0
##$SIGF2= 0
##$SINO= 400
##$SIOLD= 32768
##$SPECTYP= <>
##$SREGLST= <1H.CDCl3>
##$SSB= 0
##$STSI= 32768
##$STSR= 0
##$SW_p= 8223.68421052631
##$SYMM= 0
##$S_DEV= 0
##$TDeff= 65536
##$TDoff= 0
##$TI= <>
##$TILT= no
##$TM1= 0
##$TM2= 0
##$TOPLEV= 0
##$USERP1= <user>
##$USERP2= <user>
##$USERP3= <user>
##$USERP4= <user>
##$USERP5= <user>
##$WDW= 1
##$XDIM= 32768
##$YMAX_p= 452328210
##$YMIN_p= -654101
##$CURPLOT= <Network HP LaserJet P1505>
##$CURPRIN= <$Network HP LaserJet P1505>
##$DFORMAT= <normdp>
##$LAYOUT= <+/1D_H.xwp>
##$LFORMAT= <normlp>
##$PFORMAT= <normpl>
##$SURQMSG= 1
$$ End of Bruker specific parameters
$$ ---------------------------------
##NTUPLES= NMR SPECTRUM
##VAR_NAME=  FREQUENCY,     SPECTRUM/REAL,   SPECTRUM/IMAG
##SYMBOL=    X,             R,               I
##VAR_TYPE=  INDEPENDENT,   DEPENDENT,       DEPENDENT
##VAR_FORM=  AFFN,          ASDF,            ASDF
##VAR_DIM=   32768,         32768,           32768
##UNITS=     HZ,            ARBITRARY UNITS, ARBITRARY UNITS
##FACTOR=    0.250966925370066, 1,           1
##FIRST=     8223.43324360094, -88444,       -279212
##LAST=      0,             243735,          175484
##MIN=       0,             -654101,         0
##MAX=       8223.43324360094, 452328210,    0
$$ Real data points
##PAGE= N=1
##DATA TABLE= (X++(R..R)), XYDATA
$$ [...]
23834 -112193 313775 314140 -36915 84536 -98934 107527 56833 120537 149278 -323147 -53801
23822 132970 44983 -131105 -74947 -167685 -241532 -281319 -93999 -53864 -133249 -67531 -247252
23811 -247252 -42264 411188 92885 -38403 245997 -93446 -235269 -212700 70612 -16207 48059
23799 -42168 -86044 236424 288562 133846 166808 -63538 304651 23730 -160790 -59833 36309
23787 109657 -19715 10585 -192527 -106128 -62741 219823 29875 12622 -137598 -311040 -25610
23775 154881 -79010 125735 -95617 238742 -26861 -326722 -226309 -178711 -121106 122475
23764 17128 68588 130561 -102669 226448 -80771 203269 -63076 137787 -205341 106643
23753 -139185 -384507 -502605 6915 -191717 -35937 66171 303778 273217 -5999 -271472 -163699
23742 -163699 164720 -206928 119204 -261674 71050 -230112 270013 145198 -15538 58634
23731 -291819 -154541 118659 71863 282443 -7051 5111 -32985 -455 -180094 135462 -65670
23719 -95815 -128532 116879 -193959 -152338 -63528 92882 168818 66006 -229183 -244294 890
23707 -299172 -49472 284268 10581 -70407 -350706 38758 -174741 -333108 -67252 -6106 -85059
23696 -85059 139199 136966 -94566 117215 11206 153851 51287 334167 100733 39025 25474
23685 25474 -248864 -365389 10499 150597 -172591 78653 172813 -4887 -88261 326222 -152840
23673 53557 -9089 43648 -256976 -46883 -231524 -186225 8180 -48297 -112769 122895 -279706
23661 182615 142430 -192138 -224906 -259687 -334680 15913 -75310 -8192 406991 180007 193152
23650 193152 -122966 62072 -75050 86125 -226750 28897 -68991 225104 146089 2768 -100226
23638 -43366 191730 -167653 10368 82034 -43249 64107 314990 289403 -138300 -107499 31013
23626 -61383 -9394 -51904 -306748 -393452 -9473 -229281 263221 52797 -60628 -70514 385578
23614 255583 -116243 29302 148334 -170102 34512 -26775 -149202 -68777 -268579 87845
23603 -61686 235186 113969 -42810 -17213 242070 -319917 370250 -40614 151005 -171558
23592 324731 90037 249484 313518 -77403 165000 -84764 52266 -9594 443463 -64499 -134842
23581 -134842 -413543 136376 121529 -299564 247968 -29733 235843 -117650 82296 -210642
23570 149503 -6759 -1519 248336 -124824 93431 -117436 212489 -49397 -76036 183537 -111713
23558 285157 -1585 -170530 -113778 -229747 113129 260002 -179757 19034 -326937 -103400
23547 -93575 -383089 24107 -243967 -65243 60533 342119 -94382 38781 -234702 -14941 -257347
23536 -257347 -110549 126834 -50775 208111 26783 -117206 -9248 38547 69210 58187 -62714
23524 -148339 15056 -89056 -111676 46589 167514 107609 -73166 108604 69947 306377 121825
23512 -152275 59406 39479 -132096 -409673 -287081 -182781 -68784 -86470 -51795 -286687
23502 -286687 -254977 -78891 13734 92989 7289 -209062 -90339 205939 79881 137502 129373
23491 129373 -13525 27443 80644 109086 -182726 -130915 -341839 -34422 173987 -200893 190248
23479 -41544 462899 -101316 222344 -132877 -10737 49750 116685 89428 169536 -3664 211689
23467 -390004 156024 -87925 141422 -193986 -198024 48209 -21393 -73017 -149329 147499 -37862
23455 -276619 129907 -218952 53123 -4184 -189331 -239605 -206525 -4269 -257153 4457 123235
23444 123235 -155746 36063 -25630 71776 134652 63722 -130156 -247227 53392 2393 187283
23433 187283 -877 -217880 -126981 83204 -372447 139471 -393765 -73301 -140253 367795 154204
23421 -19237 119505 -288324 141131 181955 175413 -126600 256993 -260984 -211223 -12093 29357
23409 32761 -293377 219714 -334976 -279983 -113249 94926 -43419 503461 96064 306290
23399 306290 161365 -126277 190721 -345737 -87287 -94601 -46735 -42344 74714 43373 39058
23388 39058 55304 -27352 -140211 -82668 282979 30492 21880 -385999 101711 -29438 66615
23376 -44751 -110418 95416 -9840 43912 232117 90048 259237 -109221 -169037 -22763 -157599
23365 -157599 25672 -23944 160848 148777 -214817 24312 -398739 108952 -217534 -199957
23355 -199957 -268157 -41135 -226675 -77394 -87364 -47506 -123633 -7817 -43835 -244291 323820
23343 -87998 -46040 -13887 -336040 -91437 -146435 -145451 -107117 -343314 110319 24766 148591
23332 148591 -81128 768 118401 14943 75964 37100 32251 -280761 -24840 -4439 90110 297331
23320 297331 -148150 -60149 10615 -80742 -42666 223686 -112955 188228 143860 -128532
23309 -273223 125814 -119378 46777 -231033 -141888 10784 238963 -49465 -22426 362415
23298 -226601 -112441 238460 -208224 280790 45333 99969 -231354 106443 114939 -270168
23287 -42899 -96095 -48985 88192 222139 -554528 -175964 -346808 60539 -324885 457565
23276 -46679 -89088 -151650 94362 -135857 155102 105197 38546 189171 179502 -232042 -181174
23265 -181174 110181 19375 203980 138003 152590 297878 -176596 53520 18077 -45635 -121281
23254 -121281 -100031 -35679 -201932 -121291 35922 -260131 -189724 -57986 -129263 -93038 13740
23242 392359 -303039 -15101 -148215 314872 -141579 205702 -370309 -159338 -64734 -258093
23232 -258093 -81773 -4551 127410 -41248 171429 -171917 -125201 -283916 24218 -181415 -65226
23220 -197811 169983 -30734 -278925 -47423 -50347 -255596 339147 -221386 -295271 79470 -183355
23208 470747 -91657 58552 29322 -172042 -212545 46019 -450790 118578 -173890 -197875 -179589
23197 -179589 177781 290349 -28007 -31448 -85274 -194120 -168973 -158136 -156629 12180 46601
23186 46601 242193 -229046 117 -81210 -302376 -101534 -181870 103484 -58381 200805 -88169
23174 43496 194431 -197396 -110398 -199814 -223988 76852 -182978 22535 -79865 -106480 79228
23162 -341192 -265833 28645 309961 -352450 358808 45118 -220233 -20226 -210620 -44579
23151 84239 -289142 183284 -30766 -29050 -206801 211155 -89896 -90650 242830 -5499 -203226
23140 -203226 23969 48166 -148001 -189211 169313 -223908 95614 40032 -149692 -170621 -241689
23129 -241689 -13289 -4192 46269 46018 -141194 118581 14018 -13672 -384160 287544 122813
23117 -261302 -135587 -80872 -193477 172346 -76019 -176486 -3307 -113644 -115181 55100 214431
23106 214431 27512 -42183 -60420 -70333 -191167 -156303 -137925 -201520 182729 -91968 -121292
23095 -121292 -108490 -294542 30120 -29191 -126349 92248 -34734 99100 68084 -202319 -80964
23083 25577 -32862 -138702 4504 185443 -120413 -288080 346412 -220613 61601 159158 -53447
23071 -148684 76429 -104205 -94202 -192600 112388 -6184 -52931 -278832 -40287 92288 144790
23060 144790 -132168 -116528 453809 121937 -64889 -128204 131060 74353 222486 68509
23049 -11395 96745 238958 106447 4124 -178701 43412 -91964 -58677 -24084 144198 -10766
23037 73136 23210 165160 56109 187097 -126885 207228 172291 -24367 -150659 4873 -331236
23025 30604 54175 85977 -445096 259338 -254329 -52128 22781 251872 306346 -27810 -14185
23014 -14185 -11648 53735 2602 -10131 -62395 59580 138533 223151 439235 -154165 -69392 -219190
23002 -219190 100663 -192485 -301207 -115274 46872 80801 -32707 60441 -25878 -97191 12988
22990 -64745 276249 4674 265436 94808 229232 -322410 -185159 -345319 47591 323071
22980 323071 -96083 -246703 -269866 -96687 -157583 -283822 -129022 86800 131927 -1409 -124775
22969 -124775 -96361 360385 -434398 75897 -373335 -131184 -197553 115195 -95131 274934
22958 -227167 -51763 124374 -134208 33661 -257461 -122876 101552 -40711 88532 37504
22947 131011 -8279 92736 -300088 267996 183897 218106 118077 -204581 -399516 -74764 153299
22935 -97059 -220869 392340 -323915 50576 -70919 141076 225474 -197551 -101971 270970
22924 -94470 -137481 215069 119574 40544 80585 -3907 156926 266540 -262679 2403 -255936
22912 -222512 -29656 -288897 -65141 -153034 7145 -310329 116156 -199901 -38789 -432243 17435
22900 177054 509269 -209868 240435 293230 359800 -16446 -285050 -286434 299582 -36440 -101453
22889 -101453 73567 -138638 332028 -21566 201025 98032 -119855 -348705 313493 -96239
22878 -169477 -140174 -77735 129919 -71333 -228324 310161 176480 302190 60959 -32485
22867 -58146 206323 -183512 -106824 -29546 240483 -137900 197092 -54494 -8697 316891 69812
22855 -87592 209551 -106839 -111706 -432753 117238 23768 -238700 -91596 -170789 -85752 -179927
22844 -179927 155471 -523 107036 26220 -189700 -162723 144934 147837 161181 172156 166193
22833 166193 -96449 335103 70493 -29 -78343 -355392 -306631 161288 193697 -251114 -51569
22821 -75453 -98753 -129062 -122397 117245 190590 -82843 -47900 -4382 -118821 -96404 -56906 99213
22808 -233772 -224402 372621 -37407 -289730 136157 -24978 -121571 435039 49968 -87356 -170427
22797 -170427 234432 182535 184905 -218395 -188296 218006 113183 -44084 -80124 272179 125208
22785 -69107 175552 76821 -1142 117454 -103983 -250208 -279474 -8307 112109 2541 116722
22774 116722 -50721 23464 -1890 -90747 148909 63495 -94696 46484 -32004 157008 -14747
22762 -240466 -7326 139626 -142336 -19079 -91897 -140583 -215384 -53770 -230507 -38143 -430888
22751 -430888 -403416 77012 -40994 17200 -172669 237146 -164237 -287496 -313551 -29294 112616
22739 -119405 -41541 -91250 -76949 -239566 69954 -113671 -102638 -121731 -175008 71899 19156
22727 29176 -58414 245795 -261149 -106999 96051 -130580 -239634 -219180 -40652 90453 128798
22716 128798 -27 44599 -82031 -297424 -105876 250573 82127 -256894 -179013 274094 278592
22705 278592 41390 -234521 -227546 -48567 177195 270716 92988 -34157 -333557 -11340 -103971
22694 -103971 -6668 111807 -31281 -155640 124974 -114286 137833 76217 76579 -395528 -52322
22682 -357270 72581 294026 -133529 119903 -33804 321905 14503 -66998 -140339 -93107 -87338
22671 -87338 34910 153529 78297 46843 2494 -312700 -245760 -455259 152301 -169553 294549
22659 -252256 75525 175535 172779 -173502 -120612 -197878 -42436 46193 -365250 -50041 -121593
22648 -121593 83146 149454 53711 161952 -109012 -194325 -23455 -264512 -344272 101028 -241990
22636 -230262 86318 391151 -14000 -63630 -71619 -17555 -130401 -48835 -114135 -210719 -97871
22624 -122872 -244041 34685 81812 -192275 -369947 -5356 -154133 28971 -217851 -139755 -230140
22613 -230140 -209407 132279 118709 12295 -161726 5488 51989 25239 -28936 152200 -370706
22601 -85814 -329996 -357324 249570 -293042 -222364 -19771 32520 -11090 -7692 66299 176186
22590 176186 -92801 180265 263870 184510 -78512 103383 290199 -207134 36687 -188386
22579 -172390 -98754 -163363 -115892 -117300 270821 -278944 -17375 128868 -3450 -103268 83698
22567 -24645 -133928 -287015 147187 33966 -254988 -569806 -52805 196621 -4520 319037
22556 -280466 -165103 -257845 -87390 -234576 -117682 -274306 -98385 92324 102947 -141401
22545 124165 -308425 99579 -58185 -135310 154173 -291940 -20515 -65642 -129132 415767 153823
22533 -400170 219668 -220550 10671 9779 433065 -280415 84925 20211 139055 -70025 -156444
22522 -156444 247930 -79928 -241270 8224 -29978 -223941 297192 137619 20070 -196731
22511 -90936 -173318 274711 131846 159458 -129362 -42753 -125884 139452 236188 85646 -39061
22499 378663 -14001 10990 -131814 -18687 88407 -92413 -52497 -42152 27188 136945 -208696
22487 -282425 -98941 207999 46126 -74993 -97671 -175177 -14117 -160037 -26299 -14582 -31418
22476 -31418 28234 106806 21019 -163550 -349540 -187469 -20812 311816 -246284 -329239 101777
22464 -152144 -145671 106603 -21209 181811 56888 631102 -189490 85123 185303 31147 -11181
22452 -262247 -272092 269424 -307630 137166 82736 -218922 193587 -182874 8802 194139
22442 194139 -219948 -85218 122778 -66206 72709 140195 285394 -35851 -155615 99284 350461
22431 350461 52845 -103906 204799 192188 -243391 245622 -400796 -547606 -352800 -250698
22421 -250698 -94103 -38669 -108531 -79005 42923 135286 184236 -681 196219 -131942 -204834
22410 -204834 -63399 168223 -86092 170091 -81334 -10610 144120 -87196 108584 -153176
22399 15273 142775 -119846 -213347 -1729 136218 61219 -18315 -131852 36200 -175842 -114499
22388 -114499 33807 -28481 215879 186484 -14378 137629 -1922 120690 -296654 -120677 -221344
22377 -221344 241951 -95048 -89814 -183240 -217394 83246 142395 -79910 -321746 39287 -74005
22365 -69888 -130708 -64010 11013 -79637 -58797 -97597 534 446622 157644 -108133 10938
22353 -239353 -132613 -309815 -11011 77259 -158758 -1043 7474 -115397 -37543 -63930 56767
22341 -71094 -48490 -240663 11187 -150346 143831 160470 -134782 118976 135132 -41240 -2526
22329 -261982 119341 215479 226343 -109158 -3423 -198454 -152334 52360 5530 147722 48821
22317 -184729 -8850 3712 -7806 29373 -15182 168281 -297462 -292482 276115 -303459 12365
22305 -99017 121914 -157271 -124566 83752 82493 -205882 -174364 -180959 116157 -241867 176587
22293 149322 35350 160099 -56890 -42611 -232891 -40986 -240108 286386 119144 -26402
22282 -39327 140109 -123501 -126235 50372 127742 -261918 -132562 -17612 -17053 72465 -15630
22270 -117283 -52929 -90743 -58229 -304740 -67204 107502 -170831 -401292 -43752 131387
22259 -76281 -73863 -70124 -114124 39618 -99772 -61056 -174950 -343870 -234233 327217 -160617
22247 -46321 25877 -37062 -6608 -333417 -44819 84408 80567 -46253 187281 -87657 213851
22235 -35508 5089 -110691 -32609 -126239 121626 -316911 -36059 32437 -31204 104944 -133089
22223 169608 -11053 -80399 96088 95699 -216296 -62775 374430 19491 15948 -142600 11803
22211 -185980 181791 -5199 56751 -225799 -328059 4116 76020 -218404 -105513 193636 -110988
22199 -342076 122410 -194708 278894 80796 160939 37582 94912 92596 7972 -85820 350443
22187 23167 37548 -59494 83270 -247520 -93721 249671 -174217 147 -160616 354663 -41423
22175 -175299 40252 -288925 -421760 75919 -64117 347050 40237 37809 -109806 218540 -60658
22163 -196319 -144052 -114882 -51877 -114887 -50727 -130692 -120920 -325039 156109 -97997 -205421
22152 -205421 -187518 35223 -134957 -100561 -512023 -69226 7836 109196 214537 139020 38325
22140 -33456 -258343 -146569 -44200 543744 -246915 -90368 113630 -332444 10545 -360089
22129 -481817 -186833 429758 -31420 -237943 13450 13861 18008 -69795 245923 136531 324955
22118 324955 -205262 -339857 -100374 -85681 -429042 -177055 -54746 94506 -95575 -40326
22107 -13190 -127096 -136175 155501 -36593 136353 159711 284444 51355 -18970 -403202 62866
22095 -183961 141958 -141478 -72074 99333 -176408 -80817 30320 -18171 -251953 12703 64403
22084 64403 -51394 98971 -104211 -294595 -251615 161424 -126348 157544 -294782 -149554
22074 -149554 94010 -25234 96612 -72857 -289982 175796 -91968 142757 85649 -94243 253575
22062 192673 -163635 -202223 12980 -209109 -29296 40453 -188732 -777 90106 405245 -44060
22050 51400 331533 166994 -51898 -215277 111057 87239 -33187 215524 -28026 -125290 -89864
22039 -89864 113129 107346 -51077 383611 329941 -27717 -46992 -139121 -358482 -194225 -51955
22027 27818 32245 76299 -49000 -469872 -202463 -330122 -640 -158833 -310632 304852 -154186
22015 -115361 -106290 -161817 -354154 -496829 59326 -61662 -417039 96233 -239231 -164068 -103118
22004 -103118 -154948 -119940 62389 -109000 -310073 106014 368112 -106942 -124057 -255776
21994 -255776 -245743 179402 -140837 -273821 -318369 -37389 -74423 44100 -27888 73869 147350
21983 147350 55482 29287 26362 66039 135128 77562 6692 79515 -28757 -36993 -111268 -177788
21971 -177788 130702 129483 -124476 38726 1238 142168 -281163 93912 -26606 -15385 128090
21959 162647 193619 100118 63827 -244267 -79435 -108157 345274 252655 -309997 -282740 65885
21947 -111521 83768 377389 -318803 -111859 -317294 71986 71775 138191 -462023 171418 144619
21936 144619 120566 -201101 -103393 -116846 348468 -86919 5436 44777 -291078 82133 39255
21924 39603 -140533 115747 144707 -297219 87576 -254335 -201368 -101139 -273718 106195
21913 225945 -566486 130943 -134484 -18327 27230 -154672 209229 -87949 91867 -35772
21902 -100470 74889 -332230 84302 -232787 3704 -69595 -250196 278233 -86777 -48505 -150813
21891 -150813 -162093 92484 -284591 232583 230441 129792 61802 -84737 -364372 6365 35579
21880 35579 -237740 187623 129378 75251 -19162 -34401 -484036 -145518 68639 -136559 130764
21868 165917 243864 -291032 55764 -199712 232398 -22349 229947 -79578 -66782 156838
21857 -54726 81140 77860 117559 -18832 24298 35911 21489 -221270 324876 94841 -17225
21845 -235643 -81301 174091 169816 -172179 -62463 -300976 -125355 51421 23508 -164493 172669
21833 -54464 -44452 -4866 -12251 247088 -344865 -57880 273920 195836 -25324 -158862 -31475
21821 70836 -227344 -19651 -55532 97945 -127848 38540 64069 -249981 -56620 -112179 -57150
21810 -57150 236711 12477 80830 -375936 144328 6757 -153673 -269041 -36594 205162 -63413
21798 -111720 93959 94751 -181728 -227068 55131 -145587 206571 21084 24902 -108815 -4202
21786 -194220 42591 87067 -255844 -128590 -409497 -227917 142849 -17091 93917 107767
21776 107767 132376 26317 -10598 33570 65552 220546 -211393 -171341 295605 67856 178962
21765 178962 -116970 -216529 -504879 -180154 -28769 272889 192702 -110848 -61633 -1212 90233
21753 -40719 32229 69221 -39046 -223958 -230228 273999 199242 -6499 -54099 -72278 50821 -43279
21740 156816 -199378 28186 -126650 89657 126218 27737 -55790 177163 -100306 -62513 172897
21728 260613 -107724 383219 -142403 120085 1824 19653 26124 -54668 -151384 -46404 -8053
21716 146146 -260237 44364 -170832 -203827 53294 -62549 73615 73759 211787 -388786 -42105
21704 -29311 -196609 -223209 -187350 69035 86151 -232189 31192 43830 70743 6088 -315898
21692 22061 -348640 -425978 -1176 -182318 4615 60331 -287580 2746 -253297 -129257 -151069
21681 -151069 -16817 -188056 272711 -345538 118613 15432 -146583 -249070 18060 -132895
21670 -104373 32944 88673 147393 -153580 -147417 107258 -35620 49531 -124252 -171969 59485
21658 -183206 -57557 -211359 -48166 -153097 -10700 14461 -116294 -19819 -66586 -209477 -311479
21647 -311479 -185238 -295803 82622 3401 101785 -21160 -75636 -331239 60352 -186271 55517
21635 6398 158468 -346930 -34051 107532 76272 262972 -195786 -126528 -97898 -490517 -171762
21623 -122035 1504 -214202 -161730 -4454 -251264 -63605 -75769 105856 234254 -189485 -15458
21611 -105593 -469409 4960 103830 275455 -6279 -190496 -77375 9351 33588 76363 -35356
21599 29895 -8187 32609 8729 -351594 170352 43711 -224590 29313 -51454 -129480 -68613
21588 -68613 -75310 -192648 -140214 85024 30085 -179695 -82399 130161 -90033 -109592 -243698
21577 -243698 62826 -75349 310105 33974 219923 -205795 211225 -170572 -31186 121434
21566 67635 -236554 -108320 27029 -87102 -47745 -173002 27961 -263588 -52268 -97376 -20384
21554 -36090 84988 25365 34349 23885 -148554 167524 88144 -163827 114886 117480 -228394
21542 -232716 -444433 -209370 -15329 -200991 191352 24570 -144345 -65101 199688 23578
21531 169612 -113145 3471 95774 -23699 138739 100504 89708 -162147 -57008 33219 67391
21520 67391 76584 -345211 -56987 -84330 -197580 -209489 182879 -23868 27003 226258 -58327
21508 66375 130185 83565 104130 -255116 -56450 10415 99642 148644 12225 -51955 110103
21496 -78331 39208 -117233 -205582 -99090 -41095 -164889 -152193 -193665 -126346 25009 63108
21485 63108 -224247 43748 -166663 -121450 159398 16193 44031 -127835 126597 99355 -143169
21473 -21429 -64734 -50117 -232300 133865 137523 -182729 -138169 -161748 -185612 163430 -155400
21461 -219399 410884 -158890 63445 -95323 180009 154109 106557 -612736 243494 -6633 105418
21449 102468 -56382 31557 92087 -67711 190753 178414 295416 179399 -50424 345585 110246
21437 167116 425200 73769 74693 127347 -55866 467179 178356 123163 -23610 259577 -71973
21425 -131157 21641 -113539 -700 38640 -174115 26148 319526 41170 -251118 -218755 -115335
21414 -115335 53127 -207871 -262596 -26313 -124377 -64970 -151381 -178852 -89645 -106983 -149422
21403 -149422 77459 202249 -483568 -96500 91756 16768 35577 199320 -154089 -106205 -95597
21392 -95597 -440197 -189396 318343 101692 57781 54822 -71694 78915 -109061 45478 -270081
21380 -73846 -402164 -20063 15026 183353 184467 -71906 -347188 -111505 -72810 65409 -67853
21368 -93197 -267383 17589 -70646 157262 69720 -18295 -164201 -33101 -36705 -243877 -133640
21357 -133640 -243358 -20163 -187555 -149324 234785 162785 192062 -34436 202645 174844 220130
21346 220130 8647 -102407 23606 232346 -37450 50438 -215980 45914 -19970 237942 96207
21334 42293 132008 -83447 -109307 -305356 -9124 -48975 -58720 -180291 153140 -92343 -290881
21323 -290881 -73679 -48672 197944 318404 168163 -173497 177837 -47691 -180808 -47074
21312 -233117 -199423 -358131 -16575 -32590 -80944 -120189 -84823 -25672 -54290 160313 -155398
21300 -114726 365919 9725 -194607 191597 -148170 -61790 -176112 -86262 -71474 -218181
21290 -218181 105914 140527 -73362 92077 -258474 -35347 -46517 -226969 69791 -81104 -43087
21279 -43087 -135993 -308311 -185722 -206156 -150389 166581 -71651 186724 85721 267320 -157315
21267 -77078 80938 95682 -252432 -74234 2017 -437678 -305879 -274521 -112467 -98099 -145564
21256 -145564 -18721 -101065 -162533 128242 174514 -138725 -4938 106782 -123952 42953 -293650
21244 -35782 -32463 -45807 -34368 177144 -21282 -22046 -203175 -176896 -69068 -275131 86806 -122915
21231 -129533 -11397 -159758 -173264 105710 137618 142964 -144003 -233071 -159946 16815 123273
21220 123273 -136641 205393 3712 -112578 -212162 196054 121770 -130168 92069 4559 17524
21209 17524 156179 -194860 87591 -49132 152045 23267 43616 -43631 -92177 -69536 266447
21197 -111308 -282603 -61898 -31011 197745 8839 -199028 195173 55169 -101485 19497 39727
21186 39727 108928 -185242 -112575 74236 -16133 87421 -335284 52281 -56459 -330538 105092
21174 -225718 -142927 48981 -275066 117683 -226848 100497 -446434 28732 -259983 -135458
21164 -135458 -64912 -292663 -145411 -327332 -136201 131173 738 -94961 23319 -103005 34352
21152 -69893 -59880 116280 -236335 138197 -186446 -99062 131087 -312225 -175263 95388
21141 383178 26252 -139050 -164533 84005 -76494 -29528 495266 156819 154082 -224513 208138
21129 -35242 -177060 88336 111469 133511 -121080 241978 252167 164174 -117725 -42124 5377
21117 179455 -45117 -234813 -328836 -108111 -55983 -37420 295079 -82507 20783 145475 -183535
21105 -243574 -21167 -78225 34705 -43337 -232055 117577 236416 4828 -439028 -61554 -455853
21094 -455853 -70331 -118127 -289313 -66287 160446 120802 84751 155165 207238 72293 92553
21083 92553 -285811 -259895 -91733 11687 44641 130034 267822 70705 30416 35238 -144882
21071 -80373 -79227 15342 -347907 -303795 139705 -455893 105377 -149203 5356 26816 -182307
21059 -106157 -96220 -108400 38814 32710 6018 -53179 -218145 -71412 -278271 -50592 86891 -481899
21046 -381098 27153 -186497 -245039 -49430 37547 270644 -186787 -238965 -230085 -91374 -31020
21034 -90018 60024 41031 -116317 -338856 22888 -87265 -201137 -101448 -228357 12903 -64358
21022 164817 258254 -189031 3125 -223025 -75193 262171 -173451 2950 -168735 13359 -115498
21010 -59481 -33487 -67132 -19806 -113195 -139738 -188134 -89818 179007 -150299 -134105 -432793
20999 -432793 39550 73165 -57507 173613 -270443 -19801 81642 74523 222852 108867 -115485
20987 -59835 99573 -259334 19174 -118837 -165782 103685 -71340 106301 -88173 -60452 -70330
20976 -70330 -354621 -314872 -183247 -369462 -17021 47697 -95390 125297 -188534 -134102 63394
20964 163894 -267678 -84243 149122 -112169 -339688 70318 163406 299291 216722 -111208
20953 229337 -209681 256826 276829 -354692 -47491 -218785 32886 -10633 224081 121094
20943 121094 -173263 48464 341576 -67957 -93419 -98429 52470 -100933 97129 77680 -129679
20931 -279597 -352794 241977 11767 -74587 -282630 173916 -64554 -114491 -327138 -219450
20921 -219450 -73744 271046 349841 -45394 -36222 109577 -113894 -145760 -87518 -14144 126234
20909 -238928 -57055 87723 7884 -428376 -154945 -304457 -50828 -27628 -114817 57857 -75656
20897 -28380 42815 -53220 -277234 -254228 15036 232658 -41571 311459 -400833 -147102 -28046
20885 -153080 -21483 260607 246108 -465347 52026 140927 359748 93452 -187462 49666 135382
20874 135382 -315931 -231804 -102434 -110819 -118763 113482 -125455 -37904 -25323 -234767 -228382
20863 -228382 -115716 26755 -142427 73328 -19395 40179 70949 -211991 -191813 -102533 57958
20851 -72946 262635 -165991 -136485 -270192 -242971 113493 -340826 191005 -156406 -1830
20840 -233896 -234537 -49258 178776 -81498 20832 -113955 -98615 11301 88760 -100698 -269719
20829 -269719 9094 -303598 -117603 -80166 49434 4123 -217958 80973 58632 268928 -14648
20817 -301855 -93102 -217017 -96853 -194247 -177453 29269 149256 4700 552004 -450414 22419
20805 -64881 -190540 62950 279937 -267018 -217288 -174154 -206481 115446 -148510 1352 -280938
20793 -110787 3877 430040 -38023 -60743 82198 -33320 146574 23412 -116034 18392 15818
20782 15818 66630 -32582 -108028 -99725 -269840 -42622 -191246 -34070 -103228 -137768 -35084
20770 -198113 -104427 -123173 -323291 259921 -25604 199854 -202113 -74723 -175251 -4757 -117836
20759 -117836 165289 88965 118422 10182 122703 610 -159294 -47404 -90955 65905 141168
20748 141168 -176122 -37227 -72939 -157750 -98379 -115671 -280442 -291367 200069 -13880 183637
20736 352425 -199552 -102495 -62971 -37960 -346671 -86195 -222429 -372202 -290625 -64486 -39073
20725 -39073 37408 -309015 151097 -89923 -26940 94770 -77285 -83301 -152836 -174269 114542
20713 -66116 27499 -140082 169772 -93464 -158555 -12045 23372 147113 226884 -55227 165136
20701 -245385 -96740 -74456 -367787 117792 109750 21535 18165 170073 -68347 -120768 131161
20689 37780 98064 -38766 -188544 36093 -291878 145180 -58639 -260894 61377 60164 83279
20678 83279 116915 -56010 -21520 46698 -28487 148249 -258349 50440 51467 198454 76985
20666 -79356 25804 -336594 -64656 -137815 -196141 19558 75999 -30349 -184175 -80769 -224054
20655 -224054 -224151 -29381 106638 -364143 -171436 -300021 156144 -58172 -411728 68610 238833
20644 238833 -260024 -16411 -42211 -320283 -300305 -25181 -2665 -42470 212679 -106580 -298697
20633 -298697 -325466 -178033 -64273 48458 123448 35204 -206896 -251687 -11048 -15584 118180
20621 -10061 -200466 28767 9520 2589 -191964 -48679 -194542 244102 148660 -45997 135588
20609 -321517 80297 -62047 -225067 -142805 -107961 26547 -90499 6892 207526 -278987 -179986
20598 -179986 7964 33432 -372973 -65902 -170327 76288 196863 -6496 192363 -168785 4831
20586 281497 218197 -50171 55193 31541 117813 52476 357418 334887 200366 235328 45745
20574 10995 -135217 -11661 -216296 13450 -171842 -165335 -369600 283990 -188187 149435
20563 261290 -55965 -70814 294671 -349171 -29452 104566 -250402 -82112 213102 65018
20552 -263999 -350627 60232 -34941 -288537 -247207 134691 -119918 157828 -66034 -180735
20542 -180735 79560 -28994 -235429 -179259 -136514 -208544 -34435 149991 -220854 -92661 -7060
20530 -111757 -69928 12697 144371 -111578 -103838 38275 107814 -256993 -171286 -157299 -40396
20518 -251705 -7691 -80066 -31905 -12008 -67759 82940 173441 -125803 -62157 -300439 -209057
20507 -209057 -117174 386231 -119260 72080 -181363 -470348 86501 82043 -206317 196826
20496 148329 -51442 116570 -84383 -320416 -78136 -38068 -82465 81553 -33224 -121245 -37758
20484 121601 -90443 -68162 204273 15279 -95490 -70331 -155296 123546 218348 -68690 138441
20472 195085 -69092 283026 80636 141389 -173408 -26006 9151 -86723 -297109 115373 -56663
20460 103946 183258 428565 -265692 105467 330051 -137556 22611 91854 148851 209207
20450 209207 48824 -44623 35553 -73500 -205574 -293151 93440 -120223 60246 -14698 -146183
20439 -146183 -220884 120662 100886 -90951 -45085 100145 -137759 222032 -253334 -21583
20428 -50727 52773 -99376 182765 -144566 -110122 97451 11235 37629 -63230 -46643 -323549
20417 -323549 -181767 -87059 61969 -23792 89872 -206064 -103499 46021 92187 142828 -359761
20405 -174131 -3699 126787 -101687 10230 -436916 -227909 -88586 60227 -250732 -3315 -17656
20394 -17656 4152 98279 -69398 -34069 -223077 -225261 -80867 209231 -259508 83653 -321951
20382 -113767 87187 93804 -67208 113526 139734 -28066 -195561 -95172 146079 -37815 -105760
20371 -105760 15688 139266 -38663 -61349 -148348 -257042 122734 215329 -256853 -174892 -95428
20360 -95428 -26122 -610 101120 92480 -350746 -439645 64357 76411 -153793 -118948 -397490
20349 -397490 -307010 -126597 182926 81250 135238 -86080 -183805 -162790 -80738 -184848 -156324
20338 -156324 -127548 192611 45035 -236356 -68459 -170461 -79476 9425 -193095 -211416 -68499
20326 290755 64437 -1641 39092 -220384 2998 -387851 -128679 -192014 57906 -195465 -111248
20315 -111248 -137174 -119599 190339 -136566 19485 -395956 -76252 209743 181351 -151891
20304 -142335 -16901 28099 -193538 -38900 -115648 -276034 234444 -15653 -183556 181582
20293 -293331 -222259 155189 -28938 18976 155262 -181210 42556 130644 53353 -401377 8414
20281 377209 -100591 -16339 -150600 124974 -253950 -262367 -171459 -181736 10335 -84888 -22175
20269 139224 -101780 -222546 -40763 -48028 -273287 -84712 -242563 -230906 -4623 -261145 92174
20257 71892 -208155 27318 318391 142316 7726 -253747 162004 147763 65456 33896 -6799
20245 39143 100065 -242625 310482 -309417 -198545 233611 -216181 -172264 -222821 81151
20234 -215348 232506 -268165 181742 -69138 -66913 -147014 -60309 -209535 -127315 -96422 -144624
20223 -144624 -104402 -60056 14993 190116 -86484 -77621 -85275 -400394 182428 -301409 42735
20211 -47792 169922 4598 186336 15991 -205670 -304477 -34772 -261934 -89462 60664 45988
20200 45988 254928 -100069 262868 149250 -61040 -61522 102054 34890 -209231 -22477 240017
20188 -22528 177459 244266 28360 -122168 -76535 -538547 -17671 154246 -88395 -197480 -64877
20176 -14508 -65848 -215031 -53920 -138659 -486860 -178575 -330559 168375 33584 -343238
20165 125286 -42185 238542 53141 75357 351093 -102372 -279426 -111575 -106707 -54330 -27171
20154 -27171 -264461 -222401 249472 -118748 -53573 -181374 -107027 -341982 45546 -226547
20143 8884 38227 163067 218677 -189156 -35711 -3628 -100799 80056 -182936 127184 77067
20132 77067 142971 -59961 1558 37975 181887 -41201 245428 2447 -222624 139638 -18811
20120 -60873 -105761 -72253 -72089 159389 -24032 11018 122297 116282 -63027 61001 -234528 -154964
20108 -154964 -223988 -202059 -336385 131334 91291 -7011 -272889 145063 -5737 50601 15134
20096 179954 207017 -97243 196648 -339619 -167188 -242089 -22115 32960 -127887 -155075 109304
20084 -194259 10692 -221098 153360 45872 -191907 196321 -32524 76309 55507 -89181 -384510
20073 -384510 -377993 -47806 -17587 142706 -14931 2335 -231241 -139982 -38857 51935 -81498
20061 -151622 33130 -111291 -139221 -83743 -20338 -153486 -302349 -23261 13124 -82102 -240213
20050 -240213 108801 -182641 -373146 -232402 -111847 -145888 -501258 21341 -32187 26582
20039 126671 207360 -111271 -111388 89250 -110004 -209760 -30153 141323 -180688 -176353 -143729
20028 -143729 -63389 -103580 22538 -327605 87077 -243544 42923 -158774 39104 -225926 53560
20016 290464 188768 -331151 -91837 3682 203758 12591 6040 -17779 -104658 -320854 212950
20004 193038 41883 -162773 26843 188093 45386 -362340 -211544 -49230 -244766 -121661
19993 -101547 -119229 -54269 222148 -319223 378671 6566 -59809 115020 133651 -100840 -129161
19982 -129161 47406 32698 96559 -178172 -5929 123628 -46471 -196649 54177 12900 -197705
19970 85199 -136516 -20259 -120739 -173434 -56929 -13254 102344 28198 -88816 -151291 61158
19958 -17549 -106982 247960 223738 -13221 -293560 -189766 -23945 -202922 -60909 120379 6494
19946 -111067 108810 -301343 -89501 263601 -170507 -50007 -90264 -122921 -217022 262893
19935 59048 -25108 -290433 172558 -186429 -362325 -30220 41434 -259107 144008 -72352
19924 96828 -44570 -77858 -290828 -118960 26658 84745 -308750 -4654 -264696 2016 39251
19913 39251 -224699 -62255 129342 -93340 -427549 9553 -144288 5006 142594 -118200 221675
19901 -306836 -580555 -137258 31857 -13425 -193107 87974 11114 64115 198028 94634 190618
19890 190618 -373847 -285760 -26914 -62497 -59935 132289 258138 113029 -165876 101559
19879 -17810 -126054 -219144 -101350 95473 -132574 -24855 -106542 -64394 231613 -238156 -184818
19868 -184818 203682 -309846 -117571 186617 -230166 -149550 43699 -94659 -308874 -140886
19857 -99265 116383 -197733 118751 -69243 -3672 -203949 402757 -257945 -128427 -215906
19847 -215906 -60899 92042 -118427 92305 -72606 -180667 -76765 -91007 29936 -245074 -204254
19836 -204254 86946 26631 -115356 -146561 187690 -10443 -52127 -59854 -68165 -296521 -214268
19825 -214268 113886 -40572 -268257 -208419 75946 -20588 173250 -86250 -27707 38266 -187954
19813 37550 103984 74392 -116001 -70134 42814 17075 -173997 -178442 -123863 -117607 -149498 105624
19800 -341237 124126 -105103 45539 -30860 57626 -227720 -187769 -285928 -240012 103466 -521958
19788 -194475 -48211 123567 -188518 -77048 93609 28214 -23296 -267220 -88486 -17157 26340
19776 -22248 158891 30068 -57932 170791 -234823 -275413 99984 -129501 27731 36380 86918
19765 86918 -137577 31553 -131101 -80176 -156796 483177 306320 60374 101080 -292512 1001
19753 -200513 30356 50113 -130776 -586731 106921 -33295 -132870 -297148 12394 -98896 -200316
19742 -200316 -372699 35878 216998 -11737 -180161 13173 116364 53068 231860 33268
19731 -3004 102414 266194 -19553 -120880 107845 -353954 52301 31439 28612 107660 13062
19719 -77813 247459 -316805 -80147 -131632 -228908 46743 -72973 68725 34375 -47678 64359
19707 -305917 217654 -133042 6872 -8824 2139 -6554 -11612 -45894 -146164 -387761 167417
19695 77940 39535 -140368 4337 275272 242412 -17771 -148910 -77017 -87852 -305649 179297
19683 -204652 -45735 143601 10600 40753 -215186 -2898 -72835 -339720 -288748 55780 -100514
19671 -165097 83570 19424 -60716 -71407 49523 145595 -18300 145458 -113803 115436 -301744
19659 -186349 294677 -163061 161779 -139189 -64820 47201 173378 -85988 -300193 -8834
19648 -24979 194721 14599 65722 -57282 -57195 -180829 -122263 34301 -378725 159493 34631
19636 -390352 5014 -49018 -117140 221549 -29058 118702 150293 106395 -81306 -225657 134041
19624 -85530 -88241 -138346 109726 205273 -202492 -5078 -21326 -94489 -62459 31496 -251567
19612 -112204 231857 -242387 -111206 166532 -484444 15243 101340 -148581 25083 -28250
19601 87336 218257 414534 -111440 174517 131108 339918 -19311 59314 47114 -80834 -314611
19590 -314611 -37121 -89649 -398599 -140586 -64363 -159876 -98059 112258 -141177 -306316
19580 -306316 67371 234615 -330005 16769 196189 -234543 -45940 -493389 -154920 -67846
19569 -18157 -442374 -367102 140042 -190365 148045 -233990 -131956 36240 337762 153778
19558 284932 -124066 -223353 -70604 223579 -196362 58320 -33291 -11156 283720 -231308
19547 -198016 -31061 -367869 -139375 -22476 91160 192669 -155845 -48423 -192526 -318870
19537 -318870 -160320 -244364 25895 -221605 182935 183481 19981 -157894 -344272 -209180 -64268
19525 -144590 54402 30463 -193001 -38342 -139967 -56066 -193335 319713 -66369 -74517 108997
19513 -46751 139582 43075 -248763 -9875 199399 -81562 -36722 36277 -33969 -24283 -526479
19502 -526479 303942 -97101 66195 -25082 -140493 310857 219938 -187976 33180 358516
19492 358516 -80132 -39107 -88146 -264576 -39753 -149565 20541 47805 -20557 -147242 106104
19480 -431025 973 -53776 -117597 -234991 251222 -51276 45615 16074 -108658 -101424 405313
19468 -15381 202162 -9827 -244284 -79895 -102118 254002 242467 -396299 -155 120277 -252293
19456 -333357 139889 209345 -329198 -352115 -229525 -72873 28841 -187248 -84507 97995 185695
19445 185695 -73791 -86627 -59095 186505 152770 -312808 70271 47438 -68386 -82958 -41079
19433 -313262 -223143 -384179 95262 -421570 -201455 133871 14069 -39870 -225395 172506
19422 146735 -191580 6207 28062 17388 -29436 38621 -212845 -260341 13645 -79594 -4423
19410 27377 -93413 208795 -15884 -181223 -282162 -79590 -104632 48531 -25890 -37 -48723 -112098
19398 -112098 -92160 185533 51731 139420 86543 -157587 -548686 29392 -212875 242014
19387 164351 166663 -388835 23188 -173075 -189327 -191443 -339258 -85588 -202285 104342 265889
19376 265889 124480 244795 -16016 -293239 -214799 35975 -104646 33024 -400575 -124420
19365 165480 82379 -170983 -78748 -127227 -191843 -243373 -223411 -36512 -106203 355314 -62850
19353 181724 -126584 12664 -249215 -248289 93635 -339705 127946 -117809 -79154 177851 -433666
19341 162952 -39577 -90845 -310664 -78434 160655 238965 78506 -271683 -202431 -205714 208693
19329 232879 -84387 322879 126479 -235488 143546 -479120 -249453 14643 -76170 106840
19318 206577 145016 -137375 176951 -166944 -76881 22652 -139357 -35034 -54599 30792 -211534
19306 -83510 -145745 -204794 -109142 -102854 23574 -98434 -154175 -253119 140786 84939 -146635
19294 -369072 176081 -324746 -130756 166924 -163007 51039 6329 -283866 110938 -241826
19283 -42250 111274 -72020 -27973 -289833 5563 28418 212268 -165367 35734 190557 21226
19271 -73317 -75494 -84707 -16429 -240370 58979 57736 -337607 47287 -315630 -248691 1414 -266716
19258 24361 63736 -503809 62094 -126229 -4275 126010 -192362 37725 23232 200845 -165119
19246 -272589 -138732 -297833 9379 -24021 -163135 -330357 -178500 -103591 -90972 10585 -269473
19234 -44129 -74444 -185980 -260345 -453315 121178 -128559 -128994 -22331 140653 -405057 17636
19222 -2543 -37417 139069 139902 -321839 -84608 -514728 264513 -13824 -69468 36813 -61757
19210 -209501 41265 236671 -171289 -38637 -186949 -60637 118958 65518 -356416 -103743
19199 113308 -316123 -106071 -96094 -230695 -30932 -495 -267994 53522 187203 68319 -328103
19187 -93159 -109931 -128060 -87596 109352 -192461 -180471 5279 189275 -17736 -171688 44472
19175 -173956 -307557 -38284 36736 112204 143100 -221348 -8085 -294627 -163003 396530 -74636
19163 -134353 -455068 -254890 -239967 69200 -212914 -252869 -212766 -224979 -156538 -79865 -245834
19152 -245834 182240 221301 20742 302754 -72309 -271846 36218 -182233 -45191 -74189 -370282
19141 -370282 -242997 -243751 -7172 -148590 -466887 -68647 -67990 217809 -303027 -207041 34688
19129 -166658 306706 -205043 166119 -54843 -137255 345302 52649 -345765 50644 -516391
19118 -182835 -134018 -66248 92187 83198 -74557 -118027 -72966 -112072 290988 -55154 -249838
19107 -249838 55199 -227868 -275009 144281 -178282 129423 131789 -114531 -169643 44429 -161282
19095 -46942 -172726 -162022 106590 -193006 -78025 -317334 184992 -111476 -10768 -37424
19085 -37424 -51122 -82525 -327409 130644 291275 -156768 64855 -41685 122444 -352187
19074 -47627 -179111 -114796 70118 161445 122444 16709 -287350 316787 129242 6471 -171031
19062 -17650 -1105 -222932 45086 47346 167044 -142772 8763 82005 58009 -16116 100467
19050 -224333 -111672 -232708 6653 96380 113343 21219 -68938 -72087 -210087 120924 -100441
19038 37893 74724 -101303 -62165 -202147 326704 47832 18077 -142911 -186954 67694 -21974
19026 153300 72181 -39252 70835 -56921 91406 -36802 -96860 -12810 277457 -176115 -90084
19015 -90084 -187 -227453 65283 -76886 135803 -15068 -168676 110029 -69843 97840 -55088
19003 -173818 206316 -295124 9473 -184002 27408 200927 1807 -200884 -86382 116856 -5247
18991 97690 -18869 -208954 -196609 -282188 -126865 -184979 -99368 -193853 250887 81785 -312496
18979 63835 -156055 -574436 64207 -190080 45153 -246546 -208781 323476 31216 76347 -111084
18967 150556 -234812 186775 -301576 23173 -272911 124255 -57621 9485 -43353 317460
18956 59016 -5984 -261439 -130520 -220891 209461 -33375 -284367 -275496 -257316 -33544 123041
18944 244953 146102 -26683 70880 30883 -75166 -465062 84820 57826 -65676 -137912 122749
18932 -61258 100868 22938 14607 206908 -59721 -21121 341271 124626 -126018 -111603 -145049
18921 -145049 11403 -115268 -173510 67320 68345 -146113 -76758 -244319 10624 167957 93909
18910 93909 96159 52989 -80998 -380139 -138724 108595 -198762 173055 143954 -105304 -4630
18898 -173622 227247 -32354 229511 214834 79983 161440 11760 -341938 93968 -161038 17057
18886 -228705 -111446 -95818 -179440 -254322 15322 -75827 19070 -197196 67084 -264810 57152
18874 -7604 129982 -100439 95256 123715 -38134 60526 136991 11631 -173725 -253480 -245745
18863 -245745 -412238 -13106 -20426 -62117 -211280 -25184 60879 104886 -75429 -232511 -953
18851 -212696 -338534 8130 132643 165902 5671 -142897 -221613 453295 -378430 -110988 64644
18839 -203718 -78264 189224 110374 422179 -88631 -141514 2934 236524 -94205 240985 66884
18827 102635 -237200 -4666 94827 -121852 5348 59450 11949 -110367 -19244 137072 142813
18816 142813 171777 248935 62528 -158410 77955 -259348 469849 -232104 217968 -10274
18805 124013 -176180 15477 -185284 -21209 -101279 365785 -500973 -426549 238060 -261790
18794 -8952 -238516 16938 42868 -145817 -531609 315984 307372 22518 -374395 153246 -148697
18782 -252915 -45698 -70004 -151232 -240164 -537752 -140306 -207645 94101 -158922 -110701 150926
18770 -15814 -307088 -268290 -123848 -113879 -5004 -232463 7569 134680 109280 -186686 -155751
18759 -155751 -87590 -117611 -67923 -134302 20326 -14457 119125 -27935 -16458 121213 -125240
18747 61596 235161 -154383 267065 -94960 6442 -120245 32640 -372527 -16449 -192885 -170652
18736 -170652 72504 -190929 -20993 126161 -49388 -73773 62457 90030 -6491 -331922 49229
18724 146967 -365375 87425 37163 -158829 -211529 34777 -94745 -182009 -194973 383679 23017
18712 -340596 135023 -187323 17859 -91978 -69270 17663 -88038 27124 -181959 -305326 299000
18700 129697 4387 23948 -118249 24509 -130655 -117524 94030 -72406 108690 88944 403950
18689 403950 -301350 42163 36784 -135599 -159001 398348 -58263 -27769 -264107 -126472 -152717
18678 -152717 -114274 145419 -208209 -250027 100855 -17144 -195237 192005 -102080 211153
18667 180513 -50659 -369263 -323470 135581 -130447 7485 121204 -279137 -368450 217379
18656 303991 -123171 -251930 158448 -60386 32134 -21528 157556 -31685 -107019 11336 288201
18645 288201 182420 -139978 -88291 -111544 -397246 296729 -292582 171265 -223515 -188030
18635 -188030 -92668 -199176 83391 12808 11739 -294989 -356708 238231 -65074 -366073 37517
18623 -163807 -201847 -133078 -255101 -77679 -48410 168223 -87012 -84982 97409 -367798 355211
18611 -12475 -254684 138153 -156012 44507 -374835 -19906 -242973 21327 55305 -166506
18600 96485 -167637 -170634 52911 -396938 -51629 380994 34274 -144730 -200885 -7711 44094
18588 -138056 -24448 358581 -85825 121265 -26669 80254 -362271 88776 153000 92908 84049
18577 84049 -157072 -33010 -99614 205229 134884 -21392 29381 -256907 -140722 -74369 269536
18565 85407 -119971 -83839 -124514 -195099 -183095 224219 -79022 87603 110284 88368 289565
18554 289565 -140373 5504 -23305 229306 216772 -23085 -215890 -58013 50797 -313630 96888
18542 35517 120134 -115985 -55286 -17050 -114854 -38736 79031 42996 -13742 182641 -38518
18530 -12388 -177783 -176938 127743 115434 1123 213414 8821 273663 -278181 -113208 -160775
18519 -160775 -11115 41713 -58520 -191892 -291021 222366 219699 91248 -42947 34476 -315728
18507 -66395 37893 10051 50597 -6780 -185100 86784 49975 -108283 -25368 -68118 60727
18495 289697 97293 124882 67000 55565 53098 -220665 21915 -14487 -314940 332961 188978
18484 188978 -122276 30904 -264541 -61000 -40814 -259761 -223785 -215112 -77595 -108494 -145814
18473 -145814 -238109 -159509 83253 -41117 -99331 -136856 -209213 -225159 36848 80856 -110634
18461 7471 -166197 -81516 -171046 -110323 -255223 -11372 153534 22251 -2738 24055 -134721
18449 -21302 -359131 -365532 160414 205871 -223096 -29933 -46898 -277239 -231606 262513 -138297
18437 40188 33500 -39959 -112565 -112334 -126738 74157 34712 28796 -221565 -109658 22545 39961
18425 39961 85250 125014 -73170 -53703 147179 -32338 -1295 -118959 -9103 -45617 58559 552758
18413 552758 -117915 -268086 -275067 -188089 25004 101795 -19260 53352 321647 -428474 34403
18401 -105994 -21284 2999 -80710 161123 114244 -43897 38382 -118916 -150344 150946 -53386
18389 121053 -241122 -181393 -40084 -114488 126237 -101881 -30321 39579 59888 -156304 -184815
18378 -184815 32947 96466 -125600 270156 217348 193028 -191079 -20414 -416896 17527 92192
18367 92192 -34498 -141986 49728 60502 -67643 238557 31050 -78029 -467016 2453 -80008
18355 -48881 155966 307037 -24111 -89066 -120184 29775 -249126 30649 1853 -165507 94683
18343 -284955 -124812 223892 -298821 450355 -87836 77354 328296 117371 53886 -80938
18332 -134875 106938 -152664 112917 -112948 77080 -209052 -151729 47334 -202916 -58298
18321 -844 -169640 433397 -77571 142628 -6735 -298393 139509 -64509 -190589 -340571 97441
18309 -147775 -163519 -233871 -224002 -25323 -236586 212765 126832 -228942 9040 -32970 -124354
18298 -124354 -22240 -284414 -59516 -99116 -40039 -168621 -174361 -60592 -246859 -164285 251821
18286 -287592 -227302 -27512 59896 -72946 25458 195506 -67654 -65846 44589 135817 -3142 -310790
18274 -310790 -9901 -34931 27067 143855 -56604 131313 -45830 8943 50145 -50284 -182178
18263 -182178 -37497 509746 -45367 -92715 -126839 86608 51575 -2684 -118251 314106 -201286
18251 -201021 15616 105688 160431 186893 -34991 191231 36700 323733 316480 39633 -145630
18239 84861 27318 16130 99861 -409827 -18076 89701 -166409 362718 105162 30387 260308
18228 260308 139055 -229370 -328409 84985 -142550 -70105 216358 -174761 -432469 -270989
18218 -270989 -66208 -6326 -34351 -186589 1109 -195219 -171853 364976 17511 31411 7083
18206 86797 -143033 -74343 -53024 40102 -219511 -201618 132225 -150633 -500 -45149 154636
18194 110449 -90435 -317860 49581 -73736 -78471 -193549 268392 -121638 -91983 -213031 -4385
18182 -54001 28025 -51333 135557 -263850 137553 -108957 6635 207665 86762 -30224 -130914
18171 -130914 169395 -58877 -67036 -142677 -265650 -268005 110755 -310402 -119340 -218126 -187239
18160 -187239 63400 208184 -136526 218040 -89895 -95851 -35340 267153 156680 359907
18150 359907 -150629 -252062 66151 38004 175925 28561 -59326 180484 25743 148226
18140 148226 300629 100091 32288 -141081 -79442 155657 -351716 -162752 -182933 10328
18129 -86160 171521 151842 -217637 -268585 -470958 299613 -125064 362718 -112155 -314857
18119 -314857 -229885 -29382 -224128 -149682 -369946 91977 -70367 152897 15035 206216 238311
18108 238311 221037 45084 33991 75094 -183890 26804 101902 39462 16204 -216926 36817
18096 124724 3085 -34950 -487341 12469 -52090 -196491 -198267 -284500 201604 85953 -144131
18084 -487523 -222115 40154 41669 82395 57034 110584 360355 412464 -44074 -57671 -166078
18073 -166078 219269 91672 146449 86122 -241657 -44855 -257373 311288 82562 211806
18063 211806 271015 -238681 80120 115035 -242441 -5019 -146989 -37952 -88523 -269491 -254567
18052 -254567 -115635 492298 245780 -304629 -173609 93260 116587 -178494 -150858 -78754
18042 -78754 165866 -95123 -371226 -176156 121864 95331 -142605 -90276 37079 114458 -233791
18030 -102054 -25941 -35428 241208 139296 147704 -15259 -16912 129419 65298 166218 52691
18018 -393342 -91509 137270 80906 -63978 93938 113260 -55627 40454 206521 -37355 12415
18006 28174 -135526 105012 386587 -268364 5679 -156584 177487 164085 29494 -255607
17995 -183358 -205971 -58668 75017 208073 90652 -251624 8184 -38026 -45248 203529 4506
17983 -189529 -110364 -196053 131116 -178442 114218 231170 55857 420109 -277208 -59255
17972 60917 -93005 11828 -196287 76437 149793 -86996 6551 254695 -192039 320073 -20351
17960 -267062 -19188 30030 -127467 -5797 -139308 74194 -158323 -67812 -195694 38243 -197016
17948 122772 -144751 33184 62333 -577176 80791 -153188 -236792 -62269 -78595 55610 -234419
17936 -16986 381494 10977 59424 -59836 -56001 -61467 -295451 -60687 -87447 94312 37627 163682
17924 163682 117714 -27877 3869 -71938 -223148 -5241 -74055 216785 103486 144670 -128103
17912 127763 -71556 102652 -90457 247104 -140327 -145841 179897 -54889 200810 -112760
17901 -140134 142591 287410 -91983 116343 135951 107408 -84761 -57001 148323 -204703
17890 35497 111733 256582 -414876 31214 -239729 141040 -300713 -357325 -79841 202875
17879 -274400 -9377 291510 -81373 161267 -291879 -255840 -127066 443631 -469460 -113967
17868 67841 -14340 67937 3682 -110476 -44375 14441 280115 11284 100456 28091 -206756
17856 25136 114142 -58865 -436772 170148 277567 -42937 90807 -140747 351370 -192020
17845 -226718 149870 -188093 75082 -220622 389264 -313908 -32952 -22017 -211664 -191863
17835 -191863 -44477 186668 15109 78545 -83822 334806 -84120 108855 118168 72356 48306
17824 48306 -35717 345946 -49020 -273525 48527 310021 -122811 -95959 -52228 111375 212386
17813 212386 -116581 -297335 -269418 144545 -283429 117801 -108548 264981 200073 -142200
17802 -342734 18493 -234704 5610 -158820 109617 138334 -219198 -141090 332111 -109909
17791 160149 170500 224322 377 144014 174069 -88293 -105649 52935 56555 -118678 118888
17779 133135 103825 138424 -22255 193707 -81889 46824 91708 10865 100160 -8015 6326 -19903
17766 -232219 139552 -436291 -276947 56858 37281 48962 -241270 100742 177447 -221784
17755 -7206 -229612 -269721 146087 41194 -5796 97252 92198 3989 -3304 -202210 15091 277435
17743 277435 191135 16135 54420 -127270 -174002 -401712 40925 -15779 91317 40165 50345
17732 50345 -127057 -32380 152261 35983 -94556 53984 96813 46738 5797 -189530 236408
17720 -187086 215470 -106449 23264 -305376 -62749 51967 156543 -87815 313420 90808
17709 100456 214340 -47708 -56087 159925 -50969 -9527 -287232 148188 34013 -76071 -239607
17698 -239607 391009 23265 40181 -13146 205205 84220 -3852 -41267 -537216 -87435 294999
17686 -134107 67273 -147914 151114 -119890 339883 438104 -29075 -166522 -138907 230989
17675 179217 84388 -16218 -6310 65837 230719 -47923 186844 46232 19698 -31059 3246
17663 89389 130301 -11639 -47406 106169 -34467 26322 -169031 -25276 -82042 166991 45016
17651 -159442 -11299 -191736 -207896 -70472 -288741 -120534 145872 124307 -185251 114221
17640 34292 78063 15467 59547 105748 257205 55495 101303 -148493 163952 -27659 111262
17628 361928 53215 298798 89504 -44473 466341 45574 -156139 -185320 -183855 -244982 542499
17616 120745 84503 132799 -100253 -51155 -150054 -372013 -98203 -77832 432866 -113572 195543
17604 -8986 -107606 147077 210391 54033 306829 118606 13535 287691 -33232 123543 -124421
17592 86083 -113302 -304367 -37240 181576 126784 29086 105137 -83222 -542 307572 -214355
17580 153820 356071 131353 34671 128123 2214 -209863 -144217 73311 228133 540849 310945
17569 310945 -15386 198953 31332 12323 105894 193469 160786 -29409 133441 -191606 105089
17557 352863 -155063 37237 197654 140905 3036 -31235 361663 48591 162811 -6889 238123
17545 -14002 -49751 74776 148939 73570 -42957 16447 146589 185942 228891 -147256 -7523
17533 231477 -35279 74633 109748 83004 63153 253534 114896 178113 25614 -118889 -81664
17522 -81664 30765 130397 285205 48325 58466 30665 278390 47124 -62976 -2790 54558
17510 388895 -213685 -5388 49736 159158 258232 -217559 359087 141185 -52685 -114121 119810
17498 245473 -37148 124967 128891 163587 -77702 119961 -286642 -27858 38409 181262 -12495
17486 158453 109535 145021 138160 409544 -91425 263531 150545 480811 121016 223623
17476 223623 152024 242343 289206 56226 197836 139998 89746 317395 193172 294622 105329
17464 299491 185337 246493 102591 321674 232225 -103520 178698 170605 251287 275686 200314
17453 200314 -113586 309559 462431 409558 44014 309764 360481 123331 17636 66206
17443 66206 121783 -58075 333640 511352 312575 227032 290428 75993 210874 -71749 368834
17431 122321 44496 256575 433184 210769 193533 -34021 195398 76519 334540 188348
17421 188348 289510 256411 448789 100635 548605 381861 82389 286667 74984 681913
17411 681913 348764 420821 100484 -130669 115754 94342 47039 150200 342830 -95366
17400 166491 -108092 385658 145085 240691 150392 -7432 -6275 200692 -25454 107251 166781
17389 166781 89537 224401 479917 350496 362322 109498 13015 314022 -12668 250399
17378 46042 166194 388612 191315 -44023 76133 310525 59713 -7681 -97503 279892 -18649
17366 315823 60668 233140 162495 9181 30988 33273 192179 420837 -61365 12509 432097
17355 432097 -55068 268605 -18084 394934 37371 232867 92985 206791 47299 215222
17345 215222 244678 -300292 394741 29687 184413 215677 520736 101739 -53496 254795
17334 99007 291094 104844 316613 130030 491094 317455 376428 -21528 412655 300746
17324 300746 -24697 277041 202490 347234 -24019 281107 65994 403851 71508 188692
17314 188692 213929 291774 237502 455332 308284 71720 -12405 48227 396817 -10213 290826
17302 -72115 134813 338868 273279 89161 234986 327839 438692 136944 -73763 120255
17291 295231 526595 203865 323113 8788 328802 348203 -7330 285986 -126242 238608
17280 112993 117862 306340 9222 123329 -97078 66142 76262 372461 235770 452595 342045
17269 342045 -31745 268894 135458 -236380 139948 103043 232399 313668 275205 258603
17259 258603 323650 198891 430833 265732 182616 41312 343351 156641 223948 540575
17249 540575 133870 319118 39960 244078 345882 -27639 39433 -19603 -83374 -82352 223308
17237 102497 -78828 168167 95307 153548 237897 368746 -16193 84000 182687 -62839 527037
17225 431918 207874 301557 410219 132606 179191 -101393 552585 339591 447647 283283
17215 283283 211226 75640 -89070 243021 180772 558508 296834 208961 166371 188605 186148
17204 186148 333415 161222 481681 27187 30768 475555 185358 396201 351194 457303
17194 457303 453076 96194 10277 258749 501231 80531 454570 114363 396189 271503
17184 271503 468314 80048 173770 100090 268697 161045 351315 30983 155843 39491
17173 194961 -7326 368301 307586 428937 411044 -30728 211954 375880 349125 464706 -150314
17161 449909 343907 50827 413513 285155 420047 294727 314003 428898 519166 461150
17151 461150 244563 445793 448598 133982 289724 333821 331141 368694 360514 309703 402309
17140 402309 354347 247021 349755 369555 173097 400978 336870 468057 309596 347786
17130 347786 787632 379972 387524 235990 610944 96869 343951 586330 519524 421280
17120 421280 -64467 437374 141248 325807 278449 464368 435460 289743 549343 58817
17109 632413 584176 62523 584059 543816 637503 430094 271340 605973 637456 349496
17099 349496 263090 419834 651841 346414 316111 224750 612402 501458 104594 465192
17089 465192 149285 328116 422182 584491 380635 419209 160221 389407 661872 188284
17078 547554 229578 386997 677397 184682 334926 422705 256096 431870 624715 428680
17068 428680 580397 251295 561038 611750 396204 635386 282617 581912 730279 368293
17058 368293 473987 599552 344113 470386 543662 471983 624281 427784 518513 553936
17048 553936 420684 717173 633699 364222 768439 87803 395050 492412 523225 355992
17038 355992 623067 745175 652051 725363 488845 799832 601301 472003 481952 696748
17028 696748 647299 470485 607978 401176 742051 751088 296546 375950 735902 352116
17017 484777 734874 400995 567228 604397 489774 580201 555252 1109266 942941 647569
17007 647569 735613 597487 710545 481583 622933 847707 300523 783028 588959 801291
16997 801291 960167 828497 918285 906485 869107 724807 466466 800477 921992 696203
16987 696203 606232 932875 665104 514567 883548 805150 941694 972486 805123 1065505
16977 1065505 829894 835221 1221807 1035804 460443 888507 973899 1121173 1123090 865046
16967 865046 1197252 1130392 789136 833394 864468 918888 884045 857934 999900 978191 970406
16956 970406 1078637 787078 701755 1326910 1110874 1042759 861908 1051838 1175167 1186418
16946 1186418 1187569 1240176 1239204 1075299 1129570 1164591 1402331 1472891 790701 1042069 1290466
16935 1290466 1261156 1196175 1276487 1545964 1316181 1152027 1423464 1289883 1434256 1301929
16925 1301929 1079253 1545516 1477501 1300624 1579453 1601986 1255008 1193560 1696808 1519434
16915 1519434 1180874 1444126 1398617 1353765 1503014 1696647 1364834 1741887 1271894 2027791
16905 2027791 1538829 1844453 1926699 1464244 1460791 1916731 1609662 2017521 1702572 1826332
16895 1826332 1555596 1961046 1656984 1898462 1669821 1753161 2264051 2070310 2044588 2145166
16885 2145166 1877821 1981408 2105093 2095211 2533603 2142284 1918939 2115698 2407225 2256903
16875 2256903 2538072 2401465 2700967 2129077 2677845 2653835 2297711 2678979 2441836 2810486
16865 2810486 2725771 2824810 2727858 3098776 2487584 2950712 2750983 2784479 2996433 3210466
16855 3210466 2879775 2883738 2998035 3150715 3091144 3522721 3007055 3234686 3267672 3548244
16845 3548244 3379245 3539363 3517753 3299380 3655708 4111405 4057721 3653373 3996874 3928801
16835 3928801 3924494 3958801 4164461 4017889 4447056 4520475 4551575 4529622 4724134 4498291
16825 4498291 5006799 5124152 5254057 4988517 5076815 5266260 5252420 5545848 5786228 5611785
16815 5611785 5908537 6216738 6063751 6300743 6353930 6506134 6575460 6836695 6807525 7143106
16805 7143106 7252004 7354136 7380334 7861456 7663256 7822285 8112191 8267701 8501537 8827654
16795 8827654 8883977 8833371 9373375 9671431 9966127 10127865 10276773 10549295 10776952 11232787
16785 11232787 11589492 11712608 12025711 12749008 12778385 13176449 13603851 13892251 14488622
16776 14488622 14712269 15311404 16144912 16215905 16815323 17507729 17855213 18552318 18968411
16767 18968411 19890069 20620892 21616196 22081866 23128231 23908486 24747788 26128484 27250475
16758 27250475 28368242 29464660 30462876 31980532 33546541 35052575 36934568 38484448
16750 38484448 40121432 42565824 44672571 46440996 49032664 51542625 54330739 57436875
16742 57436875 60576920 64239441 68008330 71500710 76009599 80473122 85548517 90839542
16734 90839542 96056232 102255471 108308570 115142864 122169636 129259846 136685184 144484489
16726 144484489 152151227 159800274 167090999 174546945 181215736 186805342 192156053 195655075
16718 195655075 198516253 200175980 200082690 198455082 196090967 192627194 187391070 181632821
16710 181632821 175261875 167904598 160534252 152801225 144588150 136821493 129387192 121711497
16702 121711497 114543748 107735912 101090258 95042436 89307506 83730463 78894458 74141287
16694 74141287 69915540 66260756 62277600 58808579 55772397 52684487 49753236 47075067
16686 47075067 44654226 42202780 40163451 38130555 36615765 34560687 33162679 31507502
16678 31507502 30301010 28910139 27745054 26516126 25169980 24390908 23164694 22510207
16670 22510207 21481019 20665557 19986837 18802646 18355763 17505951 16969694 16448203 15971052
16661 15971052 15504626 14938958 14345374 13998399 13309120 12982536 12743799 12502383 12160048
16652 12160048 11389988 10952207 10773134 10423724 10209710 9974339 9772975 9230172 9343757
16643 9343757 9068939 8580092 8150211 8345593 7873846 7908501 7350521 7571027 6980851 6948153
16633 6948153 6981665 6592887 6614788 6512855 6361271 6286938 6044225 5873598 5679786 5418353
16623 5418353 5525537 5468608 5075163 5019879 4932006 4782102 4649717 4559209 4877523 4395237
16613 4395237 4181088 4833373 4273480 4335246 4141281 3655556 3899073 3686346 3761149 3655801
16603 3655801 3706709 3093794 3238476 3373584 3258454 3096134 3064138 3032308 3147388 3425569
16593 3425569 2957285 2936452 3202539 2860309 2886963 2908243 2634887 2898958 2523290 2519000
16583 2519000 2381836 2505545 2400304 2451732 2347779 2426830 1965084 2078561 2277422 2159447
16573 2159447 2256555 1951182 2366419 2076067 2137621 2073766 2052788 1949952 2048127 1888756
16563 1888756 2105164 1615198 2090262 1795381 1758234 1723101 1759525 1776687 1596169 1718114
16553 1718114 1978703 1716303 1854176 1449267 1342412 1547491 1597471 1554583 1476279 1539902
16543 1539902 1402921 1441444 1251860 1288059 1581332 1796883 1207535 1363731 1321763 1093092
16533 1093092 1336741 1234303 1181229 1270260 1340757 1096213 888938 1296443 1024402 1198977
16523 1198977 952326 862467 1359657 1155657 1059856 1210118 1130309 1188528 1039838 1248537
16513 1248537 1103713 1087500 1187407 865118 1005928 1199926 588522 902697 993790 938893
16503 938893 835963 727659 977453 668556 871897 808980 742691 830298 709664 679466
16493 679466 720391 743227 1013979 636361 804715 836239 677654 929724 592202 921368
16483 921368 383455 564371 973604 586321 659741 605777 657553 618808 726635 446602
16473 446602 675868 441201 611142 327790 804668 655812 580487 719554 685935 381899
16463 381899 639244 151380 512640 647879 896927 217178 666793 757024 727932 666574
16453 666574 462129 524063 589878 555689 516299 633700 629141 563992 371827 747129 333571
16441 483096 73533 557362 385348 284710 522010 638823 414175 341234 623242 415709
16431 415709 159122 353893 -201988 490251 244323 378713 325806 329134 548251 575303
16421 575303 356251 37343 336511 226074 455986 374346 587914 468852 229572 569967
16411 569967 516230 422049 268538 389534 74738 366711 396218 342701 247096 330788 276775
16400 276775 397923 112419 213392 219774 392408 596476 201413 575224 793539 474292
16390 474292 455473 121836 192062 327676 168352 175215 -53017 264870 71586 259415 378187
16379 378187 339462 404229 579928 -52244 247991 502565 276077 196618 413400 237734
16369 237734 348502 494314 138736 321121 226702 407480 295244 15784 -281056 512262
16358 78071 346912 70705 -15083 248991 89770 256475 268246 166034 398166 180597
16347 -62774 498250 207993 252990 176540 -230025 306208 576055 69029 54440 -35877 340880
16335 272723 145927 178656 333229 324185 433327 6651 608013 183928 457195 77708 2562
16323 72110 -63015 450962 391588 146592 153594 198321 48308 1963 173632 10319 88121
16312 88121 169695 232643 46615 98978 -53585 -92510 139083 -5425 219897 303135 -117104
16300 -173347 -44470 157306 237563 -66527 385497 -19720 529812 -52908 187829 318103
16290 318103 165770 18761 -9868 376530 112448 31132 117485 97718 407567 185748 -130033
16278 376054 24763 -9286 170815 194552 402936 148542 -119738 248564 3634 41689 149963
16267 149963 177613 -107747 206615 48294 -57037 183452 220640 -210451 -104657 46283
16256 152320 23047 162367 207281 206753 -67028 17531 -11372 100182 -139657 -29103 -272609
16245 -272609 112105 -259167 120224 186972 -144547 -71769 111492 -315737 -126497 -18657
16234 -15575 143058 -317323 116817 -279175 -221845 123083 146591 153463 168314 192967 297181
16223 297181 223370 -70903 -24782 20366 112736 -56535 62675 -146395 90327 311911 74761
16211 239170 122842 245753 257985 174159 -10923 -362088 106675 -7635 -146715 268439
16200 -201582 169344 -202683 209484 122879 235385 129474 97716 252894 126074 6698
16189 -238701 33909 -33463 -188404 190072 349568 -41478 12009 199712 -15282 -100645 -406377
16178 -406377 -208850 79081 -46957 104670 -95774 -104053 325715 -446955 -59279 -24760 -21120
16167 -21120 -115801 132331 -49346 -22557 -165878 79655 -95031 212760 176793 -44059 -113888
16156 -113888 16770 -124523 173878 217322 -161641 -31958 13478 246742 -35349 -58877 418331
16144 259209 -163518 207457 -19797 54917 138881 -33308 -39606 265910 -19904 -139805 77259
16132 156572 116140 151142 -64361 -202515 72697 -59711 -100374 174463 -88973 147223 83964
16121 83964 213227 -204262 -13503 341482 60435 -194777 -424725 36604 -355188 -104008
16110 89920 297401 -37282 49691 -259626 23003 335812 -170881 91249 202803 22256 225513
16099 225513 94872 15162 -8514 -100478 -73101 -302958 212126 75614 -89234 -139875 -88685
16088 -88685 -203140 59922 4407 135902 385326 -257050 -164716 -184412 -97083 -107849 -169368
16077 -169368 91866 44161 -156932 125568 -5479 138058 105151 -35647 184573 215238 110647
16066 110647 -29536 -396564 130500 -192594 19270 49117 -98088 -120898 17168 -70015 -57126
16055 -57126 32984 -175061 -204342 -108939 -125317 -204265 172844 -6257 188720 53266 -115845
16043 -46829 -101919 -191590 -138153 -76420 134958 228875 -129881 229655 -305482 -182693 -166354
16032 -166354 -146701 -420790 -57154 14779 -100692 -315253 -108187 -74741 91642 -82479 -208573
16021 -208573 -295655 453835 68872 390628 -190436 -459014 235287 -474415 -32883 50132
16010 -39442 177579 -33170 -88236 -260959 -22833 -185746 -89170 4448 152 90456 80977 -189036
15997 -150932 -188773 127456 -192209 144766 -134828 59079 192435 157023 23624 -202261
15986 -275365 168232 57481 253433 179185 -87447 382717 353098 419234 65522 -10993 -259768
15975 -259768 173568 -46673 -11112 159875 -274513 -32544 79575 -82707 -106852 154020 193841
15964 193841 327820 132625 -184313 -223390 140145 -206671 -203384 -70808 464759 177266
15953 152543 -152829 50200 282690 -240158 -32974 -161243 76921 180107 -2523 -278106
15943 -278106 104982 132977 -264988 -174596 41411 33752 152444 -10709 -232058 -185378 320599
15931 -202891 -91260 -239059 -115983 -263031 277302 -17028 59794 -115014 -255460 -338066
15921 -338066 -128355 -160913 -160645 -153542 97452 22205 109222 154105 -281213 -51383 120027
15909 -52791 -190818 -654101 -212418 169266 -140174 18942 -90110 -208990 -185183 -50483
15898 -287169 338630 24474 -31383 60195 -248548 85067 -126249 -270763 -179953 22685 -34169
15886 142125 -163249 -75065 222928 160450 -10355 -45057 -221983 180052 -181048 110134
15875 -199349 89006 10092 -121427 204924 770 -323538 -111367 -251244 -34687 -165509 -121415
15864 -121415 457311 -297810 -17452 6787 -177076 -455041 -183479 -93640 293053 145063
15853 -142168 -47452 -268696 -183062 6168 -82276 -190283 -114158 -133131 -179644 162115 -12481
15841 -121667 5221 -111299 49951 193159 -220866 101944 260433 -32369 -59149 240212
15830 -2575 -51144 47164 53319 -115127 50660 100634 22075 161483 -47073 111536 26865
15818 -59024 158279 10169 -97323 15650 9957 400491 -121139 26280 -179706 -160149 -99624
15807 -99624 -189033 -277551 357481 18855 -475236 20453 244775 -233926 260655 175180 -169525
15795 -61867 -204934 -47973 308022 -12411 103883 33024 142970 -72395 315737 -104296
15784 -50360 149962 -369666 -285233 -189372 -135606 -455103 -68200 111081 -269555 -58539 -174809
15773 -174809 49001 216363 -177285 -122924 269279 195974 -210366 -75490 -58222 -233570
15763 -233570 -62670 192965 -26509 188029 -119743 -84930 129250 232559 45726 113326
15753 113326 -86537 -183361 112907 -124404 -197756 208010 142827 -245936 314748 200542
15743 200542 -33973 196740 6308 86721 -32892 -158145 -7191 92929 332969 -196703 -136728
15732 -136728 222220 14460 81659 136543 -179457 177761 -89711 -195528 -32538 93877 -12506
15720 -197292 -74014 98474 -307868 43026 -209482 154125 -178528 -180557 -16335 -181482 -129195
15709 -129195 66085 -98830 -117001 -68421 -252409 -377383 95773 -16794 -117351 66048 87208
15698 87208 -38410 -24736 -134649 -50968 31073 -125180 268272 -18319 -87699 121564 60644
15686 -14867 141500 -492084 101490 -89425 103522 -106401 -204885 -245168 -226295 -116268
15676 -116268 -8997 -29294 54937 -34307 126078 134938 103519 153782 -112675 -39084 -19244
15664 139504 -197654 12657 5383 418197 -158865 -26503 -122830 -205255 43821 -50412 -50568
15653 -50568 -22509 258927 -139355 204934 505886 -74368 -308518 -43689 -49211 353973 -207901
15641 -138581 35419 -192937 -388543 164350 -298420 94983 -33469 246230 -34155 -120752
15631 -120752 104673 -114722 -311253 134824 34995 98606 -146395 -50185 117574 184882
15621 184882 146173 67220 11022 -85069 135728 667816 181994 47676 -218901 -170094 -24720
15609 -332393 -479825 226351 -12751 55914 -239755 171439 189711 -44065 -47693 21224 -97032
15597 3066 -87203 17403 138195 -123460 87851 -160351 4234 -138244 -130243 -127035 85356 3740
15584 -89797 -59526 72405 140281 247744 333001 -35371 106074 -23586 43595 -63504 -90984
15573 -90984 -112291 -176030 -22564 -142379 -180951 53591 -97101 -234018 110383 98991 -40405
15561 -52421 -150999 311751 -198813 -81467 -131234 191188 219762 17722 6298 -164885 -519
15549 -174912 -363342 325819 176121 45574 -169781 18966 -62140 -815 314193 -53478 254205
15537 224623 -103542 -64607 494042 105250 -59933 79901 68197 -169944 85812 101765 -77344
15525 -213200 -77451 82359 192160 6991 13353 197195 84144 84864 179004 6092 31715 -108893
15512 -853 103597 -58749 89387 -160689 -69663 -32321 -66360 176309 160570 -196433 243769
15500 -134542 -29078 -193568 -22617 -106961 135734 118139 51835 47140 66838 -31212 -109630
15489 -109630 -91409 52133 50098 -369765 -207431 68828 31145 -70008 -192870 -157123 -55296
15477 40503 236886 -197709 540388 -55310 -362695 254860 -148500 -52237 -174128 109111
15466 173519 297228 110917 -4295 212330 -153443 340646 -289022 48541 -186608 184507
15455 -63976 -88754 -16609 44006 108809 -135329 267002 113421 -234205 -252913 -124334 -293183
15444 -293183 145566 -202011 81927 191651 -107276 -64282 -43348 -451654 -39170 61502
15433 161148 271829 37623 14299 8020 211419 -29384 -38478 47998 5417 -142681 238777
15421 -85381 -61333 -7775 123853 -132095 -13957 -88717 -151616 -140345 -183990 135141 106096
15410 106096 -111277 131618 -52276 -1339 -61048 -68467 62490 52318 221502 -115601 -214084
15399 -214084 483099 286750 259835 143051 -28676 -203370 136795 76813 -284780 -239619
15389 -239619 -47335 273675 -76888 -93791 -7203 316672 35976 -124803 -157717 -37184 -139809
15378 -139809 -362999 95298 -40029 -242195 -15017 -76486 129681 -129882 136118 -137113
15367 -204197 -43705 -43553 -125149 136313 -365840 -225819 -157490 -82965 359162 159117 -49193
15355 41238 -27552 233111 -92658 -248776 -44321 102234 18974 140058 -258493 50090 171348
15344 171348 73628 -312828 139801 -3319 22619 8138 16560 110109 -179694 -88264 -15693
15332 74614 128430 -48515 42870 25172 -315357 -77596 71973 43064 147880 -83677 225909
15320 266267 132997 51635 -80636 53005 -38389 -281612 175563 370229 36881 46865 266002
15309 266002 -29773 -79855 68268 91291 355963 248335 424386 188333 236069 137160 -115041
15297 -364560 112942 224479 409337 -120164 122744 -79344 -217267 -129370 -70068 63411
15286 81544 -98916 149378 105444 -158962 97118 -295897 127609 -11020 -68481 305584 154256
15275 154256 -190669 145050 9867 -90887 128074 -17091 155204 146948 -1197 468697 148036
15263 -12636 206894 111732 127039 -9986 329525 489734 121130 121284 206019 268977 404626
15252 404626 155611 78124 24506 702040 1025840 1234491 1094764 1276209 773665 573051
15242 573051 179139 -216072 188040 -72610 37449 126820 272367 43158 241668 -74646
15231 47552 390098 -329125 85779 159971 -103554 -176570 210940 35033 -138542 152818
15220 -57704 183983 33972 133921 119178 153508 -9079 54216 -5064 -57490 192513 225790 252869
15208 252869 -36240 -14199 -166634 168243 431587 -122128 -163728 -115925 -184660 75582 367747
15197 367747 -146980 -77537 -109421 -107736 -120762 53288 151757 230181 252369 403761 -302827
15185 254565 121495 -59935 -8714 164769 238423 -13860 71320 375293 291056 -367434 -21904
15173 -22694 237580 -11730 -169629 -262664 103480 80802 -108182 126912 -19806 257369
15162 98959 -15851 45838 45208 358782 1729 -184434 258925 27200 -240565 338115 310626
15151 310626 176726 -74899 54597 89363 -162440 -420678 -75037 193729 82723 -236257
15140 187196 159938 -6711 251869 57322 576921 227175 456299 185766 118919 247220
15130 247220 -27879 130608 -177645 82448 73991 -46809 -102470 97486 -39419 287306 364724
15119 364724 14334 187653 390533 99602 -196158 -113968 -229888 191334 -184573 -182602
15109 -182602 64920 165322 201663 283157 258753 77494 331101 276795 164719 338809 263938
15098 263938 161542 494529 212122 -15948 138467 357096 207848 397732 -2991 91458
15087 205495 291828 353160 375654 303100 162669 121813 299035 213172 292221 -4371 338692
15075 125944 53201 237902 300956 59737 210479 90039 272975 277474 322771 -67249 25825
15063 -54280 181150 163743 -125648 233844 -164860 289404 458434 361419 290465 339860
15053 339860 431522 -13755 -24284 164362 498506 2634 -95134 332005 39536 234636 -121606
15041 -179005 198638 240416 129228 391861 253855 202255 321621 154811 -171832 -150039
15031 -150039 297630 271216 79539 285871 459554 113327 205607 304829 156480 302596
15021 302596 -125637 91338 498377 -77937 138305 184204 278493 555023 272038 386684
15011 386684 386791 247530 77527 439090 374422 295817 227980 280307 202315 -57930 5875 108050
14999 108050 312789 364060 145752 280359 172353 -70440 232827 259663 455517 330656
14989 330656 126008 336173 168823 71652 251529 149308 254307 -71597 503247 327321
14979 327321 140399 -87022 232002 182501 353069 146304 117763 621005 365741 248893
14969 248893 378608 70292 489301 207318 456678 -1756 123936 562677 169023 410568
14959 410568 132837 380671 554613 220129 141891 424213 135171 251111 350299 290714
14949 290714 458300 56669 79650 502347 126021 -108497 443164 205126 285582 427046
14939 427046 157663 502453 176082 68542 179156 328033 13249 177710 309914 302051
14929 302051 360759 637569 328290 231711 335214 408127 262313 549408 359272 248539
14919 248539 368586 12231 337893 272593 128901 416010 282477 291256 371113 441535 300346
14908 300346 367922 607557 518607 225588 275905 233795 106729 158345 508234 647962
14898 647962 237818 267572 260255 638946 637799 32088 219370 285020 297745 408031 456486
14887 456486 309594 182815 474510 308342 344395 656297 354525 811294 453443 227728
14877 227728 346302 315048 548829 554755 554119 328356 372709 582467 335717 148555 358915
14866 358915 355549 490664 528547 345300 295757 639893 289125 295763 550168 249708 435431
14855 435431 339623 493961 699277 449888 464815 262196 690896 383808 516791 257943
14844 764957 66314 660470 428129 584586 327395 453107 385674 395459 344719 311573 683355
14833 683355 578768 146513 574229 602870 468479 304349 323652 668302 517224 478583
14823 478583 227596 422619 867211 242288 287789 673108 659358 543804 650933 719005
14813 719005 283892 542000 571740 722508 500957 667815 748927 458615 906429 574027
14803 574027 577448 584347 818283 577012 661960 600512 614268 521360 794984 355217 712061
14792 712061 436776 443351 733214 692070 281130 435431 417512 596391 612075 917368
14782 917368 820994 617796 515085 829274 520221 546617 817257 660421 463211 838826
14772 838826 596099 751494 854893 502192 537601 572458 679336 856287 463083 376519
14762 376519 565022 574159 690403 696724 640691 539229 697255 689279 389848 750112 1107123
14751 1107123 533734 869315 769865 786355 866953 666936 431361 450681 805177 590560
14741 590560 831094 661849 454538 669390 922896 704024 647335 1157234 902461 766575
14731 766575 614751 999397 1060219 960381 880988 536451 718883 735715 1026517 823643
14721 823643 999209 722974 893147 464134 998528 1075630 826425 604887 642462 1299901
14711 1299901 981039 897383 723708 957104 698438 909198 651522 1051452 936414 723697
14701 723697 905304 983718 1069842 1140704 895233 975707 768342 960813 791993 882404
14691 882404 964055 829717 834017 1317562 1003206 1184029 1022366 715596 787143 1068911
14681 1068911 769649 889941 1369277 1043621 1577391 1293046 1253755 1207926 959317 1074308
14671 1074308 1059899 1420604 900384 1049003 1143524 1009502 1290231 1182513 1184488 1092505
14661 1092505 1244383 1262112 1036859 1181326 1109055 1122194 973387 1036190 907820 1049841
14651 1049841 940217 1058725 1200546 1093871 1255840 1313765 1326637 1413585 1309120 1431454
14641 1431454 1311042 1555280 1469257 1413118 1345714 1260013 1590365 1262309 1606240 1564189
14631 1564189 1414274 1553309 1130556 1501103 1396900 1418624 1466944 1258873 1592463 1504466
14621 1504466 1550557 1796260 1680885 1527640 1384856 1369025 1699952 1688674 1653791 1631355
14611 1631355 1450987 1825448 1306089 1765081 1466353 1806098 1570265 1847333 1806866 1643793
14601 1643793 1631226 1844986 1932506 1522399 2067208 1722004 2052356 1671330 1590388 2033866
14591 2033866 1776022 1779635 1679248 2037638 1888785 1767853 1871363 2128030 2149966 2114251
14581 2114251 1925944 2241561 2027907 2250429 2496887 2241948 2146087 2242666 2254365 2163650
14571 2163650 2043707 2419805 2379420 2521926 2219090 2307152 2656996 2694851 2527996 2574950
14561 2574950 2569332 2785423 3029107 2874572 3221725 3054523 3550528 3422608 4015538 4374407
14551 4374407 4985881 6165590 8128407 12993680 22261470 34267509 41263259 25067036
14543 25067036 13686810 6069364 3742404 2454595 2649086 2297517 2118541 2230287
14535 2230287 2377866 2109760 2421360 2286487 2300199 2156829 2815013 2311540 2852556 2747070
14525 2747070 2396439 2837453 2518027 2749693 2787049 2671440 2371010 2714007 2555131 2613176
14515 2613176 2577125 3119245 2750705 2801869 3240288 2812789 2949312 3071873 2962367 3093685
14505 3093685 3234167 3493142 3315056 3160333 3206449 3487936 3381254 2953346 3272338 3331413
14495 3331413 3528386 3599509 3489541 3542942 3547099 3527314 3426016 3881786 3701684 3674030
14485 3674030 4040932 4059738 3904739 3880278 3957194 4145072 3930348 4204647 3974232 4010602
14475 4010602 4200198 4081576 4308114 4133948 4692258 4572161 4342935 4487159 4485122 4578502
14465 4578502 4638602 4568338 4574134 4971044 4695270 5418622 4675246 5024568 5165441 4949020
14455 4949020 5194426 5349217 5399898 5274920 5441590 5405344 5448521 5643670 5771139 5952972
14445 5952972 5815277 5873684 6114495 6217992 6155351 6182267 6567776 6725636 6790435 6388512
14435 6388512 6845642 6757939 7052074 6858383 6931804 7543797 7439861 7409660 7879371 7162596
14425 7162596 7591178 7507598 7809158 8219320 8301503 7973635 8525882 8561834 8424510 8744467
14415 8744467 8931752 8904063 9524228 9208972 9309275 9598816 9322157 9548307 10314852 10123871
14405 10123871 10164459 10441786 10375809 10650847 10658829 11031117 11226150 11428661 11634050 11742094
14395 11742094 11963198 12049954 12325394 12817500 12553462 12657254 13197330 13491583 13531976 13980992
14385 13980992 14016291 14434507 14739528 14513448 15246541 15375989 15786925 15989264 16332430
14376 16332430 16471770 16632352 17142673 17541091 17750839 18321992 18612993 18805222 19371248
14367 19371248 19904162 20061676 20305619 20937869 21600652 21597271 22476111 22550346 23180853 23803195
14357 23803195 24350363 24605344 25707259 26085086 26657280 27249001 27667537 28410620 29452884
14348 29452884 29928312 30535139 31263780 32285588 32744628 33998357 34701990 35976590 36369984
14339 36369984 37573622 38604349 40085913 40895298 42066229 43025515 44692680 45670789
14331 45670789 47233293 48757805 50422475 52018553 53433265 55046554 56757878 58592978
14323 58592978 60639994 62613578 64812777 67422267 69545484 72098239 74513127 77822068
14315 77822068 80317613 83506083 87039620 90396755 93785108 97837520 101924860 105904008
14307 105904008 110449488 115516170 120032251 125403458 130968205 136918901 143517009 150067788
14299 150067788 157125053 164427682 172465095 180826276 189495329 198798065 208863128 219041259
14291 219041259 230310661 241582964 253269067 265835525 278835854 292257090 306076528
14284 306076528 319782987 334160631 348435901 362871868 377070089 390742818 403874592
14277 403874592 416719561 428000088 438479233 446655328 451600723 452328210 450047060 449703594
14269 449703594 451608344 448673995 444853039 442008361 436173314 427351557 416677565 404679711
14261 404679711 391592580 377528608 362962479 348188933 332968198 318122418 303538809
14254 303538809 289985193 276482299 263248735 250577227 238474092 226918093 216154722
14247 216154722 205421206 195522292 186546174 178017991 169957819 161751088 154391104 147425384
14239 147425384 141009286 135153562 129192992 123904986 118493804 113481252 108901877 104365324
14231 104365324 100386136 96737600 92555120 89223197 86115653 82327358 79338731 76584436
14223 76584436 73915381 70848074 68833574 66588790 64324412 61903160 60047495 58051416
14215 58051416 56253829 54627777 52976744 51527048 49379450 48189826 46835861 45557231
14207 45557231 44595550 43548423 42151578 40756151 39538325 38630539 37895950 36967312 35832793
14198 35832793 34672069 33552760 33039752 32203320 31541140 30732586 29623716 29172341 28428062
14189 28428062 27737113 27133875 26496727 25498654 25351259 24671721 24370568 23675024 23028917
14180 23028917 22922969 22314342 22202986 21241514 20571363 20632223 20376447 19601467 19102646
14171 19102646 18748264 18617679 17971962 17638848 17252558 17242219 16736407 16659011 16258777 15981749
14161 15981749 15594640 15158439 14833026 14813287 14392907 13725556 14195513 13724662 13801720 13281349
14151 13281349 13090028 12781137 12805829 12212555 12202852 12070866 11720871 11455100 11452130 11396780
14141 11396780 11462774 11279699 10770553 10498204 10500920 10198673 10194018 10474332 9869321 9520825
14131 9520825 9800085 9255662 9496071 9270029 9146140 8860970 8873807 8535696 8888798 8442488
14121 8442488 8261981 8727535 8299512 8182793 8215396 7568948 8028652 7460697 7267568 7535549
14111 7535549 7346176 7313860 7006963 7061704 7173314 6733459 6818866 6863412 6596695 6540666
14101 6540666 6528672 6486488 6413445 6432728 6043648 6120108 6223315 5929603 6184672 6120361
14091 6120361 5702555 6046560 5983896 5748319 5702866 5744663 5511520 5478045 5528864 5409062
14081 5409062 5423577 5004846 5255889 5033717 5055607 4925506 5151657 5071476 4788169 4795135
14071 4795135 4606089 4473068 4819139 4530455 4573377 4495940 4319721 4256894 4354535 4340676
14061 4340676 4150758 4651321 4441629 4431428 4106942 4324257 4239378 4020345 3812016 4125491
14051 4125491 3991899 3696696 3734601 3971161 3644761 3525054 3808343 3357309 3770419 3852815
14041 3852815 3618554 3353202 3328837 3082311 3256375 3104955 3253443 3535539 2968503 3791175
14031 3791175 3477997 3335616 3275519 3098344 3317465 3016957 3029376 2666454 2731645 2918020
14021 2918020 2818100 2866615 2691548 2995412 2841842 2345464 2710569 2750330 2535945 2963884
14011 2963884 2371248 2702788 2302109 2388568 2393892 2404599 2287829 2578772 2452648 2197415
14001 2197415 2189145 2134721 2286009 2332542 2112764 1884457 2246370 2104552 2166074 2364752
13991 2364752 2695315 3070173 4107347 7220152 15805675 28538897 40838089 28815099
13983 28815099 17132944 10044221 6525614 5079549 4021709 3650802 3518225 3651806
13975 3651806 3255757 2839914 3028507 2716859 2856870 2685214 2845929 2213735 2443145
13966 2443145 2413155 2572477 2414233 2559429 2163416 2418607 1893495 2169473 2006299 2355563
13956 2355563 2240361 2078640 2430297 2256171 1843129 2280938 1922336 2004454 2063218 2290975
13946 2290975 1978102 1991310 1849783 1964880 1867829 1865169 1830805 1569929 2139037 1589286
13936 1589286 1904398 1802786 1866569 1582821 1952509 1541851 1597903 1474742 1799082 1753272
13926 1753272 1581233 1836102 1381034 1573470 1618498 1902080 1599306 2104836 1568962 1674646
13916 1674646 1456516 1694430 1577943 1477629 1510068 1710597 1503162 1627819 1383787 1728496
13906 1728496 1427342 1332146 1414893 1539164 1492468 1171205 1524797 1626397 1497779 1092503
13896 1092503 1191276 1410642 1451833 1169341 1230605 1438264 1284288 1447750 1221296 1343356
13886 1343356 1445297 1255819 1091685 1310991 1309649 1002713 1398332 1469780 1256599 1384071
13876 1384071 1345744 1150847 1417868 975548 1501591 1332939 1481728 1416253 1130764 1047026
13866 1047026 1280205 1276020 1057122 1084951 1017171 1170982 1136647 1185923 1084925 905220
13856 905220 980162 1152268 1187179 1514323 945495 1072673 1195505 1202987 1034099 1339334
13846 1339334 857124 1507992 593058 1171384 1051769 860384 999301 1280750 985618
13837 985618 1056478 866856 1020647 1029670 754176 1060757 1071775 849766 1063477 868629
13827 868629 1078130 978550 838974 812144 809553 905014 1057486 740731 1380322 797621
13817 797621 607202 1058784 832484 898381 689759 897425 877453 1070145 813414 1147818
13807 1147818 812360 973262 1049323 1095980 711462 837023 902778 908324 627672 1096967
13797 1096967 648234 1093783 685047 348066 871914 945541 858040 546980 834356 703278
13787 703278 631319 775725 782270 661600 601186 472477 1094027 887756 767810 837910
13777 837910 616548 733287 622504 706955 809189 503262 635203 932049 870571 744592
13767 744592 773679 732867 338828 853713 746320 638936 842171 758792 930592 532149
13757 532149 851384 738370 937905 774904 397248 592308 829649 484723 463084 824877
13747 824877 775789 816149 378112 572511 499920 689385 487259 652958 751928 541492
13737 541492 777258 732393 285711 695884 645307 571433 439499 798546 419561 668522
13727 668522 803316 623135 658799 744283 519418 870890 312935 479664 701232 542815
13717 542815 540919 720728 486308 341637 519861 482952 348260 629183 885061 774121
13707 774121 469377 248909 482620 521593 528969 545185 493202 663183 505594 569083 824210
13696 824210 656958 634491 709725 449256 469262 711688 616779 821621 496380 648067
13686 648067 367226 485713 594166 498612 580834 174146 580889 525274 586061 697057
13676 697057 411861 741087 669173 611510 678280 558006 365693 115217 602528 572408
13666 572408 238844 329326 465853 486496 408375 663213 207075 789220 303140 452970
13656 452970 378579 720685 487271 637113 452494 950466 449370 254202 695349 668185
13646 668185 516300 378069 423549 388227 593627 531647 656247 730569 156221 309337
13636 309337 547936 349468 78350 459219 483515 289811 562392 159173 458960 405790
13626 405790 384877 610985 236776 591331 231629 268613 394312 298091 303303 405748
13616 405748 424567 413671 207056 230450 126463 544666 607351 634065 186891 433515
13606 433515 322062 268311 397124 211708 357731 385567 182084 374509 544036 623730
13596 623730 180673 586700 188098 162448 315126 409942 361233 406344 443153 323748
13586 323748 428073 137377 384894 541372 432657 209203 202393 403480 399501 506360
13576 506360 468930 454201 193240 59417 279953 422946 510339 9743 301785 241667 323340
13565 323340 560013 123003 314885 595272 483832 625578 392544 128498 170695 484948
13555 484948 317461 441886 496107 421019 451379 401117 482730 422845 554492 243235 243551
13544 243551 148825 114973 269888 277398 448593 512711 630331 350065 358902 463625 301914
13533 301914 108622 518399 519021 516429 182722 327637 -28479 616156 353706 451321 -228883
13521 220662 206518 105119 294072 103052 398491 100041 239785 75006 250070 548738
13511 548738 44983 233738 172675 -153755 236822 442440 450524 392707 161395 -15109 166698
13499 54573 390130 447951 747426 9814 206811 453792 139397 84569 142874 177605 197674
13488 197674 -3660 109832 148461 225308 384394 315254 349950 114901 152947 540996 377014
13477 377014 318222 396685 76688 413171 282289 493464 374800 303943 173383 316659
13467 316659 413653 364083 496021 423491 491411 217064 113820 178750 255478 516326 203073
13455 108022 369396 225195 214849 -52732 156271 106085 4318 102948 -144625 205671 27459
13443 311340 31365 -37501 23255 295699 150024 301220 420427 215 522179 17445 167534
13432 167534 106643 164351 -105406 42938 145505 325089 301557 592301 -102113 272745
13421 170380 168740 173516 -2173 -33624 433207 257469 -16370 322852 541116 90285 135237
13410 135237 429260 256670 -126746 399257 107494 266158 27530 127506 393393 127477
13399 575633 436982 -114939 116597 194195 59239 530115 248364 150313 239025 215061
13389 215061 335752 107446 154331 338520 163381 176050 207126 340108 463837 495815
13379 495815 448670 20733 -61920 223941 60209 186905 130397 260995 145760 175362 240951
13368 240951 429866 173020 486420 398651 89501 297252 336104 251630 456892 257592
13358 257592 33660 575179 177457 -26171 495260 398507 -115805 606605 736240 191598
13347 236354 180084 349944 194175 167686 276530 415611 147993 163251 80030 160476
13337 160476 536959 16332 -17111 -13622 442080 254392 151705 -122757 216247 276134
13327 276134 128753 245993 352173 223857 168332 192879 98709 422517 309031 265433
13317 265433 151351 485227 421625 294937 283241 134850 256651 153729 4528 249197
13307 249197 123863 -11313 700492 408174 -124528 289164 29766 48971 -47907 -40258 220929
13295 -10293 -14579 117460 276834 528660 318312 -30163 234946 147613 330241 469866
13285 469866 376998 339256 108493 127072 595284 -68888 43432 204099 110973 159196 84023
13274 84023 155437 208267 -33760 136394 56521 24009 -29784 108658 -35121 352620 -144848
13262 -11036 -80132 289266 -26218 -149505 -143683 231015 72243 -23287 6959 118819 245071
13251 245071 392771 279329 257297 337651 289854 -209580 270343 44426 -100634 213061
13240 10349 103069 26068 -349262 -194901 264332 174614 171827 97271 -120379 -199562 199505
13228 261147 479344 423329 -38067 189371 324927 364902 202835 73605 -285484 171258
13217 -203771 166384 -230065 265729 298772 125876 103317 81569 -114075 -95778 149994
13206 154528 -229317 403338 80707 -22354 167719 471723 -214458 86183 76254 475363
13196 475363 -1820 -51462 743724 184128 -108103 196801 179989 306539 -53583 63052 114991
13185 114991 23466 312257 24876 287546 174666 67145 180991 151179 -106813 135421
13174 95968 448175 214640 139941 366114 86011 220713 -176794 139808 -151292 -110189
13164 -110189 233906 213200 248851 189257 184514 -392087 39119 62073 -48649 374402 -101414
13152 245921 -662 75580 -50748 -133693 19212 125388 -231421 -184845 128745 -97918 -77208
13141 -77208 148824 570467 78649 53820 161888 -41299 -38763 9049 85122 -120756 145625
13129 108130 189533 134682 68228 -257047 -9896 -25140 252172 -415272 -38527 397949 230315
13118 230315 -34920 157252 -26075 157860 31378 -204696 523137 474641 -59373 253791
13107 -135098 96788 215416 -36399 38457 289484 -7005 266533 212038 -40863 431970 200925
13095 136877 -373550 241554 279256 573080 -7190 16446 122059 181788 -120520 184158
13084 27382 106923 120563 121607 -52785 -111256 -73814 97245 -145288 30592 306495 352452
13073 352452 -407400 214655 127207 169096 398424 -135154 32346 -117651 165290 168269
13063 168269 371316 -5051 -141338 138791 307224 210110 -7490 224651 55640 -25380 78637
13051 197421 -145472 100106 380205 -86776 254354 217233 -12138 92936 28676 124230 -191382
13039 -30085 219261 39658 -16150 -273183 239315 327529 320859 292980 82581 237639 -72085
13027 -170166 399605 258403 50480 38744 160373 -8186 107139 -68623 171912 325827
13017 325827 250809 -93176 1083 25428 98872 93379 371452 -289410 148658 130283 40399
13005 -15846 140858 148998 377072 252021 289004 -161048 252579 108503 179835 -18735 65857
12993 -45254 313861 276723 266224 65892 -85126 -140400 46969 -136640 -247506 156497 7665
12981 230750 -49309 -70644 -201636 104409 -120810 -122669 328530 -218665 17130 172144
12971 172144 27455 -24590 -47321 -136620 -49412 140917 -37967 3267 747 -111246 128897
12959 475453 139420 -105547 -151271 -280954 114501 -121289 70182 120997 -45418 -342301
12949 -342301 136950 -179532 69248 -247432 42057 256436 98190 -19185 90476 -36528 -263558
12938 -263558 -144673 133758 73035 -93742 -118854 22081 281933 -752 -230877 379140 -2044
12926 90192 -195404 103803 3750 348466 -205760 -62 -102620 -73769 -197719 323594 122025
12914 -150316 -127436 196664 -170421 -25204 30447 -30826 40061 2174 -39977 -106662 180181
12902 175170 -266564 -308222 29366 207148 -443 60092 -5622 -234731 51008 -146454 -188742
12891 -188742 65569 -128350 -82792 -76925 318728 84749 -51831 39755 155254 -31068 -134221
12880 -134221 -59702 192917 -124070 -13643 -243565 202192 64098 -72580 65021 28691 -79766
12868 221325 27971 -148471 44301 -44737 -12544 55658 5440 234880 8093 -115352 62335
12856 52321 210845 67088 167485 219617 167734 -21008 194378 186271 -86924 300611 232570
12845 232570 190365 -52001 45063 27772 73021 217147 15217 -170906 -156914 298679 -288321
12833 -5565 67051 33252 -182713 201365 -197372 -18251 -146465 126789 305215 15268 89936
12822 89936 185930 106914 335784 -103291 323838 35559 -54533 29005 -44474 412371 -159847
12810 70275 66166 -56944 -271753 112811 55655 250546 110710 100102 -335869 -135055 -150702
12799 -150702 -39169 -87517 193416 244825 49552 122776 274242 -117631 240943 -161220
12788 -9049 -82371 -25601 -217118 -102674 -101123 -301058 41866 -80567 157991 -267341 -228902
12777 -228902 -221947 -51465 38166 207710 99101 -4932 46464 -201761 21555 -43110 -201474
12766 -201474 -26429 -48185 -4119 84709 323455 381986 59707 -170205 51947 228835 -66192
12754 -197609 -160409 -65198 21933 -73847 59043 89292 164508 271810 -101738 374175 252283
12743 252283 -47093 -348562 -14151 -49726 23897 -48682 13610 88137 264394 275755 53118
12731 216131 131936 71832 155323 46340 -33813 125485 47372 -51454 -287064 24059 -270296
12719 270456 -126100 250319 330717 68719 219099 195824 262599 23996 -228568 16600 86748
12708 86748 314382 -12404 143642 260960 287248 401987 457589 213870 408729 288476
12698 288476 -43190 146680 -18401 245207 122805 -179703 -106778 -12071 144242 42985
12687 -192963 -188216 202726 49334 170855 439569 299242 -173919 -85160 460920 -91368
12676 -353272 33337 95689 161113 75174 -6746 -65331 295520 -14269 12646 13088 143829 -38793
12663 402580 -218618 195490 173540 260482 93151 242171 -60815 -354403 137497 81547
12653 81547 135352 256349 187793 -137922 -51302 134261 126113 -146338 52052 138282 37313
12641 297155 -340397 -52474 -99083 111682 144936 101289 211254 27789 240877 42147 39641
12630 39641 55005 107384 389503 195977 369770 223237 145581 306450 247245 398128
12620 398128 233961 271637 61156 377596 50187 -46881 55291 112136 -28343 69752 120685
12609 120685 43909 135932 -119583 54653 -90723 157917 -469409 -172407 197479 -284638
12598 -126411 -127776 204821 -17659 181230 148748 -84394 86736 310258 282409 -54271 32266
12586 -96513 245501 -157097 -18873 41913 7909 105734 -358974 118646 -244188 180391 -241526
12574 -136578 102917 207938 113337 -122063 10456 -36475 112255 21865 182353 186067 192191
12563 192191 -4388 394265 -224952 180948 279449 208737 -55582 334102 -125971 -51154 -113489
12552 -113489 240755 18850 -86601 411301 75229 -52907 93534 98876 130693 73356 363954
12541 363954 99916 23815 258248 -283201 -44334 101289 -184767 -56807 -33398 -23843 45767
12529 19833 -15950 90368 -80768 -113937 -181122 -66172 27349 -115710 -116692 161338 -46707 122489
12516 -204306 -76932 2493 295367 -187597 -434262 -109234 -51182 282587 152226 -199550
12505 265179 67575 116828 -21038 19408 -126244 -61460 41387 -139474 -252381 156913 21095
12493 -31735 72236 60754 -42438 35946 129125 39247 -136988 252385 144463 -124761 -123496
12482 -123496 -172666 -102260 -6661 -154476 -47350 -102888 -32150 148630 -185776 55783 -3563
12470 -230113 152480 -31791 -16006 49075 -397783 70668 -181984 205610 183329 181978 129824
12459 129824 353872 80058 228844 97640 -48743 27553 -208637 68668 318549 -312895
12448 120260 68693 -29569 -171823 -199101 -20163 -76890 118584 -39484 65965 432414 -65373
12436 111677 -39354 140382 -125865 241889 -168950 78005 -53765 42872 -41308 27777 196192
12425 196192 389885 14741 74046 166394 59682 -140292 -60095 246194 -78481 81970 277721
12414 277721 -15913 -96191 -82766 -8807 -26267 66626 -199244 134489 16067 104657 -459850
12402 11226 -274507 -169477 288036 334208 112849 -167461 176445 222300 -114540 -394095
12392 -394095 -253942 166884 -202165 -15055 237860 -126207 -134272 -207745 -163856 -69567 -71883
12381 -71883 -451899 85054 -28495 66219 141840 127340 -51056 113143 -47690 66043 63492
12370 63492 193206 33620 7884 199583 -302243 -50815 -192517 48656 204633 152046 153681
12359 153681 -128864 -160425 -22200 104403 226625 -273891 -6160 136796 -19716 42231 324548
12348 324548 165692 77728 -133716 26064 -173839 14555 127688 329558 -70699 57064
12337 -244590 -60328 61119 -254291 -167052 334074 -1290 172805 140972 -317503 -57518 341322
12325 -298520 240904 122605 -144365 -104015 -163305 -99353 -120535 -199446 199827 -88199 -110051
12314 -110051 229045 222674 -205708 230388 76823 149035 -297568 110771 -206862 -244267
12304 -244267 195958 241492 -181423 10477 -301051 -178633 -75650 246639 58742 288088
12294 288088 -18377 -140681 -67747 153047 149486 -27677 97243 -72323 241917 245425 90691
12282 35173 96356 260087 108303 42387 261990 10981 206914 -133441 27310 273665
12272 273665 299765 -103680 219179 -147546 -108582 132621 350447 -396817 282094 -161008
12261 -205432 233474 -85208 250371 236316 -28490 -84306 -105101 154224 235624 -21494 -229003
12250 -229003 -55131 -30699 -105361 -175324 285748 26220 -63061 95597 104269 159030 -125972
12238 166719 -161544 136792 146526 127898 358547 83413 -134766 -101077 -61542 269943 604008
12227 604008 218984 -114886 260951 -172121 219540 261588 309717 88842 299092 664231
12217 664231 375539 -64385 -51113 193584 -127070 375317 155612 -11375 283696 427213
12207 427213 53320 7691 550927 158296 375575 21970 173212 71611 -171820 287476
12196 224788 47247 60502 352312 110533 233593 100023 409973 281986 -309577 89734
12185 218326 -182553 136705 223470 -31092 167855 44132 222507 309191 182195 220125
12175 220125 236753 162955 422577 12649 21322 370409 -41933 4790 -83290 296607 112658
12163 -54386 -41671 4611 -185073 4841 168879 247719 109080 126567 -125101 281755 6875
12151 -38741 34143 119197 129778 226158 -208340 662 261325 -128658 247835 386253 -90562
12139 29297 410622 -223569 223720 -184691 3020 311650 -81007 159194 -96340 -199571
12129 -199571 89570 53184 -172305 93550 19695 56830 165239 -32277 -173382 5718 -72646
12117 -99771 -194230 394064 -274801 -186238 -198599 117007 -96566 242316 12308 165359 153990
12106 153990 -200700 -187536 -13408 -106748 23106 -28760 -205397 297278 -148175 -81708 38901
12094 -429997 71124 -864 -249902 69138 45484 112453 -12568 154178 -9598 -10494 229479 -295877
12081 -279465 -92009 -260520 374819 122693 822137 1385680 1356655 318064 177297 222953
12071 222953 -81885 32696 30765 -115633 -869 -161533 -72740 67632 105546 153394 -80309 -23924
12058 137258 21480 -299112 149301 264546 -18105 -160569 63188 -97194 -53561 -342630
12048 -342630 439148 -190992 174739 -182902 138034 -79953 -229783 -176923 -85457 -127725
12038 -127725 -221159 40144 -272771 -284826 38964 38957 -142431 -44310 -168103 136649 20504
12026 -175770 74309 -245289 83854 21243 -105253 104683 -27202 360474 -69320 312450
12015 9067 212682 -208556 13949 -56531 188453 -166685 -226818 -269737 209288 -149940 -44351
12003 886 -11255 17671 -252397 -72327 -156821 40609 84169 -138230 -195572 245312 44568
11991 259888 -375740 193307 16733 93120 -215254 -47962 -48057 -246641 -100094 -1428 264360
11979 -91862 213438 -235129 19542 -237134 56732 -59761 -82836 -30257 -230880 152779 39053
11967 -18830 -140916 -224751 257195 -391748 -27771 -127236 211145 194487 -3532 -208913 3157
11955 95954 71556 100285 164217 123377 -20902 21267 109374 -9784 -16029 331233 -110963 29353
11942 -19437 55379 -95919 79541 -360976 -147396 231082 20441 63985 -263897 220481 195134
11931 195134 -2659 -126036 -118965 -76521 -430856 -300660 115525 -383061 39967 140866 893
11919 -36413 166199 -274434 -134553 268158 -126183 -172202 -108272 99933 -282694 -386760
11909 -386760 -173123 -202037 -179541 252806 107296 -30821 128646 -323970 357051 -242673
11898 14244 -16537 -247279 72551 -158213 -178856 -223834 -26411 83978 -189009 81405 -34476
11886 34919 -139671 -175509 16171 -29358 -94011 21420 227495 -315756 -110126 27764 -184018
11874 49561 -275410 125172 -26826 -84989 2669 -405474 -100322 -204203 -194098 345029 60178
11862 93462 -35472 28933 -119493 -142777 61974 -195086 360374 -84160 114302 92775 -191946
11850 -69185 -104341 366759 232268 294438 -271378 193330 -59013 150853 -298409 253896
11839 90222 -48777 141356 -208860 141833 -61633 353225 401551 28189 321794 -77648 -260708
11828 -260708 20193 284800 88224 -29440 -13097 164570 -48419 -53696 119967 -63790 248888
11816 38243 122227 -287001 2890 -68606 -271313 -138279 -51639 -118404 -3473 65023 194941
11805 194941 -174098 -74004 -73944 -155211 -13748 104522 223347 -1837 -230762 -142002 192113
11793 -145425 158232 418999 -396701 171631 49911 -115730 182218 -8439 133479 39156
11782 -250948 4693 -81211 114368 -285683 225142 179679 24830 -185185 107240 31147 34568
11771 34568 -65721 330955 -88701 -179858 -140808 -465720 -237635 14820 260303 -222048 -159259
11760 -159259 56755 -170567 156628 264562 -28223 187788 -290619 51804 200040 122929
11750 122929 -323600 264035 -114197 -118080 -9639 -39134 9162 -145749 -145693 265193 -88034 -91836
11738 -91836 15980 -236216 -173905 -231620 58988 145309 81250 159546 215230 49464 -15569
11726 -154366 47136 -213811 -97267 -52000 -36838 -358302 209698 181802 -20744 124302 152768
11715 152768 -234977 -472848 160763 182385 61463 -15582 281668 -8998 1375 75210 -82127
11703 221988 381679 -156649 -141136 -122712 129665 57054 158768 160244 -60836 -83253 161311
11691 348789 -111671 210826 316455 -115111 61195 -118251 58950 299363 50318 22261
11680 78153 411607 200806 63804 470693 101161 -152968 260806 -114824 -133304 -78837
11670 -78837 -13782 -279357 2931 78360 119480 -176244 36084 -53240 94796 283029 168234
11659 168234 -30798 356637 -248738 243608 -72561 186087 158267 -336748 -12341 152824
11648 -231094 110620 -23267 225716 200221 3579 41964 19867 145385 -247959 -31298 173006
11636 -269263 -119807 -19605 -273415 -24993 310997 60125 64596 40255 29833 81874 323500
11625 323500 129475 131057 -146733 358222 402949 34737 344625 -5781 77706 317188 -266965
11613 -47724 -3947 14133 247752 -320403 167842 4774 -83282 90556 -109039 -57707 -12364
11601 129266 404328 252335 -207949 43390 70353 -39690 4796 111871 -44061 -238116 55436
11589 -143656 111678 -58973 55061 284325 346893 187967 -69836 402089 179392 -80075
11578 46684 -163435 -382277 -143484 72854 -7512 -156763 144141 126001 -180498 -17792 235547
11566 -60232 123587 68391 422529 309883 -147811 84846 80752 68934 141580 -239143 102079
11554 180575 39060 250803 51830 134539 110424 -126562 -96041 119987 -157272 214318
11543 -134866 140728 -1989 418067 -13796 -78791 85964 182709 -109414 87709 155304 108734
11532 108734 -27263 -353469 -69071 -284244 -123971 153833 72049 151877 240164 217962 105938
11520 24436 -85338 56490 286729 -23711 -129375 18001 243611 434844 242229 357333
11510 357333 -235520 269239 -19616 -23319 264116 182936 18671 77128 236585 -283391 60836
11498 273912 48301 315490 -124392 294037 94530 185962 47363 -86850 471213 107531
11487 23626 118448 273558 534536 -128205 2445 362028 77824 226692 69436 261633 262637
11476 262637 25117 236056 166931 165799 -264565 32479 15889 40612 389132 111020 -1309
11464 146920 128267 -171184 468621 99100 -43842 48658 118206 207679 366542 163939 -63637
11452 87611 -85089 -366703 -105357 -204889 317401 -16518 160013 67598 -193567 -28915 -39396
11441 -39396 145501 283157 165586 -83615 43307 296287 3197 -114252 169094 79718 -55682
11429 -224538 166455 -254472 80254 -53918 2499 -41516 100120 -246465 9948 43582 167770
11418 167770 -9091 -181658 384536 -10067 -119211 125985 -76879 206464 -440840 -350515
11408 -350515 244539 127264 263643 54059 -216193 -228263 314250 248278 -123760 20424
11397 -19511 -97640 312694 228640 -68633 121757 227948 98921 16395 -372404 51068 236850
11386 236850 -63802 -246769 10078 -29410 3408 2553 -153877 95029 2282 -95082 171776 106858
11374 106858 -45086 272378 87757 -20860 237217 -184076 -36122 246088 266927 -46373 10781
11362 136733 -34032 -216461 -21986 -274743 12559 -166038 217760 -238812 -11558 -38987
11352 -38987 -108109 233047 411343 89988 -78201 -101200 102160 313730 -440063 77256 -28513
11340 -22972 -83998 167489 9527 149211 101654 101018 -31850 67295 -45264 320512 -204885
11328 -109886 -79777 -72706 -21360 -100881 124341 156453 -321778 -373315 85206 -23360 -43058
11317 -43058 78313 -408802 43552 -210396 8586 -241066 -75424 -112542 -161610 -292177 -47989
11305 -150490 -344662 -48801 321196 11593 -134890 281558 315268 -214589 219608 -105792
11294 241310 -117608 3702 -296386 58850 153665 74850 26648 -121967 -313285 -1256 158094
11282 -25571 -591225 -5749 259304 52589 75792 -47700 -365843 -15443 151840 121619 -46313
11270 -115651 -346344 113699 43310 -76908 175766 -4376 -303898 123773 -155569 -318040
11260 -318040 -60767 -465509 -182676 -231842 -75530 -238407 219975 -59445 -351110 20013
11249 -8167 28980 -224816 -159199 -67415 109000 -91025 94959 -161633 2869 -117040 -203419
11238 -203419 -67429 -6413 -22070 332518 -305994 -26064 -150705 -139665 -268629 315139 164995
11227 164995 164403 15853 -60501 483045 -27613 -114365 156570 -249570 -181672 234421 144338
11216 144338 -132700 139285 119329 -4074 -352403 -21634 24762 217065 -46354 -111615 133367
11204 37488 29202 -71367 227753 -65619 -64823 16398 148965 -224528 -265561 161315 -165069
11192 122068 52660 18427 -202645 -35921 -132536 -110679 -138387 236917 -219422 -256064 -128622
11181 -128622 -26389 -115261 -130215 -34428 179546 -414946 -290130 30363 -113575 -194497 -5206
11169 -15524 146217 72543 162396 -68596 5960 -131005 -11893 75458 -97405 35002 276015
11158 276015 90549 -320584 -76447 -353095 506518 56613 260488 1183 105540 100073 -154448
11146 134800 72654 108374 -325156 -94083 220087 140762 -280769 23031 -32883 4180 165873
11135 165873 -175749 47858 124775 129567 -162105 -222285 -166206 -13266 -57055 -154384 -18533
11123 72101 339584 21717 -112713 -81403 -148324 -2017 371944 76986 -43905 -20415 185588
11111 228122 59470 185807 462141 255465 59862 36381 154472 351177 -14619 23301
11100 207007 -20908 450087 47007 183955 63067 110974 520351 9824 14360 225726 273325
11089 273325 273266 185350 331372 185582 -389216 414719 -66342 31455 266327 333391 131884
11077 201179 67271 289714 19075 455553 -16477 312151 297977 415306 619316 315260
11067 315260 245847 441611 433389 260986 183815 494990 189957 111456 436719 431458 450699
11056 450699 664326 651446 715530 445674 491725 872900 422288 882377 619160 815498
11046 815498 748312 564053 957671 708706 502035 417668 857539 327260 1098260 789539
11036 789539 625625 634174 562520 1088812 858100 840437 905189 686822 563819 555302 374453
11025 374453 406921 438954 455630 599311 608120 370053 602982 722949 516605 556577 378328
11014 378328 763174 790699 445178 514525 461144 376010 663440 480546 768326 953728
11004 953728 571111 511889 858468 696172 851468 607118 670578 818798 739792 335828
10993 338386 798754 824499 798279 704853 1006266 722332 749806 865703 1092236 1001054
10983 1001054 839719 1131931 1431675 1451355 1456243 1416527 1843183 1568487 1968527 2512262
10973 2512262 2592330 2527004 2496913 2433244 2681177 2611463 2051281 1934206 2207642 2005319
10963 2005319 1951281 1990095 1793150 2375145 1865038 2218030 2176665 2174329 2043486 1796986
10953 1796986 1561248 1134097 1179116 1009614 757013 946290 852656 312289 59092 163063
10943 163063 36635 299172 250249 167629 225592 419944 165284 303034 352477 3376 43601
10932 43601 512003 94968 132509 336704 -32429 -10271 243817 -4511 760 -74723 -83677 12185
10919 -251154 -19032 -101373 153092 112132 -235153 -240784 149569 337992 -141255 10619 -160990
10907 211039 -234624 -226764 -439747 9770 241318 113507 -244081 20947 166633 35284 -85628
10895 39815 60019 -57464 -243569 -244822 -67538 -35989 82679 71285 -26802 -19021 233230 -194359
10882 -139227 -265464 13507 297783 -63314 74458 -81864 -79015 129893 -93361 397353 210749
10871 210749 -54457 -89420 188372 423777 65752 118498 -16759 316068 91631 -16690 115554
10859 252444 -89599 -79695 87006 41173 -63711 -36608 61121 28774 192974 126414 -12475
10847 -134318 -39778 -58091 -92216 -133594 -25048 -99318 86782 -162044 208750 232528 -524851
10835 281791 -176934 -206514 -109486 22102 -95605 217934 -171224 -53709 -205977 -126465 282202
10823 -365994 -148005 21783 -463231 -210036 -247135 -80368 108897 -8879 204839 255240 295568
10812 295568 -5420 -5158 -155891 -271564 302098 84072 -107826 41293 239636 30947 227647
10801 227647 -6049 120866 -307759 -53556 -29747 -194956 -134974 -82846 172776 338403 67617
10789 -189212 -187885 1676 -108510 -52990 -100944 -163861 -243373 7165 134253 -103092 -111190 -270788
10777 -270788 216413 -187706 155128 -170238 -129517 -90373 23959 18738 71148 -235606 -211097
10766 -211097 -343608 -128338 92236 -17306 90242 78140 84093 68024 -432909 -18404 -293665
10755 -293665 -58922 317581 -246616 -465557 -170921 11346 -221830 -107911 -65891 -81374
10745 -81374 -51261 -65504 86598 -484262 165789 86518 -3241 13687 -264862 192702 -383044
10733 -47524 -115380 -35975 -210207 78355 189625 -280771 -24853 -102218 -183639 139328 -434757
10721 213980 -67783 -121385 85083 23940 -46267 -90903 -161061 -43262 64771 289792 64922
10709 -389781 -181789 -263347 -99041 83207 -60579 -75235 146448 -117522 -92384 46311 -124205
10697 168349 -194308 -129277 300164 -79208 77959 49717 -160081 18446 -106372 -121977 -226988
10686 -226988 102505 73494 19353 -44749 -34916 15784 -181807 -248533 200979 11708 -298940
10674 -515664 -328080 -13881 81588 -62664 145473 -288569 -306134 -267178 144876 -34904 108528
10662 -15572 38401 -181149 291684 -16344 91980 -17085 1527 13996 45758 -122474 -125413
10651 -125413 326973 -65728 -84910 225376 -335358 173120 -14754 42099 108773 -189923
10640 -27845 123374 -276757 -36575 -62339 28737 180052 2167 22107 299002 -430409 -80947
10628 -166200 -212396 -146169 63605 73206 -235947 -154387 -3248 278227 -232808 -189204 -201541
10617 -201541 93054 -137326 134369 -391794 140652 -355220 178726 201277 173168 109552
10607 109552 -29849 -53684 31677 72174 489412 313794 -231120 21278 -314870 -10443 46357
10595 -61215 -253626 -31941 -147001 291413 178308 -192685 98197 167095 9096 -123042 -221705
10584 -221705 -171804 172859 217329 204612 -67405 -14224 -162317 -15954 -478211 -220505 57900
10572 -5605 -17102 -11409 114803 -43402 -331245 -23563 161240 -78888 -230527 -254476 -204075
10561 -204075 -115991 -90654 -168654 -178997 25262 101553 90685 -83760 85645 -114301 -98063
10550 -98063 -153914 -242687 155890 7541 -168172 -80865 -162054 -117102 66171 122831 189802
10539 189802 -80000 -189369 -188438 -138286 6834 110286 -51328 120785 -24814 -78601 143708
10527 197014 80373 120889 -79651 -27963 242794 -11699 -24783 -223656 -103429 26617 215651
10516 215651 -454012 75853 95178 -157291 -304864 306810 -137540 165523 -196018 -1323
10505 -11949 -485674 293934 -376693 80088 310151 -57141 -87426 103292 -140760 151088
10494 273348 127494 -84367 21409 -30822 29290 71393 87457 -172711 -32159 -147426 -48267
10482 334850 211061 196064 55335 -99243 -88357 221948 151446 -122597 -107484 -72556 -96222
10471 -96222 510344 -151143 197397 456367 -196119 182446 -557261 11844 190345 -101842
10460 2409 -112609 -207777 26861 -49392 -121974 -217726 -112407 65202 -11948 -91144 -223186
10449 -223186 187465 -152646 264065 -283421 196966 3256 -234300 2962 -345746 45601
10438 -91565 32396 75657 -14779 -26800 -325737 75546 15746 -71165 -156072 155786 154639
10427 154639 -184065 -181994 -75544 -40973 -119474 -103117 24222 1200 -49395 -419413 173147
10415 111906 -265489 92421 12869 -154879 -307699 278862 255637 -338324 -109530 113453
10404 262037 -80752 59063 48686 -203188 246741 -228016 62997 -29899 122675 52150 171733
10393 171733 163035 45456 66122 186935 -46166 -60808 -108762 185865 -30441 16385 254630
10382 254630 -11239 -79554 -95320 -45439 376289 386877 443122 518276 331649 71889 344824
10371 344824 389708 -155347 148884 324622 414104 -29833 407809 513464 -69886 191431
10360 403514 434622 93315 5288 -188994 202468 167757 276403 315998 190564 238552 351634
10349 351634 383251 480901 641347 77963 195624 533461 615852 201954 329814 90551
10338 265654 180104 53129 20014 217727 27089 69614 163758 21496 -180491 130340 168634
10327 168634 149312 116816 -119415 185029 379360 -45537 119560 356925 262143 -76600
10316 84821 -29921 662137 144598 330807 -215455 12636 342455 90394 136349 85172 -157530
10304 91509 -16782 75020 151932 -231828 98485 -96739 13795 13894 151738 -313683 130155
10292 266884 -77995 -368598 201596 -112197 -171654 -68578 -285967 -104851 -66548 -141509
10282 -141509 -192583 105218 -72672 105506 -144748 -137910 -74093 118886 -267683 -193113 381474
10270 -167254 115376 -16400 -107329 -45120 -6672 -141558 215576 -46148 64070 63993 313539
10259 313539 493142 329411 607908 117137 607168 -14560 232031 -23659 -51397 26977
10248 100945 -18909 83004 -178687 -71168 -212818 251649 148597 -435611 212077 -217009
10237 111783 153264 -7357 -281543 -387085 160413 -178876 -25867 -499926 438845 -73993
10226 -144298 -42384 410000 -93458 -251713 -100780 -230242 -11501 -430997 329433 -268924
10215 -17470 -303646 8527 -344386 171923 -317257 -160098 -116388 -77313 -72735 140441 120850
10204 120850 485940 -367353 22192 -54840 1777 390667 231979 77547 56798 -62833 174444
10192 -13019 60443 81434 -127479 -217570 -206025 -180986 49704 -48924 -351892 -5382 82921
10180 -102320 -509299 44260 354158 -105652 -299724 -219209 -215646 -19001 -106546 -2844 48180
10168 -6433 -131784 66572 92411 -154918 -50618 -247088 132772 -69279 -345573 -42366 310752
10156 -23036 -160940 176549 -23419 173896 -145962 176407 -285368 -213344 -110158 -258756
10146 -258756 -300857 89853 -99622 -22016 -183521 -111584 795 -238788 -2129 82329 -127433
10134 -113936 -162925 -100837 146923 51246 -87483 -245577 -50101 -187572 -178488 200600 -48400
10122 109991 -212494 82561 -120329 -356226 40064 -510 -215898 306889 47453 -193530 360469
10110 -17080 -254237 -105431 -295406 112248 -7420 -33749 -154711 -51250 -113478 -73818 -193516
10099 -193516 -130855 353583 -134380 -171715 -337908 147467 -119355 46678 -39438 -192752
10089 -192752 -268640 -225259 -76343 142632 -25052 -268889 -41520 -316815 -91267 -132901 -175709
10078 -175709 -451825 47288 -284093 -73582 -50860 22840 283476 232868 98753 -368470 -320366
10067 -320366 -325865 45339 122288 -93804 -51977 178830 -100820 20815 -99133 185581 204737
10056 204737 124383 -261967 -38873 -45003 182134 -319330 148213 -13257 293424 37557 23040
10045 23040 -93726 -377628 -40725 234468 -302469 -297761 -123501 -72860 -158306 93856 15535
10033 133275 147077 21414 1185 -112614 149881 147814 -235972 95544 158661 -82518 -27140
10021 -433710 -108796 -35435 -228060 -259627 82174 -345005 59557 -315904 -500311 -296559
10011 -296559 -99206 -62069 -295878 62382 191375 -14124 -84171 -47106 -347917 -87153 -119576
10000 -119576 -507469 203193 -89034 -100547 172465 -148162 93110 179152 -135351 337508
9989 156569 -156636 -102689 -162406 -9847 121004 121736 -40381 234629 1607 30952 64351 -147486
9976 212283 -188160 -210175 222505 -174011 180621 -83667 43493 -202413 31947 -54694 -12169
9964 24390 -265101 -123371 12105 -107518 -204114 46685 -111363 11340 -142214 -117880 -35170
9952 -80104 142588 -425948 -266281 -232430 7285 -14570 80765 -146871 -66267 -27721 319602
9940 -392359 198109 -119591 -18872 209392 -164154 -116586 220645 -129106 -37454 112218
9929 70598 -245515 -35748 -166820 -125560 -102057 327885 249481 -44984 179354 932 9111 -193512
9916 -55569 204862 368744 -192112 -85244 -77862 2813 -290460 -285773 157188 -45652 -100477
9905 -100477 -48076 -397229 -343146 91011 261710 -180090 -138411 -9149 -146036 116647 -22974
9893 -138925 110005 -142086 -8239 -86146 350815 -190676 69489 25509 -342020 -64320 -275963
9882 -275963 -79636 -10876 -202453 -74729 -404678 -117073 -156404 -47398 -135182 -288282 58659
9870 178211 -200154 35303 -212407 108503 -87385 -240381 -242452 175391 -33842 -62178 -445400
9859 -445400 142009 -358681 26732 -155169 -170818 -286866 -386066 32242 -93623 -160353 -172957
9848 -172957 -38156 105004 -76640 61410 -192347 -42473 -396529 -272665 -156731 -136991 290476
9836 -92322 68712 -117267 160027 -209827 -253123 -417440 -186332 -100469 -337646 18173 55832
9825 55832 -218868 31103 142481 -90222 -265633 -50261 -258620 -238568 59744 -1835 92111
9813 -184821 -246908 -61325 26143 53289 -250739 -405093 -40038 -338532 -89998 89790 271774
9802 271774 118983 44326 -292700 -52212 -92805 63923 -86424 50423 149915 426740 -274575
9790 -19720 201824 -113706 -91590 9669 -135516 -443154 53699 -10541 168626 -294983 -2027
9778 33507 -192054 -38229 -318848 -239235 -37148 -190315 -198677 -53766 198070 166367 116768
9767 116768 -101771 -102915 127315 113131 104820 -180590 -48300 30362 5359 -155848 -66335
9755 -242329 176219 -128871 -52957 -380613 -37458 -42438 141952 -251914 -67427 -121342 72287
9743 16224 142492 128227 -15371 344184 63903 -61755 -271348 -368994 61367 94365 60001
9732 60001 198513 -132165 -19525 182882 48411 -271887 201506 -77114 -95387 -146922 9290
9720 -92977 109751 -102306 -33828 30092 66823 -55142 -114764 -273927 65763 166317 -25293
9708 -35545 19216 -128044 -137912 -271393 105930 -202131 -409431 -322355 49300 -192228 -173782
9697 -173782 -305329 -156832 -281530 183987 212828 79995 -78383 -142587 93137 126968 -150333
9685 -86422 -243015 -59032 151761 123078 -140966 155247 -280210 -155116 -18768 23477 -179915
9673 72913 23626 -83701 142472 -163181 -68677 -516055 104979 -20015 -295258 -56417 -8609
9661 -131236 -152192 -18989 150489 341728 -308791 -339671 -52059 129934 -116571 144674
9650 -170631 -166956 257196 -78425 100935 -38875 -297270 -9810 -121362 55357 -299268 -124979
9638 76889 -377934 -114737 -6735 -59503 -218259 -231820 19196 -127857 156002 -175201 -340433
9627 -340433 -41160 -233684 -198313 -408173 -17016 189245 -181602 -280811 -27883 -44807 -10055
9615 -327681 -202963 201007 99031 67200 119672 -62342 -94890 299356 223680 -72635 -25259
9603 -228617 -137085 -309782 17437 39542 -15305 83311 -59371 -46794 396565 -13468 409632
9591 -34940 85138 -162623 380003 -149388 -409051 64985 -409787 -186677 -40244 -129609 -204425
9580 -204425 -145324 -115002 -96282 -3964 -150393 45996 204809 70812 -304455 22174 62314
9569 62314 202571 -95794 -8526 -37938 -55557 -200288 56259 -53212 35520 -6349 -33186 -105225
9557 -105225 -110995 -24876 -227924 98178 -26336 -24562 -171088 71995 102 -264630 7853 91798
9545 91798 -299328 -9524 -287469 -460296 157770 151517 -38366 -224462 -142749 82538 88965
9534 88965 46891 -197069 -47422 113679 -75086 95881 -417824 -148015 -375181 7736 -33576
9522 290478 -137177 85933 41059 52704 147107 -41809 112304 -157154 -104647 203344 -179127
9510 -289343 199590 -67956 7963 163420 180758 174230 117292 241585 -67871 18942 48209
9499 48209 83450 -29204 -34116 -87883 -190175 -67062 -111930 63472 204810 41390 33168 -159029
9486 -28180 15327 30822 -243226 -114606 -139344 -31209 84549 -9899 -87916 -240469 -95366
9474 -15588 -86898 -47563 -307533 65403 -246647 -106328 266310 458130 -258707 -40494 -108863
9463 -108863 48865 -230016 -69035 -295300 -337395 215386 -271016 -229621 -190131 132333 -55669
9451 -152361 -196597 15195 80559 -308719 140498 -9957 -212566 -188250 86098 -193159 27357
9439 35210 -32496 -149752 -390694 111541 -138557 -278094 89743 -86450 -30247 -160269 -306516
9428 -306516 -117707 160380 64915 86221 -180693 57934 -78290 -213377 -200 -33786 -34348 282466
9415 115452 -111277 -344005 120509 -114262 -161617 281933 -184370 -66005 -314796 59162
9404 -30602 104415 -326920 24162 11776 -50870 130477 201938 278187 125410 -125082 34412
9392 88800 195406 90 98473 -183601 -352181 -69410 -153766 -89121 34076 -101197 -37802 26517
9379 63806 -16120 54048 -188045 165349 -242756 -4163 -1936 -68457 143072 -194622 52107
9367 398578 -272103 116895 -24989 161665 -212140 -84913 -61241 123722 -256971 -313325
9357 -313325 232234 352470 -251831 154390 6275 -154966 -182894 -181542 -222114 262825 -272472
9345 22099 26343 -9635 -117895 -272250 39908 -174820 -120705 -87264 33537 -49121 -12956 -80395
9333 -80395 45195 180792 -204675 -29396 15785 -91867 -236625 -94106 -149262 -107992 -236513
9322 -236513 258016 180791 -25353 -16046 -223266 -38310 -53835 -11981 259451 39314 71085
9311 71085 -111216 -160991 -83933 -120260 -63092 25980 64782 26371 351362 -5311 -332686
9300 -332686 -208889 -306336 1248 -59226 7446 49558 -94340 -156375 112490 -10572 -137201
9289 -137201 98581 -118398 -129297 -334574 48031 277894 -223053 46489 -103685 -76659 -43447
9278 -43447 -47439 -41076 -172567 -268349 -118814 113664 -149954 -25387 169386 -152996 43280
9266 -118181 -18797 -316885 121044 -28989 19996 -4578 100940 90562 -19419 -126683 -313550
9255 -313550 123194 -89348 -260487 -67057 98408 -103497 -70680 -94700 -120617 -208433 35050
9243 35565 -217656 256181 -111730 -397570 44439 49776 -377654 -79150 -112587 214023 -115531
9231 -88464 -39168 -82767 -134235 -224081 115653 -88975 -158592 -115828 167002 -124702 -255292
9220 -255292 38773 -45068 170823 44001 -11954 139852 -233179 -79429 -187948 4368 -351086
9208 -63247 167746 7464 -44585 -86725 -90137 -236969 249468 80447 -259552 -69465 -21751
9196 -116637 10772 120594 -33303 -347864 -7444 6381 -262579 -239652 -114242 -163845 58036
9184 -285116 -105136 43574 62095 68972 -132179 -59955 -173790 -115607 -276822 -204597 -173182
9173 -173182 -191714 58705 -230261 -97946 32274 -130229 72469 -275427 7902 1583 -16204
9161 -236283 178263 -239130 141468 155751 -152896 -8232 76346 -82605 -167970 49580 -133451
9149 -138961 117918 98238 -328984 310370 17793 -143453 -93183 -63258 193094 -59543 -104531
9138 -104531 -134939 -168795 -144286 -22137 -186996 -57604 -254395 -137372 90460 19536 15734
9127 15734 341195 4512 178515 130011 40884 59047 -121376 -123188 -46136 -68787 -176788
9116 -176788 190088 -63212 -59436 -10395 58685 84699 -98801 -96154 22028 -177051 -239488 -106074
9103 -58987 -216950 208795 164359 -2892 -47300 -236021 -96739 53135 -186949 -109534 -238375
9092 -238375 47677 37693 -26662 190638 -266414 -144750 -84181 -424604 266036 -67001 -158203
9081 -158203 160494 -41098 -79011 -18289 -40721 -422242 -30391 -149880 228992 -170796 161672
9069 -20337 -57769 -24360 269939 -255027 -145146 -116746 -98081 127852 -255370 -101522 -80231
9058 -80231 -139164 10346 154906 225748 -166450 -174985 -114247 -205310 -68748 -162320 -19869 143291
9045 -475408 -448025 -45402 -67160 52273 161852 -61232 75833 257331 -3403 -67556 -79586
9034 -79586 -95927 -115820 -287696 179354 -113080 140470 -281785 -364116 243398 143673 -164804
9022 -139093 -427183 -312341 -34837 24126 276605 -12103 55465 -373079 -282400 153370 155728
9011 155728 151332 -436257 -131630 137505 -184694 57287 -26383 -54194 21066 -167791 172878
8999 227193 -4574 -108210 21756 26699 -138549 -131277 -29524 -112745 -163630 17218 -142669 208921
8986 -91652 -164450 -59980 59558 -175995 -269639 292762 -395210 -39068 -234658 -133079 -151435
8975 -151435 -224211 -210421 -125453 -105150 38413 -292762 169162 -19542 -29465 -484238 -106891
8963 226548 -505371 -79134 159781 -101112 112861 -291485 -42041 -187087 159495 57448
8952 145744 176863 -18632 -45599 280504 -176672 -21439 55846 -105608 -281008 47774 -86282
8940 -103042 -136986 -141179 -218577 -79929 -159308 544070 474689 77446 57672 -328392 109709
8928 66713 -11466 15001 758153 424935 1350876 3985764 7911150 12078691 5443712 2218940
8917 681969 429161 289021 127633 -232361 141022 4375 -126191 264109 62950 310380
8907 310380 36094 -128460 199618 31171 -325627 1064 312303 -40661 13325 -29863 37680
8895 -281710 -173124 -183560 -32790 -33773 -183403 -55766 -341270 84895 -23653 1682 152879
8884 152879 -110661 -148793 -34861 48157 234861 122033 -331075 4548 102503 -41286 258008
8872 44876 32452 -202033 -39653 146713 -237381 69149 -38571 -199371 -98453 -102365 -14039
8860 -86815 66071 -339561 -231746 -9352 -163706 11845 -499925 47639 22916 -91432 -225336
8849 -225336 -239762 151565 482691 -95039 -46938 -136918 145632 2974 -96258 -97627 217868
8837 -160647 -248232 -373322 41172 197951 -94543 -1993 -28625 169698 124009 200311 338255
8826 338255 -263911 65334 -177882 -167623 293301 764 -124168 -147149 169209 29048 150919
8815 150919 -260665 -49041 84246 -379225 -289523 -74119 40622 12230 307627 20671 -791
8803 58518 27078 -55933 -185009 -257913 -8741 -113835 112152 5208 -57384 73334 -135815
8791 156929 199457 -84516 53675 -262763 -120407 -9764 -136716 -237072 74711 109516 -353252
8779 63510 4116 67205 -348697 94188 67826 2504 -145745 -370278 43064 -20217 3900 -76066
8766 -1915 -50160 35580 81485 -294013 -166579 -234363 -299349 -253505 -92209 -333873 172068
8754 13237 -18708 -157193 -90641 -64216 -206597 -110050 45323 -65121 -69218 214336 -5064 47727
8741 -39250 -284455 -249281 -110052 -83081 141890 333426 -160281 -10311 -15318 17129 -88305
8729 169718 -191035 -274876 -8684 -196438 -166692 -177511 -3090 231978 -169713 173402 183903
8718 183903 -14132 -74559 -357333 -70901 118412 -225388 -317819 -30388 18432 -196981 77329
8706 -290161 -142866 -296954 -47501 -51967 -275628 -164445 175772 -84600 -173270 -20195 21829
8694 100573 77449 49085 37241 -231604 -80101 -31702 18492 -230340 36018 -1332 20211
8682 -12906 8813 258242 112180 34006 157723 -183338 4768 -23931 -40946 -182581 -137387
8671 -137387 406045 110901 -268426 172187 86783 64145 71356 18658 -246633 -219000 -79562
8659 -179398 177042 -237319 231524 76990 -436921 134632 -323998 -115712 24247 -134774
8648 -344811 -240161 -43390 204033 -308903 -38764 -234977 37740 353539 276796 -154522
8637 189111 -265315 134841 -136533 -86008 41844 120694 -262122 -11424 61573 -166421 -86898
8626 -86898 -271391 -33538 268602 262164 96475 -425544 -309130 -220401 -323320 -207597 -224747
8615 -224747 -55339 103254 51736 -76036 -286412 -228733 -221603 -163365 -104505 -78986 -169013
8604 -169013 -107727 351893 294362 123091 107673 -167967 278573 -227730 258940 53783
8593 69098 148381 31617 202661 -167992 17935 -161975 -323550 -75932 -191054 -28460 -258523
8582 -258523 178853 113606 104547 -364638 -430808 -195073 -154967 -205563 -29611 -195258 -320212
8571 -320212 -336588 -220178 -33804 -258430 194666 329179 -161607 27498 34960 -313571 -221458
8560 -221458 -361129 -155237 63743 -206323 75036 -304925 -148952 -34999 -121534 -264249
8550 -264249 -179128 -133874 11945 60948 -72535 -253582 -244898 -308009 213503 -79187 89924
8538 40535 -183218 -81469 311114 61393 -253193 71347 -185134 37941 -395231 -157573 -112578
8527 -112578 -33186 -250106 -109941 -73507 -26630 179998 -87133 -116170 -35207 35923 224639
8516 224639 46655 -141139 -293067 202373 -134227 -81148 14406 -11615 45555 -137822 86824
8504 310906 92751 88507 -53840 -70802 -66405 -87313 -61640 -112277 -175775 -341733 272025 33899
8491 -165999 -227589 139858 -162722 -216526 -301052 -440633 -100104 -4593 104211 -315684 -122324
8479 -432905 116168 109028 90198 175379 45525 -233351 -261785 -290176 -387542 -140077 8509
8467 -73727 22178 -5983 -37522 105396 166961 -374880 -103403 26716 -188585 107298 -27003
8455 -157030 66869 -102780 -6892 -260634 -34317 -7822 113829 -54709 -32189 144384 -182650
8443 -432394 -61246 -144393 -123305 202922 -13387 196079 -94811 -202429 -20770 103603 -99607
8431 -54227 -409687 47645 42508 -109327 -60987 111423 28555 262235 41517 -296311 -50634
8419 -93586 110214 -195560 -264155 -47665 375348 -43825 -214969 176929 -171587 90417 -20491
8407 -33544 -33448 -130081 160677 93071 -150136 -195516 -113169 -5739 -116511 -63873 83999 -172558
8394 -10507 -107648 77554 -545156 103649 206418 -40717 -166465 -24226 190235 138292 -106840
8382 -34861 281539 -26265 -72251 -201370 157212 121406 19824 137488 -43921 221837 34705
8370 -270021 41690 148961 -102962 -175467 213260 135095 -54581 -9837 -195999 72510 116071
8359 116071 -177153 -384760 -82097 296458 -124886 212795 -169001 -47770 -287994 -89300
8348 23741 176233 -345537 -112309 -257074 -143251 186189 -49390 60281 -136104 10891
8337 71212 -47580 143123 13368 6972 -177344 -108716 -112727 70316 190500 -100147 -511085
8326 -511085 -2722 62399 -197392 213778 188419 159668 -311903 -179709 -289424 -261923 -57221
8314 -237943 63467 -51845 -209381 68260 11040 -279771 -85656 -231816 -169828 39038 -168660
8302 279205 -73163 -692 272199 -107544 -204913 90798 -143043 -615799 79901 -199550 113501
8290 147194 158368 118632 -103772 68453 273099 -38710 -183858 173429 -22220 26787 -18752
8278 390629 103640 -109457 264343 -170832 322799 153878 76821 -55805 94033 95153 64154
8267 64154 311707 77252 4387 32227 -378293 7777 -244367 -242255 186393 -52518 -74869 -48779
8255 -48779 -73043 -248754 87276 61646 146698 229744 96950 -42396 -93584 -181209 -45000 -99452
8243 -99452 -399452 -218298 -67626 -39025 -115202 -174364 -204886 18118 -20009 101695 45759
8231 -372636 76670 -136517 -241049 -191414 52945 -250753 -64084 -70335 -39454 -247613 17548
8219 -225389 -116423 219362 -202127 -92496 -223367 -305238 94291 221141 10564 -214530
8208 40204 -167451 -58358 -40002 -224999 71338 69512 82100 -200687 186594 30661 -96282
8196 -223641 -83288 28168 -157395 -152615 105006 243719 -96197 149383 49538 -398659 -287669
8185 -287669 170940 108182 -184195 -15880 9117 -189614 149832 -179255 -166759 -230491 -201029
8174 -201029 244792 157168 1315 -117229 -82719 -215621 -8764 170256 -36974 -74037 -76253
8163 -76253 -343722 294005 65739 414393 -182459 21461 -89117 -42507 -146423 339933 184345
8152 184345 -21692 -57681 -110586 54197 31932 5419 -238862 -91169 122002 -5920 -14703 -90025
8140 -90025 -455961 -215617 48741 155036 10583 33163 378970 61977 106866 273122 -184682
8128 36442 -9059 -114489 -252161 194434 17220 6869 -25754 -141164 85400 65427 -54932
8116 -208632 7056 -240166 -274284 158518 251273 41005 143335 -133012 -37677 -178794 139970
8104 75701 -2737 -232570 286617 87105 -26789 349286 -105072 -85876 -105052 184140 -88999
8092 82136 -146297 -470382 110988 -182603 122180 7587 -90160 -115306 306770 -77942 -43636
8081 -43636 -177061 333452 176109 -318797 116643 393760 73229 -3440 -333073 -111426
8070 68065 -87674 -76133 -265365 133721 -138085 101142 -211720 -53523 199227 -36385 146039
8058 -71680 -218799 -272800 -179599 -229635 -202943 -216285 110736 242624 -304297 162569 54650
8046 364694 204502 -235649 -341949 -40895 -243163 108403 -22964 -233754 87404 7754 -271542
8034 71174 6289 75215 -176199 -189576 213445 -427799 -74653 -91359 -15352 249013 72610
8022 -265291 216937 -10042 263258 286618 -219656 204497 -104601 51836 -245303 -240177 -203630
8011 -203630 -565653 -235267 10354 -90364 383048 105036 -28730 -120617 15691 -186785 -175168
8000 -175168 -373588 -129518 -18891 -108450 81121 -97347 70077 148154 -35754 184477 -36512
7988 202052 -375651 47023 -116525 -151019 75051 230695 -340347 217458 69965 -387040
7977 -12100 32270 -134888 42278 -112912 -93259 250190 -18683 -14536 269950 193716 -70170
7965 7760 -350022 139968 -338460 104244 -282998 -255053 -91584 31110 21710 -142553 -84047
7954 -84047 -79673 -132990 -77857 22620 -34595 180226 335891 -42431 -130681 22248 180997
7943 180997 -312536 -41536 52057 -199793 -214966 9481 -101668 181248 279960 269161 178962
7932 178962 124309 -78597 156272 227822 -153848 -234187 -113561 143769 -62574 29985 279113
7921 279113 -11731 196920 108403 -102723 -151678 152633 -272730 171254 195286 -154848
7910 -116656 -196925 280163 -108869 3522 278420 -191551 -148896 -210691 23766 -110251 23261
7898 3088 98990 -295335 123562 -180530 -247477 -71808 64366 -142049 -55841 30218 59220
7887 59220 360635 55454 -320429 -217492 -268463 -231610 -50773 263775 -81627 -304498 74985
7875 430834 -37681 -319493 -269784 -49991 1802 153762 165609 16056 -195377 154837 -17154
7863 -192759 52671 -253752 -232316 -175751 -285699 156200 348364 64449 -185229 -441598
7853 -441598 44183 -72933 -210481 -126136 198815 71130 -23191 19524 132013 5938 -63265
7841 -203583 -181130 -183441 -179948 -39779 -159173 23805 106482 144777 -46057 -188596 -192741 -530883
7829 -530883 65321 32767 14503 134023 -69326 -264992 78760 -140933 21359 -234290 -215859
7818 -215859 320820 205938 -61818 225338 -408992 89430 279680 95766 112802 -232235
7807 171785 263689 134541 14781 -412428 -2356 29845 -154400 307889 4660 -63644 -195813
7796 -195813 45049 119536 -221991 -70147 -56669 34307 195255 -134992 -62160 -396774 48064
7784 -55609 -80798 -406662 -83846 15757 -81080 -297546 105080 -159580 112377 81226 -139748
7772 -477484 78030 -116012 -43919 -118620 248970 11138 -507134 174404 -126055 171164
7761 -7970 -61868 -156374 -128511 -67607 31031 -60682 -31559 -205719 213384 -270040 89429
7749 -246260 -96108 -58418 -462080 -103781 -45101 236096 256086 218253 -71287 30343 17441
7738 17441 -171045 -71332 63095 147791 143599 -259612 -70314 -222733 -151609 -164305 -244739
7727 -244739 150793 -193708 -22263 -197541 23402 -44120 27250 -176371 -126693 3891 256176
7716 256176 -147765 142722 -163908 -222021 -53039 -48875 -472822 131323 -463998 189994
7705 -299612 -217239 -125246 207495 265779 -12614 -203268 12669 -30077 49491 -494310 257112
7693 -78767 28075 449961 87476 -123778 175287 -26113 -238759 -99548 -38016 -204300 -30705
7681 -129239 126458 76993 -105409 278876 265811 9822 8480 7736 -211694 -31005 -59406 124203
7668 -97327 48242 -104179 -112921 -219289 304247 -136771 -115065 -211580 238429 -319804 -242753
7657 -242753 329900 -51084 142063 -151083 100452 96023 170272 -392225 148164 -199749
7646 41352 -106781 -109919 175406 -300914 -417914 -16043 332637 44610 49108 -233197 45460
7634 8771 -180428 -68994 -130042 -190495 34857 -108761 -36093 -133517 -85406 37376 -213251
7622 -289910 -388253 -273073 135058 136589 -335352 -303411 114557 -270 -1782 -179598 -154786
7611 -154786 -47447 167704 92536 -124762 -7390 55270 77521 105804 -185887 -220646 39433
7599 -156509 368829 -210011 21674 151993 -147769 21557 -128930 -190692 -382137 -198891
7589 -198891 -200324 7350 -169660 36207 -106283 2755 108502 -99664 -3493 321837 11333 150706
7577 150706 29291 147365 -157559 -167463 240032 -205467 182144 -93966 -185585 91915 -266845
7565 478562 -12900 37895 -205934 142086 -93040 37169 -110813 174309 -45525 89495 -86991
7553 -212943 123001 10243 -131918 -113472 119260 -90993 -187197 92721 -198227 -33767 8440
7541 145122 -32543 2562 -360977 -131553 43796 -94859 -142226 71850 -153105 -159550 125928
7529 -74019 -137408 -378746 -55720 -112554 -138009 17171 -40283 18251 -55156 -309183 136962
7517 -237921 -8852 -24382 -88117 61522 34084 229421 -319600 -330777 109379 107386 -303394
7505 -76215 -27137 -133607 -302480 -133612 -237487 -66247 29418 204289 246101 -161941 -130558
7494 -130558 -5248 19137 114924 145047 68183 6136 54451 210163 9252 226256 278229 69175
7481 100980 301053 -546904 -297224 -29051 -40724 105720 -176387 68155 47036 65859 -79960
7469 117378 -62779 -188503 -488216 -53687 -129268 -25648 94187 -277839 -8060 -33830 -232203
7458 -232203 -187715 -481154 -78037 -36395 -70979 -183248 278022 -39242 -297450 -402155 -130448
7446 199858 217613 -193325 -226469 94841 57422 108761 -163754 147646 -117312 -82589 20404
7434 83828 219831 314302 -35392 187272 -304092 -166656 410643 -249848 -366141 -73016
7423 -55116 61720 -119177 63741 63013 -75226 -287517 -296165 -138708 7238 -9017 -196657 15772
7410 -59440 -480607 120596 17344 245982 -122033 130176 14761 217514 -106005 248189
7399 68856 63393 247825 -128539 -174000 -113442 248907 -352685 -129588 -65893 -514495 17418
7387 -14122 32904 -13725 117472 289539 -209623 243402 58574 -352202 289938 49699 124492
7376 124492 60500 200163 -21087 -127742 344828 190230 152541 -96758 76111 25090 -45151
7364 -169506 -165803 -10041 -126024 90938 -52573 -269676 71849 107333 -328135 381844 229074
7353 229074 -127768 -37905 -51082 232274 -136922 -43881 -54577 93784 -184416 -311432 108587
7341 49397 -20114 -134806 -36268 41558 -344831 301258 -77034 16381 205398 71040 -41303
7329 -213090 109374 485261 -145691 187642 57193 100273 148008 96413 246887 207168 -305815
7317 206059 -46031 145603 227352 -74421 -403601 342986 -80833 -116770 187577 71925 183393
7306 183393 -87319 -490865 -155391 49019 178365 -186 116022 193313 50971 -315370 -295304
7295 -295304 -130578 -15700 -39363 -258821 -108059 -68848 -145807 -50172 -188792 -16844 -451986
7284 -451986 -73708 -368778 70880 122725 -5308 -200498 -93225 243050 161304 -8883 -167260
7273 -167260 32801 -33640 -202266 447483 -137367 -82601 -66352 -272121 -147665 -31695 -230406
7262 -230406 269975 235143 -48590 -210828 306497 -129511 41235 31478 117604 -91998 -79109
7251 -79109 -83346 -72974 73447 54492 50936 -122081 18302 -207362 94323 3281 -114959 -416455
7239 -416455 53313 -118826 -26791 273589 40687 146037 -471693 -408360 60498 207632 188910
7228 188910 152574 -222062 -193235 -198143 58901 -43882 14754 -134869 86681 -282063 -135112
7216 -13795 -27642 -195573 53574 -83819 -364194 61035 170014 14791 -530369 16865 -328891
7204 -136293 140377 53708 66986 66818 62630 93719 -10671 -102436 -150403 -151936 189015 -231648
7191 53574 241808 -64452 -297086 -292290 150940 24241 128318 -172671 -93547 22674 -115815
7179 -281199 50197 -324617 472354 -125858 -145309 -141572 31380 -96711 14662 177293 -436401
7167 -71224 -155798 188463 135847 75950 272296 209699 236553 148275 -99326 -112208 -149997
7156 -149997 -137317 -39456 -455168 -123330 19057 149572 -290533 -113129 -120222 -147844 185663
7144 -332965 -284963 164044 -226191 97937 -65743 -73464 -19077 -82792 -324935 -64875 -113626
7133 -113626 -11499 -270599 160742 79124 314695 241631 -193362 -102981 111287 253327
7123 253327 -97581 90571 289957 107019 -73321 -176869 -126666 45102 -16552 190951 74745
7111 4281 16787 53110 95369 -73229 -285071 -153970 165488 -188350 35509 -312687 -67861
7099 131361 -265337 -277443 -335670 -267662 104820 183710 -171758 14882 53704 237492 -297829
7087 21918 -36215 -292507 -1283 -203918 190974 -70104 -42960 234033 307933 -212910 -79457
7075 1313 64763 -214201 88319 -129214 18203 -177934 -420789 187114 184795 84610 5194
7063 -65785 10899 127088 39223 -206235 -24001 152448 11871 244182 -160467 -64600 -2969
7051 -11999 -179475 -123921 -37283 67671 -179313 115892 113938 -79287 -154551 -249568 -194906
7040 -194906 -159686 -18886 194187 328549 -162164 -463271 125850 -144323 268262 339336
7030 339336 12217 117033 245340 100507 -183670 -154341 -46313 36512 -122831 27356 -141010
7018 33609 -167675 176087 -104343 13985 -61302 -52223 -145336 32847 83814 58468 52534 -117121
7005 -263036 20136 144484 12273 -61262 92546 -42393 -182746 115823 188640 -261189 -4939
6993 -29200 226785 14024 166870 -129211 31631 20741 197025 -62869 -18302 40282 -143965
6981 -100982 136610 24626 63326 64788 19931 71119 -143772 34396 26750 433121 -92609
6969 -177357 -142106 -234309 14698 -7869 84088 -10915 -102031 82597 -153720 32728 -161787
6957 -261467 77282 3308 -452463 208792 80043 -164356 121924 -57248 117081 60016 112856
6946 112856 -9894 186122 99443 61087 -110034 -123070 -341118 -105230 -194931 51213 133401
6935 133401 -120468 78666 -21241 -158783 272119 73233 -237629 58749 56644 259123 101820
6923 -162941 62179 -32570 -265754 201330 -8119 -312799 115049 53441 -128875 -38001 -299392
6912 -299392 -140523 -233497 60335 -145262 -70243 -2783 -51161 -23390 -126039 -83842 44970
6900 147386 -146349 -308170 -283856 30042 -158277 -85428 -43041 139134 -336309 307483
6889 -303119 257975 -78600 150500 -255049 -61100 -4051 -79802 35756 -111304 97014 -58463
6877 44361 182046 38460 54215 43550 115107 -208483 -39372 102885 15459 -172938 -67757
6865 5986 -203197 63512 -98133 -63440 -15425 234305 36173 85266 217734 -132001 169685
6853 -117602 -332946 -44529 117333 -139120 -72121 -138097 -127458 -272721 246604 -84970 -104450
6842 -104450 -56426 103871 90454 -226484 26375 244485 173215 87080 -100138 51735 -27307
6830 62375 89580 126557 384418 110670 -44406 -166820 -397459 -374354 233224 249102 -133654
6818 130534 76331 4156 -144191 1783 -74841 139201 -223599 -1089 50347 -225777 -68213
6806 -216997 -65437 123644 -102404 -190343 -118677 -73219 104094 141056 565 -198250 183384
6794 -94020 106707 -18766 -242158 8081 -221481 -273506 -187405 64157 238409 -247392 97753
6782 139227 127371 -188608 -141310 215642 138783 -23548 48673 -49209 88195 325717 61794
6770 -92790 -14727 -21721 195339 -63442 -134126 -139313 -116498 -227614 -30050 43712 -137846 77204
6757 -247562 -157306 115199 17411 41278 370487 -63391 -109271 -33281 -37828 71187 -209335
6745 -116382 -176216 -206491 -132048 2918 90642 -82785 330174 139 -236349 110056 -225989
6733 -61719 187657 -2683 -86980 -69912 -227189 309346 -209282 -24516 175329 -343439 149146
6721 -191280 934 21949 -190412 5729 8369 4658 -81235 -154882 94840 -216495 -37244 -68842
6709 -68842 -4365 83716 -77361 -80435 153545 -284047 109882 -25170 -43853 -147338 -205920
6698 -205920 113402 -183079 284580 -356177 267181 -90840 69861 46762 -306339 137581
6687 108824 -13622 -136713 41638 105009 45845 185764 54997 -92616 -85098 29054 -12897
6675 -76517 -120421 20948 303151 -102057 8942 116468 111386 -17602 -110067 -58356 -113205 -521192
6663 -521192 -20613 -3037 238169 21300 -121067 92224 146778 -60597 17599 9998 206773
6652 206773 -271501 -88228 72012 -133728 99811 191266 87945 -14922 -377190 140923 -73792
6640 -152067 -17525 -13231 120031 195243 -20333 195272 275684 -112132 -136855 -54347 13972
6628 -270727 -91567 76477 -275722 173575 -292014 145333 37799 -34054 94245 -181064 -77925
6616 -136705 -245707 -140289 -118383 3414 -31949 15873 -65028 309899 -96636 -107271 -240306
6605 -240306 -88120 144678 174366 -141678 37977 185304 -96593 -100238 112484 166643 -348
6593 14325 -620987 -23258 -221510 118662 352166 420297 360684 -28300 -78472 73065 -32909
6581 51947 -164756 -9148 116416 48301 129144 -8178 -294107 -21306 4610 -32601 -182992 -299743
6569 -299743 197655 -367949 7262 7343 -147440 325195 -192640 -376614 222776 -462947 23716
6557 -81831 110028 937 51296 125668 -187569 -55903 -119337 -120315 -34092 -481251 -105734 304608
6544 -100450 -151001 -4719 5317 -14362 -69961 -39560 -252419 138260 77002 -109326 135196
6532 -28178 -229482 -158429 95775 186771 -30485 226791 -156011 65517 163848 118237 32109
6520 127535 -190634 -110533 90802 46902 61867 30903 -45229 -53 -253841 -225089 2152 143563
6508 143563 196555 -63306 35372 122245 160342 -168923 -11897 -80200 -213690 -130904 -130871 -238366
6496 -238366 320135 204971 -49931 -106355 105015 -152030 69623 -187131 -171717 -41615 226685
6484 -54407 -193223 -71485 -126094 174253 -70414 -92922 98919 -98180 100165 153816 101998
6473 101998 -135838 -283016 -64095 184474 -16662 171545 -32749 415998 148604 97212
6463 97212 -266029 -170270 -76020 261853 -85908 -41154 131161 -51714 21694 149667 203341
6452 203341 -251111 -248500 86574 -4323 -52866 -97610 384047 255164 -60378 -92087 -116422
6441 -116422 83036 25097 5359 -293977 -17633 375948 25293 -176850 75161 143014 380808
6430 380808 -149097 -94941 6322 -524750 3750 -117215 -74437 117615 -3105 4381 -287353
6418 66864 205884 -75024 347744 192052 142312 49888 -31862 -285529 -74297 -208976 -285987
6407 -285987 -157589 127494 -22406 150053 67619 222710 309397 50066 123856 -51297 132273
6395 -321966 -302243 136689 -213713 -179879 -34059 -14340 206055 -20113 35157 -61285 168413
6383 35309 -405004 -32098 -130082 72609 -235449 230986 66135 -34345 -353138 -322218 -98994
6371 56318 -155647 75094 141366 23573 -143644 -24745 -339200 -74558 -74705 -357 114675 116607
6359 116607 -62481 187608 15132 -214946 -145664 70494 48706 -76395 123190 -361178 -101069
6347 218856 216876 8443 221642 -25655 -4846 -134696 -69180 53524 -65562 -65941 72880 -332338
6334 215848 117745 24336 36640 -130618 -221910 -255804 -158548 -100257 -340869 258499 134292
6323 134292 -204795 -85128 -80532 227814 86929 14188 199894 -6788 -61550 -250937 93721
6311 13363 85340 -39227 154414 -206259 -149173 169751 254151 65530 258249 87492 -68665
6299 -442147 -48390 -16211 -22925 -164082 -180868 -284285 187198 -155108 -69157 60068 381896
6288 381896 -199562 179007 54801 253958 -2534 -107058 -166341 132173 169389 -46746 152953
6276 152765 153199 46132 361977 47860 -93130 156212 77450 163707 -104012 -273605 -84680
6264 -99699 30126 104539 -237236 -105594 -202666 -268604 76543 47155 281952 139627 32764
6252 -4273 232394 -345910 -460357 224484 -144822 205339 142761 -267452 107344 117159 52763
6240 -40702 -212956 416851 -191797 185305 110011 -184019 32114 -301595 58386 62786 -96846
6228 2426 44989 -94764 140172 124163 95532 -83262 -324607 -133828 39687 262026 2201
6216 -90986 40135 -208005 147940 -235533 164278 -261705 59286 -231688 210585 89837
6205 86646 -219324 -375765 60625 -90697 241129 -81510 -186625 318839 -59796 27479 -77310
6193 10803 110983 195297 -111220 61475 -149962 150468 117946 133732 2538 128724 290958
6182 290958 -82923 211365 118694 -62850 179251 33656 114013 34828 122564 -318669 83898
6170 -71977 -96862 -10289 -11674 -369944 168422 -345663 -210236 8987 118183 138382 104599
6159 104599 -148662 -242084 59717 151023 -249677 -7397 118898 270706 212613 -207564 -156086
6148 -156086 -106420 -452838 -198457 -134463 189921 27421 80879 299259 216727 150305 -198986
6136 326695 521385 -314107 -45124 -160749 -340350 108610 2632 -106423 142664 -129642
6125 -104036 -110686 -44659 65509 -191565 -279165 -34366 -16247 133692 -101056 -175864 -93083
6114 -93083 -174030 171241 -27972 146452 -183895 -333210 73634 -89578 112560 -63686 -233063
6103 -233063 305934 314063 -42567 8639 -191666 143361 -29119 61077 -222750 -116126 59305
6091 137386 -234788 328358 -206983 -38404 -2974 70200 346655 35262 185431 -60357 -325313
6080 -325313 136815 707 72864 53379 99488 142232 -137316 191584 29980 -100936 38220
6068 159329 -6041 -490 -180988 304846 -132197 -419518 -99457 -230939 -239700 -36066 263390
6056 173368 50127 105352 -282479 286450 180518 42229 -106837 -70264 81114 36844 -263595
6044 380464 -298788 98906 33214 -54968 -311333 16129 179853 -139957 301915 19279 103022
6033 103022 -7554 -29898 -195748 -261031 -53890 -71730 86898 54431 33934 232634 -62144
6021 -33371 -116627 28651 121266 -220983 154578 151675 291713 -379500 192294 223536 -93327
6009 -2044 322836 -187524 -77857 243785 -11073 -20925 -40781 79983 54608 -239601 138756
5997 146155 202279 -65581 -8109 133229 96541 -420710 -329012 20760 -124785 -283424 151016
5985 -174650 -7013 -61111 85602 152566 -195911 -185947 8760 -38525 -225964 67351 -221872 262817
5972 -9269 141372 -95980 115426 -102714 -150317 -282060 151797 25066 -170758 48953 -186798
5960 -15685 75617 -54174 5222 48178 -186355 50429 255217 132848 -38949 -213410 -68362
5948 -226846 -48181 169664 -31706 27620 -214302 48950 135115 259135 -50987 40537 150826
5937 150826 -144680 55190 -160973 -171464 -83822 -104927 137976 -128656 -26111 239724 -22698
5925 -294442 -321189 -26856 82458 138936 56754 -139650 -9383 -205064 -23729 -36405 177285
5913 92312 32907 5348 300403 25480 22519 -79173 -175996 295173 42254 20403 35094 -178200
5900 -7070 153704 -346035 157180 -27829 -109105 180283 -84095 20555 -90621 153307 152932
5889 152932 -137380 159964 -259376 -285707 5351 -48160 219197 37449 211752 70899 -416777
5877 -162455 -256544 450499 154667 -84995 38159 -109167 38219 -50352 21003 113928 140925
5866 140925 49286 246324 224156 -280242 96576 240982 -322266 159034 -179783 182645
5855 86965 263432 -170822 109147 362014 -42577 -93009 -197525 116196 145231 -122446
5844 -128102 290172 15276 166703 -155454 -100331 43262 72816 -67648 -16050 345678 -213248
5832 -61911 45528 -148801 210741 -331082 -47306 -179039 87240 195286 60296 236147 41891
5820 -90244 371632 -236418 -188759 -102725 11164 -191814 -136545 48461 -138336 -124011 -112069
5809 -112069 -40635 117665 -230059 226997 -458394 30714 121823 149615 -82973 -14587 -94901
5798 -94901 21955 40329 214518 -182915 136176 -163892 -238183 86967 -232669 -43423 -64607
5787 -64607 132819 -84663 283801 -35269 -147135 -246170 4768 37631 133744 293981 117946
5775 142583 37831 -150502 38578 -281846 -97356 -64836 155156 282898 -160253 -28626 35752
5763 144397 -225700 381774 -24284 205531 -147652 -6381 48402 122699 -87956 -267071 -6542
5751 2171 313164 306135 62596 23355 263995 307095 -60246 -110058 -55986 -357488 172633
5739 -137138 -206245 323400 153494 242883 -41510 104503 295881 176044 -28112 -96967 -194586
5728 -194586 -114145 -205938 -17520 92194 206758 158181 179348 25648 -189767 -193798 322973
5716 108001 257279 -145404 -20252 -178529 -128447 -325282 110693 -116699 -79058 153961
5705 -62124 -75663 -47320 90482 -70113 -84303 7537 159726 -396148 104368 170594 165298 117051
5693 117051 101802 -66659 -291905 -149650 67684 64612 -145421 -404741 -209548 293877 -203743
5681 127425 -48446 -115808 159117 -36313 -124774 49119 225736 -19869 -147754 8387 3120
5669 -210895 58883 46367 4817 -74570 -44305 -16848 61626 383894 -10536 92525 -81718 88452
5656 143764 38120 58819 -166242 33969 131113 87005 -301900 38553 34462 -158375 135085
5644 -179026 -87839 111875 125147 -70026 -124486 146898 -71670 -261669 -64231 215887 -299642
5632 -5095 58092 177644 -222996 -123552 -109327 -100241 -60941 5337 124369 401007 10742 344299
5620 344299 -400245 38869 -108227 175004 -133105 -364295 -402261 -75433 66338 257633
5610 257633 238279 94704 -422425 -161970 -18394 -283875 -92136 -373566 -120060 14373 131162
5599 131162 -43927 -153961 193325 -55497 -126886 -159425 136924 -128977 22412 413756 212731
5588 212731 -310591 -329891 65772 169964 -183577 -237681 40701 -48040 272690 106079 -124938
5576 -116176 -59169 -281338 -34546 302243 142207 -210877 -8413 179765 -223713 362479
5565 265342 104799 3997 -8562 -37142 118758 -318014 180146 227549 192801 -186681 -114503
5554 -114503 -90982 214389 64140 566764 169139 343165 -126974 365243 -1742 -240493
5544 -240493 -78561 -285123 -98547 -59942 57421 68422 -233402 179957 -53729 -140164 151614
5532 291532 140988 -410329 31895 -228035 -84116 52900 -358212 143529 153451 -66981 119009
5520 -120509 63767 137920 -121755 80275 83247 -161811 -87186 199180 64291 -101396 -243588
5509 -243588 165435 -85422 312923 -231720 104240 90528 -350766 -295716 216196 78177
5498 -13664 269144 -31399 54434 32670 67576 50740 -312100 73336 -4546 -16212 -350814
5487 -350814 104034 -105637 -115232 301234 -118207 130142 -196104 7376 -141293 249309
5476 16937 26878 133686 65654 -217247 -231847 223144 1802 188578 6032 52779 201737
5465 201737 168756 153803 -188745 -153113 -295867 -452121 37610 -25420 145247 -105005 13158
5453 208251 -337484 214076 31462 75253 -169274 -162176 -123789 -31174 53212 268282 56835
5441 -130308 -16239 -70176 235700 121592 -131736 -179651 55884 -150173 81814 -133939 -263318
5430 -263318 -119761 171182 107843 -166686 226224 85811 370936 -82111 -473743 350765
5419 140491 -27838 350750 -19794 -468212 -142658 -99895 7013 -154225 -228669 179175 -213453
5407 -37166 -226260 47453 215711 266942 -86772 -65017 50158 265204 -146484 213755 -131420
5395 -15928 -8280 -140514 280326 53200 36114 -22142 195028 -219919 104050 113824 -2646
5383 85250 56432 -12783 37987 -161452 -190311 -152131 32161 -228365 -26149 251911 68453
5371 -86205 -137645 -124342 370721 121833 -264224 44353 32427 355615 -265342 -80206 -142605
5360 -142605 -115369 4997 259003 -80295 155654 305178 -160096 44099 181108 17889 -463348
5348 -68875 253590 -12170 -48551 11279 170417 -352314 111216 -9637 1074 -500049 180985
5336 47630 -63806 50106 35761 -122383 -777 210615 -42483 93660 -71727 23231 -121261 87944
5323 -103169 75423 -60512 -107935 -269373 -103611 15209 14745 -331075 -120431 -29593 -189317
5312 -189317 -114893 -103933 48564 91445 -128105 144990 -200868 35424 388181 -201372 203112
5300 126594 -84212 -189937 366285 40730 -124281 -189365 96253 290304 -89706 -377928 11971
5288 108353 46129 511607 398206 -240059 -21290 -89845 -58939 90706 -93408 143649 -71333
5276 -239239 19581 -117123 72405 -93708 88032 -177374 55915 -109329 82822 220045 -67082
5264 48423 2898 40524 288441 -139853 -133071 125636 301373 -58582 -58016 120551 186088 258935
5252 258935 147904 -64417 -183715 107625 188258 -19962 -173406 200190 1470 -7741 242407
5240 69064 -16125 -69319 -164541 46162 -83435 -200575 -104185 -14614 -44928 216114 -157530
5228 -520910 -4661 -249900 261278 175758 27701 -5136 16704 -251910 -34882 -38064 -86939 -164845
5216 -164845 -70251 150822 96973 237880 7942 6951 -13979 -192630 -284233 -195930 -335197
5205 -335197 -110735 -46320 -35418 96180 143717 -173075 261201 -67345 260761 -141950 200070
5193 43441 114297 -8736 52889 133743 -182170 28967 -127790 298364 -151604 154909 -347296
5181 120622 62261 -78471 -365833 233599 -301501 198775 239466 194304 -88578 -71357 -215036
5170 -215036 36361 13316 107068 -21364 24255 -3572 -119604 -51768 -69923 57545 50486 -296656
5157 220116 65533 -105535 -173189 -338579 446348 -25618 29105 121548 28661 -35972 -12708
5145 206265 -125850 39376 -68809 -97549 50393 116138 -136427 229154 -284976 24471 9116
5133 -124295 78194 62424 -61993 -110510 -73895 -390927 -175589 84812 193860 -118415 433559
5121 196024 -5149 -27694 -263411 -366898 94644 -63336 108120 20376 -88758 91507 -2255
5109 -230095 225482 -91315 -113001 160375 -120328 6731 14308 142232 254932 -18478 -138584
5098 -138584 45406 -223605 -271300 -157774 -406941 12757 26864 353088 206102 29116 -28229
5086 2717 226893 82427 -111946 17592 -97910 -5942 263120 -83616 -170314 -34625 225452
5074 29197 180982 46222 134764 -123213 -167926 -197669 -158053 225391 284961 39130 -6175
5062 -411118 25422 -315052 -102773 -59050 975 37093 -27919 -169563 48324 225850 26676
5050 -174535 20997 -85327 99225 -268548 185274 94658 -209679 -163737 -28261 28953 -111141
5038 168110 -32525 -20087 -56001 -121272 -132998 -158364 -409532 -160562 237599 -130513 43365
5026 68386 -94462 227985 86572 -91019 68712 -288 -49616 89498 -199236 3152 -233903 351928
5013 1969 128602 257288 148548 40220 54161 -65378 -85432 -16452 -12877 -64477 -181954
5002 -181954 226633 37855 19177 -136315 115290 124625 -88556 437768 179020 146739 -120387
4990 -126360 -13948 -61049 208068 -39609 -121648 -27726 200043 62752 311515 41774 -116022
4978 51513 16622 -166233 186297 64558 226217 -200828 -164717 2706 -90955 382320 59303
4966 -73541 121402 101843 -73381 129998 86111 -56027 -165175 -83866 23061 -33535 -199740
4955 -199740 -68940 -154319 -54686 -241220 -81563 290522 266459 -52103 17566 5001 480 292718
4943 292718 171620 115871 215860 157878 119860 5637 215608 215256 276813 234900 54482 -1766
4930 61081 -26052 8996 -65832 159735 183004 -203081 124932 232531 218902 96854 -77676
4918 70572 468255 -135115 -11155 -43908 -268107 -112061 -19468 371281 139122 308720
4908 308720 -148642 -182972 -6416 90895 203152 -179164 43926 184094 162095 -331652 145806
4896 -14201 153731 -22834 -217724 280994 327030 -289200 -163510 -156639 -39232 259027 -150506
4884 -238919 190653 -228333 127782 -188140 -189933 -155517 -89047 92201 -30154 -27289 52675
4872 161238 114507 73978 -68340 277546 -30272 197415 244174 32640 145006 -128491 -288229
4861 -288229 -24580 -142947 54786 54436 11646 104580 -171036 -196742 -71552 44576 -164783
4849 126445 181650 73747 -98650 -158352 -111624 -58654 -224411 7254 132692 345660 -1757
4837 185517 -162650 2860 -313297 -198087 -99174 -131511 -277188 -16229 44410 -18520 -56214
4826 -56214 -87436 -204120 -51920 -34702 -171203 102643 -500591 -130040 -173659 27096 52453
4815 52453 107689 -231990 -54281 350062 -126777 227816 -57505 -214704 -104066 274945
4804 -92448 90531 170500 -217401 241890 4067 43661 65062 -46874 -58643 -91284 116342
4792 -167642 29240 170558 138672 10114 -277654 -232304 -89318 -86966 141280 232590 -221545
4780 66804 -44289 85195 -289915 10292 -109975 -48537 38619 -271506 115156 128002 -28761
4768 80624 -166455 152351 -147509 -261047 -87149 154551 65942 29594 271095 -183851
4757 -97824 -44966 180606 -143253 -94954 -316028 18938 -409321 47888 138042 103615 246084
4746 246084 -196668 15807 190195 28950 74826 -4809 -28156 37560 -46262 263619 229012
4735 229012 -119919 -88099 -48323 -117760 219592 -97038 383778 -114053 17599 84898 8942
4723 -129948 -150503 58176 155626 -358881 -121226 -160558 133160 69970 -61672 -134889 -156499
4712 -156499 -54804 -94218 -52190 -83912 -28064 37529 -183099 -100494 189291 -89279 -275500
4701 -275500 181769 254522 269923 -49316 -99626 -32598 175699 28524 -21087 310810 155429
4690 155429 89183 -75517 -155609 401223 -161164 -161563 208241 64086 451697 96256 -141922
4678 112657 90414 475891 -184315 -7328 19014 -3798 179029 -39332 -329319 154069 -1869
4666 20505 106435 -38461 -51166 208903 48335 170248 -157916 163352 -134101 447648 -151703
4654 -134520 -107002 -371318 58551 -80904 -180817 13431 22297 8340 9174 115610 -15724 -105717
4642 -105717 -211624 -256457 -80803 92327 -444077 69773 43247 41513 140676 -214967 24358
4630 -11797 203967 98942 123040 93859 1577 -97095 43139 164290 2995 -8036 333193 100627
4617 49718 36337 29918 27823 -54436 152575 -3098 -40442 138829 205883 211110 -69717 -166437
4605 -166437 142086 115701 29761 -30471 244428 56694 127886 85545 179902 -121596 -12941
4593 65406 -117260 44405 63631 26779 -56093 -408817 -96659 -312681 -41765 45615 31732
4582 31732 -28241 -168636 111254 69922 273075 -120982 208781 24276 95225 232938 252405
4571 252405 350042 -19131 57011 117665 76240 -24897 123115 351214 -100287 107470 -42103
4559 127074 -88865 -36311 9758 94048 -130751 -10855 39610 30066 54703 186162 121494 17452
4546 -255152 313785 -95812 93111 214301 63381 57925 166997 315506 103684 -57272 95174
4534 -199602 -173505 -227683 -142858 -141662 -65169 -296066 -138875 320510 -360598 -237419 210053
4522 149006 30490 -8614 51992 93381 -103522 -54687 -264010 -246154 8943 155714 -239425
4510 282046 -147296 51651 -339334 -148260 -37966 80321 74885 112299 -238594 96488 97481
$$ [...]
##END NTUPLES=NMR SPECTRUM
##END=
