##TITLE=AC1539_ROEFFECT0011_8214524_ESldt897ex
##JCAMPDX= 6.0         $$ Bruker NMR JCAMP-DX V2.0
##DATA TYPE= NMR SPECTRUM
##DATA CLASS= NTUPLES
##ORIGIN= BRUKER
##OWNER= Administrator
$$ 1.72 TOPSPIN		Version 2.1
$$ 2013-10-11 18:35:29.874 -0700  Administrator@X
$$ Compression mode = diff/dup
##.OBSERVE FREQUENCY= 400.02188249412
##.OBSERVE NUCLEUS= ^1H
##.ACQUISITION MODE= SIMULTANEOUS (DQD)
##.ACQUISITION SCHEME= undefined
##.AVERAGES= 8
##.DIGITISER RES= 22
##SPECTROMETER/DATA SYSTEM= spect
##.PULSE SEQUENCE= zg30
##.SOLVENT NAME= COFFEE_meoh
##.SHIFT REFERENCE= INTERNAL, COFFEE_meoh, 1, 14.98509
##AUDIT TRAIL= $$ (NUMBER, WHEN, WHO, WHERE, PROCESS, VERSION, WHAT)
$$ ##TITLE= Audit trail, TOPSPIN		Version 2.1
$$ ##JCAMPDX= 5.01
$$ ##ORIGIN= Bruker BioSpin GmbH
$$ ##OWNER= Administrator
$$ $$ E:\/data/COFFEE/nmr/AC1539_ROEFFECT0011_8214524_ESldt897ex/10/pdata/1/auditp.txt
$$ ##AUDIT TRAIL=  $$ (NUMBER, WHEN, WHO, WHERE, PROCESS, VERSION, WHAT)
(   1,<2013-10-11 18:35:23.170 -0700>,<Administrator>,<X>,<go>,<TOPSPIN 2.1>,
      <created by zg
	started at 2013-10-11 18:34:17.389 -0700,
	POWCHK enabled, PULCHK disabled,
       configuration hash MD5:
       C8 4E 4E 5D D3 5C D8 9E 9F 52 82 E0 59 8A DE 15
       data hash MD5: 64K
       ED C7 E9 91 6C 6E 6E 3E 75 05 88 37 10 89 55 38>)
(   2,<2013-10-11 18:35:26.108 -0700>,<Administrator>,<X>,<proc1d>,<TOPSPIN 2.1>,
      <Start of raw data processing
       efp LB = 0 FT_mod = 6 PKNL = 1 PHC0 = 0 PHC1 = 0 SI = 32K 
       data hash MD5: 32K
       C3 83 E8 AE A4 F2 9A 82 9F B9 A8 C1 95 EF 76 BA>)
(   3,<2013-10-11 18:35:26.389 -0700>,<Administrator>,<X>,<proc1d>,<TOPSPIN 2.1>,
      <pk PHC0 = 95.24597 PHC1 = 0 
       data hash MD5: 32K
       1D 72 C8 FB 1D A4 8A C2 20 27 71 3F 14 17 9F 2B>)
(   4,<2013-10-11 18:35:26.483 -0700>,<Administrator>,<X>,<proc1d>,<TOPSPIN 2.1>,
      <abs ABSG = 1 
       data hash MD5: 32K
       62 B5 4D D8 0B D7 BC 12 D6 E2 76 0C 68 C5 FC D1>)
(   5,<2013-10-11 18:35:26.592 -0700>,<Administrator>,<X>,<proc1d>,<TOPSPIN 2.1>,
      <abs ABSG = 2 
       data hash MD5: 32K
       C7 4E 11 47 C1 E7 BF A5 BC 8C C6 68 D0 EA 09 5B>)
(   6,<2013-10-11 18:35:26.655 -0700>,<Administrator>,<X>,<proc1d>,<TOPSPIN 2.1>,
      <abs ABSG = 3 
       data hash MD5: 32K
       C5 39 75 FE 88 0A 31 49 0D CF 94 4A 4D 0F DB 6A>)
(   7,<2013-10-11 18:35:26.717 -0700>,<Administrator>,<X>,<proc1d>,<TOPSPIN 2.1>,
      <abs ABSG = 4 
       data hash MD5: 32K
       8C CF 1B 9B CD A4 A8 1F CD FA 09 57 BC B4 A6 4B>)
(   8,<2013-10-11 18:35:26.764 -0700>,<Administrator>,<X>,<proc1d>,<TOPSPIN 2.1>,
      <abs ABSG = 5 
       data hash MD5: 32K
       84 31 5C 62 50 FA B6 C3 D8 50 F5 8A 49 23 11 43>)
$$ ##END=
$$ 
$$ $$ hash MD5
$$ $$ 33 B4 D3 52 6D A6 3F ED 45 6B 01 9F 8C 2F 70 F0
##$RELAX= 
##$RELAX= 
##$RELAX= 
##$RELAX= 
##$RELAX= 
##$RELAX= 
##$RELAX= 
$$ Bruker specific parameters
$$ --------------------------
##$DU= <E:\>
##$EXPNO= 10
$$ [...]
150 150 150 150 150 150 150 150
##$TP07= 0
##$TPNAME0= <>
##$TPNAME1= <>
##$TPNAME2= <>
##$TPNAME3= <>
##$TPNAME4= <>
##$TPNAME5= <>
##$TPNAME6= <>
##$TPNAME7= <>
##$TPOAL= (0..7)
0.5 0.5 0.5 0.5 0.5 0.5 0.5 0.5
##$TPOFFS= (0..7)
0 0 0 0 0 0 0 0
##$TUNHIN= 0
##$TUNHOUT= 0
##$TUNXOUT= 0
##$USERA1= <user>
##$USERA2= <user>
##$USERA3= <user>
##$USERA4= <user>
##$USERA5= <user>
##$V9= 5
##$VALIST= <valist>
##$VCLIST= <CCCCCCCCCCCCCCC>
##$VD= 0
##$VDLIST= <DDDDDDDDDDDDDDD>
##$VPLIST= <PPPPPPPPPPPPPPP>
##$VTLIST= <TTTTTTTTTTTTTTT>
##$WBST= 1024
##$WBSW= 4
##$XGAIN= (0..3)
0 0 0 0
##$XL= 0
##$YL= 0
##$YMAX_a= 659391
##$YMIN_a= -560388
##$ZGOPTNS= <>
##$ZL1= 120
##$ZL2= 120
##$ZL3= 120
##$ZL4= 120
##$ABSF1= 14.98509
##$ABSF2= -5.573092
##$ABSG= 5
##$ABSL= 3
##$ALPHA= 0
##$AQORDER= 0
##$ASSFAC= 0
##$ASSFACI= 0
##$ASSFACX= 0
##$ASSWID= 0
##$AUNMP= <proc_prof1d_extract_pilot.lims>
##$AXLEFT= 0
##$AXNAME= <>
##$AXNUC= <1H>
##$AXRIGHT= 0
##$AXTYPE= 0
##$AXUNIT= <>
##$AZFE= 0.1
##$AZFW= 0.1
##$BCFW= 0
##$BC_mod= 0
##$BYTORDP= 0
##$COROFFS= 0
##$CY= 15
##$DATMOD= 1
##$DC= 0
##$DFILT= <>
##$DTYPP= 0
##$F1P= 0
##$F2P= 0
##$FCOR= 0.5
##$FTSIZE= 32768
##$FT_mod= 6
##$GAMMA= 0
##$GB= 0
##$INTBC= 1
##$INTSCL= 1
##$ISEN= 128
##$LB= 0
##$LEV0= 0
##$LPBIN= 0
##$MAXI= 10000
##$MC2= 0
##$MEAN= 0
##$ME_mod= 0
##$MI= 0
##$NCOEF= 0
##$NC_proc= -8
##$NLEV= 6
##$NOISF1= 0
##$NOISF2= 0
##$NSP= 0
##$NTH_PI= 0
##$NZP= 0
##$OFFSET= 14.98509
##$PC= 1
##$PHC0= 95.24597
##$PHC1= 0
##$PH_mod= 1
##$PKNL= yes
##$PPARMOD= 0
##$PPDIAG= 0
##$PPIPTYP= 0
##$PPMPNUM= 2147483647
##$PPRESOL= 1
##$PSCAL= 4
##$PSIGN= 0
##$PYNMP= <proc.py>
##$REVERSE= no
##$SF= 400.02
##$SI= 32768
##$SIGF1= 0
##$SIGF2= 0
##$SINO= 400
##$SIOLD= 32768
##$SPECTYP= <>
##$SREGLST= <1H.CDCl3>
##$SSB= 0
##$STSI= 32768
##$STSR= 0
##$SW_p= 8223.68421052631
##$SYMM= 0
##$S_DEV= 0
##$TDeff= 65536
##$TDoff= 0
##$TI= <>
##$TILT= no
##$TM1= 0
##$TM2= 0
##$TOPLEV= 0
##$USERP1= <user>
##$USERP2= <user>
##$USERP3= <user>
##$USERP4= <user>
##$USERP5= <user>
##$WDW= 1
##$XDIM= 32768
##$YMAX_p= 460021823
##$YMIN_p= -772899
##$CURPLOT= <Network HP LaserJet P1505>
##$CURPRIN= <$Network HP LaserJet P1505>
##$DFORMAT= <normdp>
##$LAYOUT= <+/1D_H.xwp>
##$LFORMAT= <normlp>
##$PFORMAT= <normpl>
##$SURQMSG= 1
$$ End of Bruker specific parameters
$$ ---------------------------------
##NTUPLES= NMR SPECTRUM
##VAR_NAME=  FREQUENCY,     SPECTRUM/REAL,   SPECTRUM/IMAG
##SYMBOL=    X,             R,               I
##VAR_TYPE=  INDEPENDENT,   DEPENDENT,       DEPENDENT
##VAR_FORM=  AFFN,          ASDF,            ASDF
##VAR_DIM=   32768,         32768,           32768
##UNITS=     HZ,            ARBITRARY UNITS, ARBITRARY UNITS
##FACTOR=    0.250966925370066, 1,           1
##FIRST=     8223.43324360094, -292775,      -157250
##LAST=      0,             15612,           -196342
##MIN=       0,             -772899,         0
##MAX=       8223.43324360094, 460021823,    0
$$ Real data points
##PAGE= N=1
##DATA TABLE= (X++(R..R)), XYDATA
$$ [...]
$$ plain form
19528 -75567 -76952 136971 -28693 38882 -94944 -477583 -111550 -79827 -193263 -168115 -118571
19517 -118571 -266 -34903 151589 76716 230453 245628 -106345 49405 50809 -203779 -73995
19505 100479 -78587 -74741 -128098 -107045 -114243 -413097 -110421 -264303 -75065 -210824 -241134
19494 -241134 -71587 245889 -94526 -254602 53082 -125446 -307960 111656 -182533 25149
19483 -140802 -221854 172307 -65678 -121897 -249636 220000 -37540 -12657 -169161 -29929 -484628
19472 -484628 -99118 -83777 148803 209223 -27744 -110752 28993 51970 55399 -93475 -102524 -224866
19460 -224866 -203282 -219263 -234778 -94469 159618 -99633 -293882 -338431 -161361 -373832 -97373
19448 -157058 22144 184205 -235189 -222020 -4509 -178125 224802 -176067 281909 -90138
$$ packed form
19528g5567j385A36971b8693C8882i4944l82639a11550L1723j13436K5148M9544
19517a18571b66l4637A51589p4873J53737J5175a06345D9405J404b03779g3995
19505A00479g8587L846n3357K1053p198k98854a10421j53882g5065j35759l0310
19494b41134g1587B45889i4526j60076E3082a25446j82514A11656a82533B5149
19483a40802q1052A72307f5678n6219j27739B20000c7540a2657j56504b9929m54699
19472d84628i9118J5341A48803O0420b7744q3008B8993K2977L429i3475r049j22342
19460b24866K1584j5981j5515i4469A59618i9633j94249m4549a61361k12471i7373
19448a57058B2144J62061b35189J3169d509j73616B24802a76067B81909i0138
$$ plain form
19437 20224 4237 200925 24556 -124838 -284179 -65077 -43737 -11194 -99856 -108489 -184278
19426 -184278 -265903 198177 97336 159072 -211080 -236682 -151030 156308 -122882 95788 -129275
19414 -306779 170918 172257 -415458 -181935 26555 -165420 -118813 28281 71966 -65874 12673
19402 -120853 -1948 -141344 -255682 186500 -46869 18145 104181 -66137 -166117 65557 -316502
19390 321786 -340413 -57798 101393 -9206 -147393 184693 93115 -182078 287826 110811
19379 -88663 -147810 35594 -251603 63709 -249533 331805 -126108 -74226 68660 -136633 -89521
19368 -89521 200691 244072 -32763 -40525 -202983 -316703 128485 78045 -74940 164581 16113
19356 -177818 -353476 -65969 -44299 -42061 87623 151077 53498 23302 75120 297279 136089
$$ packed form
19437B0224D237J96688B4556a24838j59341f5077K1340a1194q8662q633p5789
19426a84278q1625A98177I7336O1736b11080k5602Q5652A56308a22882I5788a29275
19414c06779A70918J339d15458a81935B6555a65420M6607B8281M3685f5874A2673
19402a20853a948j39396j14338A86500d6869A8145Q6036f6137r9980F5557c16502
19390C21786c40413e7798A01393i206j38187A84693r1578a82078B87826A10811
19379h8663n9147C5594b51603F3709b49533C31805a26108N1882F8660a36633M7112
19368h9521B00691M3381c2763p762j62458j13720A28485n0440g4940A64581A6113
19356a77818j75658f5969K1670K238H7623O3454E3498B3302N1818K22159A36089
$$ plain form
19344 128865 -122906 -130369 124483 6699 15738 7381 -149019 -215658 -24000 93830 -77628 191051
19331 49788 -52131 124222 173374 -282825 -216230 16131 -234697 -152408 -252417 -164529 -231628
19320 -231628 281424 -164986 -329895 -187062 -294002 -132631 -52745 56402 36993 33955
19310 33955 -276188 82468 8368 -179193 -99654 -1347 114427 120829 28196 -341051 -172223
19299 -172223 -256140 -122158 -35938 33308 69873 94079 52728 -58477 -36540 101221 -125517
19287 -125380 -133690 38536 79210 -164142 -340697 47852 10557 -380788 91988 -288043 -132356
19275 -327398 -258350 137492 65699 61128 9682 12840 -149958 -188386 125405 -320682 -31948
19263 -60619 90225 -189901 -271321 -166935 3841 145927 184144 -5622 117087 9014 107059
$$ packed form
19344A28865a22906p463A24483F699R039G381a49019o6639b4000I3830g7628A91051
19331D9788e2131A24222M9152b82825O6595A6131b34697Q2289j00009Q7888o7099
19320b31628B81424a64986j64909J42833j06940a32631e2745E6402j9409l038
19310C3955b76188H2468H368a79193P9539a347A14427O402B8196c41051J68828
19299a72223q3917a22158c5938C3308L6565K4206m1351e8477K1937A01221a25517
19287a25380q310C8536M0674a64142j76555D7852A0557c80788I1988b88043a32356
19275c27398O9048A37492F5699m571I682L158a49958l8428A25405c20682c1948
19263f0619I0225a89901q1420J04386C841J42086L8217e622A17087I014R8045
$$ plain form
19252 107059 -235699 -8961 -134516 -18859 -9964 -324871 72828 -16651 97394 -85313 33457
19240 -117649 -33159 93193 -121104 -36790 8593 -113180 -80712 118286 -83747 196085 4881
19228 -377943 -192672 -256292 184991 -308901 -925 66930 12867 -89207 -65335 -179152 190995
19216 -75928 -141951 -628759 -131741 -149877 158 -184957 -34078 -284745 -70371 264547 -38063
19204 -178656 -176825 -178324 -424838 -46022 -74110 -55986 -291182 -37716 208916 -155940 -554
19192 225724 -43550 35894 -145456 -91724 -192340 -44646 199375 -49056 209258 115782 13875
19180 -148778 -33357 -363388 -59553 137501 28011 -209606 -313512 -128733 -501388 15393
19169 -496723 20467 6048 66440 -82639 -187822 -69481 53062 -58155 -135328 -3765 -37153 165152
$$ packed form
19252A07059b35699h961j25555a8859Q895l14907G2828a6651I7394h5313C3457
19240a17649c3159I3193a21104c6790H593a13180L2468A18286h3747A96085D881
19228c77943J85271o3620A84991c08901i25F6930A2867h9207K3872j13817A90995
19216g5928o6023m86808a31741j8136A58a84957c4078k50667g0371B64547c8063
19204a78656J831j499k46514d6022k8088J8124k35196c7716B08916a55940e54
19192B25724d3550C5894a45456N3732j00616d4646A99375d9056B09258r3476A3875
19180a48778c3357l30031e9553A37501B8011b09606j03906a28733l72655A5393
19169d96723B0467F048O0392h2639j05183f9481E3062e8155p7173c765l3388A65152
$$ plain form
19156 -5681 -152311 55646 -377309 -265098 -42135 18454 -82042 -92857 -164491 -122885 -12915
19144 -62450 -118098 -272253 -320934 2745 54370 35162 -209425 -234363 105753 128840 290496
19133 290496 -319792 210546 -153475 -135326 -62048 1784 -345778 209629 2958 -1092 62502
19121 -114066 258842 -65573 -190351 -88422 -466483 23594 -450872 28777 -332329 -244138
19111 -244138 150856 -38286 -52818 -349786 -103969 76357 -160771 -40199 -139170 -35178 -442155
19100 -442155 13908 -284731 37125 -208107 -27960 -199928 -95206 146890 -39001 236984
19089 160971 -15729 -252685 -44334 108665 281404 -250098 1768 -270718 -301579 -101196
19078 46223 -38324 70486 -434617 -127338 325299 -19787 -171951 -466009 -83691 -101390 -194242
$$ packed form
19156e681j46630E5646c77309J12211d2135A8454h2042j0815p1634M1606a2915
19144f2450n5648j54155m8681B745N1625j9208b09425k4938A05753K3087J61656
19133B90496c19792B10546a53475J8149f2048A784c45778B09629B958a092F2502
19121a14066B58842f5573j24778h8422l78061B3594d50872B8777c32329Q8191
19111b44138A50856c8286j4532k96968a03969G6357a60771d0199r8971c5178m06977
19100d42155A3908b84731C7125b08107b7960j71968i5206A46890c9001B36984
19089A60971a5729k36956d4334A08665J72739b50098A768b70718l0861a01196
19078D6223c8324G0486d34617a27338C25299a9787j52164k94058h3691j7699r2852
$$ plain form
19067 -194242 -62254 -41554 169384 -10337 125112 136628 -56659 -71125 -42803 -32069 104255
19055 417731 -74510 -209770 15808 144360 359583 107624 -62902 79498 419120 -30551
19044 307695 -44105 -98297 228252 321989 -30615 -204233 214001 -337510 233504 72909
19033 155552 362854 45501 395213 135162 101840 -185505 118407 -78555 -28287 -114212
19023 -114212 -112836 179506 333750 126305 182721 -224588 72180 264221 172378 -44287 141246
19011 -215606 -54995 -200128 -113497 452303 -276252 -2653 -120859 -126262 -73817 293357 210893
19000 210893 32328 240685 113122 13198 -188752 159705 -231525 -90136 -236117 -217564
18990 -217564 -114706 -45731 -87751 -60042 90624 -168149 -125964 56708 -59523 -52033 -20840
$$ packed form
19067a94242f2254K0700A69384a0337A25112J1516e6659j4466K8322J0734A04255
19055D17731g4510j35260A5808J28552K15223A07624f2902G9498L39622c0551
19044C07695d4105n4192B28252R3737c0615j73618B14001c37510B33504G2909
19033A55552K07302D5501L49712A35162l3322a85505A18407g8555b8287q5925
19023a14212J376A79506J54244A26305N6416b24588G2180J92041r1843d4287A41246
19011b15606e4995j45133Q6631D52303b76252b653j18206n403N2445B93357q2464
19000B10893C2328K08357A13122A3198a88752A59705b31525i0136j45981J8553
18990b17564J02858d5731m2020K7709I0624a68149M2185E6708e9523P490b0840
$$ plain form
18978 -46286 10194 -158205 -151871 49994 -41162 -33323 178076 -188987 -283917 29105 -170682
18966 -219659 -148964 -326831 -374158 -41882 328603 132425 103726 -142291 -171033 69696 210766
18955 210766 129939 -402432 -119689 -217451 -58894 100329 -86111 -142910 -170329 369287 -257278
18943 151388 36543 -374741 158162 -253909 -371340 -245938 -57818 -353981 16518 61586
18933 61586 157559 84832 227781 -212811 -370827 -49837 30852 61966 85796 -122876 -2381
18921 -99810 377901 -168085 99093 -85408 -186358 -56197 -301429 -285314 -135198 -270514
18911 -270514 -140360 -146023 -3904 112220 33089 177829 67927 -277322 67139 30653 -199153
18899 -153889 -44019 -102742 137773 -430625 -147494 12859 108882 273329 -323151 -205338
$$ packed form
18978d6286A0194a58205O334D9994d1162P839A78076a88987r4930B9105a70682
18966b19659P0695j77867m7327d1882C28603A32425k8699a42291k8742F9696J41070
18955B10766q0827d02432a19689r7762e8894A00329h6111n6799k7419C69287b57278
18943A51388C6543c74741A58162b53909j17431J25402e7818k96163A6518M5068
18933F1586R5973p2727J42949b12811j58016d9837C0852L1114K3830a22876b381
18921i9810C77901a68085I9093h5408j00950e6197k45232J6115a35198j35316
18911b70514J30154n663c904A12220C3089J44740F7927b77322F7139C0653a99153
18899a53889d4019n8723A37773d30625a47494A2859R6023J64447c23151J17813
$$ plain form
18889 -205338 34794 41232 44723 -272059 -184994 -166095 -191908 22260 159002 311038 -414563
18877 -474783 -420593 -1449 59560 -222261 103984 -242652 -15178 -60157 -111747 -81489 67995
18865 -54764 -109357 334333 -166856 14084 -118575 -203534 260396 -20830 28897 23894 -83837
18853 -335954 506252 -130322 54945 34808 288164 384385 159794 -131074 309244 258752
18843 258752 73770 194531 -49878 -60541 -205182 -23837 -107918 -179970 -56531 -174588 -212704
18832 -212704 -131163 -60433 37234 -44647 -260922 76386 -66956 -446082 -102369 -19837 -28736
18821 -28736 -182641 -105391 -65896 -14458 -6840 3996 -25509 -85706 59641 -136897 190947
18809 36002 290682 -54866 -183629 -98547 85216 -55963 -256549 -48611 465404 -31090 -305082
$$ packed form
18889b05338C4794O438L491b72059Q7065J8899k5813B2260J36742J52036d14563
18877d74783N4190a449E9560b22261A03984b42652a5178m4979n1590L0258F7995
18865e4764n4593C34333a66856A4084a18575q4959B60396b0830B8897n003h3837
18853c35954E06252a30322E4945k0137K53356R6221A59794a31074C09244n0492
18843B58752G3770J20761d9878j0663j44641b3837q4081p2052e6531j18057l8116
18832b12704Q1541f0433C7234d4647k16275G6386f6956l79126a02369a9837q899
18821b8736j53905P7250L9495a4458f840C996b5509o0197E9641a36897A90947
18809C6002K54680e4866j28763Q5082H5216e5963k00586d8611D65404c1090k73992
$$ plain form
18798 -305082 67508 2195 -105270 69901 -112179 69303 -155029 -428 -136824 -5312 -78141
18787 -78141 -144094 71240 -124546 225589 -130937 -20895 -205740 -217774 -49214 -45392 -114556
18776 -114556 69649 -113982 290398 80880 -132867 -179514 59538 11117 -143229 48867 3759
18764 159749 56200 205860 -69314 -161488 142809 -134370 64166 -117530 4571 -13369 -174282
18753 -174282 -6335 -13083 -406522 85821 304590 -101401 -12832 -347994 -359 135849 9743
18741 -176985 91039 -132784 219991 105126 -158633 -188047 -113606 -237099 -110866 -167406
18731 -167406 14924 -5013 160484 -373664 23527 177234 -1668 29968 324634 -292690 -529107
18720 -529107 -127736 -269482 74219 -105344 161287 16341 -259340 -308797 320300 -231424
$$ packed form
18798c05082F7508B195a05270F9901a12179F9303a55029d28j36396e312p2829
18787g8141o5953G1240a24546B25589a30937b0895j84845j2034d9214L822o9164
18776a14556F9649a13982B90398H0880a32867m6647E9538A1117a43229D8867C759
18764A59749E6200J49660f9314r2174A42809a34370F4166a17530D571a3369j60913
18753a74282f335o748l93439H5821K18769a01401a2832l35162c59A35849I743
18741a76985I1039a32784B19991A05126a58633k9414P4441j23493a10866n6540
18731a67406A4924e013A60484c73664B3527J53707a668B9968K94666b92690k36417
18720e29107a27736j41746G4219a05344A61287A6341b59340m9457C20300b31424
$$ plain form
18709 -61207 86565 -271707 -501251 -154858 -22326 -120436 -120550 234558 -27793 -23318 227028
18697 -74892 -303028 170164 74068 44126 144326 196172 132101 85793 -56301 -58071 3619
18685 -91282 -166655 19994 -257603 -52086 -192228 -255568 -84944 181484 174825 -86499 136629
18673 114544 218392 -44144 -14841 -167834 -46324 -31418 -176635 -125228 292281 50667 -146466
18661 59744 29208 106881 128997 231943 68659 -86988 210738 -479476 -307580 186087 186382
18650 186382 -267810 -1793 22981 165588 -150951 43069 142308 312734 95514 -185140 -218956
18639 -218956 45992 157410 -93809 184490 -47825 -236118 -42086 -235584 4873 -166676 333509
18627 235447 -198524 -272915 -223412 103406 -181434 87941 -237541 -135682 -53176 123084
$$ packed form
18709f1207H6565b71707k29544a54858b2326r8110j14B34558b7793M475B27028
18697g4892k28136A70164G4068k9942J00200N1846o4071m6308e6301j770C619
18685i1282p5373A9994b57603e2086j40142o3340h4944A81484o659h6499A36629
18673A14544J03848d4144a4841j52993d6324J4906j45217N1407B92281E0667a46466
18661E9744B9208P7673K2116J02946F8659h6988B10738d79476J71896A86087K95
18650A86382b67810a793B2981J42607a50951D3069R9239J70426I5514a85140l3816
18639b18956D5992J11418i3809A84490d7825j88293d2086j93498D873a66676C33509
18627B35447a98524p4391M9503A03406a81434H7941b37541J01859e3176A23084
$$ plain form
18616 103166 -50371 165145 -78632 -345626 -291035 -172265 25825 -112929 -166870 32587 -192357
18604 -158565 -52636 -35631 142501 70921 -37351 -99899 69007 -22764 22362 13413 349733
18593 349733 66387 -534601 56677 -81110 27808 -28054 -1108 -312039 38168 -259769 61258
18581 -129661 -255767 -132331 -66253 244787 -108781 -106980 134325 -283463 11770 -79411
18570 -135501 7935 -265642 277179 493031 52457 -23145 -233059 25290 153228 111885 -28272
18558 -337266 -87754 137257 -95709 -198589 -177082 -177470 -128727 -179117 178826 -104191 -112356
18547 -112356 -13980 -56643 47699 -200274 -80628 37568 -12929 -300876 -80197 -215114 -36800
18535 -172150 -141876 -12755 -133494 118171 -7963 -134391 -249310 -328491 -11442 -180495 -67663
$$ packed form
18616A03166e0371A65145g8632k66994N4591J18770B5825a12929n3941C2587a92357
18604a58565e2636J7005A42501G0921c7351o2548F9007b2764B2362q949L36320
18593C49733F6387e34601E6677h1110B7808b8054a108l10931C8168b59769F1258
18581a29661j26106J23436O6078B44787a08781J801A34325b83463A1770g9411
18570a35501G935b65642B77179K15852E2457b3145k09914B5290J27938m1343b8272
18558c37266h7754A37257i5709j02880K1507l88M8743n0390A78826a04191q165
18547a12356a3980m2663D7699b00274h0628C7568a2929k87947h0197j34917c6800
18535a72150L0274a2755j20739A18171g963j26428j14919p9181a1442j69053f7663
$$ plain form
18523 204113 232593 233953 -135105 62053 112604 78207 242734 -251874 -15922 218593 -252438
18511 -127828 191037 -59044 100840 -33862 -218162 68028 -100361 -305373 144641 -3641
18500 -166679 61903 -168121 -248911 -207067 25588 -160185 -441370 176937 46885 25334 219120
18489 219120 -288528 -207758 -112664 83070 125239 -86734 -78746 -14267 113553 -206180 -218228
18478 -218228 193481 20813 87942 -55913 -2720 -332948 -144008 -80714 42348 -152677 165447
18466 -83524 39566 -171495 -47565 64356 -205044 -40393 93220 -59590 160763 67627 -340586
18454 -34053 -181343 -210345 -447696 -139081 -145476 -37662 -1537 79967 -31980 -192550 225003
18442 30205 66388 -93474 97781 -144290 112575 65705 -116902 -54790 -329125 -195602 -27108
$$ packed form
18523B04113K8480J360a35105F2053N0551l4397J64527b51874a5922B18593b52438
18511a27828A91037e9044A00840c3862j84300F8028a00361k05012A44641c641
18500a66679F1903a68121q0790M1844B5588a60185k81185A76937D6885k1551J93786
18489B19120b88528Q0770R5094H3070M2169h6734P988a4267A13553b06180j2048
18478b18228A93481B0813O7129e5913b720l30228a44008O3294D2348a52677A65447
18466h3524C9566a71495d7565F4356b05044d0393I3220e9590A60763F7627c40586
18454c4053j47290k9002k37351a39081o395c7662a537G9967c1980j60570B25003
18442C0205L6183i3474I7781a44290A12575m6870a16902e4790k74335J33523b7108
$$ plain form
18430 -31876 -127723 -78762 -199443 -3035 -264572 12005 -117184 -154182 118795 -16154 -181698
18419 -181698 109798 66132 142860 -60116 53950 -14450 -199168 -91261 -84873 220924 -14024
18407 92949 241691 292452 -82151 -182182 -13451 9332 107982 -208333 243142 -40978 -33846
18396 -33846 -146060 51444 -33090 -90679 36977 -35310 -152910 108790 2668 -159556 250849
18384 -297831 -115267 -80104 -146946 -118787 -85273 224863 19534 -49817 140924 48433 16418
18372 90265 -107605 -300247 -26544 -57891 96004 -41753 -290296 96224 48763 151615 12269
18360 -123889 -113899 56121 -132890 -10827 409768 -180024 -226654 -158083 265988 -44254 123734
18348 -252625 -157926 272610 -84085 52581 242455 133110 -75039 -156140 -370053 -42833 -189732
$$ packed form
18430c1876r5847M8961j20681c035k61537A2005a17184l6998A18795a6154j65544
18419a81698A09798m3666P6728f0116E3950a4450j84718i1261O388B20924a4024
18407I2949J48742N0761h2151j00031a3451I332R8650b08333B43142d0978P132
18396c3846j12214E1444c3090n7589C6977c5310j17600A08790B668a59556B50849
18384b97831a15267L5163o6842K8159L3514B24863A9534d9817A40924D8433A6418
18372I0265a07605j92642b6544l1347I6004d1753k48543I6224m7461J02852A2269
18360a23889R990E6121a32890a0827D09768a80024m6630O8571B65988d4254A23734
18348b52625R4699B72610h4085E2581J89874j09345g5039q1101k13913d2833j46899
$$ plain form
18337 -189732 2408 50475 35027 105906 -221123 55986 196719 -156404 100665 -47174 20543
18325 304083 -943 322463 110211 -1873 219169 155 93151 316205 -187557 -74865 -269084
18314 -269084 -237887 -309631 -80285 32349 -163425 -207876 53873 245078 -116023 -131393 82126
18302 54791 -144960 -201416 -390354 -50923 -153795 -204384 181409 -35499 -85803 -516470 124589
18290 1838 86773 -277071 -349723 135404 -320222 -129603 -105591 72560 -173948 -146206 -106025
18279 -106025 12287 -73886 189525 48040 -34498 -315746 78687 111812 358559 125513 184528
18268 184528 -298926 -389807 36740 251603 -163251 114042 106841 -199163 39257 268708
18258 268708 -438195 -10837 10341 -260550 160812 -99531 -165103 -205009 -17785 -90472 277230
$$ packed form
18337a89732B408M8067j5448P0879b21123E5986J40733a56404A00665d7174B0543
18325C04083i43C22463A10211a873B19169A55R2996K23054a87557g4865j94219
18314b69084L1197p1744h0285C2349a63425m4451E3873J91205a16023j5370H2126
18302E4791a44960n6456j88938e0923j02872n0589A81409c5499n0304m30667A24589
18290A838Q4935b77071p2652A35404c20222a29603K4012G2560a73948K7742M0181
18279a06025A2287g3886A89525D8040c4498k81248G8687L3125K46747A25513N9015
18268A84528b98926r0881C6740K14863a63251A14042p201a99163C9257K29451
18258B68708d38195a0837A0341b60550A60812i9531o5572l9906a7785p2687B77230
$$ plain form
18246 36085 -87963 42611 142564 115601 253910 22673 -385161 -137584 156477 97051 1396
18234 4650 278182 55936 32723 -49726 36354 87786 110934 19802 116383 -63895 -2066 -366359
18222 -366359 -318962 -218966 -49934 -200034 19367 83982 221402 288106 -37466 211025 25825
18210 -71840 4614 370057 201830 30927 -267431 178700 -273636 -19020 253579 -233539
18199 -35098 -95772 101175 -7944 -392604 -27347 183411 -70364 -223754 239287 135287 -12683
18187 -74555 34262 -127220 -11046 335028 120403 54960 -180152 -114490 154812 -75154 -172716
18176 -172716 77391 -28362 -5644 118033 -156760 -124734 -146731 93978 -409136 10463 85229
18165 85229 52333 -152946 -205203 35610 -185114 -35940 -83652 -150991 238763 59037 -8615
$$ packed form
18246C6085h7963D2611R9953k6963J38309B2673c85161a37584A56477n9426A396
18234D650K73532E5936k3213d9726C6354N1432K3148A9802R6581f3895b066l64293
18222c66359M7397R9996d9934j50100A9367O4615J37420O6704c7466B11025B5825
18210g1840D614L65443j68227C0927b67431A78700b73636a9020B53579b33539
18199c5098o0674A01175g944l84660b7347A83411g0364j53390B39287j04000a2683
18187g4555C4262a27220a1046C35028A20403E4960a80152O5662A54812g5154r7562
18176a72716G7391b8362e644A18033a56760L2026k1997I3978d09136A0463P4766
18165H5229l2896a52946n2257C5610a85114c5940m7712o7339B38763E9037h615
$$ plain form
18153 -274943 224238 -335579 -48304 182867 317873 -234997 -16920 61663 -109593 -44031
18142 -22286 -24512 -246913 111465 -126393 171221 -140556 177969 -9325 11147 32260 78565
18131 78565 103240 -280016 -166035 258956 -256625 -91395 131949 -25605 -161022 30900
18120 56188 -149430 -165237 -199025 -24649 -61044 11074 -84044 17393 -135054 -71187 4357
18108 103708 46329 198498 307192 150837 -159034 -173452 112244 -173298 -32763 -37327
18098 -37327 316145 -101585 288679 -286332 -120537 104541 127012 204681 -280978 -52127
18087 -191453 -1949 -100049 -278413 3357 85075 111307 34024 -147524 122198 386684 130421
18075 -197007 -37682 -62267 -53686 -158843 -137373 52179 -113426 -32105 186096 119265 -197222
$$ packed form
18153b74943B24238c35579d8304A82867J35006b34997a6920F1663a09593d4031
18142b2286k226k22401A11465a26393A71221a40556A77969i325A1147K1113M6305
18131G8565K4675b80016J13981B58956b56625i1395A31949b5605j35417C0900
18120E6188a49430j5807l3788b4649l6395A1074h4044A7393a35054O3867D357
18108A03708D6329J52169J08694A50837a59034j4418A12244a73298c2763m564
18098c7327C16145a01585B88679b86332a20537A04541K2471P7669b80978e2127
18087a91453a949r8100j78364C357Q1718K6232C4024a47524A22198K64486A30421
18075a97007c7682k4585Q581j05157K1470E2179a13426c2105A86096o6831a97222
$$ plain form
18063 -113272 126260 -108870 -103497 -314568 51610 150877 -22216 120803 -148189 106716
18052 -262439 256651 -172166 70722 -231417 -14016 -256553 7102 138994 -156348 105840
18041 59719 -86581 95657 -67702 -34677 -25653 206780 -223868 95001 1437 -193233 98600
18029 -40332 117545 -295808 80623 231013 -199042 52222 176878 59845 -254338 -296929
18019 -296929 144235 212755 84505 -206045 172084 -174195 -108093 -166900 -142491 -118589 53351
18007 -451009 -320674 76025 -80390 -60466 239140 249054 216267 -135593 -152566 -91114 60140
17995 83603 -76209 72238 24183 -119695 192987 64066 -156955 342476 -180814 -261696 -189122
17984 -189122 -146637 -75634 331432 128598 181240 -324906 -182533 -176902 -230512 -40749 -121881
$$ packed form
18063a13272A26260a08870N373k11071E1610R9267b2216A20803a48189A06716
18052b62439B56651a72166G0722b31417a4016k42537G102J31892a56348A05840
18041E9719h6581I5657f7702L3025R024B06780b23868I5001A437a93233I8600
18029d0332A17545b95808H0623J50390a99042E2222J24656E9845b54338m2591
18019b96929A44235O8520H4505b06045A72084a74195O6102n8807K4409K3902E3351
18007d51009J30335G6025h0390J9924B39140R914l2787a35593j6973O1452F0140
17995H3603g6209G2238B4183a19695A92987F4066a56955C42476a80814q0882P2574
17984a89122M2485P1003C31432A28598N2642c24906J42373N631n3610d0749q1132
$$ plain form
17973 -121881 242971 -149469 -22260 -295843 -45862 -52729 -75155 174380 52286 -19398 -55265
17962 -55265 284562 -90366 -6848 70614 -149059 -99246 -58973 253103 18400 8020 -79662
17950 273175 -21665 4304 -113225 -104324 9331 235543 -216256 149597 -18020 186530 127565
17939 127565 -102504 133948 -14858 -264906 -261531 -113909 -90325 73546 -318966 -202427
17929 -202427 -233708 -222744 298118 217787 112415 172625 91531 -71039 -23561 -21845 140155
17917 53443 -235025 -239364 162292 -122254 263200 187175 8762 -264626 141988 -173632 179131
17905 71706 -117236 -99603 234877 -256655 -268898 -131969 224622 373690 12318 448792
17895 448792 -14287 -35524 -51032 76001 290733 -69402 38377 156260 -198728 -14350 211429
$$ packed form
17973a21881B42971a49469b2260k73583d5862o867k2426A74380E2286a9398l5867
17962e5265B84562i0366f848G0614a49059M9813M0273B53103A8400H020g9662
17950B73175b1665D304a13225Q901I331K26212b16256A49597a8020A86530n8965
17939A27565a02504A33948a4858k50048L375a13909K3584G3546c18966J16539
17929b02427l1281J0964B98118q0331j05372O0210q1094g1039b3561J716A40155
17917E3443b35025m339A62292a22254B63200p6025H762b64626A41988a73632A79131
17905G1706a17236J7633B34877b56655j2243a31969B24622J49068A2318M36474
17895D48792a4287k1237j5508G6001K14732f9402C8377J17883a98728a4350B11429
$$ plain form
17883 79987 209964 -78900 1663 -272273 55462 153216 162730 -149020 183494 226345 -143401
17871 -244735 157435 -41438 157479 -191481 9621 22992 90568 22920 127505 -336317 -345189
17860 -345189 -56795 -250904 -107218 67456 132240 95716 -292411 333201 -204720 -50802
17849 204077 4166 -219368 -382243 -136691 -99968 -169763 -59033 -115815 69837 257723 -70745
17837 116141 52168 -203530 177834 306137 -65854 153621 269734 -6939 -401425 -20984
17826 41679 -287919 -144731 -47912 -47707 -34531 -36406 -32057 122951 261929 107216 -130636
17814 282507 -63288 98979 -105026 153120 -75365 123287 95250 157474 295871 -268872
17803 30327 -363408 176804 33955 -14639 -5187 -151023 -102681 -269444 57376 -68593 -62453
$$ packed form
17883G9987J29977g8900A663b72273E5462R7754R514a49020A83494M2851a43401
17871b44735A57435d1438A57479a91481I621J3371O7576B2920J04585c36317q872
17860c45189e6795j94109a07218F7456O4784l6524b92411C33201b04720e0802
17849B04077D166b19368j62875a36691L6723o9795e9033n6782F9837J87886g0745
17837A16141E2168b03530A77834J28303f5854A53621J16113f939l94486b0984
17826D1679b87919J43188d7912K05J3176j875M349A22951J38978A07216a30636
17814B82507f3288I8979a05026A53120g5365A23287k8037O2224J38397b68872
17803C0327c63408A76804C3955a4639e187j45836M8342j66763E7376f8593O140
$$ plain form
17792 -62453 -131344 -36981 313120 218955 -142292 -287256 393275 107050 -223220 218607
17781 210844 33465 -276867 -273348 58381 120807 -151179 86917 -206473 -15800 -35277 64464
17769 -63405 150173 187321 -30427 -86778 141238 167661 87136 59242 94377 8287 59009
17758 59009 114265 245426 60209 91462 -37849 135123 199269 210660 -1106 265926 244936
17747 244936 -68333 399955 132279 -36704 223581 -24990 -50043 -118717 -146034 -19159 -188672
17736 -188672 -45014 101481 157799 -24084 278666 125647 -398779 52226 -235047 214862
17725 308717 257858 -84073 -106953 148176 55471 101473 162516 193362 -7365 -55139 -97049
17714 -97049 76370 -22923 -105609 -119403 -245330 -74679 248550 25931 -1868 63660 202937
$$ packed form
17792f2453o8891c6981C13120r4165a42292j44964C93275A07050b23220B18607
17781B10844C3465b76867L519E8381O2426a51179H6917b06473a5800j9477F4464
17769f3405A50173L7148c0427n6351A41238K6423q0525k7894L5135H287N0722
17758E9009N5256J31161F0209L1253c7849A35123O4146J1391a106B65926k0990
17747B44936f8333C99955A32279c6704B23581b4990k5053o8674k7317a9159j69513
17736a88672d5014A01481N6318b4084B78666A25647c98779E2226b35047B14862
17725C08717n0859h4073k2880A48176E5471M6002O1043L0846g365m7774m1910
17714i7049G6370b2923q2686j3794j25927g4679B48550B5931a868F3660J39277
$$ plain form
17703 202937 -132145 -55919 -61624 -183622 9808 39709 -606155 355013 190853 -179513 105362
17691 30437 -7818 9628 -145465 -145447 -41170 -112259 23276 -43721 -140267 -68135 -51379 -62236
17679 -62236 -82962 21054 -34338 120938 -162435 -552658 189333 188811 98435 179318 50236
17667 -206597 -195993 261168 123250 106775 114117 -170427 19367 -379946 -272638 262157
17656 67733 164167 47400 72657 -153168 -50970 -182905 -189745 150440 -453158 -12558 263853
17644 287948 76461 -63405 -68602 158624 149571 296077 -402840 -90810 -165256 124119 -71939
17632 139035 211295 357659 202964 150744 80320 -249685 -92604 -460295 130255 213040
17622 213040 356930 159009 51331 -1284 161657 -39266 242640 101647 -23544 2591 -44010
$$ packed form
17703B02937a32145e5919n705j21998I808K9901f06155C55013j64160a79513A05362
17691C0437g818I628a45465J8d1170p1089B3276d3721r6546f8135J6756j0857
17679f2236k0726B1054c4338A20938a62435l90223A89333n22r0376Q0883E0236
17667b06597J0604B61168A23250j6475P342a70427A9367c79946J07308B62157
17656F7733R6434D7400K5257a53168e0970j31935o840A50440d53158a2558B63853
17644B87948G6461f3405n197A58624r053J46506d02840i0810p4446A24119g1939
17632A39035P2260J46364j54695n2220p0424b49685i2604l67691A30255Q2785
17622B13040J43890A59009E1331a284A61657c9266B42640A01647b3544B591d4010
$$ plain form
17610 248813 -333166 -281187 -21146 -67687 175670 28297 196154 -223521 -132012 -31388 165126
17598 126533 193494 -2890 -56296 298841 192041 -346437 480475 109447 -141042 45548
17587 279326 -246102 280969 90560 -237118 -116176 146340 -4386 64719 154968 -132403
17576 -276315 -186815 231656 -37625 -167883 -37573 -22457 127942 -36352 -254650 222347
17565 204914 163904 76519 7151 149585 208282 -163326 -165692 212552 161239 -47309 -240933
17554 -240933 15457 320668 92291 199405 145115 75201 -51954 -23172 68015 22650 244150
17543 244150 -2029 49744 218448 -68334 440365 17510 292999 434847 -28330 12322 364075
17532 364075 -45555 172492 168225 262780 206508 157080 59323 206970 -128830 132858 -82179
$$ packed form
17610B48813c33166N1979b1146m6541A75670B8297J67857b23521R1509c1388A65126
17598A26533O6961b890n3406B98841j06800c46437D80475A09447a41042D5548
17587B79326b46102B80969I0560b37118a16176A46340d386F4719R0249a32403
17576b76315Q9500B31656c7625j30258c7573J5116A27942c6352k18298B22347
17565B04914m1010G6519G151J42434N8697a63326k366B12552n1313d7309j93624
17554b40933A5457L05211I2291J07114n4290o9914e1954b3172F8015B2650K21500
17543B44150b029D9744J68704f8334D40365A7510K75489J41848b8330A2322L51753
17532C64075d5555A72492m267R4555n6272m9428E9323J47647a28830A32858h2179
$$ plain form
17520 -289382 -97383 30025 42425 -50220 214750 228519 -180381 455504 354231 -10225 241450
17508 -50572 308291 18445 376530 104335 358334 42469 7204 -123708 -269251 182578
17497 105299 102152 -267931 90500 -362857 105981 54752 172256 125658 255988 234111 276873
17486 276873 43443 309788 13587 181151 171410 90287 -96205 196245 100758 25971 470448
17475 470448 152800 15433 367319 -9492 87154 -41177 216996 238174 400449 131644 144945
17464 144945 -206683 76574 156963 67794 89367 233542 43168 357686 9011 315130 441953
17453 441953 153524 315546 -129353 353649 150004 877828 417277 77419 42796 -44776
17442 221756 421194 403370 108745 -160076 369093 399 276899 315348 119126 455619
$$ packed form
17520b89382i7383C0025J2400e0220B14750J3769a80381D55504j01273a0225B41450
17508e0572C08291A8445L58085A04335K53999D2469G204a23708j45543A82578
17497A05299l147b67931I0500c62857A05981n1229J17504m6598J30330k1877M2762
17486B76873D3443K66345A3587J67564r741q1123i6205A96245r5487B5971M44477
17475D70448A52800A5433L51886i492H7154d1177B16996K1178J62275A31644J3301
17464A44945b06683G6574Q0389F7794K1573J44175D3168L14518I011L06119J26823
17453D41953A53524J62022a29353C53649A50004P27824D17277G7419l4623d4776
17442B21756J99438j7824A08745a60076C69093C99K76500L8449A19126L36493
$$ plain form
17432 455619 349487 539031 113837 297077 330918 162443 240573 28897 202073 243868
17422 243868 781824 -73419 695979 240490 491718 126576 664634 -37477 77481 227817
17412 227817 -78516 419400 588233 38993 136602 -102852 175292 205087 402591 12702
17401 342213 158580 -64357 -14812 171954 180435 225346 353058 72472 -86870 167694 315269
17390 315269 226859 338686 128599 82350 148260 300379 -147054 27855 402598 -34239
17379 -137839 -24617 -90201 389046 7397 274736 379071 21221 522268 -59032 153076 193830
17368 193830 194104 271693 411183 -62442 -29158 250858 -37559 76801 48214 246940 160262
17357 160262 45795 174510 163049 212218 311750 125490 -91611 -325203 129110 -65048 215033
$$ packed form
17432D55619j06132J89544A13837J83240L3841A62443P8130B8897J73176M1795
17422B43868N37956g3419F95979B40490K51228A26576N38058c7477G7481J50336
17412B27817g8516D19400J68833C8993R7609a02852A75292K9795J97504A2702
17401C42213A58580f4357a4812A71954Q481M4911J27712G2472h6870A67694J47575
17390C15269q8410J11827A28599m6249O5910J52119a47054B7855L74743c4239
17379a37839b4617o5584C89046G397K67339J04335B1221N01047e9032A53076M0754
17368A93830K74P7589J39490f2442b9158B50858c7559G6801k8587J98726q6678
17357A60262D5795J28715j1461M9169R9532A25490i1611k33592A29110f5048B15033
$$ plain form
17345 342749 305768 253860 211183 -38101 125358 1443 263239 41258 118895 222947 130227
17334 130227 -16624 -17826 -94178 459627 42980 -156290 177511 97105 1173 324487 222983
17323 222983 42759 -90244 189580 315102 385523 18400 -60473 -144633 224483 305286 98667
17311 91755 -90130 -77799 147365 68345 330392 164408 173177 -13282 -93903 394660 47438
17299 145343 244661 -19679 280320 43394 24501 136993 18016 434721 -46683 -274082 -177475
17288 -177475 242589 100037 522374 56028 256543 66387 149338 228137 -148470 283789
17277 -30549 219493 195404 216836 341341 77672 62316 21886 127469 277974 303512 216662
17266 216662 310810 287755 40214 224546 -29390 36205 278949 167322 66773 -94139 437870
$$ packed form
17345C42749l6981n1908m2677c8101A25358A443K61796D1258P7637J04052r2720
17334A30227a6624j202p6352D59627D2980a56290A77511q0406A173L23314j01504
17323B22983D2759i0244A89580J25522P0421A8400f0473q4160B24483Q0803I8667
17311I1755i0130J2331A47365F8345K62047A64408Q769a3282q0621C94660D7438
17299A45343R9318a9679B80320D3394j8893J12492A8016M16705d6683k27399R6607
17288a77475B42589A00037M22337E6028K00515F6387Q2951P8799a48470B83789
17277c0549B19493k4089K1432J24505G7672j5356B1886J05583J50505K5538q6850
17266B16662R4148k3055D0214J84332b9390C6205K42744j11627F6773i4139D37870
$$ plain form
17254 301521 110089 -194556 175813 497257 295244 90501 88415 424419 263881 323538
17244 323538 149989 204299 96653 161823 244876 -61582 385690 -110691 361096 253547
17234 253547 50734 141208 127153 222256 -79973 495074 265472 121893 377075 553140
17224 553140 347360 590131 31073 418766 -50386 238372 51803 271547 316643 430956
17214 430956 485972 454059 138935 -77104 7366 349474 332686 83786 97853 63829 140509
17203 140509 302097 216380 -32652 89577 257211 194887 116993 94637 311257 426399 168271
17191 275806 -117639 256432 236405 461388 230809 176771 211089 408289 320980 -12595
17180 392461 711953 75014 59061 187977 511158 200192 441239 435901 94751 346073
$$ packed form
17254C01521A10089a94556A75813L21444k02013I0501k086L36004j60538N9657
17244C23538A49989N4310I6653O5170Q3053f1582C85690a10691C61096j07549
17234B53547E0734R0474j4055R5103g9973D95074k29602A21893K55182J76065
17224E53140k05780K42771C1073L87693e0386B38372E1803K19744M5096J14313
17214D30956N5016l1913A38935g7104G366L42108j6788H3786J4067l4024P6680
17203A40509J61588q5717c2652H9577J67634o2324p7894k2356K16620J15142A68271
17191B75806a17639B56432k0027K24983k30579n4038L4318J97200q7309a2595
17180C92461L19492G5014j5953J28916L23181B00192K41047n338I4751K51322
$$ plain form
17170 346073 345084 51725 221054 359355 269317 463057 81916 190084 545217 280286 640024
17159 640024 191101 302327 231733 559661 102278 475867 439790 257282 539520 173901
17148 53867 -282850 428153 143149 348538 306411 309559 537004 -15102 285478 45083 566875
17137 566875 179429 8806 66771 269102 111425 241918 526729 180736 391122 515270
17127 515270 194909 324664 150589 358322 190959 173375 162064 278267 462927 518296
17117 518296 576555 369692 191540 146031 592237 536609 342954 308588 458293 84791
17106 594380 295720 483927 62700 338210 369982 461438 479498 438155 508856 396340 245565
17095 245565 501066 524008 284084 293113 425863 290698 457392 511190 520991 507436 629283
$$ packed form
17170C46073r89E1725J69329J38301r0038J93740H1916J08168L55133k64931L59738
17159F40024A91101J11226p0594L27928A02278L73589l6077j82508K82238A73901
17148E3867b82850D28153A43149K05389m2127L148K27445a5102B85478D5083N21792
17137E66875A79429H806N7965K02331A11425J30493K84811A80736K10386J24148
17127E15270A94909J29755A50589K07733j67363j7584j1311J16203J84660N5369
17117E18296N8259k06863j78152m5509M46206n5628j93655l4366J49705H4791
17106E94380B95720J88207F2700K75510L1772R1456J8060m1343P0701j12516j50775
17095B45565K55501K2942k39924R029J32750j35165J66694N3798R801j3555J21847
$$ plain form
17084 629283 281246 897590 409737 676285 243858 421617 187290 489368 325701 654367
17074 654367 425062 328275 551376 690161 420965 264911 325568 396166 174367 500036
17064 500036 717954 575602 462182 512810 498189 942337 463784 760842 528471 860303
17054 860303 505426 531495 852268 775251 510181 372864 489397 660403 631099 855182
17044 855182 629799 416464 495968 470621 472963 517485 664013 799457 575589 424918
17034 424918 607109 449327 591308 446014 930101 452411 428249 444596 423878 639916
17024 639916 749648 466057 696979 522948 706949 764352 689740 678637 921797 620679
17014 620679 829980 793119 803469 752145 602767 730669 941682 851087 707301 408098
$$ packed form
17084F29283B81246O16344D09737K66548B43858J77759A87290L02078j63667L28666
17074F54367k29305r6787K23101J38785k69196j56054O0657P0598A74367L25669
17064E00036K17918j42352j13420N0628j4621M44148D63784K97058k32371L31832
17054H60303l54877K6069L20773p7017k65070j37317J16533J71006k9304K24083
17044H55182k25383k13335P9504k5347K342M4522J46528J35444k23868j50671
17034D24918J82191j57782J41981j45294M84087D52411k4162J6347k0718K16038
17024F39916J09732k83591K30922j74031J84001N7403p4612j1103K43160l01118
17014F20679K09301l6861J0350n1324j49378J27902K11013r0595j43786k99203
$$ plain form
17004 408098 683556 842636 440402 656062 758303 678717 479951 493335 716922 565987
16994 565987 524269 1145755 737407 753879 835248 794678 736098 857607 693198 576506
16984 576506 959480 794187 888317 409842 978155 973825 1048926 1137549 982668 739011
16974 739011 1150012 973770 993554 742409 791390 776204 1046789 952304 1068245 782259
16964 782259 991069 950273 1284939 1097491 1037756 1028127 875022 1329889 910038 1074592
16954 1074592 1040708 1062035 1404010 1299827 1158114 1288940 994670 1049470 1056109 973499
16944 973499 1427877 1280438 1180831 978405 1420455 1446501 1689040 1240629 1275344 1265987
16934 1265987 1120230 1349162 1305308 1506483 1578466 1342644 1501405 1599729 1439599 1256941
$$ packed form
17004D08098K75458J59080m02234K15660J02241p9586j98766J3384K23587j50935
16994E65987m1718O21486m08348J6472Q1369m0570n8580J21509j64409j16692
16984E76506L82974j65293R4130D09842N68313m330P5101Q8623j54881k43657
16974G39011M11001j76242J9784k51145M8981j5186K70585r4485J15941k85986
16964G82259K08810m0796L34666j87448n9735r629j53105M54867m19851J64554
16954A074592l3884K1327L41975j04183j41713J30826k94270N4800O639q2610
16944I73499M54378j47439r9607k02426M42050K6046K42539m48411L4715r357
16934A265987j45757K28932m3854K01175P1983k35822J58761R8324j60130j82658
$$ plain form
16924 1256941 1676354 1543984 1657220 1196845 1461749 1364159 1513485 1682907 1672021 1240086
16914 1240086 2007546 1798327 1356002 1732161 1830541 1895801 2020204 1769516 1968949 1899636
16904 1899636 1965071 2030121 1899120 1574706 2098707 1564914 2244416 2036095 1766634 2101632
16894 2101632 1823813 2126994 1928981 2116641 1948794 2226418 2167951 1877322 2504970 2241589
16884 2241589 2310415 2331710 2199325 2369293 2229625 2158084 2292780 2805158 2324755 2692359
16874 2692359 2578440 2635704 2833048 2812644 2917039 2373199 2807122 2579454 2860636 3160792
16864 3160792 3021686 2855244 2836058 2991484 2969679 2980307 2906109 3182200 2997030 3031883
16854 3031883 3075571 3497868 3566373 3292322 3741456 3554441 3966267 3835195 3861622 3741559
$$ packed form
16924A256941M19413j32370J13236m60375K64904r7590J49326J69422j0886m31935
16914A240086P67460k09219m42325L76159R8380O5260J24403k50688J99433o9313
16904A899636O5435O5050j31001l24414N24001n33793O79502k08321k69461L34998
16894B101632k77819L03181j98013J87660j67847K77624n8467k90629O27648k63381
16884B241589O8826K1295j32385J69968j39668p1541J34696N12378m80403L67604
16874B692359j13919N7264J97344k0404J04395n43840M33923k27668K81182L00156
16864C160792j39106j66442j9186J55426k1805J0628p4198K76091j85170L4853
16854C031883M3688M22297O8505k74051M49134j87015M11826j31072K6427j20063
$$ plain form
16844 3741559 3654990 3937790 3929757 3894302 3823076 4348250 4552097 4254644 4205339 4541518
16834 4541518 4527946 4492274 5354190 5032619 4850845 5034997 5015782 5137457 5163476 5398527
16824 5398527 5333631 5151898 5209365 5626319 5918070 6040654 5873687 6392234 6366473 6456818
16814 6456818 6657180 6645009 7012713 7036669 6996770 7336134 7348495 7710362 7717046 7918704
16804 7918704 8001719 8244674 8394394 8653160 8732774 8859468 9290421 9676996 9979049 9837097
16794 9837097 10578084 10154833 11016878 10996354 11000161 11578541 12223108 12333837 12537789 12785008
16784 12785008 13283115 13618830 13966406 14806631 15003719 15662488 15937803 16208882 17105214
16775 17105214 17789317 18161605 18624064 19090622 19704478 20766959 21472033 21943458 22923207
$$ packed form
16844C741559q6569K82800q033l5455p1226N25174K03847k97453m9305L36179
16834D541518j3572l5672Q61916l21571j81774J84152j9215J21675K6019K35051
16824E398527o4896j81733N7467M16954K91751J22584j66967N18547k5761R0345
16814F456818K00362j2171L67704K3956l9899L39364J2361L61867O684K01658
16804G918704Q3015K42955J49720K58766P9614J26694M30953L86575L02053j41952
16794I837097P40987m23251Q62045k0524L807N78380O44567J10729K03952K47219
16784A2785008M98107L35715L47576Q40225J97088O58769K75315K71079Q96332
16775A7105214O84103L72288M62459M66558O13856J062481P05074M71425R79749
$$ plain form
16766 22923207 23576242 24700414 25437238 26569812 27663808 29055456 29795578 31163531
16758 31163531 33035351 33884328 35669348 37002317 38885069 40419746 42126836 44127366
16750 44127366 46336859 48662125 50778193 53523545 56444672 59092530 62313871 65302420
16742 65302420 69053923 73126317 77071825 81300431 86126029 90959784 95866334 101388000
16734 101388000 107059833 113000722 119169782 125297344 132146704 138386293 145329701 151515474
16726 151515474 158185386 164262799 169617736 174938565 179186446 182425768 184679788 185927387
16718 185927387 186484824 185345188 183728548 180729029 176804066 172315420 167080103 161234366
16710 161234366 154593934 148247796 141910575 134982712 128184145 121738825 115185945 109257635
$$ packed form
16766B2923207O53035J124172P36824J132574J093996J391648P40122J367953
16758C1163531J871820Q48977J785020J332969J882752J534677J707090K000530
16750D4127366K209493K325266K116068K745352K921127K647858L221341K988549
16742F5302420L751503M072394L945508M228606M825598M833755M906550N521666
16734A01388000N671833N940889O169060O127562O849360O239589O943408O185773
16726A51515474O669912O077413N354937N320829M247881L239322K254020J247599
16718A85927387N57437j139636j616640k999519l924963m488646n235317n845737
16710A61234366o640432o346138o337221o927863o798567o445320o552880n928310
$$ plain form
16702 109257635 103446421 97492552 92250141 87142439 82506385 78068387 73498144 69936871
16694 69936871 66060736 62558430 59411531 56268808 53568544 50910658 48525114 46091086
16686 46091086 43870664 41808831 39720752 37775923 36022798 34862454 32803929 31650296
16678 31650296 30530262 29257377 27871388 26573972 25477062 24756698 23913670 22766438
16670 22766438 22005266 21381781 20411320 19937384 19172673 18682648 17802422 16948157 16722462
16661 16722462 16176714 15818509 15215089 14632651 14207324 13813984 13490698 12595941 12576786
16652 12576786 12320104 11833413 11758285 11156604 10821881 10380209 10093326 10304817 9717085
16643 9717085 9785051 9432634 8895741 8957241 8509307 8433230 8330230 8195573 7834582 7399267
$$ packed form
16702A09257635n811214n953869n242411n107702m636054m437998m570243l561273
16694F9936871l876135l502306l146899l142723k700264k657886k385544k434028
16686D6091086k220422k061833k088079j944829j753125j160344k058525j153633
16678C1650296j120034j272885j385989j297416j096910p20364q43028j147232
16670B2766438p61172o23485r70461m73936p64711m90025q80226q54265k25695
16661A6722462n45748l58205o03420n82438m25327l93340l23286q94757j9155
16652A2576786k56682m86691p5128o01681l34723m41672k86883K11491n87732
16643I717085O7966l52417n36893O1500m47934p6077j03000j34657l60991m35315
$$ plain form
16633 7399267 7528552 7221951 6944965 6818470 6526236 6680716 6752510 6539863 5894516 5988650
16623 5988650 6127263 5834931 5784289 5712330 5461601 5208180 5146162 5106566 5016656 4832309
16613 4832309 4911574 4734477 4624632 4438297 4527311 4112328 4238484 4351075 4458997 4397498
16603 4397498 4042790 4097400 3891152 3739164 3957880 3887198 3551633 3497171 3365370 3720517
16593 3720517 3440104 3099040 3424564 3323336 2800217 3285265 3182993 2990684 2958062 2974334
16583 2974334 3018755 3035023 2648862 2844632 2631119 2805840 2776279 2616734 2546443 2454546
16573 2454546 2625748 2277587 2604960 2663315 2515672 2441076 2569153 2039621 2362014 2178350
16563 2178350 2112140 1930786 2207936 2054888 2102218 1903401 1757018 1730455 1705823 1975600
$$ packed form
16633G399267J29285l06601k76986j26495k92234J54480P1794k12647o45347R4134
16623E988650J38613k92332n0642p1959k50729k53421o2018l9596q9910j84347
16613D832309P9265j77097j09845j86335Q9014m14983J26156J12591J07922o1499
16603D397498l54708N4610k06248j51988K18716p0682l35565n4462j31801L55147
16593C720517k80413l41064L25524j01228n23119M85048j02272j92309l2622J6272
16583B974334M4421J6268l86161J95770k13513J74721k9561j59545p0291r1897
16573B454546J71202l48161L27373N8355j47643p4596J28077n29532L22393j83664
16563B178350o6210j81354K77150j53048M7330j98817j46383k6563k4632K69777
$$ plain form
16553 1975600 1932980 1812974 1812235 1560874 1748263 1724701 1603761 1620559 1505111 1922367
16543 1922367 1384186 1521126 1183293 1527030 1748503 1527260 1393612 1426527 1744168 1435627
16533 1435627 1497383 1437494 1434665 1201836 1306687 1423505 1495438 1249953 1474512 1625123
16523 1625123 1263970 1628387 1238044 1336246 1288741 1082187 1095587 1074598 1144683 1067259
16513 1067259 1061059 1235613 1229259 1325787 1196538 1032209 844193 1304933 888531 998963
16503 998963 828247 1032888 719811 1030059 1155376 1162847 733977 1266515 884498 1253800
16493 1253800 1049511 922810 956191 931503 754061 1002940 939697 839825 646680 832885
16483 832885 1159400 711394 925139 569934 1062119 946083 1021055 978483 674277 374334
$$ packed form
16553A975600m2620j20006p39k51361J87389k3562j20940J6798j15448M17256
16543A922367n38181J36940l37833L43737K21473k21243j33648L2915L17641l08541
16533A435627O1756n9889k829k32829J04851J16818P1933k45485K24559J50611
16523A625123l61153L64417l90343R8202m7505k06554J3400k0989P0085p7424
16513A067259o200J74554o354R6528j29249j64329j88016M60740m16402J10432
16503I98963j70716K04641l13077L10248J25317P471m28870N32538l82017L69302
16493A253800k04289j26701L3381k4688j77442K48879o3243r9872j93145J86205
16483H32885L26515m48006K13745l55205M92185j16036P4972m2572l04206k99943
$$ plain form
16473 374334 872678 451727 750519 1038843 843152 535342 841612 744424 813961 504333
16463 504333 591553 889074 924132 1010283 828403 543071 778786 769325 535857 903925
16453 903925 726975 1198643 660514 676023 684909 865290 744091 610837 623608 588788
16443 588788 700935 692845 513849 529573 582494 574642 697797 586416 688319 373781 527860
16432 527860 610648 647824 750862 582689 770186 357517 633233 465936 340523 664523
16422 664523 646520 592164 302359 765886 512129 780674 449050 546967 460044 771386
16412 771386 619785 358661 458390 369857 750897 359450 328668 321788 424152 196384
16401 252647 407498 544120 392485 662517 125343 302659 434595 346422 150499 430787
$$ packed form
16473C74334M98344m20951K98792K88324j95691l07810L06270r7188O9537l09628
16463E04333Q7220K97521L5058Q6151j81880k85332K35715r461k33468L68068
16453I03925j76950M71668n38129J5509Q886J80381j21199j33254J2771l4820
16443E88788J12147q090j78996J5724N2921p852J23155j11381J01903l14538J54079
16432E27860Q2788L7176J03038j68173J87497C57517K75716j67297j25413L24000
16422F64523j8003n4356k89805M63527k53757K68545l31624R7917q6923L11342
16412G71386j51601k61124R9729q8533L81040C59450l0782o880J02364A96384
16401B52647J54851J36622j51635K70032A25343J77316J31936q8173A50499K80288
$$ plain form
16391 430787 411576 472926 61459 358118 178399 548164 488896 275256 73918 -1820 576798
16379 281911 395541 205496 641521 458354 531997 465763 397580 184816 366866 187197
16369 187197 428390 116049 86901 47093 197264 308885 -68519 517603 161190 307578
16359 307578 251884 242209 69856 46307 309726 244873 367264 67185 409915 287677 347165
16348 347165 561731 169737 -28183 217238 202720 314760 228178 319473 346208 383781 169911
16336 247546 339733 132411 317016 -78274 214372 606963 189993 93603 407329 432194
16326 432194 234681 40914 244058 -180825 -27017 100389 182288 490493 526981 101534
16315 337617 139450 100067 136077 143761 336533 -60500 184037 380644 327777 135077 382415
$$ packed form
16391D30787j9211O1350F1459K96659A78399L69765n9268k13640G3918a820E76798
16379B81911J13630j90045M36025j83167P3643o6234o8183A84816J82050j79669
16369A87197K41193A16049k9148l9808J50171J11621f8519E17603A61190J46388
16359C07578n5694r675F9856k3549K63419o4853J22391F7185L42730j22238N9488
16348C47165K14566A69737b8183B17238j4518J12040q6582R1295K6735L7573A69911
16336B47546R2187A32411J84605g8274B14372L92591A89993I3603L13726K4865
16326D32194j97513D0914K03144a80825b7017A00389Q1899L08205L6488A01534
16315C37617A39450l9383L6010P684J92772f0500A84037J96607n2867A35077K47338
$$ plain form
16304 382415 567427 286881 390811 184074 40533 96875 313119 120154 154654 70510
16293 174318 393466 114390 354537 315230 244767 280338 235607 155113 -182077 84099 -115213
16281 68940 203704 106635 231605 165531 104549 146629 397722 207305 385127 232699
16271 232699 112212 247011 326859 191952 60931 259076 159194 68550 471837 108468
16260 556169 190700 38607 -19723 170905 315531 291265 125888 285887 296440 233197
16250 233197 86484 170468 -243478 2125 51719 193472 374532 -18357 237908 207245 48746
16238 -17408 -210 -229240 105032 101221 230395 378299 203680 48567 38957 28489 398947
16227 398947 319777 62233 -94098 274430 163507 740497 95530 -69688 29016 284887 115658
$$ packed form
16304C82415J85012k80546J03930A84074D0533N6342K16244A20154L4500G0510
16293A74318K19148A14390K40147l9307p0463L5571m4731q0494a82077H4099a15213
16281F8940J34764r7069J24970o6074o0982M2080K51093j90417J77822j52428
16271B32699A12212J34799P9848j34907F0931J98145r9882F8550M03287A08468
16260E56169A90700C8607a9723A70905J44626k4266A25888J59999J0553o3243
16250B33197H6484Q3984b43478B125M9594J41753J81060a8357B37908l0663D8746
16238a7408b10k29030A05032l811J29174J47904j74619D8567r610j0468L70458
16227C98947p9170F2233i4098B74430j10923N76990I5530f9688B9016K55871A15658
$$ plain form
16215 115855 -99071 226351 163985 -152472 76548 -109967 292742 314220 350519 122398
16204 113990 -109256 33091 128233 -116978 -183127 293918 47538 -119613 -260642 -128333
16193 -146040 -46589 19076 38473 180052 174524 117387 -71962 22124 -279826 823 142033
16182 142033 20371 231565 28691 106461 139712 30136 194402 -80247 470197 252835 -200987
16170 85433 454493 57838 -115964 148294 232557 128894 195339 -2455 -20003 -148495 -115989
16159 -115989 21803 -196861 393571 170509 186690 180587 -52313 -272373 -92452 -107708 -164282
16148 -164282 97814 -264194 84660 103941 142328 327142 150570 179721 30942 -152109 249675
16136 -131512 -170402 -89719 111395 360494 -98169 -119224 -18461 114366 107938 149479 -118131
$$ packed form
16215A15855i9071B26351o2366a52472G6548a09967B92742K1478L6299A22398
16204A13990a09256C3091R5142a16978o6149B93918D7538a19613j41029a28333
16193a46040d6589A9076J9397J41579n528n7137g1962B2124b79826H23J41210
16182A42033B0371K11194B8691P7770L3251C0136J64266h0247D70197k17362b00987
16170H5433L69060E7838a15964A48294Q4263j03663O6445b455j7548j28492L2506
16159a15989B1803a96861C93571A70509J6181o103e2313k20060i2452j5256n6574
16148a64282I7814b64194H4660J9281L8387J84814A50570K9151C0942a52109B49675
16136a31512l8890Q0683A11395K49099i8169k1055a8461A14366o428M1541a18131
$$ plain form
16124 -224751 378499 214783 363996 -242394 -68172 -237732 64844 335311 129162 235694
16114 235694 184771 -50803 -212250 -1498 -81293 65706 -243987 71341 99045 224665 224877
16103 224877 93747 260373 248932 236364 378877 157067 -198206 -45470 113713 -75084
16092 -50612 -243386 -216067 122794 477576 -55486 -31640 239246 -51848 -621358 -269196
16081 123116 -236542 485987 -13640 47985 152673 11431 -15919 158193 -14536 -394406
16071 -394406 49921 219365 -3372 100688 -282819 298436 173802 90125 170833 243413 -198019
16059 58634 114892 -90183 16482 -300707 -88196 -233887 -192044 6904 217612 18367 -31700
16047 -384655 126573 16906 45756 -102531 -152658 208382 -255211 347693 54830 -124178
$$ packed form
16124b24751C78499j63716J49213b42394f8172j69560F4844K70467A29162J06532
16114B35694n0923e0803j61447a498p9795F5706b43987G1341K7704J25620K12
16103B24877I3747J66626j1441j2568J42513A57067a98206d5470A13713g5084
16092e0612j92774K7319A22794L54782e5486K3846B39246e1848n69510b69196
16081A23116b36542D85987a3640D7985J04688A1431a5919A58193a4536l79870
16071c94406D9921J69444c372A00688b82819B98436j24634q3677Q0708P2580a98019
16059E8634N6258i0183A6482c00707h8196j45691M1843F904K10708A8367c1700
16047c84655A26573A6906K8850a02531n0127B08382b55211C47693E4830a24178
$$ plain form
16036 -173040 141928 -64110 -21409 111934 29544 -170682 54483 -100284 185361 -97036
16025 -83631 160655 293897 -102865 -48627 -267671 -127851 125362 -181609 77204 -140907
16014 -150088 -276368 12674 -48654 133289 261309 231405 -34805 138422 2294 -18010 118238
16002 -83912 67346 12186 -185879 -143643 -505963 -49899 -181577 22343 196952 -240876 34367
15990 97493 -4690 -3197 24415 260235 370572 -194805 142507 550411 -119836 153699 -23280
15978 63766 110167 -155491 361087 -210347 -134541 179507 19113 -26554 100690 94085 -87758
15966 -39799 66405 56853 -57430 161052 27977 -203516 298171 34830 -186473 -246503 71335
15954 -75198 -143888 -85573 -14525 -212192 69487 -326968 235140 -100904 -263402 105676
$$ packed form
16036a73040A41928f4110b1409A11934B9544a70682E4483a00284A85361i7036
16025h3631A60655J33242a02865d8627k19044a27851A25362a81609G7204a40907
16014a50088j26280A2674d8654A33289J28020k9904c4805A38422B294a8010A18238
16002h3912F7346A2186a85879M2236l62320d9899j31678B2343J74609b40876C4367
15990I7493d690J493B4415K35820J10337a94805A42507M07904a19836A53699b3280
15978F3766M6401a55491C61087b10347P5806A79507A9113b6554A00690o605h7758
15966c9799F6405r552e7430A61052B7977b03516B98171C4830a86473o0030G1335
15954g5198o8690N8315a4525j97667F9487c26968B35140a00904j62498A05676
$$ plain form
15943 -245038 -171537 99573 129848 119191 -104118 86615 -183451 -106265 -70359 60682 -18818
15931 -162917 -389116 -9152 262775 208513 -95426 -16732 -107190 -142346 58675 -9219 -117036
15920 -117036 167730 127071 -95643 61847 -376917 266334 -146485 -16327 17521 -197700
15909 -99626 106403 -117028 31043 256517 154064 -140342 28766 -127377 105370 -112661
15898 201812 186884 -378426 -96142 -193907 -110330 -83141 -116160 -259325 227867 144200 32219
15886 -137073 -156334 -183167 -92731 199456 -53482 98355 -205827 94227 154723 76130 -71642
15874 -76706 -50023 -266402 -376423 -246836 -454950 33790 -177268 -267318 43825 -244580
15863 11963 -49061 -216511 57100 -72460 56301 -156293 -173724 -184049 -345928 172809 115747
$$ packed form
15943b45038P3501I9573L0275j0657a04118H6615a83451P7186L5906F0682a8818
15931a62917k26199i152B62775n4262i5426a6732r0458l5156E8675i219j07817
15920a17036A67730m0659i5643F1847c76917B66334a46485a6327A7521a97700
15909i9626A06403a17028C1043K25474j02453a40342B8766a27377A05370a12661
15898B01812j4928c78426i6142r7765Q3577K7189l3019j43165B27867q3667C2219
15886a37073j9261k6833R0436A99456e3482I8355b05827I4227O0496G6130g1642
15874g6706K6683k16379j10021J29587k08114C3790a77268r0050D3825b44580
15863A1963d9061j67450E7100g2460E6301a56293j7431j0325j61879A72809n7062
$$ plain form
15852 115747 -242657 -218418 -50388 89284 -235017 -50553 93020 76757 -490456 123969 100895
15841 100895 355802 58368 223788 -332168 -47339 -300657 235034 -26722 -222052 -109667
15830 27407 254701 146211 -129592 11679 492918 150682 5113 252103 192068 53235 238949
15819 238949 -25677 -41758 -14997 79274 -290396 -26241 -70554 -195173 -117518 87842 -172958
15807 295840 -138363 -35333 372277 54514 -135473 -38444 134229 -50058 411129 206541
15797 206541 -54777 -124713 157340 -199534 -88940 2219 26034 383610 214326 340416 18622
15785 -240764 251302 38876 -220296 -9351 -155460 -55395 -148655 -82222 -176810 -283070 -354610
15774 -354610 -172915 -5416 132042 44074 -146335 -9944 -47836 -290260 -91508 -6912 -145526
$$ packed form
15852A15747b42657K4239e0388H9284b35017e0553I3020j6263d90456A23969k3074
15841A00895K54907E8368J65420c32168d7339k53318B35034b6722j95330a09667
15830B7407K27294j08490a29592A1679M81239A50682E113K46990o0035E3235J85714
15819B38949b5677j6081a4997G9274b90396b6241m4313j24619P7655H7842a72958
15807B95840a38363c5333C72277E4514a35473c8444A34229e0058D11129k04588
15797B06541e4777o9936A57340a99534h8940B219K3815L57576j69284J26090A8622
15785b40764B51302C8876b20296i351j46109e5395r3260O6433r4588j06260p1540
15774c54610a72915e416A32042D4074a46335i944l7892k42424i1508f912j38614
$$ plain form
15763 -145526 -54570 283601 -182586 157863 85487 61794 170067 118775 176268 -147480
15752 -75849 196272 13101 -3593 142015 285876 -329595 -129267 -217407 83234 361876 82431
15740 209961 243697 -266984 -2782 -140008 -6355 -109184 -214800 -168811 -186022 193931 36063
15728 -248233 36601 45514 -22997 -383493 -249317 -203990 25836 -62583 89079 377160 234390
15717 234390 -192447 111089 72823 87154 246920 339 -21361 -14031 -285801 -257368 -113921
15705 -152418 57944 -216239 121749 13042 -246065 238929 -162229 -45963 -384676 -121974
15694 -95430 113364 255959 -39859 144125 -228648 34152 -102535 57064 -290331 245532
15683 -71858 24632 -206932 -116686 69889 -52102 -335610 -190399 74325 -50185 -311038 332931
$$ packed form
15763a45526e4570B83601a82586A57863p2376k3693J08273n1292N7493a47480
15752g5849A96272A3101c593A42015J43861c29595a29267q8140H3234K78642H2431
15740B09961L3736b66984b782j37226f355j02829j05616M5989j7211A93931C6063
15728b48233C6601Q913b2997l60496J34176M5327B5836f2583H9079K88081j42770
15717B34390a92447A11089l8266J4331J59766C39b1361P330k71770K8433a13921
15705a52418E7944b16239A21749A3042b46065B38929a62229d5963l38713a21974
15694i5430A13364J42595c9859A44125b28648C4152a02535E7064b90331B45532
15683g1858B4632b06932R0246F9889e2102k83508J45211G4325e0185k60853C32931
$$ plain form
15671 -22074 -189839 88883 -185408 1400 98193 -130838 -30817 89409 -44058 -134445 66804
15659 -262377 -131822 -164913 -178442 -150613 190170 -116413 -23399 28774 24343 61612 -120125
15647 217831 277421 -22104 -100191 97809 -277670 242250 -456209 -142587 -132888 128664 72740
15636 72740 292942 -367466 -93845 -272996 24708 64910 -7351 -240093 77215 -52870 -260319
15625 -260319 -75013 47754 271398 -114501 5597 134390 -407101 -205237 -187961 67602 67874
15614 67874 -205956 -13254 -278092 15039 135582 76415 -41356 -78953 14898 -125723 188840
15602 78636 167817 -288946 176912 -89471 45250 -24344 -12275 -284800 -124129 33924 37591
15591 37591 32612 -314142 -179191 -305636 -57110 60886 213454 176712 219646 -24605 100825
$$ packed form
15671b2074j67765H8883a85408A400R6793a30838c0817H9409d4058r0387F6804
15659b62377J30555l3091j3529K7829A90170a16413b3399B8774m431L7269a20125
15647B17831N9590b2104p8087I7809b77670B42250d56209a42587R699A28664n5924
15636G2740K20202c67466i3845j79151B4708M0202g351k32742G7215e2870k07449
15625b60319g5013D7754K23644a14501E597J28793d07101K01864J7276F7602K72
15614F7874b05956a3254k64838A5039J20543n9167d1356l7597A4898a25723A88840
15602G8636Q9181b88946A76912h9471D5250b4344J2069k72525a24129C3924L667
15591C7591m979c14142J34951j26445e7110F0886J52568l6742M2934b4605A00825
$$ plain form
15579 -109319 -6377 110801 83873 84198 57493 -59940 -213795 28836 -137830 -394840 -94451
15567 190759 -148878 2248 185889 -82134 -113695 -54778 -479314 83320 -91912 -48932 225354
15555 -52645 20305 295602 260404 -133675 162739 239336 -228877 17789 -61850 91424 -273700
15543 114434 -198286 68794 281381 -235227 91221 -126227 -88561 21990 -225111 100849
15532 -75694 113261 147034 44997 297682 211889 -143062 233020 -14589 -210310 38224 87578
15521 87578 -121990 -40703 -3988 -240991 20015 183875 164477 202301 -303467 230441 -244339
15509 152805 72768 -154213 88579 -498484 142289 112987 -19234 52900 88743 18548 -51727
15497 -26372 -240959 177696 -23713 -260591 -80880 59865 -327261 425105 -15426 -198737
$$ packed form
15579a09319f377A10801k6928L25k6705e9940j53855B8836a37830k57010i4451
15567A90759a48878B248J83641h2134l1561e4778m24536H3320i1912M2980B25354
15555e2645B0305K75297l5198a33675A62739P6597b28877A7789f1850I1424b73700
15543A14434a98286F8794K12587b35227I1221a26227L7666B1990b25111A00849
15532g5694A13261L3773D4997K52685q5793a43062B33020a4589j95721C8224M9354
15521H7578a21990d0703c988k37003B0015J63860j9398L7824c03467B30441b44339
15509A52805G2768a54213H8579d98484A42289k9302a9234E2900L5843A8548e1727
15497b6372k14587A77696b3713k36878h0880E9865c27261D25105a5426j83311
$$ plain form
15487 -198737 -101589 70655 19460 -3142 -164164 -91985 60717 -334771 -239521 -137391 -162997
15476 -162997 -264575 216750 68875 -151445 -109011 -150810 279342 1451 -48343 449076 228233
15465 228233 -374032 -127811 -226802 107936 -134117 15200 -32939 160898 -155659 86565
15454 41601 94490 8097 -345912 50406 33553 22841 -94013 -122856 43656 23323 -435884
15442 -29785 -19458 -151194 170925 125817 308777 242678 243306 2602 4134 -140994 -38743 157962
15429 -37934 -65600 -16654 39150 4108 -139851 -139714 174881 303029 -72540 230205 29643
15417 446685 -41479 84215 -164569 -371805 -79983 -255925 210707 -265069 24204 -297017
15406 147004 186154 -25795 -313285 -155628 7911 13222 -238788 -85037 121092 10951 90191
$$ packed form
15487a98737R7148G0655A9460c142j61022P2179F0717c34771R5250J02130k5606
15476a62997j01578B16750F8875a51445M2434m1799B79342A451d8343D49076k20843
15465B28233c74032a27811r8991A07936a34117A5200c2939A60898a55659H6565
15454D1601N2889H097c45912E0406j6853j0712i4013k8843D3656k0333d35884
15442b9785J0327j31736A70925m5108J82960o6099O28B602J532a40994c8743A57962
15429c7934k7666a6654C9150D108a39851J37A74881J28148g2540B30205B9643
15417D46685d1479H4215a64569k07236g9983j75942B10707b65069B4204b97017
15406A47004L9150b5795k87490a55628G911N311b38788h5037A21092A0951P9240
$$ plain form
15395 90191 31691 -110915 -45937 -79033 -205740 -143325 54949 -49767 14137 -35156 100826
15383 162380 -180192 -100997 206297 181521 -101089 225338 157407 122759 -51690 -209368
15373 -209368 -312345 -269409 -20266 180769 112988 -191645 -78051 -194666 -301085 -88920
15362 191019 -222781 49352 5451 5636 286041 227309 217822 119896 229942 -177 306493 135209
15349 117918 50538 -175352 -185448 -14610 -287188 -316963 269566 -52090 249110 16525 194332
15338 194332 59800 -153287 -29076 65062 -85026 69498 -55784 193590 170719 129866 263994
15327 263994 191818 -16294 311574 84620 -97895 -87415 170430 208138 -72980 134811 -36913
15315 119098 80691 393792 -98039 226694 101366 -224953 30760 173810 115307 -40128
$$ packed form
15395I0191C1691a10915d5937l3096j26707O2415E4949d9767A4137c5156A00826
15383A62380a80192P9195B06297k4776a01089B25338o7931l4648e1690j57678
15373b09368j02977M2936b0266A80769o7781a91645g8051j16615j06419h8920
15362A91019b22781D9352E451J85K80405n8732r487r7926J10046a77C06493A35209
15349A17918E0538a75352j0096a4610k72578k9775B69566e2090B49110A6525J77807
15338A94332E9800a53287b9076F5062h5026F9498e5784A93590k2871m0853J34128
15327B63994p2176a6294C11574H4620i7895J0480A70430L7708g2980A34811c6913
15315A19098l8407L13101i8039B26694A01366b24953C0760J43050n8503d0128
$$ plain form
15304 -43439 -73588 123618 150489 645248 58088 3043 -46603 175548 123824 -121244 143528
15292 118882 -32245 178074 3487 -90427 -164250 47068 -141381 -233439 18017 132981 182541
15281 182541 -1766 194161 31969 -33403 188480 86040 60032 73387 -288007 -100445 312287
15269 -114102 166853 -173743 134786 191472 100218 166741 -91774 -117285 -3821 82185 253153
15258 253153 182895 -105321 198156 234949 495752 396948 214850 391142 564451 820069
15248 820069 1530194 1079318 1392156 1171027 567660 378664 143084 6500 -25666 66713
15237 -64354 -35412 245703 -17954 86701 318803 320375 210589 249669 -107837 134431 110629
15226 110629 -263340 170899 -13027 326053 -182422 -33276 247842 96241 -204650 -175780
$$ packed form
15304d3439l0149A23618K6871M94759E8088C043d6603A75548n1724a21244A43528
15292A18882c2245A78074C487i0427p3823D7068a41381r2058A8017J14964M9560
15281A82541a766A94161C1969c3403A88480H6040k6008J3355b88007a00445C12287
15269a14102A66853a73743A34786N6686r1254O6523i1774k5511c821H2185J70968
15258B53153p0258a05321A98156L6793K60803r8804j82098J76292J73309K55618
15248H20069P10125m50876L12838k21129E67660j88996A43084F500b5666F6713
15237f4354K8942B45703a7954H6701K32102J572j09786L9080a07837A34431k3802
15226A10629b63340A70899a3027C26053a82422c3276B47842I6241b04650K8870
$$ plain form
15216 -175780 159777 224083 308168 -128399 273799 -106131 -74935 -168013 137920 -474241
15205 168288 -131878 -200620 333655 19933 -177786 28244 104177 155925 136628 205318 2433
15193 -51718 146926 135398 149525 130399 -169697 193245 -45160 193695 116328 170297 1351
15181 202236 -12598 -18949 -37707 -185546 -308886 393694 273619 79375 411304 -10584 135232
15169 318735 397102 230503 122446 177715 309178 128037 209497 184397 -6415 228817 335387
15158 335387 202020 -234731 11708 131704 104921 -263226 418147 194346 24401 -272296
15147 475832 202234 -77858 241678 57245 366931 90779 -298470 102371 -97205 336023
15136 -130711 30663 234535 -112136 171122 41491 348248 145242 480060 -167076 46568
$$ packed form
15216a75780A59777O4306Q4085a28399B73799a06131L1196r3078A37920d74241
15205A68288a31878o8742C33655A9933a77786B8244P5933N1748j9297O8690B433
15193e1718A46926j1528J4127j9126a69697A93245d5160A93695p7367N3969A351
15181B02236a2598o351j8758j47839j23340C93694j20075G9375L31929a0584A35232
15169C18735P8367j66599j08057N5269J31463A28037Q1460k5100f415B28817J06570
15158C35387j33367b34731A1708J19996k6783b63226D18147A94346B4401b72296
15147D75832B02234g7858B41678E7245L09686I0779b98470A02371i7205C36023
15136a30711C0663K03872a12136A71122D1491L06757A45242L34818a67076D6568
$$ plain form
15125 10240 138380 115786 -196648 376513 297168 221551 327251 -15092 250200 -95720 222787
15113 -27404 -42633 419101 120537 172704 -1687 335413 16846 132035 -62461 -274191 185098
15101 -88811 59635 314984 111063 367514 37450 368553 -43769 117266 178587 -65250 179842
15089 90418 83898 178814 342123 98398 36532 -157518 16258 337324 -136654 254112 162435
15078 162435 93272 26236 391030 -19927 319236 167598 329591 146793 66725 127133
15068 127133 361503 82314 -79880 316043 -134809 133603 454827 165710 274153 30853
15057 47722 -1615 108369 176685 80455 91340 33561 25665 -15199 318281 224031 120910
15046 120910 69973 251496 202373 -9719 299688 114949 163041 49723 360086 164145 334844
$$ packed form
15125A0240J28140k2594a96648C76513p9345p5617J05700a5092B50200i5720B22787
15113b7404j5229D19101A20537N2167a687C35413A6846J15189f2461k11730A85098
15101h8811E9635K55349A11063K56451C7450L31103d3769A17266O1321f5250A79842
15089I0418o520R4916J63309I8398C6532a57518A6258L21066a36654B54112r1677
15078A62435o9163B6236L64794a9927C19236j51638J61993A46793F6725O0408
15068A27133K34370H2314g9880C16043a34809A33603L21224A65710J08443C0853
15057D7722a615A08369O8316H0455J0885C3561p896a5199C18281r4250j03121
15046A20910n0937J81523m9123i719B99688A14949M8092D9723L10363A64145J70699
$$ plain form
15035 334844 -124766 253078 375827 101164 136277 136455 111589 190936 254364 279057 202626
15024 202626 179407 400012 -240799 -94887 -89222 113368 512167 487490 106057 15776 45370
15013 45370 -67934 129486 415597 -89812 107106 451852 382560 190875 569958 262129
15002 165501 312359 86536 -139221 274607 435540 320743 185512 419086 468989 -74953
14991 206299 317431 381618 240737 488479 267271 234656 305536 295833 -28191 233343 149359
14980 149359 199971 263776 27131 264430 144631 94101 236153 339438 337204 264803 430066
14969 430066 120692 -179859 452364 434803 127797 220450 6435 116579 605022 195386
14958 446632 199711 283744 285974 323026 400229 -147527 370476 404000 403178 -14947 250792
$$ packed form
15035C34844a24766B53078J22749A01164L5113J78k4866P9347O3428K4693p6431
15024B02626k3219K20605b40799i4887N665A13368L98799k4677A06057A5776K9594
15013D5370f7934A29486K86111h9812A07106L44746o9292A90875L79083B62129
15002A65501J46858H6536a39221B74607J60933j14797j35231K33574M9903g4953
14991B06299J11132O4187j40881K47742k21208l2615P0880r703b8191B33343q3984
14980A49359N0612O3805B7131K37299j19799n0530J42052J03285k234p2401J65263
14969D30066A20692a79859D52364j7561A27797R2653F435J10144M88443A95386
14958D46632A99711Q4033K230L7052P7203a47527C70476L3524q22a4947B50792
$$ plain form
14946 -18418 295935 90834 263130 -41973 176323 375328 83518 658670 101017 330544
14936 330544 319583 255885 367514 232511 215080 142819 73525 469307 401792 -130529 166891
14924 460213 58534 25634 173698 131785 482320 375380 215380 275561 118968 410181
14914 410181 393775 245439 297355 373548 81922 313990 521744 655608 251308 87117
14903 499466 321207 641411 140950 435341 236257 450461 125903 422297 324395 76746
14892 305573 510073 409364 608284 463912 330835 640502 461990 209620 141428 109136
14882 109136 334964 259517 425983 380408 182962 237007 270038 -78020 125924 427595
14872 427595 337912 481568 544301 287635 168389 276982 571332 412671 259558 379048
$$ packed form
14946a8418B95935I0834J72296d1973A76323J99005H3518N75152A01017K29527
14936C30544j0961o3698J11629j35003j7431p2261o9294L95782o7515a30529A66891
14924D60213E8534B5634J48064m1913L50535j06940j60000O0181A18968K91213
14914D10181j6406j48336N1916P6193H1922K32068K07754J33864B51308H7117
14903D99466j78259L20204A40950K94391j99084K14204A25903K96394r7902G6746
14892C05573K04500j00709J98920j44372j33077L09667j78512B09620o8192l2292
14882A09136K25828p5447J66466m5575A82962N4045L3031g8020A25924L01671
14872D27595q9683J43656O2733k56666j19246J08593K94350j58661j53113J19490
$$ plain form
14862 379048 636717 432529 455738 357214 622331 654517 685403 88894 429708 556746
14852 556746 306820 495949 403368 464386 497236 588247 342736 330124 281290 607955 389319
14841 389319 225400 213803 344693 318817 730851 655012 522502 455508 100491 620855
14831 620855 546636 485771 538502 679288 669669 560534 267753 591460 741959 339531
14820 285863 732301 483956 835504 341087 349366 324748 460146 564732 437004 340650
14810 340650 553537 466666 682006 324607 523195 728299 410536 391948 705399 389960
14800 389960 383185 379677 629190 553562 500864 487881 519436 765067 698391 629914 579249
14789 579249 885541 525690 671064 907047 140776 295990 835504 761759 871111 737997
$$ packed form
14862C79048K57669k04188K3209r8524K65117L2186L0886H8894L40814J27038
14852E56746k49926J89129r2581O1018L2850R1011k45511j2612m8834L26665k18636
14841C89319j63919j1597J30890k5876M12034p5839j32510o6994A00491N20364
14831F20855p4219o0865N2731J40786r619j09135B67753L23707J50499C39531
14820B85863M46438k48345L51548C41087Q279k4618J35398J04586j27728r6354
14810C40650K12887q6871K15340C24607J98588K05104l17763j8588L13451l15439
14800C89960o775l508K49513p5628n2698j2983L1555K45631o6676o8477n0665
14789E79249L06292l59851J45374K35983A40776J55214N39514p3745J09352j33114
$$ plain form
14779 737997 529711 520417 449312 444076 280267 595135 856424 604623 710562 802304 624446
14768 624446 659841 626298 591705 667748 787789 548865 692753 357132 470930 255842
14758 255842 636319 715010 729800 622996 610731 701285 466083 817471 672898 796121
14748 796121 433163 798611 728872 891222 552451 855460 944293 1058454 764265 1100904
14738 1100904 725321 806404 622717 850519 618504 447716 797225 703003 712140 891352
14728 891352 994819 905162 593030 678963 715004 690159 743355 870306 627223 469524
14718 469524 766331 1159554 709677 876226 1081134 442303 738960 684736 822156 722600
14708 722600 778463 994757 956222 723403 845418 767370 942979 926067 923326 1089985 930204
$$ packed form
14779G37997k08286r294p1105n236j63809L14868K61289k51801J05939R1742j77858
14768F24446L5395l3543l4593P6043J20041k38924J43888l35621J13798k15088
14758B55842L80477P8691J4790j06804j2265R0554k35202L51388j44573J23223
14748G96121l62958L65448o9739J62350l38771L03009Q8833J14161k94189L36639
14738A100904l75583Q1083j83687K27802k32015j70788L49509r4222R137J79212
14728H91352J03467q9657l12132Q5933L6041k4845N3196J26951k43083j57699
14718D69524K96807L93223m49877J66549K04908D42303K96657n4224J37420r9556
14708G22600N5863K16294l8535k32819J22015p8048J75609j6912k741J66659j59781
$$ plain form
14697 930204 731298 1038242 1129525 1200349 1149699 642132 1144936 992372 782518 868233
14687 868233 958780 1084557 655868 921619 872290 932442 1131896 1150164 844670 976419
14677 976419 1080216 995949 984181 1292874 1060077 854143 1062819 1127481 1142654 1189557
14667 1189557 1139299 966150 990934 1093575 1224939 1138503 1215631 1071059 942136 1158499
14657 1158499 989540 1269176 1425811 1268568 1162260 904888 1316923 1196682 1310713
14648 1310713 958654 1447413 1132175 1190191 1268681 1332959 1199264 1331263 1138083 1620462
14638 1620462 1572709 1374125 1348899 1109333 1385760 1584987 1310347 1341330 1677872 1493249
14628 1493249 1555198 1655606 1406084 1630885 1334816 1526335 1663933 1231791 1204366 1522624
$$ packed form
14697I30204j98906L06944R1283P0824n0650n07567N02804j52564k09854Q5715
14687H68233R0547J25777m28689K65751m9329O0152J99454J8268l05494J31749
14677I76419J03797q4267j1768L08693k32797k05934K08676O4662J5173M6903
14667A189557n0258j73149K4784J02641J31364q6436P7128j44572j28923K16363
14657A158499j68959K79636J56635j57243j06308k57372M12035j20241J14031
14648A310713l52059M88759l15238N8016P8490O4278j33695J31999j93180M82379
14638A620462m7753j98584k5226k39566K76427J99227k74640L0983L36542j84623
14628A493249O1949J00408k49522K24801k96069J91519J37598m32142k7425L18258
$$ plain form
14618 1522624 1790019 1789819 1906252 1538628 1467427 1606882 1918194 1694031 2146197 1759429
14608 1759429 1625352 1908659 1952337 2022608 1604068 1703141 1675060 1644871 1587016 1925230
14598 1925230 2213288 1971645 1803711 1831496 1861071 1623755 1597101 1484249 1854769 1911716
14588 1911716 2032584 1717356 1998198 2149619 2285172 1785599 1865786 2024555 1939168 1837632
14578 1837632 1967827 2019360 1932571 2288600 2489549 1966475 2009558 2111978 2373152 2200567
14568 2200567 2732922 2323967 2552682 2278422 2580782 2675530 2446128 2996850 2633299 2501849
14558 2501849 2967256 3018440 3108435 3451321 3738014 4007868 4618368 4932807 5794272 7596548
14548 7596548 11472131 20514673 40212775 46644654 22119817 9839741 5572097 3637553
$$ packed form
14618A522624K67395k00J16433l67624p1201J39455L11312k24163M52166l86768
14608A759429j34077K83307M3678P0271m18540R9073k8081l0189n7855L38214
14598A925230K88058k41643j67934K7785K9575k37316k6654j12852L70520N6947
14588A911716J20868l15228K80842J51421J35553m99573Q0187J58769q5387j01536
14578A837632J30195N1533q6789L56029K00949n23074M3083J02420K61174j72585
14568B200567N32355m08955K28715k74260L02360R4748k29402N50722l63551j31450
14558B501849M65407N1184Q9995L42886K86693K69854O10500L14439Q61465J802276
14548G596548L875583R042542J9698102O431879B2119817I839741m267644j934544
$$ plain form
14540 3637553 2613663 2385655 2232497 2017108 2150618 2032038 2274500 2167855 2201540
14531 2201540 2258680 2119860 2459530 2485511 2138068 2576033 2346075 2477160 2489588 2430848
14521 2430848 2588879 2625573 2894156 2680225 2495827 2620265 2766675 2886973 2793251 2784572
14511 2784572 2951400 3357049 2868427 3031768 3121346 2706966 3139198 3166747 3190428 3215936
14501 3215936 3452928 3007726 3283717 3345247 3498160 3632972 3549680 3310152 3184533 3837235
14491 3837235 3587005 3743007 4045205 3793034 3781084 3908205 3901664 4057318 3961270 4006641
14481 4006641 3982750 4493813 4086753 4240323 4363798 3947423 4147741 4514913 4570342 4416554
14471 4416554 4569777 4302225 4370153 4902840 4421265 4715169 4868152 4641515 4903620 4937576
$$ packed form
14540C637553j023890k28008j53158k15389J33510j18580K42462j06645L3685
14531B201540N7140j38820L39670K5981l47443M37965k29958J31085J2428n8740
14521B430848J58031L6694K68583k13931j84398J24438J46410J20298r3722q679
14511B784572J66828M05649m88622J63341Q9578m14380M32232K7549K3681K5508
14501C215936K36992m45202K75991O1530J52913J34812q3292k39528j25619O52702
14491C837235k50230J56002L02198k52171j1950J27121o541J55654r6048M5371
14481D006641k3891N11063m07060J53570J23475m16375K00318L67172N5429j53788
14471D416554J53223k67552O7928N32687m81575K93904J52983k26637K62105L3956
$$ plain form
14461 4937576 4959704 5067012 5501387 5367906 5094532 5537615 5536237 5522184 5505634 5595998
14451 5595998 5566704 5795402 5607107 5897461 5930540 6055905 5957433 5941838 6099692 6312923
14441 6312923 6352601 6435432 6837742 6647884 6800337 6524126 6788185 7086603 7327028 6952709
14431 6952709 7225255 7523535 7126969 7490498 7811333 7633434 7749056 8241240 8149113 8329203
14421 8329203 8202652 8729961 8199562 8612627 8654624 8614013 9008464 9008019 9217480 9380187
14411 9380187 9666726 9588542 9844304 9728283 10271220 10038283 10147296 10500655 10576475 10559857
14401 10559857 10968101 11363677 10786725 11772499 11638357 11942882 12052250 12091850 12356879
14392 12356879 12642796 12401849 13061999 13178094 13150638 13796328 13786684 14104991 14353908 14756519
$$ packed form
14461D937576K2128J07308M34375j33481k73374M43083j378j4053j6550R0364
14451E595998k9294K28698j88295K90354L3079J25365r8472j5595J57854K13231
14441F312923L9678Q2831M02310j89858J52453k76211K64059K98418K40425l74319
14431F952709K72546K98280l96566L63529L20835j77899J15622M92184r2127J80090
14421H329203j26551N27309n30399M13065M1997m0611L94451m45K09461J62707
14411I380187K86539p8184K55762j16021N42937k32937J09013L53359P5820j6618
14401A0559857M08244L95576n76952R85774j34142L04525J09368L9600K65029
14392A2356879K85917k40947O60150J16095k7456O45690r644L18307K48917M02611
$$ plain form
14382 14756519 14972332 15347845 15509666 15995777 15915536 16280100 16762695 16968747 17242756
14373 17242756 17744926 17862377 18767118 18530066 19166610 19355802 19577670 20103078 20761456
14364 20761456 21077603 21541163 22077069 22344703 23171986 23587473 23847057 24407867 24942513
14355 24942513 25363786 26098452 26673740 27528462 27923377 28939348 29557354 30247411 30822299
14346 30822299 31899721 32388386 33203431 34471893 35340563 35891058 37169735 38217582 39322996
14337 39322996 40345631 41325860 42469662 43879927 44871451 46442546 47700501 49295126
14329 49295126 50719257 52454646 54004840 55995436 57777635 59314376 61826420 63520564
14321 63520564 66074289 68362770 70754444 73179685 76206161 78823712 81647035 84809399
$$ packed form
14382A4756519K15813L75513J61821M86111q0241L64564M82595K06052K74009
14373A7242756N02170J17451R04741k37052O36544J89192K21868N25408O58378
14364B0761456L16147M63560N35906K67634Q27283M15487K59584N60810N34646
14355B4942513M21273P34666N75288Q54722L94915J015971O18006O90057N74888
14346C0822299J077422M88665Q15045J268462Q68670N50495J278677J047847J105414
14337C9322996J022635R80229J143802J410265R91524J571095J257955J594625
14329D9295126J424131J735389J550194J990596J782199J536741K512044J694144
14321F3520564K553725K288481K391674K425241L026476K617551K823323L162364
$$ plain form
14313 84809399 88198334 91856287 95476339 99449956 103194735 108076596 112118687 116954204
14305 116954204 122145799 127313129 133016137 139142172 145565853 152198657 159440149 166993423
14297 166993423 174993998 183610042 192520487 201678604 211739889 222222422 233330565
14290 233330565 244605063 256849090 269468129 282626950 296338202 310041975 324838772
14283 324838772 338955039 353736213 368229769 382603637 396718227 409918300 422538676
14276 422538676 433741287 443895544 452214927 457054343 459298916 460021823 459790608 458612012
14268 458612012 453839307 447121835 441102177 434184456 425698469 415341028 403570093 390529987
14260 390529987 376536074 361911565 347026521 331578174 316506974 302636407 288755993
$$ packed form
14313H4809399L388935L657953L620052L973617L744779M881861M042091M835517
14305A16954204N191595N167330N703008O126035O423681O632804P241492P553274
14297A66993423Q000575Q616044Q910445R158117J0061285J0482533J1108143
14290B33330565J1274498J2244027J2619039J3158821J3711252J3703773J4796797
14283C24838772J4116267J4781174J4493556J4373868J4114590J3200073J2620376
14276D22538676J1202611J0154257Q319383M839416K244573P22907k31215j178596
14268D58612012m772705o717472o019658o917721q485987j0357441j1770935j3040106
14260C90529987j3993913j4624509j4885044j5448347j5071200j3870567j3880414
$$ plain form
14253 288755993 275078322 261678933 248912650 236993834 225519227 214745680 204413186
14246 204413186 194406636 185563809 177075598 168851508 160666855 153610395 146317455 139918663
14238 139918663 134262657 128454011 123071412 117602240 112709996 108050480 103843714 99889269
14230 99889269 95636898 92132552 88527531 85193576 82136059 78629076 75911040 73315450
14222 73315450 70785144 68402996 66247013 64002137 62248284 59584911 57506678 56184788
14214 56184788 54339781 53053912 51179513 49578629 47912653 46532362 45255273 44613366
14206 44613366 43356333 42011560 40482091 39365813 38268694 37685185 36937360 35872022
14198 35872022 35056226 33719041 32790534 32066666 31606406 30567805 29914835 29569722 28200914
$$ packed form
14253B88755993j3677671j3399389j2766283j1918816j1474607j0773547j0332494
14246B04413186j0006550q842827q488211q224090q184653p056460p292940o398792
14238A39918663n656006n808646n382599n469172m892244m659516m206766l954445
14230I9889269m252371l504346l605021l333955l057517l506983k718036k595590
14222G3315450k530306k382148k155983k244876j753853k663373k078233j321890
14214E6184788j845007j285869j874399j600884j665976j380291j277089o41907
14206D4613366j257033j344773j529469j116278j097119n83509p47825j065338
14198C5872022q15796j337185r28507p23868m60260j038601o52970l45113j368808
$$ plain form
14189 28200914 27647122 27304056 26468694 25664476 24854426 24574125 24123768 23751622 22941886
14180 22941886 22706187 22248586 21619428 21097196 20793476 20422732 19841985 19384535 19420395
14171 19420395 18889768 18270881 18166488 17618717 17226373 17186312 16740713 16578075 16353886
14162 16353886 16052891 15626067 15399828 15255285 14994721 14501470 14436342 14129286 13565967
14153 13565967 13477885 13172609 13280002 12823433 12717717 12595075 12308361 12240161 11898380 12158491
14143 12158491 11624545 11134764 11391279 10871185 10990464 10818690 10479923 10381455 10063977
14134 10063977 9787083 9789550 9644838 9393656 9641748 9232610 9439342 8915445 8987458 8873516
14124 8873516 8990043 8813153 8365934 8479929 8463617 7897205 7850384 8221044 7915261 7811362
$$ packed form
14189B8200914n53792l43066q35362q04218q10050k80301m50357l72146q09736
14180B2941886k35699m57601o29158n22232l03720l70744n80747m57450L5860
14171A9420395n30627o18887j04393n47771l92344m0061m45599j62638k24189
14162A6353886l00995m26824k26239j44543k60564m93251o5128l07056n63319
14153A3565967q8082l05276J07393m56569j05716j22642k86714o8200l41781K60111
14143A2158491n33946m89781K56515n20094J19279j71774l38767r8468l17478
14134A0063977k76894K467j44712k51182K48092m09138K06732n23897P2013j13942
14124H873516J16527j76890m47219J13995j6312n66412m6821L70660l05783j03899
$$ plain form
14114 7811362 7874433 7592154 7418519 7415946 7400971 7210681 6833504 6856066 6812824 6923474
14104 6923474 6685225 6794102 6514015 6372971 6433873 6300539 5993931 6107675 6152228 6016357
14094 6016357 5921346 5742504 5522657 6095658 5441540 5688263 5085025 5602345 5310633 5351514
14084 5351514 5141070 5265358 5068473 5310669 4914346 4890998 5033682 4823680 4814412 4896937
14074 4896937 4807648 4457560 4816904 4665282 4563388 4391648 4491708 4436463 4574317 4625120
14064 4625120 4465287 4427008 4536258 4357914 4131893 4318956 4360436 4420045 4365367 4101246
14054 4101246 4220365 4171233 4111000 3840340 3887140 3773091 3846313 3827121 3542737 3855451
14044 3855451 3389391 3897982 3481235 3518277 3459682 3533358 3251452 3264318 3459875 3311249
$$ packed form
14114G811362O3071k82279j73635k573j4975j90290l77177K2562m3242J10650
14104F923474k38249J08877k80087j41044O0902j33334l06608J13744M4553j35871
14094F016357r5011j78842k19847N73001o54118K46723o03238N17320k91712M0881
14084E351514k10444J24288j96885K42196l96323k3348J42684k10002r268Q2525
14074D896937q9289l50088L59344j51622j01894j71740J00060n5245J37854N0803
14064D625120j59833l8279J09250j78344k26021J87063M1480N9609n4678k64121
14054D101246J19119m9132o0233k70660M6800j14049P3222j9192k84384L12714
14044C855451m66060N08591m16747L7042n8595P3676k81906J2866J95557j48626
$$ plain form
14034 3311249 3247061 3240022 3546007 3452438 3062936 3087310 3293876 3147446 2949891 2840927
14024 2840927 3304791 2937401 3056838 2978487 2593110 3074242 2473091 2691911 2852501 2742969
14014 2742969 3011846 2794256 2861328 2732010 2772158 2374412 2542314 2403900 2840845 2302111
14004 2302111 2213187 2592914 2380024 2387008 2178113 2201103 1938182 2187000 2118761 2337336
13994 2337336 2407138 2255068 2233373 2260054 3172818 3925104 6185578 12810748 31886847
13985 31886847 48249779 26593624 14767155 9326078 6698349 5306650 4523956 3909566
13977 3909566 3598030 3326083 3312051 2956355 2891965 2391801 2727667 2671617 2681206 2442445
13967 2442445 2797532 2122434 2248823 2645223 2278018 2237868 2414431 2182214 2448699 2036068
$$ packed form
14034C311249o4188p039L05985r3569l89502K4374K06566j46430j97555j08964
14024B840927M63864l67390J19437p8351l85377M81132o01151K18820J60590j09532
14014B742969K68877k17590O7072j29318M0148l97746J67902j38414M36945n38734
14004B302111q8924L79727k12890O984k08895K2990k62921K48818o8239K18575
13994B337336O9802j52070k1695K6681R12764P52286K260474O625170J9076099
13985C1886847J6362932k1656155j1826469n441077k627729j391699p82694o14390
13977C909566l11536k71947j4032l55696o4390n00164L35866n6050R589k38761
13967B442445L55087o75098J26389L96400l67205m0150J76563k32217K66485m12631
$$ plain form
13957 2036068 2271402 2663289 2087655 1983236 2041736 1857480 2082512 1845811 1820516 2040855
13947 2040855 1807473 1817560 2431439 1888221 1546219 1657079 1691852 2019522 1499718 1984634
13937 1984634 1863894 1767228 1939765 1792350 1904087 1592323 2087223 1755511 1798474 1910203
13927 1910203 1817712 1742606 1555648 1697794 1591772 1737529 1756418 1534509 1693669 1675829
13917 1675829 1649365 1551643 1790126 1593283 1715024 1423015 1551708 1285360 1741547 1737961
13907 1737961 1396692 1636910 1564547 1558311 1126015 1576435 1598857 1614266 1588775 1766132
13897 1766132 1483202 1580262 1463562 1205934 1435657 1285039 1107625 1284854 1207109 1108276
13887 1108276 843374 1577618 1424823 1160554 1425769 1325096 1442588 1429289 1212425 1516800
$$ packed form
13957B036068K35334L91887n75634j04419N8500j84256K25032k36701k5295K20339
13947B040855k33382J0087O13879n43218l42002J10860L4773L27670n19804M84916
13937A984634j20740r6666J72537j47415J11737l11764M94900l31712M2963J11729
13927A910203r2491p5106j86958J42146j06022J45757J8889k21909J59160j7840
13917A675829k6464r7722K38483j96843J21741k92009J28693k66348M56187l586
13907A737961l41269K40218p2363o236m32296M50420K2422J5409k5491J77357
13897A766132k82930R7060j16700k57628K29723j50618j77414J77229p7745r8833
13887A108276k64902P34244j52795k64269K65215j00673J17492j3299k16864L04375
$$ plain form
13877 1516800 1355684 1191763 1350185 1279493 1308302 1210906 1212435 1207181 1129042 1318841 1080502
13866 1080502 1134371 1258997 1158772 1115795 1003666 972616 1400180 1302254 1003037 1303608
13856 1303608 1130233 1049897 1233305 1137704 814417 1177703 1111604 1168116 1008706 1012004
13846 1012004 1140070 918047 1354023 966723 697344 912602 1041817 893764 1050693
13837 1050693 973805 1353528 1225632 1243253 889032 1052497 927595 822353 817767 742666
13827 742666 1059009 823140 1037455 935615 958130 856544 1284289 542285 922847 992379
13817 992379 973039 999520 985992 762311 920069 1001640 981651 869431 1080580 603662
13807 603662 1196716 700623 837127 891402 1027843 1170730 792898 557873 739712 828506
$$ packed form
13877A516800j61116j63921J58422p0692K8809r7396J529n254p8139J89799k38339
13866A080502N3869J24626j00225m2977j12129l1050M27564r7926k99217L00571
13856A303608j73375q0336J83408r5601l23287L63286o6099N6512j59410L298
13846A012004J28066k22023M35976l87300k69379K15258J29215j48053J56929
13837A050693p6888L79723j27896J7621l54221J63465j24902j05242m586p5101
13827G42666L16343k35869K14315j01840K2515j01586M27745E42285L80562O9532
13817I92379j9340K6481j3528k23681J57758Q1571j9989j12220K11149m76918
13807F03662N93054m96093J36504N4275J36441J42887l77832k35025J81839Q8794
$$ plain form
13797 828506 1090264 862959 801675 757734 1037455 943745 855763 1080075 776949 776079 953584
13786 953584 809129 978134 549001 925605 929750 774413 963380 883391 754494 633034
13776 633034 895547 812808 628453 851521 806125 322559 413215 606491 818554 937349
13766 937349 923131 1102812 576948 890773 583953 803143 988778 712244 874432 652107
13756 652107 934905 528336 755668 835909 759171 109984 582131 248744 518118 664520
13746 664520 643132 613801 563127 553027 589560 917108 564396 574243 918412 700949 762801
13735 762801 563339 914231 519037 748024 605098 700936 384019 882368 731789 778550
13725 778550 817627 677691 534497 468056 793820 556574 703547 791979 544302 554185
$$ packed form
13797H28506K61758k27305o1284m3941K79721r3710q7982K24312l03126q70J77505
13786I53584j44455J69005m29133L76604M145j55337J88967p9989j28897j21460
13776F33034K62513q2739j84355K23068m5396C22559R0656J93276K12063J18795
13766I37349j4218J79681n25864L13825l06820K19190J85635k76534J62188k22325
13756F52107K82798m06569K27332Q0241p6738A09984M72147B48744K69374J46402
13746F64520k1388k9331n0674j0100L6533L27548l52712R847L44169k17463O1852
13735G62801j99462L50892l95194K28987j42926R5838l16917M98349j50579M6761
13725G78550L9077j39936j43194o6441L25764k37246J46973Q8432k47677R883
$$ plain form
13715 554185 654867 720297 937773 710881 395146 404731 218173 540864 639323 321852
13705 321852 509879 1019478 413616 533018 627445 710224 661182 604072 505389 288199
13695 288199 614581 720211 614739 532096 664594 257333 342318 702314 380578 687657
13685 687657 640088 441962 649957 469249 493518 1020521 675170 432892 642447 552291
13675 552291 740744 453886 351168 684238 497207 475279 503456 786661 553316 473862
13665 473862 513753 440571 605385 481685 636117 528063 629748 368258 547491 499743
13655 499743 462442 551000 597108 534478 446681 731311 510196 596253 505181 465911 712247
13644 712247 751050 732551 140890 240959 237702 678546 337098 695598 420224 505321
$$ packed form
13715E54185J00682O5430K17476k26892l15735R585j86558L22691R8459l17471
13705C21852J88027N09599D13616J19402R4427Q2779m9042n7110r8683k17190
13695B88199L26382J05630j05472q2643J32498B57333Q4985L59996l21736L07079
13685F87657m7569j98126K07995j80708K4269N27003l45351k42278K09555r0156
13675E52291J88453k86858j02718L33070j87031k1928K8177K83205k33345p9454
13665D73862L9891p3182J64814j23700J54432j08054J01685k61490J79233m7748
13655D99743l7301Q8558M6108o2630q7797K84630k21115Q6057r1072l9270K46336
13644G12247L8803j8499A40890J00069l257M40844C37098L58500k75374Q5097
$$ plain form
13634 505321 183081 260318 398294 335332 171991 -3527 279233 544589 384124 321203
13624 321203 500206 322567 662112 422091 368179 517192 96622 582023 401478 434662
13614 434662 348146 527788 9152 571430 254336 364257 495393 284220 497114 435308
13604 435308 357126 493782 405166 361315 412404 478678 463082 259727 169626 281242 419883
13593 419883 525462 417914 403494 357409 528618 280209 116800 230064 319082 288036
13583 288036 379441 376589 527011 407002 646732 221615 214021 192523 284625 316722 492660
13572 492660 291450 309002 483240 352531 556051 443150 260136 552933 193701 461827
13562 461827 469330 87031 364176 221956 359481 327136 469364 597013 342827 344594 347973
$$ packed form
13634E05321A83081P7237J37976o2962j63341c527B79233K65356j60465o2921
13624C21203J79003j77639L39545k40021n3912J49013I6622M85401j80545L3184
13614D34662q6516J79642I152N62278B54336J09921J31136k11173K12894o1806
13604D35308p8182J36656q8616m3851N1089O6274j5596k03355r0101J11616J38641
13593D19883J05579j07548j4420m6085J71209k48409A16800J13264Q9018l1046
13583B88036R1405k852J50422j20009K39730B21615p594k1498R2102L2097J75938
13572D92660k01210J7552J74238j30709K03520j12901j83014K92797A93701K68126
13562D61827P503H7031K77145j42220J37525l2345J42228J27649k54186J767L379
$$ plain form
13551 347973 384445 -66678 298338 319356 -107131 247234 377918 399239 425161 465500 42777
13539 216294 450911 371063 229455 363235 220751 143946 430480 148393 176133 484077
13529 484077 285884 348586 254337 131816 260836 504950 433550 309869 209428 502501
13519 502501 92123 357857 258457 56363 210861 345251 106093 305871 73070 136735
13509 136735 290892 124066 384171 124228 162132 192393 420896 236268 66932 254626
13499 254626 244148 358383 457314 472176 621753 77498 482334 41760 162507 293887
13489 293887 455983 461926 518320 294090 234709 255959 -55599 472726 173617 369741 352881
13478 352881 631971 441049 359741 587205 137947 370164 318646 136847 337070 71213
$$ packed form
13551C47973L6472f6678B98338K1018a07131B47234J30684K1321K5922M0339D2777
13539B16294K34617p9848j41608J33780j42484p6805K86534A48393K7740L07944
13529D84077j98193O2702r4249j22521J29020K44114p1400j23681j00441K93073
13519E02501I2123K65734r9400E6363J54498J34390A06093J99778G3070O3665
13509A36735J54157A24066K60105A24228L7904L0261K28503j84628F6932J87694
13499B54626j0478J14235R8931J4862J49577G7498M04836D1760J20747J31380
13489B93887J62096N943N6394k24230n9381K1250e5599D72726A73617J96124j6860
13478C52881K79090j90922q1308K27464A37947K32217n1518A36847K00223G1213
$$ plain form
13467 366461 153207 234123 60272 207809 215067 347754 237383 348622 431799 378310 591324
13456 591324 279794 514043 483932 278866 -62906 214142 231939 400003 353370 259295
13446 259295 287280 176200 573758 165582 -144476 484624 354624 421942 184000 182531
13436 182531 148644 226189 83315 -123446 288042 281314 94936 237288 268758 -53994 -114136
13425 -114136 259583 225439 293573 478672 89956 341793 205567 289316 273842 30834 163516
13414 163516 198268 278189 290296 322939 270912 195429 445496 103479 382756 221985 365541
13403 365541 105816 87951 362048 218747 224267 261810 213772 485678 442748 78283 305634
13392 305634 244565 85543 260400 326641 372707 -190019 76500 287928 113535 146405 66218
$$ packed form
13467C66461A53207Q0916F0272J47537P258J32687j10371J11239Q3177n3489K13014
13456E91324B79794K34249l0111k05066f2906B14142J7797J68064m6633r4075
13446B59295K7985j11080L97558A65582a44476D84624j30000O7318A84000j469
13436A82531l3887P7545H3315a23446B88042o728I4936J42352L1470e3994o0142
13425a14136B59583l4144O8134J85099H9956K51837j36226Q3749j5474C0834J32682
13414A63516L4752P9921J2107L2643n2027p5483K50067A03479K79277j60771J43556
13403C65541A05816j7865K74097j43301N520L7543m8038K71906m2930G8283K27351
13392C05634o1069H5543J74857O6241M6066a90019G6500K11428A13535L2870F6218
$$ plain form
13380 88222 438639 62447 -69735 294957 204478 424644 282648 628116 137471 220715
13370 220715 403794 193952 319276 379574 147114 241099 -20633 372877 18931 333366
13360 333366 110281 139471 151109 118541 411133 110244 297440 554137 -169978 408084
13349 294128 323387 487633 216551 -20336 150740 263593 713196 519323 359296 212106
13339 212106 252218 -29966 22466 237102 652586 340033 122308 -33286 261302 118106
13328 228516 234420 333837 -106216 497154 20333 169143 135541 480866 431095 -86348 325143
13316 173267 195288 257384 164372 63568 12897 383655 114521 124670 243853 187231 35017
13304 105270 -196720 244345 -240060 10548 192723 119590 64428 104524 185324 259834 132770
$$ packed form
13380H8222L50417F2447f9735B94957r0479K20166j41996L45468A37471Q3244
13370B20715J83079A93952J25324O0298A47114R3985b0633C72877A8931L14435
13360C33366A10281K9190J1638l2568K92592A10244J87196K56697a69978D08084
13349B94128K9259J64246B16551b0336A50740J12853M49603j93873j60027j47190
13339B12106M0112b9966B2466K14636M15484l12553A22308c3286B61302A18106
13328B28516N904R9417a06216D97154B0333J48810l3602L45325m9771h6348C25143
13316A73267K2021O2096r3012F3568A2897L70758A14521J0149J19183n6622C5017
13304A05270a96720B44345b40060A0548J82175p3133n5162M0096Q0800P4510j27064
$$ plain form
13293 132770 107478 207902 199510 10385 76162 200821 201011 123254 200124 101805 221238
13282 221238 151128 -130706 -27152 157596 187843 74582 16598 58052 -81869 -62717 29226
13270 -34189 -173817 121035 390782 -173038 156075 -40055 119591 417438 -14211 101599
13259 -20332 97785 138738 185035 105982 365620 398610 237109 170404 94900 233893 180036
13248 180036 429450 203976 -191510 264993 192012 219096 24068 240823 132952 -11981
13237 165223 242322 124627 120556 108956 1331 243512 305299 166138 171167 -114333 50219
13225 53540 -61601 106290 155999 -56396 183055 68258 218873 -28334 -290170 301687 -62586
13213 129497 300665 -273852 120961 3997 278968 -351660 488337 -108619 252634 360393
$$ packed form
13293A32770k5292J00424q392A0385O5777J24659J90p7757P6870r8319J19433
13282B21238p0110a30706b7152A57596L0247G4582A6598M1454h1869J9152B9226
13270c4189j39628A21035K69747a73038A56075d0055A19591K97847a4211A01599
13259b0332I7785M0953M6297p9053K59638L2990j61501o6705p5504J38993n3857
13248A80036K49414B03976a91510B64993p2981K7084B4068K16755j07871a1981
13237A65223P7099j17695m071j1600A331K42181O1787j39161N029a14333E0219
13225E3540f1601A06290M9709e6396A83055F8258J50615b8334k61836C01687f2586
13213A29497J71168b73852A20961C997K74971c51660D88337a08619B52634J07759
$$ plain form
13203 360393 187808 57334 447617 -163956 160960 -138890 373473 431620 -188292 143521
13192 -155450 -97398 -19789 132609 -130889 -85424 296871 337818 107492 173327 101134 66565
13181 66565 125211 185582 24105 63672 61508 253135 222518 288952 149780 165822 255058
13170 255058 336174 248437 362315 297018 13521 -263460 7961 -88187 -20239 13125 256026
13159 256026 427714 -65998 33269 187497 9777 117457 7174 188899 224915 111553 263992
13148 263992 -157727 162971 70883 317337 333265 -34983 153268 -5390 50999 -280394 165799
13136 55660 354169 -45815 70649 146794 235695 -15396 138278 98189 -84132 64517 -28153
13124 168167 113495 361928 121296 28379 -219990 -26263 146310 -104956 62102 25091
$$ packed form
13203C60393j72585E7334L90283a63956A60960a38890C73473N8147a88292A43521
13192a55450N8052a9789A32609a30889M5465B96871M0947A07492O5835p2193l4569
13181F6565N8646O0371B4105L9567k164J91627l0617O6434j39172J6042Q9236
13170B55058Q1116q7737J13878o5297A3521b63460G961h8187b0239A3125K42901
13159B56026J71688f5998C3269J54228I777J07680G174J81725L6016A11553J52439
13148B63992a57727A62971G0883K46454J5928c4983A53268e390E0999b80394A65799
13136E5660K98509d5815G0649P6145Q8901a5396A38278m0089h4132F4517b8153
13124A68167n4672K48433A21296B8379b19990b6263A46310a04956F2102B5091
$$ plain form
13113 -63702 127446 70258 -165906 171276 256153 267694 2442 12461 195329 56462 -77711
13101 -10384 -75339 65970 162092 116226 138771 264108 215576 -137836 32651 149051 193775
13090 193775 -78265 -17986 78751 23449 -20385 -144486 -337725 -82774 -281267 276683 289968
13079 289968 111118 350524 203402 -79528 200445 182880 382979 24137 70896 215314
13069 215314 -218739 295148 118422 264570 69207 378165 28199 -151251 -227509 -29349
13058 -89263 -47416 361264 -256367 138011 -308891 139285 213135 -27618 -34928 10412 125099
13047 125099 -15868 121593 -108140 234982 -191355 12834 144373 586601 43422 80932
13037 80932 154106 317975 1251 -27521 380 78296 -348985 -129488 151659 65876 72466 231033
$$ packed form
13113f3702A27446n7188a65906A71276Q4877J1541B442J0019J82868E6462g7711
13101a0384o4955F5970R6122m5866K2545J25337m8532a37836C2651J16400M4724
13090A93775g8265a7986G8751B3449b0385j24101j93239h2774j98493B76683J3285
13079B89968A11118K39406j47122g9528B00445j7565K00099B4137M6759J44418
13069B15314b18739B95148A18422J46148F9207L08958B8199a51251p6258b9349
13058h9263M1847C61264b56367A38011c08891A39285P3850b7618p310A0412J14687
13047A25099a5868A21593a08140B34982a91355A2834J31539M42228D3422L7510
13037H0932P3174J63869A251b7521C80P7916c48985a29488A51659F5876O590J58567
$$ plain form
13025 231033 175683 293383 181727 3202 -51219 211405 376621 145807 105521 6147 254806
13014 254806 28925 228649 101477 156241 21315 259199 204577 -43766 -25253 -252220 125025
13002 30460 212814 -202029 -104925 -13079 -306030 16577 318880 -147125 -321056 -100085
12991 2269 -32493 171915 51518 -37177 -151392 409 83102 279092 260518 -141964 137876
12979 -44546 121733 232188 -38757 -50210 -49648 261966 119595 -42671 -15903 19318 102603
12968 102603 35983 45982 -37951 198635 11381 34025 59922 10131 59122 137650 -19738
12956 298737 95661 -265170 197412 156859 -182283 81227 -13062 180859 129000 -109838
12945 248802 30410 101431 172434 -211941 39501 -87650 -56011 -31347 2307 127280 -84255
$$ packed form
13025B31033n5350J17700j11656C202e1219B11405J65216A45807m0286F147K48659
13014B54806B8925J99724A01477N4764B1315K37884n4622d3766J8513k26967A25025
13002C0460J82354b02029R7104a3079k92951A6577L02303a47125j73931a00085
12991B269c2493A71915E1518c7177j14215D09Q2693J95990j8574a41964A37876
12979d4546A21733J10455c8757j1453N62B61966A19595d2671a5903A9318Q3285
12968A02603C5983R999c7951A98635A1381K2644K5897A0131M8991P8528a9738
12956B98737I5661b65170A97412m0553a82283H1227a3062A80859n1859a09838
12945B48802C0410P1021P1003b11941C9501h7650L1639K4664B307J24973h4255
$$ plain form
12933 -49361 209132 274782 47887 87551 98430 -289102 302636 170131 117895 271650 -83550
12921 350137 15029 -12399 -248289 -54237 -33002 20935 -27984 -105889 177793 3066 -242879
12909 69157 -122992 140402 31893 203673 -242857 103604 83621 90381 49648 22074 -536
12897 161690 85723 54191 -270721 81448 -70463 -125337 -55313 -294650 92059 14121 336140
12886 336140 6374 -100141 345916 -70496 262937 -20316 -145859 -24812 166980 18429 225766
12875 225766 -346849 341490 23282 74581 259016 260972 390795 46595 -156093 -109148 -286064
12864 -286064 265220 99150 271671 233955 -1649 -236250 100360 183799 -32400 -52264 -4019
12852 -223267 -151490 143801 28664 250804 92270 8093 -205195 -282963 43604 38370 -60287
$$ packed form
12933d9361B09132O5650D7887L9664J0879b89102C02636j32505n2236J53755h3550
12921C50137A5029a2399k35890e4237K1235B0935b7984p7905A77793C066b42879
12909F9157a22992A40402C1893J71780b42857A03604j9983O760m0733B2074e36
12897A61690p5967l1532b70721H1448g0463n4874e5313k39337I2059A4121L22019
12886C36140F374a00141C45916g0496B62937b0316j25543b4812A66980A8429K07337
12875B25766c46849C41490B3282N1299J84435J956J29823D6595a56093M6945j76916
12864b86064B65220I9150J72521l7716a649k34601A00360Q3439c2400j9864d019
12852b23267P1777A43801B8664K22140I2270H093b05195p7768D3604n234f0287
$$ plain form
12840 371975 150959 77579 87258 372044 132443 264111 60340 -42129 111231 -32209 -279995
12829 -279995 236660 -106450 60029 -120669 161859 310020 9286 -15692 -69208 337298
12818 -122156 -333697 -194266 -28648 28261 84792 -23951 -236343 -37692 64584 563 -240944
12806 53264 127342 -85447 95012 -245913 -134562 -175318 111293 -133041 -86908 74409 145609
12795 145609 -90027 180177 -169994 -76666 -343911 -63994 -180858 133162 201194 81473
12784 9402 -128317 -148101 134382 43644 139608 229933 -12150 32915 280363 -208846 -100415
12772 282828 -69465 175501 29343 210605 -107060 164155 -17069 -325844 -78130 -70468 72127
12760 -17723 -30013 167274 41665 379800 128509 15142 25686 62598 171053 217885 -316367
$$ packed form
12840C71975A50959p3380R679K84786A32443J31668F0340d2129A11231c2209k47786
12829b79995B36660a06450F0029a20669A61859J48161I286a5692n3516C37298
12818a22156k11541J39431b8648B8261N6531b3951k12392c7692F4584E63b40944
12806E3264P4078h5447I5012b45913J11351m0756A11293a33041M6133G4409P1200
12795A45609i0027A80177a69994g6666k67245f3994j16864A33162O8032H1473
12784I402a28317j9784A34382D3644R5964R0325a2150C2915K47448b08846a00415
12772B82828f9465A75501B9343J81262a07060A64155a7069l08775g8130P662G2127
12760a7723j2290A67274D1665L38135A28509A5142J0544L6912J08455M6832c16367
$$ plain form
12748 57883 -135342 235946 -184985 -198092 -174095 151123 -237862 45325 121791 107648 242714
12737 242714 -875 -8283 198932 6374 96760 254494 408060 189948 215908 -83942 81289
12725 60907 -137940 -240275 26571 -68996 41197 -163674 27150 177727 64342 113455 -149345
12713 -63894 -122097 97240 -11367 -136275 278645 181059 437403 136310 341070 276253 133187
12701 138093 281520 -216117 78386 30980 279774 -78770 101756 154891 -191356 -111572
12691 -111572 78172 318926 27756 -97707 113797 -74420 201193 -233894 -37739 56052 82400
12680 82400 22619 -58594 -89987 6060 74317 -190340 -174535 -16814 26792 236035 -239559
12668 -58953 175186 -8211 341915 119394 -131631 -52334 254938 150025 198120 333842
$$ packed form
12748E7883a35342B35946a84985j3107K3997A51123b37862D5325P6466j4143J35066
12737B42714h75p408A98932F374R0386J57734J53566A89948K5960h3942H1289
12725F0907a37940j02335B6571f8996D1197a63674B7150J50577F4342M9113a49345
12713f3894n8203I7240a1367j24908B78645r7586K56344A36310K04760o4817A33187
12701A38093J43427b16117G8386C0980K48794g8770A01756N3135a91356P9784
12691a11572G8172K40754B7756i7707A13797g4420B01193b33894c7739E6052K6348
12680H2400B2619e8594l1393F060O8257a90340J5805a6814B6792K09243b39559
12668e8953A75186h211C41915A19394a31631e2334B54938j04913M8095J35722
$$ plain form
12658 333842 95581 -10346 173166 9375 178217 204421 -233522 121118 -283256 192377
12647 212482 37377 -20857 -57008 340713 153471 -141337 174612 64257 15650 -106989
12636 -47085 -91360 249543 -80000 -127619 139861 -181884 -129804 412250 67034 13937 217478
12625 217478 325343 -24493 553166 235522 292401 46319 244771 72290 27102 68248 288646
12614 288646 534979 -142146 324869 -210894 167118 -381126 123923 183031 -205477 105186
12603 272864 -5246 299937 332480 500974 -129193 301937 279098 251386 -58043 110817 63558
12592 63558 75979 30473 210449 -124924 43057 -224998 188925 -88718 152658 -226424
12581 -1070 -71029 109436 273869 80425 -426971 -52531 -114196 284953 70786 81607 334372
$$ packed form
12658C33842I5581a0346A73166I375J68842K6204b33522A21118b83256A92377
12647B12482C7377b0857l6151C40713A53471a41337A74612F4257A5650a06989
12636d7085m4275B49543h0000m7619A39861a81884N2080D12250F7034A3937K03541
12625B17478J07865b4493E53166B35522N6879D6319J98452G2290B7102M1146K20398
12614B88646K46333a42146C24869b10894A67118c81126A23923N9108b05477A05186
12603B72864e246B99937L2543J68494a29193C01937k2839k7712e8043A10817m7259
12592F3558J2421C0473J79976a24924D3057b24998A88925h8718A52658b26424
12581a070o9959A09436J64433H0425d26971e2531o1665B84953G0786J0821K52765
$$ plain form
12570 334372 233769 -168463 -169876 114199 -217938 -338269 19275 -59286 34905 -41608 152344
12558 -222512 -119001 1420 -115874 -8694 -147256 -175767 -169440 -463420 -165799 -233160 -126524
12547 -126524 -376028 -12301 -1930 337506 73118 -67755 -43543 -7456 -170146 310522 -18992
12535 -59221 -104241 59432 -68621 -229969 204378 -137042 -349822 -72809 178788 84656 175702
12524 175702 163802 7179 221922 -205537 -146786 66015 -16945 179902 -209312 226971 -133340
12512 -22522 -120593 230469 -227773 244994 46434 -206106 7133 149096 98508 57265 82786
12501 82786 314470 -15072 179392 299887 182438 40931 -118157 -40825 -185251 23389
12490 -61116 155065 -61455 -322138 -35185 -289228 38646 85252 203249 -238850 27547 295385
$$ packed form
12570C34372j00603a68463j413A14199b17938j20331A9275e9286C4905d1608A52344
12558b22512J03511A420a15874h694j38562k8511O327k93980a65799o7361J06636
12547a26524k49504a2301a930C37506G3118f7755K4212g456j62690C10522a8992
12535e9221m5020E9432f8621j61348B04378a37042k12780g2809A78788H4656R1046
12524A75702j1900G179K14743b05537N8751F6015a6945A79902b09312B26971a33340
12512b2522r8071B30469b27773B44994D6434b06106G133J41963n0588m1243K5521
12501H2786K31684a5072A79392J20495j17449D0931a18157d0825j44426B3389
12490f1116A55065f1455k60683c5185k54043C8646M6606J17997b38850B7547K67838
$$ plain form
12479 295385 -106496 -175181 -27792 354274 -75559 124218 -162092 -381026 -88083 -202419
12469 -202419 -155973 80718 -169759 33037 212947 177795 -42539 -102817 -144156 37821 -37930
12457 -38170 61587 119474 -280507 137442 28817 -19561 44247 -17886 87002 96575 145422
12446 145422 49431 -117114 100349 134804 -264029 -248094 2292 88315 -101440 461094 -37794
12434 167576 54195 135035 -15390 140465 -129738 -258711 88489 208640 70331 -308249
12423 68679 -391019 -8430 -417211 109570 -23779 -5530 10278 25827 -103233 -322301 9112
12411 17381 -155459 51326 287610 -106027 263132 -205577 -78408 1672 -150376 57241 -151271
12399 44229 -61737 260527 -85004 36896 -92605 146309 77197 127358 -355111 16419 -145276
$$ packed form
12479B95385a06496o8685b7792C54274g5559A24218a62092k18934h8083j14336
12469b02419M6446H0718a69759C3037J79910l5152d2539o0278m1339C7821c7930
12457c8170F1587N7887b80507A37442B8817a9561D4247a7886H7002R573M8847
12446A45422D9431a17114A00349L4455b64029J5935B292Q6023a01440D61094c7794
12434A67576E4195Q0840a5390A40465a29738j28973H8489J20151G0331c08249
12423F8679c91019h430m08781A09570b3779e530A0278J5549a03233k19068I112
12411A7381a55459E1326K36284a06027B63132b05577g8408A672a50376E7241a51271
12399D4229f1737B60527h5004C6896i2605A46309o9112N0161c55111A6419a45276
$$ plain form
12387 -15177 -297910 43000 46339 -5672 5659 172861 30096 11539 -321786 22669 64120 274594
12375 274594 -69145 -13819 166122 -200411 -173980 56710 63948 174084 62451 -102727 -258885
12364 -258885 -259601 -16882 -30883 -33704 -23059 244535 125270 -226982 281250 -28173 -215717
12353 -215717 198670 -131270 373039 -126199 -125668 -172301 62453 5573 211093 163775 -123243
12341 -162150 85808 196996 55207 2486 208425 -151275 -50053 -47405 -90490 245477 159784
12330 159784 255413 -43268 -321555 98229 200784 -93424 182492 -204597 37949 -40572 -6022
12318 281376 57062 -105603 -227705 278032 -122704 -28534 -85754 -206411 7919 -252217
12307 325008 -116532 -26384 -288176 -177689 -237674 228286 181844 54533 18905 123209
$$ packed form
12387a5177k82733D3000L339e672E659J67202C0096A1539c21786B2669M1451K10474
12375B74594f9145a3819A66122b00411K6431E6710P238J10136F2451a02727j56158
12364b58885p16a6882j4001k821J0645B44535j19265b26982B81250b8173j87544
12353b15717A98670a31270C73039a26199N31m6633F2453E573K05520m7318a23243
12341a62150H5808J11188E5207B486K05939a51275e0053K648m3085B45477q5693
12330A59784R5629d3268k78287I8229J02555i3424A82492b04597C7949d0572f022
12318B81376E7062a05603j22102B78032a22704b8534n7220j20657G919b52217
12307C25008a16532b6384k61792J10487n9985B28286m6442E4533A8905J04304
$$ plain form
12297 123209 112420 153 -12926 -126680 -128642 -189445 -37199 -321343 37419 -71389 90820 -136115
12284 163572 -124090 210385 -119460 -42564 151701 -338651 215528 -18488 8156 380567
12274 380567 478437 -49063 -265796 -29932 4372 -289158 13862 150004 53528 447153 186026
12262 95820 140665 -129023 -195221 123692 -2576 166968 -876 -64440 23510 71671 -14098 40608
12249 232567 -51978 121065 -107977 20194 267277 154748 140160 -675 -187012 98148 -229346
12237 5062 45914 204463 74094 -75703 78309 283533 81737 161359 21401 164350 477121
12226 477121 208275 11340 333945 -14174 -36753 224739 -84120 164336 -118157 159681
12215 388550 -73320 -61166 -22548 6772 -547767 -207559 -14593 -137879 -21165 180696 -303840
$$ packed form
12297A23209j0789A53a2926j13754j962o0803c7199k84144C7419g1389I0820a36115
12284A63572a24090B10385a19460d2564A51701c38651B15528a8488H156L72411
12274C80567R7870d9063k16733b9932D372b89158A3862J36142E3528L93625A86026
12262I5820M4845a29023o6198A23692b576A66968h76o3564B3510M8161a4098D0608
12249B32567e1978A21065a07977B0194K47083j12529j4588f75j86337I8148b29346
12237E062M0852J58549G4094g5703G8309K05224H1737P9622B1401J42949L12771
12226D77121B08275A1340L22605a4174k2579B24739h4120A64336a18157A59681
12215C88550g3320J2154b2548F772e47767b07559a4593j23286b1165A80696c03840
$$ plain form
12203 123691 167771 -282391 137133 64403 161310 165498 353905 220258 202320 412634 138005
12191 503401 237385 100061 -26154 160679 -183722 132692 289974 334298 97703 183201
12181 183201 89069 -136001 -121739 213933 471319 226519 258572 44761 177071 -284743
12170 145991 -57590 352060 46024 -24727 213534 45140 166994 30329 3256 73824 258849
12159 258849 177701 184013 69823 188525 69759 271774 -60921 154711 -190542 -248156 -149788
12148 -149788 211342 -231007 297733 176549 -275954 -233996 -144681 201962 401805 211510
12138 211510 98074 53933 -114618 151132 97327 -167817 113370 -87932 -78161 -75915 -232430
12127 -232430 -102247 1119 165314 9756 7954 -120705 168019 137051 -111673 86971 102804
$$ packed form
12203A23691M4080b82391A37133F4403R6907M188J88407j33647j7938K10314A38005
12191E03401B37385A00061b6154A60679a83722A32692J57282M4324I7703Q5498
12181A83201H9069a36001J4262B13933K57386B26519L2053D4761J32310b84743
12170A45991e7590C52060D6024b4727B13534D5140J21854C0329C256P0568J85025
12159B58849q1148O312F9823J18702F9759K02015f0921A54711a90542n7614R8368
12148a49788B11342b31007B97733j21184b75954M1958Q9315B01962J99843j90295
12138B11510I8074m4141a14618A51132n3805a67817A13370h7932R771K246j56515
12127b32430a02247A119J64195I756j802a20705A68019l0968a11673H6971J5833
$$ plain form
12116 102804 -62211 67090 -98910 13427 -325836 -400096 -95306 165136 -87358 -59292 199834
12104 -4762 -24371 -23821 248824 6084 113723 123864 -13344 -291175 -237435 178079 -73503 -168478
12092 -168478 -15916 -83163 23331 212153 208863 263428 273875 -282487 16965 54766 91449
12081 91449 74839 -209245 13475 126352 -174976 202026 700229 2028477 544891 281849
12071 281849 150637 83081 74346 194851 5382 149025 126596 -385146 24991 67566 -58305
12059 250876 43760 88800 -67355 264380 -68399 704 89086 95983 -62099 -50869 -263969 -243680
12047 -243680 -23621 34687 -213675 39840 207467 110199 -280297 59625 64797 209953 237250
12036 237250 -51944 -99643 -257242 37395 740 31352 47205 -109061 -276971 151546 53542
$$ packed form
12116A02804f2211F7090i8910A3427c25836p4260i5306A65136h7358K8066A99834
12104d762j9609N50B48824F084J07639J0141a3344k77831N3740A78079g3503r4975
12092a68478a5916o7247B3331J88822l290N4565J0447b82487A6965L7801L6683
12081I1449j6610b09245A3475J12877a74976B02026M98203J328248E44891k63042
12071B81849j31212o7556q735J20505E382J43643k2429c85146B4991M2575e8305
12059B50876D3760M5040f7355B64380f8399G04Q8382O897f2099J1230k13100K0289
12047b43680b3621C4687b13675C9840J67627r7268b80297E9625N172J45156K7297
12036B37250e1944m7699j57599C7395G40L0612J5853a09061j67910A51546E3542
$$ plain form
12024 -178216 -15502 258618 208405 14536 88292 -111879 45865 -76575 119961 65315 264677
12013 264677 -232513 143581 48002 -1804 -80901 454091 -160517 -11609 -365583 -44060 117414
12001 146933 29091 -285941 223953 -72588 -208250 -68718 159406 29514 10319 -295501
11990 295582 -30804 201439 -243034 -157229 -70904 -132390 63959 -30230 -105542 8203 263738
11979 263738 144120 -240517 178859 55632 271175 60318 38061 72021 -162300 185333
11968 -218745 -41404 32680 301072 45192 98157 139385 136249 -364965 -120467 -143997 -121993
11957 -121993 352527 -56402 -76684 139454 93674 84395 -163417 90725 -349141 -168216 -652
11945 -22315 319848 -300489 84051 -477206 251789 -420346 227283 -146300 -311007 163411
$$ packed form
12024a78216a5502B58618n0213A4536P3756a11879D5865g6575A19961n4646J99362
12013B64677b32513A43581D8002a804p9097D54091a60517a1609l53974d4060A17414
12001A46933B9091b85941B23953g2588j35662f8718A59406B9514A0319b95501
11990B95582c0804B01439b43034Q5805g0904o1486F3959c0230p5312H203K55535
11979B63738j19618b40517A78859E5632K15543F0318k2257L3960a62300A85333
11968b18745d1404C2680K68392D5192N2965M1228l136c64965a20467k3530K2004
11957a21993C52527e6402k0282A39454m5780r279a63417I0725c49141a68216f52
11945b2315C19848c00489H4051d77206B51789d20346B27283a46300j64707A63411
$$ plain form
11934 165987 -354934 47541 21409 69326 -9535 41075 142547 -364862 -70135 126085 -23436
11922 -356216 -26624 -7482 -142887 -252168 -210025 136600 95121 30854 -395579 -115019 157338
11910 -129883 68859 72395 -62000 -100233 -180314 -55571 366733 207251 -242419 -173842 37459
11898 -211867 173607 -37709 36565 -75388 -356701 -111688 99392 -40672 -55399 -42127 93387
11886 -99814 30744 -216597 -73035 218279 -179210 275663 -217725 29595 -101929 -76484
11876 -76484 46539 -304528 44881 -337147 98959 -138832 3474 -562249 29051 211866 -135283
11864 128906 114932 -59926 -173171 -81000 161659 115494 29659 -132844 -132716 -237925 -239758
11853 -239758 -131487 -268323 399219 -117652 98683 334543 -149216 -122889 143149 -79749
$$ packed form
11934A65987c54934D7541B1409M7917i535D1075J01472c64862g0135A26085b3436
11922c56216b6624g482j35405j09281M2143A36600m1479C0854c95579a15019A57338
11910a29883F8859L536f2000l8233q0081e5571C66733j59482b42419O8577C7459
11898b11867A73607c7709C6565g5388k81313a11688I9392d0672j4727J3272I3387
11886i9814C0744b16597g3035B18279a79210B75663b17725B9595a01929K5445
11876g6484D6539c04528D4881c37147I8959a38832C474e62249B9051J82815a35283
11864A28906j3974e9926j13245h1000A61659m6165B9659a32844J28j05209j833
11853b39758J08271j36836C99219a17652I8683K35860a49216K6327A43149g9749
$$ plain form
11842 -267378 -410855 169010 -18523 -4854 -83090 -272500 342478 -226538 -153277 69952 -80590
11830 109742 39525 -151070 14519 -79678 -148749 8654 -42333 -226218 -144676 -84992 -244718
11819 -244718 273603 -330170 187395 -19099 69650 -153063 45766 25659 -299752 -250839
11809 -250839 321267 -259294 -27009 406063 -43321 -238187 133556 -283845 48352 -111935
11798 -73114 -75939 -103365 142978 -49117 -40263 -375656 49550 170920 71019 123774 -12433
11786 -234760 -186634 -170119 -198554 291510 354913 161132 -386825 -68728 -104557 -108565 -174430
11775 -174430 73028 131742 -40687 -39766 -7376 -199142 -112764 85324 -68600 -13764 -127553 -47925
11762 -235596 -61418 108024 -2642 -60681 90983 -38171 386666 -123202 180235 83140 -80166
$$ packed form
11842b67378j43477A69010a8523d854p8236j89410C42478b26538P3261F9952h0590
11830A09742C9525a51070A4519g9678o9071H654d2333j83885Q1542N9684j59726
11819b44718B73603c30170A87395a9099F9650a53063D5766k0107b99752M8913
11809b50839C21267b59294b7009D06063d3321j94866A33556b83845D8352a11935
11798g3114k825k7426A42978d9117Q854l35393D9550J21370G1019N2755a2433
11786b34760M8126J6515k8435B91510O3403A61132c86825f8728l5829m008o5865
11775a74430G3028N8714d0687R21g376j91766Q6378H5324f8600a3764j13789d7925
11762b35596f1418A08024b642n8039I0983c8171C86666a23202A80235H3140h0166
$$ plain form
11750 38868 23052 -105778 61940 150453 10705 -151297 33424 1651 -141166 41819 183649
11739 183649 -160046 -91864 14935 11630 -327825 195671 76060 -121584 -53594 28872 -30762
11727 -51662 212647 -161286 208966 -204792 65270 -186447 67084 -126251 -113717 48536
11716 116203 -61866 100192 -7787 305197 249256 -47385 142699 43173 -142373 -51810 -53481
11705 -53481 -64223 112042 4812 281403 209391 192375 -57926 56620 277522 28818 154360
11694 154360 345496 108659 24930 5744 29674 -98393 110400 74330 320555 48901 -92115
11682 127374 66619 234556 -56675 315309 26097 59785 -161171 -92118 27508 -103754 85163
11670 136952 281710 138534 74194 -197149 80659 -59383 -3441 83132 -63986 4953 238484
$$ packed form
11750C8868j5816a05778F1940Q8513A0705a51297C3424A651a41166D1819J41830
11739A83649a60046O8182A4935l305c27825A95671G6060a21584e3594B8872c0762
11727e1662B12647a61286B08966b04792F5270a86447F7084a26251J2534D8536
11716A16203f1866A00192g787C05197n5941d7385A42699D3173a42373e1810j671
11705e3481j0742A12042D812K76591p2012j7016e7926E6620K20902B8818J25542
11694A54360J91136A08659B4930E744K3930i8393A10400l6070K46225D8901i2115
11682A27374o0755J67937e6675C15309B6097L3688a61171O9053B7508a03754H5163
11670A36952J44758A38534o4340a97149H0659e9383c441H3132f3986D953K33531
$$ plain form
11659 238484 -19142 135335 -153981 -158488 307300 140463 -71545 189498 9573 112246 -264452
11647 -219439 192123 391248 -56832 -182164 -165193 156022 201237 -71756 146072 -108705
11636 -210881 -55900 -79990 -115009 -269061 34694 328001 219393 172677 111755 499505 180981
11624 -114804 189468 141491 -94410 -152700 -188369 -140554 -281477 -131929 219615 173333 64095
11612 -108529 8508 4905 179633 -79245 -239406 239758 173991 -167599 9644 47172 19673
11600 13574 338388 99935 156774 -48922 119155 148629 52528 -97944 205043 22006 -127774
11588 -319493 66429 -205683 60778 -224037 221444 285835 59057 33132 148929 304013
11578 304013 23052 192840 -75437 -154183 67213 351283 81672 1245 -5312 -57500 -133755
$$ packed form
11659B38484a9142A35335a53981m507C07300A40463g1545A89498I573J02673b64452
11647b19439A92123J99125e6832j25332J6971A56022M5215g1756A46072a08705
11636b10881e5900k4090l5019j54052C4694K93307j08608m6716o0922L87750A80981
11624a14804A89468m7977i4410n8290l5669M7815j40923a31929B19615m6282F4095
11612a08529H508l603J74728g9245j60161B39758o5767a67599I644L7528A9673
11600A3574L24814I9935N6839d8922A19155K9474E2528i7944B05043B2006a27774
11588c19493F6429b05683F0778b24037B21444O4391E9057k5925J15797J55084
11578C04013B3052J69788g5437p8746F7213K84070H1672A245e312n2188p6255
$$ plain form
11567 -133755 -62622 210476 44239 -214396 -160409 -55985 63026 209826 -368245 -156414
11556 -159154 110274 27174 -21313 58194 65578 55647 41876 167319 163762 129064 153327 -112706
11543 89940 82862 231340 455141 28671 190824 -31212 401660 275692 33294 119467 336593
11532 336593 165431 -128235 60953 316276 110255 24084 9138 -269968 429205 33665
11521 -180697 101281 -239034 149944 324264 225631 5454 246821 60905 -159534 128293
11510 131980 -39028 43762 77053 162955 33482 296848 15970 -133707 25972 37713 -44019
11498 -23965 -54144 161591 300698 112278 198076 58832 150909 483112 102712 64603 217029
11487 217029 -126874 85967 -264024 -206872 -137 83641 382747 242842 -262945 39978 -47761
$$ packed form
11567a33755f2622B10476D4239b14396N3987e5985F3026J46800c68245a56414
11556a59154A10274B7174b1313E8194P384r931j3771J25443l557l4698K4263a12706
11543H9940p078J48478K23801B8671J62153c1212D01660j25968C3294Q6173K17126
11532C36593A65431a28235F0953K55323A10255B4084I138b69968D29205C3665
11521a80697A01281b39034A49944J74320r8633E454K41367F0905a59534A28293
11510A31980c9028D3762L3291Q5902C3482K63366A5970a33707B5972J1741d4019
11498b3965l0179A61591J39107A12278Q5798E8832R2077L32203A02712l8109J52426
11487B17029a26874H5967b64024N7152a37H3641K99106j39905b62945C9978d7761
$$ plain form
11475 -26034 270853 97939 -16672 283421 658760 209717 131849 492306 265942 65968
11464 349287 -28549 111944 47786 123356 131902 -214964 211171 355866 493065 182196
11453 -14732 36075 213513 429214 -363605 -26605 -149452 57930 93088 114330 -184115 252596
11441 323160 166198 111785 74914 -128416 135853 -229918 -57181 -201489 233149 120834
11431 120834 -123638 53286 15296 -169822 7285 -115995 133038 247099 61607 1831 -249530
11419 66359 281339 175536 -154242 139854 -163459 -140700 154640 -83061 15840 168890
11409 168890 207445 76438 41397 64386 -201280 -224985 -139279 -55931 308873 -86698 71467
11397 425308 -9368 -73531 -173454 36410 98660 10493 -157442 249585 -25427 10027 10399 29968
$$ packed form
11475b6034B70853I7939a6672B83421L75339B09717p7868L60457k26364F5968
11464C49287b8549A11944D7786P5570Q546b14964B11171J44695J37199A82196
11453a4732C6075J77438K15701c63605b6605j22847E7930L5158K1242a84115B52596
11441C23160j56962n4413l6871a28416A35853b29918e7181j44308B33149j12315
11431A20834a23638E3286A5296a69822G285a15995A33038J14061F1607A831b49530
11419F6359K14980j05803a54242A39854a63459K2759A54640h3061A5840J53050
11409A68890L8555G6438l5041K2989b01280k3705Q5706e5931C08873h6698G1467
11397D25308i368o4163r9923C6410O2250A0493a57442B49585b5427A0027L72J9569
$$ plain form
11385 29968 -43258 78422 -147958 49952 -248383 121370 140492 120178 73067 34765 -263664
11373 117766 -72558 238153 -188756 430688 71792 -41971 92948 247223 52125 19223 -97937
11361 -164511 -131999 -245424 -257971 -149188 135110 24484 -187652 509157 295308 -16044
11350 180541 -186581 -109093 -74948 121792 44372 249545 222192 149570 218877 -53103 -235329
11339 -235329 47736 36208 126124 -140619 79112 -146938 163329 9109 -240285 92705 44370
11327 -533177 -106871 106563 -222338 159271 -40371 -93640 83515 79208 -18398 -127353 -140372
11316 -140372 -70054 53940 -8451 79552 -94035 -127237 -319538 -210768 218897 -104416 -79570
11305 -79570 -72303 -30479 -127135 39599 230367 45852 -13355 -45631 -78461 78652 -72202 108420
$$ packed form
11385B9968d3258G8422a47958D9952b48383A21370J9122k0314m7111C4765b63664
11373A17766g2558B38153a88756D30688G1792d1971I2948J54275E2125A9223i7937
11361a64511L2512j13425j2547J08783A35110B4484a87652E09157k13849a6044
11350A80541a86581P7488L4145A21792D4372K05173k7353p2622O9307e3103j82226
11339b35329D7736j1528Q9916a40619G9112a46938A63329I109b40285I2705D4370
11327e33177a06871A06563b22338A59271d0371n3269H3515m307a8398j08955j3019
11316a40372g0054E3940h451G9552i4035l3202j92301J08770B18897a04416K4846
11305g9570P267c0479r6656C9599J90768D5852a3355l2276l2830G8652g2202A08420
$$ plain form
11292 -272699 -46847 -403065 -274152 340944 -175014 19390 73873 -138094 -85878 360486
11281 -49279 775 52276 -243897 -102312 -256698 -63674 -247056 127522 -33265 75653 456592
11270 456592 -10696 115648 -346475 144407 -70696 -363417 -118406 -185073 -3055 -256652
11260 -256652 -145825 98871 -263353 -159545 -112457 146195 -83140 42181 -67599 98674 47593
11248 -102300 12432 -414452 192356 -129663 -197231 -109876 -348073 276308 226308 246060
11238 246060 -121188 22705 -232636 -197175 -334745 212165 -56940 193860 155794 26221
11227 -84093 -103571 150864 161905 -393914 -295575 315049 176940 49765 -161916 19573 -130226
11215 117361 219005 116686 464716 30355 3761 -267542 162381 318987 -34325 352303
$$ packed form
11292b72699d6847l56218J28913C40944a75014A9390N4483a38094N2216C60486
11281d9279G75N1501b43897a02312j54386f3674j83382A27522c3265G5653L80939
11270D56592a0696A15648c46475A44407g0696k92721a18406o6667c055k53597
11260b56652J10827I8871b63353J03808M7088A46195h3140D2181f7599I8674D7593
11248a02300A2432d14452A92356a29663o7568Q7355k38197B76308n0000J9752
11238B46060a21188B2705b32636L5461j37570B12165e6940A93860l8066B6221
11227h4093j9478A50864J1041c93914R8339C15049j38109D9765a61916A9573a30226
11215A17361J01644j02319L48030C0355C761b67542A62381J56606c4325C52303
$$ plain form
11204 124253 -140537 102962 -190056 127695 -257152 -199092 72965 113930 -52403 -114503
11194 -114503 -193401 -129734 80395 -68940 24164 -178059 123057 -397637 181062 -320981
11183 46904 385278 -179243 53195 159633 -236800 -97865 110511 31344 4870 386 -151488
11171 49776 -148952 10365 240315 296602 -8892 -11960 -104667 -151176 -41409 85601 50439 -300670
11158 -23701 -64163 157527 158653 -160663 -8038 -54720 -40345 163389 -95286 88915 175353
11147 175353 -233439 3603 281403 -75219 112396 -49566 -111403 72165 -73439 -172424 12798
11135 352413 -114309 -10563 -106203 -308466 -23676 -207826 -7213 -106411 194406 -242570 109372
11123 220613 -254573 1385 -67124 -32327 98641 -145205 -81217 263170 -93887 -247062 -2493
$$ packed form
11204A24253a40537A02962a90056A27695b57152N8060G2965M0965e2403o2100
11194a14503p8898O3667H0395f8940B4164a78059A23057c97637A81062c20981
11183D6904L38374a79243E3195J06438b36800i7865A10511C1344D870C86a51488
11171D9776a48952A0365K29950N6287h892l068r2707m6509d1409H5601l5162c00670
11158b3701m0462A57527J126a60663h038m6682J4375A63389i5286H8915Q6438
11147A75353b33439C603K77800g5219A12396d9566o1837G2165g3439r8985A2798
11135C52413a14309a0563r5640k02263b3676j84150g213r9198A94406b42570A09372
11123B20613b54573A385f7124c2327I8641a45205O3988B63170i3887j53175b493
$$ plain form
11111 -75391 303360 -145149 -168347 177307 330350 -350045 23884 381056 303640 264155
11101 264155 123809 232100 282574 215788 271524 80172 -135028 58707 250942 433999
11091 433999 184542 236608 40194 461920 239501 5429 25912 425706 121912 100967 156668
11080 156668 2762 341003 252721 330915 120366 118420 35783 163114 215993 442479 362275
11069 362275 402897 364802 244827 348887 257046 627753 115894 345896 559193 284042
11059 284042 339195 246319 738012 595533 613514 591787 694566 842298 669699 616271
11049 616271 537018 656231 777443 659556 699671 315759 380099 396298 724493 796702
11039 796702 1046651 487858 427168 648321 560048 823628 715751 639738 445764 467691
$$ packed form
11111g5391C03360a45149k3198A77307J53043c50045B3884L57172p7416l9485
11101B64155A23809J08291N0474o6786N5736H0172a35028E8707J92235J83057
11091D33999A84542N2066D0194M21726k22419E429K0483L99794A21912k0945N5701
11080A56668B762L38241q8282P8194A20366j946C5783J27331N2879K26486q0204
11069C62275M0622l8095j19975J04060r1841L70707A15894K30002K13297k75151
11059B84042N5153r2876M91693j42479J7981k1727J02779J47732j72599n3428
11049F16271p9253J19213J21212j17887M0115C15759O4340J6199L28195P2209
11039G96702K49949D87858o0690K21153q8273K63580j07877p6013j93974K1927
$$ plain form
11029 467691 585407 876665 335821 511867 760170 925993 482422 267460 564907 879901
11019 879901 499397 669147 776543 492623 519129 697078 557128 419475 405364 729449
11009 729449 514463 172146 586704 517698 518398 274015 604379 333380 325460 488580 395151
10998 395151 404182 833722 296466 905212 678058 368854 652299 361659 1072692 846194
10988 846194 504899 464499 789818 996407 690155 597534 551053 1003699 1399483 1290995
10978 1290995 1607166 1381030 1848104 1626874 1684821 2394329 2311681 2447414 2369293 2383038
10968 2383038 2449228 2067914 1734846 1712819 1596243 1565113 1550266 1327699 1315572 1572593
10958 1572593 1708359 1499811 1752743 1754039 1616146 1112169 1120520 893519 756306 347511
$$ packed form
11029D67691J17716K91258C35821J76046K48303J65823m43571k14962K97447L14994
11019H79901l80504J69750J07396k83920K6506J77949j39950j37653j4111L24085
11009G29449k14986A72146M14558o9006P00k44383L30364k70999p920J63120r3429
10998C95151R031M29540B96466O08746k27154l09204K83445k90640P11033k26498
10988H46194l41295m0400L25319K06589l06252r2621m6481M52646L95784j08488
10978A290995L16171k26136M67074k21230N7947P09508q2648J35733p8121J3745
10968B383038O6190l81314l33068k2027j16576l1130j4847k22567j2127K57021
10958A572593J35766k08548K52932J296j37893n03977Q351k27001j37213C47511
$$ plain form
10947 623654 539960 570924 513525 540790 267188 216531 557411 272548 107666 58933 -20496
10935 216731 206531 171208 -109891 95742 275109 16040 164047 143346 -233183 -106864
10924 97641 102455 -30195 185710 80082 127170 -4346 78126 214855 -61765 168586 -337279
10912 350352 131036 131117 195490 78947 -248277 -316876 -20425 -6947 -156634 -187558 157734
10900 -12975 194854 124189 -49472 38247 246634 -64761 314321 -189382 344947 -161000
10889 -272867 290881 -277656 38393 23646 13613 -183610 2103 -119991 66317 -228164 166963
10877 150352 -253232 -170783 -106927 92269 19272 55320 51437 -326828 206553 28255 -240102
10865 16474 -100755 -109866 -40883 -146884 -7147 226172 -50482 -139387 -237019 -255769 186735
$$ packed form
10947F23654q3694L0964n7399K7265B67188n0657L40880B72548A07666m8733b0496
10935B16731j0200l5323a09891I5742J79367A6040J48007k0701b33183a06864
10924I7641M814c0195A85710H0082M7088d346G8126J36729f1765A68586c37279
10912C50352A31036Q1O4373G8947b48277o8599b0425f947j49687l0924A57734
10900a2975A94854p0665d9472C8247K08387f4761C14321a89382C44947a61000
10889b72867B90881b77656C8393j4747j0033a83610B103a19991F6317b28164A66963
10877A50352b53232Q2449O3856I2269A9272L6048l883c26828B06553B8255b40102
10865A6474a00755r111d0883j06001g147B26172e0482q8905r7632j8750A86735
$$ plain form
10853 108292 -1345 71150 -274008 -149384 -21959 -78666 -46309 -56611 -72284 129031 152275
10842 152275 208852 212970 117183 111679 -68262 -182680 246049 -4406 480949 32855 -158700
10830 -78517 125247 -137770 -127531 13947 109630 85972 108117 -128872 -104015 -266986 -56732
10818 -197678 113896 240973 10943 398519 76370 145236 -147564 88474 -367987 -403586
10808 -403586 -84401 -184409 83346 138560 7277 -9740 208218 289789 240939 -138228 -214916
10797 -214916 202083 180113 -189143 49589 -208286 -233835 15649 -156843 277576 86654
10786 -318825 -99299 -102345 -262577 -240659 -263268 -282719 44563 -482327 -186871 -163389 -108554
10775 -108554 -238376 251965 195994 105613 -125849 254125 -172886 73522 -91472 -61034
$$ packed form
10853A08292a345G1150b74008J24624b1959n6707L2357j0302j5673A29031K3244
10842A52275N6577M118r5787n504f8262j14418B46049d406D80949C2855a58700
10830g8517A25247a37770J0239A3947R5683k3658K2145a28872K4857j62971e6732
10818a97678A13896J27077A0943L87576G6370O8866a47564H8474c67987l5599
10808d03586h4401j00008H3346N5214G277i740B08218Q1571m8850a38228p6688
10797b14916B02083k1970a89143D9589b08286k5549A5649a56843B77576H6654
10786c18825i9299l046j60232K1918k2609j9451D4563d82327a86871K3482N4835
10775a08554j29822B51965n5971r0381a25849B54125a72886G3522i1472L0438
$$ plain form
10765 -61034 -148477 265693 -222308 -241724 -63854 16880 251758 -56099 -19455 -106117 -185064
10754 -185064 -136459 -15457 102797 -29311 -36050 -21710 240641 117565 -13648 6462 69525
10743 69525 -160801 58590 14653 -35278 -310636 -35220 -85566 269566 -164039 -347058 -186964
10732 -186964 8082 -148581 -399123 -525034 15686 -86187 53003 130842 16134 105654 36159
10720 -44762 -94045 -168488 129428 -372274 -239406 -38937 -344473 49539 107593 90484 294512
10709 294512 32904 -204759 -235378 -24782 110648 -25393 30557 -156009 -49496 23623 -18597
10697 90963 -294863 -118773 -32329 226481 -23311 -311118 -115823 -143282 172126 -224239
10686 30901 123065 -16876 -281793 -77447 -369561 30673 -88117 -186221 40131 88854 -204722
$$ packed form
10765f1034q7443B65693b22308j9416f3854A6880K34878e6099a9455q6662p8947
10754a85064M8605a5457A02797b9311o739J4340B40641A17565a3648F462O3063
10743F9525a60801E8590A4653c5278k75358c5220n0346B69566a64039j83019J60094
10732a86964H082a48581k50542j25911A5686h6187E3003P7839A6134Q9520C6159
10720d4762m9283p4443A29428c72274J32868c8937l05536D9539N8054j7109K04028
10709B94512C2904b04759l0619b4782A10648b5393C0557a56009d9496B3623a8597
10697I0963b94863a18773c2329B26481b3311k87807a15823k7459A72126b24239
10686C0901R2164a6876k64917g7447k92114C0673h8117r8104D0131M8723b04722
$$ plain form
10674 209520 39423 126508 46913 -174707 -25445 22084 62337 -126977 114029 -73442 -253405
10663 -253405 -114663 -18749 -216434 9469 196134 -104379 3938 -134027 19315 -33505 -104551
10652 -104551 142283 -107050 -192018 129562 107269 -40450 -471737 -117861 49618 -182230
10641 -18723 -136037 207698 -239444 126766 -20030 24794 -192156 42311 -219982 -215989 -101565
10629 21536 128840 -241573 -120356 -215176 161975 -433191 106675 1367 127407 195960
10619 195960 42703 53563 246511 -207332 122883 -79449 171856 -255033 11964 -215341
10608 -131491 -286896 -222310 -273894 58706 -98760 -57897 -122479 -173747 179623 -50637 -202121
10597 -202121 -127655 14741 -206596 -172546 103407 -155468 -115858 16456 102 -88531 33025
$$ packed form
10674B09520C9423Q7085D6913a74707b5445B2084M0253a26977A14029g3442j79963
10663b53405a14663a8749j97685I469J86665a04379C938a34027A9315c3505p1046
10652a04551A42283a07050q4968A29562k2293d0450m31287a17861D9618a82230
10641a8723j17314B07698b39444A26766b0030B4794a92156D2311b19982L993a01565
10629B1536J07304b41573a20356r4820A61975d33191A06675A367J26040O8553
10619A95960D2703J0860J92948b07332A22883g9449A71856b55033A1964b15341
10608a31491j55405O4586n1584E8706i8760M0863o4582n1268A79623e0637j51484
10597b02121P4466A4741b06596L4050A03407a55468L9610A6456A02h8531C3025
$$ plain form
10585 127700 -149864 -98163 -181331 -210426 -169387 -199754 -357104 -21311 -14223 235519 64189
10573 -4745 -321593 -68666 -178429 -181489 86074 107507 -179856 -24166 3080 -133715 232797
10561 118322 128891 -294774 -222578 -403811 160863 153425 -152351 -123927 85917 124167 -58174
10549 176438 -118205 -268851 26410 -283288 272606 80223 -29546 111232 -150922 -108563
10539 -108563 52323 64987 -220661 -63352 -75970 92779 119936 37869 -434364 -351870 -11911
10527 -156592 -64334 -116044 71899 174653 -32296 241199 -108818 -114764 395698 -312511 -248812
10516 -248812 4940 290792 -72947 198249 147378 -326354 22966 38982 30706 -250388 171136
10504 37922 -229670 -42436 -55341 56361 -28764 15015 -97817 63267 -287560 44435 78091
$$ packed form
10585A27700a49864N1701q3168k9095M1039l0367j57350b1311P088B35519F4189
10573d745l16848f8666j09763l060H6074K1433a79856b4166C080a33715B32797
10561A18322J0569b94774P2196j81233A60863p438a52351K8424H5917L8250e8174
10549A76438a18205j50646B6410b83288B72606H0223b9546A11232a50922M2359
10539a08563E2323J2664b20661f3352j2618I2779K7157C7869d34364Q2494a1911
10527a56592f4334n1710G1899J02754c2296B41199a08818n946C95698c12511O3699
10516b48812D940K85852g2947A98249n0871c26354B2966J6016q276b50388A71136
10504C7922b29670d2436j2905E6361b8764A5015i7817F3267b87560D4435L3656
$$ plain form
10493 78091 -54024 -96952 -193793 -15564 -251430 -105846 -154875 -30446 318485 -257677 135594
10481 460875 590666 299190 180838 787887 205063 26534 82261 -25726 417676 96897
10470 -320439 201755 -181641 -17941 66916 -221460 -140104 638850 100244 -28908 -412042
10460 -412042 -63649 -274021 -3183 -417855 -4326 216305 212996 -368327 -160195 243344 148720
10449 148720 191046 -24001 -223829 -131150 -237631 -21074 2238 112187 12961 322285 97506
10437 33863 259420 -24882 -16797 181638 -32189 68321 7822 -202614 -195036 131580 -59061
10425 -122702 335273 -33208 -176025 182182 -170412 35699 78428 -3639 -1596 -67137 137640
10413 162048 -177879 19255 224964 85446 31814 -68764 -140880 84611 37718 -152092 379421
$$ packed form
10493G8091e4024m2928r6841a5564k35866a05846m9029c0446C18485b57677A35594
10481D60875J29791k91476j18352O07049B05063B6534N5727b5726D17676I6897
10470c20439B01755a81641a7941F6916b21460Q1356F38850A00244b8908l83134
10460d12042f3649k10372c183m14672d326B16305l309c68327a60195B43344r4624
10449A48720M2326b4001j99828R2679j06481b1074B238J09949A2961L09324I7506
10437C3863K25557b4882Q085A81638c2189F8321G822b02614P578A31580e9061
10425a22702C35273c3208j42817A82182a70412C5699M2729c639a596o5541A37640
10413A62048a77879A9255K05709H5446C1814f8764p2116H4611C7718a52092C79421
$$ plain form
10401 -114058 -120013 -67034 -154112 137420 188404 -10890 51308 -21992 -179214 11942 108665
10390 108665 279543 13868 148486 -16760 -2160 -267486 175157 486740 292606 -41745
10379 198737 97454 -108526 483396 23252 114274 195507 -77814 149331 392470 -51008 328011
10367 14955 407657 318122 516479 365765 337277 2170 429541 195857 218570 46078 225060
10356 225060 192412 262277 195357 146779 296636 298359 440696 508947 536576 450842 405151
10345 405151 78503 167734 471539 292020 303775 160592 -247397 215947 286290 86858
10334 226302 386575 -263381 -144161 163338 -11381 -274740 105802 205585 176905 390421
10324 390421 137969 361401 275614 101589 3500 32743 312210 -324408 376930 296673
$$ packed form
10401a14058n955N2979q7078A37420N0984a0890E1308b1992j57222A1942R6723
10390A08665J70878A3868J34618a6760b160k65326A75157L11583j94134d1745
10379A98737I7454a08526D83396B3252R1022Q1233g7814A49331K43139e1008C28011
10367A4955L92702q9535J98357j50714k8488B170M27371A95857K2713D6078J78982
10356B25060l2648O9865o6920m8578J49857J723J42337O8251K7629q5734m5691
10345D05151G8503Q9231L03805j79519J1755j43183b47397B15947P0343H6858
10334B26302J60273b63381J19220A63338a1381k63359A05802R9783k8680K13516
10324C90421A37969K23432q5787A01589C500K9243K79467c24408C76930q0257
$$ plain form
10314 296673 80358 -48687 446211 -112998 18522 118492 -5794 -108216 5257 -316886 -27786
10302 -434669 88304 -314311 -7738 -28324 -14382 -105700 69972 73948 63649 -161293 202928
10290 307198 -16839 -591726 -179572 -44776 -193450 -229533 -451336 145268 -183248 -149032
10280 -149032 139239 -164933 -255524 76663 -43088 15087 -174130 -32264 331292 88320 -85433
10268 127700 -30842 -284959 -209550 28466 -29299 35065 226974 468196 586126 -13857 89766
10256 257846 16876 172720 286707 39079 -101501 -309302 33192 -57533 -10835 48711 -93032
10244 -183699 -455 -34605 88176 -156358 149700 -173253 -246979 152229 -77828 -160841 -144466
10233 -144466 -61861 -37124 -76759 27378 -220572 -236075 67136 -56629 -125975 4475 522 218224
$$ packed form
10314B96673H0358d8687D46211a12998A8522R9970e794j02422E257c16886b7786
10302d34669H8304c14311g738k0586J3942r1318F9972L976j0299a61293B02928
10290C07198a6839n74887a79572d4776j48674l6083k21803A45268a83248L4216
10280a49032A39239a64933r0591G6663d3088A5087a74130c2264C31292H8320h5433
10268A27700c0842k54117P5409B8466b9299C5065J91909K41222J17930a3857H9766
10256B57846A6876J55844J13987C9079a01501k07801C3192e7533a0835D8711i3032
10244a83699d55l4150H8176a56358A49700a73253p3726A52229g7828q3013J6375
10233a44466f1861K4737l9635B7378b20572j5503F7136e6629o9346D475E22K17702
$$ plain form
10221 218224 -109200 -29610 18430 14374 -45419 148104 189140 45375 188142 60672 -139980
10209 -347377 64325 -150411 -36559 -70900 -102166 -32604 -164859 -198658 -310209 90224 -270208
10197 -167862 -228192 105215 -252545 -174399 -92932 63879 33961 -104748 -70446 256218 -66399
10185 -20590 -2385 142319 -29498 206378 356121 210057 -317644 163682 -25068 1181 -165984
10173 6899 -57324 -38827 -337561 -60106 -59383 -398792 -115699 -13632 -218740 -81085 90787
10161 225479 -353380 -346933 -333754 -28592 190554 130140 -219886 189069 62128 201231 213620
10150 213620 -159089 75352 -86659 -268903 -366272 -148925 -86037 29518 -246558 -90246 -80882
10139 -80882 -139673 295285 102798 269701 -46637 -246175 -192968 -166035 108248 335845
$$ packed form
10221B18224a09200b9610A8430m056d5419A48104M1036D5375J42767F0672a39980
10209c47377F4325a50411c6559l4341l1266c2604j32255l3799j11551I0224b70208
10197a67862o0330A05215b52545P8146Q1467F3879k9918a04748L4302B56218f6399
10185b0590b385A42319b9498B06378J49743j46064c17644A63682b5068A181a65984
10173F899e7324J8497k98734f0106P23l39409a15699a3632k05108h1085I0787
10161B25479c53380O447J3179b8592A90554o0414b19886A89069F2128J39103J2389
10150B13620a59089G5352h6659j82244r7369a48925O2888B9518b46558i0246R364
10139h0882n8791B95285A02798J66903d6637j99538N3207K6933A08248K27597
$$ plain form
10129 335845 -109911 126713 -170457 -409996 -223165 -157855 -145333 203325 -20997 -283957
10119 -283957 126145 -94833 -26578 -210103 -293468 -68938 -39567 -401579 151775 52492 343282
10108 343282 22448 -251272 -130004 -112404 -261838 -100048 171170 312379 -284501 -120492
10097 -125590 -216452 52365 -150619 109020 -374654 69338 74224 51601 124910 -281298 -293687
10086 -293687 138480 -51305 -230636 -108118 -514561 36410 -74963 -234463 -117937 432863
10075 -327695 -202789 82809 97511 40460 -62371 -68068 -71002 59370 -32336 -242533 30732
10063 -51222 418856 -41822 -289761 153835 111339 157441 -21967 128346 -174114 13064 -5284
10051 -188861 -155126 -448329 -77226 -317347 46850 -141540 -207574 69949 72373 -51830 46592
$$ packed form
10129C35845a09911A26713a70457k39539J86831O5310J2522B03325b0997k62960
10119b83957A26145i4833b6578j83525q3365f8938K9371l62012A51775E2492K90790
10108C43282B2448b51272J21268J7600j49434a00048A71170J41209b84501a20492
10097a25590r0862E2365a50619A09020c74654F9338M886k2623P3309b81298j2389
10086b93687A38480e1305j79331a08118m06443C6410g4963j59500J16526D32863
10075c27695J24906H2809J4702D0460f2371n697k934E9370c2336k10197C0732
10063e1222D18856d1822k47939A53835m2496M6102b1967A28346a74114A3064e284
10051a88861L3735k93203g7226k40121D6850a41540o6034F9949K424e1830D6592
$$ plain form
10039 356304 -31808 -293731 -85641 -8870 -126235 -235178 -119385 86249 181714 100380 -331931
10027 -230743 -12590 -268594 266145 -181286 -142663 44229 -87919 42276 -363 -13651 -111326
10016 -111326 272497 189549 -252628 41669 74947 -90170 -233932 218488 -296262 -26053
10005 -32842 -25774 -76153 70207 -28092 128805 120267 76275 -138326 -33407 -231373 27366
9993 120170 311549 83425 -133884 -84073 -100704 -50958 279526 -51355 -196466 19673 -330738
9981 -205195 -67923 -303912 -203034 -94867 -7777 9971 -99850 -151012 -178238 152193 -83155
9969 -87902 -229546 76201 -299655 -39660 -161135 -151553 -245847 -319680 -223635 -78626 -562275
9958 -562275 -216067 -289518 -144450 -229708 -160859 -68406 -30476 -35675 112988 230730 -342
$$ packed form
10039C56304c1808k61923h5641h870j17365j08943J15793H6249R5465q1334c31931
10027b30743a2590k56004B66145a81286L8623D4229h7919D2276c63j3288r7675
10016a11326B72497q2948b52628D1669L3278i0170j43762B18488b96262b6053
10005c2842P068n0379G0207b8092A28805q538m3992a38326c3407j97966B7366
9993A20170J91379H3425a33884M9811j6631M9746B79526e1355j45111A9673c30738
9981b05195f7923k35989J00878i4867g777I971i9850n1162k7226A52193h3155
9969h7902j41644G6201b99655c9660j21475R582r4294p3833R6045g8626m83649
9958e62275b16067p3451a44450q5258O8849f8406c0476n199A12988J17742c42
$$ plain form
9946 -34123 -200990 -27243 146473 15531 -158574 179991 -193417 -223917 238876 155124 -6861
9934 54089 -285760 -308499 305084 -319822 -80138 -38231 369919 -390147 -189524 -101652 -296155
9923 -296155 80683 21800 -271184 -77605 257340 252516 -336105 80335 -240178 128951 -5729
9911 -396430 58931 -167173 -286299 -285224 166746 -149077 -19405 -34600 -357894 108702 -155427
9899 54283 107745 -104175 -56176 -156572 24056 -38352 -112319 -70973 -201222 -17001 107634
9887 34415 -28836 -38718 -18015 -188738 -8459 -203663 54611 -261436 109313 -134667 -223009
9876 -223009 -244158 -309156 200888 138274 86537 -97496 -247106 37042 -66006 -167389 -205657
9865 -205657 -8162 -356427 -168262 -39353 -33122 78017 116840 118699 -336679 62538 -17711 -203454
$$ packed form
9946c4123j66867b7243A46473A5531a58574A79991a93417l0500B38876q3752f861
9934E4089b85760k2739C05084c19822h0138c8231C69919c90147a89524Q7872j94503
9923b96155H0683B1800b71184g7605B57340m824c36105H0335b40178A28951e729
9911c96430E8931a67173j19126J075A66746a49077a9405j5195l23294A08702a55427
9899E4283N3462a04175M7999j00396B4056c8352p3967M1346j30249a7001A07634
9887C4415b8836r882a8015j70723h459j95204E4611b61436A09313a34667q8342
9876b23009k1149o4998B00888o2614n1737i7496j49610C7042f6006j01383l8268
9865b05657h162l48265a68262c9353O231G8017L8823J859c36679F2538a7711j85743
$$ plain form
9853 -203454 -112404 -111334 -88570 -265045 -175343 -180369 -262673 -307911 -238060 -350062 -163443
9841 -264816 361542 -232639 -102392 -333025 -301495 -485904 -78890 -20972 -342879 -22658
9830 -184667 44706 -16950 -347137 -164654 -72054 -54533 -316419 -29313 -402925 -164091 157263
9818 47183 -46161 -42738 -184299 260808 -52527 402806 164866 -364401 -74608 -9868 -157828
9807 -157828 -171188 -67148 -395314 -450797 -411255 -118598 -79944 -62418 151013 4869 -136139
9795 -7751 -212716 -128528 360264 -1831 -58028 -125833 22693 -210421 -59811 -22250 -234516
9784 -234516 102301 -488001 143838 82324 -200625 76471 67035 -100518 -186862 -10931 40378
9772 -22672 163207 139399 149584 118507 71566 -8399 215565 -87223 -23582 210174 347398
$$ packed form
9853b03454R1050J070K2764j76475Q9702n026q2304m5238O9851j12002a63443
9841b64816C61542b32639a02392k30633L1530j84409g8890b0972l21907b2658
9830a84667D4706a6950l30187a64654g2054J7521k61886b9313l73612a64091A57263
9818D7183d6161L423j41561B60808e2527D02806A64866c64401g4608i868j47960
9807a57828j3360f7148l28166n5483L9542a18598L8654J7526A51013D869a36139
9795g751k04965Q4188C60264a831n6197o7805B2693b10421e9811b2250k12266
9784b34516A02301d88001A43838o1514b00625G6471r436a00518q6344a0931D0378
9772b2672A63207k3808J0185l1077m6941h399B15565h7223b3582B10174J37224
$$ plain form
9761 347398 -207746 -197210 -410898 126239 -19482 11042 -311833 -39129 89849 -17547 -42128
9750 -42128 198939 71575 -304450 -12510 -310162 -288508 -306970 -77417 66157 146784 -539180
9738 -204988 47376 -259266 -8654 147613 -194763 -52760 116850 35229 304079 -260237 58296
9726 -203811 -77305 -93364 -99373 -59805 5308 -151012 154736 392298 -98551 -25719 -120616
9715 -120616 -66657 -243773 -92508 240424 -291296 -223776 -91214 336730 130059 349434
9705 349434 -248084 315021 8745 -113359 -156207 -195503 -26859 -111929 -3779 206220 -148663
9693 52819 65444 -22075 187848 -15746 -286558 -71807 25018 6944 -54133 601790 90663
9681 -150435 -57280 146196 50313 -67430 157723 -51082 -36586 -222938 168557 -190536 -287732
$$ packed form
9761C47398b07746J0536k13688A26239a9482A1042c11833c9129H9849a7547k4581
9750d2128A98939G1575c04450a2510k97652K1654j8462g7417F6157Q0627e39180
9738b04988D7376b59266h654A47613a94763e2760A16850C5229K68850b60237E8296
9726b03811g7305j6059o009L9568E308a51012A54736K37562i8551b5719r4897
9715a20616N3959j77116i2508B40424b91296O7520i1214C36730A30059K19375
9705C49434b48084C15021H745a13359m2848l9296b6859q5070c779B06220a48663
9693E2819J2625b2075A87848a5746k70812g1807B5018F944e4133F01790I0663
9681a50435e7280A46196E0313f7430A57723e1082J4496j86352A68557a90536r7196
$$ plain form
9670 -287732 -11581 -2469 -97492 -317825 62255 -110815 121679 -23932 254716 -4407 -375312
9659 -375312 -187284 9216 -341396 -92866 -135236 -62946 -418605 -8030 -5637 273 -389078 -360945
9647 -360945 -544970 -155999 201847 -333300 -180052 -182818 -141351 100666 15975 -61570 -166926
9636 -166926 -139803 48940 22369 -266771 161282 -112598 -361996 41318 -225034 -35703 177600
9624 -154055 63673 -139648 194745 -236669 -136267 -315238 98962 -174935 -180024 149394
9613 -83779 -211142 13148 -226871 -166818 -54260 130326 10096 -199769 -46015 -41316 -312314
9602 -312314 -79518 -412090 -84368 -119818 124276 -20452 -297689 -43450 -26187 88755 -23484
9590 -146494 -330789 31474 174146 -107777 -161799 231235 67202 -8491 -169026 -72911 -85795
$$ packed form
9670b87732a1581b469r5023k20333F2255a10815A21679b3932B54716d407l70905
9659c75312a87284I216c41396i2866m2370f2946l55659h030K393B73c89078K8133
9647c60945j84025a55999B01847c33300J53248k766M1467A00666A5975f1570j05356
9636a66926K7123D8940B2369b66771A61282a12598k49398D1318b25034c5703A77600
9624a54055F3673a39648A94745b36669J00402j78971I8962a74935n089A49394
9613h3779j27363A3148b26871O0053e4260A30326A0096a99769d6015M699k70998
9602c12314g9518l32572h4368l5450A24276b0452k77237d3450J7263H8755b3484
9590a46494j84295C1474J42672a07777n4022B31235F7202h491j60535g2911j2884
$$ plain form
9579 -85795 88968 103177 -267785 -77019 -29980 -118862 -229178 -152142 -30340 175021 -203468
9567 183490 187330 -103576 -164248 -396267 233188 91259 -173565 522 -303307 75031 -115937
9555 -182477 743 -14470 -37133 -174942 149506 -146678 -33485 -20715 72008 -205361 -263857
9544 -263857 -57823 235724 -8732 -90067 -293070 -213503 -163432 -120271 -151728 -109156 188467
9532 -117911 -151257 -243301 -182491 175170 -29493 187423 -21488 -202054 -287300 -169551 -582602
9521 -582602 -271136 -16048 -50055 45259 81671 99768 -77083 -137804 -14204 47250 50445 -18961
9508 -274898 -23298 190164 36273 78172 -205027 174749 -257403 154361 147245 96450 184574
9497 184574 328070 -167357 -27075 114489 -334546 -9386 -244967 -16165 -130122 -417251
$$ packed form
9579h5795H8968J4209b67785g7019b9980q8882j10316P7036c0340A75021b03468
9567A83490L840a03576o0672k32019B33188I1259a73565E22c03307G5031a15937
9555a82477G43a4470k2663j37809A49506a46678c3485J2770G2008b05361n8496
9544b63857e7823B35724h732q1335k03003P9567N0071M3161l1457M2572A88467
9532a17911l3346r2044O0810A75170b9493A87423b1488j80566q5246J17749m13051
9521e82602b71136a6048l4007D5259L6412J8097g7083o0721a4204D7250L195a8961
9508b74898b3298A90164C6273M1899b05027A74749b57403A54361p116n0795Q8124
9497A84574J43496a67357b7075A14489c34546i386k35581a6165j13957k87129
$$ plain form
9487 -417251 -275427 -918 46300 -126690 83341 -211611 5337 -313166 94718 -348211 68523
9475 -137642 -6223 -65318 -225147 -135130 21414 216188 47732 -391298 -67133 -239004 56097
9463 -270517 63921 117562 -118441 23975 -2613 135495 -320669 -303606 154861 94206 392315
9452 392315 244414 -241947 -54868 -206631 -154728 -250619 -339606 -87143 -129119 -222605 -43368
9440 16438 79903 139773 335800 25090 -44328 -54986 -186684 141418 -69079 -31010 -266535
9429 -266535 129847 -119390 140890 -15619 8202 -180938 -26605 74160 -280414 -79750 57700
9417 -434832 622890 89395 -376278 -239852 -84144 -272623 296815 101780 -265817 -29031
9406 134932 117636 -77834 7678 171265 -108983 148939 -401511 -102757 108399 -8934 -367686
$$ packed form
9487d17251J41824i18D6300a26690H3341b11611E337c13166I4718c48211F8523
9475a37642f223n9095j59829R0017B1414J94774D7732c91298f7133j71871E6097
9463b70517F3921N3641a18441B3975b613A35495c20669J7063A54861o0655K98109
9452C92315j47901b41947e4868j51763N1903r5891q8987h7143m1976r3486d3368
9440A6438O3465N9870J96027B5090d4328j0658j31698A41418f9079c1010k35525
9429b66535A29847a19390A40890a5619H202a80938b6605G4160b80414g9750E7700
9417d34832F22890H9395c76278J36426h4144j88479B96815A01780b65817b9031
9406A34932j7296g7834G678J63587a08983A48939d01511a02757A08399h934l58752
$$ plain form
9395 -367686 -139275 -94632 -220840 -190925 -65952 -69555 -83767 93905 83602 -253403 -47354
9383 -476864 -28050 178301 163750 -262452 -79653 165682 -182684 -76222 -165316 -231057 77267
9371 -214146 -238821 -375785 -133694 103950 -120596 -279073 -93013 -120058 54233 -131462
9360 -448432 15997 -207303 227914 -60324 58936 -374777 -297752 -106093 -179371 -262432 -184037
9349 -184037 -129778 329121 156941 -126583 171143 -72260 -236585 -97631 -158547 60315 51436
9338 51436 28901 33397 -36050 -150434 -163461 -269462 149496 221233 34167 -111139 -32756
9326 92714 130731 -159407 -257003 -238683 182008 73998 -266132 -85652 90703 -49531 -2216
9314 -372664 -151646 -65631 -168446 -66459 60297 -61656 -195321 117645 -157602 86892 224880
$$ packed form
9395c67686a39275M4643j26208K9915f5952l603j4212I3905j0303b53403d7354
9383d76864b8050A78301j4551b62452g9653A65682a82684g6222q9094o5741G7267
9371b14146k4675j36964a33694A03950a20596j58477i3013k7045E4233a31462
9360d48432A5997b07303B27914f0324E8936c74777P7025a06093p3278q3061P8395
9349a84037N4259C29121A56941a26583A71143g2260j64325i7631o0916F0315q879
9338E1436k2535M496c6050j14384j3027j06001A49496P1737C4167a11139c2756
9326I2714L8017a59407r7596J8320A82008G3998b66132h5652I0703d9531b216
9314c72664a51646f5631j02815f6459F0297f1656j33665A17645a57602H6892J37988
$$ plain form
9303 224880 -287619 -72344 -171158 162376 -26766 65791 -136572 -279855 -68159 176725 -274385
9291 -158487 46470 -132011 -104279 -201645 -153058 23393 -175430 92008 -215464 -23116 -175466
9280 -175466 -154538 -240868 1429 -62353 192205 -109064 284516 -67522 35110 -148743 -280646
9269 -280646 -68877 -108977 -61389 117972 30375 -166749 -66104 -132519 -195467 -185823 -206286
9258 -206286 -220884 44419 -209587 -252784 -165673 -370361 -74904 46754 77906 -91994 141105
9246 71390 -301925 -63160 -178476 -332431 45949 -25823 181311 16214 111058 30239 -95770
9234 -6207 181626 187565 100274 182339 138686 310056 -158542 -104893 5070 -122418 -4595 -60665
9222 -60665 -112435 -198930 -74916 187406 -302331 -169511 -207314 -154956 -271441 -148961 94046
$$ packed form
9303B24880b87619g2344r8814A62376b6766F5791a36572j43283f8159A76725b74385
9291a58487D6470a32011K7732r7366M8587B3393a75430I2008b15464b3116j52350
9280a75466K0928q6330A429f2353A92205a09064B84516f7522C5110a48743j31903
9269b80646f8877m0100M7588A17972C0375a66749f6104o6415o2948R644k0463
9258b06286j4598D4419b09587m3197Q7111k04688g4904D6754L1152i1994A41105
9246G1390c01925f3160j15316j53955D5949b5823A81311A6214R4844C0239i5770
9234f207A81626N939q7291Q2065m3653J71370a58542N3649E070a22418d595n6070
9222f0665n1770q6495g4916A87406c02331J32820l7803N2358j16485J22480I4046
$$ plain form
9210 -203351 340166 -40694 330429 -170585 -235225 -223276 141269 -172230 253543 -210398
9199 -62403 -270700 -5740 18576 229841 145103 257639 95545 -25012 -182452 41627 -132789
9187 30958 -205804 -117787 -81429 43079 -67979 -38157 -250137 -178337 152101 -35353 -193828
9176 -193828 -126981 -70759 10891 392218 -187991 -278439 915 -339439 -59037 -38630 -106633
9165 -106633 -135209 23045 -165858 -62056 -157104 -179337 -84147 -14332 269411 183701 -391240
9153 -76212 91877 -32689 27778 -171993 -271993 273725 -282578 -206668 -18499 -3555 -173146
9142 -173146 -32435 -49331 137191 -210184 -66987 -123147 -250568 -407669 -367110 -69386 -153664
9131 -153664 -176151 -272314 140365 -171894 -53940 -117708 114909 -147772 49472 -80453 -156416
$$ packed form
9210b03351C40166d0694C30429a70585o4640J1949A41269a72230B53543b10398
9199f2403k08297e740A8576K11265q4738J12536I5545b5012j57440D1627a32789
9187C0958b05804Q8017L6358D3079f7979K9822k11980P1800A52101c5353j58475
9176a93828O6847N6222A0891L81327a87991r0448I15c39439e9037K0407o8003
9165a06633k8576B3045a65858f2056r5048k2233h4147a4332B69411q5710c91240
9153g6212I1877c2689B7778a71993j00000B73725b82578P5910a8499c555j69591
9142a73146c2435j6896A37191b10184f6987n6160j27421j57101M0559f9386q4278
9131a53664k2487r6163A40365a71894e3940o3768A14909a47772D9472h0453p5963
$$ plain form
9120 -156416 55271 -120952 -279644 28260 -215121 -81088 -167445 -64293 -143307 62209 -192740
9108 -392636 -31611 124472 23261 10199 -413081 -20739 -76560 -19764 -325879 -358895 -461654
9097 -461654 266168 292237 -15028 -117707 222503 -105883 -135162 244549 257891 -93157 54923
9085 6180 -158262 -58094 -134996 30544 -81869 29598 -198849 296690 -372781 58978 147326
9074 147326 -300790 306710 234281 18839 16580 -243364 -347124 -376318 -353235 138417 132640
9063 132640 -250818 10703 27323 -81318 -179690 86259 -127639 378275 -19538 87004 -183541
9051 -122433 -91674 -51336 -117692 -136981 211566 83169 -324274 -408394 -52509 -317837 -137690
9039 97490 -2891 -179998 -370864 82460 3992 126225 -210763 70512 313125 46551 -170751
$$ packed form
9120a56416E5271a20952j58692B8260b15121h1088q6357f4293p9014F2209a92740
9108c92636c1611A24472B3261A0199d13081b0739n5821a9764l06115l3016j02759
9097d61654B66168K6069a5028j02679B22503a05883k9279B44549J3342i3157E4923
9085F180a58262e8094p6902C0544h1869B9598a98849B96690c72781E8978Q8348
9074A47326c00790C06710p2429A8839k259b43364j03760k9194K3083A38417n777
9063A32640b50818A0703J6620h1318r8372H6259a27639C78275a9538H7004a83541
9051a22433L0759M0338o6356j9289B11566H3169c24274q4120e2509k65328a37690
9039I7490b891j77107j90866H2460C992J22233b10763G0512K42613D6551a70751
$$ plain form
9027 88849 168597 7536 -151778 73081 146821 -33336 29250 297928 -171827 -250907 -281032
9016 -281032 111212 -44383 36508 246272 -34497 140385 94818 156567 -123845 -20571 -114325
9005 -114325 142629 -29787 -66802 79598 29061 64558 -85753 -156252 306158 -202294 -212031
8994 -212031 40661 178046 148198 -64931 -46246 -109269 76636 -285389 189795 -212905 18023
8982 -11780 -178129 -149787 -99755 38436 147839 -77657 -28193 -130503 91954 74865 -184525
8970 311509 -76803 139459 -201449 126798 1175 61929 111494 -77980 -12257 -25071 -60354
8959 -60354 243790 -81309 -49339 86668 53361 -445182 167109 -55501 -235735 -56186 303062
8947 -167088 -175039 -12663 -87666 146717 -59288 -130483 -388043 -14925 190763 274208 22910
$$ packed form
9027H8849P9748G536a51778G3081P3740c3336B9250K68678a71827p9080l0125
9016b81032A11212d4383C6508K09764c4497A40385m5567O1749a23845b0571r3754
9005a14325A42629b9787l7015G9598B9061L5497h5753p0499C06158b02294r737
8994b12031D0661J37385k9848f4931J8685o3023G6636b85389A89795b12905A8023
8982a1780j66349K8342N0032C8436J09403g7657b8193j02310I1954j7089a84525
8970C11509g6803A39459b01449A26798A175O0754M9565g7980a2257j2814l5283
8959f0354B43790h1309L1970H6668l3307d45182A67109e5501j80234e6186C03062
8947a67088p951a2663p5003A46717e9288p1195k57560a4925A90763Q3445B2910
$$ plain form
8935 -26736 103867 505841 81264 -209478 -14388 -97166 -163386 102776 -174441 127947 366643
8924 366643 993313 1897953 7872900 18127128 4859310 2121734 616635 679326 540219
8915 540219 347938 265677 230747 -193833 -119250 127149 177530 533233 417568 302037
8905 302037 -262643 -209302 -243568 126883 195229 -228199 -141554 -32901 151880 -147543 96314
8893 15667 -10307 -223046 -56564 11132 -100888 128911 -18791 -22343 -64128 -241320 -182560
8882 -182560 -64490 -27134 -120312 -237774 116365 -111240 -76513 -29879 19528 251391 -139321
$$ packed form
8935b6736A03867M01974H1264b09478a4388q2778o6220A02776a74441A27947K38696
8924C66643O26670R04640N974947J0254228D859310B121734F16635O2691j39107
8915E40219j92281q2261l4930a93833P4583A27149N0381L55703j15665j15531
8905C02037b62643N3341l4266A26883O8346b28199Q6645c2901A51880a47543I6314
8893A5667a0307k12739e6564A1132a00888A28911a8791l552m1785j77192N8760
8882a82560f4490b7134r3178j17462A16365a11240L4727b9879A9528K31863a39321
$$ [...]
##END NTUPLES=NMR SPECTRUM
##END=
