##TITLE=AC1539_ROEFFECT0011_8214524_ESldt897ex
##JCAMPDX= 6.0         $$ Bruker NMR JCAMP-DX V2.0
##DATA TYPE= NMR SPECTRUM
##DATA CLASS= NTUPLES
##ORIGIN= BRUKER
##OWNER= Administrator
$$ 1.72 TOPSPIN		Version 2.1
$$ 2013-10-11 18:48:28.889 -0700  Administrator@X
$$ Compression mode = diff/dup
##.OBSERVE FREQUENCY= 400.02188249412
##.OBSERVE NUCLEUS= ^1H
##.ACQUISITION MODE= SIMULTANEOUS (DQD)
##.ACQUISITION SCHEME= undefined
##.AVERAGES= 64
##.DIGITISER RES= 22
##SPECTROMETER/DATA SYSTEM= spect
##.PULSE SEQUENCE= noesygpps1d.comp
##.SOLVENT NAME= COFFEE_meoh
##.SHIFT REFERENCE= INTERNAL, COFFEE_meoh, 1, 14.96104
##AUDIT TRAIL= $$ (NUMBER, WHEN, WHO, WHERE, PROCESS, VERSION, WHAT)
$$ ##TITLE= Audit trail, TOPSPIN		Version 2.1
$$ ##JCAMPDX= 5.01
$$ ##ORIGIN= Bruker BioSpin GmbH
$$ ##OWNER= Administrator
$$ $$ E:\/data/COFFEE/nmr/AC1539_ROEFFECT0011_8214524_ESldt897ex/12/pdata/1/auditp.txt
$$ ##AUDIT TRAIL=  $$ (NUMBER, WHEN, WHO, WHERE, PROCESS, VERSION, WHAT)
(   1,<2013-10-11 18:48:23.920 -0700>,<Administrator>,<X>,<go>,<TOPSPIN 2.1>,
      <created by zg
	started at 2013-10-11 18:36:53.749 -0700,
	POWCHK enabled, PULCHK disabled,
       configuration hash MD5:
       C8 4E 4E 5D D3 5C D8 9E 9F 52 82 E0 59 8A DE 15
       data hash MD5: 64K
       AA A9 6F 4F D7 96 3D A0 D2 73 95 51 D6 29 26 6D>)
(   2,<2013-10-11 18:48:26.920 -0700>,<Administrator>,<X>,<proc1d>,<TOPSPIN 2.1>,
      <Start of raw data processing
       efp LB = 0.3 FT_mod = 6 PKNL = 1 PHC0 = 0 PHC1 = 0 SI = 128K 
       data hash MD5: 128K
       04 22 C7 FB F6 55 07 A0 8F 69 97 E3 19 9B 7F 97>)
(   3,<2013-10-11 18:48:27.920 -0700>,<Administrator>,<X>,<proc1d>,<TOPSPIN 2.1>,
      <pk PHC0 = -82.17773 PHC1 = 0 
       data hash MD5: 128K
       D3 FE CD E3 C6 BD 71 53 B5 DE 52 8A 97 B1 DE A4>)
(   4,<2013-10-11 18:48:28.327 -0700>,<Administrator>,<X>,<proc1d>,<TOPSPIN 2.1>,
      <abs ABSG = 1 
       data hash MD5: 128K
       B6 DB 85 F3 6F C5 17 C1 12 69 63 9C 75 7C 02 DC>)
(   5,<2013-10-11 18:48:28.420 -0700>,<Administrator>,<X>,<proc1d>,<TOPSPIN 2.1>,
      <abs ABSG = 2 
       data hash MD5: 128K
       68 A0 90 3C 13 55 E2 4A 61 F0 24 B3 80 95 43 8C>)
(   6,<2013-10-11 18:48:28.530 -0700>,<Administrator>,<X>,<proc1d>,<TOPSPIN 2.1>,
      <abs ABSG = 3 
       data hash MD5: 128K
       5E D7 29 53 22 83 72 FB 46 43 0F 37 B3 AE 7B 49>)
(   7,<2013-10-11 18:48:28.624 -0700>,<Administrator>,<X>,<proc1d>,<TOPSPIN 2.1>,
      <abs ABSG = 4 
       data hash MD5: 128K
       39 84 D1 F3 31 3E 74 10 F9 E5 4E 41 72 F1 C2 02>)
(   8,<2013-10-11 18:48:28.717 -0700>,<Administrator>,<X>,<proc1d>,<TOPSPIN 2.1>,
      <abs ABSG = 5 
       data hash MD5: 128K
       BE 52 A3 4C 79 FE 06 EE 49 5A 81 76 69 46 2E 1C>)
$$ ##END=
$$ 
$$ $$ hash MD5
$$ $$ E3 5F 88 63 5B 29 F3 39 84 CA 6A 78 9A 9B E0 42
##$RELAX= 
##$RELAX= 
##$RELAX= 
##$RELAX= 
##$RELAX= 
##$RELAX= 
##$RELAX= 
##$RELAX= 
$$ Bruker specific parameters
$$ --------------------------
##$DU= <E:\>
##$EXPNO= 12
$$ [...]
##$TP07= 0
##$TPNAME0= <>
##$TPNAME1= <>
##$TPNAME2= <>
##$TPNAME3= <>
##$TPNAME4= <>
##$TPNAME5= <>
##$TPNAME6= <>
##$TPNAME7= <>
##$TPOAL= (0..7)
0.5 0.5 0.5 0.5 0.5 0.5 0.5 0.5
##$TPOFFS= (0..7)
0 0 0 0 0 0 0 0
##$TUNHIN= 0
##$TUNHOUT= 0
##$TUNXOUT= 0
##$USERA1= <user>
##$USERA2= <user>
##$USERA3= <user>
##$USERA4= <user>
##$USERA5= <user>
##$V9= 5
##$VALIST= <valist>
##$VCLIST= <CCCCCCCCCCCCCCC>
##$VD= 0
##$VDLIST= <DDDDDDDDDDDDDDD>
##$VPLIST= <PPPPPPPPPPPPPPP>
##$VTLIST= <TTTTTTTTTTTTTTT>
##$WBST= 1024
##$WBSW= 4
##$XGAIN= (0..3)
0 0 0 0
##$XL= 0
##$YL= 0
##$YMAX_a= 5942158
##$YMIN_a= -12339445
##$ZGOPTNS= <>
##$ZL1= 120
##$ZL2= 120
##$ZL3= 120
##$ZL4= 120
##$ABSF1= 14.96104
##$ABSF2= -5.597142
##$ABSG= 5
##$ABSL= 3
##$ALPHA= 0
##$AQORDER= 0
##$ASSFAC= 0
##$ASSFACI= 0
##$ASSFACX= 0
##$ASSWID= 0
##$AUNMP= <proc_prof1d_extract.lims>
##$AXLEFT= 0
##$AXNAME= <>
##$AXNUC= <1H>
##$AXRIGHT= 0
##$AXTYPE= 0
##$AXUNIT= <>
##$AZFE= 0.1
##$AZFW= 0.1
##$BCFW= 0
##$BC_mod= 0
##$BYTORDP= 0
##$COROFFS= 0
##$CY= 15
##$DATMOD= 1
##$DC= 0
##$DFILT= <>
##$DTYPP= 0
##$F1P= 0
##$F2P= 0
##$FCOR= 0.5
##$FTSIZE= 131072
##$FT_mod= 6
##$GAMMA= 0
##$GB= 0
##$INTBC= 1
##$INTSCL= 1
##$ISEN= 128
##$LB= 0.3
##$LEV0= 0
##$LPBIN= 0
##$MAXI= 10000
##$MC2= 0
##$MEAN= 0
##$ME_mod= 0
##$MI= 0
##$NCOEF= 0
##$NC_proc= -2
##$NLEV= 6
##$NOISF1= 0
##$NOISF2= 0
##$NSP= 0
##$NTH_PI= 0
##$NZP= 0
##$OFFSET= 14.96104
##$PC= 1
##$PHC0= -82.17773
##$PHC1= 0
##$PH_mod= 1
##$PKNL= yes
##$PPARMOD= 0
##$PPDIAG= 0
##$PPIPTYP= 0
##$PPMPNUM= 2147483647
##$PPRESOL= 1
##$PSCAL= 4
##$PSIGN= 0
##$PYNMP= <proc.py>
##$REVERSE= no
##$SF= 400.020009622029
##$SI= 131072
##$SIGF1= 0
##$SIGF2= 0
##$SINO= 400
##$SIOLD= 131072
##$SPECTYP= <>
##$SREGLST= <1H.CDCl3>
##$SSB= 0
##$STSI= 131072
##$STSR= 0
##$SW_p= 8223.68421052631
##$SYMM= 0
##$S_DEV= 0
##$TDeff= 65536
##$TDoff= 0
##$TI= <>
##$TILT= no
##$TM1= 0
##$TM2= 0
##$TOPLEV= 0
##$USERP1= <user>
##$USERP2= <user>
##$USERP3= <user>
##$USERP4= <user>
##$USERP5= <user>
##$WDW= 1
##$XDIM= 131072
##$YMAX_p= 417237456
##$YMIN_p= -30175
##$CURPLOT= <Network HP LaserJet P1505>
##$CURPRIN= <$Network HP LaserJet P1505>
##$DFORMAT= <normdp>
##$LAYOUT= <+/1D_H.xwp>
##$LFORMAT= <normlp>
##$PFORMAT= <normpl>
##$SURQMSG= 1
$$ End of Bruker specific parameters
$$ ---------------------------------
##NTUPLES= NMR SPECTRUM
##VAR_NAME=  FREQUENCY,     SPECTRUM/REAL,   SPECTRUM/IMAG
##SYMBOL=    X,             R,               I
##VAR_TYPE=  INDEPENDENT,   DEPENDENT,       DEPENDENT
##VAR_FORM=  AFFN,          ASDF,            ASDF
##VAR_DIM=   131072,        131072,          131072
##UNITS=     HZ,            ARBITRARY UNITS, ARBITRARY UNITS
##FACTOR=    0.0627417313425164, 1,          1
##FIRST=     8223.62146879497, -408,         -63059
##LAST=      0,             1500,            -64138
##MIN=       0,             -30175,          0
##MAX=       8223.62146879497, 417237456,    0
$$ Real data points
##PAGE= N=1
##DATA TABLE= (X++(R..R)), XYDATA
$$ [...]
61723D25247J155P66O63O27O95J057J467J460J184J299J894K209J680O87j22o92
61707D41276j338j999k298k181k070k349k939l427l543l460l656m294m854m593
61693C98275l483k427k295k919l358l105k698k887l507l613k772j735j521k137
61679C59818k751k898k853k799k410j604j020j163j545j323n36pr8l04j04L60
61663C38763O93Q05P80O03L31K65O13J114J331J231J193J448J770J860J760J671
61647C56231J480Q85J2m49l6Q69J556J883K183K475K399J908J418J063M60n57
61631C73780j550k156k560k878k674j738q76j060k023k535k043j259r79j040q36
61616C47573l03R0P8j30k81m34q18j546k557l711m707n064m465l273k391k324
$$ plain form
61723 425247 426402 427168 427831 428458 429153 430210 431677 433137 434321 435620 437514 439723 441403 442090 441968 441276
61707 441276 439938 437939 435641 433460 431390 429041 426102 422675 419132 415672 412016 407722 402868 398275
61693 398275 394792 392365 390070 387151 383793 380688 377990 375103 371596 367983 365211 363476 361955 359818
61679 359818 357067 354169 351316 348517 346107 344503 343483 342320 340775 339452 338916 338909 338811 338507 338403 338763
61663 338763 339456 340261 341041 341644 341975 342240 342853 343967 345298 346529 347722 349170 350940 352800 354560 356231
61647 356231 357711 358596 358608 358159 358123 358992 360548 362431 364614 367089 369488 371396 372814 373877 374337 373780
61631 373780 372230 370074 367514 364636 361962 360224 359348 358288 356265 353730 351687 350428 349449 348409 347573
61616 347573 347270 347360 347438 347308 347027 346593 345775 344229 341672 337961 333254 328190 323725 320452 318061 315737
61600C15737k663k786k773l069l459l185k169j356j525k324k861k705k017j132
61586B81713m32k14l12k74j66o00j656k431k216j492j086r68o66l25l99o36l51
61569B67489M34J053J275J429J529J278R53J251J963J824K51j601k160j226J57
61554B75899J201J878K248K024J084q4p27m98L30J239J854K043J794J240P17N35
61538B92777N48K43o03j456j538p27K89P48N35J58J13L15K49l09r41j113q99p60
61520B87629p77o04j92N2n7k15k02j56j6O02J590K071J456K93m49n56n12o89j048
61501B88220j343j183l23P34R62J01q46r32m45j13J07N87J008Q13L04K07M17K72
61483B88547j23N1R26J683J826J766J930K127K057J730J174L50m32n79M5R63J677
$$ plain form
61600 315737 313074 310288 307515 304446 300987 297802 295633 294277 292752 290428 287567 284862 282845 281713
61586 281713 281281 281067 280755 280481 280315 279715 278059 275628 273412 271920 270834 269866 269200 268875 268476 267840 267489
61569 267489 267923 268976 270251 271680 273209 274487 275440 276691 278654 280478 280729 279128 276968 275742 275899
61554 275899 277100 278978 281226 283250 284334 284250 283523 283025 283355 284594 286448 288491 290285 291525 292242 292777
61538 292777 293325 293568 292965 291509 289971 289244 289533 290281 290816 290974 291087 291402 291651 291342 290401 289288 288389 287629
61520 287629 286852 286248 286056 286108 286051 285836 285634 285478 285462 286064 287654 289725 291181 291474 291025 290469 289957 289268 288220
61501 288220 286877 285694 285371 286105 287067 287168 286322 285390 284945 284832 284939 285526 286534 287347 287651 287858 288275 288547
61483 288547 288424 288475 289401 291084 292910 294676 296606 298733 300790 302520 303694 304044 303612 303033 303078 304041 305718
61466C05718J981J726R04K4k60K5K63J74N8J10J06l7n0J52K64J37J04N31J366
61447C13296K236K756K706K144J336M47m65j048p81J80Q74P55M10M91O37L40J09
61430C26423O41J358J097n6q81q08l39J42O69Q97L64l74k36O65J179J069J289
61413C33099J996J980P03o15q15l81k88m80n02n91j040j327r80o21j050j846j912
61396C25330j071j69J65R2J3J37M80Q80J067R42N96Q1m42m08N42J671J798R57
61378C32661M02P08J070R09Q74J502K005J525N83K19M27N76P38J329J963J808
61362C49299R75M45P58J602K517L247L577L523L543L895M212M261M657N908P292
61347C99711P644O984O237N572M284K386J069J117J869K296K266K187J998J309
$$ plain form
61466 305718 307699 309425 310329 310353 310093 310118 310381 310555 310613 310723 310829 310792 310742 310894 311158 311295 311399 311930 313296
61447 313296 315532 318288 320994 323138 324474 324921 324456 323408 322627 322807 323681 324436 324846 325337 325974 326314 326423
61430 326423 327064 328422 329519 329463 328582 327774 327435 327577 328246 329143 329507 329133 328897 329562 330741 331810 333099
61413 333099 335095 337075 337778 337163 336348 335967 335679 335199 334697 334106 333066 331739 330759 330138 329088 327242 325330
61396 325330 324259 324090 324255 324347 324360 324497 324977 325857 326924 327866 328462 328543 328101 327693 328235 329906 331704 332661
61378 332661 333063 333771 334841 335750 336624 338126 340131 341656 342239 342458 342885 343461 344199 345528 347491 349299
61362 349299 350274 350719 351477 353079 355596 358843 362420 365943 369486 373381 377593 381854 386511 392419 399711
61347 399711 407355 414339 420576 426148 430432 432818 433887 435004 436873 439169 441435 443622 445620 446929
61333D46929L01l10j55L09M06mn25q31j010j264j587j833j889j545m99J132K589
61316D40214L262L523M076M730M659L940L788M895O523P819R147J1265J3787J5452
61302E37080J5665J4948J3932J2613J0745Q397O002L958K326Q17q33k496l862
61289F19292m890n777o570p235p965q856r384q948p906p232p079o620n481m323
61275E21026l630k967j941r74m66j09L61N26J61j19J48M48K63J44Q39K052L079
61258E18841L977N035N697N200L938L008K625K106J268O94O34O67N40M52L43k50
61242E54775j348k274k468k106j682j442j346j214q78l95j27k81m84j10J027K533
61226E42180L839M656N174N874O892P611P481P112P734R346J0429J0051R202R259
$$ plain form
61333 446929 447230 446920 446765 447074 447480 447476 446951 446120 445110 443846 442259 440426 438537 436992 436493 437625 440214
61316 440214 443476 446999 451075 455805 460464 464404 468192 473087 479610 487429 496576 507841 521628 537080
61302 537080 552745 567693 581625 594238 604983 613380 619382 623340 625666 626483 625650 623154 619292
61289 619292 614402 608625 602055 594820 586855 577999 568615 559667 551761 544529 537450 530830 525349 521026
61275 521026 517396 514429 512488 511514 511048 510939 511300 511826 511987 511868 512016 512464 512727 512871 513710 515762 518841
61258 518841 522818 527853 533550 538750 542688 545696 548321 550427 551695 552389 553023 553690 554230 554682 555025 554775
61242 554775 553427 551153 548685 546579 544897 543455 542109 540895 540017 539622 539495 539214 538730 538620 539647 542180
61226 542180 546019 550675 555849 561723 568615 576226 583707 590819 598553 607899 618328 628379 637581 646840
61212F46840R948R865Q472O540M931L895L414L444L768M135M483M763M923N338
61198G24759O679Q867J0797J1662J1964J2636J3730J4603J4738J3763J1439Q349
61186H63986N913M785L892J953o23k413k870k654k535l079m841p720j0463j1829
61172H31502j1994j1957j1987j1716j1222j0960j0955j1103j1746j2949j3750
61161G01163j3406j2785j3184j4155j4086j2676j1211j0383r453p807n994m669
61149E71354l633k383r38J74K77j010l109m650m979n017n759o535o040m419k920
61134E20413j874o28Q02J722K369L812N999P557P864P921Q688R963J1310J2864
61120E98782J4710J6529J8296K0284K2210K3399K4026K4993K6343K7091K6821
$$ plain form
61212 646840 656788 666653 675125 681665 686596 690491 693905 697349 701117 705252 709735 714498 719421 724759
61198 724759 731438 740305 751102 762764 774728 787364 801094 815697 830435 844198 855637 863986
61186 863986 869899 874684 878576 880529 879906 877493 874623 871969 869434 866355 861514 853794 843331 831502
61172 831502 819508 807551 795564 783848 772626 761666 750711 739608 727862 714913 701163
61161 701163 687757 674972 661788 647633 633547 620871 609660 599277 589824 582017 576023 571354
61149 571354 567721 565338 564400 564574 564851 563841 560732 556082 551103 546086 540327 533792 527752 523333 520413
61134 520413 518539 517911 518713 520435 522804 526616 532615 540172 548036 555957 564645 574608 585918 598782
61120 598782 613492 630021 648317 668601 690811 714210 738236 763229 789572 816663 843484
61109H43484K6217K5625K4447K2444K0345J8577J6574J3915J1136Q761O474L817
61097A041816Q32k378n872r255j1833j3812j6278j9537k2425k3849k4070k3949
61085H69390k3712k3065k1856k0217j8505j7320j6930j6689j5726j4166j2751
61074F68453j1479r752p731o214n133l567j468N6M82N76J037J774K713M002N166
61059F38915N542N748P137R438J0799J0678J0818J2509J4700J5894J6304J6925
61047G75407J7886J8970K0489K2483K4160K5205K6607K9127L1938L3807L4631
61036A060710L5033L5375L6019L7506L9736M1891M3694M5680M7831M9426N0574
61025A523475N2146N3816N4253N4040N6123O2090P0284P8887Q8615J00544J13584
$$ plain form
61109 843484 869701 895326 919773 942217 962562 981139 997713 1011628 1022764 1031525 1037999 1041816
61097 1041816 1042648 1040270 1034398 1025143 1013310 999498 983220 963683 941258 917409 893339 869390
61085 869390 845678 822613 800757 780540 762035 744715 727785 711096 695370 681204 668453
61074 668453 656974 647222 639491 633277 628144 624577 623109 623165 623647 624223 625260 627034 629747 633749 638915
61059 638915 644457 650205 657342 666780 677579 688257 699075 711584 726284 742178 758482 775407
61047 775407 793293 812263 832752 855235 879395 904600 931207 960334 992272 1026079 1060710
61036 1060710 1095743 1131118 1167137 1204643 1244379 1286270 1329964 1375644 1423475 1472901 1523475
61025 1523475 1575621 1629437 1683690 1737730 1793853 1855943 1926227 2005114 2093729 2194273 2307857
61014B307857J26302J39597J55588J75551K00763K33289K73913L21526L76866
61005D311252M44603N29390O32782P56779R06657J086731J298418J545288J824278
60996A3336178K087565K214060K056544J559891Q43324J47242l18675m82885l91183
60987B1052061j25113K24165N19304N79877K81887l30881j052266j645847j981261
60978A7521926k063986j971197j782345j555047j328327j124357r48842p98841
60970E948984o71607n65436m76920m02206l39746k89154k48784k16472j91143
60961B547516j71672j55577j40696j26954j14900j03738r2442q1580p2266o4278
60951A423413n6863n0577m6658m4992m4098m2796m0829l8310l5628l3485l2092
$$ plain form
61014 2307857 2434159 2573756 2729344 2904895 3105658 3338947 3612860 3934386 4311252
61005 4311252 4755855 5285245 5918027 6674806 7581463 8668194 9966612 11511900 13336178
60996 13336178 15423743 17637803 19694347 21254238 22097562 22244804 21926129 21443244 21052061
60987 21052061 20926948 21151113 21670417 22250294 22532181 22201300 21149034 19503187 17521926
60978 17521926 15457940 13486743 11704398 10149351 8821024 7696667 6747825 5948984
60970 5948984 5277377 4711941 4235021 3832815 3493069 3203915 2955131 2738659 2547516
60961 2547516 2375844 2220267 2079571 1952617 1837717 1733979 1641537 1559957 1487691 1423413
60951 1423413 1366550 1315973 1269315 1224323 1180225 1137429 1096600 1058290 1022662 989177 957085
60940I57085l0740k8864k6924k5558k4566k3517k2558k1750k0472j8498j6874
60929F96764j6526j6682j5890j4073j2261j0787r177p580o792o790o529n540m637
60916E63500m546m816m571l748k978k677k639k336j345K79J845K457J820N64l08
60901E40501k89K98P06N45J43K7J18k60j481l029m069m296l984l438k853k584
60885E16055l126m605o457p755p924p147o181n747o051o755p299p297o800o265
60871D26646o043n821m907l245j711j082j006o07K19P71P28O01R34J610K171K371
60855D11629K171J665J181J121J457J761J876K231L171M282M672L873K286P81
60841D44157o3l48n40q76j286j756k405l065l231k792k329k330k523k382j948
$$ plain form
60940 957085 926345 897481 870557 844999 820433 796916 774358 752608 732136 713638 696764
60929 696764 680238 663556 647666 633593 621332 610545 601368 593788 586996 580206 573677 568137 563500
60916 563500 558954 554138 549567 545819 542841 540164 537525 535189 533844 534123 535968 538425 540245 540809 540501
60901 540501 540212 540510 541216 541761 541904 541931 542049 541789 540308 537279 533210 528914 524930 521492 518639 516055
60885 516055 512929 508324 501867 494112 486188 479041 472860 467113 461062 454307 447008 439711 432911 426646
60871 426646 420603 414782 409875 406630 404919 403837 402831 402224 402443 403214 403942 404543 405477 407087 409258 411629
60855 411629 413800 415465 416646 417767 419224 420985 422861 425092 428263 432545 437217 441090 443376 444157
60841 444157 444094 443746 443206 442330 441044 439288 436883 433818 430587 427795 425466 423136 420613 418231 416283
60826D16283j565j270r87r53j264j392r92p52j528k875l495l101k694k978l564
60811C86873l942m190m276l792k861k450l087l951l912k995k184k180k854l555
60797C40644l553k528j083l97j026k228k843k525j837j428j482j677j413k78J455
60782C17801K923L401K822J612L52l84l42J30M62O42J198K330L544M317M664M817
60766C50289M742M292L522K599J635P71J53j73j77K28Q07P88l05j753k316j919
60750C63183j761k504l296l054j951r11k00N96J513J914J291j36j732l012l836
60735C46104m286m436m322m076l947m024m115m122m306m745m833l907k213o33
60721B92139M01J012J102M58l74l77M37Q62L08k51J75J106J531J537J873K386
$$ plain form
60826 416283 414718 413448 412461 411508 410244 408852 407860 407108 405580 402705 399210 396109 393415 390437 386873
60811 386873 382931 378741 374465 370673 367812 365362 362275 358324 354412 351417 349233 347053 344199 340644
60797 340644 337091 334563 333480 333083 332057 329829 326986 324461 322624 321196 319714 318037 316624 316346 317801
60782 317801 320724 324125 326947 328559 328911 328527 328185 328315 328777 329419 330617 332947 336491 340808 345472 350289
60766 350289 355031 359323 362845 365444 367079 367850 368003 367830 367653 367881 368688 369476 369171 367418 365102 363183
60750 363183 361422 358918 355622 352568 350617 349706 349506 350102 351615 353529 354820 354684 352952 349940 346104
60735 346104 341818 337382 333060 328984 325037 321013 316898 312776 308470 303725 298892 294985 292772 292139
60721 292139 292540 293552 294654 295112 294738 294361 294798 295660 295968 295717 295892 296998 298529 300066 301939 304325
60705C04325K158J098K74M42J099J399J349J601K349L004K984K499K310K698L066
60690C32655K746J981J580J730J770J268P44Q84J540J961J726J094N52L69M97
60675C53097O75O79N61M75L37lk94j25K44j35j665l430m166l660k739k125j811
60658C35915j479r86l98J10L11N9m80q79p60n4R28J717K079K216K434K624K314
60641C45671J298n6j216k013k630l205l598l526k863j838q55j34L74O55N93L24
60625C26981L21P73J204J108O26K31K3j61k47j04l7m01r53j131q88o11l63P7N86
60606C27034Q34R20J094R88Q3j093j267j49J092J409J071Q37P84N61K54L32R83
60589C35767J917K640K791K484K271K409K345J472K15m47l58j94j11M98J723K736
$$ plain form
60705 304325 306483 307581 307855 308297 309396 310795 312144 313745 316094 319098 322082 324581 326891 329589 332655
60690 332655 335401 337382 338962 340692 342462 343730 344474 345358 346898 348859 350585 351679 352231 352600 353097
60675 353097 353772 354451 355012 355487 355824 355821 355527 355402 355646 355511 353846 350416 346250 342590 339851 337726 335915
60658 335915 334436 333450 333052 333162 333473 333532 333052 332173 331413 331359 332287 334004 336083 338299 340733 343357 345671
60641 345671 346969 346913 345697 343684 341054 337849 334251 330725 327862 326024 325169 325035 325409 326064 326657 326981
60625 326981 327302 328075 329279 330387 331013 331244 331267 331106 330859 330755 330718 330317 329364 328233 327345 326734 326371 326448 327034
60606 327034 327868 328788 329882 330870 330953 329860 328593 328444 329536 330945 332016 332853 333637 334198 334452 334784 335767
60589 335767 337684 340324 343115 345599 347870 350279 352624 354096 354311 353864 353506 353312 353201 353699 355422 358158
60573C58158L089L379M131M923N306N668O581P870R079J0165J1137J1549J1036
60560D52071R835Q263O179L493P00j664l632n392o681p058o469n130l310j498
60546D39707j97P47J971L482M426M472M548N591P320Q942J0482J2421J4563J6123
60532E34598J6757J6720J6065J4389J1464P716L965P88j881m426o699p841p445
60519E94170o513o437p222p757p619p314o773n205k819j084n51N0J599L070L449
60504E43044L808N811R104J1928J3746J5694J8676K2484K6675L1035L5110L8272
60492G75387M0342M1445M1365L9757L6797L2945K8372K3094J7341J1161M181l615
60480A088572j1414j8577k5463l2474l8878m3465m5809m6151m4691m1922l8894
$$ plain form
60573 358158 361247 364626 368757 373680 378986 384654 391235 399105 408184 418349 429486 441035 452071
60560 452071 461906 470169 476348 479841 480541 478877 475245 469853 463172 456114 449645 444515 441205 439707
60546 439707 439510 440257 442228 445710 450136 454608 459156 464747 472067 481009 491491 503912 518475 534598
60532 534598 551355 568075 584140 598529 609993 617709 621674 622462 620581 616155 609456 601615 594170
60519 594170 587657 581220 573998 566241 558622 551308 544535 539330 536511 535427 534876 534926 536525 539595 543044
60504 543044 546852 552663 561767 573695 587441 603135 621811 644295 670970 702005 737115 775387
60492 775387 815729 857174 898539 938296 975093 1008038 1036410 1059504 1076845 1088006 1092187 1088572
60480 1088572 1077158 1058581 1033118 1000644 961766 918301 872492 826341 781650 739728 700834
60469G00834l6148l3075k9341k5988k3858k1861j8465j4328j1598j0926j0890
60458D64356j0318r370q301o859n296m430m284l958l242k996l481l695l011k237
60444C92878k294k782k791k302j955j971j998j799j494j297j256j191q49l53l08
60429C68238j034j888j904j041j63J20j6j29N5O40J411J794J529J153J166J117
60413C71048L58o47q62k98N0j45j20N92J435J806J803J713J547J359J332J327
60397C82298J024N79M67P01R61J341K062K566K072J123J281K986M800N285M556
60382D14102L549K758K274K201K299J949J078N20R06J730K051J675J126R03J129
60367D40250J572J769J439R49R14J362J831K241K929L749M020L651L462M060N092
$$ plain form
60469 700834 664686 631611 602270 576282 552424 530563 512098 497770 486172 475246 464356
60458 464356 454038 444668 436367 429508 424212 419782 415498 411540 408298 405302 401821 398126 395115 392878
60444 392878 390584 387802 385011 382709 380754 378783 376785 374986 373492 372195 370939 369748 368899 368546 368238
60429 368238 367204 365316 363412 362371 362208 362328 362312 362183 362238 362878 364289 366083 367612 368765 369931 371048
60413 371048 371406 370759 369897 369599 369649 369504 369384 369976 371411 373217 375020 376733 378280 379639 380971 382298
60397 382298 383322 383901 384368 385069 386030 387371 389433 391999 394071 395194 396475 399461 404261 409546 414102
60382 414102 417651 420409 422683 424884 427183 429132 430210 430730 431636 433366 435417 437092 438218 439121 440250
60367 440250 441822 443591 445030 445979 446893 448255 450086 452327 455256 459005 463025 466676 470138 474198 479290
60352D79290N971O650P360Q157R025R783R717Q022M920J618j033l100m679n503
60338E36198n769o308p290p667o696n180m433m592m835m669m232l671l107k896
60324D64853l261l766l777l270k648k030j224k89M55R73J616K642L863M909N679
60309D64725O573Q148J0476J2894J4684J5784J6492J6688J5949J4308J2184R543
60297F18448N926J554k411n226p553j0506j4050j6947j8051j7250j5227j2712
60285E05995j0151p868o259n493n071m216k935k154k430l069l135k772k698k887
60271D44857k779k460k537k949l019k708k661k976l045k746k703l038l047k407
60257D05782j724j431j133n17O8L40N51Q06P99O51J052K135L029L081K559J819
$$ plain form
60352 479290 485261 491911 499271 507428 516453 526236 535953 543975 548895 550513 549480 546380 541701 536198
60338 536198 530429 524121 516831 509164 502468 497288 492855 488263 483428 478759 474527 470856 467749 464853
60324 464853 461592 457826 454049 450779 448131 446101 444877 444588 445043 446016 447632 450274 454137 459046 464725
60309 464725 471298 479446 489922 502816 517500 533284 549776 566464 582413 596721 608905 618448
60297 618448 624374 625928 623517 618291 610738 600232 586182 569235 551184 533934 518707 505995
60285 505995 495844 487976 481717 476224 471153 466937 464002 461848 459418 456349 453214 450442 447744 444857
60271 444857 442078 439618 437081 434132 431113 428405 425744 422768 419723 416977 414274 411236 408189 405782
60257 405782 404058 402627 401494 400977 401045 401385 401936 402742 403541 404192 405244 407379 410408 413489 416048 417867
60241D17867P30m62q25k8R50J177J005J153J414J152M79O6K04P50J529K259K543
60224D31963K414K381K531K295J590J283K008L300M491N605O661P063O539N898
60210D86022N891O150O133O298P152P865P221N592M608M962N696N713N028M268
60196E68599L757L345K751J842Q23j4p50j682k628k989k783k820l471m131m414
60181E55435m922o021o794o265m948m030l593k928k118j987k590k955k470j539
60167E02275p68l36k70n55r31j112j231j550j888j886j602j293q57j90L00K08
60151D88314k6L41J180J671J544J327J462J861K346K774K815K328J947K547M078
60136E16509N508O064N970N912O253O850P182O708N407L935K958K548K469K645
$$ plain form
60241 417867 418597 418135 417310 417282 418232 419409 420414 421567 422981 424133 424612 424678 424882 425632 427161 429420 431963
60224 431963 434377 436758 439289 441584 443174 444457 446465 449765 454256 459861 466522 473585 480124 486022
60210 486022 491913 498063 504196 510494 517646 525511 532732 538324 542932 547894 553590 559303 564331 568599
60196 568599 572356 575701 578452 580294 581117 581103 580353 578671 576043 573054 570271 567451 563980 559849 555435
60181 555435 550513 544492 537698 531433 526485 522455 518862 515934 513816 511829 509239 506284 503814 502275
60167 502275 501507 501171 500901 500346 499415 498303 497072 495522 493634 491748 490146 488853 487996 487806 488106 488314
60151 488314 488288 488629 489809 491480 493024 494351 495813 497674 500020 502794 505609 507937 509884 512431 516509
60136 516509 522017 528081 534051 539963 546216 553066 560248 566956 572363 576298 579256 581804 584273 586918
60122E86918K885K636J681P30N89J053J356J415J771K424K679K193J448R09L98
60107F11085n14j886l285m068l878l165k929l569m313m272l682l446l730l807
60093E64541l170k130j238p62o66o40j87Q58J961K447K261J833J433J061P20L08
60077E68630m54j553k496k994l412m039m504m556m803n852p185p835p703p329
60063E03915o737n619m365l684l395k732j864j889l156m583m993m212k643o52
60049D53391J326K781L631M247M819N221N441N552N282M382L364L093L562L896
60035E09988L635L179K836K325J496O81L2p89j922k990l734m346m883n089n060
60020D95359n465o571p668p865p115o087n367n151n325n547n456m971m258l424
$$ plain form
60122 586918 589803 592439 594120 594850 595439 596492 597848 599263 601034 603458 606137 608330 609778 610687 611085
60107 611085 610571 608685 605400 601332 597454 594289 591360 587791 583478 579206 575524 572078 568348 564541
60093 564541 561371 559241 558003 557241 556575 555935 555748 556606 558567 561014 563275 565108 566541 567602 568322 568630
60077 568630 568176 566623 564127 561133 557721 553682 549178 544622 539819 533967 526782 518947 511244 503915
60063 503915 497178 491559 487194 483510 480115 477383 475519 473630 470474 465891 460898 456686 454043 453391
60049 453391 454717 457498 461129 465376 470195 475416 480857 486409 491691 496073 499437 502530 506092 509988
60035 509988 513623 516802 519638 521963 523459 524140 524172 523383 521461 518471 514737 510391 505508 500419 495359
60020 495359 489894 483323 475655 467790 460675 454588 449221 444070 438745 433198 427742 422771 418513 415089
60006D15089k594k151k394k906k817j858o32K34P19J028J184J176J158J202J185
59991D07623J063J041J321J900K620L173L235K833K417K197J744O67n54j118j026
59976D29136r60j178j329j374j754k503k988k848k509k387k189j447k67Q05J459
59961D07667J805K102K490K880L033K874K624K400J893Q24m61j232j153n31Q7
59946D27302K47j55o87p03k58k07r11j522j236o81j023k081k553j948j126q10
59930D11648o75j72O42J508K432L404M246M877N344N549N478N522N884N840M475
59915D66002K055j58j473k167k358j602R3J817K789L123L233L211L030K770K385
59900D82750J793J278J172J202Q79M71O92J436J824J649J753K756M332N883O988
$$ plain form
60006 415089 412495 410344 407950 405044 402227 400369 399737 399971 400690 401718 402902 404078 405236 406438 407623
59991 407623 408686 409727 411048 412948 415568 418741 421976 424809 427226 429423 431167 431834 431280 430162 429136
59976 429136 428176 426998 425669 424295 422541 420038 417050 414202 411693 409306 407117 405670 405403 406208 407667
59961 407667 409472 411574 414064 416944 419977 422851 425475 427875 429768 430592 430131 428899 427746 427215 427302
59946 427302 427549 427394 426707 426004 425746 425539 424628 423106 421870 421189 420166 418085 415532 413584 412458 411648
59930 411648 410973 410801 411443 412951 415383 418787 423033 427910 433254 438803 444281 449803 455687 461527 466002
59915 466002 468057 467899 466426 464259 461901 460299 460392 462209 464998 468121 471354 474565 477595 480365 482750
59900 482750 484543 485821 486993 488195 489074 489545 490237 491673 493497 495146 496899 499655 503987 509870 516858
59885E16858P104N982M526M131M821N224M657L966L855L733K965K008J438R29
59871E72197N5q05j236j643k503l502m147m414m194l098j523q48j581k337j814
59856E38607p25m74p58p1J927M059N486O504P550Q600R570J0182R532O880K995
59841F09864k95k024k583k380j163Q51K307J859m57l492o171p996q822q737q075
59826E62686p206o308n463m821m533m552m584m282l565k754k334k543l175l720
59812E02846l622k683j504j244k417m068m683l922k763j995j436q03l93m08m55
59797D70450l35n33j285j839j528r58j144j876k019j220l26r8m21q95j346j544
59781D53083j174m60j72o50j238j098k62N25P38N19K79K12K08Q0j48j19O38K120
$$ plain form
59885 516858 523962 529944 534470 538601 543422 548646 553303 557269 561124 564857 567822 569830 571268 572197
59871 572197 572252 571447 570211 568568 566065 562563 558416 554002 549808 546710 545187 544339 542758 540421 538607
59856 538607 537882 537408 536650 536579 538506 542565 548051 554555 562105 570705 580275 590457 599989 606869 609864
59841 609864 609569 607545 604962 602582 601419 602270 604577 606436 605979 602487 596316 588320 579498 570761 562686
59826 562686 555480 549172 543709 538888 534355 529803 525219 520937 517372 514618 512284 509741 506566 502846
59812 502846 499224 496541 495037 493793 491376 487308 482625 478703 475940 473945 472509 471706 471313 470905 470450
59797 470450 470115 469582 468297 466458 464930 463972 462828 460952 458933 457713 457387 457289 456868 455973 454627 453083
59781 453083 451909 451449 451277 450627 449389 448291 448029 448554 449292 449811 450090 450302 450510 450590 450442 450323 450961 453081
59763D53081L599M176L674K814K371K422K684L261M529O225P343P250O471N958
59749E15858N948O042O016O024O177O397O599O646O342N823N605N764N534M269
59735E99044K480J202P06N65N61O71M06o98k157l015l189l294l365k893k113j908
59719E83003k333k490k131k061k592k959k733k555k823k913k451k131k380k393
59705E48058j486m40l09p13n07L96J074J124J112J569K396L093L136K318J172
59690E61993O19Q03Q18N2q61j050p36p49j256j780k070k194k083j722j509j833
59674E46442k456k873l017l228l739m502n206n306m573l682l514l750l192j749
59660D95655q25j093j209J80K298L410L269K963K998K996K887L044L288L052K414
$$ plain form
59763 453081 456680 460856 464530 467344 469715 472137 474821 478082 482611 488836 496179 503429 509900 515858
59749 515858 521806 527848 533864 539888 546065 552462 559061 565707 572049 577872 583477 589241 594775 599044
59735 599044 601524 602726 603432 603997 604558 605229 605635 604937 602780 599765 596576 593282 589917 587024 584911 583003
59719 583003 580670 578180 576049 573988 571396 568437 565704 563149 560326 557413 554962 552831 550451 548058
59705 548058 546572 546132 545823 545110 544603 544999 546073 547197 548309 549878 552274 555367 558503 560821 561993
59690 561993 562612 563415 564233 564285 563424 562374 561638 560889 559633 557853 555783 553589 551506 549784 548275 546442
59674 546442 543986 541113 538096 534868 531129 526627 521421 516115 511542 507860 504346 500596 497404 495655
59660 495655 494830 493737 492528 492708 495006 498416 501685 504648 507646 510642 513529 516573 519861 522913 525327
59645E25327J927J482M20j285k947m196n169n724n509m790m274m008l360k245
59631D85649j429j340j414j042m78m17j019j821k303k371k358k651l220l568l306
59616D56912k631k154k298k948l438k959j396K37P99N14P08J886L009L071K465
59601D51777K045J713Q59l51j072r16k16N12Q69O62K13K12Q25J431J611J654J628
59584D63456Q60q74k489k888k469k341k643k693k306j879j556j274j283j714j989
59569D35918j571r35q66j139q90L2J022J674J852J216l07j800k189j572q51l39
59553D29255K99J028J441J588J850K061J798J365J601K655L855M726N439O330
59539D65291P583R334J1542J4032J6810J9622K0775J7719R949N58o424r530r776
$$ plain form
59645 525327 527254 528736 529156 527871 524924 520728 515559 509835 504326 499536 495262 491254 487894 485649
59631 485649 484220 482880 481466 480424 479946 479529 478510 476689 474386 472015 469657 467006 463786 460218 456912
59616 456912 454281 452127 449829 446881 443443 440484 439088 439325 440124 440638 441346 443232 446241 449312 451777
59601 451777 453822 455535 456394 456043 454971 454055 453839 454351 455220 455882 456095 456307 457132 458563 460174 461828 463456
59584 463456 464316 463442 460953 458065 455596 453255 450612 447919 445613 443734 442178 440904 439621 437907 435918
59569 435918 434347 433412 432546 431407 430517 430549 431571 433245 435097 436313 436006 434206 432017 430445 429594 429255
59553 429255 429554 430582 432023 433611 435461 437522 439320 440685 442286 444941 448796 453522 458961 465291
59539 465291 472874 482208 493750 507782 524592 544214 564989 582708 592657 593215 586791 577261 567485
59526E67485q285n746l353k195j836j143k88k62p82o11R7j82j820l434m204m923
59510E28518o135p017o949o657o846p012o534n817n435n085m286l352k820k589
59496D51984k304k017j856j581j024n19m01m79l36J60Q36J393J592J583J877K604
59480D51512L135L003K741K996L398L287L085L634M551M685M081L875M244L998
59466E02225K606J111N50P15R58J117J127Q14N52J116K494L797M648N585O823
59451E36238P753Q040Q098Q052P361N967M639L651K218j37k667m469n571o353
59437E72820o788o811o591n977m519k525j167j025j352j301r16m18N72K358M436
59422E40796O073P152Q019R029J0478J2418J4404J5958J7223J8602K0064K1741
$$ plain form
59526 567485 559200 553454 550101 547906 546070 544927 544639 544377 543595 542984 543081 542899 541079 537645 533441 528518
59510 528518 522383 515366 508417 501760 494914 487902 481368 475551 470116 465031 460745 457393 454573 451984
59496 451984 449680 447663 445807 444226 443202 442683 442282 441803 441467 441627 442463 443856 445448 447031 448908 451512
59480 451512 454647 457650 460391 463387 466785 470072 473157 476791 481342 486027 490108 493983 498227 502225
59466 502225 504831 505942 506492 507207 508165 509282 510409 511223 511775 512891 515385 519182 523830 529415 536238
59451 536238 543991 552031 560129 568181 575542 581509 586148 589799 592017 591880 589213 584744 579173 572820
59437 572820 566032 559221 552630 546653 542134 539609 538442 537417 536065 534764 533848 533430 534002 536360 540796
59422 540796 546869 554021 562040 571069 581547 593965 608369 624327 641550 660152 680216 701957
59410G01957K4379K7530K7781K1299Q698m578j3507j7385j7961j6098j1883o172
59398G24060n5O137J1566J3604R777P97r591j7637k1685k1988j9817j6649j3385
59385F45134j0183p300n380m597m202l556k856k407j978j461j248j341j040j83
59371E97402L27p4o40o27m60o64o90M5Q80R48O77J029J922K637L267M359N651
59354F15989O410O815P724R227J0531J1252J1818J2589J3387J3953J4241J4199
59342G48135J3776J3100J2315J1368J0224Q872P005M194P72k254m468o508q767
59329H07764j0575j1326j1613j2330j3323j3828j3698j3317j2795j2023j1194
59318F71742j0559j0008r456r147r094q780p919o943o217n441m373l330k428j108
$$ plain form
59410 701957 726336 753866 781647 802946 811644 807066 793559 776174 758213 742115 730232 724060
59398 724060 724005 730142 741708 755312 765089 765886 756295 738658 716973 694985 675168 658519 645134
59385 645134 634951 627651 622271 617674 613472 609916 607060 604653 602675 601214 599966 598625 597585 597402
59371 597402 597729 597655 597015 596388 595928 595264 594574 594619 595499 596447 597124 598153 600075 602712 605979 610338 615989
59354 615989 622399 629214 636938 646165 656696 667948 679766 692355 705742 719695 733936 748135
59342 748135 761911 775011 787326 798694 808918 817790 824795 828989 829761 827507 823039 816531 807764
59329 807764 797189 785863 774250 761920 748597 734769 721071 707754 694959 682936 671742
59318 671742 661183 651175 641719 632572 623478 614698 606779 599836 593619 588178 583805 580475 578047 576939
59304E76939Q68K761L972N098P074R924J2858J4725J3834Q630k32r368j5422j7756
59290F13905j7675j6142j3579j0846q722o862m644k572j493r81O8J540K391K545
59276E36933L043M333N815P128Q576J0087J0987J1091J1017J1145J1160J0848
59264F42163J0462R996Q892O861M470K513J149j72k050m437o484p284o845n956
59250F53278n102m126l072k470k407k177j396n60J03J291L301N101N763N879O360
59235F59766O696N852M218L158K932K592J790J183J008M36j302l992o870r204
59221F68263j0541j0978j1164j1504j1545j0772r532q521p775o959o225n864n532
59208E51351m745l875l652l892l645k531j107j02Q8n66j480j563l02J539K846
$$ plain form
59304 576939 577807 580568 584540 589638 596712 606636 619494 634219 648053 656683 656451 647083 631661 613905
59290 613905 596230 580088 566509 555663 546941 540079 535435 532863 531370 530389 530457 531997 534388 536933
59276 536933 539976 544309 550124 557252 565828 575915 586902 597993 609010 620155 631315 642163
59264 642163 652625 662621 671513 678374 682844 685357 686506 686334 684284 679847 673363 666079 659234 653278
59250 653278 648176 644050 640978 638508 636101 633924 632528 631968 632071 633362 636663 641764 647527 653406 659766
59235 659766 666462 672314 676532 679690 682622 685214 687004 688187 689195 689631 688329 684337 677467 668263
59221 668263 657722 646744 635580 624076 612531 601759 592227 583706 575931 568972 562747 556883 551351
59208 551351 546606 542731 539079 535187 531542 529011 527904 527802 527890 527324 525844 524281 523979 525518 528364
59193E28364L386L490L200K560K169K504L133L435L547L810L921L563L233L476
59179E73791L897L956M018M477M624L696K371J849J973J713J057Q63J214J450
59165F10949J571K140K954L233K966K630J859m3k430l826m155m827o429p876q232
59150E90484p901p589p411p485q163r114r235q040o331n117m603m522m646m691
59136D95636m389l850l357k820k099j578j604j587o69Q49J735J513R12P68J298
59121D80758K430L906N147N840O486P573Q577Q737Q405Q507Q981Q969Q285P525
59107E80126O953O414O071O014N521M018K408K010K470K296J161N0p24j831l225
59092F19732l906l574k954k278j122J11K97n11r82p11q56k093l579m556n354o171
$$ plain form
59193 528364 531750 535240 538440 541000 543169 545673 548806 552241 555788 559598 563519 567082 570315 573791
59179 573791 577688 581644 585662 590139 594763 598459 600830 602679 604652 606365 607422 608285 609499 610949
59165 610949 612520 614660 617614 620847 623813 626443 628302 628259 625829 622003 617848 613021 606592 598716 590484
59150 590484 582583 574994 567583 560098 551935 542821 533586 525546 519215 514098 509495 504973 500327 495636
59136 495636 491247 487397 484040 481220 479121 477543 475939 474352 473683 474532 476267 477780 478692 479460 480758
59121 480758 483188 487094 492241 498081 504567 512140 520717 529454 537859 546366 555347 564316 572601 580126
59107 580126 587079 593493 599564 605578 611099 615117 617525 619535 622005 624301 625462 625512 624788 622957 619732
59092 619732 615826 612252 609298 607020 605898 606009 606306 605795 604813 604102 603246 601153 597574 593018 587664 581493
59076E81493o382n817n366n518n628n312n209n597n580m528l210k672k912l378
59062E14384l751l648k654j241o24j047j362q47l04o37j482k127k568k909k673
59047D86510j723q60o28m54J29L70m67j544j411o3J096J146N41K00N05J311K330
59030D86988L270L831L778L213K806L466N365P594R216J0275J1238J1963J2029
59017E75032J1660J1296J0577Q836O388M132K086m26l194n050n463n047m342l302
59003F03183j999p59N23K066L320L579L327L628M269M089L104K617L073L430L004
58988F40454K272J486J47j571k520k278j787j717j578r59j95P41K515N002O996
58973F47008P990Q866J0230J1496J2220J2865J3544J3477J2504J1716J1759J1906
$$ plain form
59076 581493 575111 569294 563928 558410 552782 547470 542261 536664 531084 526556 523346 520674 517762 514384
59062 514384 510633 506985 504331 503090 502466 501419 500057 499210 498906 498269 496787 494660 492092 489183 486510
59047 486510 484787 483927 483299 482845 482974 483344 482877 481333 479922 479859 480955 482101 482642 482842 483347 484658 486988
59030 486988 490258 494089 497867 501080 503886 507352 512717 520311 529527 539802 551040 563003 575032
59017 575032 586692 597988 608565 617401 623789 627921 630007 629581 626387 621337 615874 610827 606485 603183
59003 603183 601184 600425 600948 603014 606334 609913 613240 616868 621137 625226 628330 630947 634020 637450 640454
58988 640454 642726 644212 644359 642788 640268 637990 636203 634486 632908 631949 631754 632495 635010 640012 647008
58973 647008 654998 663864 674094 685590 697810 710675 724219 737696 750200 761916 773675 785581
58961G85581J1476J0900J0530R849Q544P028N176K024k366o322q796j0742j3251
58948H09631j5669j6814j6802j6485j6127j5588j4923j3913j2080r817q311p669
58936F45433o508m248k251j675j666r95q1M5l31j64O09J206J205O63l55j475j989
58919F27423j726j293r43k67O77J122R12P21N69l07j554j562j5J296J296J357
58903F27706K999N624P951R999J2161J3751J4133J3906J3643J2839J1477J1024
58891G57213J2241J3595J3617J3403J4821J7469J9421J9940J9531J8236J5848
58880I35335J3034J0473P568L655l10k958m645o707r241j1302j2661j3739j4267
58867H94235j3586j1908j0053q399p063o397o286n855m939m725n860p181p595
$$ plain form
58961 785581 797057 807957 818487 828336 836880 843908 849084 851108 848742 842420 833624 822882 809631
58948 809631 793962 777148 760346 743861 727734 712146 697223 683310 671230 661413 653102 645433
58936 645433 638925 634677 632426 630751 629085 628090 628009 628054 627723 627559 628168 629374 630579 631242 630887 629412 627423
58919 627423 625697 624404 623461 623194 623871 624993 625905 626626 627195 626888 625334 623772 623757 625053 626349 627706
58903 627706 630705 636329 644280 654279 666440 680191 694324 708230 721873 734712 746189 757213
58891 757213 769454 783049 796666 810069 824890 842359 861780 881720 901251 919487 935335
58880 935335 948369 958842 966410 970065 969755 966797 962152 955445 946204 934902 922241 908502 894235
58867 894235 880649 868741 858688 850289 843226 836829 830543 824688 819749 815024 809164 801983 794388
58854G94388p795q655r411r147q715r249r962r436q040p087o608n966n680o460
58840F82177p385p222o717p370q677q950q208p878q004p246n513m304m319m620
58826E85764m292l299j767NJ061R29Q59K354M894O774P545P860P598O239M602
58811F27126M042M235L813K830K410K272J003j252k759k992l190l867m087l701
58797F25883m100n940p963q885q927q743q270p334o303n483m783m221l878l316
58783E37737k080o92n9rM22J441K402L103L883M554M470L476J832m96l280n380
58767E51324n998o014o659p450p044n575m354l691k851j795j188q65j02P89R11
58752D99438O06J020K042K465K092J836J842J445Q50J034J898K399K480L041M032
$$ plain form
58854 794388 786593 777938 768527 759380 750665 741416 731454 722018 713978 706891 700283 694317 688637 682177
58840 682177 674792 667570 660853 653483 644806 635856 627648 619770 611766 604520 599007 594703 590384 585764
58826 585764 581472 578173 576406 576411 577472 578401 579260 581614 586508 593282 600827 608687 616285 622524 627126
58811 627126 631168 635403 639216 642046 644456 646728 647731 646479 643720 640728 637538 633671 629584 625883
58797 625883 621783 615843 607880 598995 590068 581325 573055 565721 559418 553935 549152 544931 541053 537737
58783 537737 535657 534965 534906 534897 535319 536760 539162 542265 546148 550702 555172 558648 560480 559984 556704 551324
58767 551324 545326 539312 532653 525203 518159 512584 508230 504539 501688 499893 498705 497840 497738 498527 499438
58752 499438 500044 501064 503106 505571 507663 509499 511341 512786 513636 514670 516568 518967 521447 524488 528520
58737E28520M466M390M869N825N892M774L917M329N314N821N641M991M196L891
58723E96836M302M440L393K045J972K976L612L807M882P032Q753R067Q428P377
58709F68922N966M558L521K112n53l625n466o235p525r634j1368j2450j3774j5248
58695E99201j5678j5077j4691j4523j3185j0646q725q254p973o950n952n574n139
58682D66834m274l745l895l890l261k565k055j264l46q7k65L09J737K865L403
58667D49501M326N832O889P247P934R322J0466J0683R947P712L495j176l761m046
58653E24371m203n222n809n320n045n679o008n211m254l923l518k523j655j344
58639D64657j087r17j462k038r95J394K859K689K723L831M249K778R67M13L11
$$ plain form
58737 528520 532986 537376 542245 548070 553962 558736 562653 566982 572296 578117 583758 588749 592945 596836
58723 596836 601138 605578 608971 611016 612988 615964 619576 623383 628265 635297 644050 653117 661545 668922
58709 668922 674888 679446 682967 685079 684526 680901 675435 669200 661675 652041 640673 628223 614449 599201
58695 599201 583523 568446 553755 539232 526047 515401 506676 498422 490449 483499 477547 471973 466834
58682 466834 462560 458815 454920 451030 447769 445204 443149 441885 441539 441452 441187 441496 443233 446098 449501
58667 449501 453827 459659 466548 473795 481729 491051 501517 512200 522147 529859 533354 532178 528417 524371
58653 524371 520168 514946 509137 503817 498772 493093 487085 481874 477620 473697 470179 467656 466001 464657
58639 464657 463570 462653 461191 459153 458158 459552 462411 465100 467823 471654 475903 478681 479648 480061 480372
58624D80372n22j330j010j92J50M65J380K174K113J941K554L462L823L822L899
58609E03101L828L499L377L387K738J455O07N24L81n5j56j82j117k421k431j424
58593E15111j523k840k802m37J819K157K184L727N668O307O421P474Q839R173
58579E61278Q925R187R527R001Q043P515P154O624O646P593Q443Q573R120J1102
58565F78731J3732J6020J8406K1381K4104K5753K6688K7055K6025K3518K0729
58554I22142J7829J3335P109J593j502l396n492o926o777o204o277n985m686m296
58540I10467o563j0169j3037j5527j8768k1653k2328k1244k0078j8869j6692j4008
58528G11531j1955j0334q438o789o042n396m040k966l334m286m340l652l143k698
$$ plain form
58624 480372 479850 478520 477510 477318 477468 477933 479313 481487 483600 485541 488095 491557 495380 499202 503101
58609 503101 506929 510428 513805 517192 519930 521385 521992 522516 522897 522842 522686 522504 521387 518966 516535 515111
58593 515111 513588 510748 507946 507509 509328 511485 513669 517396 523064 529371 535792 543266 552105 561278
58579 561278 570203 579390 588917 597918 605961 613476 620630 627254 633900 641493 649936 658509 667629 678731
58565 678731 692463 708483 726889 748270 772374 798127 824815 851870 877895 901413 922142
58554 922142 939971 953306 960415 962008 960506 957110 951618 944692 937915 931711 925434 919449 914763 910467
58540 910467 903904 893735 880698 865171 846403 824750 802422 781178 761100 742231 725539 711531
58528 711531 699576 689242 680804 674015 667973 662577 658537 655571 652237 647951 643611 639959 636816 634118
58514F34118k111k335l758m797m122k894k715k969k279j121p68r32o33k22m43
58499F02019p57m19q1m69q25l59J65M2J51J225K297K632L280M884N978N589N399
58482F30751P065R409J0691J1596J3391J5105J5253J4619J4578J4296J2342R436
58470G78532O924M103j59m640p317q347q964q897p455n622m468l020j80K870M715
58455G38075O323Q941J1311J1779J1316J1419J0983Q368M734K019n85m642q722
58442H11319j0302r987j0150j0649r613p366n852n052l439j276j7P27K324M053
58428G44720M184L351L687N270O541P371Q681R834R392P672N741L058j015m713
58414H13774n957n757o365p448p281o321o206o503n893n208n904o805n968m312
$$ plain form
58514 634118 632007 629672 625914 621117 616995 614101 611386 608417 606138 605017 604249 603317 602684 602462 602019
58499 602019 601262 600843 600762 600293 599468 599109 599274 599316 599467 600692 602989 605621 608901 613785 619763 625352 630751
58482 630751 637816 647225 657916 669512 682903 698008 713261 727880 742458 756754 769096 778532
58470 778532 785456 789559 789400 784760 777443 769096 760132 751235 743780 738158 733690 730670 730490 733360 738075
58455 738075 744398 753339 764650 776429 787745 799164 810147 818515 823249 825268 824683 820041 811319
58442 811319 801017 791030 780880 770231 760618 753252 747400 742348 738909 737633 737616 738343 740667 744720
58428 744720 748904 752255 755942 761212 767753 775124 783805 793639 803031 810703 816444 819502 818487 813774
58414 813774 807817 802060 795695 788247 780966 774645 768439 761936 756043 750835 744931 738126 732158 727846
58400G27846l870l880k468o36n34j187j41J905K414J828K594M381M695L554L190
58385G39691L625K949J461J273K171K037J052J388L027L893L812M426N609N785
58371G82199N345N977P196P297O951Q053R887J0373J0069J0925J2171J1753J0674
58358H98870J1407J3093J2952J1361J0776J0662Q542N184L655L883L208J661J573
58345I96827K604K411J643L039N986P308O976P774R763J0507J0348J1889J4585
58332A091660J5415J4614J5175J6899J6724J4713J3945J4511J3444J0564Q688
58321A246352Q050O278L794L419M794N013M446N935Q611Q876P197P453R811J0931
58307A340960J0801J2436J5045J4816J2538J2953J6303J7986J6975J6942J8610
$$ plain form
58400 727846 723976 720096 717628 716992 716458 715271 715130 717035 719449 721277 723871 728252 732947 736501 739691
58385 739691 743316 746265 747726 748999 751170 753207 754259 755647 758674 762567 766379 770805 776414 782199
58371 782199 787544 793521 800717 808014 814965 823018 832905 843278 853347 864272 876443 888196 898870
58358 898870 910277 923370 936322 947683 958459 969121 977663 982847 986502 990385 993593 995254 996827
58345 996827 999431 1001842 1003485 1006524 1012510 1019818 1026794 1034568 1044331 1054838 1065186 1077075 1091660
58332 1091660 1107075 1121689 1136864 1153763 1170487 1185200 1199145 1213656 1227100 1237664 1246352
58321 1246352 1254402 1260680 1264474 1267893 1272687 1277700 1282146 1288081 1296692 1305568 1312765 1320218 1330029 1340960
58307 1340960 1351761 1364197 1379242 1394058 1406596 1419549 1435852 1453838 1470813 1487755 1506365
58296A506365J8723J7308J8075K0786K1047J8622J8061K0145K0718J9083J9358
58285A718291K2239K3652K2923K4085K7719K9611K8913K9398L1537L1788L0748
58274B020904L3082L8228M0389L8967L9503M3073M4730M3964M6216N2073N5527
58263B496656N5217N6757O1538O4162O3583O5599P1277P4249P2626P2290P5123
58252C229077P5712P3044P3534P8752Q2330Q2721Q6527R5287J01989J04844J11071
58241D194888J22460J31031J33952J38811J48794J57011J61055J68465J81913
58232E538380J93928K02219K14755K33662K50284K62528K80094L05860L29924
58223G811634L49263L74618M10094M45498M77245N16455N67335O19052O68749
$$ plain form
58296 1506365 1525088 1542396 1560471 1581257 1602304 1620926 1638987 1659132 1679850 1698933 1718291
58285 1718291 1740530 1764182 1787105 1811190 1838909 1868520 1897433 1926831 1958368 1990156 2020904
58274 2020904 2053986 2092214 2132603 2171570 2211073 2254146 2298876 2342840 2389056 2441129 2496656
58263 2496656 2551873 2608630 2670168 2734330 2797913 2863512 2934789 3009038 3081664 3153954 3229077
58252 3229077 3304789 3377833 3451367 3530119 3612449 3695170 3781697 3876984 3978973 4083817 4194888
58241 4194888 4317348 4448379 4582331 4721142 4869936 5026947 5188002 5356467 5538380
58232 5538380 5732308 5934527 6149282 6382944 6633228 6895756 7175850 7481710 7811634
58223 7811634 8160897 8535515 8945609 9391107 9868352 10384807 10952142 11571194 12239943
58214A2239943P30162Q09159Q94443R83552J092780J229752J383401J554274J765743
58205B2683209K030999K340166K695717L126874L651942M263166M967434N801966
58197E1561473O792115P943798R302738J0966131J3005023J5433165J8278681
58190A33283124K1605694K5421966K9636278L4061876L8145665M0456385L8744065
58183C61355053L1194569J8066457K034607j3275606k5197729l2780252l6297982
58176C05099117l6543875l4506838l1208825k7464683k3744961k0278982j7201684
58169A14149269j4569259j2344257j0462270q892417p606836o544277n646085
58162D8083868m892248m270555l744966l283714k887166k559847k281684k031202
$$ plain form
58214 12239943 12970105 13779264 14673707 15657259 16750039 17979791 19363192 20917466 22683209
58205 22683209 24714208 27054374 29750091 32876965 36528907 40792073 45759507 51561473
58197 51561473 58353588 66297386 75600124 86566255 99571278 115004443 133283124
58190 133283124 154888818 180310784 209947062 244008938 282154603 322610988 361355053
58183 361355053 392549622 410616079 412650686 399375080 374177351 341397099 305099117
58176 305099117 268555242 234048404 202839579 175374896 151629935 131350953 114149269
58169 114149269 99580010 87235753 76773483 67881066 60274230 53729953 48083868
58162 48083868 43191620 38921065 35176099 31892385 29005219 26445372 24163688 22132486
58154B2132486j811570j630007j473744j327928j196752j086817r88236q90830
58146A1726602q01563p28662o64483o00058n41127m94658m54215m13152l78255
58137F650429l56208l39466l18866k97920k82155k66437k45254k24309k09845
58128D109969j96986j79835j62903j51737j42188j29406j17921j12507j08348
58119B808138j00137r2055q9002q6678p9972p2859p0472o9328o4612n9465n8093
58108A965465n7023n2160m7345m7217m8303m5771m2440m2678m3673m1126l7640
58097A460089l7319l7681l4875l1454l1255l1791k9255k6020k5773k6199k3689
58086A124778k0580k0571k1562k0063j8188j9354k1343k0487j8684j9578k1569
$$ plain form
58154 22132486 20320916 18690909 17217165 15889237 14692485 13605668 12617432 11726602
58146 11726602 10925039 10196377 9531894 8931836 8390709 7896051 7441836 7028684 6650429
58137 6650429 6294221 5954755 5635889 5337969 5055814 4789377 4544123 4319814 4109969
58128 4109969 3912983 3733148 3570245 3418508 3276320 3146914 3028993 2916486 2808138
58119 2808138 2708001 2615946 2526944 2440266 2360294 2287435 2216963 2147635 2083023 2023558 1965465
58108 1965465 1908442 1856282 1808937 1761720 1713417 1667646 1625206 1582528 1538855 1497729 1460089
58097 1460089 1422770 1385089 1350214 1318760 1287505 1255714 1226459 1200439 1174666 1148467 1124778
58086 1124778 1104198 1083627 1062065 1042002 1023814 1004460 983117 962630 943946 924368 902799
58075I02799k1135j9379j9151j9304j7702j6248j7073j7611j5129j2281j2381
58064G15405j3192j1311q730q893j0059q855o880p455r109q664p705r529j2461
58051E92562j2526j0401r573r797q441o177n540n615l867j533j724l726m481m123
58037E05038m911o190n587l901l845n125n434n090o125p907q187p429p813r021
58023D18473r015p926p341o921n460l949l974m481l742k878l690m767l678j518
58009C49133j170k446k914k310k273k748k398j583j482j387p4J378J301M93M66
57994C31986M37o81j246N68K983L098J459M68k7j590l367l483k883l714n110m701
57978C14197l122k976m236m726m266m427m881l993k377k111k869k559j226p68
$$ plain form
58075 902799 881664 862285 843134 823830 806128 789880 772807 755196 740067 727786 715405
58064 715405 702213 690902 682172 673279 663220 654365 647485 640030 630921 622257 614552 605023 592562
58051 592562 580036 569635 560062 550265 541824 535647 530107 524492 520625 519092 517368 513642 509161 505038
58037 505038 500127 493937 488350 484449 480604 475479 470045 464955 458830 450923 442736 435307 427494 418473
58023 418473 409458 401532 394191 387270 381810 377861 373887 369406 365664 362786 359096 354329 350651 349133
58009 349133 347963 345517 342603 340293 338020 335272 332874 331291 329809 328422 328348 329726 331027 331520 331986
57994 331986 332423 331742 330496 331064 334047 337145 338604 339072 339045 337455 334088 330605 327722 324008 318898 314197
57978 314197 311075 308099 303863 299137 294871 290444 285563 281570 279193 277082 274213 271654 270428 269660
57964B69660j307j309p63q10q25O15K518K642J348Q11J044K34j538k483k584l290
57948B63963m185l519j783j192j818j695o19k28m04Q12L418N050M845M528N204
57933B72377N984O287O678P000O196M384K753J316q10l143m281m536n461o958
57919B87786p442o762o300o270n597m427m121m690m724l899l131k364o78J505
57905B28886K737K906K985K779J419k99o65J39N37M35R79J858J714R30J153K232
57889B50725K506J955K066K695K125L80o06l73n70j878l044l420l800m364m326
57874B40071l858l956m250l468k103j914k765k761j629j086j598j720r73n15m71
57859B07004M78K339L400L169L012L429L447L163L968N649O183N155M485M965
$$ plain form
57964 269660 268353 267044 266281 265471 264646 265261 267779 270421 271769 272580 273624 273858 272320 269837 267253 263963
57948 263963 259778 256259 254476 253284 251466 249771 249152 248924 248520 249332 252750 257800 262645 267173 272377
57933 272377 278361 284648 291326 298326 304522 308906 311659 312975 312165 309022 304741 300205 294744 287786
57919 287786 280344 273582 267282 261012 255415 250988 246867 242177 237453 233554 230423 228059 227381 228886
57905 228886 231623 234529 237514 240293 241712 241413 240748 240887 241424 241859 242838 244696 246410 247340 248493 250725
57889 250725 253231 255186 257252 259947 262072 262452 261846 261473 260903 259025 255981 252561 248761 244397 240071
57874 240071 236213 232257 228007 224539 222436 220522 217757 214996 213367 212281 210683 208963 207990 207475 207004
57859 207004 207482 209821 213221 216390 219402 222831 226278 229441 233409 239058 245241 250396 254881 259846
57845B59846M956L550K119J599R70l10r98n37l74j498k832l361l664m232m339
57830B50895l749l490l890l846k984k460k702k510j343l59j94J08R55J198L54
57815B25983l60l01n46j713k799l326m432o480p823p361o319o030n924n155m322
57800A63092m029l514k236j181j182j446j128p69q98q26j42K41j58j77J009K301
57784A48957K489K205K539L122L104K870L310M363N449O427P050O663N405M527
57770B08480M571M553L745K900K621K073M98j231j879j568j148r86j248k235l518
57755B15628l918l191k526k653k819k435k181k486k469j484l65o5l09n20q06j115
57739A86286q02J09N24O2k68J50N73N02N95J151J383J085J169J708J450L48L29
$$ plain form
57845 259846 264802 268352 270471 272070 273040 272730 271732 271195 270821 269323 266491 263130 259466 255234 250895
57830 250895 247146 243656 239766 235920 232936 230476 227774 225264 223921 223562 223368 223476 224431 225629 225983
57815 225983 225623 225322 224776 223063 220264 216938 212506 206026 198203 190842 184523 178493 172569 167414 163092
57800 163092 159063 155549 153313 152132 150950 149504 148376 147607 146709 145883 145741 145982 145824 145647 146656 148957
57784 148957 151446 153651 156190 159312 162416 165286 168596 172959 178408 184835 191885 198548 203953 208480
57770 208480 213051 217604 221349 224249 226870 228943 229441 228210 226331 224763 223615 222629 221381 219146 215628
57755 215628 211710 208519 205993 203340 200521 198086 195905 193419 190950 189466 189101 189036 188727 188207 187401 186286
57739 186286 185484 185593 186117 186179 185911 186061 186634 187136 187731 188882 190265 191350 192519 194227 195677 196025 196354
57722A96354K232M126M195L234K611J909N32l97N4O05j12j002n15L44m21k375
57706B11374l373k981k630k915l086l002l428m394m957m628l673k330r27l57j107
57691A67586k310k883k943l006k745j899j440k233l281k939j231N50J921L329
57677A46476M753N796O766Q345J0511J2961J6066K0332K5432L0926L7172M4430
57665C69966N1579N6468N6652M9298L2430Q123j6901l5907m6804n1199n0706m6393
57653C76606m0362l4884l0142k5030j9810j5978j3782j2018j0057q290o766n218
57641A54269m213m357m658l586j613p57j567k460k194j224l87J39K87p3n00l99
57625A26707j15l94j020j216j175j675k428k389j625j253j534j593j137r03j165
$$ plain form
57722 196354 198586 202712 206907 210141 212752 214661 215193 214796 214850 215455 215343 214341 213826 214170 213749 211374
57706 211374 208001 205020 202390 199475 196389 193387 189959 185565 180608 175980 172307 169977 169050 168693 167586
57691 167586 165276 162393 159450 156444 153699 151800 150360 148127 144846 141907 140676 141226 143147 146476
57677 146476 151229 157025 163791 172136 182647 195608 211674 232006 257438 288364 325536 369966
57665 369966 421545 478013 534665 583963 616393 624516 607615 571708 524904 473705 422999 376606
57653 376606 336244 301360 271218 246188 226378 210400 196618 184600 174543 166253 159487 154269
57641 154269 150056 145699 141041 137455 135842 135085 133518 131058 128864 127640 127253 127392 127679 127606 127106 126707
57625 126707 126592 126198 125178 123962 122787 121112 118684 116295 114670 113417 111883 110290 109153 108250 107085
57610A07085j271q96n16m39n24q58j595k203k009j345j005q47l04K00j71r58r99
57593I1345m54n21j192j309q45j107k348l152k763k193k340k625k323j716j187
57578F5270n00J83p7j480k774k893k350k181k424k515k378k263k084j655j157
57563C8722q95r29j164j423j378q74k82j9J48O24J130J164J062J496K153K092
57547D1627J327Q20Q46O76M6m03m07n60j095j309p50K8L34J67k01o50r61q62o00
57528C8073p23j207j476j331j040o37M1O73Q39Q88J363J805J350L87J99R31J367
57511D1502Q94K70J38K08K27M01N44J49l98r0Q18Q30m43j571j599j472k206l187
57493C5015l361k886k444j952j147n59p04j018o40K64Q34P94N27L47K90K78R5
$$ plain form
57610 107085 105814 104918 104402 103963 103439 102581 100986 98783 96774 95429 94424 93577 93273 93473 93302 92344 91345
57593 91345 90891 90370 89178 87869 87024 85917 83569 80417 77654 75461 73121 70496 68173 66457 65270
57578 65270 64770 64953 64876 63396 60622 57729 55379 53198 50774 48259 45881 43618 41534 39879 38722
57563 38722 37827 36898 35734 34311 32933 32059 31777 31758 31906 32530 33660 34824 35886 37382 39535 41627
57547 41627 42954 43774 44620 45296 45342 44939 44532 43972 42877 41568 40818 40846 41180 41347 41146 40496 39535 38673 38073
57528 38073 37350 36143 34667 33336 32296 31659 31700 32373 33212 34100 35463 37268 38618 39005 39204 40135 41502
57511 41502 42396 42666 42804 43012 43239 43640 44184 44333 43935 43845 44663 45493 45050 43479 41880 40408 38202 35015
57493 35015 31654 28768 26324 24372 23225 22666 21962 20944 20304 20568 21402 22196 22723 23070 23360 23638 23733
57476B3733m09q60p23k51k66q24j091q28p89j259j421q86n56j103j664j168j15
57459I520J28q22k115k868A094h06r49p00j250j775j635j078n02J55P79P48m6
57442g059o11j55P44J011O30M08O93J065J012L96n12j058p09K04Q11Q44P49N73
57424i64k02j379j856j293p19p72o40K75R24J95j099j354n75r5l78o37l96m9K13
57405a0801P21J434J706J198K50p29j623k242k292j783j041l40J56L05K25L67
57389a4489R14J400J434J386J783K372K461g78F44J182J032P18K82n1m7L01N84
57372D645K87n44j304A442b76j638j271r41j314k212k504j732q89p95p59J40J299
57355a2892J443O49J28L20N18L08J35K91N03O89J189J877J936R51m04j157j090
$$ plain form
57476 23733 23324 22464 21741 21490 21224 20400 19309 18481 17692 16433 15012 14126 13570 12467 10803 9635 9520
57459 9520 9648 8826 6711 3843 1094 -806 -1755 -2455 -3705 -5480 -7115 -8193 -8695 -8540 -7761 -7013 -7059
57442 -7059 -7670 -7825 -7081 -6070 -5440 -5032 -4339 -3274 -2262 -1866 -2378 -3436 -4145 -3941 -3130 -2286 -1537 -964
57424 -964 -1166 -2545 -4401 -5694 -6413 -7185 -7825 -7550 -6626 -6431 -7530 -8884 -9459 -9554 -9932 -10569 -10965 -11014 -10801
57405 -10801 -10080 -8646 -6940 -5742 -5492 -6221 -7844 -10086 -12378 -14161 -15202 -15542 -15386 -15081 -14856 -14489
57389 -14489 -13575 -12175 -10741 -9355 -7572 -5200 -2739 -778 644 1826 2858 3576 3858 3807 3760 4061 4645
57372 4645 4932 4388 3084 1442 -276 -1914 -3185 -4126 -5440 -7652 -10156 -11888 -12777 -13572 -14331 -14191 -12892
57355 -12892 -11449 -10800 -10672 -10352 -9834 -9526 -9391 -9100 -8597 -7908 -6719 -4842 -2906 -1955 -2359 -3516 -4606
57338d606o35j22M13Q44Q06J46o53q54m48l49j199k304k450j603q90r52j275j358
57320a7489j416j556j356q51q55j536j786q97J12k3q75j109n31pJ80N14R77R38
57302b7566L34j25kM88J101J739K047J777J458J877K858L386L032K410K126a030
57285G29J468J656K604L955M813M531L596L232L790M170L463K412K296L014L448
57270D9177L368L733N003O362O848O455N806N406N404N578N485M968M523M748
57256A22864N589O538P267P645P487O993O971P913R168R837J0068J0646J1591
57243B30577J2192J2243J2233J2375J2418J2342J2397J2493J2473J2839J4258
57232C68840J6310J7753J8074J7902J7802J7654J7296J6879J6337J5362J4129
$$ plain form
57338 -4606 -5241 -5363 -4950 -4106 -3300 -3154 -3807 -4661 -5109 -5458 -6657 -8961 -11411 -13014 -13904 -14856 -16131 -17489
57320 -17489 -18905 -20461 -21817 -22668 -23523 -25059 -26845 -27742 -27630 -27653 -28528 -29637 -30168 -30175 -29995 -29481 -28504 -27566
57302 -27566 -27232 -27357 -27359 -26871 -25770 -24031 -21984 -20207 -18749 -16872 -14014 -10628 -7596 -5186 -3060 -1030
57285 729 2197 3853 6457 10412 15225 19756 23352 26584 30374 34544 38007 40419 42715 45729 49177
57270 49177 52545 56278 61281 67643 74491 80946 86752 92158 97562 103140 108625 113593 118116 122864
57256 122864 128453 134991 142258 149903 157390 164383 171354 179267 188435 198272 208340 218986 230577
57243 230577 242769 255012 267245 279620 292038 304380 316777 329270 341743 354582 368840
57232 368840 385150 402903 420977 438879 456681 474335 491631 508510 524847 540209 554338
57221E54338J3216J2688J2005J0973R989R310Q922R158J0413J2072J2841J2450
57209F88375J2096J2690J3701J4230J4342J4602J4965J4940J4479J4024J3835
57198H42279J3733J3419J2767J2046J1869J2685J4196J5611J6473J6959J7420
57187I99457J8080J9073K0169K0610J9843J8439J7608J7790J8403J8981J9760
57176A208213K0951K2258K3405K4504K5552K6195K6325K6424K6999K8071K9422
57165A488319L0947L2518L3929L5121L6234L7424L8872M0726M2611M3575M3166
57154A903442M2237M1905M1933M1202L9675L8694L9111M0166M0600M0118L9393
57143B348476L9400M0959M4136M7649M9626M9360M7787M5990M3874M0674L6055
$$ plain form
57221 554338 567554 580242 592247 603220 613209 622519 631441 640599 651012 663084 675925 688375
57209 688375 700471 713161 726862 741092 755434 770036 785001 799941 814420 828444 842279
57198 842279 856012 869431 882198 894244 906113 918798 932994 948605 965078 982037 999457
57187 999457 1017537 1036610 1056779 1077389 1097232 1115671 1133279 1151069 1169472 1188453 1208213
57176 1208213 1229164 1251422 1274827 1299331 1324883 1351078 1377403 1403827 1430826 1458897 1488319
57165 1488319 1519266 1551784 1585713 1620834 1657068 1694492 1733364 1774090 1816701 1860276 1903442
57154 1903442 1945679 1987584 2029517 2070719 2110394 2149088 2188199 2228365 2268965 2309083 2348476
57143 2348476 2387876 2428835 2472971 2520620 2570246 2619606 2667393 2713383 2757257 2797931 2833986
57132B833986L0525K5335K2164K2063K4475K7946L2070L7810M5678N4508O2620
57121C219180O9378P4986P9430Q2397Q3877Q4364Q4742Q6256R0149R6929J06301
57110D157989J17984J32315J50035J72109J99850K34695K77848L30808L96171
57101F169804M77237N76857O97588Q42716J015846J218974J452004J714357K005947
57092A6171330K325968K671275L035359L406982L769114M100710M380703M590256
57084D4451697M712581M733582M642418M426313M061793L516762K772208J849251
57076G5166605Q15955k34445j216196k071913k774871l320525l716322l974211
57068E8674077m107236m129738m058406l911652l707708l463501l194695k915509
$$ plain form
57132 2833986 2864511 2889846 2912010 2934073 2958548 2986494 3018564 3056374 3102052 3156560 3219180
57121 3219180 3288558 3363544 3442974 3525371 3609248 3693612 3778354 3864610 3954759 4051688 4157989
57110 4157989 4275973 4408288 4558323 4730432 4930282 5164977 5442825 5773633 6169804
57101 6169804 6647041 7223898 7921486 8764202 9780048 10999022 12451026 14165383 16171330
57092 16171330 18497298 21168573 24203932 27610914 31380028 35480738 39861441 44451697
57084 44451697 49164278 53897860 58540278 62966591 67028384 70545146 73317354 75166605
57076 75166605 75982560 75748115 74531919 72460006 69685135 66364610 62648288 58674077
57068 58674077 54566841 50437103 46378697 42467045 38759337 35295836 32101141 29185632
57060B9185632k637728k370059k118648j887978j680874j497896j337474j197297
57052A4457678j075604r71113q82102q06138p40690o83674o33479n88704n47868
57043G528306n09221m71302m34013l98656l66269l36316l07723k80554k55546
57034D168706k32371k09652j86654j63608j40364j16023r0099o3009l6093j3302
57024B917531k696j2528m3125q3777j19646j41552j48775j44983j34343j20723
57014A965383j07231r5140q4170p4123o5404n8171n2082m6993m2942l9512l6165
57003A263450l3085l0797k9046k7068k4824k3044k2008k1205k0212j9021j7539
56992I95601j5592j3466j1688j0209q550o641m765k718k3L007N222N688M132M37
$$ plain form
57060 29185632 26547904 24177845 22059197 20171219 18490345 16992449 15654975 14457678
57052 14457678 13382074 12410961 11528859 10722721 9982031 9298357 8664878 8076174 7528306
57043 7528306 7019085 6547783 6113770 5715114 5348845 5012529 4704806 4424252 4168706
57034 4168706 3936335 3726683 3540029 3376421 3236057 3120034 3029935 2966926 2930833 2917531
57024 2917531 2914835 2902307 2859182 2775405 2655759 2514207 2365432 2220449 2086106 1965383
57014 1965383 1858152 1763012 1678842 1604719 1539315 1481144 1429062 1382069 1339127 1299615 1263450
57003 1263450 1230365 1199568 1170522 1143454 1118630 1095586 1073578 1052373 1032161 1013140 995601
56992 995601 980009 966543 954855 944646 936096 929455 924690 921972 921949 924956 930178 935866 939998 940435
56978I40435n245j1698j7008k0097k1376k1634k1034j9481j7216j4690j2206r991
56966G48759q160o407m170j318J690M472P173J0150J3542J7194K0451K1880J9762
56953H45018J3337L560p355j7040k3832k7203k7722k6528k4672k2784k1009j8990
56941F44780j6077j1970p170k535J479N111Q873J3002J7243K1120K4495K7558
56929G25909K9775K9106K3310J2375r95j3575k3581l0351l3457l3155l0952k8513
56917F25896k6223k3535k0280j6914j3844j1399j0053r832r786q914p367o020
56905D61729n108m175l097k315j998j800j438r84n85l05j46J36R43K305L833N451
56889D52446P464R613J1078J2010J3785J6640J8154J5638R381K086m241r251j2615
$$ plain form
56978 940435 935190 923492 906484 886387 865011 843377 822343 802862 785646 770956 758750 748759
56966 748759 740599 734192 730022 728704 730394 734866 742039 752189 765731 782925 803376 825256 845018
56953 845018 858355 861915 854560 837520 813688 786485 758763 732235 707563 684779 663770 644780
56941 644780 628703 616733 609563 607028 608507 613618 622491 635493 652736 673856 698351 725909
56929 725909 755684 784790 808100 820475 819480 805905 782324 751973 718516 685361 654409 625896
56917 625896 599673 576138 555858 538944 525100 513701 503648 493816 484030 475116 467749 461729
56905 461729 456621 452446 449349 447034 445036 443236 441798 440814 440229 439924 439778 439914 440857 443162 446995 452446
56889 452446 459910 469523 480601 492611 506396 523036 541190 556828 566209 568295 564054 554803 542188
56876E42188j3567j2269j0060p856n517k888l22K124M905Q173J1688J5563K0095
56863E52257K4941K9602L4602M0865M7681N2473N2675M6894L4623J6760l191k0247
56851I09935l1368l6921l8530l6890l2425k6463k0450j4619q434j795M931J1688
56839F78659J8812K6623L5280M4767N4843O5297P5844Q4834Q8185Q1010O1228
56828A315382L1397k716l4627n8872p2572p6539p4118o8300o0412n1295m2199
56817H05129l3813k5676j7394r477k190N355J3993K3183L1892M0152M8681N6943
56805I36778O2191O0372M8329K6222j432k7795m7638n9484o4460o4280o0605n5013
56793G53185m8475m1217l3546k6217j9639j3505p625k345K356P253J2787J8403
$$ plain form
56876 542188 528621 516352 506292 498436 492919 490031 489709 491833 496738 504911 516599 532162 552257
56863 552257 577198 606800 641402 682267 729948 782421 835096 881990 916613 933373 930182 909935
56851 909935 878567 841646 803116 766226 733801 707338 686888 672269 663835 662040 666971 678659
56839 678659 697471 724094 759374 804141 858984 924281 1000125 1084959 1173144 1254154 1315382
56828 1315382 1346779 1344063 1309436 1250564 1177992 1101453 1027335 959035 898623 847328 805129
56817 805129 771316 745640 728246 718769 716579 721934 735927 759110 791002 831154 879835 936778
56805 936778 998969 1059341 1107670 1133892 1132460 1104665 1057027 997543 933083 868803 808198 753185
56793 753185 704710 663493 629947 603730 584091 570586 562961 560616 562972 570225 583012 601415
56781F01415K3509K8128L1693L2060K6881J5867J213j3796k6225l4418l8480l9713
56769F08134l9114l6775l2891k8561k4964k2238j9810j7357j5010j2956j1311
56758C47147j0028q795p438o414o249o494o130n128m497m637m823m676m791n292
56744B61755n103l566j697q21r27j248j576j984k080j544p82k10M15J183J364
56729B43179N08n43p33j74M15R66J761K483K591K172J625J070O79Q73J374J047
56713B59293m41j718j568p46o66j163j049k11M78Q49J444K001J566J69r45j024
56697B56269o06m42n90p70p92n31n1J71k01p49q38n14k39l1M03R44J192J107R23
56678B54655P01N45P56J239J295P16L68Q78J471J166L85K08O00P52O77J006J483
$$ plain form
56781 601415 624924 653052 684745 716805 743686 759553 760766 746970 720745 686327 647847 608134
56769 608134 569020 532245 499354 470793 445829 423591 403781 386424 371414 358458 347147
56758 347147 337119 328324 320886 314472 308223 301729 295599 290471 285974 281337 276514 271838 267047 261755
56744 261755 256652 253086 251389 250568 249641 248393 246817 244833 242753 241209 240427 240217 240632 241815 243179
56729 243179 243687 243144 242411 242237 242652 243618 245379 247862 250453 252625 254250 255320 255999 256872 258246 259293
56713 259293 258852 257134 255566 254820 254154 252991 251942 251731 252209 253058 254502 256503 258069 258238 257293 256269
56697 256269 255663 255221 254631 253861 253069 252538 252487 252658 252457 251708 250870 250356 250117 250086 250489 251433 252625 253732 254655
56678 254655 255356 255901 256657 257896 259191 259907 260275 261153 262624 263790 264175 264383 264983 265735 266412 267418 268901
56661B68901J150L8p20o08l13l73l77J48R63J580J786J524Q31L3n59j065j661
56644B71278j953j446m31K90M04J89j37m84o11m26l05m63m71r3mp70j635j449
56626B61483m03L03K11j51n14j103j708j731j220q62q98r35q52r43j173j144q18
56609B47542n35m08l61n24q66p91MP25M44n13j098j034o93o6R24J507R00k18m17
56590B44522M25J183J358J494J761J654J201J018J051O16j52k81L87Q79P11N03
56574B58330O48O23J16k87o8N15J055J517J962K415L120M127M824M800M925O341
56558B94963Q655J0362J0903J0804R967P552L798L48j662k538k839k728k657l227
56544C41701l961l772k939k926l864m028k562r76r08j982k901l264l196k432j109
$$ plain form
56661 268901 270051 270089 269369 268761 268448 268075 267698 267846 268809 270389 272175 273699 274530 274563 274004 272939 271278
56644 271278 269325 267879 267448 267738 268142 268331 268194 267710 267099 266673 266368 265905 265434 265341 265337 264567 262932 261483
56626 261483 261080 261383 261594 261443 260929 259826 258118 256387 255167 254305 253407 252472 251620 250677 249504 248360 247542
56609 247542 247007 246599 246238 245714 244848 244057 244061 244786 245230 244717 243619 242585 241892 241826 242750 244257 245157 244939 244522
56590 244522 244947 246130 247488 248982 250743 252397 253598 254616 255667 256283 256131 255850 256237 257116 257827 258330
56574 258330 258978 259601 259717 259430 259362 259877 260932 262449 264411 266826 269946 274073 278897 283697 288622 294963
56558 294963 303618 313980 324883 335687 345654 353206 357004 357352 355690 353152 350313 347585 344928 341701
56544 341701 337740 333968 331029 328103 324239 320211 317649 316673 315765 313783 310882 307618 304422 301990 300881
56529C00881l65q98j738j599p14k84o84j333j824k267k713l016l018k516j367
56514B76545J3P76O02K0m07o76r03j047j199j523j722j325n63j71l00m89o69j106
56496B65856j418r06N8K60n23j242j285j111r06j36J101J763J514J221J325J129
56480B66700L35j76O0K51j41m21o0K67k0l46j54J23J98P23J922K640J951N72l07
56461B74117n35l95K41J100J095m5q95l78M84J92r02j377r05j56O67J659K259
56444B76226J915J208J041J196R48M48K74J74l84r34o77m3j03p78r56l60J18m1
56426B79272k93j01K72L52J56N0K83P46R88O95K55L39Q07P57l1n82k53K28n1o98
56406B83191p34r4N76J097J766K427K455J612L58n80o92k7P36R06O21N27O80N72
$$ plain form
56529 300881 300516 299618 297880 296281 295567 295283 294599 293266 291442 289175 286462 283446 280428 277912 276545
56514 276545 276558 277334 277936 277956 277549 276873 275970 274923 273724 272201 270479 269154 268591 268420 268120 267631 266962 265856
56496 265856 264438 263532 263590 263850 263327 262085 260800 259689 258783 258647 259748 261511 263025 264246 265571 266700
56480 266700 267035 266859 266919 267170 267029 266608 266548 266815 266795 266449 266295 266418 266616 267339 269261 271901 273852 274424 274117
56461 274117 273582 273187 273428 274528 275623 275578 274683 274305 274789 274981 274079 272702 271797 271641 272308 273967 276226
56444 276226 278141 279349 280390 281586 282534 282982 283256 283430 283046 282112 281435 281392 281289 280511 279555 279195 279313 279272
56426 279272 278979 278878 279150 279502 279658 279708 279991 280737 281725 282420 282675 283014 283821 284578 284547 283965 283712 283940 283889 283191
56406 283191 282457 282363 282939 284036 285802 288229 290684 292296 292654 292074 291382 291355 292091 292997 293618 294145 294825 295397
56388B95397K72M34J054J354J204J364J947K023J325R11J380J849J515R20O51
56373C13600J47j053k083j953j011j11O82J481J808J480J365K092K915K918K321
56358C24598J701R38R1L7J083K004J751J072J111J489J216N35L77P20R21R84J222
56341C41850J351J105R62J224J288R56J276K796M161L987L032K862L324L178K469
56326C75821K370L175M070M552M635M128K994J966J550J106N9p88m85M06P91P83
56310D07133J009J148P48N97J483K380J848N94O65K477M481N559O035O308O139
56295D48604N399M364L314K604K815L926M985N370N667O402P021P159P660R045
56281E24335J0228J0224R937J0597J1662J1989J1942J2521J3457J4004J4608J5963
$$ plain form
56388 295397 295669 296103 297157 298511 299715 301079 303026 305049 306374 307285 308665 310514 312029 312949 313600
56373 313600 313747 312694 310611 308658 307647 307536 308218 309699 311507 312987 314352 316444 319359 322277 324598
56358 324598 326299 327237 327328 327365 328448 330452 332203 333275 334386 335875 337091 337626 338003 338723 339644 340628 341850
56341 341850 343201 344306 345268 346492 347780 348736 350012 352808 356969 360956 363988 366850 370174 373352 375821
56326 375821 378191 381366 385436 389988 394623 398751 401745 403711 405261 406367 406426 405638 405153 405559 406350 407133
56310 407133 408142 409290 410038 410635 412118 414498 416346 416940 417605 420082 424563 430122 436157 442465 448604
56295 448604 454003 458367 461681 464285 467100 471026 476011 481381 487048 493450 500471 507630 515290 524335
56281 524335 534563 544787 554724 565321 576983 588972 600914 613435 626892 640896 655504 671467
56269F71467J7421J8221J9238K1535K4272K6076K7479K9839L2912L5739L8953
56258I63152M3868N0017N6000O2043O9464P8321Q7850R8377J10518J23286J35443
56247A878339J47817J61721J75832J87441J96136K03394K08951K10451K06601
56238C576683J97967J84745J66220J42477J14440Q2504M7304J1219k3185n5632
56228D444742q6699j14819j37579j55108j69125j79351j84204j84526j83023j80099
56218B870209j73887j64567j55020j46682j38163j28638j19322j10735j01690
56209A631505r2021q3445p6717p0551o4225n8666n4148m9487m4373m0088l7083
56198I60701l4168l0761k7644k5010k2088j9189j7556j6826j5186j2529j0719
$$ plain form
56269 671467 688888 707109 726347 747882 772154 798230 825709 855548 888460 924199 963152
56258 963152 1007020 1057037 1113037 1175080 1244544 1322865 1410715 1509092 1619610 1742896 1878339
56247 1878339 2026156 2187877 2363709 2551150 2747286 2950680 3159631 3370082 3576683
56238 3576683 3774650 3959395 4125615 4268092 4382532 4465036 4512340 4523559 4500374 4444742
56228 4444742 4358043 4243224 4105645 3950537 3781412 3602061 3417857 3233331 3050308 2870209
56218 2870209 2696322 2531755 2376735 2230053 2091890 1963252 1843930 1733195 1631505
56209 1631505 1539484 1456039 1379322 1308771 1244546 1185880 1131732 1082245 1037872 997784 960701
56198 960701 926533 895772 868128 843118 821030 801841 784285 767459 752273 739744 729025
56187G29025j0210r222p023n250n025n302n043m708m641m186l224k591k381j893
56173F58326j439j924k579j607P05K189K263K487L452M032M044M630N614N453
56159F85646M335M307N813P090P490Q286R754J0606J0935J2461J5232J7315J8440
56146H17710K0616K4461K8365L1996L7188M4370N1670N8447O6097P4298Q0052
56135A335270Q1727Q0572P7159P0050N9476M8767M0602L4921L1512L0888L1316
56124A922260K8808K1796J2671L596n419j3234j6929j6523j6550k0801k8781l8835
56112A832059n0710o2989p1967p5628p5592p3321o7885n9363n0659m3720l7316
56101A162909l0473k4630k0524j6612j2407r740q908p416m374k114j614n41K108
$$ plain form
56187 729025 718815 709593 702570 697320 692295 686993 681950 677242 672601 668415 665191 662600 660219 658326
56173 658326 656887 654963 652384 650777 651482 653671 655934 658421 661873 665905 669949 674579 680193 685646
56159 685646 689981 694288 700101 707191 714681 722967 732721 743327 754262 766723 781955 799270 817710
56146 817710 838326 862787 891152 923148 960336 1004706 1056376 1114823 1180920 1255218 1335270
56135 1335270 1416997 1497569 1574728 1644778 1704254 1753021 1793623 1828544 1860056 1890944 1922260
56124 1922260 1951068 1972864 1985535 1989131 1983712 1970478 1953549 1937026 1920476 1899675 1870894 1832059
56112 1832059 1781349 1718360 1646393 1570765 1495173 1421852 1353967 1294604 1243945 1200225 1162909
56101 1162909 1132436 1107806 1087282 1070670 1058263 1048523 1039615 1032199 1027825 1025711 1024097 1023556 1025664
56088A025664L819L323L185N111O955O973O916Q208R212Q915R221J0966J1801
56075A120269J0617R890J1057J1990J1586J2253J5041J7045J6538J6045J7371
56064A269702J8288J7265J6593J7737J8472J7739J8199K0739K1756J9435J7272
56053A473197J7736J8009J5951J4573J6212J7877J6933J6037J7814J9951K0176
56042A664466K0773K3564K5760K5497K5882K8950L1322L0670L0454L3258L5721
56031A976317L5325L5756L9814M3575M3644M3625M7051N0431N0001M8961N1154
56020B465654N3918N4156N5051N9688O4449O5950O7807P3271P8222P9060Q0308
56009C197534Q6306R2817R5261R7582J04123J10619J12685J15265J23704J33364
$$ plain form
56088 1025664 1029483 1032806 1035991 1041102 1048057 1055030 1061946 1070154 1079366 1088281 1097502 1108468 1120269
56075 1120269 1130886 1140776 1151833 1163823 1175409 1187662 1202703 1219748 1236286 1252331 1269702
56064 1269702 1287990 1305255 1321848 1339585 1358057 1375796 1393995 1414734 1436490 1455925 1473197
56053 1473197 1490933 1508942 1524893 1539466 1555678 1573555 1590488 1606525 1624339 1644290 1664466
56042 1664466 1685239 1708803 1734563 1760060 1785942 1814892 1846214 1876884 1907338 1940596 1976317
56031 1976317 2011642 2047398 2087212 2130787 2174431 2218056 2265107 2315538 2365539 2414500 2465654
56020 2465654 2519572 2573728 2628779 2688467 2752916 2818866 2886673 2959944 3038166 3117226 3197534
56009 3197534 3283840 3376657 3471918 3569500 3673623 3784242 3896927 4012192 4135896 4269260
55999D269260J38445J43021J52497J62302J66626J70332J80275J92681K01382
55990E776821K10514K26374K44786K59552K75240K98280L23961L45900L69468
55981H330896M01613M36945M68889N04380N51724O04658O55327P11716P84470
55972A3450618Q68431R56297J057834J185286J333695J497847J694190J942548
55964B3986746K242290K592125L015319L536454M152369M857584N677537O644532
55956E6704956P770436R086766J0681751J2646289J5011950J7792894K1042824
55949A50737866K4799252K9010297L3531705L7945039M1036254M0553054L4151597
55942C91765064K1267615M204777j2874076k6281725l4428802l7708745l7416444
$$ plain form
55999 4269260 4407705 4550726 4703223 4865525 5032151 5202483 5382758 5575439 5776821
55990 5776821 5987335 6213709 6458495 6718047 6993287 7291567 7615528 7961428 8330896
55981 8330896 8732509 9169454 9638343 10142723 10694447 11299105 11954432 12666148 13450618
55972 13450618 14319049 15275346 16333180 17518466 18852161 20350008 22044198 23986746
55964 23986746 26229036 28821161 31836480 35372934 39525303 44382887 50060424 56704956
55956 56704956 64475392 73562158 84243909 96890198 111902148 129695042 150737866
55949 150737866 175537118 204547415 238079120 276024159 317060413 357613467 391765064
55942 391765064 413032679 417237456 404363380 378081655 343652853 305944108 268527664
55935B68527664l4903450l1284797k7359541k3576128k0120273j7071124j4464017
55928I9748334j2270433j0421750q870486p591371o539252n655108m907028m285912
55920C9206994l768577l320853k929576k598111k315984k062344j833360j638130
55912A8740059j472170j320266j180651j062468r63301q71394p86236p16138o58800
55903I708635o03722n50599n07005m71097m34066l96642l66538l42403l16286
55894E720277k89119k68319k52673k34483k14226j98696j86877j71691j53850
55885C750343j40273j30542j18191j04194r6343r5892r6628r6354r7893r9688
55875B674345r6554q9355q3717p9964p4088o7324o4664o4994o2665n7830n5475
$$ plain form
55935 268527664 233624214 202339417 174979876 151403748 131283475 114212351 99748334
55928 99748334 87477901 77056151 68185665 60594294 54055042 48399934 43492906 39206994
55920 39206994 35438417 32117564 29187988 26589877 24273893 22211549 20378189 18740059
55912 18740059 17267889 15947623 14766972 13704504 12741203 11869809 11083573 10367435 9708635
55903 9708635 9104913 8554314 8047309 7576212 7142146 6745504 6378966 6036563 5720277
55894 5720277 5431158 5162839 4910166 4675683 4461457 4262761 4075884 3904193 3750343
55885 3750343 3610070 3479528 3361337 3257143 3160800 3064908 2968280 2871926 2774033 2674345
55875 2674345 2577791 2488436 2404719 2324755 2250667 2183343 2118679 2053685 1991020 1933190 1877715
55864A877715n5271n2237m6705m3887m3948m1992l7745l5972l7141l6579l3296
55853A412942l1170l1001k9541k6799k6490k8620k9165k7495k7021k8205k8004
55842A099431k6413k6558k7991k6843k2944k0197j9594j8420j6493j6581j8284
55831H59113j7953j5174j3224j2812j1397q913q124r031q898q007r435j2902j4693
55818G08550j4059j3830j4505j3566j1031r815j0108r064o547n527o226n585l086
55805E85601j540j468k72K265L293K537L191O081Q149P818O843N862L231o69k928
55790F27994l101m010o518q215q178q256q652p203m280l550o387r940j2011j3425
55776E24268j4322j2763q597m539j893R12M470P132Q460R602R302M396m318j1419
$$ plain form
55864 1877715 1822444 1770207 1723502 1679615 1635667 1593675 1555930 1519958 1482817 1446238 1412942
55853 1412942 1381772 1350771 1321230 1294431 1267941 1239321 1210156 1182661 1155640 1127435 1099431
55842 1099431 1073018 1046460 1018469 991626 968682 948485 928891 910471 893978 877397 859113
55831 859113 841160 825986 812762 799950 788553 779640 771516 762485 753587 745580 736145 723243 708550
55818 708550 694491 680661 666156 652590 641559 631744 621636 612572 606025 600498 594272 588687 585601
55805 585601 584061 582593 582321 584586 587879 590416 593607 599688 607837 615655 622498 628360 631591 630922 627994
55790 627994 624893 620883 614365 606150 597972 589716 581064 573861 569581 566031 559644 549704 537693 524268
55776 524268 509946 497183 488586 484047 482154 483066 487536 494668 503128 512730 522032 526428 522110 510691
55762E10691j3785j3818j4058j3312j0425p487o454o045m580k813j805r40J1k83
55748D14897k044l419l687m468o350p483p057o898p895q004n779k976j780k073
55734C44984l033m769o694o957n227l625l477l618l125k987l750m261m129m675
55720B84657o031o118m099k085j699j691n99P34J184J481K552L849M818N900O706
55705B89559N594K490j54q10j000k489m606n997o838p604p603o436n190m758m511
55690B39647l780k949k152p90P51J039J09j40R56J697J035M07J190K604L425L697
55674B46746L455J970m81k072k016j666k010k236j832j777k331k029k92J249J476
55659B36154J575K569L312K639J439Q89N71mO9J259K158J550L23k63n25j068j281
$$ plain form
55762 510691 496906 483088 469030 455718 445293 437806 431352 425307 420727 417914 416109 415169 415180 414897
55748 414897 412853 409434 405747 401279 394929 387446 380389 373491 365596 357592 351813 348837 347057 344984
55734 344984 341951 337182 330488 323531 318304 314679 311202 307584 304459 301472 297722 293461 289332 284657
55720 284657 278626 272508 268409 266324 264625 262934 262335 263069 264253 265734 268286 272135 276953 282853 289559
55705 289559 295153 297643 297489 296679 295679 293190 288584 282587 275749 268145 260542 254106 248916 244158 239647
55690 239647 235867 232918 230766 229976 230727 231766 231875 231735 232691 234388 235423 235830 237020 239624 243049 246746
55674 246746 250201 252171 251690 249618 247602 245936 243926 241690 239858 238081 235750 233721 233429 234678 236154
55659 236154 237729 240298 243610 246249 247688 248577 249148 249144 249213 250472 252630 254180 254503 254240 253715 252647 251366
55642B51366o95l37j141k454l431m387n537n969n239m497m723n268n252m877m353
55627A93206l201j635r38j436j801j334j006j289j069J31R06L32n18o97j005k082
55611A76564k927k783k509k707k467j430r65j717k118j014K44J55n33o02n96j328
55595A53267j927j411n97o23j074j250j573k140j669K33J646J110K6K88J254J269
55579A46829N47L06M47L22M64J481K435K391K248L101M127M093L640L939M446
55564A80816M055L223K834K173K71j889k783k887l636m756m897m076l425l161
55550A61862k747k334k289k073j273p52j132j288j71J084Q49l21p25j78M13J010
55534A49935J900K200J077m08p57l86n75j118j151j195k067k781j994o60p33j983
$$ plain form
55642 251366 250671 250334 249193 246739 243308 238921 233384 227415 222176 217679 212956 207688 202436 197559 193206
55627 193206 190005 188370 187432 185996 184195 182861 181855 180566 179497 179628 180534 180866 180348 179651 178646 176564
55611 176564 173637 170854 168345 165638 163171 161741 160776 159059 156941 155927 156171 156326 155793 155191 154595 153267
55595 153267 151340 149929 149332 148709 147635 146385 144812 142672 141003 141236 142882 143992 144018 144306 145560 146829
55579 146829 147376 147682 148129 148451 148915 150396 152831 155222 157470 160571 164698 168791 172431 176370 180816
55564 180816 184871 188094 190928 193101 193372 191483 188700 185813 182177 177421 172524 168448 165023 161862
55550 161862 159115 156781 154492 152419 151146 150394 149262 147974 147803 148887 149736 149415 148690 148512 148925 149935
55534 149935 151835 154035 155112 154704 153947 153561 152986 151868 150717 149522 147455 144674 142680 142020 141287 139304
55518A39304k619k371k412k696k134j004o50r41n20N11O21m22j170r53n95n10
55502A21439k24J75kn25n44k85o09j115p14J11j76j390j697n98L17L7n19l47K79
55483A13613Q36J347J636J266N41K42K52k02r71j113n83k21j02M39J103P85m21
55466A18447j107p13j57n2J4J27k92j030r35J75R63N30l90q23q34p68l81M69J197
55447A14440J215P42L57K72L19J97k76q40r08m23j13l36l67L38J015P63J09J13
55429A16617N46L79l70p70n68k84m5L59O66O21Q32J769K530K024Q19K58L02m2
55411A25643p58j064j092j485j800j238n12r07j904j894r07l71m12J02R16M43
55395A12760j222j992j104k20m05m59O19J756J683R01M78L93K53K09J80m64j502
$$ plain form
55518 139304 136685 134314 131902 129206 127072 126068 125418 124477 123957 124468 125089 124667 123497 122544 121949 121439
55502 121439 121215 121390 121388 120863 120319 120034 119425 118310 117596 117707 117531 116141 114444 113846 114163 114200 113681 113334 113613
55483 113613 114449 115796 117432 118698 119239 119481 119733 119531 118560 117447 116864 116643 116541 116980 118083 118868 118447
55466 118447 117340 116627 116470 116418 116432 116559 116267 115237 114302 114477 115440 115970 115580 114757 113923 113155 112774 113243 114440
55447 114440 115655 116397 116754 117026 117345 117542 117266 116426 115518 115095 114982 114646 114279 114617 115632 116395 116504 116617
55429 116617 117163 117542 117172 116402 115834 115550 115505 115864 116530 117151 117983 119752 122282 124306 125125 125383 125685 125643
55411 125643 124885 123821 122729 121244 119444 118206 117694 116787 114883 112989 112082 111711 111299 111401 112317 112760
55395 112760 111538 109546 108442 108222 107817 107358 107977 109733 111416 112317 112795 113188 113441 113650 113830 113366 111864
55378A11864j539r1J401J571Q99M66J89n07j300j469j074o51l33jK44L37M22L84
55360A10812j39r50j279q27p4N83J159J420R08j33q33q69o38k77M30J097R48J54
55342A11492k45Q0L65J92P8L98Q03R08N95l41j712k331j301L09O40k77p85m39
55324A08429m96j387j805j012K0M54P65J240J151K95k75j9K19m3O1R70J593J072
55306A11232J54k97o54j257j295k34R34J210J112J441J671R83j62p88r05j017
55290A12128j010o60m40o43n23N12J638J633N30p05j485j670j101q0M19o7o95
55273A07781n12J76N06L77K42K17J83K03K01p8l21K50J512K233J810J089P36J07
55255A16712j261k318j926o78j3k60p62j151j416j259n18L27Q28J193J509J303
$$ plain form
55378 111864 110325 110234 111635 113206 114105 114571 114760 114253 112953 111484 110410 109759 109426 109425 109669 110006 110428 110812
55360 110812 110673 109723 108444 107617 107543 108126 109285 110705 111613 111480 110647 109778 109140 108863 109293 110390 111338 111492
55342 111492 111247 111327 111692 111884 111962 112360 113163 114071 114666 114325 112613 110282 108981 109290 109930 109653 108868 108429
55324 108429 107933 106546 104741 103729 103749 104203 104968 106208 107359 107654 107379 107360 107579 107536 107597 108567 110160 111232
55306 111232 111386 111089 110435 109178 107883 107649 108583 109793 110905 112346 114017 115000 114838 114050 113145 112128
55290 112128 111118 110458 110018 109375 108852 109364 111002 112635 113165 112460 110975 109305 108204 108124 108543 108476 107781
55273 107781 107269 107445 107951 108328 108570 108787 108970 109173 109374 109296 108975 109225 110737 112970 114780 115869 116605 116712
55255 116712 115451 113133 111207 110529 110516 110256 109494 108343 106927 105668 105150 105477 106305 107498 109007 110310
55239A10310N94M19J255J979J482L39k96m98r26j256q04o2j13q89j315r63l77
55222A08879l0K5k31n78l22P65J760J749J161R67J195J256J203J414J462O28o97
55205A20606j295p65Q0L63q1r14j480j148q3O35L77j10J36P91Q87L32k62p14j134
55186A16221j106k31Q58J155P63N71O55J91j038k138k320j736q97p2N66P44L66
55169A12552l17q42q00k54J21k61r10p18M58J530J792J720J730J365M12l83o34
55152A16561j092k012k054l21J663J772K93o44j42P68J160J142Q39J01o59p22
55136A16653l12k70n42k74M84N70n52j980k605k128p61J039K330K260J196M09
55120A15517M34N61J13o53j098r21j91O97J020M43k97j53Q04J464J182M26p3n5
$$ plain form
55239 110310 110904 111323 112578 114557 116039 116378 116082 115584 114658 113402 112598 112536 112423 111534 110219 109256 108879
55222 108879 108849 108874 108643 108065 107743 108508 110268 112017 113178 114145 115340 116596 117799 119213 120675 121303 120606
55205 120606 119311 118546 118626 118989 118908 117994 116514 115366 115283 115918 116295 116185 116321 117112 117999 118331 118069 117355 116221
55186 116221 115115 114884 115742 116897 117660 118231 118886 119077 118039 115901 113581 111845 110948 110876 111442 112186 112552
55169 112552 112235 111393 110593 110339 110460 110199 109289 108571 109029 110559 112351 114071 115801 117166 117578 117195 116561
55152 116561 115469 113457 111403 111082 112745 114517 114810 114166 114024 114792 115952 117094 117933 118034 117375 116653
55136 116653 116341 116071 115529 115255 115739 116309 115757 113777 111172 109044 108283 109322 111652 113912 115108 115517
55120 115517 115951 116512 116625 115972 114874 113953 113762 114459 115479 115922 115625 115472 116276 117740 118922 119348 119275 119220
55102A19220M46J247J866J806J080O9r27j569j372m09L42J51l91l09K26M16L95
55085A22287R65J990K363J681O87n9p69j415j358l98O55R78O48K55J35K26K48
55068A29119n4m70l26O06J523J573R89N48L05j50o08n95m41q35j512j612j249
55051A26811j337j842j637l96P02O23k12p50n72J11R21J421J400J156J002N89
55035A27990m13j273r51J93P27K74n7M15R43P06pn50q15q35m79J7P4k51k16L27
55015A25819N98K47r4o4k29q65j209p18q9j06l71o9O96J225J309J139P19J03k65
54996A27776k01k49p76j089l82R26J616J268O03L14L16K17r5m73p70r33r42p32
54978A26394j80O43J313J418J109Q60P72N28N1l59n84p95r31o84j65R1o2j61P8
$$ plain form
55102 119220 119666 120913 122779 124585 125665 125734 124807 123238 121866 121457 121799 121950 121559 121250 121476 121892 122287
55085 122287 123252 125242 127605 129286 129973 129914 129145 127730 126372 125974 126629 127607 128255 128510 128645 128871 129119
55068 129119 129065 128595 128269 128875 130398 131971 132960 133508 133813 133663 133055 132460 132019 131184 129672 128060 126811
55051 126811 125474 123632 121995 121599 122301 122924 122712 121962 121390 121501 122422 123843 125243 126399 127401 127990
55035 127990 127577 126304 125353 125546 126273 126547 126490 126905 127848 128554 128547 127997 127182 126347 125868 125885 125959 125708 125492 125819
55015 125819 126417 126664 126570 126506 126277 125412 124203 123485 123396 123290 122919 122850 123546 124771 126080 127219 127938 128041 127776
54996 127776 127575 127326 126550 125461 125079 126005 127621 128889 129492 129806 130122 130339 130244 129771 129001 128068 127126 126394
54978 126394 126214 126857 128170 129588 130697 131557 132329 132857 132908 132549 131965 131170 130239 129555 129390 129481 129419 129258 129336
54959A29336L89N75P67Q73M62m50j215j457j509j528j027K42J566K065J717J068
54943A31874M40p3k70r7J27J32O4O1q2m86q14p52m41j20K68P76J252J671K216
54924A35746K701K565J849J579K560M309N750O471O757O737O226N183L758K089
54910A94280L83j056k238l522m837n383m676l509l089l544l941l655k989k449
54896A49775k080j697j234o89j25J68j61r84j597j400n20L86Q82J143J483J779
54880A45129J615J030P73J544L171M790N698N807N476N151N060M885L966K087
54866A96182j78k193l908n330n909n241m035l457l680l948l946m035m185l765
54852A42372k626j403n02K38O78K37r61j818j716j298j265j338j047p31q78j205
$$ plain form
54959 129336 129725 130300 131067 131940 132402 131952 130737 129280 127771 126243 125216 125458 127024 129089 130806 131874
54943 131874 132314 132241 131971 131874 132001 132133 132197 132258 132176 131690 130876 130124 129683 129563 129831 130607 131859 133530 135746
54924 135746 138447 141012 142861 144440 147000 151309 157059 163530 170287 177024 183250 188433 192191 194280
54910 194280 194663 193607 191369 187847 183010 177627 172951 169442 166353 162809 158868 155213 152224 149775
54896 149775 147695 145998 144764 144075 143950 144118 143957 142973 141376 139976 139456 139842 140724 141867 143350 145129
54880 145129 146744 147774 148547 150091 153262 158052 163750 169557 175033 180184 185244 190129 194095 196182
54866 196182 196004 193811 189903 184573 178664 173423 169388 165931 162251 158303 154357 150322 146137 142372
54852 142372 139746 138343 137841 138079 138757 138994 138033 136215 134499 133201 131936 130598 129551 128820 127942 126737
54836A26737j153p66l78N5O11R38Q00O17Q33J200J291J250J332J206N09l98r59
54819A33725j357k041k661k370j143P5N46M51L56M50N36L66k5k55M6O81J033R07
54801A29320Q23J147J472J255O67K62K18L64O46J015J118O70o1o12r50j275j460
54784A34619j198n46O6L49L48L12N21J015J380J212Q69J181K131K644K142J495
54768A48540J788K854L845M577N360N993O044N820N926O032N153L185J125l94
54754B05848j780l437m964n784n898n621n128m636m478m626m526l852k978k373
54740A45767j861j012PN54M81L80P28J176J115O58M71P51R67R11J195K219L144
54723A57651K903J868J564K654M290N528O255O374N279K967O67o02j436k971m956
$$ plain form
54836 126737 125584 124818 124440 124495 125106 126044 126844 127461 128294 129494 130785 132035 133367 134573 135082 134684 133725
54819 133725 132368 130327 127666 125296 124153 124228 124774 125225 125581 126031 126567 126933 126908 126653 126699 127380 128413 129320
54801 129320 130143 131290 132762 134017 134684 134946 135164 135528 136174 137189 138307 138977 138916 138304 137354 136079 134619
54784 134619 133421 132875 132941 133290 133638 133950 134471 135486 136866 138078 138947 140128 142259 144903 147045 148540
54768 148540 150328 153182 157027 161604 166964 172957 179001 184821 190747 196779 201932 205117 206242 205848
54754 205848 204068 200631 195667 189883 183985 178364 173236 168600 164122 159496 154970 151118 148140 145767
54740 145767 143906 142894 142901 143455 143936 144316 145044 146220 147335 147993 148464 149215 150182 151093 152288 154507 157651
54723 157651 160554 162422 163986 166640 170930 176458 182713 189087 194366 197333 198000 197398 195962 192991 188035
54708A88035o026n560m277l143k561k534k775k696k080j644k118k890k562r77
54694A46192L62K31q32j498j376j097j163j379j382j150q70o56m59k28o6j52n17
54677A33960q82r04m53L33J211J874K021J556P49Q8q5J61L42n1r39j534j186k57
54659A36004K92K11J81N95Q27J70j003j625j213l12J92r1p81j010k67R67J735
54642A34872J723J401R94K09p53q67L15J710J944J055R3m48q80j303j410j176
54626A37479r31p19k51M66J035J183Q57K0j121j834j539o49j11j99l50j36K92
54609A33492P01J052J155P37k4m86k91K80P10P18K85l45o87m03K35N93L97rj21
54590A37989K20O89P62K70k25rP45J035L89m39n59j51L6k12o22j116j681j914
$$ plain form
54708 188035 182009 176449 172172 169029 166468 163934 161159 158463 156383 154739 152621 149731 147169 146192
54694 146192 146554 146785 145953 144455 143079 141982 140819 139440 138058 136908 136038 135382 134923 134695 134629 134477 133960
54677 133960 133078 132174 131721 132054 133265 135139 137160 138716 139465 139553 139468 139629 139971 139920 138981 137447 136261 136004
54659 136004 136296 136507 136688 137283 138110 138280 137277 135652 134439 134127 134319 134228 133447 132437 132170 133137 134872
54642 134872 136595 137996 138990 139199 138446 137579 137894 139604 141548 142603 142696 142248 141368 140065 138655 137479
54626 137479 136548 135829 135578 136044 137079 138262 139119 139139 138018 136184 134645 133996 133885 133686 133336 133200 133492
54609 133492 134193 135245 136400 137137 137113 136627 136336 136616 137326 138044 138329 137984 137297 136894 137129 137722 138119 138110 137989
54590 137989 138209 138898 139660 139930 139705 139696 140441 141476 141865 141426 140867 140716 140752 140540 139918 138802 137121 135207
54572A35207j450n97P5M76O75M25k43n14J52R35P28j18l30K27M52n8m02N7P82
54553A36479J141J297J500J486J103P11N42L44O7M4K04l5o49o99K42J228J260
54536A46265P65Q06J354J332K89r71j542j502j530j815j842j252m83k48n16n74
54520A38536j47J73m8l13o9K65K8m03j61N35N69k64q56m50M21R63J099R08J75
54501A40961q93j356p11L15Q04Q61J110J526J564J079M00k66q13q71j30R82J499
54484A46061R30k40j032q56M2Q45R87O70M47L68np36j210r59k75K74N37O74P30
54465A47252O56N37N27O42Q23J013J085R55P79P73Q22O02J07k80l12q0J99K46
54447A56346k76j267j813j141J39N75j88r17n87L38R05J011R95O84j48q70o43
$$ plain form
54572 135207 133757 133160 133235 133711 134386 134811 134568 134054 134206 135141 135869 135751 135421 135648 136100 136042 135640 135697 136479
54553 136479 137620 138917 140417 141903 143006 143717 144259 144603 144670 144714 144918 144883 144234 143535 143777 145005 146265
54536 146265 147030 147836 149190 150522 150811 149840 148298 146796 145266 143451 141609 140357 139874 139626 139110 138536
54520 138536 138389 138562 138514 138201 138132 138397 138425 138022 137861 138396 138965 138701 137845 137395 137816 138779 139878 140786 140961
54501 140961 140068 138712 138001 138316 139120 139981 141091 142617 144181 145260 145660 145394 144581 143710 143580 144562 146061
54484 146061 146991 146751 145719 144863 144905 145750 146737 147407 147854 148222 148217 147481 146271 145312 145037 145311 145848 146522 147252
54465 147252 147908 148445 148972 149614 150437 151450 152535 153490 154269 155042 155864 156466 156573 156293 155981 155901 156100 156346
54447 156346 156070 154803 152990 151849 151988 152563 152375 151458 150871 151209 152114 153125 154120 154804 154656 153786 153143
54430A53143K52O28L9o23m37L39P51M04k17m72j93M40J228J850J795Q94j71m49
54412A59201L5K80k09p04m93p3k42o88n81l3K69N18J409K423K126N10o06j42P62
54393A63762O57l8N3J098K024K079J393L27q11j711k296k767k946k177m66R44
54377A59125R32m5o53l66L40J020J614J967J897J659J744K284L073L929M557M492
54361A87569L790L335L786M588M768M286L717K966J412p33k325k799k881l424
54347B08055m309m877m943m827m716m456l856k918j803o99J57N43L86Mn5L66O70
54330A72722J57r97j931k223k214k101j597p83m71j058j638j106K76J215J054
54315A59305M02J93P08J497J849J384M47k41m72o84j094j243q68n20p53j247j371
$$ plain form
54430 153143 153395 154023 154062 153439 153002 153341 154092 154496 154279 153807 153614 154054 155282 157132 158927 159821 159650 159201
54412 159201 159236 159516 159307 158603 158110 158037 157795 157107 156526 156493 156762 157280 158689 161112 163238 163748 163142 163000 163762
54393 163762 164419 164381 164434 165532 167556 169635 171028 171355 170544 168833 166537 163770 160824 158647 158181 159125
54377 159125 160057 160012 159359 158993 159333 160353 161967 163934 165831 167490 169234 171518 174591 178520 183077 187569
54361 187569 191359 194694 198480 203068 207836 212122 215839 218805 220217 219484 217159 214360 211479 208055
54347 208055 203746 198869 193926 189099 184383 179927 176071 173153 171350 170651 170808 171351 171737 171741 171686 172052 172722
54330 172722 172879 171882 169951 167728 165514 163413 161816 161033 160562 159504 157866 156760 157036 158251 159305
54315 159305 159707 159900 160608 162105 163954 165338 165785 165544 165072 164388 163294 162051 161183 160663 159910 158663 157292
54298A57292j125q36m66N1L06O3o0N19J246J216O81O74J263J432O95k89q18r23
54280A60921p80l13K81M31l0n64o80m11R9Q21J467J551J035L73j84p01r36m19
54262A61961O00J119O88P7J89R13J530J719J679J599J532J482J282O57l41j239
54246A75447j694j835j860j732j491j424j562j407n52O32J325J108K83m63n34
54231A64241J59J005J200O44Q4J37N13N11Jn11n91k67J87M97M49L2m24n30l18
54212A67019j79l07m23k25J65L66L02K23J87r7p12j159r31l05l0k92n70n51n73
54193A61908q80j019n13L85J051J311J358J217Q91P31R96J269R51J71m65q76j452
54176A67034k049j890p63M50Q10L96q4k77l60n49p87q62o30k08P1Q4J45N10Q03
$$ plain form
54298 157292 156167 155331 154865 154916 155222 155285 155225 155744 156990 158206 158887 159561 160824 162256 162951 162662 161844 160921
54280 160921 160141 159828 160109 160540 160510 159946 159266 158855 158954 159775 161242 162793 163828 164201 164017 163316 162380 161961
54262 161961 162561 163680 164368 164445 164634 165547 167077 168796 170475 172074 173606 175088 176370 177027 176686 175447
54246 175447 173753 171918 170058 168326 166835 165411 163849 162442 161890 162522 163847 164955 165238 164775 164241
54231 164241 164400 165405 166605 167249 167333 167470 167983 168494 168495 167984 167393 167126 167313 167810 168259 168291 167867 167337 167019
54212 167019 166840 166533 166110 165885 166050 166416 166718 166941 167128 167031 166319 165160 164229 163924 163894 163602 163032 162481 161908
54193 161908 161028 160009 159496 159881 160932 162243 163601 164818 165709 166440 167436 168705 169656 169827 169362 168486 167034
54176 167034 164985 163095 162332 162782 163592 163988 163904 163627 163267 162718 161931 161069 160439 160231 160302 160386 160531 161041 161844
54157A61844M60k71n03M9O54O77M40N15P36N34q6n64o09m16j20M03J088J493J267
54138A67591N65j60n66n19l2O62J088R02K66k70l36n4K16K91K29J66K49N95J105
54119A71988J459J528J577J788J815J275M97J77L03J82l63n96nQ61J213J024P27
54102A85450M67K34K17L99K80l71q83n14N10J482K259L008L476L459L699M993
54086B08165O608O764M829J951o59k847m593n245m449l079k369k601l117l208
54072A96150k532j179J97P76N23L52R15J695J759J009J34l21l37o9L90R29J514
54055B01905K169K739K890K626K464K776L221L219K797K473K454K432K156J832
54041B38153J767J950K167K351K630L026L368L602L971M646N256N132M178L106
$$ plain form
54157 161844 162304 162033 161530 161579 162233 162910 163350 163865 164601 165135 165049 164485 163876 163460 163340 163743 164831 166324 167591
54138 167591 168156 167996 167430 166911 166879 167541 168629 169531 169797 169527 169191 169137 169353 169644 169873 170039 170288 170883 171988
54119 171988 173447 174975 176552 178340 180155 181430 181927 182104 182407 182589 182226 181630 181625 182486 183699 184723 185450
54102 185450 185917 186151 186368 186767 187047 186676 185793 185279 185789 187271 189530 192538 196014 199473 203172 208165
54086 208165 214773 221537 226366 228317 227658 224811 220218 214973 210524 207445 205076 202475 199358 196150
54072 196150 193618 192439 192636 193412 193935 194287 195202 196897 198656 199665 199799 199478 199141 199072 199462 200391 201905
54055 201905 204074 206813 209703 212329 214793 217569 220790 224009 226806 229279 231733 234165 236321 238153
54041 238153 239920 241870 244037 246388 249018 252044 255412 259014 262985 267631 272887 278019 282197 285303
54027B85303K666K869L229L428L388L034K390J700J128N31p8k73O4J44r00k750
54011C05873m193m544m138l562l140l198l930m863n178m752m306m321m491m376
53997B46881m019l592l069k445j857j301p29m40p69j343j336o65j60l95r83j359
53981B22419j508j589j529j367j406j647j634j155n74j52L00Q05R77P67P41J207
53965B14655J716J887K014K361K544K264J947K063K399K674L243M443N850P001
53951B57061Q391J0756J3638J5493J5096J2184P106P78n096q803r855r088p502
53938C00159n578l597j903o36L62J187J773K176K585K977L086K832K537K592L039
53923C13591L584L951M190M473M678M415L700L298L931N353O758P827Q676Q988
$$ plain form
54027 285303 287969 290838 294067 297495 300883 303917 306307 308007 309135 309666 309588 309315 309379 309523 308623 305873
54011 305873 301680 297136 292998 289436 286296 283098 279168 274305 269127 264375 260069 255748 251257 246881
53997 246881 242862 239270 236201 233756 231899 230598 229869 229429 228660 227317 225981 225316 225156 224761 223778 222419
53981 222419 220911 219322 217793 216426 215020 213373 211739 210584 210010 209858 210158 210963 211940 212707 213448 214655
53965 214655 216371 218258 220272 222633 225177 227441 229388 231451 233850 236524 239767 244210 250060 257061
53951 257061 265452 276208 289846 305339 320435 332619 339725 340503 335407 326604 316749 307661 300159
53938 300159 294581 290984 289081 288445 288807 289994 291767 293943 296528 299505 302591 305423 307960 310552 313591
53923 313591 317175 321126 325316 329789 334467 338882 342582 345880 349811 355164 361922 369749 378425 387413
53909C87413Q249O824N687M857L284P89j203j555j044j073j774k455l099m063
53895D00837m884m705l750l187l612m594n643o641p358p519p395p474p590p134
53881C19351o161n431n228m927m031k954k501k957l901m617m621m005l257k650
53867B62110k156k013k785m314n298m636k825j301q06j104j812k552k672j872
53853B25964r01o45q03n06O4j05j045j610j209n16j41J71O10O87J77k92k00M8
53835B19748r8m78o71p02p36n98j80J81J40j82n10p48p21j19R21J668J641J164
53817B19720P92O50O47Q54J264J624J871K256K760K866K421K181K922M309N252
53802B52389N187M551M054L982M194M523M952N427N614N075L916K909K654K805
$$ plain form
53909 387413 395662 402486 408173 413030 416314 417103 415900 414345 413301 412228 410454 407999 404900 400837
53895 400837 395953 391248 387498 384311 380699 376105 370462 363821 356463 348944 341549 334075 326485 319351
53881 319351 313190 307759 302531 297604 293573 290619 288118 285161 281260 276643 272022 268017 264760 262110
53867 262110 259954 257941 255156 250842 245544 240908 238083 236782 235976 234872 233060 230508 227836 225964
53853 225964 225063 224418 223615 223109 223173 223068 222023 220413 219204 218688 218547 218718 219328 220015 220192 219900 219700 219748
53835 219748 219650 219172 218501 217799 217063 216465 216285 216466 216606 216424 215914 215166 214445 214326 215247 216915 218556 219720
53817 219720 220512 221162 221809 222663 223927 225551 227422 229678 232438 235304 237725 239906 242828 247137 252389
53802 252389 257576 262127 266181 270163 274357 278880 283832 289259 294873 299948 303864 306773 309427 312232
53788C12232K696K360K264K243J643M88n14j288k590m530n895n686m439l330k696
53773B92958k289k267k965m005m566m438m110l951l928l936l805l156j887p09
53759B46946n39j378k348k829k969l072l035k625j945j360j112j132j110q01l38
53744B20353j42m08p97q11l27M21J177J721J773J140L2r52j216o38K54O68L72
53727B22620N3M93J462J977J606R51O43O15O52J009J853K620K597J860J100P76
53711B42887Q80J279J744J911J646J363J470J790J967K116K545L113L508L918
53697B72137M722N535N420M136K592J792J837K170K329K180J719R88R8p99j502
53682C05354j782j599j238j020r81j003j089j236j235j010q65j033j145p59k44
$$ plain form
53788 312232 314928 317288 319552 321795 323438 323926 323412 322124 319534 315004 309109 303423 298984 295654 292958
53773 292958 290669 288402 285437 281432 276866 272428 268318 264367 260439 256503 252698 249542 247655 246946
53759 246946 246407 245029 242681 239852 236883 233811 230776 228151 226206 224846 223734 222602 221492 220691 220353
53744 220353 220211 219803 219006 218195 217868 218289 219466 221187 222960 224100 224132 223180 221964 221326 221580 222248 222620
53727 222620 222673 223166 224628 226605 228211 229162 229805 230420 231072 232081 233934 236554 239151 241011 242111 242887
53711 242887 243767 245046 246790 248701 250347 251710 253180 254970 256937 259053 261598 264711 268219 272137
53697 272137 276859 282394 287814 291950 294542 296334 298171 300341 302670 304850 306569 307557 307655 306856 305354
53682 305354 303572 301973 300735 299715 298734 297731 296642 295406 294171 293161 292296 291263 290118 289359 289115
53667B89115m06j227j735j341n84j64P8O22J180R63q0r95r78l13J14n7l86l33
53649B83473J02N62Q42J008J098J015P66N93P10J106J660K300K878L109K890K477
53633C06589K162J919J595J321J335J533J525J220J041J452K450L601M424M716
53619C36883M627M499M517M532M315L869L384K970K639K421K357K353K328K389
53605C84083K652K971L130L233L566M050M135L420K152R91L56J49M6l9J27O56
53589D15678J142J006K82l06l43l32r08j775k064j618j196j328j694j831j830
53574D02883j927j925j599j287j489k051k292j910j251o78j57L48N58K24l92p59
53558C86296o86m01j09K24N61O20K65j39p8M60R42J012R16J160J859K634K962
$$ plain form
53667 289115 288709 287482 285747 284406 283822 283658 283736 284358 285538 286501 286421 285426 284448 284135 284249 284192 283806 283473
53649 283473 283575 284137 284979 285987 287085 288100 288866 289459 290169 291275 292935 295235 298113 301222 304112 306589
53633 306589 308751 310670 312265 313586 314921 316454 317979 319199 320240 321692 324142 327743 332167 336883
53619 336883 341510 346009 350526 355058 359373 363242 366626 369596 372235 374656 377013 379366 381694 384083
53605 384083 386735 389706 392836 396069 399635 403685 407820 411240 413392 414383 414739 414888 414934 414895 415022 415678
53589 415678 416820 417826 418108 417802 417459 417127 416219 414444 412380 410762 409566 408238 406544 404713 402883
53574 402883 400956 399031 397432 396145 394656 392605 390313 388403 387152 386474 386317 386665 387223 387447 387055 386296
53558 386296 385610 385209 385100 385324 385885 386505 386770 386631 386553 387013 387955 388967 389883 391043 392902 395536 398498
53541C98498K571J636P66O00J251K288L332M409N510O230O239N954O148O998P947
53526D60377Q560Q999R554J0162J0631J0948J1165J1267J1308J1465J1799J2258
53514E88493J3017J4433J6422J8345J9741K0811K1847K2606K2755K2540K2471
53503H03481K2513K2239K1643K1128K0746K0088J9085J8248J7851J7492J6815
53492A021329J6187J6183J6754J7386J7774J7867J7538J6760J5933J5497J5339
53481A204547J5123J5021J5438J6056J5959J4929J3801J3099J2138J0135P539
53470A353785N405L789J843o53k891m411n882p964j0139j1418j1703j1765j2080
53457A285916j2445j2688j3072j3864j4910j5952j6926j7792j8324j8351j8039
$$ plain form
53541 398498 401069 402705 403471 404071 405322 407610 410942 415351 420861 427091 433330 439284 445432 452430 460377
53526 460377 468937 477936 487490 497652 508283 519231 530396 541663 552971 564436 576235 588493
53514 588493 601510 615943 632365 650710 670451 691262 713109 735715 758470 781010 803481
53503 803481 825994 848233 869876 891004 911750 931838 950923 969171 987022 1004514 1021329
53492 1021329 1037516 1053699 1070453 1087839 1105613 1123480 1141018 1157778 1173711 1189208 1204547
53481 1204547 1219670 1234691 1250129 1266185 1282144 1297073 1310874 1323973 1336111 1346246 1353785
53470 1353785 1359190 1362979 1364822 1364169 1361278 1356867 1350985 1343021 1332882 1321464 1309761 1297996 1285916
53457 1285916 1273471 1260783 1247711 1233847 1218937 1202985 1186059 1168267 1149943 1131592 1113553
53446A113553j7729j7617j7677j7779j7699j7140j5938j4224j2202r908p331m732
53434I43577k660j519j216j207r28k02O66J262J604K209L511N321P034Q296R198
53419I74946R941J0680J1730J3401J5378J6738J7059J7154J8198K0300K2564K4402
53407A172491K6031K7664K9019L0031L1244L2934L4449L5160L5639L7082L9707
53396A531451M2499M4569M6006M7241M8218M8668M8767M9060M9881N0940N1477
53385B058777N0798M8879M6477M4398M2749M1121L9365L7656L5825L3269K9709
53374B509023K5532K1161J6583J1838P397L581r4m408r609j5444k1767k8432l4675
53361B480686l9327m1897m3034m3787m4634m5437m5995m6305m6359m5957m4877
$$ plain form
53446 1113553 1095824 1078207 1060530 1042751 1025052 1007912 991974 977750 965548 955640 948309 943577
53434 943577 940917 939398 938182 936975 936047 935845 936511 937773 939377 941586 945097 950418 957452 965748 974946
53419 974946 984887 995567 1007297 1020698 1036076 1052814 1069873 1087027 1105225 1125525 1148089 1172491
53407 1172491 1198522 1226186 1255205 1285236 1316480 1349414 1383863 1419023 1454662 1491744 1531451
53396 1531451 1573950 1618519 1664525 1711766 1759984 1808652 1857419 1906479 1956360 2007300 2058777
53385 2058777 2109575 2158454 2204931 2249329 2292078 2333199 2372564 2410220 2446045 2479314 2509023
53374 2509023 2534555 2555716 2572299 2584137 2591534 2595115 2595021 2590613 2581004 2565560 2543793 2515361 2480686
53361 2480686 2441359 2399462 2356428 2312641 2268007 2222570 2176575 2130270 2083911 2037954 1993077
53350A993077m3168m1157l9153l7326l5883l5169l5292l5792l6081l6091l6049
53339A581916l5641l4070l1268k8362k6387k4973k2976k0139j7358j5367j3932
53328A311443j2564j1375j0821j0996j1597j2399j3322j4079j4204j3553j2614
53317A173919j2002j1725j1171r968q559p656p205o402m746k766j337o73j52R22
53303A090479K686M613N867O109O147P477J0697J4628J7438J8490J8609J8838
53291A222078J9540K0718K2291K3755K4180K3163K1506K0425K0197J9970J8911
53280A456734J7094J5123J3219J0996Q090M723J537j038l119n088p231r588j1969
53267A489483j4061j5707j7217j9090k1327k3255k4269k4523k4657k5060k5653
$$ plain form
53350 1993077 1949909 1908752 1869599 1832273 1796390 1761221 1725929 1690137 1654056 1617965 1581916
53339 1581916 1546275 1512205 1480937 1452575 1426188 1401215 1378239 1358100 1340742 1325375 1311443
53328 1311443 1298879 1287504 1276683 1265687 1254090 1241691 1228369 1214290 1200086 1186533 1173919
53317 1173919 1161917 1150192 1139021 1129053 1120494 1112838 1105633 1099231 1094485 1091719 1090382 1089709 1089557 1090479
53303 1090479 1093165 1097778 1103645 1109754 1115901 1123378 1134075 1148703 1166141 1184631 1203240 1222078
53291 1222078 1241618 1262336 1284627 1308382 1332562 1355725 1377231 1397656 1417853 1437823 1456734
53280 1456734 1473828 1488951 1502170 1513166 1521256 1525979 1527516 1526478 1523359 1518271 1511040 1501452 1489483
53267 1489483 1475422 1459715 1442498 1423408 1402081 1378826 1354557 1330034 1305377 1280317 1254664
53256A254664k6156k6206k5494k4285k3568k4067k5162k5415k4310k2797k1922
53245I85282k1607k1267k0979k1231k1783k1650k0419j8906j8133j8066j7776
53234G63465j6646j5022j3624j2746j2112j1357j0363r285q356p724p305o958
53222F31967o776p141q205r499j0406j0950j1741j2976j3971j4002j3323j2821
53210E00156j2764j2418j1061r016p366o783o885o850o430o120o411p174p896
53197C92982q272q271p845p044o276n995o026n730m893m043l680l724l921m225
53183C13037m494m380l907l676l932l988l209k107j599j543j055j15J89p13j960
53168B76548k409j978j366r92q27q51j122j473j625j530j307q90j19P69J090L39
$$ plain form
53256 1254664 1228508 1202302 1176808 1152523 1128955 1104888 1079726 1054311 1030001 1007204 985282
53245 985282 963675 942408 921429 900198 878415 856765 836346 817440 799307 781241 763465
53234 763465 746819 731797 718173 705427 693315 681958 671595 662310 653954 646230 638925 631967
53222 631967 625191 618050 609845 600346 589940 578990 567249 554273 540302 526300 512977 500156
53210 500156 487392 474974 463913 454897 447531 440748 433863 427013 420583 414463 408052 400878 392982
53197 392982 384710 376439 368594 361550 355274 349279 343253 337523 332630 328587 324907 321183 317262 313037
53183 313037 308543 304163 300256 296580 292648 288660 285451 283344 281745 280202 279147 279032 279221 278508 276548
53168 276548 274139 272161 270795 269803 268976 268125 267003 265530 263905 262375 261068 260178 260059 260828 261918 262257
53152B62257j125k281k405j777j213j009p14L6Q90J240R79M40r9m86n62l94l29
53135B53448m64l59K11O81N78N59J538K957L132J498n44j431j136n15J12Q89J574
53118B62728J688J321J035J027R86O70K18j33k59j26J23J23m12j262j805j601
53102B64321q79m26q77j936k533k015j022p17j263j704j328m85K03O51R73R60
53086B51923M70j41m87o62q66r69q54q01r90j009m95J04Q0m32o34k39J69N2l96
53067B43823o07l30J96M89K10m82j028j083q91q64j009j039q21m14J15N65N82
53050B37412J85L4O88J746K259J840Q77j43j018j552j550j152p35m02j1K88J07
53033B38873n09r14o12J58P69Q88O63M27L23J96j25l88j10O11Q66O9j035j113
$$ plain form
53152 262257 261132 258851 256446 254669 253456 252447 251733 251769 252659 253899 254878 255318 255219 254733 254171 253777 253448
53135 253448 252984 252625 252836 253517 254095 254654 256192 259149 262281 263779 263235 261804 260668 260153 260265 261154 262728
53118 262728 264416 265737 266772 267799 268785 269455 269673 269540 269281 269155 269278 269401 268989 267727 265922 264321
53102 264321 263442 263016 262139 260203 257670 255655 254633 253916 252653 250949 249621 249136 249339 249990 250963 251923
53086 251923 252393 252252 251765 251103 250237 249268 248414 247613 246623 245614 245119 245223 245303 244871 244237 243998 244167 244219 243823
53067 243823 243216 242886 243082 243571 243781 243299 242271 241188 240297 239433 238424 237385 236564 236150 236265 236830 237412
53050 237412 237597 237631 238319 240065 242324 244164 245041 244898 243880 242328 240778 239626 238891 238489 238478 238766 238873
53033 238873 238364 237450 236838 236996 237765 238653 239316 239743 240066 240262 240137 239749 239639 240250 241116 241185 240150 239037
53015B39037Q3J433J801J082m4p63m72Q10K203K655K028J010kj130k076j929m62
52998B45264J115J438N57l56n34k37n2k05n14o54m25J8L45N26Q33J258J418J240
52980B51035J250J713K024J555O83K95N32P49O02M33N54Q34J107J420J696J610
52964B68092J027K60k33j65N04J397J683Q18o57j620j760j780k101k175j575r52
52948B60763j081j550j309l13L87J87l85p39j053j535j677r35K26P83M73p3m12
52931B51757p77j369j848j857j581j357j154q13n77p64j110r77k45N13Q56J029
52915B39726J400J782J637Q20k16q73q94m88j46k87q43j303j294r18m82r5K13
52898B37739K31j04k99K57J404K251K188J485P69L29J71L01N93P08N25L16K41
$$ plain form
53015 239037 239120 240553 242354 243436 243392 242629 242157 242967 245170 247825 249853 250863 250861 249731 247655 245726 245264
52998 245264 246379 247817 248374 248018 247484 247247 247195 246990 246476 245822 245397 245415 245760 246286 247119 248377 249795 251035
52980 251035 252285 253998 256022 257577 258260 258555 259087 259836 260438 260871 261425 262259 263366 264786 266482 268092
52964 268092 269119 269379 269146 268981 269485 270882 272565 273383 272726 271106 269346 267566 265465 263290 261715 260763
52948 260763 259682 258132 256823 256510 256897 257084 256699 255960 254907 253372 251695 250760 250986 251769 252242 252169 251757
52931 251757 250980 249611 247763 245906 244325 242968 241814 241001 240424 239660 238550 237573 237328 237841 238697 239726
52915 239726 241126 242908 244545 245365 245149 244276 243382 242894 242748 242461 241618 240315 239021 238103 237621 237526 237739
52898 237739 237970 237866 237567 237824 239228 241479 243667 245152 245921 246250 246421 246722 247315 248023 248548 248864 249105
52881B49105l5p00j230j014l95k31n25l11Q72K201K708K582K634K978K918K086
52865B63643J007M15M50O61N49j6o60q21k93M91Q26L60p24j972k909l237l111
52848B54659l069l352l498k963k049j674k144k686k396j279p6O24P97O89M87K60
52832B32330M5o9J08P03J536K123K027J202K4r25j264j141j106j427j685j378
52816B31103o96l02l11j21N90J273J236N98J07K45Q65J506J709J221L12l15k40
52799B38780P3j81j123k086k479k364k038j496o27L43R17Q68M79J68O7J8q9j64
52781B29066j17RJ89N33J056J430J255N73j10l24k2M61O50J98q08j829k373k415
52763B27422k081j192L15J629J630L33q14o12N01J169Q04j6m34q9P78J503J433
$$ plain form
52881 249105 249070 248370 247140 246126 245731 245500 244975 244664 245536 247737 250445 253027 255661 258639 261557 263643
52865 263643 264650 265065 265515 266176 266725 266709 266049 265228 264935 265426 266252 266612 265888 263916 261007 257770 254659
52848 254659 251590 248238 244740 241777 239728 238054 235910 233224 230828 229549 229473 230097 230894 231583 232070 232330
52832 232330 232375 232306 232414 233117 234653 236776 238803 240005 240029 239104 237840 236699 235593 234166 232481 231103
52816 231103 230407 230105 229794 229673 230263 231536 232772 233370 233477 233722 234587 236093 237802 239023 239335 239020 238780
52799 238780 238853 238672 237549 235463 232984 230620 228582 227086 226459 226802 227719 228587 229066 229234 229301 229319 229230 229066
52781 229066 228949 228958 229147 229680 230736 232166 233421 233994 233884 233560 233538 233999 234649 234847 234039 232210 229837 227422
52763 227422 225341 224149 224464 226093 227723 228056 227242 226630 227131 228300 229104 229088 228654 228565 229343 230846 232279
52746B32279O58R9M96J476K059J903J540J502J778K034J953J386N60O9K84Q23
52730B50899J037Q63P53Q60Q52N00n7o59j208j398r72l20k27q03j238r46m12m63
52712B47061j087j515j294p67m40k84J24Q95J528J484Q98L81J37k96j104j567
52696B44154r43L02R62O66K10K31L70J43j51O5P00J142J062O02Km93n37RO96Q76
52676B50068M33j39m18n03p06j045j220r78m16J35M58O82J021J394J472J086M27
52659B51751j71m44k35M11J172J676J929K245K727L074K941K301J323K47o08r81
52643B69358j000j060j314j537j593j601j574j312r33r32j370j450m66J167K358
52628B56741K650K451K157J699J033M82L06L15P9o09j540k165j947r34Q4L53M6
$$ plain form
52746 232279 232937 233036 233532 235008 237067 238970 240510 242012 243790 245824 247777 249163 249723 249792 250076 250899
52730 250899 251936 252799 253552 254412 255264 255764 255707 255048 253840 252442 251470 251150 250923 250120 248882 247936 247524 247061
52712 247061 245974 244459 243165 242398 241958 241674 241798 242693 244221 245705 246603 246984 247121 246825 245721 244154
52696 244154 243211 243513 244475 245141 245351 245582 245952 246095 245944 246009 246709 247851 248913 249515 249517 249024 248487 248496 249192 250068
52676 250068 250501 250362 249944 249441 248735 247690 246470 245492 245076 245211 245669 246351 247372 248766 250238 251324 251751
52659 251751 251580 251136 250901 251312 252484 254160 256089 258334 261061 264135 267076 269377 270700 270947 270339 269358
52643 269358 268358 267298 265984 264447 262854 261253 259679 258367 257434 256502 255132 253682 253216 254383 256741
52628 256741 259391 261842 263999 265698 266731 267213 267519 267834 267913 267304 265764 263599 261652 260718 260802 261155 261201
52611B61201n5K23J88n55j301j137k03N86Q75J164J769K088J408j0j100j185o20
52594B63336j54j5J91P93J492J661J090K96m3J78N28P48J072J687K247K203J476
52577B78786M47n34j258j426q61kL58j0n55p93q37q83p37l24r7l55n44K5J000
52558B71400J317O15m21j106j439j556j292o46j54k66p40j007r08o98n35l76k37
52541B61951k46l87l66J45J150K179K606K224J466Q63M77O7l46m45j37K66L99
52524B71866J16n14j129j153l79N87R93R66J273K046K493K101J371J061J240J586
52508B84524K009K501K765K569K176J912J577O88q27k557l982m646m258l068j941
52493B79442j612j977k383k368j864j049l38k70q92j470j234k38Q68J720K352
$$ plain form
52611 261201 261146 261369 261557 261002 259701 258564 258361 258947 259822 260986 262755 264843 266251 266241 265141 263956 263336
52594 263336 263182 263167 263358 264151 265643 267304 268394 268690 268647 268825 269353 270101 271173 272860 275107 277310 278786
52577 278786 279233 278699 277441 276015 275154 275152 275510 275500 274945 274152 273315 272432 271695 271371 271274 270919 270375 270400 271400
52558 271400 272717 273332 272911 271805 270366 268810 267518 266872 266718 266452 265712 264705 263797 263099 262564 262188 261951
52541 261951 261705 261318 260952 261097 262247 264426 267032 269256 270722 271585 272062 272129 271783 271338 271201 271467 271866
52524 271866 271982 271468 270339 269186 268807 269394 270387 271353 272626 274672 277165 279266 280637 281698 282938 284524
52508 284524 286533 289034 291799 294368 296544 298456 300033 300721 299894 297337 293355 288709 284451 281383 279442
52493 279442 277830 275853 273470 271102 269238 268189 267851 267581 266689 265219 263985 263747 264615 266335 268687
52478B68687K652K244J073k34q05k39R67J773J560Q24N41Q69J036O93O02J492
52462B83735K898L817M004L778L056J544l06j546j973k284k922l537l686l421
52448B83157k948k349j860j787k050k214k124j978j724j017R6J049J470J533J394
52433B68648R58L52k8k03o43j310j385m54P23J250J290J497J793J545P69J94K41
52416B75237O15R96J467K055K490K647K818L243L845M640O046Q271J0633J1947
52402C36950J1606R898P298L848m18m743p838q927q396p296o383n808n408m967
52388C09416m193k853j116L79R87O01k86r65r81l31O36J476J938K071K202K713
52372C11694L681M677N111M866M371M017L726L299K870K676K561K065R93l84j618
$$ plain form
52478 268687 271339 273583 274656 274422 273617 273378 274345 276118 277678 278502 279043 279912 280948 281641 282243 283735
52462 283735 286633 290450 294454 298232 301288 302832 302526 300980 299007 296723 293801 290264 286578 283157
52448 283157 280209 277860 276000 274213 272163 269949 267825 265847 264123 263106 263202 264251 265721 267254 268648
52433 268648 269606 269958 269930 269727 269084 267774 266389 265935 266658 267908 269198 270695 272488 274033 274802 274996 275237
52416 275237 275852 276848 278315 280370 282860 285507 288325 291568 295413 300053 306099 314370 325003 336950
52402 336950 348556 358454 365752 369600 369182 364439 356601 347674 339278 331982 325599 319791 314383 309416
52388 309416 305223 302370 301254 301633 302620 303221 302935 301970 300989 300658 301294 302770 304708 306779 308981 311694
52372 311694 315375 320052 325163 330029 334400 338417 342143 345442 348312 350988 353549 355614 356607 356223 354605
52357C54605k307k198j408m31L76J150K015K443J773L21o93m84N83J703K505K916
52341C62869K882K647K857L794M869N363N397N683O503P538Q503R398J0118J0490
52327D48911J0749J1454J2723J4035J5012J5967J7289J8681J9497J9554J9187
52316F23059J8577J7617J6485J5823J6014J6673J7103J7146J7156J7338J7409
52305H10400J6983J6031J4917J4088J3701J3508J3203J2885J2879J2928J2022
52294I63545R535O193L265J000j350m018o233p451q168q984r610r452q598p534
52280I12140o400n151m010l044j729K80K328L505L894M324N220O529Q401J0787
52266I37074J2686J3008J2219J1861J2305J2375J1512J0889J1593J2940J3583
$$ plain form
52357 354605 352298 350100 348692 348261 348637 349787 351802 354245 356018 356339 355646 355162 355745 357448 359953 362869
52341 362869 365751 368398 371255 375049 379918 385281 390678 396361 402864 410402 418905 428303 438421 448911
52327 448911 459660 471114 483837 497872 512884 528851 546140 564821 584318 603872 623059
52316 623059 641636 659253 675738 691561 707575 724248 741351 758497 775653 792991 810400
52305 810400 827383 843414 858331 872419 886120 899628 912831 925716 938595 951523 963545
52294 963545 973080 979273 982538 983538 982188 978170 971937 964486 956318 947334 937724 928272 919674 912140
52280 912140 905740 900589 896579 893535 891806 892086 894414 897919 901813 906137 911357 917886 926287 937074
52266 937074 949760 962768 974987 986848 999153 1011528 1023040 1033929 1045522 1058462 1072045
52255A072045J3385J3115J2963J2520J1765J1055J0322R167P631N971L861O86
52243A184486l313o969r442j0948j2090j3053j3660j3792j3484j2867j2219j1875
52231A050774j1921j2063j1874j1119r970q954q528q509q151o968n325l957l031
52218I40404k084q39L05P31L98R2P47K442M164M798M335L688L444L310K948K680
52202I71563K948L551L980M174M434M838N175N280N018M235L161K557K948L889
52188A027751M520M617M474M016K760O85j558l459n050o354p067p097o951p166
52174A004121p624p731p205o404n914n806n476m312k602j347r74o50N74K378L571
52159I54599L758L704L992M201L755K884K176J641Q64j04o60m01L88J115J494
$$ plain form
52255 1072045 1085430 1098545 1111508 1124028 1135793 1146848 1157170 1166337 1173968 1179939 1183800 1184486
52243 1184486 1181173 1174204 1164762 1153814 1141724 1128671 1115011 1101219 1087735 1074868 1062649 1050774
52231 1050774 1038853 1026790 1014916 1003797 993827 984873 976345 967836 959685 952717 947392 943435 940404
52218 940404 938320 937481 937786 938517 938915 939007 939754 942196 946360 951158 955493 959181 962625 965935 968883 971563
52202 971563 974511 978062 982042 986216 990650 995488 1000663 1005943 1010961 1015196 1018357 1020914 1023862 1027751
52188 1027751 1032271 1036888 1041362 1045378 1048138 1048823 1047265 1043806 1038756 1032402 1025335 1018238 1011287 1004121
52174 1004121 996497 988766 981561 975157 969243 963437 957961 953649 951047 949700 948726 948076 948650 951028 954599
52159 954599 958357 962061 966053 970254 974009 976893 979069 980710 981574 981470 980810 980409 980797 981912 983406
52144I83406J689J943K246K338J988J202K09n70o38K32J567K502K814L282M669
52129A008879O677Q506J0117J2190J4890J7551J9680K1540K3431K5129K6465K7738
52117A222793K8999K9545K8853K7548K6650K6084K4852K2657K0440J8963J7615
52106A494999J5270J1930Q845P011O131N289M193L198K308Q30j613m187n632n916
52092A542656o545q960j2965j6943j9440k0286k0276k0121j9763j8659j6584j4038
52080A348076j1746r911q255o630n171l766j934N41L248N739Q081J0485J2625
52067A341382J3886J4195J4118J4072J3921J3440J2869J2699J3135J3889J4429
52056A492035J4249J3127J1335R576Q394P515O015L303j24l195n462p508j0103
$$ plain form
52144 983406 985095 987038 989284 991622 993610 994812 995021 994451 993813 994045 995612 998114 1000928 1004210 1008879
52129 1008879 1015556 1024062 1034179 1046369 1061259 1078810 1098490 1120030 1143461 1168590 1195055 1222793
52117 1222793 1251792 1281337 1310190 1337738 1364388 1390472 1415324 1437981 1458421 1477384 1494999
52106 1494999 1510269 1522199 1531044 1538055 1544186 1549475 1553668 1556866 1559174 1560004 1558391 1554204 1548572 1542656
52092 1542656 1536111 1527151 1514186 1497243 1477803 1457517 1437241 1417120 1397357 1378698 1362114 1348076
52080 1348076 1336330 1326419 1318164 1311534 1306363 1302597 1300663 1301204 1304452 1310191 1318272 1328757 1341382
52067 1341382 1355268 1369463 1383581 1397653 1411574 1425014 1437883 1450582 1463717 1477606 1492035
52056 1492035 1506284 1519411 1530746 1540322 1548716 1556231 1562246 1565549 1565425 1562230 1556768 1549260 1539157
52043A539157j3263j6386j9025k1110k2555k3135k2825k1919k0694j9220j7640
52032A321385j6301j5418j4839j4357j3981j3840j3968j4374j5066j5801j6015
52021A157425j5327j3977j2665j1973j2049j2559j2828j2247j0833r281q309q165
52009A017212q774r978j1321j2091j2087j2110j3048j4662j5853j6077j5868j5795
51997H59548j5647j4940j3709j2300j0769q981p195o034n860o462p397q411r453
51984G32390j0477j1386j2094j2644j3180j3807j4397j4640j4332j3577j2696
51973E89160j1936j1241j0230q451n864l042p13R16K263L722N191O237O599O353
51959E68964N862N525N374M786K995O3k979n209o627p588p919p244n898m674l694
$$ plain form
52043 1539157 1525894 1509508 1490483 1469373 1446818 1423683 1400858 1378939 1358245 1339025 1321385
52032 1321385 1305084 1289666 1274827 1260470 1246489 1232649 1218681 1204307 1189241 1173440 1157425
52021 1157425 1142098 1128121 1115456 1103483 1091434 1078875 1066047 1053800 1042967 1033686 1025377 1017212
52009 1017212 1008438 998460 987139 975048 962961 950851 937803 923141 907288 891211 875343 859548
51997 859548 843901 828961 815252 802952 792183 783202 776007 769973 764113 757651 750254 741843 732390
51984 732390 721913 710527 698433 685789 672609 658802 644405 629765 615433 601856 589160
51973 589160 577224 565983 555753 547302 541438 538396 537683 538599 540862 544584 549775 556012 562611 568964
51959 568964 574826 580351 585725 590511 593506 593569 590590 585381 578754 571166 563247 556003 550105 545431 541737
51944E41737k270p2K328M366O257Q393J0519J2090J3095J3940J4699J4950J4326
51931F54358J2860J0898Q903P171N483L366R92n97q18p33k181n738j0218j4179
51917F69567j7159j9325k0736k1358k1195k0080j7776j4629j1626r432p787o181
51905D82283m523k767m88K398M952O015N560M596L783K822J233r60l446n998q377
51890D87083j0231j1255j1297j0317q504o346m327k621j277m77j15N38K107M139
51876D27100N607O333P071Q050Q411P531O030M731L422J511n99j895k363l051
51862D77889m398n436n131l767k392j404l89R15K169L011L454L549L075J864J48
51847D73157j694l503n152o229o333n710n153n136n326n172m590l889l273k809
$$ plain form
51944 541737 539467 539395 541723 546089 552346 560739 571258 583348 596443 610383 625082 640032 654358
51931 654358 667218 678116 687019 694190 699673 703039 704031 703434 702616 701883 699702 693964 683746 669567
51917 669567 652408 633083 612347 590989 569794 549714 531938 517309 505683 496251 488464 482283
51905 482283 477760 474993 474505 476903 481855 487870 493430 498026 501809 504631 505864 504904 501458 495460 487083
51890 487083 476852 465597 454300 443983 435479 429133 424806 422185 420908 420431 420316 420854 422961 427100
51876 427100 432707 439040 446111 454161 462572 470103 476133 480864 484286 485797 485198 483303 480940 477889
51862 477889 473491 468055 462924 459157 456765 455361 454972 455887 458056 461067 464521 468070 471145 473009 473157
51847 473157 471463 467960 462808 456579 450246 444536 439383 434247 428921 423749 419159 415270 411997 409188
51833D09188k580k468j916m65J475K799K826J896P63k01j014j679k080k205k166
51818D02173k106k076k012j714j062k66L03N84R17J513K107K208J594L89j047
51803D01505k222k689k404j674p53L01J261J663J352P19R6o84j699k387k226j676
51787C88483j677k219k286j324m0O14N99M88N35N72N02M44N32R61J964L427M786
51770C96361N706O518P576Q508Q765Q519Q328Q065P105N501M017K796J039j639
51756D77165m444o568q193r660j0461j0066r045q320p781o769n548m919m582l293
51742C77516r13J143J987K483L668N117N810N810N924O244O038M908L148J247
51728D30130l72j240j180o11QP10J462J585M41j484l040l752l993l952l281j878
$$ plain form
51833 409188 406608 404140 402224 401759 403234 406033 408859 410755 411518 411317 410303 408624 406544 404339 402173
51818 402173 400067 397991 395979 394265 393203 392937 393240 393824 394741 396254 398361 400569 402163 402552 401505
51803 401505 399283 396594 394190 392516 391763 392064 393325 394988 396340 397059 397155 396471 394772 392385 390159 388483
51787 388483 386806 384587 382301 380977 380937 381551 382150 382638 383173 383745 384247 384691 385223 386184 388148 391575 396361
51770 396361 402067 408585 416161 424669 433434 441953 450281 458346 465451 470952 474969 477765 478804 477165
51756 477165 472721 466153 457960 448300 437839 427773 418728 410408 402627 395858 390310 385391 380809 377516
51742 377516 376603 377746 379733 382216 385884 391001 396811 402621 408545 414789 420827 425735 428883 430130
51728 430130 429758 428518 427338 426727 426735 427445 428907 430492 430933 429449 426409 422657 418664 414712 411431 409553
51712D09553m05J98n36k227l673l649k156n51J67O61K061M021N049M510L128J646
51696D17797K44o77m95N51J435J757J992K055J016j191l094l538l198l303l833
51681D07518l979l650l351l093k452j366r8J246K435K779J944P87N50J438K702
51666D03410L871N123O560P792Q250P534N655L234J054q36l063n468o569n178
51652D31369j997J341M181O812R017R788Q375M851r9n175q748j0171j0499j0936
51638D28109j1068r813p525n644m478l072j318l76n70n46O77K251K947K847K592
51623C95013K059Q74n35j518k227l099l835l872l436l244l419l423k937k132j368
51608C62901j063j508k253k181q30Q61J757J946K200K596K743L004M247O417Q430
$$ plain form
51712 409553 409148 409346 408810 406583 402910 399261 397105 396554 396721 397382 399443 403464 408513 413023 416151 417797
51696 417797 418041 417364 416869 417420 418855 420612 422604 424659 425675 424484 421390 417852 414654 411351 407518
51681 407518 403539 399889 396538 393445 390993 389627 389529 390775 393210 395989 397933 398720 399270 400708 403410
51666 403410 407281 412404 418964 426756 435006 442540 448195 451429 452483 451647 448584 443116 436547 431369
51652 431369 429372 430713 434894 441706 450723 460511 468886 473737 473638 468463 459715 449544 439045 428109
51638 428109 417041 407228 399703 394059 389581 386509 385191 384815 384245 383699 384376 386627 389574 392421 395013
51623 395013 397072 397946 397411 395893 393666 390567 386732 382860 379424 376180 372761 369338 366401 364269 362901
51608 362901 361838 360330 358077 355896 355066 355927 357684 359630 361830 364426 367169 370173 374420 380837 389267
51593C89267R594J0065R808Q130M843R45k355m713o222o622n644l765j903m97
51579D00931O43J742K913M458O694R411J1861J3380J3798J3282J2357J1974J2905
51566E16349J4695J5758J5018J3193J2011J2499J4583J7996K2602K7778L2374
51555G14856L5578L7191L6806L3598K7526J9975J2428N058k581j0051j6306k1167
51543H72911k5351k9098l1851l3382l4090l3934l2159k8623k4494k0999j8214
51532E60716j5687j3471j1838j0431q617o325m015k042o12l8n10j741l257m770
51518D77362n988o465o135n638n573n738n579n056m613m496m662n004n289n131
51504D01995m549m158m220m050k992j579q37p92n91M8N69P02Q27J043Q52R0o17
$$ plain form
51593 389267 398861 408926 418734 426864 431707 432652 430297 425584 419362 412740 407096 403331 401428 400931
51579 400931 401574 403316 406229 410687 417381 426792 438653 452033 465831 479113 491470 503444 516349
51566 516349 531044 546802 561820 575013 587024 599523 614106 632102 654704 682482 714856
51555 714856 750434 787625 824431 858029 885555 905530 917958 923016 920435 910384 894078 872911
51543 872911 847560 818462 786611 753229 719139 685205 653046 624423 599929 578930 560716
51532 560716 545029 531558 519720 509289 500672 494347 490332 488290 487678 487640 487130 485389 482132 477362
51518 477362 471374 464909 458774 453136 447563 441825 436246 431190 426577 422081 417419 412415 407126 401995
51504 401995 397446 393288 389068 385018 382026 380447 379610 378818 378227 378275 378844 379546 380373 381416 382268 382358 381741
51487C81741p22m17q3K53N03K34o49j461j556j169j010j224j363j201j088j461
51471C69327k283l054l299k991k544k256j966j434r09r03j420j889j896j504q21
51456C40158K09J322J859J521Q34M95O34J074J928L390N160O562P285P753Q731
51441C88915J0630J2907J4081J2681Q646L657j93j913j791o16P65J428O59j448
51427D48408l993n942o703o243m951l410k076j099n80p07j465k326k704k576k373
51412D01260k269k006j436q22m77m44o44j020j325j121k39Q46J440J316Q83O69
51396C94611Q69J321J825K362L085M121N407O679P679Q418R329J0981J3557J6592
51382D86836J9493K2334K5791L0078L4347L7647M0265M3484M7765N1633N2686
$$ plain form
51487 381741 381019 380602 380519 380772 381275 381509 380860 379399 377843 376674 375664 374440 373077 371876 370788 369327
51471 369327 367044 363990 360691 357700 355156 352900 350934 349500 348591 347688 346268 344379 342483 340979 340158
51456 340158 340367 341689 343548 345069 345903 346398 347032 348106 350034 353424 358584 365146 372431 380184 388915
51441 388915 399545 412452 426533 439214 447860 451517 451324 449411 447620 447004 447769 449197 449856 448408
51427 448408 444415 438473 431770 425527 420576 417166 415090 413991 413411 412704 411239 408913 406209 403633 401260
51412 401260 398991 396985 395549 394727 394250 393806 393162 392142 390817 389696 389457 390303 391743 393059 393942 394611
51396 394611 395480 396801 398626 400988 404073 408194 413601 420280 427959 436377 445706 456687 470244 486836
51382 486836 506329 528663 554454 584532 618879 656526 696791 740275 788040 839673 892359
51371H92359M9488M2371L2806K2440J2449L228n524j4150k2420k9649l5353l9581
51359I08464m2632m4686m5706m5454m3691m0616l7030l3651l0312k6263k1493
51348D96930j7123j4165j2344j0674q838p428o915p056p338p411p007n959m521
51335C80151l259k418j756j107o76n67n14l75m61r10j164n82O33J652J963J714
51319C72324J143K90o99j389j372o18M70J238J199N33k3n3K3l69j101j702k198
51302C67696k909l505l148j762l42K67K86K90K43k62j187k044k499k545k254j707
51286C44618j017j25J183K817M214M998N490O134O633O227M787L055J750Q46K8
51271C91638o13p01l12j10n23r88m36J335L135L636K886K034J613R23o46k447
$$ plain form
51371 892359 941847 984218 1017024 1039464 1051913 1055141 1049617 1035467 1013047 983398 948045 908464
51359 908464 865832 821146 775440 729986 686295 645679 608649 574998 544686 518423 496930
51348 496930 479807 465642 453298 442624 433786 426358 419443 412387 405049 397638 390631 384672 380151
51335 380151 376892 374474 372718 371611 370935 370368 369854 369479 369018 368108 366944 366362 366995 368647 370610 372324
51319 372324 373467 373757 373058 371669 370297 369679 370149 371387 372586 373119 373096 373043 373066 372697 371596 369894 367696
51302 367696 364787 361282 358134 356372 356030 356297 356583 356873 357116 356854 355667 353623 351124 348579 346325 344618
51286 344618 343601 343476 344659 347476 351690 356688 362178 368312 374945 381172 385959 389014 390764 391610 391638
51271 391638 391025 390324 390012 389902 389379 388391 387955 389290 392425 396061 398947 400981 402594 403517 402871 400424
51255D00424l393l440l443l781l968l607l047k775k723k530k147j822j660j520
51241C60568j272j008r78j260j540j353p38m31r92j905k026j046M6K82l8J60J233
51224C47702K412K867K620K284K267K538K878K996K524J319j60j119j229q85n42
51209C68472j54M71J065J178R64J104J871K772L242L232K922K294J377N08k6l23
51193C90969n44n78m05m26q68j219q48K3O79J012J445J786J171n08k013k204j524
51176C85948j227j584j637o87O80J374J078M73L21P04J165J409J626K065K592
51161C94300K865K894L033L302L123J953Q7j515k170k092k069k597l442m023m107
51146C89542l936l672l091k101j272j302k040k516k031q03N54J595J966J381J09
$$ plain form
51255 400424 397031 393591 390148 386367 382399 378792 375745 372970 370247 367717 365570 363748 362088 360568
51241 360568 359296 358288 357310 356050 354510 353157 352419 351988 350996 349091 347065 346019 346065 346347 346309 346469 347702
51224 347702 350114 352981 355601 357885 360152 362690 365568 368564 371088 372407 372247 371128 369899 369014 368472
51209 368472 368318 368789 369854 371032 371996 373100 374971 377743 380985 384217 387139 389433 390810 391318 391292 390969
51193 390969 390425 389847 389442 389016 388148 386929 386081 386104 386783 387795 389240 391026 392197 391689 389676 387472 385948
51176 385948 384721 383137 381500 380813 381493 382867 383945 384418 384739 385443 386608 388017 389643 391708 394300
51161 394300 397165 400059 403092 406394 409517 411470 411557 410042 407872 405780 403711 401114 397672 393649 389542
51146 389542 385606 381934 378843 376742 375470 374168 372128 369612 367581 366778 367332 368927 370893 372274 372383
51131C72383r07r59k88M71J243K372L729M646M739M258L592K850K057J339P82
51116D02307L73K40O01J326J891J973J787J686J668J498J157Q25O32O08Q32J320
51100D20724J836K024J796J368R46M94n7n98q90q15m51k1K09J02j72k04K40Q74
51082D27405J116P02l2n05m16J10P42J170J228J035R29J169J696K290K885L539
51066D45063M174M630N040N860P364R300J1214J3057J5193J7659J9546J9346J6281
51053E93727J1387P082N380O579R581J3009J5576J5950J3362Q714M205J272p42
51040G05082l429p173j0742j2747j2836j1482r280o841m980m562n994q815j1799
51027E94402j3569j3448j1791r546p538o082n046m040k773j308R0J445L065M853
$$ plain form
51131 372383 371476 370517 370229 370700 371943 374315 378044 382690 387429 391687 395279 398129 400186 401525 402307
51116 402307 402680 402920 403521 404847 406738 408711 410498 412184 413852 415350 416507 417332 417964 418572 419404 420724
51100 420724 422560 424584 426380 427748 428694 429188 429131 428533 427643 426828 426377 426356 426565 426667 426495 426291 426531 427405
51082 427405 428521 429223 429191 428686 428270 428380 429122 430292 431520 432555 433484 434653 436349 438639 441524 445063
51066 445063 449237 453867 458907 464767 472131 481431 492645 505702 520895 538554 558100 577446 593727
51053 593727 605114 612196 617576 624155 633736 646745 662321 678271 691633 700347 704552 705824 705082
51040 705082 701653 694480 683738 670991 658155 646673 637393 630552 625572 621010 615016 606201 594402
51027 594402 580833 567385 555594 546048 538510 532428 527382 523342 520569 519261 519351 520796 523861 528714
51013E28714O092O326O140O573P859R316J0300J0748J0754J0283R556R156R380
51000F41197R748R471Q281O603N049L936L180K499J713Q92K90J36M71J059J435
50985F95960J376J387K412M762P718J0415J2698J4637J5739J5493J4439J3775
50973H10811J3950J4650J6196J9732K5483L1820L6926M0765M4573M8917N3174
50962A156997N6768N9902O2890O5402O6775O6838O6077O4951O3143N9711N4222
50951A843676M7551M1050L5047K8753K1811J5058R395M686N23k561l608k775j585
50938B037021j653l644p224j1296j4403j5743j6027j6840j9057k2219k5432k8283
50926A855200l0955l3916l7645m2101m6413m9540n1294n2347n3171n3497n2830
$$ plain form
51013 528714 534806 541132 547272 553845 561704 571020 581320 592068 602822 613105 622661 631817 641197
51000 641197 650945 660416 668697 675300 680349 684285 687465 689964 691677 692569 692859 692995 693466 694525 695960
50985 695960 697336 698723 701135 705897 713615 724030 736728 751365 767104 782597 797036 810811
50973 810811 824761 839411 855607 875339 900822 932642 969568 1010333 1054906 1103823 1156997
50962 1156997 1213765 1273667 1336557 1401959 1468734 1535572 1601649 1666600 1729743 1789454 1843676
50951 1843676 1891227 1932277 1967324 1996077 2017888 2032946 2042341 2047027 2047550 2044989 2041381 2038606 2037021
50938 2037021 2035368 2031724 2024500 2013204 1998801 1983058 1967031 1950191 1931134 1908915 1883483 1855200
50926 1855200 1824245 1790329 1752684 1710583 1664170 1614630 1563336 1510989 1457818 1404321 1351491
50915A351491n1012m8201m4695m0974l7448l4162l0992k8074k5560k3155k0575
50904I66643j8310j7154j6877j6291j4869j3383j2594j2098j1030r247p208n280
50892H12302l729k845k494k001j090m22n81j017p71J44R69J529K412L881N407
50877H11694O435O971P334P848Q800J0207J1630J2608J3290J4113J5189J6477
50865I42596J8322K0914K3447K4827K5410K6995L0678L5608M0344M4565M8875
50854A282581N3636N8948O5295P3225Q2509R2248J01737J10736J19042J26452
50844B166409J33100J39257J44797J49247J52269J53461J51770J45867J35391
50835C471568J21277J04656Q5936O5343M3824K2885L713j3080k7082l7896m5334
$$ plain form
50915 1351491 1300479 1252278 1207583 1166609 1129161 1094999 1064007 1035933 1010373 987218 966643
50904 966643 948333 931179 914302 898011 883142 869759 857165 845067 834037 824790 817582 812302
50892 812302 808573 805728 803234 801233 800143 799721 799140 798123 797352 797496 798465 799994 802406 806287 811694
50877 811694 818129 825100 832434 840282 849082 859289 870919 883527 896817 910930 926119 942596
50865 942596 960918 981832 1005279 1030106 1055516 1082511 1113189 1148797 1189141 1233706 1282581
50854 1282581 1336217 1395165 1460460 1533685 1616194 1708442 1810179 1920915 2039957 2166409
50844 2166409 2299509 2438766 2583563 2732810 2885079 3038540 3190310 3336177 3471568
50835 3471568 3592845 3697501 3783437 3848780 3892604 3915489 3919202 3906122 3879040 3841144 3795810
50824C795810m9366m9872m6798m0671l2660k4005j5661q600m118l438p052j4598
50812C498971k5322l8364n2649o7034q0804r3897j06293j17220j25315j29772
50802B662301j31044j30155j27392j22160j14244j04774r5433q6888p8495o9639
50792A602077o0749n2645m5395l8414l1528k5287k0165j6029j2608r968q193o955
50780A274141n857n026m934n662o666p316p442p398p681q498r608j0609j1431
50767A176013j2321j3298j3914j3874j3569j3624j4048j4257j3863j3002j1942
50756A028301j0779r532q146o385m100j638M59K286M565P664J1117J4397J7657
50743A045866K1274K5133K8829L2431L6422M0973M5776N0558N5312N9995O4341
$$ plain form
50824 3795810 3746444 3696572 3649774 3609103 3576443 3552438 3536777 3528177 3524059 3520621 3513569 3498971
50812 3498971 3473649 3435285 3382636 3315602 3234798 3140901 3034608 2917388 2792073 2662301
50802 2662301 2531257 2401102 2273710 2151550 2037306 1932532 1837099 1750211 1671716 1602077
50792 1602077 1541328 1488683 1443288 1404874 1373346 1348059 1327894 1311865 1299257 1289289 1281096 1274141
50780 1274141 1268284 1263258 1258324 1252662 1245996 1238680 1231238 1223840 1216159 1207661 1198053 1187444 1176013
50767 1176013 1163692 1150394 1136480 1122606 1109037 1095413 1081365 1067108 1053245 1040243 1028301
50756 1028301 1017522 1007990 999844 993459 989359 987721 988180 990466 995031 1002695 1013812 1028209 1045866
50743 1045866 1067140 1092273 1121102 1153533 1189955 1230928 1276704 1327262 1382574 1442569 1506910
50732A506910O8144P1375P3888P5325P5592P5274P5223P5646P5752P4437P1344
50721B318910O7056O2228N6717M9769M0801K9638J6207P76j5296k9702m0673m8014
50709B508417n2282n3390n0791m4824l7075k9174k1813j5015q839l562L72K263
50697B194287J402k322q333j6131k5719l6926m8620n9063o6976p1996p4307p4277
50685A711019p2378o8994o4237n8170n1286m4427l8089l2052k5841j9455j3384
50674A222706p970k992J974O864J1036J3974J5866J7226J8132J8223J7445J6358
50662A348842J5486J4724J3675J2394J1388J1059J1378J2066J2814J3385J3736
50651A490947J4068J4642J5618J7184J9551K2631K5934K9099L2264L5578L8658
$$ plain form
50732 1506910 1575054 1646429 1720317 1795642 1871234 1946508 2021731 2097377 2173129 2247566 2318910
50721 2318910 2385966 2448194 2504911 2554680 2595481 2625119 2641326 2642102 2626806 2597104 2556431 2508417
50709 2508417 2456135 2402745 2351954 2307130 2270055 2240881 2219068 2204053 2195214 2191652 2192024 2194287
50697 2194287 2195689 2193367 2185034 2168903 2143184 2106258 2057638 1998575 1931599 1859603 1785296 1711019
50685 1711019 1638641 1569647 1505410 1447240 1395954 1351527 1313438 1281386 1255545 1236090 1222706
50674 1222706 1214736 1211744 1213718 1220582 1231618 1245592 1261458 1278684 1296816 1315039 1332484 1348842
50662 1348842 1364328 1379052 1392727 1405121 1416509 1427568 1438946 1451012 1463826 1477211 1490947
50651 1490947 1505015 1519657 1535275 1552459 1572010 1594641 1620575 1649674 1681938 1717516 1756174
50640A756174M1111M3350M6133M9249N1403N1603N0109M7820M5357M3157M1729
50629B267195M1177M0933M0661M1115M2992M4689M2023L1096J1880j0921l0675
50618B562165m2846m6996m5438m0578l3738k5954j8592j2549p594l208K95K209
50606B287176K566J831l35m960j2224k0961l0006l9173m8472n7086o3883o8449
50594A946024p0999p1592p0161o7095o3238n9219n5222n1332m7736m4571m1854
50583A303005l9444l6962l3921l0272k6595k3411k0554j7549j4369j1288q262
50572A040378n011j685J178L449N580P890J0112J1854J3085J4002J4811J5793
50560A131436J7267J9238K1376K3415K5289K6815K7672K7818K7457K6499K4608
$$ plain form
50640 1756174 1797285 1840635 1886768 1936017 1987420 2039023 2089132 2136952 2182309 2225466 2267195
50629 2267195 2308372 2349305 2389966 2431081 2474073 2518762 2560785 2591881 2603761 2592840 2562165
50618 2562165 2519319 2472323 2426885 2386307 2352569 2326615 2308023 2295474 2287880 2284672 2284967 2287176
50606 2287176 2289742 2291573 2291238 2286278 2274054 2253093 2223087 2183914 2135442 2078356 2014473 1946024
50594 1946024 1875025 1803433 1733272 1666177 1602939 1543720 1488498 1437166 1389430 1344859 1303005
50583 1303005 1263561 1226599 1192678 1162406 1135811 1112400 1091846 1074297 1059928 1048640 1040378
50572 1040378 1035367 1033682 1034860 1038309 1043889 1051779 1061891 1073745 1086830 1100832 1115643 1131436
50560 1131436 1148703 1167941 1189317 1212732 1238021 1264836 1292508 1320326 1347783 1374282 1398890
50549A398890K2069J9973J9099J9029J8917J8637J8678J9266K0322K2115K5135
50538A622130K9346L4173L9307M4912N0996N7153O3043O8639P3912P8799Q3613
50527B246023Q8879R4535R9851J04356J08281J11647J13598J13155J10227J05271
50517C295823R8377Q9345P8316O5615N1115L4568J6555j671j9388l6699n3437
50506C618519o8472q0567q9337r4894r7031r5352q9888q1082o9325n5118l9510
50495B757943k3841q935N018J7880K9164L8294M4635M7180M4607L6073K1859L102
50483C012979j8856m2554o6069q6984j03128j13500j18566j19671j18069j14416
50473B111166j09021j02248r4532q6196p7545o8995o0929n3403m6435m0488l6288
$$ plain form
50549 1398890 1420959 1440932 1460031 1479060 1497977 1516614 1535292 1554558 1574880 1596995 1622130
50538 1622130 1651476 1685649 1724956 1769868 1820864 1878017 1941060 2009699 2083611 2162410 2246023
50527 2246023 2334902 2429437 2529288 2633644 2741925 2853572 2967170 3080325 3190552 3295823
50517 3295823 3394200 3483545 3561861 3627476 3678591 3713159 3729714 3728043 3708655 3671956 3618519
50506 3618519 3550047 3469480 3380143 3285249 3188218 3092866 3002978 2921896 2852571 2797453 2757943
50495 2757943 2734102 2725167 2730185 2748065 2777229 2815523 2860158 2907338 2951945 2988018 3009877 3012979
50483 3012979 2994123 2951569 2885500 2798516 2695388 2581888 2463322 2343651 2225582 2111166
50473 2111166 2002145 1899897 1805365 1719169 1641624 1572629 1511700 1458297 1411862 1371374 1335086
50462A335086l3916l2318l0037k6398k1904j7569j3943j0706p139k992J203M767
50450A144134P616J0104J2309J3964J5159J6532J8555K0932K3040K4626K5661
50439A332632K5795K4366K1093J6515J1813Q100N652L689J252j561l568l994l494
50426A438290l309l748m118l795k667o96K161N450Q438J1122J4432J9081K4656
50413A505297L0213L5322M0054M4368M8037N1066N3638N5650N6715N6611N5378
50402B032349N2900M8850M3334L7227L1446K5838J9142J0250o76j2549k4516l6316
50390B227279m7515n7007o3760o7703o9383o8921o5932o0497n3514m5873l7688
50379A589486k8734j9314j0272k271M646J0794J6260K0543K2653K1651J7277J0049
$$ plain form
50462 1335086 1301170 1268852 1238815 1212417 1190513 1172944 1159001 1148295 1141156 1138164 1139367 1144134
50450 1144134 1151750 1161854 1174163 1188127 1203286 1219818 1238373 1259305 1282345 1306971 1332632
50439 1332632 1358427 1382793 1403886 1420401 1432214 1440314 1445966 1449655 1450907 1449346 1445778 1441784 1438290
50426 1438290 1434981 1431233 1427115 1423320 1420653 1419957 1422118 1427568 1436006 1447128 1461560 1480641 1505297
50413 1505297 1535510 1570832 1610886 1655254 1703291 1754357 1807995 1863645 1920360 1976971 2032349
50402 2032349 2085249 2134099 2177433 2214660 2246106 2271944 2291086 2301336 2300660 2288111 2263595 2227279
50390 2227279 2179764 2122757 2058997 1991294 1921911 1852990 1787058 1726561 1673047 1627174 1589486
50379 1589486 1560752 1541438 1531166 1528895 1533541 1544335 1560595 1581138 1603791 1625442 1642719 1652768
50367A652768Q38r468j9929k9573l7687m3968m8323n0745n1449n0745m8664m5082
50355A217973m0468l6111l3105l1267k9446k6740k3048j8661j3829q857m206l78
50343I51857K028K293M3m060q393j1434j2613j2157j0517q188n776l775k184o10
50329H76514J163K874M110M836N506O601Q120R553J0391J0597J0479J0170R439
50316I70353Q012N956L606J270q16k432l435l932m080l800k906j570l49M34J052
50301I67363J868K823L749M882O475Q077Q950R267J0080J1854J3811J5248J6734
50288A081181J9344K3195K7574L1650L3922L1462K1688N676j1389k3949k9928
50277A210426l0743k8762k5623k2237j9049j6079j3324j1116r713q676p287n464
$$ plain form
50367 1652768 1653606 1644138 1624209 1594636 1556949 1512981 1464658 1413913 1362464 1311719 1263055 1217973
50355 1217973 1177505 1141394 1108289 1077022 1047576 1020836 997788 979127 965298 956441 952235 951857
50343 951857 953885 956178 956221 952161 943768 932334 919721 907564 897047 888859 883083 879308 877124 876514
50329 876514 877677 880551 884661 889497 895003 901604 909724 919277 929668 940265 950744 960914 970353
50316 970353 978365 984321 987927 989197 988381 985949 982514 978582 974502 970702 967796 966226 965877 966311 967363
50301 967363 969231 972054 975803 980685 987160 995237 1004187 1013454 1023534 1035388 1049199 1064447 1081181
50288 1081181 1100525 1123720 1151294 1182944 1216866 1248328 1270016 1275692 1264303 1240354 1210426
50277 1210426 1179683 1150921 1125298 1103061 1084012 1067933 1054609 1043493 1033780 1025104 1017817 1012353
50265A012353l851k978k719k576k125j243j24R90K254M241P162J0317J2656J3771
50251A048128J4082J4256J4753J5663J6587J6823J6159J5298J5105J5666J6411
50240A218931J6910J6915J5815J2802P734J433m952j0571j4992j8174k0334k1475
50228A200042k1163j9213j6379j3804j1890j0464r990j1663j5955k1732k7154
50217A020635l0914l2452l1710k9295k6403k3886k1539j8692j5299j2060r654
50206G68731q206p407o822o106n233m503m226m417m760m856m502l908l501l372
50192F96912l102k474k059k569l818m937n554n957o128n533m222l161k990l159
50178F41249l000k851l312l976l889k955j928j164l70M56Q09O55P82J683K762
$$ plain form
50265 1012353 1008502 1005524 1002805 1000229 998104 996861 996737 997727 999981 1004222 1011384 1021701 1034357 1048128
50251 1048128 1062210 1076466 1091219 1106882 1123469 1140292 1156451 1171749 1186854 1202520 1218931
50240 1218931 1235841 1252756 1268571 1281373 1289107 1290540 1285588 1275017 1260025 1241851 1221517 1200042
50228 1200042 1178879 1159666 1143287 1129483 1117593 1107129 1097139 1085476 1069521 1047789 1020635
50217 1020635 989721 957269 925559 896264 869861 845975 824436 805744 790445 778385 768731
50206 768731 760525 753118 746296 740190 734957 730454 726228 721811 717051 712195 707693 703785 700284 696912
50192 696912 693810 691336 689277 686708 682890 677953 672399 666442 660314 654781 650559 647398 644408 641249
50178 641249 638249 635398 632086 628110 624221 621266 619338 618174 617804 618260 619069 619724 620506 622189 624951
50163F24951L122K783K508K693K970K944K882L406M709O300P577Q414R046R602
50149F93907R985J0190J0289J0121R452Q548Q198Q891J0366J2217J4483J7318
50137H23965K0513K3828K7427L1348L4900L7151L7939L7759L6908L5498L4173
50126A181409L3849L4499L4946L4158L2055K8641K3229J5280N600m123j2848k0582
50114A386113k7410l2819l6265l7864l8202l7688l6421l4422l1765k8578k5195
50103A019484k2240k0198j8932j7871j6777j6051j6121j6764j7243j6918j5476
50092H24893j2901r603o421l974k049q7J793K902L196L585M689N931O389O031
50078H24374N498N100M716M376M208L934L141K022J190O97l6j205k142k256j878
$$ plain form
50163 624951 628073 630856 633364 636057 639027 641971 644853 648259 652968 659268 666845 675259 684305 693907
50149 693907 703892 714082 724371 734492 743944 752492 760690 769581 779947 792164 806647 823965
50137 823965 844478 868306 895733 927081 961981 999132 1037071 1074830 1111738 1147236 1181409
50126 1181409 1215258 1249757 1284703 1318861 1350916 1379557 1402786 1418066 1423666 1419543 1406695 1386113
50114 1386113 1358703 1325884 1289619 1251755 1213553 1175865 1139444 1105022 1073257 1044679 1019484
50103 1019484 997244 977046 958114 940243 923466 907415 891294 874530 857287 840369 824893
50092 824893 811992 802389 795968 791994 789945 789858 791651 794553 797749 801334 806023 811954 818343 824374
50078 824374 829872 834972 839688 844064 848272 852206 855347 857369 858559 859256 859220 858015 855873 853617 851739
50063H51739j830k478l523m492n091n269n152m893m524m031l561l353l411l402
50049G96729k888j571N61L026M971N853N976O095O626P532Q794J0340J1613J1940
50035H75597J1487J1153J1338J1440J0970J0373J0201J0036R059P379O032N629
50023I90694N685N409M771M486N202O814Q580R853J0660J1396J1993J1808J0498
50010A097849Q672P307O772O805P159P771Q403Q604Q141P059N304K603j128n582
49996A175739j0336j5093j9559k3292k5862k7012k6716k5248k3244k1431k0159
49985I37787j9373j9011j9198j9891k0587k0673j9961j8715j7245j5738j4378
49974G33017j3332j2494j1504j0180q806p794p145o461n458m272l202k453k132
$$ plain form
50063 851739 849909 847431 843908 839416 834325 829056 823904 819011 814487 810456 806895 803542 800131 796729
50049 796729 793841 792270 792831 795857 800828 806681 812657 818752 825378 832910 841704 852044 863657 875597
50035 875597 887084 898237 909575 921015 931985 942358 952559 962595 971654 979033 985065 990694
50023 990694 996379 1001788 1006559 1011045 1016247 1023061 1031641 1041494 1052154 1063550 1075543 1087351 1097849
50010 1097849 1106521 1113828 1120600 1127405 1134564 1142335 1150738 1159342 1167483 1174542 1179846 1182449 1181321 1175739
49996 1175739 1165403 1150310 1130751 1107459 1081597 1054585 1027869 1002621 979377 957946 937787
49985 937787 918414 899403 880205 860314 839727 819054 799093 780378 763133 747395 733017
49974 733017 719685 707191 695687 685507 676701 668907 661762 655301 649843 645571 642369 639916 637784
49961F37784k237k431k133j147lP02J189K265M163O153P492Q317R245J0342J1007
49946F90708J0778R846Q685P481O114M554L070J957J115O7j550l666o092q915
49932G24152j2183j5212j6783j6325j4578j2756j1340j0074q799p725o896n969
49920E85512m738l425k228q87R09K830M030M028L260K635K700L331M107M788N370
49905F12222N893O397P000P844Q929J0123J1339J2453J3093J2751J1314R275P225
49892G35858N313L393J501k20j979m250p028r544j1001j1428j1499j1596j1489
49879F66031j0985j0512j0651j1282j1596j0983r570p784n863m031k779k373k259
$$ plain form
49961 637784 635547 633116 630983 629836 629833 630535 631724 633989 638152 644305 651797 660114 669359 679701 690708
49946 690708 701486 711332 720017 727498 733612 738166 741236 743193 744308 744375 742825 739159 733067 724152
49932 724152 711969 696757 679974 663649 649071 636315 624975 614901 606102 598377 591481 585512
49920 585512 580774 577349 575121 574234 575143 577973 582003 586031 589291 591926 594626 597957 602064 606852 612222
49905 612222 618115 624512 631512 639356 648285 658408 669747 682200 695293 708044 719358 728633 735858
49892 735858 741171 744564 746065 745845 743866 739616 732588 723044 712043 700615 689116 677520 666031
49879 666031 655046 644534 633883 622601 611005 600022 590452 582668 576805 572774 569995 567622 565363
$$ [...]
##END NTUPLES=NMR SPECTRUM
##END=
