##TITLE=AC1540_ROEFFECT0011_8214838_SN4dJS9b3Q
##JCAMPDX= 6.0         $$ Bruker NMR JCAMP-DX V2.0
##DATA TYPE= NMR SPECTRUM
##DATA CLASS= NTUPLES
##ORIGIN= BRUKER
##OWNER= Administrator
$$ 1.72 TOPSPIN		Version 2.1
$$ 2013-10-11 19:09:50.361 -0700  Administrator@X
$$ Compression mode = diff/dup
##.OBSERVE FREQUENCY= 400.02188249412
##.OBSERVE NUCLEUS= ^1H
##.ACQUISITION MODE= SIMULTANEOUS (DQD)
##.ACQUISITION SCHEME= undefined
##.AVERAGES= 8
##.DIGITISER RES= 22
##SPECTROMETER/DATA SYSTEM= spect
##.PULSE SEQUENCE= zg30
##.SOLVENT NAME= COFFEE_meoh
##.SHIFT REFERENCE= INTERNAL, COFFEE_meoh, 1, 14.98509
##AUDIT TRAIL= $$ (NUMBER, WHEN, WHO, WHERE, PROCESS, VERSION, WHAT)
$$ ##TITLE= Audit trail, TOPSPIN		Version 2.1
$$ ##JCAMPDX= 5.01
$$ ##ORIGIN= Bruker BioSpin GmbH
$$ ##OWNER= Administrator
$$ $$ E:\/data/COFFEE/nmr/AC1540_ROEFFECT0011_8214838_SN4dJS9b3Q/10/pdata/1/auditp.txt
$$ ##AUDIT TRAIL=  $$ (NUMBER, WHEN, WHO, WHERE, PROCESS, VERSION, WHAT)
(   1,<2013-10-11 19:09:43.736 -0700>,<Administrator>,<X>,<go>,<TOPSPIN 2.1>,
      <created by zg
	started at 2013-10-11 19:08:37.861 -0700,
	POWCHK enabled, PULCHK disabled,
       configuration hash MD5:
       C8 4E 4E 5D D3 5C D8 9E 9F 52 82 E0 59 8A DE 15
       data hash MD5: 64K
       4B 2F FE D2 09 2C 9B 3A A2 AE 1C 7F 6F 53 37 35>)
(   2,<2013-10-11 19:09:46.611 -0700>,<Administrator>,<X>,<proc1d>,<TOPSPIN 2.1>,
      <Start of raw data processing
       efp LB = 0 FT_mod = 6 PKNL = 1 PHC0 = 0 PHC1 = 0 SI = 32K 
       data hash MD5: 32K
       E1 4C 6E 76 01 22 7F C6 ED 81 3A D1 A1 96 9B 37>)
(   3,<2013-10-11 19:09:46.939 -0700>,<Administrator>,<X>,<proc1d>,<TOPSPIN 2.1>,
      <pk PHC0 = 95.18555 PHC1 = 0 
       data hash MD5: 32K
       76 9D 4B E6 48 47 51 ED D8 60 53 15 76 74 EF 0C>)
(   4,<2013-10-11 19:09:47.080 -0700>,<Administrator>,<X>,<proc1d>,<TOPSPIN 2.1>,
      <abs ABSG = 1 
       data hash MD5: 32K
       6F 74 D1 F7 38 2F 3B 06 BC 68 7F 3A ED 10 2C 0B>)
(   5,<2013-10-11 19:09:47.143 -0700>,<Administrator>,<X>,<proc1d>,<TOPSPIN 2.1>,
      <abs ABSG = 2 
       data hash MD5: 32K
       40 ED 23 B1 E3 A8 A5 66 D9 4F DC CA 86 F0 C8 30>)
(   6,<2013-10-11 19:09:47.205 -0700>,<Administrator>,<X>,<proc1d>,<TOPSPIN 2.1>,
      <abs ABSG = 3 
       data hash MD5: 32K
       84 B2 77 77 D9 D8 AC 22 E6 32 2C 57 D6 83 D2 5D>)
(   7,<2013-10-11 19:09:47.299 -0700>,<Administrator>,<X>,<proc1d>,<TOPSPIN 2.1>,
      <abs ABSG = 4 
       data hash MD5: 32K
       F1 38 24 B6 CC B2 24 AF BA 36 A1 02 53 E6 23 DD>)
(   8,<2013-10-11 19:09:47.346 -0700>,<Administrator>,<X>,<proc1d>,<TOPSPIN 2.1>,
      <abs ABSG = 5 
       data hash MD5: 32K
       96 E1 A1 51 65 0C 88 23 72 40 F4 7B 1E A5 F2 3C>)
$$ ##END=
$$ 
$$ $$ hash MD5
$$ $$ C4 1F C3 D4 7E A5 9A 56 A4 24 E5 F1 A6 7F 23 56
##$RELAX= 
##$RELAX= 
##$RELAX= 
##$RELAX= 
##$RELAX= 
##$RELAX= 
##$RELAX= 
$$ Bruker specific parameters
$$ --------------------------
##$DU= <E:\>
##$EXPNO= 10
$$ [...]
##$TP= (0..7)
150 150 150 150 150 150 150 150
##$TP07= 0
##$TPNAME0= <>
##$TPNAME1= <>
##$TPNAME2= <>
##$TPNAME3= <>
##$TPNAME4= <>
##$TPNAME5= <>
##$TPNAME6= <>
##$TPNAME7= <>
##$TPOAL= (0..7)
0.5 0.5 0.5 0.5 0.5 0.5 0.5 0.5
##$TPOFFS= (0..7)
0 0 0 0 0 0 0 0
##$TUNHIN= 0
##$TUNHOUT= 0
##$TUNXOUT= 0
##$USERA1= <user>
##$USERA2= <user>
##$USERA3= <user>
##$USERA4= <user>
##$USERA5= <user>
##$V9= 5
##$VALIST= <valist>
##$VCLIST= <CCCCCCCCCCCCCCC>
##$VD= 0
##$VDLIST= <DDDDDDDDDDDDDDD>
##$VPLIST= <PPPPPPPPPPPPPPP>
##$VTLIST= <TTTTTTTTTTTTTTT>
##$WBST= 1024
##$WBSW= 4
##$XGAIN= (0..3)
0 0 0 0
##$XL= 0
##$YL= 0
##$YMAX_a= 637523
##$YMIN_a= -541304
##$ZGOPTNS= <>
##$ZL1= 120
##$ZL2= 120
##$ZL3= 120
##$ZL4= 120
##$ABSF1= 14.98509
##$ABSF2= -5.573092
##$ABSG= 5
##$ABSL= 3
##$ALPHA= 0
##$AQORDER= 0
##$ASSFAC= 0
##$ASSFACI= 0
##$ASSFACX= 0
##$ASSWID= 0
##$AUNMP= <proc_prof1d_extract_pilot.lims>
##$AXLEFT= 0
##$AXNAME= <>
##$AXNUC= <1H>
##$AXRIGHT= 0
##$AXTYPE= 0
##$AXUNIT= <>
##$AZFE= 0.1
##$AZFW= 0.1
##$BCFW= 0
##$BC_mod= 0
##$BYTORDP= 0
##$COROFFS= 0
##$CY= 15
##$DATMOD= 1
##$DC= 0
##$DFILT= <>
##$DTYPP= 0
##$F1P= 0
##$F2P= 0
##$FCOR= 0.5
##$FTSIZE= 32768
##$FT_mod= 6
##$GAMMA= 0
##$GB= 0
##$INTBC= 1
##$INTSCL= 1
##$ISEN= 128
##$LB= 0
##$LEV0= 0
##$LPBIN= 0
##$MAXI= 10000
##$MC2= 0
##$MEAN= 0
##$ME_mod= 0
##$MI= 0
##$NCOEF= 0
##$NC_proc= -8
##$NLEV= 6
##$NOISF1= 0
##$NOISF2= 0
##$NSP= 0
##$NTH_PI= 0
##$NZP= 0
##$OFFSET= 14.98509
##$PC= 1
##$PHC0= 95.18555
##$PHC1= 0
##$PH_mod= 1
##$PKNL= yes
##$PPARMOD= 0
##$PPDIAG= 0
##$PPIPTYP= 0
##$PPMPNUM= 2147483647
##$PPRESOL= 1
##$PSCAL= 4
##$PSIGN= 0
##$PYNMP= <proc.py>
##$REVERSE= no
##$SF= 400.02
##$SI= 32768
##$SIGF1= 0
##$SIGF2= 0
##$SINO= 400
##$SIOLD= 32768
##$SPECTYP= <>
##$SREGLST= <1H.CDCl3>
##$SSB= 0
##$STSI= 32768
##$STSR= 0
##$SW_p= 8223.68421052631
##$SYMM= 0
##$S_DEV= 0
##$TDeff= 65536
##$TDoff= 0
##$TI= <>
##$TILT= no
##$TM1= 0
##$TM2= 0
##$TOPLEV= 0
##$USERP1= <user>
##$USERP2= <user>
##$USERP3= <user>
##$USERP4= <user>
##$USERP5= <user>
##$WDW= 1
##$XDIM= 32768
##$YMAX_p= 446715755
##$YMIN_p= -696541
##$CURPLOT= <Network HP LaserJet P1505>
##$CURPRIN= <$Network HP LaserJet P1505>
##$DFORMAT= <normdp>
##$LAYOUT= <+/1D_H.xwp>
##$LFORMAT= <normlp>
##$PFORMAT= <normpl>
##$SURQMSG= 1
$$ End of Bruker specific parameters
$$ ---------------------------------
##NTUPLES= NMR SPECTRUM
##VAR_NAME=  FREQUENCY,     SPECTRUM/REAL,   SPECTRUM/IMAG
##SYMBOL=    X,             R,               I
##VAR_TYPE=  INDEPENDENT,   DEPENDENT,       DEPENDENT
##VAR_FORM=  AFFN,          ASDF,            ASDF
##VAR_DIM=   32768,         32768,           32768
##UNITS=     HZ,            ARBITRARY UNITS, ARBITRARY UNITS
##FACTOR=    0.250966925370066, 1,           1
##FIRST=     8223.43324360094, 59192,        128303
##LAST=      0,             138129,          60234
##MIN=       0,             -696541,         0
##MAX=       8223.43324360094, 446715755,    0
$$ Real data points
##PAGE= N=1
##DATA TABLE= (X++(R..R)), XYDATA
$$ [...]
19560a32507J9383k6073K4313j92178B66118C4762K2978B5763b91803b649j28520
19549a31169K8661A66964b04981m039l1900H1396P3376a71548J0659A0943b33133
19537D5971a12772C01749A3971a33700J4476K5980j89513E9667A2476K88552a2578
19525d41328D6235c4679q2742p2228c5199j28170E2534a19042I3018B0836a06037
19513f6794a56k00017b8802l71706F2125k347J90707A06938k521c471C21274j15644
19501B05630a4164F0022c01058M1199A80852c10766K8542c3415k72214i2903B19560
19489b49140p6905d2103B55085d6302a1172H7896a77466A70490a46904C17845
19478c99380A24857L5921a94234G0293A1036K59953a46193B3818a99455D1373
$$ plain form
19560 -132507 -113124 -139197 -114884 -307062 266118 34762 57740 25763 -291803 -2649 -131169
19549 -131169 -102508 166964 -204981 -209020 -240920 81396 154772 -171548 -160889 10943 -233133
19537 45971 -112772 301749 13971 -133700 -119224 -93244 -282757 59667 12476 301028 -12578
19525 -441328 46235 -34679 -117421 -189649 -35199 -163369 52534 -119042 93018 20836 -106037
19513 -66794 -156 -200173 -28802 -400508 62125 59778 250485 106938 104417 -3471 321274 205630
19501 205630 -14164 60022 -301058 -259859 180852 -310766 -282224 -33415 -305629 -92903 219560
19489 -249140 -326045 -42103 255085 -46302 -11172 87896 -177466 170490 -146904 317845
19478 -399380 124857 160778 -194234 70293 11036 270989 -146193 23818 -199455 41373
19467a92764B47115e011j59329D5126J14660J8252C4633J81150b27364i6641d302
19455A7761M7060K7667b68638E1700d47941d9534H924f7653j1729A3193d7468
19443a55506k15733J02895K8014Q397O4992B32040j08276i1833k19642O3894A52375
19431A1045J24596l7012m6017c62428A29727c9095A2553d54424A83572a46933
19420I5642b61716D0131J72734I8707d08581a19451j5388j93112J49033Q7564
19410i1354j63442R348i7578D2647J44645R7973O050a35659m5727B00895h6385
19398I2615K1922A113D51a9765k66999l577G6659a71451B96638a55236B21254
19386g3893f996k40637C0093b43205a17960j38662B77137A4148i1750k23516E47919
$$ plain form
19467 -192764 247115 -5011 -164340 45126 159786 178038 34633 215783 -227364 -96641 -4302
19455 17761 64821 92488 -268638 51700 -447941 -49534 8924 -67653 -79382 13193 -47468
19443 -155506 -371239 -268344 -240330 -231933 -166941 232040 123764 -91833 -311475 -247581 152375
19431 11045 135641 98629 52612 -362428 129727 -39095 12553 -454424 183572 -146933
19420 95642 -261716 40131 212865 98707 -408581 -119451 -134839 -327951 -178918 -91354
19410 -91354 -254796 -245448 -97578 42647 187292 285265 291315 -135659 -181386 200895 -86385
19398 92615 114537 1113 451 -19765 -286764 -290341 76659 -171451 296638 -155236 221254
19386 -73893 -6996 -247633 30093 -243205 -117960 -256622 277137 14148 -91750 -315266 547919
19374B0486Q8696a93479o2738c4488A9808K38751b59531R9794C837a9329j08283
19363a27612A02281J9340C2201J07472i3528G1536b47254R4921j58504B42338
19352c6540E0268i4668c4164k44052c6864j8895l1470A95184b33909q225k1077
19341b63211A84632l9118i8722B14818c1793j14872j2171c982k55108d0861j28785
19330a69646C59203a58458A0560c48185A35343c27998A6075d12609a3805C669
19319b3423k93397B1397a4014j54042N8476l0817A75658d777m7098D972a15309
19307F1603b34940H7434a49663m57194d7266q0015b6238p3699E9471j5627a25255
19295d8148B6443Q1059F280K9236j0234g0952r1958j95675B84084d29242h7078
$$ plain form
19374 20486 109182 -193479 -256217 -34488 19808 258559 -259531 -159737 3837 -19329 -127612
19363 -127612 102281 121621 32201 139673 -93528 71536 -247254 -152333 -310837 242338
19352 -36540 50268 -94668 -34164 -278216 -36864 -55759 -87229 195184 -233909 -242134 -263211
19341 -263211 184632 145514 -98722 214818 -31793 -146665 -158836 -3982 -259090 -40861 -169646
19330 -169646 359203 -158458 10560 -348185 135343 -327998 16075 -412609 -13805 3669
19319 -23423 -316820 21397 -14014 -168056 -109580 -140397 175658 -4777 -51875 4972 -115309
19307 61603 -234940 87434 -149663 -606857 -47266 -127281 -26238 -99937 59471 43844 -125255
19295 -48148 26443 107502 6280 35516 25282 -70952 -162910 -358585 284084 -429242 -87078
19283g060m8162j23785F2977a993j12947j1874A11019C866a54190C7366c67164
19271g1659B95504h051A90903b20788m0150k09705a82722Q9226A51396d03124
19260A72409c44257A1458J80671F2140i4532j79674C0990b20997G543h3596B53316
19248I7839i78D5754c52252C7260J9150b34634C46762A12698b99247d179m3010
19237d7189G8045K584a81453O7905C7252d6636l9866j9878j06549f0531a9627
19225c15383k5598B57461b761I6623a43075o3447A18661f1202r739l76895B095
19213a61227H0719j2884Q1152a83597L6330f4897j58802G6161a95184A32254R4429
19202B26683O0913a04o7309A58764b06040J3863Q4837e1055j60806q8456a8544
$$ plain form
19283 -7060 -55222 -179007 62977 -1993 -114940 -126814 111019 3866 -154190 37366 -367164
19271 -71659 295504 -8051 190903 -220788 -260938 -470643 -182722 -93496 151396 -403124
19260 172409 -344257 11458 192129 62140 -94532 -274206 30990 -220997 7543 -83596 253316
19248 97839 -978 45754 -352252 37260 56410 -234634 346762 112698 -299247 -4179 -47189
19237 -47189 78045 80629 -181453 -113548 37252 -46636 -86502 -106380 -212929 -60531 -19627
19225 -315383 -340981 257461 -2761 96623 -143075 -206522 118661 -61202 -70941 -447836 2095
19213 -161227 80719 67835 148987 -183597 -147267 -64897 -223699 76161 -195184 132254 226683
19202 226683 287596 -104 -67413 158764 -206040 -192177 -107340 -51055 -211861 -300317 -18544
19190H0623L6309e57025b4192l37669P8501J09705A75915F3610a3836q7619A43547
19178A29823F0474a76302I0591a99325f2478H5694C0444K27116E4410b08707A79420
19166e4106r740k41186D2095h8727I8896b23119A17778b15619e5816l26572a18268
19154C8486h265n2389a7780j88930A02417a68989F663a6382k00002B8758R7847
19143A26605a49569A4137b4259j57145O4528C21543h651r347j77335k04282a40497
19131B8643P5459R1716b35870a8518q0931B93572j00296g2510R868A5322J01766
19120A17088a49900d3508j6234A64918E7820K23243F5258j1895J06792b23371
19109a84798b5597B11064C7361f7823G2222b38657f4077B0102P3514c26926C4645
$$ plain form
19190 80623 116932 -557025 -24192 -361861 -283360 -173655 175915 63610 -13836 -101455 143547
19178 129823 60474 -176302 90591 -199325 -62478 85694 30444 257560 54410 -208707 179420
19166 -54106 -63846 -305032 42095 -88727 98896 -223119 117778 -215619 -55816 -382388 -118268
19154 38486 -8265 -60654 -17780 -206710 102417 -168989 6663 -16382 -216384 28758 126605
19143 126605 -149569 14137 -24259 -181404 -116876 321543 -8651 -17998 -195333 -399615 -140497
19131 28643 104102 195818 -235870 -18518 -99449 293572 193276 -72510 -62642 15322 117088
19120 117088 -149900 -43508 -59742 164918 57820 281063 65258 53363 160155 -223371
19109 -184798 -25597 211064 37361 -67823 72222 -238657 -64077 20102 93616 -326926 34645
19097h1915J5000J1970F0720c71936i5474A21250L5093d32890A54230d21295J44241
19086b77054e9817J5359n5198A94461a11753L9383B66422d41005G2043J3596B9963
19074g0341A220b28456J6879B46506a4974p4826H2253M224j2936L8733b96640
19062c5424n146j68064j27451B27023D6576a0432H5681K61415d28251a07366J1084
19051i6282L9804p8971A77486k9616b45265N7771B31500E1906d859D7906b54474
19039D95775f2937k00186A1167M5977K85214c42579I8674h1331A59865m7919c6566
19027a08018A10824b00624j24887J26709F04366D2069J28139c62290c5421c595
19016a04480b563F354N8601L0423a21642r7047A18258a85274g0662F1768Q9110
$$ plain form
19097 -81915 -66915 -54945 60720 -371936 -95474 121250 156343 -432890 154230 -421295 -277054
19086 -277054 -59817 -44458 -99656 194461 -111753 -72370 266422 -441005 72043 85639 29963
19074 -70341 1220 -228456 -211577 246506 -14974 -89800 82253 86477 73541 112274 -296640
19062 -35424 -40570 -208634 -336085 227023 46576 -10432 85681 347096 -428251 -107366 -96282
19051 -96282 -56478 -135449 177486 147870 -245265 -187494 231500 51906 -4859 47906 -254474
19039 495775 -62937 -263123 11167 57144 342358 -342579 98674 -81331 159865 111946 -36566
19027 -108018 110824 -200624 -325511 -198802 604366 42069 170208 -362290 -35421 -3595
19016 -104480 -2563 6354 64955 95378 -121642 -218689 118258 -185274 -70662 61768 150878
19005A50878a07286G1566b26503c7639r4462I3687b27580D6558P433O2796c57404
18993g1767D7429b3361C979J87984g8545J3558k3763j51838N8889A15632b36213
18981C1594N6954C4615c4568k74168b074k58896G1865A9783a25319b8702i171
18969a61219J2263D9610H13J40247c60697B60187a45630A02339g3521j57937I6807
18957E2353L7098c43065Q9200H2486a37095A67679J8176a52318A07771h0062B44455
18945a1405k31273e541j20221r5278R9827a6560m0585j12892A4310b76542P8709
18934a97833r4586Q8463H3408g119j97108B26159J45719a73085q6975j46241C5984
18922b43653c8931k94261h003m0495r3935r1623F7866h7411r2160m5456e9423
$$ plain form
19005 150878 -107286 71566 -226503 -37639 -132101 93687 -227580 46558 53991 116787 -357404
18993 -71767 47429 -23361 3979 191963 -78545 -64987 -88750 -240588 -181699 115632 -236213
18981 31594 88548 34615 -34568 -308736 -2074 -260970 71865 19783 -125319 -28702 -9171
18969 -161219 -148956 49610 813 141060 -360697 260187 -145630 102339 -73521 -231458 96807
18957 52353 89451 -343065 -253865 82486 -137095 167679 185855 -152318 107771 -80062 244455
18945 -11405 -242678 -5541 -125762 -221040 -121213 -16560 -57145 -170037 14310 -276542 -197833
18934 -197833 -292419 -203956 83408 -7119 -204227 226159 371878 -173085 -260060 -406301 35984
18922 -243653 -38931 -333192 -8003 -48498 -142433 -234056 67866 -87411 -179571 -225027 -59423
18910B3571b65756E705a91711D34559a61342P4287A45092A7742a77883N5726k13808
18899c35965B54525E1213J39889j2369e2482A96276c06117a45438H7887b45707
18888a05289B80683b38293b9019p1549q5816B8973O275b47060A54247e7678j90230
18877b47908B07153b24384J05664p3359q4093j1502C5316b05440A12743D5935
18866a29352A93954J3610g1532k1906C662a93250D00187b44691C22113g9629A350
18854d2382J4423j58686A93117C5316J74467c6823A51705A6050a24640e3608D1119
18842e70750K24233b4315m7047A35943i5113j95008G3570J88864b19973H1568
18831C3485c01277C11481G943a96853j3697g6169d187A14148A3221K00216a471
$$ plain form
18910 23571 -265756 5705 -191711 434559 -161342 -87055 145092 17742 -177883 -122157 -335965
18899 -335965 254525 51213 191102 178733 -52482 196276 -306117 -145438 87887 -245707
18888 -105289 280683 -238293 -29019 -100568 -186384 28973 35248 -247060 154247 -57678 -247908
18877 -247908 207153 -224384 -118720 -192079 -276172 -287674 35316 -205440 112743 45935
18866 -129352 193954 207564 -71532 -93438 3662 -193250 400187 -244691 322113 -79629 1350
18854 -42382 -27959 -186645 193117 35316 209783 -36823 151705 16050 -124640 -53608 41119
18842 -570750 -346517 -24315 -71362 135943 -95113 -290121 73570 262434 -219973 81568
18831 33485 -301277 311481 7943 -196853 -210550 -76169 -4187 114148 13221 213437 -1471
18819B91241b86928a26688D55193a2231j06404p0499A21799J01162m5696J48113
18809C25378j32103K1558A03757L06411A03836l3037c91381i931l4376p1475A41366
18797a6789l1909p857B13719H3795a95114B23133d2982A60771A2242i2759l8085
18786a30844B47313m7802B062a80757f9410j95430B99142b06525I1256f728H529
18774A09878a03956I2008m5188N3190J97791I6947C8a83041C08352B7450K73366
18763C00816a21250k5425o27d9337A72254C8649A701a01506B32633B3858J60900
18752A84758d07789a31525r6489F826L03884A32067a22227l08174A99304a57571
18741A56357g7556c4523C3128a30765C2127j0504F167J41627E2802f690A51907
$$ plain form
18819 291241 -286928 -126688 455193 -12231 -118635 -189134 121799 222961 177265 325378
18809 325378 193275 214833 103757 410168 103836 70799 -391381 -9931 -44307 -115782 141366
18797 -16789 -48698 -56555 213719 83795 -195114 223133 -42982 160771 12242 -92759 -130844
18786 -130844 247313 199511 2062 -180757 -69410 -264840 299142 -206525 91256 -6728 8529
18774 109878 -103956 92008 46820 100010 297801 96947 38 -183041 308352 27450 300816
18763 300816 -121250 -146675 -147302 -49337 172254 38649 1701 -101506 232633 23858 184758
18752 184758 -407789 -131525 -228014 6826 310710 132067 -122227 -430401 199304 -157571
18741 156357 -77556 -34523 33128 -130765 32127 21623 6167 147794 52802 -6690 151907
18729B1617a23737A76947e5721k42466A87921H8261B5915i0790j61763D05431
18718a00337A34555n9550a25202K2176A99961a34770B9913a88485M1484l3145
18708a80146B20263N896c56555h9103m6786n3995B94628c31623A20256a32163
18697e592j30125b7566j12204A20327b98015g6002a5966j59628A28375c05350
18686i1518a8906j34385C8869J62167b59139j4202N9343B78233a10153I8590b05017
18674A77880D1817a11812A47640b74204B66078c08759A19424K09474b58768a20078
18663A86457a35437A6404e0978A85317a57120k2526A42201F1228a84494j8674
18653b03168A51722n7491b43590r2862b2255I7780g5389A80791b54553l01488
$$ plain form
18729 21617 -123737 176947 -55721 -298187 187921 88261 25915 -90790 -252553 405431
18718 -100337 134555 75005 -125202 -103026 199961 -134770 29913 -188485 -147001 -180146
18708 -180146 220263 226159 -356555 -89103 -135889 -189884 294628 -331623 120256 -132163
18697 -5592 -135717 -27566 -139770 120327 -298015 -76002 -15966 -175594 128375 -305350
18686 -91518 -18906 -153291 38869 201036 -259139 -273341 -213998 278233 -110153 98590 -205017
18674 177880 41817 -111812 147640 -274204 266078 -308759 119424 328898 -258768 -120078
18663 186457 -135437 16404 -50978 185317 -157120 -179646 142201 61228 -184494 -203168
18653 -203168 151722 94231 -243590 -336452 -22255 97780 -75389 180791 -254553 -556041
18643e56041A89199l7357a81031N5979b9780k3738E8461j6119G619d68208a24844
18631D9607d4416p0559A38735a23324j58768F9255a34455c6265j27795k3994A55677
18619e1517l12250c8471k82554H4684R8460a32342N6570H1557b18323J452l3663
18608b50534a02367C05791d6994q8842j53331B1891d6331j24458b4653j59664
18598a84317D4668d7314j88654P2518A0507d72935h9997b6334k87170A98251m3032
18587A55219p6504f1276A34359f6722j12484l4981a1533F0712c38751J04270B63963
18575B30569E5387b95505A04968c7962j26598A7912b33789B6360a01850d9873
18564b33111a10580A7585a66791P2j27736c6925j23445R338A17318f7964m8338
$$ plain form
18643 -556041 189199 151842 -181031 -125052 -29780 -53518 58461 42342 7619 -468208 -124844
18631 49607 -44416 -114975 138735 -123324 -282092 69255 -134455 -36265 -164060 -188054 155677
18619 -51517 -363767 -38471 -321025 84684 183144 -132342 -75772 81557 -218323 -216871 -250534
18608 -250534 -102367 305791 -46994 -135836 -289167 21891 -46331 -170789 -24653 -184317
18598 -184317 44668 -47314 -235968 -163450 10507 -472935 -89997 -26334 -313504 198251 155219
18587 155219 78715 -61276 134359 -66722 -179206 -214187 -11533 60712 -338751 -234481 263963
18575 230569 55387 -295505 104968 -37962 -164560 17912 -233789 26360 -101850 -49873
18564 -233111 -110580 17585 -166791 -166719 -294455 -36925 -160370 -151032 117318 -67964 -116302
18553a16302j41136O3313K649k2n7429L0319J02033q3889f5893j27798f3898B12688
18540b6672l61702a22561B85652a49532k6248p5193j1369D9396q199K67671a66953
18528b08101A87076a70684C36500E2875a40334K0440K6029M837H9664b90888J6253
18517b74635b6454j7389a679B17783D4042O0912K5553h444p3130j57345D09942
18505a89887g5365n1451K0754B0133a85778A41665o2788b6660I5580d93082b38122
18493a75429B8869c5415A00235b20262G1527a57981G9393a28831b6480j1248j48230
18482a85958A75920c45886h3242I8616b23526B69886c78707F0394J84851l4606
18472B10639G8685R6749o6908P8879m0386a30825J5048l9238M442j01208q149
$$ plain form
18553 -116302 -257438 -194125 -191476 -191498 -248927 -218608 -116575 -200464 -65893 -193691 -63898 212688
18540 -26672 -388374 -122561 285652 -149532 -175780 -250973 -262342 49396 41197 308868 -166953
18528 -208101 187076 -170684 336500 52875 -140334 -119894 -93865 -89028 89664 -290888 -274635
18517 -274635 -26454 -43843 -1679 217783 44042 104954 130507 -8444 -81574 -238919 409942
18505 -189887 -75365 -126816 -106062 20133 -185778 141665 78877 -26660 95580 -493082 -238122
18493 -175429 28869 -35415 100235 -220262 71527 -157981 79393 -128831 -26480 -37728 -185958
18482 -185958 175920 -345886 -83242 98616 -223526 269886 -378707 60394 245245 210639
18472 210639 78685 175434 108526 187405 147019 -130825 -115777 -155015 -150573 -251781 -259930
18461b59930A4720J30934F3480g8122B56433e5112k41469I9633d08843H5927m868
18450H1059K6981D7216a29147J1539A29681n5351R4726d220j76251k04681E1271
18438B08764c85384F5745g81k16597b4230j93529e7181B63755B0815h8920K7567
18427f1353m10985a66399n722k5347A10404E1259d4697k8381K6217o5708L7445
18416g5124F7415f5773A2524f3204F2355L0390d7581M196A40084J89579a85515
18404H3412h7986B7534f3271A67267b32921r6441D00056g1851j42083C4347a04728
18392a35351r0538A2352J20468c74385A08032b1808D1749A535a07182A05891K6532
18381A32423b26825E3773g780p1643D42850a31872h900k04894M7416C68864G2327
$$ plain form
18461 -259930 14720 145654 63480 -78122 256433 -55112 -296581 99633 -408843 85927 81059
18450 81059 108040 47216 -129147 -117608 129681 74330 169056 -4220 -180471 -385152 51271
18438 208764 -385384 65745 -781 -217378 -24230 -217759 -57181 263755 20815 -88920 -61353
18427 -61353 -472338 -166399 -172121 -197468 110404 51259 -44697 -73078 -46861 -112569 -75124
18416 -75124 67415 -65773 12524 -63204 62355 92745 -47581 -43385 140084 329663 -185515
18404 83412 -87986 27534 -63271 167267 -232921 -329362 400056 -71851 -213934 34347 -104728
18392 -135351 -225889 12352 132820 -374385 108032 -21808 41749 1535 -107182 105891 132423
18381 132423 -226825 53773 -7780 -79423 442850 -131872 -8900 -213794 -166378 368864 72327
18369A53276b91844H1653I339J44013m7577E13d6061A67225H2730C7987K17112
18358B55099d3941J3607D5123K6255k2738f1082j19963h9468j47396I2924a20826
18346A6265b6758A65834C6686c18088G5847d0099A3857a70545c4523A66503i5937
18334a41257I264Q6083a69414O9632M797F2425b36822b5155D1002c6994j64443
18323b01437k1437B28260a91440B14612b49382Q911L5705I7572b0139H8905b9028
18311A04052c10870g9848j38431A94877a4604p6262A26940K4828e3910A58940
18300b15464A0952b40450A77709g8693K9134D5809P1743n1049E296O0001a98407
18288G3297k2944Q831a42668E0720a81302B54006i9986A77524h5439B3447K00791
$$ plain form
18369 153276 -291844 81653 9339 153352 105775 513 -46061 167225 82730 37987 255099
18358 255099 -43941 -30334 45123 71378 48640 -61082 -181045 -89468 -236864 92924 -120826
18346 16265 -26758 165834 36686 -318088 75847 -40099 13857 -170545 -34523 166503 -95937
18334 -141257 9264 95347 -169414 -99782 -94985 62425 -236822 -25155 41002 -36994 -201437
18323 -201437 -222874 228260 -191440 214612 -249382 -240471 -204766 97572 -20139 88905 -29028
18311 104052 -310870 -79848 -218279 194877 -14604 -90866 126940 151768 -53910 158940
18300 -215464 10952 -240450 177709 -78693 -49559 45809 117552 66503 5296 65297 -198407
18288 73297 50353 59184 -142668 50720 -181302 254006 -99986 177524 -85439 23447 224238
18277B24238a35026D9208C915a84563k3352Q4131A07816J1109Q1161g7205j93122
18266b70327a30193K0681k41454F325a86825A33303c80062A11549b33701b9313
18255C6841P9350Q61n237Q6981p1191O4036D6066d7200K0377B2494K94636H3262
18242c9989j98138h3731B20844A890a02771k28400B28443A02434e3209I3583c15024
18230a68951B09115b83941d3001C6581a38897k0422o1433A93592b02651k33595
18220d36246J25565a38463e9812A48695K49604g6437o308m6979J9949m467D9252
18208A05383j8493A1789M2512b0496F8273K8071b8845A58514J30062c59394B4615
18196b93768f9121k52813E7283L042b34918o1968q507J29a262A58132a64260F2409
$$ plain form
18277 224238 -135026 49208 3915 -184563 -207915 -123784 107816 118925 200086 -77205 -270327
18266 -270327 -130193 -109512 -350966 6325 -186825 133303 -380062 111549 -233701 -29313
18255 36841 116191 117052 111815 198796 127605 191641 46066 -47200 -26823 22494 317130 83262
18242 -39989 -238127 -83731 220844 1890 -102771 -331171 228443 102434 -53209 93583 -315024
18230 -168951 209115 -283941 -43001 36581 -138897 -159319 -220752 193592 -202651 -436246
18220 -436246 -310681 -138463 -59812 148695 398299 -76437 -82745 -129724 -109775 -114242 49252
18208 105383 86890 11789 54301 -20496 68273 96344 -28845 158514 288576 -359394 24615
18196 -293768 -69121 -321934 57283 60325 -234918 -296886 -305393 -305264 -1262 158132 -164260 62409
18183a27324B91943f8606b0282k25992B85153i1385r8479L5193o7795M1628O2054
18172a18784E4253a22338b1200B87410a17863m029m7320A40827k8418A3338b08825
18160G6110P9710b15290c4054H5701c96084I4833f8738C21576h4011E3452a77169
18148a19443j9778n6197Q5623l8276N6921j92898h0677j15174g9475b22r7436
18137i7658A07118C9896b16429N918d5590A24073a49049e6785B29238a38696B36861
18125b15145i7698A75898b41257r0336D5456c90403J86218j21151a46620L7020
18115a09600B39972J22322c5139B72321o8638A2576b09304c2842B86564p0938
18105B15626b4145m9903j55944J14043k17614d6604A59984n746a7864k79831a20248
$$ plain form
18183 -127324 291943 -68606 -20282 -246274 285153 -91385 -189864 -154671 -222466 -180838 -118784
18172 -118784 54253 -122338 -21200 287410 -117863 -121892 -169212 140827 112409 13338 -208825
18160 76110 155820 -215290 -34054 85701 -396084 94833 -68738 321576 -84011 53452 -177169
18148 -119443 -139221 -195418 -109795 -148071 -91150 -284048 -80677 -195851 -79475 -222 -97658
18137 -97658 107118 39896 -216429 -210511 -45590 124073 -149049 -56785 229238 -138696 236861
18125 -215145 -97698 175898 -241257 -331593 45456 -390403 -204185 -325336 -146620 -109600
18115 -109600 239972 362294 -35139 272321 203683 12576 -209304 -32842 286564 215626
18105 215626 -24145 -74048 -229992 -115949 -333563 -46604 159984 154238 -17864 -297695 -120248
18093a34997M9388p8975O8803B18074m9501a0426A6940J6774O4961a38119D9712
18081c04498a04698A54689b55773B41309b4613I4205p438b14815H9748M5422N8427
18070A93597g973l3848E28559A13928g2592J3890o9570d3549n5157j03913C49627
18058A13935j4416a8590o5219j0469m5628C15988D4593g8507n831j50510h8057
18046A635a62046l0249F5212B6575b87858i8170B03272G7008n940R3184m2015
18035A22237a20552j84541A60448a56987C06737a48503l2973h7376C75066a04405
18024b96688h6133L8273p7072F880K52855e5988k95704b348A9055N9540b13979
18012C06150f8542a1953o7790k27194F7680a67169A4441K09707a56728g6707n6108
$$ plain form
18093 -134997 -85609 -164584 -95781 218074 168573 -10426 16940 33714 98675 -138119 49712
18081 -304498 -104698 154689 -255773 241309 -24613 94205 86767 -214815 89748 135170 193597
18070 193597 -7973 -41821 528559 113928 -72592 -58702 -128272 -43549 -98706 -202619 349627
18058 113935 99519 -18590 -83809 -94278 -139906 315988 44593 -78507 -84338 -234848 -88057
18046 1635 -162046 -192295 65212 26575 -287858 -98170 203272 77008 71068 164252 122237
18035 122237 -120552 -305093 160448 -156987 306737 -148503 -181476 -87376 375066 -104405
18024 -296688 -86133 -47860 -124932 6880 259735 -55988 -351692 -2348 19055 78595 -213979
18012 306150 -68542 -11953 -79743 -306937 67680 -167169 14441 224148 -156728 -76707 -132815
18001a32815A55111k9827j2654J6063J48439I5336J7538J6817a85334B1441J24807
17990A46248g1069A7616m044L456b29169h5527J550j6287l08542J61135a15952
17978f96541b26992P4938A27118b37623A61226P050a61805l3771Q8514A07753
17967A1927K36395A4268b32712A8999Q2296a4279l14811A23894J29644E1318b66669
17955e9863A43774a9632j96371i0282B05326c7813A50611o7189b23790a00524
17944D57916i9452D62628G1840c17481b8520I8663K2197L3555e5972B110Q0862
17933H2972k2353j535h8650L5510j08389B08524k424a21654H3181a30371r2068
17922b22439B05054b42433N4029e1718F9580d4252r5002a553j39815Q396F2922
$$ plain form
18001 -132815 155111 125284 112630 128693 277132 95336 112874 129691 -185334 21441 146248
17990 146248 -71069 17616 13572 17028 -229169 -85527 -83977 -100264 -408806 -247671 -115952
17978 -696541 -226992 -152054 127118 -237623 161226 168276 -161805 -195576 -107062 107753
17967 11927 248322 14268 -232712 18999 101295 -14279 -329090 123894 253538 51318 -266669
17955 -59863 143774 -19632 -216003 -90282 205326 -37813 150611 83422 -223790 -100524
17944 457916 -99452 462628 71840 -317481 -28520 98663 120860 154415 -55972 2110 82972
17933 82972 60619 59084 -88650 -53140 -161529 208524 206100 -121654 83181 -130371 -222439
17922 -222439 205054 -242433 -188404 -51718 69580 -44252 -139254 -1553 -141368 -132972 62922
17910G7419K72684E1522c6982k2308q9908O8929a2392B58531f9989A46628g5669
17898g4782j99042D3481k0203Q3383h0317P71H8226A5125b31499j51397I1040
17886a26156A28567b44660P0097l3052L6943g4547A84844c2043A13034a34100
17875A33869J11700E9904K84941a7991C41692j22220o0301B1768K62437i8250
17864c55931E5582a5072I5012a22209A37642J21804A4427N5714J85013e6366A66306
17852f9288a4769j57927K7347f0761h300j33256b6892A28628A3781i906q3285
17841i3191m8970l2799Q4137A76165l7851F3776J95815C1928h2731B7182J83008
17830B10190c65916B44814a40252B41971d5211E889R7042m3926K9383L0902a73141
$$ plain form
17910 77419 350103 51522 -36982 -59290 -149198 -80269 -12392 258531 -69989 146628 -75669
17898 -74782 -273824 43481 23278 106661 -80317 -79546 88226 15125 -231499 -382896 91040
17886 -126156 128567 -244660 -174563 -207615 -170672 -74547 184844 -32043 113034 -134100
17875 133869 245569 59904 344845 -17991 341692 219472 159171 21768 284205 -98250
17864 -355931 55582 -15072 95012 -122209 137642 259446 14427 70141 255154 -56366 166306
17852 -69288 -14769 -172696 -145349 -60761 -8300 -141556 -26892 128628 13781 -9906 -93191
17841 -93191 -142161 -174960 -90823 176165 138314 63776 259591 31928 -82731 27182 210190
17830 210190 -365916 244814 -140252 241971 -45211 5889 102931 59005 88388 119290 -173141
17818A06745b17228a2780k03484j3866p2901A9601L25383f9597j13359A84362
17807b0428B36448a30633J0045A20276q268c9674A65234J8392b40962h9715B30994
17795a88840A4934K99332f4423Q553j21767K2199e3269I9516J28764h0315L1157
17784d9158C5304K74899h358B49059a42319A76684G4414K49678a53495j98310
17774c51805A98245d7367j35532A80058o4863C2519K2096k4527O436J49975a85616
17762E169O1217f5908p6352D5236a08792c1763I7246K00902A37639f7186F4010
17750b05583I405a48548D1194J75760a777j42713A75903Q929m1789m7781a86698
17738i87p8087B43836H0582a66567d6817C5106a6967I8495a68469N840M466o0695
$$ plain form
17818 106745 -217228 -12780 -216264 -230130 -303031 19601 344984 -69597 -182956 184362
17807 -20428 236448 -130633 -120588 120276 112008 -39674 165234 183626 -240962 -89715 230994
17795 -188840 14934 314266 -64423 -55870 -177637 -155438 -53269 99516 228280 -80315 -49158
17784 -49158 35304 310203 -8358 249059 -142319 176684 74414 324092 -153495 -351805
17774 -351805 198245 -47367 -182899 180058 115195 32519 54615 30088 36524 186499 -185616
17762 5169 66386 -65908 -142260 45236 -108792 -31763 97246 298148 137639 -67186 64010
17750 -205583 9405 -148548 41194 216954 -1777 -144490 175903 184832 143043 95262 -186698
17738 -987 -79074 243836 80582 -166567 -46817 35106 -16967 98495 -168469 -162629 -158163 -218858
17726b18858F5763b27562k82754J86626f8016F5434N25678C224b2773k11313A21230
17714a09263N4199G3334c5009A72140C7246P3494h3747B7940a0333G699c63902
17702a15051A85491B4389d898G4853b54797A4762b51025b7251L062o9367B17075
17690B02833D5761J66230k8953o5106N26198H8830b15784b9230D9413b07366A0855
17678a23719j61534A34079c1382I4113C6578a02464p3302c8162l5633A77588l8833
17667A38755E4228j4983b34055E9039b13641A77336m0844a1170A51712J2130B9226
17655b41613A70234a9895A19793M8056C8177i0527A07758b75032f9926j91642
17645b61568A15360i15E6087o105Q9722K6286i0908C3885a32142A10977f8877
$$ plain form
17726 -218858 65763 -227562 -510316 -323690 -68016 65434 591112 3224 -22773 -234086 121230
17714 -109263 -55064 73334 -35009 172140 37246 110740 -83747 27940 -10333 7699 -363902
17702 -115051 185491 24389 -4898 74853 -254797 14762 -251025 -27251 -24189 -93556 217075
17690 202833 45761 211991 183038 117932 644130 88830 -215784 -29230 49413 -207366 10855
17678 -123719 -285253 134079 -31382 94113 36578 -102464 -175766 -38162 -73795 177588 138755
17667 138755 54228 39245 -234055 59039 -213641 177336 136492 -11170 151712 163842 29226
17655 -241613 170234 -19895 119793 167849 38177 -90527 107758 -275032 -69926 -261568
17645 -261568 115360 -915 56087 49982 139704 165990 -90908 33885 -132142 110977 -68877
17633B96518b83465B02800b76220g0043A27743o3369l317B9859a98277G7079A3931
17621B34597N9678b84711B12186F2699J12983a82510C48924A57247C1996c742
17610C46769A7933b3703A94638d2806a2605A67231l2602A9348J07371J15489c0924
17598C40940A39467E1704P6206L8434d9754A00566a85687f9088I8396b37933a06274
17586c3671F2936K7357J08647b70509A38456a48673M938D1764a03478A01739K82544
17575C84283a35765B17889H306b06856i2993o5730B56779B691O5J50342J891O1225
17563B16214b1057j54360B2319M5309J70720a27764A14361C9533K47539G3111
17552A29777a06460j7015D5919J96708h0353C19548j02685m9973b1407p8018A51813
$$ plain form
17633 296518 -283465 202800 -276220 -70043 127743 64374 61057 29859 -198277 77079 13931
17621 234597 294275 -284711 212186 62699 175682 -182510 348924 157247 31996 -3742
17610 346769 17933 -23703 194638 -42806 -12605 167231 134629 19348 126719 242208 -30924
17598 340940 139467 51704 127910 166344 -49754 100566 -185687 -69088 98396 -237933 -106274
17586 -33671 62936 90293 198940 -270509 138456 -148673 -143735 41764 -103478 101739 384283
17575 384283 -135765 217889 8306 -206856 -92993 -158723 256779 2691 2756 153098 154989 216214
17563 216214 -21057 -175417 22319 67628 238348 -127764 114361 39533 287072 73111
17552 129777 -106460 -123475 45919 242627 -80353 319548 216863 166890 -21407 -99425 151813
17540B86378I321M31266f7228F334b0474k15362B98018j34698J3715j1648k4354
17529A41033L8362L4615C2953P7374k3528d4345A66853a54017A28381J35424E0483
17517f4879D2002j4956K52163b301D17729g6524D4023e0611K3113A21942a56405
17505D32858F095f0705j2804d009j86242A77993F2668a12402B94924C5669J3062
17494D8731N5985k0260J53970A02076q664J92455e5938C2531L08616a88260B67139
17482C3052L13055A61255A0529M74073r3573h8740b0813C23346N3937e3834C86991
17470B1174J77287r6575J36325K44745H0199K93727G5341B3208f7948B32685A8568
17458B83133j25156J5956N7991k2591I1983F481L77135q6188r6327a57773B68529
$$ plain form
17540 286378 9321 440587 -67228 6334 -20474 -235836 298018 163320 177035 165387 141033
17529 141033 179395 214010 32953 110327 86799 -44345 166853 -154017 128381 263805 50483
17517 -64879 42002 27046 279209 -2301 417729 -76524 44023 -50611 -27498 121942 -156405
17505 432858 6095 -60705 -73509 -4009 -190251 177993 62668 -112402 294924 35669 48731
17494 48731 104716 84456 238426 102076 93412 285867 -55938 32531 341147 -188260 267139
17482 33052 346107 161255 10529 484602 391029 -88740 -20813 323346 377283 -53834 386991
17470 21174 198461 101886 238211 482956 80199 373926 75341 23208 -67948 232685 18568
17458 283133 157977 173933 231924 209333 91983 6481 383616 297428 201101 -157773 268529
17446C93445A28652B6690J07526K13850q6979A15804R1378J56359A23730K25433
17436C49163A54955o3800K40098j50834L14439c5695D33607A97926k5134K42957
17426D15749j43909j24637K14600A5172J35706n3453m238M87549G2897K99813
17416C72710j41227j6927f9776k193B34900J800I8570J4459J22467M1027d3436
17404A19337K9518J93907C6637N7450m4979K23904j30492B1554L28536O2998j43913
17393B69175K3900e9918C25201A0375f9017j09863B19476k1915N6845j621r059
17382B43726J5746O1189j0193L5261F9093K27591c2052A31324J54452m8056g3940
17370A22155J3396J02210J34311q9709D1955J5280c76j19415B48996O8225r2077
$$ plain form
17446 393445 128652 26690 134216 348066 261087 115804 207182 363541 123730 349163
17436 349163 154955 91155 331253 180419 494858 -35695 433607 197926 172792 415749
17426 415749 271840 147203 361803 15172 150878 97425 93187 580736 72897 372710
17416 372710 231483 214556 -69776 -71969 234900 236700 98570 113029 235496 276523 -43436
17404 119337 148855 342762 36637 94087 49108 273012 142520 21554 350090 413088 269175
17393 269175 293075 -59918 325201 10375 -69017 -178880 219476 197561 254406 252785 243726
17382 243726 259472 320661 310468 345729 69093 296684 -32052 131324 285776 237720 -73940
17370 122155 135551 237761 372072 282363 41955 57235 -376 -119791 248996 317221 225144
17359B25144I3109J28506O6485L6981o9201O5794i5521c9182m9640l1720A77303
17347D78824b2787E9783j9846M35251a52597A79276K03473C9966e1129j2237A48413
17335d1176C70600h8867A25961D0499K4774d1908D30779j87386d7462D5212P3124
17324A18336A3410M79870I4003J37433A07697R4792I7852L97288o0919j90744
17314B43477A07711R0906p1319J40564J28866j97151Q942F1043K7253P9781K89121
17303D57198o8220A55832n1707K94393a35690B59912J03329E3376a96455N9509
17293a36946f2292E26882o5759j45385c1101B56939r8779n5160a13945A53459
17282C99187a66276A07495K96360h0872F6796K77973N0474j07199Q7878I6552
$$ plain form
17359 225144 93109 221615 288100 325081 255880 321674 -95521 -39182 -88822 -120542 177303
17347 478824 -22787 59783 39937 475188 -152597 179276 382749 39966 -51129 -63366 148413
17335 -41176 370600 -88867 125961 40499 65273 -41908 430779 243393 -47462 45212 118336
17324 118336 13410 493280 94003 231436 107697 202489 97852 495140 434221 243477
17314 243477 107711 198617 127298 267862 396728 199577 208519 61043 88296 168077 457198
17303 457198 388978 155832 104125 398518 -135690 259912 363241 53376 -196455 -136946
17293 -136946 -62292 526882 461123 315738 -31101 256939 158160 103000 -113945 153459
17282 399187 -166276 107495 403855 -80872 66796 344769 395243 288044 375922 96552
17271C10760N6683A42749e5209k5901C82898A62162o383c6928B90296l7829Q9177
17260C41644p4275a43551B25994n7967c47693D47478A61720p6107J61488K13181
17250D60282m4324F0518J55504G675M27059H7861L86600a52675C38806J50003
17240D88809A93336N3529l9438K48523j52813R5978d6192I7057C9108K1604c1161
17228C61252k2738g6395D85805A36119E105L34009d0412D80627r7640J0752g3827
17216C70029r5963b49707B63133K46788C735L84965j22034J12902J81336a43137
17205A52420J24665c5750A66603d7295D00141j39160L6175I5671J00509J03735
17195B99915j38606J62634C6426L32539A12009j0661J00582a3216B60183K09203
$$ plain form
17271 310760 367443 142749 -55209 -81110 382898 162162 155779 -36928 290296 252467 341644
17260 341644 267369 -143551 225994 168027 -347693 447478 161720 85613 247101 460282
17250 460282 415958 60518 216022 7675 434734 87861 474461 -152675 338806 488809
17240 488809 193336 246865 207427 455950 303137 399115 -46192 97057 39108 60712 -31161
17228 361252 338514 -76395 485805 136119 5105 339114 -40412 480627 382987 393739 -73827
17216 370029 274066 -249707 263133 509921 3735 388700 266666 379568 560904 -143137
17205 152420 277085 -35750 166603 -47295 400141 260981 297156 95671 196180 299915
17195 299915 161309 323943 36426 368965 112009 101348 201930 -13216 260183 469386
17185D69386R2267I997K76536j3749F4093J99791L3412J89773r8382J34033p4408
17174D48312Q9297j92645K1836m3530k085K21307B3245Q4960K35096J88210j58348
17163C73163J558j11886L13167k04456L16941B56084q8225m2129R1829M862J41618
17152C64039A81774A6637K38803J00625D3511N47522j83174A24698k9485L47297
17142D42510n0170R5939j65719k9213L33745k31103G1517J41074J2913K72025
17132D97529B12219M5419I9439K29647J05622j75589j01679L05615j98659N17118
17122G81514B63526I9761K75135L4385P1615L0998N8247B10196J81231m7221N01576
17111H45782l64637J474A20255J62094L76813A78065J21342Q7589Q3640p4395
$$ plain form
17185 469386 561653 9997 286533 272784 64093 263884 297296 487069 388687 522720 448312
17174 448312 537609 344964 366800 323270 321185 542492 23245 108205 343301 531511 373163
17163 373163 374721 262835 576002 371546 688487 256084 167859 125730 217559 222421 364039
17152 364039 181774 16637 255440 356065 43511 591033 407859 124698 95213 442510
17142 442510 392340 488279 322560 293347 627092 395989 71517 212591 225504 497529
17132 497529 212219 257638 99439 329086 434708 259119 157440 463055 264396 781514
17122 781514 263526 99761 374896 409281 480896 511894 570141 210196 391427 344206 845782
17111 845782 481145 482619 120255 282349 659162 178065 299407 386996 470636 396241
17101C96241q6691L10242k27890J04286o5110m0931A73049M66591B68214K52329
17091E20543j99549K13177J58331p9041A69798K42056L3379K27973A70278O52629
17081H22907l38450O5775j6803k9650B42673K29068J23935j15382L22129l64539
17071D37884j45611p1334J67854j47892N10904C15922o8503N01813j37827N9471
17061F70876L2578J97047C03553L85403l02721K78234q9831m9097J39440p4177
17051E90804m3292l377K10693j09131R2431Q5320C70066J54610j11369K92540
17041G05847l25459L76017l57673J9021J60674j0432R662l873n1915J45477R7718
17030G65064m8242K94217C47165K24773r9645K379K85358k73008M15955r1311
$$ plain form
17101 396241 309550 619792 391902 496188 431078 390147 173049 639640 268214 520543
17091 520543 320994 534171 692502 613461 169798 411854 445233 673206 170278 822907
17081 822907 484457 550232 533429 503779 242673 471741 595676 480294 802423 437884
17071 437884 292273 220939 388793 240901 751805 315922 247419 749232 611405 670876
17061 670876 703454 900501 303553 688956 386235 664469 574638 525541 664981 590804
17051 590804 547512 544135 754828 645697 738128 823448 370066 524676 413307 705847
17041 705847 380388 756405 398732 417753 578427 567995 577657 573784 521869 667346 765064
17030 765064 716822 1011039 347165 571938 472293 474672 760030 487022 902977 811666
17020H11666k77645j39241j2655L82290o1918B20359N96378N6287k33415J84165
17010H23774o457k56452K76760J31347j54462l03257K34631j87359R7147j9953
17000F35719L96965k73846C49324O07659q7588j31870J07835K42883k44750j02060
16990G41433m9539J01110J14205j68552J84393r2241K60408J54843l54723J83339
16980A074676m18915M18747k57205Q7477J97972O2816j88145j05874m9146L10671
16970A133074l55235m4484J55202n9856N7510R6239K37469m59114K03089k95167
16960F68727K18045K33874J9778m4722L93688k54807J26469k93358r1104J43289
16950A119879r2442k1927r2975J11068L67345k32556J03571n6369J7131J10616
$$ plain form
17020 811666 534021 394780 382125 764415 702497 220359 816737 873024 639609 823774
17010 823774 817317 560865 837625 968972 814510 511253 745884 558525 655672 635719
17000 635719 1032684 758838 349324 956983 869395 737525 845360 1088243 843493 741433
16990 741433 691894 793004 907209 738657 923050 830809 1091217 1246060 891337 1074676
16980 1074676 655761 1074508 817303 904780 1102752 1165568 977423 871549 822403 1133074
16970 1133074 777839 733355 888557 828701 886211 982450 1219919 760805 963894 668727
16960 668727 886772 1120646 1140424 1095702 1489390 1234583 1361052 1067694 976590 1119879
16950 1119879 1027437 1005510 912535 1023603 1390948 1158392 1261963 1205594 1222725 1333341
16940A333341M3143j01685K83492k20684j48508J32256L9769k02268J49798J12195
16930A420849J36899j6016k32893k06556J36633J90790J1602L11284l23751L5453
16920A464294n6991M000j36488L02524O0658K34096l74086M3998j5949K70873
16910A796929J36009n6753k63602J27867j58938L30848l63144R5395K37463J85696
16900B067770K08554l15994j02853N5166r0971j9069P9875K14656o1262k44793
16890A791079J40038L45384m8099j0577J27576j19971n2789K2904K77321j70636
16880B302230m654N8820J10012O1762l70557J89177K62272J73828l28792J27760
16870B581858K24238j51792R3326j0594Q5034J83477J24074k55860K11903P1265
$$ plain form
16940 1333341 1376484 1274799 1558291 1337607 1189099 1321355 1361124 1158856 1308654 1420849
16930 1420849 1557748 1541732 1308839 1102283 1238916 1429706 1441308 1752592 1428841 1464294
16920 1464294 1407303 1411303 1274815 1577339 1637997 1872093 1498007 1542005 1526056 1796929
16910 1796929 1932938 1876185 1612583 1740450 1581512 1912360 1549216 1644611 1882074 2067770
16900 2067770 2276324 1960330 1857477 1912643 1821672 1802603 1882478 2097134 2035872 1791079
16890 1791079 1931117 2276501 2228402 2217825 2345401 2225430 2172641 2195545 2472866 2302230
16880 2302230 2297576 2356396 2466408 2528170 2157613 2346790 2609062 2782890 2454098 2581858
16870 2581858 2806096 2654304 2747630 2737036 2822070 3005547 3129621 2873761 3085664 3156929
16860C156929L01388n86057L65709j54036K71888j4398J5919Q6199J37731m68891
16850C112381N42600M7202m7468J51300J49195O2853k9877J12811J72454k72118
16840D001333N4944j67482M05428J81773l3944j19841M97131j60660J59812Q725
16830D827219K30657k06221N61286m22718L19429K4633K69602K93881j84011J84415
16820E898172n4618M19232p052m232L26218O0312l04394R75986k90551K29686
16810G248759n5282N17085j80810K38700m6816N74140L22453p9688k18662K38214
16800H558093K07128N83964j60669J99808O66348J81396L08150Q9004J65994M06648
16790A1205864K75094L34104K39966J06097O32806J60741N12792K56405P7476
$$ plain form
16860 3156929 3458317 2872260 3237969 3083933 3355821 3341423 3357342 3443541 3581272 3112381
16850 3112381 3654981 3702183 3654715 3806015 3955210 4018063 3988186 4100997 4273451 4001333
16840 4001333 4056277 3888795 4294223 4475996 4442052 4322211 4819342 4658682 4818494 4827219
16830 4827219 5057876 4851655 5412941 4990223 5309652 5334285 5603887 5897768 5713757 5898172
16820 5898172 5843554 6262786 6255734 6251502 6577720 6638032 6333638 7309624 7019073 7248759
16810 7248759 7193477 7710562 7529752 7768452 7721636 8295776 8618229 8538541 8319879 8558093
16800 8558093 8765221 9349185 9188516 9388324 10054672 10236068 10544218 10633222 10799216 11205864
16790 11205864 11480958 11815062 12055028 12161125 12793931 12954672 13467464 13723869 13801345
16781A3801345Q92826M23514N45592K47733L56796Q47045M31832O78050L71108
16772A8595841N69153P66002J024215O78538N55344N84429J045893J263013Q48958
16763B5931386M46283J036567J338641J049846J470702R81266J654205J342729
16755C5251625J393484J639380J576535J756353K138269J886944K091508K551640
16747E0285738K530383K501710K537055L046151L136380L583734L390091M083816
16739G5095058L823901M317618M625089M745789M903804N043890N228076N917636
16731A13700861N385931O205799N847655N511637O188262N646213N420663M889628
16723A58796649M332042L860266K989531K387431J182099P23265q72906j554703
$$ plain form
16781 13801345 14694171 15117685 15663277 15911010 16267806 17114851 17546683 18224733 18595841
16772 18595841 19164994 19930996 20955211 21633749 22189093 22773522 23819415 25082428 25931386
16763 25931386 26377669 27414236 28752877 29802723 31273425 32254691 33908896 35251625
16755 35251625 36645109 38284489 39861024 41617377 43755646 45642590 47734098 50285738
16747 50285738 52816121 55317831 57854886 60901037 64037417 67621151 71011242 75095058
16739 75095058 78918959 83236577 87861666 92607455 97511259 102555149 107783225 113700861
16731 113700861 119086792 125292591 131140246 136651883 142840145 148486358 153907021 158796649
16723 158796649 163128691 166988957 169978488 172365919 173548018 174271283 173398377 171843674
16715A71843674k436490l464295l741962m568531n137829n464881n784833n934563
16707A35310290o266053n971169o087766n473174n822031n613534m926900n556367
16699H9593296m856968m039205m454210l872112m042493l395243l083208l594907
16691E8254950k568866k804604k473498k687053k001729k629449j521740k135393
16683C9432618j838680j549096j603241j389718j360644j341624j421987j252218
16675B7675410j150149p49970j055177o70427j170294p18974j185574m72321p61218
16666A9741306k63900j033708q44339m20705m79984n77168o73948M4874r29339
16657A4563089k69082n34246m89066m90285n49454j42023q2731m64326m71748
$$ plain form
16715 171843674 169407184 165942889 162200927 157632396 152494567 147029686 141244853 135310290
16707 135310290 129044237 123073068 116985302 111512128 105690097 100076563 95149663 89593296
16699 89593296 84736328 80697123 76242913 72370801 68328308 64933065 61849857 58254950
16691 58254950 55686084 52881480 50407982 47720929 45719200 43089751 41568011 39432618
16683 39432618 37593938 36044842 34441601 33051883 31691239 30349615 28927628 27675410
16675 27675410 26525261 25775291 24720114 24049687 22879393 22160419 20974845 20502524 19741306
16666 19741306 19477406 18443698 17599359 17178654 16698670 16121502 15447554 15492428 14563089
16657 14563089 14294007 13759761 13270695 12780410 12230956 12088933 12006202 11541876 11070128
16648A1070128k32267j01304n14953l50325q9102J782m09864n01991j87106J35355
16638H820353j20290p39280j25126J53711o16360M77935n08840p8596p9384k09636
16628F974487k26385j18597m11813K33317l11176k28846j23875J14876k25237
16619E676751m72033J71168l08085J78811j88860j1826j83496k83128M06309m52441
16609D533170l86605O53623n28478j07269L59293j71625p9507j14800k39987J52333
16599D070148m09678M4563p0421j81769r6837K45161k61193K19323j88379l94925
16589B975993J92001l7857M11755r75141Q19618m90068J91653k47628K9231q3290
16579B786267n4385K0018j0001j44995k38275j33863J13206j07520L61056j10654
$$ plain form
16648 11070128 10837861 10736557 10221604 9871279 9782177 9783959 9374095 8872104 8684998 8820353
16638 8820353 8700063 7960783 7835657 7989368 7373008 7850943 7342103 7263507 7184123 6974487
16628 6974487 6748102 6629505 6217692 6451009 6139833 5910987 5787112 5901988 5676751
16619 5676751 5204718 5375886 5067801 5246612 5057752 5045926 4862430 4579302 4985611 4533170
16609 4533170 4146565 4800188 4271710 4164441 4523734 4352109 4272602 4157802 3917815 4070148
16599 4070148 3660470 3705033 3634612 3452843 3356006 3601167 3339974 3559297 3370918 2975993
16589 2975993 3167994 3130137 3541892 2566751 3386369 2896301 3087954 2840326 2869557 2786267
16579 2786267 2731882 2751900 2741899 2596904 2358629 2224766 2337972 2230452 2591508 2480854
16569B480854l8070k3289k32592N8472k12333K11387N9359p0137M01894l87224
16559B248321J0978q1447r321m9127l3999j07013m9416J02437P1369m08765j43130
16548A550887L06194j84230M557l09459N23743k08376Q0996o2994m3568P4177
16538A731927n7125m76959N79658k81433J50778k55327l6082K07135j75944L58773
16528A745401n68470M25326l42599J46324m4243j15176R4700K58299k04766r0902
16518A303894J15071m37579N87527j96193r3881o0589k66624M56724m289n5737
16508A348324J19657k86090j21703j5012K23123p5051j46069K34083n99652L66243
16498A047853n4763k56648N00023k15283k32461l9092Q8888L09244l71703L14903
$$ plain form
16569 2480854 2442784 2419495 2186903 2245375 2033042 2244429 2303788 2233651 2635545 2248321
16559 2248321 2259299 2177852 2168531 2119404 2085405 1978392 1928976 2031413 2102782 1694017 1550887
16548 1550887 1857081 1672851 1677408 1367949 1891692 1683316 1764312 1701318 1657750 1731927
16538 1731927 1674802 1197843 1777501 1496068 1646846 1391519 1355437 1562572 1386628 1745401
16528 1745401 1176931 1602257 1259658 1405982 1361739 1246563 1341263 1599562 1394796 1303894
16518 1303894 1418965 981386 1568913 1372720 1278839 1218250 951626 1408350 1404061 1348324
16508 1348324 1467981 1181891 1060188 1045176 1268299 1193248 1047179 1281262 681610 1047853
16498 1047853 993090 736442 1236465 1021182 788721 749629 838517 1147761 776058 1090961
16488A090961j77606l01374M73034j93161j7151J51098j09424L18118m24408j2978
16478G97109L2445N1589n1627j25554n481J43789J48341j70885P7737j75698Q9690
16467H11455k94009o4729J59635J20329k29501J75341J88616o8387J85600N0811
16457A035161l15530K14721j04951k1043r5485K4329K58768D12494J82354N6618
16447F51466j83134J60625P2960l11026J34587K47715M4186k36409o7498K03693
16437G17165q8377n3017L27262j77089k70455m023J33840r6418J54492C09578
16426E79135l6897j69476K97427J23947k29124J84293r307l12478J60016d4047
16415C74563M98334I1112P15022l58458L02468B79749K80961J16577k39133H8347
$$ plain form
16488 1090961 913355 611981 1085015 891854 874703 1025801 916377 1234495 810087 797109
16478 797109 829554 881143 829516 703962 698481 842270 990611 819726 897463 721765 811455
16467 811455 517446 452717 612352 732681 503180 678521 867137 798750 984350 1035161
16457 1035161 719631 934352 829401 808358 712873 737202 995970 412494 594848 651466
16447 651466 468332 628957 701917 390891 525478 773193 817379 580970 513472 717165
16437 717165 628788 575771 903033 725944 455489 451466 585306 488888 643380 309578
16426 579135 542238 372762 670189 794136 565012 749305 739998 427520 587536 -44047
16415 374563 872897 91112 806134 447676 750144 279749 560710 677287 438154 88347
16404B70118K55967J77802k33038j16881K8162M0016l2402A17546M16475k20160
16394C13861K1443J60704M6386n3428O3000M6393L9750j76724J39212K4779k79175
16383C46201J48398A84492m8820K47251J57558Q3245A73689R728J07079M3304
16373C33800l7409J43879P3961I4679K22914P6932m0446N2510j28053P7388L67734
16362G23658I5402J75619H299N07698j90405R6639j18762K55026B75775j18823
16352A56952K7224J90967j86717K20236o0817q0487I5865C4373J04641K02195
16342C41209a9741C41150H8904O2694J00668k0158J08708k2444J68949M6498k45175
16331B88644O9093K79071C07356J0118j47292l5351J33111p5208e2351a8515l9239
$$ plain form
16404 270118 526085 703887 470849 353968 382130 422146 389744 117546 534021 313861
16394 313861 335304 496008 542394 488966 551966 598359 638109 461385 600597 625376 346201
16383 346201 494599 184492 135672 382923 540481 623726 173689 183417 290496 333800
16373 333800 296391 440270 514231 94679 317593 394525 354079 406589 278536 355924 723658
16362 723658 95402 271021 8299 515997 325592 422231 303469 558495 275775 156952
16352 156952 184176 375143 188426 408662 347845 267358 95865 34373 139014 341209
16342 341209 -19741 341150 88904 151598 252266 232108 340816 318372 487321 533819 288644
16331 288644 357737 636808 307356 317474 170182 134831 267942 192734 -52351 -18515 -57754
16320e7754C64004A35446M21237Q320K8460B8718n372K61054m9721j3977K06238
16309D26940l4764k9684j25084n4519Q6875J07056L3022p2692A11796C8974K09891
16298B48865R3824O107B1014R1693M0073Q0098M3419a290A75799k2602j3883L26143
16286D65457d5728C97286A16887J276Q2498q8249J39231e3730A03873J62789H3790
16274E8835J29640A6593L20720j23704N1374c179D05726j98132M3327J78223k4780
16263D04364E8605a92541C84863A10754n0095e337j98821m7669F3639J1340i4071
16251A64533J3362P1403J46468a43904a1460E39604a28462A84380A8781f1543
16240I4168J50778F7067K11932j17845R225J77610j22041L6055e7751A48983O6169
$$ plain form
16320 -57754 364004 135446 556683 565003 593463 28718 23346 284400 234679 220702 426940
16309 426940 392176 362492 237408 182889 269764 376820 409842 337150 111796 38974 248865
16298 248865 342689 348796 21014 112707 152780 232878 276297 -1290 175799 153197 139314 465457
16286 465457 -45728 397286 116887 118163 200661 112412 251643 -53730 103873 266662 83790
16274 58835 188475 16593 337313 213609 264983 -3179 405726 207594 250921 429144 404364
16263 404364 58605 -192541 384863 110754 60659 -5337 -204158 -251827 63639 74979 -94071
16251 164533 177895 249298 395766 -143904 -11460 539604 -128462 184380 18781 -61543
16240 94168 244946 67067 278999 161154 170379 347989 225948 262003 -57751 148983 215152
16229B15152F1820J33147J48628G7048a06988k11690a5897B05659Q4675A178P7829
16218G9007a63448a8222D61076G1501a2907j06455B85650J8270J99184a75246
16207A60990O8067n4737D7857M8983g9115A62326a0578D57878j67359A45229B3860
16195B5888Q7409a11381A85451c1865B08330L8443a04597B14419q5043n4468Q0951
16184A55859E3674a6022A98616m5222J33494j31644J2331F7506K34992G4104k0542
16173E3562a9395E5022R112b3336q4599A19250C884J96396J38657b03117B38427
16161b67577N6667B53786J911L3067Q8059b5210j0090E5799a5619B91023a25733
16149F1127f3912q9976g6881o2713F4340k2937j6187J09789d9501k8628A11630
$$ plain form
16229 215152 61820 194967 343595 77048 -106988 -318678 -15897 205659 290334 1178 79007
16218 79007 -163448 -18222 461076 71501 -12907 -119362 285650 303920 503104 -175246
16207 160990 229057 174320 47857 96840 -79115 162326 -10578 457878 290519 145229 23860
16195 25888 113297 -111381 185451 -31865 208330 246773 -104597 214419 129376 74908 155859
16184 155859 53674 -16022 198616 153394 286888 155244 167575 67506 302498 74104 53562
16173 53562 -19395 55022 64134 -23336 -107935 119250 3884 200280 338937 -203117 238427
16161 -267577 -210910 253786 255697 288764 376823 -25210 -35300 55799 -15619 291023 -125733
16149 61127 -63912 -153888 -76881 -139594 64340 41403 25216 135005 -49501 -78129 111630
16137A48451g5899A05517k3915c28839J28744b4178H4098K6660J04732a93748
16126B22928b2429A7575o979J35541B1414R8129a61390P6436H7270K23694j02386
16115B08578a66312O9413D65138g600j46114K2593c9050a5360C06863A46919a40858
16103a52549j28799e2532B10675k4418a0206A30335J03764c1434j47536B85615
16092A09925m5598J04724K363B7554L6533Q0551b92007a30675B42462b35270b1390
16080a85898A20157a93375b634A29042a11522l6150c0467F2775h2931A29485j3851
16069A15634C3133a06777B04417e5671D43470a21469e6897B52085b67248J29799
16059a37449A39780a49539A21920K39848a90294a5238j29088O2867E2892i8483
$$ plain form
16137 148451 -75899 105517 81602 -328839 -200095 -24178 84098 110758 215490 -193748
16126 222928 -22429 17575 10596 146137 21414 119543 -161390 -84954 87270 310964 208578
16115 208578 -166312 -96899 465138 -7600 -153714 -131121 -39050 -15360 306863 146919 -140858
16103 -152549 -281348 -52532 210675 186257 -10206 130335 234099 -31434 -178970 285615
16092 109925 64327 169051 171414 27554 64087 144638 -292007 -130675 242462 -235270 -21390
16080 -185898 120157 -193375 -2634 129042 -111522 -147672 -30467 62775 -82931 129485 115634
16069 115634 33133 -106777 204417 -55671 443470 -121469 -56897 252085 -267248 -137449
16059 -137449 139780 -149539 121920 361768 -190294 -15238 -144326 -81459 52892 -98483
16048g5245a8160k2960I2226j398k6283e9441E16775h5875k079a767A0343J82565
16036A92908K1424m2573D5998a25855B59609P4108b93092A74823a52009l6371
16026a88380C12350a2919q5398A0800a63915g522k93670I461e9124l05525h6607
16014b47016Q4058e76j3695A70264a62898c0915B27059g1252j47044C929P4660
16003G8589a06307H8150K4154b39528E9078R2980c58412a72504a7494A95542a88484
15991a27823q090n6640E591a40722q3911l5239A37139O5641K1343Q4124J34161
15980D42408j92306J89255j71422d92343a83851B24233a98248A50904a97997A2565
15969b44418j26361C39004F076c1818C70733D4159J35164f8516A19694M4613c42253
$$ plain form
16048 -75245 -18160 -41120 92226 90828 64545 -59441 516775 -85875 -87954 -1767 10343 192908
16036 192908 214332 171759 45998 -125855 259609 333717 -293092 174823 -152009 -188380
16026 -188380 312350 -12919 -98317 10800 -163915 -7522 -301192 9461 -59124 -364649 -86607
16014 -247016 -162958 -576 -14271 170264 -162898 -30915 227059 -71252 -218296 3929 78589
16003 78589 -106307 88150 112304 -239528 59078 152058 -358412 -172504 -17494 195542 -188484
15991 -127823 -135913 -192553 5591 -140722 -224633 -259872 137139 202780 224123 308247 442408
15980 442408 250102 439357 267935 -492343 -183851 224233 -198248 150904 -197997 12565
15969 -244418 -370779 339004 6076 -31818 370733 44159 179323 -68516 119694 164307 -342253
15957h562D33796d85660e577A02039b11943h2521k8963r8136D514N7631c33840
15945D5506c25071A29724F1415a92243i3055q8835I9164a14378D8664a61273B39477
15933b8392B3221f4173r6327h365l2944C1738d8455a1532B38582c26376A20113
15921F2073c08729R1119a08043j75888L2519J17256o4995A36042K14637a55668
15910f1648B5660R5532k7209J26005R646b07428o14A29350a82539L8861G9569
15898i6884E1174a21210F906L7348d1129j23512B39112b86181m6460j22588a37083
15886H4513J53107I5068I240c9522C2815f9943b5883F0349f2080g123k86594a37555
15873C3613h7334l30021B05980a83954D5473J01939A235d3638g825E5099h984
$$ plain form
15957 -8562 433796 -485660 -5577 102039 -211943 -82521 -111484 -209620 4514 62145 -333840
15945 45506 -325071 129724 61415 -192243 -93055 -181890 99164 -114378 48664 -161273 239477
15933 -28392 23221 -64173 -160500 -8365 -41309 31738 -48455 -11532 238582 -326376 120113
15921 62073 -308729 -217610 -108043 -283931 -251412 -134156 -199151 136042 350679 -155668
15910 -61648 25660 121192 93983 219988 229634 -207428 -208042 129350 -182539 -143678 79569
15898 -96884 51174 -121210 6906 44254 -41129 -164641 239112 -286181 -332641 -455229 -137083
15886 84513 237620 95068 9240 -39522 32815 -69943 -25883 60349 -62080 -7123 -293717 -137555
15873 33613 -87334 -417355 205980 -183954 45473 147412 1235 -43638 -7825 55099 -8984
15861H5429b66133B02009b81766c3072k00336G5352g9916A12183e0869I3507k4912
15850F8595i7767a3876j68445d5983a9711j11224A18848a99660d5414n6967A41227
15838A29679N7634g6851k5244D8004g0001p1909B30206a37673j80329C8959b80813
15826h9562a9694F4207a64767C6407Q9756E563R4041b45072d5237C3834b25247
15814e1620k09199G0947a39774A89200a22662N5278E2316b70034F4060J15075
15804A79135c2407j8259A3497K33238J50746D8601a11690a8511a309A77400b60539
15792C764g088j47850E05541a51407H8768a05055b5971r0581A22364a67373D3893
15780G973K71794e9221E1648c2002j01206M3520E17422e8380A14237h5053B70415
$$ plain form
15861 85429 -266133 202009 -281766 -33072 -233408 75352 -79916 112183 -50869 93507 68595
15850 68595 -97767 -13876 -182321 -45983 -19711 -130935 118848 -199660 -45414 -102381 141227
15838 129679 187313 -76851 -102095 48004 -70001 -141910 230206 -137673 -318002 38959 -280813
15826 -89562 -19694 64207 -164767 36407 126163 5563 99604 -245072 -45237 33834 -225247
15814 -51620 -260819 70947 -139774 189200 -122662 -67384 52316 -270034 64060 179135
15804 179135 -32407 -50666 13497 246735 397481 48601 -111690 -18511 -1309 177400 -260539
15792 3764 -7088 -154938 505541 -151407 88768 -105055 -25971 -116552 122364 -167373 43893
15780 7973 279767 -59221 51648 -32002 -133208 -89688 517422 -58380 114237 -85053 270415
15768a73227F8079b36688E7844e5496b1382C6948J46599i6375n3513d3806a3949
15756B08746a73571A70580h5218k35353G5200K3217a70935B66392I0158M15790
15746E05948j31671h468A80152N769f473k87283a39934d5956e216k58827A6310
15734h0089j93039r686C16018D0957c7297D8960b72515d5844F0658b00845i0771
15722c3297B1686J32910n1772g4892q8444C8955b12027D38660e4810G3670a37044
15710a32026E0255a36863k57627B16072J5991e9674a6449I794J34073e5567j9335
15699g4902b6105j03941F2239a66501A4681J37149Q6961j7297a47937f1888A39232
15687b44548J11900H8245b04495i2385j53102J13107K0832j18280B51255c23992
$$ plain form
15768 -173227 68079 -236688 57844 -55496 -21382 36948 183547 -96375 -149888 -43806 -13949
15756 208746 -173571 170580 -85218 -320571 75200 98417 -170935 266392 90158 505948
15746 505948 374277 -8468 180152 185921 -6473 -293756 -139934 -45956 -5216 -264043 16310
15734 -80089 -273128 -282814 316018 40957 -37297 48960 -272515 -45844 60658 -200845 -90771
15722 -33297 21686 154596 102824 -74892 -163336 38955 -212027 438660 -54810 73670 -137044
15710 -132026 50255 -136863 -394490 216072 232063 -59674 -16449 9794 143867 -55567 -74902
15699 -74902 -26105 -130046 62239 -166501 14681 151830 238791 221494 -147937 -61888 139232
15687 -244548 -132648 88245 -204495 -92385 -245487 -132380 -111548 -229828 251255 -323992
15676a42712B2956d2687j93190A36937c91989A0900e9658p2612f3412k42295H4382
15664a57161C70419a95992e6467B01341a79956B21808N8419b72271A86901m8781
15654A38120B7022G490N39977a85572J6443B67651A14296b23339g8813G5399c4846
15642d7198n6057D5496e9765j5197j24554a4639A54930J19421a09346b6910D4007
15630C5621b23800M5353k0420F8316I518g0485A83240a43148E1902J78041b99608
15618i2723E7085a54739I9807J13815a23372k3915d0928j11894k02492q2624A94598
15606F3350b30190A85579e2696C6613a25609A29063e5206I3085a1040p7867a0957
15594a49667N3627l21552e7030k3483H9728c6276A96958N6197q4050a3605j16678
$$ plain form
15676 -142712 22956 -42687 -235877 136937 -391989 10900 -59658 -132270 -63412 -305707 84382
15664 -157161 370419 -195992 -56467 201341 -179956 221808 280227 -272271 186901 138120
15654 138120 27022 7490 547467 -185572 -169129 267651 114296 -223339 -78813 75399 -34846
15642 -47198 -103255 45496 -59765 -74962 -199516 -14639 154930 274351 -109346 -26910 44007
15630 35621 -223800 -178447 -198867 68316 9518 -70485 183240 -143148 51902 229943 -299608
15618 -92723 57085 -154739 99807 213622 -123372 -147287 -40928 -152822 -355314 -437938 194598
15606 63350 -230190 185579 -52696 36613 -125609 129063 -55206 93085 -11040 -88907 -10957
15594 -149667 -96040 -417592 -57030 -80513 89728 -36276 196958 253155 169105 -13605 -130283
15583a30283C19219a26255a8536A32037Q2153a59751Q695d8220B52347d57069
15572F2190J04467e7733B17674C7738J6243L4854B543K29829H4638i2988D5373
15560C7745a97316e6270j24594D12958A33867m431b8798k8218B58533f3446B14291
15548E3797b25779G5339F435a27402A87644b34818P2659a6512q0235B54012j03520
15537A50492a6592B38028A00157d4197B37557b7333j54886c8334B226J17859J1601
15526A31686a44716f7619m8272A43417e0357j3724C52362A17334m7419c4154F8881
15514b4512n0977B04677D5799P9569D169K77133c2331H8988b04406I9293b2389
15502a6227q3895B39747a45848k56930a47639A2108L25814g2161h423j78912A47144
$$ plain form
15583 -130283 319219 -126255 -18536 132037 214190 -159751 -151056 -48220 252347 -457069
15572 62190 166657 -57733 217674 37738 53981 88835 2543 232372 84638 -92988 45373
15560 37745 -197316 -56270 -180864 412958 133867 129436 -28798 -57016 258533 -63446 214291
15548 53797 -225779 75339 6435 -127402 187644 -234818 -162159 -16512 -96747 254012 150492
15537 150492 -16592 238028 100157 -44197 237557 -27333 -182219 -38334 2226 120085 131686
15526 131686 -144716 -67619 -115891 143417 -50357 -64081 352362 117334 69915 -34154 68881
15514 -24512 -75489 204677 45799 125368 4169 281302 -32331 88988 -204406 99293 -22389
15502 -16227 -100122 239747 -145848 -402778 -147639 12108 337922 -72161 -8423 -187335 147144
15490a6871m97197b24410A115c24285a44923d1815B7190J38566f9165E3675J40141
15479A93816G7545n738c5281a243j15505K9916L3586D5196L9456d4371m934k23053
15467b72358J28358E5074k2640b26908g5807A17743a48776D8387J0442P5640c01682
15455c33995B46336c7799A65190p5539d64183h7994B26379b51271r9269a3042
15444b57601h655j07518B53706I9591J31826A14449N9470a61799j06651D56492
15433A5984b34295A95172A8532J31534b11964a4398k6105A20540C5935M2033j7936
15422F0032c7103B7438M5141K22270J0755A46969h5455A06722b99602C489N7906
15411F1395J22410I506a24657d5055l0509C5340M330J98318F3278g2412G960a71115
$$ plain form
15490 -16871 -514068 -224410 1115 -324285 -144923 -41815 27190 165756 -69165 53675 193816
15479 193816 77545 71807 -35281 -1243 -116748 -86832 -53246 45196 84652 -44371 -49305 -272358
15467 -272358 -144000 55074 32434 -226908 -75807 117743 -148776 48387 58829 134469 -301682
15455 -333995 246336 -37799 165190 89651 -464183 -87994 226379 -251271 -350540 -13042
15444 -257601 -8655 -116173 253706 99591 231417 114449 173919 -161799 -268450 456492
15433 15984 -234295 195172 18532 150066 -211964 -14398 -40503 120540 35935 77968 60032
15422 60032 -37103 27438 72579 294849 305604 146969 -85455 106722 -299602 3489 61395
15411 61395 183805 9506 -124657 -45055 -75564 35340 39670 237988 63278 -72412 7960 -171115
15398f294j05415A68086d2304j3029M764B8286i1748A35160f32023a87876I6162
15386G2439h1816j57856A32209J56476f3322a200r6538G0797M371l5666M6393
15375H5895j9186j2312l801Q9923N9741a55403B06337O2417q1849a13083a4760
15363B19337G2578C0900c41243A86244c4984E7588C333J72376o7377b42900B26982
15351B90730E9804L1520N083J6152a2831A66657b1323F9728k174a29078B57636
15339B57513j14366f2065r7479F7562J27369Q694f2124j24797e7800G1122i1434
15327B15676R1152n9137m1031Q1818D7986a33858A29390E5108K14900A16505R6424
15316B12929a43481A21580k7343J27943d9558q4278j49991A61923n3865c27188
$$ plain form
15398 -6294 -111709 168086 -42304 -55333 -50569 28286 -91748 135160 -632023 -187876 96162
15386 72439 -81816 -239672 132209 288685 -63322 -1200 -97738 70797 75168 39502 85895
15375 85895 66709 54397 50596 140519 200260 -155403 206337 268754 186905 -113083 -14760
15363 219337 72578 30900 -341243 186244 -34984 57588 3333 175709 108332 -242900 226982
15351 290730 59804 91324 96407 112559 -12831 166657 -21323 69728 67554 -129078 257636
15339 257513 143147 -62065 -159544 67562 194931 203625 -62124 -186921 -57800 71122 -91434
15327 215676 306828 247691 206660 288478 47986 -133858 129390 55108 270008 116505 212929
15316 212929 -143481 121580 94237 222180 -49558 -133836 -283827 161923 108058 -327188
15305B70408G8863J29231h2862B80148j20102e2183E1156j3110L08055Q0079C0165
15293a83474c3420A19145J42091F2487g7301A82214a02822A31766d49282A69659
15282C7753c8434B83343p2487c1003r7073H5692B0542b7530B21485m6291K9752
15271B04946d3332A12153N3128F6616Q602K1053K08458h5650B32378b40450C2542
15259a53937F8686K43915a46756B11253A1727N65104B07728M0438I8481L47457
15249D45938K54835O88587R2205j02771J66328G51535A88082l6789K0844o1720
15239A10417a39277a2258B31015h7013l2529G2465J18975J75931a47598G1368
15228D36019b31123F1128a72093a222A37215c5765j47246F7998J18761F2740J38859
$$ plain form
15305 270408 78863 208094 -82862 280148 160046 -52183 51156 38046 346101 426180 30165
15293 -183474 -33420 119145 261236 62487 -77301 182214 -102822 131766 -449282 169659
15282 37753 -38434 283343 210856 -31003 -128076 85692 20542 -27530 221485 175194 204946
15271 204946 -43332 112153 165281 66616 75218 96271 304729 -85650 232378 -240450 32542
15259 -153937 68686 312601 -146756 211253 11727 576831 207728 248166 98481 445938
15249 445938 700773 1389360 1481565 1378794 1545122 751535 188082 151293 172137 110417
15239 110417 -139277 -12258 231015 -87013 -119542 72465 191440 367371 -147598 71368
15228 436019 -231123 61128 -172093 -1222 137215 -35765 -183011 67998 186759 62740 201599
15217B01599C25L0440P4417l3718a0220j10950L3808B8687a61961H0485b07935
15205A26994f6338J5675B45237Q156a7478A9133a51018a6152D3976J50652C6740
15193A20001J04503P7163G764k013J04759b08880a00552B42544j0027D0996K29551
15182B70547C8320a48261C84845j53081G8736b693B6020f4311j44886A72899J38589
15171C11488A08100a14881d7801H132Q3069J0810Q4031g9209G1570a23228I4411
15159c242j1678A44840J09410j21827K64752a96693a210C78305A74456c57582
15148A35806b28574C84659A13794p477P3642R6469N9511e9419A38139L34251G2858
15136F28182a31678B04810P177F6409A1890e5174H7233m2640j4457N9368J17618
$$ plain form
15217 201599 325 30765 105182 71464 -10220 -121170 -87362 28687 -161961 80485 -207935
15205 126994 -66338 -50663 245237 253393 -17478 19133 -151018 -16152 43976 194628 36740
15193 120001 224504 301667 7764 5751 110510 -208880 -100552 242544 232517 40996 270547
15182 270547 38320 -148261 384845 231764 78736 -2693 26020 -64311 -209197 172899 311488
15171 311488 108100 -114881 -47801 8132 91201 102011 186042 -79209 71570 -123228 94411
15159 -3242 -14920 144840 254250 132423 397175 -196693 -1210 378305 174456 -357582
15148 135806 -228574 384659 113794 106317 179959 276428 335939 -59419 138139 472390 72858
15136 628182 -131678 204810 211987 66409 11890 -55174 87233 44593 30136 89504 207122
15125B07122a78844C25088a34577B04167H4239a97232G1366N1169Q8095g6046
15114f7859B24684j03040M4219J7418J41694m9748G1341P8811a03947E2744K8242
15103H0986P1559O5867L0566G5114L0382J64492A15297a28220D2460J15884K44597
15092D02941b12121C22581a12062A03384A5896a78572G4838L9685a06514B35919
15081C1844K09556I6736b31048B85033i301D6644J51143n173g0681I3326K68702
15070C62028K8762E6535O4040O8760b8664C97098I4523N1355J47865p9924M5985
15059B59804l7788b95763D3243J6353J16558K31870B3310a71661A23330k214j5858
15048A05258k1523c7053A68601o6301K63462A66656a62600A96576P8361H0043
$$ plain form
15125 207122 -178844 325088 -134577 204167 84239 -197232 71366 122535 210630 -76046
15114 -67859 224684 121644 165863 183281 324975 275227 71341 150152 -103947 52744 80986
15103 80986 152545 218412 248978 75114 105496 269988 115297 -128220 42460 158344 402941
15092 402941 -212121 322581 -112062 103384 15896 -178572 74838 114523 -106514 235919
15081 31844 241400 96736 -231048 285033 -9301 46644 197787 192614 -70681 93326 362028
15070 362028 390790 56535 120575 189335 -28664 397098 94523 145878 293743 213819 259804
15059 259804 222016 -295763 43243 59596 176154 408024 23310 -171661 123330 121116 105258
15048 105258 83735 -37053 168601 102300 365762 166656 -162600 196576 274937 80043
15037C78189p3885A43027j061L20497j44705M3008M0174b1699A92465L34681A98595
15025B08099P4352j01456L7249R2329k5041O9921J08379I2262R2752J83006R6492
15014D64512k20472m8172Q1493A05176F527J22251Q015K02515p9771e6337A40579
15002C45215N1011J31105A44533b36671C87854H0330g9353H5888N1771J21734
14992B59393J84572r1602J11874A65759K27815A49750K15990o2150G9941M8088
14982A28029J07387n3547R8282j39097K35201h7117E37579B5367K64876k825A12333
14970c9637C12209G9461K04982J25457j11591F3485M72993B58879C2695M57591
14960D90286b8571B3853J10013Q5468m175M83133D7131b25301G6880K08927r6704
$$ plain form
15037 378189 304304 143027 141966 462463 317758 360766 400940 -21699 192465 527146 198595
15025 208099 282451 180995 218244 310573 285532 355453 463832 92262 185014 368020 464512
15014 464512 244040 195868 277361 105176 6527 128778 136793 339308 259537 -56337 140579
15002 345215 396226 527331 144533 -236671 387854 80330 -79353 85888 137659 259393
14992 259393 443965 352363 464237 165759 393574 149750 365740 303590 79941 128029
14982 128029 235416 181869 280151 141054 376255 -87117 537579 25367 290243 287418 112333
14970 -39637 312209 79461 284443 409900 298309 63485 536478 258879 32695 490286
14960 490286 -28571 23853 133866 219334 215159 698292 47131 -225301 76880 285807 189103
14949A89103J45117J1621R9952j49831a62827D97936q4259j92736r1986m2508
14939H6447J26249j1953J32135l4237K1080J21937n2989o077n9265J10725r9499
14928C34553J4390J06846k942j09342B4067O24296A32460J98531A42382K51788
14918C94170j5261J2483A59955m2506K64329r8048J25675m2647l9969J20645A33179
14906D76016j71788L2883J48203J9381j69609K72144O3324j68638k32076K25594
14896D95434B36885K05119n2111j92649M4904J44512j42910G2835J66125J34970
14886C73930q139K13072b0602A86O35118k95317O8077A52296J49835C8356M36938
14875D75294j29197I4825J03502L35234k52832N9509J25837o7184J90107j58898
$$ plain form
14949 189103 334220 345841 445793 295962 -162827 497936 413677 220941 128955 86447
14939 86447 212696 200743 332878 298641 319721 441658 388669 382592 323327 434052 334553
14928 334553 348943 455789 452847 343505 24067 648363 132460 330991 142382 394170
14918 394170 378909 391392 159955 117449 381778 283730 409405 366758 326789 447434 133179
14906 476016 304228 337111 485314 504695 335086 607230 670554 501916 269840 495434
14896 495434 236885 442004 389893 197244 242148 386660 243750 72835 238960 373930
14886 373930 365791 578863 -20602 186 635304 339987 408064 152296 302131 38356 475294
14875 475294 346097 94825 198327 533561 280729 340238 466075 398891 588998 430100
14865D30100m978n0188j26108M3468K27903m952N4583A00449L04857r2872K71595
14854E84029A63181L73008J72060k18043j20861k2256Q4199K23229k58281J17068
14844E13304p846j40822P5229o9397K04831M14k12806m059J67866K39534j29401
14833F36847j01441k5179j28339N4513p1277j04353N97605k98703R1096j99693
14823D51076j748q1191J11634k12359J54207p6525K34462K86311C93914M2303
14813D36217K29818r1533J05264B38655K68520k21081j42913M58241j29013k3215
14803D49194K17908B93418N11353k35956B38877J94414P5846L90756D13493J61899
14793E75392J77649j81412N9651K32496j67891l13204M24418m9279k92705n3329
$$ plain form
14865 430100 425122 374934 248826 292294 520197 515245 569828 100449 405306 312434 584029
14854 584029 163181 536189 708249 490206 369345 347089 431288 654517 396236 513304
14844 513304 505458 364636 439865 370468 575299 575713 362907 358848 526714 766248 636847
14833 636847 535406 510227 381888 436401 365124 260771 858376 559673 650769 451076
14823 451076 449328 368137 479771 267412 421619 345094 579556 865867 393914 436217
14813 436217 666035 574502 679766 238655 507175 286094 143181 601422 472409 449194
14803 449194 667102 293418 804771 568815 238877 433291 509137 899893 413493 575392
14793 575392 753041 571629 631280 863776 695885 382681 807099 757820 465115 411786
14783D11786J01823R1641k51889N51993l80456N3600J1846M5899m5249j93418
14773C97576K86989o863k17157K08414j78486j94114K54304j9562J12853j58160
14763D85794P9873N0970j90231R9108K76198k5098k91363j72198L01991J29554
14753G44598K53685l60015J04058M5209J41134j61819L6521j86702K05494O0946
14743H83109l46658J82056K19635D45003l2449K44585J35757o7245r5223K59857
14733H90285k87807J56397J93658j54798m1222l02847J76609m0087R9799p4196
14723F15791j72044N00900l11048K29925j98286j06125M8434N15861k42535K20227
14713A101100j24461j67881l93757K92547j07917K71118l2055J19433l19665K35933
$$ plain form
14783 411786 513609 605250 353361 905354 524898 578498 590344 636243 590994 397576
14773 397576 684565 677702 460545 668959 490473 296359 550663 531101 643954 485794
14763 485794 565667 616637 426406 525514 801712 776614 485251 313053 615044 744598
14753 744598 998283 638268 742326 787535 928669 766850 803371 616669 822163 883109
14743 883109 536451 718507 938142 445003 412554 657139 792896 725651 630428 890285
14733 890285 602478 758875 952533 797735 756513 453666 630275 590188 689987 615791
14723 615791 443747 944647 633599 863524 665238 559113 607547 1123408 880873 1101100
14713 1101100 976639 808758 415001 707548 599631 870749 838694 958127 638462 874395
14703H74395p6836N6081j82368K10234J19149J38522l31440j99344L82979P5369
14693A066741J8648k88444q8227K35830n5645J16329j32070J94009r7444K3663
14683I93390P5948j75106J52041J4011r2667k74048L16059L45783o00530K12668
14673I67549L95672l79594J57165J26909l32285j25508L28599J35072k41436N403
14663A037546p1266o4011r8897L71180j96158J83326j19681Q7248P0891j75305
14653A024873L30095O6795l75804J40510J34414P7898k20435J22643K97021m13787
14643A184223m9056J75043j50183K80877k69144j39082J62384J86677r0574J51886
14633A443051l99564M18001Q1187n34865P94275m31719j17964o9078k95408N69989
$$ plain form
14703 874395 797559 853640 671272 881506 1000655 1139177 807737 608393 991372 1066741
14693 1066741 1085389 796945 708718 944548 888903 1005232 873162 1067171 969727 993390
14683 993390 1069338 894232 1046273 1060284 967617 693569 1009628 1355411 754881 967549
14673 967549 1363221 983627 1140792 1267701 935416 809908 1138507 1273579 1032143 1037546
14663 1037546 966280 902269 803372 1174552 978394 1161720 1042039 1129287 1200178 1024873
14653 1024873 1354968 1421763 1045959 1186469 1320883 1398781 1178346 1300989 1598010 1184223
14643 1184223 1135167 1310210 1160027 1440904 1171760 1032678 1195062 1381739 1291165 1443051
14633 1443051 1043487 1461488 1542675 1007810 1802085 1370366 1252402 1183324 887916 1457905
14623A457905j66452L26062L5638j54057j06096j35846K18694M66167j58163l59509
14613A424343J41492K6136l29662M75835p2743k17739p3862L14298r6393N2995
14603A644700R8330j86116K51592j33136k7136K6260J13912q7385O5411j53901
14593A612531J34948J92930p8048L1257M9173l10219M25652j87813K80840m97038
14583A654213L97807R3018r0843k55358P40090n73948L61373j79002l49703N68604
14573B366251j58802q118j30673P9725J08659j72922K19269J28434M8043j55429
14563B324437m3173M33833j20579j18170M16302K81371O8644l396L82505j0332
14553C611442J13070M12152O34575Q95104J402187L966917R830842J4804009J0312741
$$ plain form
14623 1457905 1291453 1617515 1653153 1499096 1393000 1257154 1475848 1942015 1783852 1424343
14613 1424343 1565835 1591971 1262309 1738144 1665401 1447662 1373800 1688098 1591705 1644700
14603 1644700 1743030 1556914 1808506 1675370 1648234 1674494 1788406 1701021 1766432 1612531
14593 1612531 1747479 1940409 1862361 1893618 1942791 1632572 2058224 1870411 2151251 1654213
14583 1654213 2052020 2145038 2054195 1798837 2538927 1964979 2326352 2147350 1797647 2366251
14573 2366251 2207449 2199331 2068658 2148383 2257042 2084120 2303389 2431823 2479866 2324437
14563 2324437 2281264 2715097 2594518 2476348 2892650 3174021 3242665 3239269 3621774 3611442
14553 3611442 3724512 4136664 4771239 5666343 7068530 11035447 20866289 35670298 45983039
14544D5983039k1277103I869029m627575k190731l01024o02422j23708k78107
14536A745462L53658K8825K83841k88461P7558r055J58958k4238p6682L01167
14526B551033j31799j84923q1147M22148o7563n7142K1432J55691K86066k67628
14516B646168k2641J70665m56853M89044r84K7817L4469J05262K52286m19280
14506B825953K31910n3234j34564K47371j07200M6774l2553J59264Q9129j42777
14496C130073M17269m89695K74954m4939K4530J05978L17781j14415J64158j66095
14486C619599J75751j05305J63236J84725o096k69266J71140k40241N32077l8973
14476D186647j72198K66675l1288q0870L86162m5970j52804j27923K27311L1718
$$ plain form
14544 45983039 24705936 9869029 5241454 3050723 2749699 2147277 2023569 1745462
14536 1745462 2099120 2127945 2411786 2123325 2200883 2191828 2350786 2326548 2249866 2551033
14526 2551033 2419234 2234311 2153164 2575312 2507749 2450607 2472039 2627730 2913796 2646168
14516 2646168 2623527 2794192 2337339 2826383 2825399 2853216 2887685 2992947 3245233 2825953
14506 2825953 3057863 3004629 2870065 3117436 3010236 3057010 3024457 3183721 3272850 3130073
14496 3130073 3547342 3057647 3332601 3287662 3312192 3418170 3735951 3621536 3785694 3619599
14486 3619599 3795350 3690045 3853281 4038006 4031910 3762644 3933784 3693543 4225620 4186647
14476 4186647 4014449 4281124 4249836 4168966 4555128 4509158 4356354 4228431 4455742 4487460
14466D487460L5772N5904j30156J73992L49272j00693J87423m36901J76740M69595
14456E268408k94382M3265k143K59397J43238J27488j22673L0083J65857p7417
14446E541121J9559N18601j82376L58227l13129L57853J91826k95192q7181R3494
14436F202803N49574J20775k36902J25688n6569j42855M64700m3340j70674K79937
14426G093137J57440P9097K32139k1010J43684N35883m10934L74147j7762o7234
14416H098587N12121n4656O8114J41135j9303M15751J83657j36975p0272O05083
14406I743242k36489K70160L88227m34764N19028N99673l10623P3705K93821Q4772
14396A0990752M48362L7973J55641J02280N09296J29179L69892J18961P9838J26880
$$ plain form
14466 4487460 4523232 4579136 4448980 4622972 4972244 4871551 5058974 4622073 4798813 5268408
14456 5268408 4974026 5017291 5015148 5274545 5417783 5545271 5422598 5452681 5618538 5541121
14446 5541121 5560680 6079281 5896905 6255132 5942003 6299856 6491682 6196490 6109309 6202803
14436 6202803 6752377 6873152 6636250 6761938 6705369 6562514 7027214 6983874 6813200 7093137
14426 7093137 7250577 7329674 7561813 7540803 7684487 8220370 7809436 8183583 8165821 8098587
14416 8098587 8610708 8556052 8624166 8765301 8745998 9161749 9345406 9208431 9138159 9743242
14406 9743242 9506753 9776913 10165140 9730376 10249404 10849077 10538454 10612159 10905980 10990752
14396 10990752 11439114 11477087 11632728 11735008 12244304 12373483 12743375 12862336 12942174 13069054
14386A3069054N00786J92145P7292R3070O66265R3666K15928L49606L58655L888
14376A5620355L50178K17786K55280L57877Q16621o6299N84061K71512L07216
14367A8714587K91055N03152K82216P67097L43660K88819N99830J91419M73509
14358B2455344M13905Q53834L37377Q26999N44136N24003P20302N72214O38256
14349B7886370P41497O39239N34804O99414P62845J085747Q10174M61453J026104
14340C4647647J178275J038809R04163Q68696J490095O41232J473410J271384
14332D3513711J455999R41672J598988J912424J211251J640507J661369J669673
14324E5605594K045567J551538K335140K189505J990774K372005K498490K507057
$$ plain form
14386 13069054 13569840 13761985 13839277 13932347 14598612 14692278 14908206 15257812 15616467 15620355
14376 15620355 15970533 16188319 16443599 16801476 17618097 17551798 18135859 18407371 18714587
14367 18714587 19005642 19508794 19791010 20558107 20901767 21190586 21790416 21981835 22455344
14358 22455344 22869249 23723083 24060460 24887459 25431595 25955598 26675900 27248114 27886370
14349 27886370 28627867 29267106 29801910 30501324 31264169 32349916 33160090 33621543 34647647
14340 34647647 35825922 36864731 37768894 38637590 40127685 40768917 42242327 43513711
14332 43513711 44969710 45911382 47510370 49422794 50634045 52274552 53935921 55605594
14324 55605594 57651161 59202699 61537839 63727344 65718118 68090123 70588613 73095670
14316G3095670K596541K877915L163033L343929L184713L782416L321201L913891
14308I9279309L978473M723514M756250M718715N535037M834472O072180O200184
14300A40098134O135733P186081P257887P637736Q060730Q860790R053846R427520
14292B03718457J0340317J0767699J1025534J1935711J2241747J2496168J3574818
14285B86100451J3627228J3694185J4418494J4220000J4317208J3518981J3999365
14278C83895912J2727606J2325375J1556811J0191017Q268175N993620J757239
14271D46715755j273888r14204J711201l861076l305299n553627p712012q879637
14263D16927213j0720533j2236786j3348694j4051004j4679505j5031626j4839755
$$ plain form
14316 73095670 75692211 78570126 81733159 85077088 88261801 92044217 95365418 99279309
14308 99279309 103257782 107981296 112737546 117456261 122991298 127825770 133897950 140098134
14300 140098134 146233867 153419948 160677835 168315571 176376301 185237091 194290937 203718457
14292 203718457 214058774 224826473 235852007 247787718 260029465 272525633 286100451
14285 286100451 299727679 313421864 327840358 342060358 356377566 369896547 383895912
14278 383895912 396623518 408948893 420505704 430696721 438964896 444958516 446715755
14271 446715755 445441867 444527663 446238864 442377788 439072489 433518862 425806850 416927213
14263 416927213 406206680 393969894 380621200 366570196 351890691 336859065 322019310
14256C22019310j5097999j3648861j3518852j3826302j2629880j2416823j2005658
14249B28874935j0830245j0962113j0074785r552100q816432q329966p866427
14242A62442867p997041p162608o494230o590670n275135n581710n397646n353782
14234A12590045m643997m658843m158937l652155l752354l640371l430293l328721
14226H1324374l049342k872703k828855k674988k421798k402935k292345j451933
14218F1329475k519725k367117j259747k083087j435647j032893k030003j774344
14210D6826912j489265j060114j224146m28034j723414r69270j199336j439563
14202C7293770r77817n86844p32867o36772j373614j190313o52668n35387j010844
$$ plain form
14256 322019310 306921311 293272450 279753598 265927296 253297416 240880593 228874935
14249 228874935 218044690 207082577 197007792 187455692 178639260 170309294 162442867
14242 162442867 154445826 147283218 140788988 134198318 128923183 123341473 117943827 112590045
14234 112590045 107946048 103287205 99128268 95476113 91723759 88083388 84653095 81324374
14226 81324374 78275032 75402329 72573474 69898486 67476688 65073753 62781408 61329475
14218 61329475 58809750 56442633 55182886 53099799 51664152 50631259 48601256 46826912
14210 46826912 45337647 44277533 43053387 42625353 40901939 39932669 38733333 37293770
14202 37293770 36315953 35729109 34996242 34359470 32985856 31795543 31142875 30607488 29596644
14193B9596644n95774o22495p13703l82303j005654r52602k29963p45590K6322
14184B4374882q72587n99204p89776j78030o97172m67569j81590m15420n16328
14175A9657206j14911o06846k2008n48264o83058j72498l85606j47914l79658
14166A6596443n40510j3157k82382k52395m89758J20323m50065k94186m70602
14157A3923711K6153J050r16426J57259j18553l08395j67013m27836n7053j33552
14147A1979345k88327J39869k73242k94962j32199m07302j75566j57935J36544
14138A0526225j01394l78653l12281K47692n51766n6665j52781l06451M31933
14129I345859p28505J56763m0486r2361L256k31180L88419o55211K4260k36911
$$ plain form
14193 29596644 29000870 28378375 27664672 27282369 26276715 25324113 25094150 24348560 24374882
14184 24374882 23502295 22903091 22113315 21935285 21238113 20770544 20588954 20173534 19657206
14175 19657206 19542295 18935449 18913441 18365177 17682119 17509621 17124015 16976101 16596443
14166 16596443 16055933 16042776 15760394 15507999 15018241 15138564 14688499 14394313 13923711
14157 13923711 13949864 13950914 13034488 13191747 13073194 12764799 12597786 12169950 12112897 11979345
14147 11979345 11691018 11830887 11557645 11262683 11130484 10723182 10547616 10389681 10526225
14138 10526225 10424831 10046178 9733897 9981589 9429823 9373158 9220377 8913926 9345859
14129 9345859 8617354 8774117 8733631 8641270 8644526 8413346 8801765 8146554 8170814 7933903
14119G933903j72479K36999l11092k8566k35901m9481k04856l18313J49599K34509
14109G234322l14272n1477o0334p5768l36133L4793K64457m36679Q3611o7476
14099F275044K4162k7177n69402j31509J419j49306M16821n56164M42797m70922
14089E255763L5048l47638N276L89776j71472j63291j39710m034l35920L21426
14079D845224l85700M90312k8557j18123k76064J34507j70975j42040J77564p48
14069D525400j5568l65193Q2171k73944J80943K31565p9245k98258L79016k61090
14059D105797L0721j96312J00157Q6830j37132p8339j81265M7262n6973j69021
14049C551725J9753R7865k56093K21624j87117k02445Q5774J71318j27180p6543
$$ plain form
14119 7933903 7761424 7998423 7687331 7658765 7422864 7373383 7168527 6850214 6999813 7234322
14109 7234322 6920050 6868573 6808239 6732471 6396338 6431131 6695588 6258909 6342520 6275044
14099 6275044 6299206 6272029 5702627 5571118 5572537 5423231 5840052 5283888 5726685 5255763
14089 5255763 5290811 4943173 4948449 5338225 5166753 5003462 4863752 4859718 4523798 4845224
14079 4845224 4459524 4949836 4921279 4803156 4527092 4661599 4490624 4348584 4526148 4525400
14069 4525400 4509832 4144639 4226810 3952866 4133809 4365374 4286129 3987871 4366887 4105797
14059 4105797 4136518 3940206 4040363 4127193 3990061 3911722 3730457 3777719 3720746 3551725
14049 3551725 3571478 3669343 3413250 3634874 3447757 3245312 3331086 3502404 3375224 3298681
14039C298681j6994k13924O007K88681m44031K45758K05853k39758k9859j0447
14029C089967K55843M6613l54913j92157l8525N6680j18561K18253k30164j11272
14019B621764K38643j43782l20078L46151r0402r5789j52861J14325Q0148R2269
14009B690388m13293K84603j63928r3182j30169J03418j29475j06815K72329J11873
13999B425749l34991L7260j43290r4697K46098K73281l58649J42247l5241N33636
13989B691403M69982K893387P520558J4406132J7659088j6968420j4313164n501024
13981H857942k490211j416249p08376m25218o60470P9214l53732K30815k36967
13972B876748K7361m28544l8205J69578k04586l13530K88573j01314K78102l12907
$$ plain form
14039 3298681 3281687 3067763 3073770 3362451 2918420 3164178 3370031 3130273 3100414 3089967
14029 3089967 3345810 3392423 3037510 2845353 2806828 2863508 2744947 2963200 2733036 2621764
14019 2621764 2860407 2716625 2396547 2742698 2652296 2556507 2403646 2517971 2598119 2690388
14009 2690388 2277095 2561698 2397770 2304588 2174419 2277837 2148362 2041547 2313876 2425749
13999 2425749 2090758 2128018 1984728 1890031 2136129 2409410 2050761 2193008 2157767 2691403
13989 2691403 3161385 6054772 13575330 27981462 45640550 28672130 14358966 8857942
13981 8857942 6367731 4951482 4243106 3817888 3157418 3236632 2882900 3113715 2876748
13972 2876748 2904109 2475565 2437360 2606938 2402352 2088822 2377395 2276081 2554183 2241276
13962B241276k68856J77682M2439j66814M29044m22910R8433n0996j49551k6180
13952A903567L5706k36612M27738l01292K4794L67346l94884M8109P3720J29313
13942B077505k42553K62541J09448n86570J26790j77394K08437Q870J06917j25388
13932A768603K03173m1294l80980j3356P8375m3127J77536k55912Q8178m2741
13922A538455p9058o6371m3721J93230j93257l1678J21566l4348k22557N50877
13912A733138k83983K0925K41296m22689J61964J9024J55561p1338l04624L00126
13902A549400o0307l98338L14021k12972l2040q833K61190l23440K52114L6461
13892A377256L1127j03590j85320P6418J76385j11173P8349m8986m2880m6992
$$ plain form
13962 2241276 1972420 2150102 2192541 2025727 2454771 2031861 2130294 2079298 1929747 1903567
13952 1903567 1939273 1702661 2130399 1829107 1853901 2221247 1826363 1874472 1948192 2077505
13942 2077505 1834952 2097493 2206941 1620371 1747161 1569767 1778204 1787074 1893991 1768603
13932 1768603 1971776 1930482 1549502 1536146 1614521 1571394 1748930 1493018 1581196 1538455
13922 1538455 1459397 1393026 1349305 1542535 1349278 1317600 1439166 1404818 1182261 1733138
13912 1733138 1449155 1470080 1711376 1288687 1450651 1469675 1625236 1553898 1249274 1549400
13902 1549400 1489093 1090755 1404776 1191804 1159764 1150931 1412121 1088681 1340795 1377256
13892 1377256 1408383 1304793 1119473 1195891 1372276 1261103 1339452 1290466 1247586 1200594
13882A200594r0736J48073P4107k52063r1754N1491J52863l1108j46543L24775
13872A339699l21152K7489J60775n6885K58706j94859j84701K67895l73315K31931
13862A155583P7712k42618K97396j07431k17787L81057l12788q160j87324o4769
13852G70871M07188j76785l1280L3221J05775q1070J26263r9221M68635n11114
13842A012483Q4823K28696m07543J2400j4447k43687M59263E51900N01599J91390
13832A244889k33308j08920J75167l43004J08943M068n2737K35659j65715j73782
13822F91260p2251j15504K22011J49033j47559K90000l5913j06061j19093J06052
13812H61975J58381k48986J31536K58125j53386j30268C51374P11775k35207m09850
$$ plain form
13882 1200594 1109858 1257931 1332038 1079975 988221 1039712 1192575 1161467 1014924 1339699
13872 1339699 1018547 1046036 1206811 1149926 1408632 1213773 1029072 1296967 923652 1155583
13862 1155583 1233295 990677 1288073 1180642 962855 1343912 1031124 1022964 835640 770871
13852 770871 1178059 1001274 969994 1003215 1108990 1027920 1154183 1054962 1523597 1012483
13842 1012483 1097306 1326002 918459 930859 916412 672725 1131988 551900 1053499 1244889
13832 1244889 1011581 902661 1077828 734824 843767 847835 795098 1030757 865042 691260
13822 691260 619009 503505 725516 874549 726990 1016990 981077 875016 755923 861975
13812 861975 1020356 771370 902906 1161031 1007645 877377 351374 1063149 827942 418092
13802D18092J89111J17698J40320C35484O43409k7705k33287j28672N8835J74378
13792H22442K36315k27232L1924J50934k33748N2624O3386K36819D96733K39552
13782G36285J9763k96006L89204J10959l39520o8052L38091P6024J16966E34745
13771G33944P527k33491M0411K67382j34735J0399j40741J73295K34650m36361
13761E22280K29437l1199k16216Q0430K04273k81930J61905J35767l54068M04317
13751H54996k11158K23687R5579D80376K52485l028J01031l54213L66981P5571
13741I19203l57797J93992j13632j01136Q7440j68724O2869m8379J85454O881
13731F66171J60326j28178j49198j10172L00509j24652J013J51565j18544k1962
$$ plain form
13802 418092 607203 724901 865221 335484 978893 951188 717901 589229 648064 822442
13792 822442 1058757 831525 863449 1014383 780635 833259 896645 1133464 496733 736285
13782 736285 756048 460042 849246 960205 620685 552633 890724 966748 1083714 534745
13771 733944 741471 507980 548391 815773 681038 691437 550696 723991 958641 522280
13761 522280 751717 720518 504302 584732 789005 507075 668980 804747 450679 854996
13751 854996 643838 867525 963104 480376 732861 729833 830864 476651 843632 919203
13741 919203 561406 755398 641766 540630 628070 459346 522215 473836 659290 666171
13731 666171 826497 698319 549121 438949 739458 614806 615819 767384 648840 626878
13721F26878J02090l06470K57623o6327q3394J50117j50626m2865O175O23j96424
13710B97400K86206p9669A69465K78560j52540L45154B51975k7615O87110j03090
13700H08380j30636k77964O2075J48255j3598k14294G0044M76436k59980L92143
13690F78643K0184j61382j36787K93156r3969M0578J31784l20574K85488k71516
13680D65605J9346j60470M34641j63167B13316m949J76698r0632o9380K78307
13670E03360k08654M1586O1152K56877j43213q4723k656K20286p8086M6783k17122
13659C95590L68425C74780j68301K40256J59008B09179N00266k90764J25606j21459
13649D22828o9867Q6267L7110j03442p6541K08039j13239o8739L10466j13520
$$ plain form
13721 626878 728968 422498 680121 613794 530400 680517 529891 487026 493201 493824 297400
13710 297400 583606 503937 169465 448025 295485 640639 251975 224360 911470 808380
13700 808380 677744 399780 461855 610110 596512 382218 70044 546480 286500 678643
13690 678643 698827 537445 400658 693814 599845 640423 772207 451633 737121 465605
13680 465605 484951 324481 759122 595955 213316 208367 385065 294433 225053 503360
13670 503360 294706 336292 397444 654321 511108 426385 423729 644015 565929 612712 395590
13659 395590 764015 374780 206479 446735 605743 209179 709445 418681 544287 422828
13649 422828 352961 439228 476338 372896 296355 504394 391155 322416 632882 519362
13639E19362o1694A06217J72077o9687J20566P1122A44885J86571j37125L06798
13629E01129J81531C08735r6615J72009A52762J59394K56831H5164N83650B94739
13618D32307j43372L30220B25569J24007J12408A9596M36970K8567K9400k34301
13608B80232R5842j52605n4820K02978H3628N3121L74495j52508F8117K24157
13598B92274G4455K59249J3674K33560j92292j60258K65635j88944k4453A40303
13587A94010I863b6894D48097A47216O4582j4443J18109n303A14321K41624J39995
13576D95940j01558j60175m8273P1641A11122J53204D5029L86667j07711r0753
13566B33232J76937j10883A44290L17851B6361K42157A02925L6321L76410j46995
$$ plain form
13639 519362 457668 106217 278294 208607 329173 400295 144885 331456 194331 501129
13629 501129 682660 308735 212120 384129 152762 312156 568987 85164 668814 294739
13618 432307 288935 619155 225569 349576 461984 19596 456566 485133 514533 280232
13608 280232 376074 223469 168649 371627 83628 136749 511244 358736 68117 292274
13598 292274 74455 333704 347378 580938 388646 228388 494023 305079 280626 140303
13587 194010 9863 -26894 448097 147216 211798 197355 315464 310161 114321 355945 495940
13576 495940 394382 234207 185934 257575 111122 264326 45029 431696 323985 233232
13566 233232 410169 299286 144290 462141 26361 268518 102925 139246 515656 368661
13556C68661J8792M1235m0239C2149N26126A14401J52288P8509A55431l9935J65127
13545B80623M7720F7898J03276K33877A85125P1848J0474P5105K44837k43403
13535C43986n5782l6566J83365j10667j38011K2317J82601p8059o9887p3776J0858
13524A80379n3192c5410E89092A9563L73236n2158I323R7314Q40786A97594O10828
13513H08422k63508B54433n2498J59255K51367B17341p3817J3732k2942K40792
13503C75106j54248J3791L6878H1516J07080R8237b02274E64630j28265f526A19787
13491A79663K27371g3710C58533q575I6328L594J51319p9577J89257Q8179j74424
13480B74676A16597K41315A64192J92172k682I2923L16959A95822J32960i261
$$ plain form
13556 368661 387453 428688 388449 32149 558275 114401 266689 345198 155431 115496 280623
13545 280623 328343 67898 171174 405051 185125 256973 267447 342552 587389 343986
13535 343986 288204 251638 435003 324336 186325 208642 391243 313184 243297 169521 180379
13524 180379 127187 -35410 589092 19563 392799 340641 9323 106637 947423 197594 808422
13513 808422 544914 254433 201935 361190 612557 217341 143524 157256 134314 375106
13503 375106 220858 234649 271527 81516 188596 286833 -202274 564630 436365 -6526 119787
13491 179663 407034 -73710 358533 349958 96328 99922 251241 171664 360921 449100 274676
13480 274676 116597 357912 164192 356364 353682 92923 409882 195822 328782 -9261
13469I5078j4517K03097q6278a1640A89106J96518J0024r157N0131r9339K03481
13458E40764k18911J43264k15226k5930n0094J19640j26264k0646a70435D88297
13447C40833A55335J88841A63497e7846E48071A87101J26336j31395b1950n6118
13437g8068A31344L00467j94459L2207D8019K51961E4721L64374j40074B9705
13426B42743Q2950E8350b49519A11008J2724a43484F8J51209J78369O515L344
13415C39505A62986L18020j43779E9000J89170R8650K6488A60763P421o4221K00546
13404C04509m2874n3808C6632J7112O4031J6318R3057C6507K63006r1190R4324
13393C02647G2604R3978j2962k6640K92P8720J04224I2707R8012J87061H3931
$$ plain form
13469 95078 80561 283658 197380 -11640 189106 385624 395648 386491 436622 337283 540764
13458 540764 321853 465117 249891 223961 173867 293507 167243 146597 -170435 488297
13447 340833 155335 344176 163497 -57846 548071 187101 313437 182042 -21950 -78068
13437 -78068 131344 431811 237352 269559 48019 299980 54721 419095 279021 29705
13426 242743 325693 58350 -249519 111008 123732 -143484 68 151277 329646 336161 339505
13415 339505 162986 481006 337227 59000 248170 346820 373308 160763 168184 103963 304509
13404 304509 261635 207827 36632 53744 117775 134093 227150 36507 299513 208323 302647
13393 302647 72604 166582 153620 126980 127272 205992 310216 92707 190719 377780 83931
13381E7746K66105j43242J13791o0933J35513A23511B6378J78457R7493e4889
13370B53083b6972C07088e795A33383J94810A33085l278Q5748n8106L62134k54837
13359B64746d3460D8898J88205a25683B91502K20063I1451Q9619Q338n0701p134
13348A31573K42351G2056J19359N6803J45222J43695j63021j25154J82371j86012
13338B45319k0116R3922N9406j67090A9762K8762L24939j82383N82J10465A46001
13326B8716N1445L326K36105j44089b03400D8538K25900K13709I5118M2438K22056
13315C59612j1396G9072h9544C12186a62678A05363k283K73054j60760B1147L5604
13304E6751c0042A27241b68022G8651K69280A37393a7974B08158d0604B29949
$$ plain form
13381 57746 323851 180609 294400 233467 368980 123511 26378 204835 302328 -54889
13370 253083 -26972 307088 -5795 133383 328193 133085 129807 215555 157449 519583 264746
13359 264746 -43460 48898 237103 -125683 291502 511565 91451 181070 189408 138707 131573
13348 131573 373924 72056 191415 248218 393440 537135 374114 248960 431331 245319
13338 245319 225203 319125 378531 211441 19762 48524 373463 191080 191662 302127 146001
13326 28716 80161 83487 319592 175503 -203400 48538 274438 488147 95118 137556 359612
13315 359612 348216 79072 -89544 312186 -162678 105363 103080 376134 215374 21147 56751
13304 56751 -30042 127241 -268022 78651 347931 137393 -17974 208158 -40604 229949
13293A32955C1350a11668D412J30657b51819A45935o456Q6879r2509K36190I0145
13281F327b1404B2672a28398A02223m5123P9574E9755j4874R8038n1928L69300
13270D60291k9516j02451A04642K14733A30945O5184q0458J35258A22705N6888
13260A79593b097E39580k28264B1156a6589j07444E7001a75288H774a11011E9666
13248B02481o1085a63186D4475J29204J0013J08529d9103H3432k4112K28809G9143
13236C00008A7564K40152C8510K14061J2217j30010M8807p6765K18203C0724h9979
13224B0794d2843B51219n7354h60A47967l6712H467b00845B54945A06663n060
13213A01603h9884A88936a35139A80429m5329F3022N9648a57726A88669Q2494
$$ plain form
13293 132955 31350 -111668 4412 135069 -251819 145935 139479 226358 133849 370039 90145
13281 6327 -21404 22672 -128398 102223 57100 136674 59755 44881 142919 90991 460291
13270 460291 430775 328324 104642 319375 130945 196129 115671 250929 122705 179593
13260 179593 -2097 539580 311316 21156 -16589 -124033 57001 -175288 8774 -111011 59666
13248 202481 141396 -163186 44475 173679 183692 292221 -49103 83432 59320 288129 79143
13236 300008 17564 257716 38510 252571 264788 134778 183585 106820 325023 30724 -89979
13224 20794 -42843 251219 193865 -860 147967 111255 8467 -200845 254945 106663 101603
13213 101603 -89884 188936 -135139 180429 135100 63022 122670 -157726 188669 271163
13203B71163A25768P9535m5574j0877J124d6792B4332K3247a89331c8782D296
13191B07674K84584E9039L026M7427J58581j10963j4395k4830j3527J69005D2061
13179a4843j0992B12969a9905k08313A08184K57133A54515b28568K2409I4648
13168C41880b03203a1527A99134I2334c16316C66433A36834K57977h6979A82926
13157B3226L740f0077A07118L24064c5277A14758k2851J29337l7830o9497n0778
13146F3139J23566a00725j01937d4266C10819j23970c7381A30761J95037A57169
13135h7861G4411e5420h123A50736J4222A6898a15472b19C1290M46436k17484
13124B60242G5068P0219c49180B58693a7011A98942R3733G0693L7673O5866M4256
$$ plain form
13203 271163 125768 205303 159729 148852 149976 -46792 24332 47579 -189331 -38782 4296
13191 207674 492258 59039 62065 109492 268073 157110 142715 117885 104358 273363 42061
13179 -14843 -25835 212969 -19905 -228218 108184 365317 154515 -228568 -206159 94648
13168 341880 -203203 -11527 199134 92334 -316316 366433 136834 394811 -86979 182926
13157 23226 26966 -60077 107118 431182 -35277 114758 91907 221244 183414 113917 63139
13146 63139 186705 -100725 -202662 -44266 310819 186849 -37381 130761 325798 157169
13135 -87861 74411 -55420 -8123 150736 164958 16898 -115472 -219 31290 477726 260242
13124 260242 75068 145287 -349180 258693 -17011 198942 292675 70693 108366 174232 218488
13113B18488b0306F3207K91286B2287g4081A88308n4242K3881N7234h4013A06195
13101A16851Q2031G1655J56904K05899f1410B54869J36844a80535B62377c58211
13090f3576a4897A04722A2462L5171a6775A28036l2215J23138B0946J00231N4511
13079A75688j7009J4807k7807h6915D79004a880D0578e3572A81113n2209K01565
13068C30469A48765o3807Q7210G6893O0433J29488j07283L7314G9195b86774A18881
13056F5088J41067a40407D2624L27901j66953b38180c3389C06413r6398m8956
13046A61059K1993p400f7540B87712h3054B14846a2501E3007J38409q3852b42892
13034B02961N802J01912a9481A81082c40665c9177k3061p503B05233J1015k6689
$$ plain form
13113 218488 -20306 63207 354493 22287 -74081 188308 134066 157947 215181 -84013 106195
13101 116851 198882 71655 228559 434458 -61410 254869 391713 -180535 262377 -358211
13090 -63576 -14897 104722 12462 47633 -16775 128036 95821 218959 20946 121177 175688
13079 175688 158679 173486 145679 -86915 479004 -1880 40578 -53572 181113 128904 330469
13068 330469 148765 84958 172168 76893 137326 266814 159531 196845 79195 -286774 118881
13056 65088 206155 -140407 42624 370525 203572 -238180 -33389 306413 210015 161059
13046 161059 183052 175652 -67540 287712 -83054 214846 -12501 53007 191416 107564 -242892
13034 202961 208763 310675 -19481 181082 -340665 -39177 -62238 -69741 205233 216248 189559
13023A89559a44464E1962J85549O882A12305a12091A97135b31657f8848B60831
13012e5383D4869P7291a05880A08438A4942n875J96877F1436g0912C8844O7581
13001A06425A721J35041O802n8175b01529A389f1585E3194A9814b77858G9083
12989h9970A49666D0406K1445g0749a4620j29024G895J28333B5204j293K98029
12978C21940d9180q1696A60266m6030C4270b7938D46562a37451A56750L3660J38920
12967C29330b69576f2784A09365a20191m1140A48992P4706a49947k9890I01a80787
12955a35989O1527k85578h7650A03681c86021a87294F2698P7987e8228A06768
12944B7343b9972B21498c08142j05043l8363I6751P6002n5296d0682A4154L42347
$$ plain form
13023 189559 -144464 51962 237511 244393 112305 -112091 197135 -231657 -68848 260831
13012 -55383 44869 122160 -105880 108438 14942 9067 205944 61436 -70912 38844 106425
13001 106425 1721 136762 143564 85389 -201529 1389 -61585 53194 19814 -277858 79083
12989 -89970 149666 40406 61851 -70749 -14620 -143644 7895 136228 25204 23911 321940
12978 321940 -49180 -130876 160266 114236 34270 -27938 446562 -137451 156750 190410 329330
12967 329330 -269576 -62784 109365 -120191 -161331 148992 223698 -149947 -179837 901 -180787
12955 -135989 -74462 -360040 -87650 103681 -386021 -187294 62698 140685 -58228 106768
12944 27343 -29972 221498 -308142 -413185 -451548 96751 172753 117457 -40682 14154 356501
12933C56501j48058F461R7329b7703E24830D4423Q0084e30990A83740h3041A17280
12921A21006b82878a307A26526J85889h8380j73520J27071B27593g8647I8492
12910B77368c41014A75333J830c9868A86227p5323a60104M4792E5272K2916b62060
12898B96988f4310B61315c07162a41146C23533I5359a40044B95666q0365c7736
12887C9734J77915J22197f5706j31457i808g70j4580j54108j28949D3583J60538
12876B04121p6271E0219P25c3411D5611d1110H7872R7332a21556l874A39037K03514
12864C42551a31951d7730n913B13983n5709k5943k6785a51125O9986E8108L45888
12853D03996e4903H4354Q8691m145L3259f4216A59194d4035C9822D305L45072
$$ plain form
12933 356501 208443 6461 103790 -27703 524830 44423 124507 -530990 183740 -83041 117280
12921 121006 -282878 -1307 126526 312415 -88380 -261900 -134829 227593 -78647 98492
12910 277368 -341014 175333 177163 -39868 186227 110904 -160104 -115312 55272 78188 -262060
12898 296988 -64310 261315 -307162 -141146 323533 95359 -140044 295666 215301 -37736
12887 39734 217649 339846 -65706 -197163 -9808 -770 -15350 -169458 -298407 43583 204121
12876 204121 127850 50219 50944 -33411 45611 -41110 87872 185204 -121556 -125430 139037 342551
12864 342551 -131951 -47730 -53643 213983 158274 132331 105546 -151125 -81139 58108 403996
12853 403996 -54903 84354 173045 168900 202159 -64216 159194 -44035 39822 4305 349377
12842C49377j38438j04590J59478H5268K4349J07007b4647l4733a2541k074A82196
12830E4614d5182C84859A43346d8872G2925J9574b74516O1058M0515H6194N7187
12819A43381E1921b1739B74408e0102A64576h2187A94185M3031H5558A4170P7963
12808I2133k4928b71867B32242b0118j0477B09425m0468e3432B6000J02174c9701
12796a54072K4765q9825r3494g5790c4705I2974a49801B40062a59585C1847f773
12784b67290B07192d00654a51775e0118B5655n252K00240h3793D4644b64315A14700
12772A10605K6137a33489D4175L32473d6764I480J0602e5399c677B1258a70243
12760B87353C3232E231R1063M5802o9798K9079K91232b30659i843k09407E5884
$$ plain form
12842 349377 210939 106349 265827 85268 109617 216624 -24647 -59380 -12541 -14615 182196
12830 54614 -45182 384859 143346 -48872 72925 92499 -274516 -213458 -172943 86194 143381
12819 143381 51921 -21739 274408 -50102 164576 -82187 194185 237216 85558 14170 92133
12808 92133 67205 -271867 232242 -20118 -30595 209425 168957 -53432 26000 128174 -39701
12796 -154072 -129307 -219132 -312626 -75790 -34705 92974 -149801 240062 -159585 31847 -6773
12784 -267290 207192 -400654 -151775 -50118 25655 20403 220643 -83793 44644 -264315 114700
12772 110605 136742 -133489 44175 376648 -46764 9480 20082 -55399 -3677 21258 -170243
12760 287353 33232 5231 96294 142096 72298 101377 392609 -230659 -9843 -219250 55884
12748g7997C69018b24349e9403D9732K00706a52757O476A46565K0013G0557B1549
12736B9129J37067p3442Q4047G0045J19429K09341a8255J209l77684C36583j17527
12725B19056B1733a06035A00220A2692a21717C7361O9817a30580N9670l15482
12715c86392B37848a35821e7240R111B1244M2321R410J46500C3861J24934K8391
12704A87186K58190r365B14515c032k64149b2743A31375a41420f1818j0614n9404
12693a31836A03743K37427h5958C0435J85159n9532J38575A33248B4312J62359
12683A86671h9609F91280A02961L0796J37361A8867i6991B71014C2448i3965D10588
12671A31815L71808A34541M3483b5159j48047j38164C03046r8828p5367M8278
$$ plain form
12748 -77997 369018 -224349 -59403 49732 250438 -152757 -146281 146565 166578 70557 21549
12736 29129 166196 92754 176801 70045 189474 398815 -18255 -17046 -394730 336583 219056
12725 219056 21733 -106035 100220 12692 -121717 37361 107178 -130580 -70910 -386392
12715 -386392 237848 -135821 -57240 -48129 21244 63565 72975 219475 33861 158795 187186
12704 187186 445376 436011 214515 -3032 -267181 -22743 131375 -141420 -61818 -72432 -131836
12693 -131836 103743 341170 -85958 30435 215594 156062 294637 133248 24312 186671
12683 186671 -89609 691280 102961 133757 271118 18867 -96991 271014 32448 -93965 410588
12671 131815 503623 134541 178024 -25159 -173206 -311370 303046 204218 128851 177129
12661A77129f8760k3732A16770d4848l2862F2753b97022g3700j27281B25757A09632
12649e048C8178c35154A1842e6264H3552a48060C2616L25041A31077q37m6290
12638H3950K60579A50758K66499j99323n8631k8684D102J07876k6743R0879l9121
12627A36993J6891l2328a24106f975I2760a29238l1133f2228k1697j56416A77503
12615d4621B52754j03643k3416b9420k2153e144E1492R4358a00072o2058A45116
12603a52302G6078K98130I2567R7222H9483a86755E7645K44514A2068a90051I8758
12591A02914J78736a60409n0833B2146a12440c6291j59087A54017G3449i2536
12580A23997a59264C66404i3657D46299f2005A7294f4691r385k81503A12457L9231
$$ plain form
12661 177129 -68760 -92492 116770 -44848 -77710 62753 -297022 -73700 -200981 225757 109632
12649 -5048 38178 -335154 11842 -56264 83552 -148060 32616 357657 131077 130240 83950
12638 83950 344529 150758 417257 217934 159303 130619 4102 111978 85235 176114 136993
12627 136993 153884 121556 -124106 -6975 92760 -129238 -160371 -62228 -83925 -240341 177503
12615 -44621 252754 149111 125695 -29420 -51573 -5144 51492 145850 -100072 -162130 145116
12603 -152302 76078 374208 92567 189789 89483 -186755 57645 302159 12068 -190051 98758
12591 102914 281650 -160409 -211242 22146 -112440 -36291 -195378 154017 73449 -92536
12580 123997 -159264 366404 -93657 446299 -62005 17294 -64691 -74076 -355579 112457 151688
12569A51688J01343H471c10515J45374C11142j27564n7669B017J44107m7651b08870
12557a4726A82631g3651B37099B8668a07953A89841b3076A2510a05857E4715J82721
12546B37436e879k7817G0250i9597A97772i6697b5481A96072J86587F1520P5982
12535A37502J6908d7187B49799C4287A2145d6882A40383e1569o3871A94297E7160
12523B39154A01468J26567m865K04893a52985b0215A50572a08486B888J7559c78303
12511H2506K1550a78538I4078f0932o7625C31423G9757b33351J06237f2603b8940
12499I2797J28483G0463e9481A3928a4573k76167b0359j23797E7667k2142J69686
12488B05211E6095a14097F1895a71692e8612b4755A40587J15686h0233H2792j5709
$$ plain form
12569 151688 253031 8471 -310515 -165141 311142 183578 125909 2017 146124 98473 -208870
12557 -14726 182631 -73651 237099 28668 -107953 189841 -23076 12510 -105857 54715 237436
12546 237436 -5879 -33696 70250 -99597 197772 -96697 -25481 196072 382659 61520 137502
12535 137502 154410 -47187 249799 34287 12145 -46882 140383 -51569 -115440 194297 57160
12523 239154 101468 228035 223170 428063 -152985 -20215 150572 -108486 2888 20447 -378303
12511 82506 104056 -178538 94078 -60932 -128557 331423 79757 -233351 -127114 -62603 -28940
12499 92797 221280 70463 -59481 13928 -14573 -290740 -20359 -144156 57667 35525 205211
12488 205211 56095 -114097 61895 -171692 -58612 -24755 140587 256273 -80233 82792 67083
12477F7083J71495a44853C570J69015p0554i0490l0159G1200a03561J9034I7163
12465B48738n5315i9357b1519A4141a56348A28508a19926H2737K11A572i9319
12453C43J93712b02695N7049C9206M5647P0449O1369c14948Q6400A7121b9700
12441D2534Q7940J8068b2550j16375A10693a3215A71389b37997c8401A6975g3609
12429A58878m7996P8273a54780J1639A12313J42275J0671a27134b2058j47601
12419a69659A62885N0948a27024a3249k82682A65909K01527A4059g2560D9168
12408a13925e4632B51204q1021o3954J41406n8290a51066f7574A13370a15640
12397c9725j84946j9041c6446E09257h1973k0847L0594k26060D1203f1769A11666
$$ plain form
12477 67083 238578 -144853 3570 172585 102031 -90490 -120649 71200 -103561 -84527 97163
12465 248738 193423 -99357 -21519 14141 -156348 128508 -119926 82737 82948 1572 -99319
12453 343 194055 -202695 -145646 39206 84853 155302 216671 -314948 -228548 17121 -29700
12441 42534 130474 148542 -22550 -138925 110693 -13215 171389 -237997 -38401 16975 -73609
12429 158878 110882 189155 -154780 -143141 112313 254588 265259 -127134 -22058 -169659
12419 -169659 162885 213833 -127024 -13249 -295931 165909 367436 14059 -72560 49168
12408 -113925 -54632 251204 170183 106229 247635 189345 -151066 -67574 113370 -115640
12397 -39725 -224671 -243712 -36446 509257 -81973 -102820 -72226 -298286 41203 -61769 111666
12385a7425j45633a1846K483A26706J1552b52606K7771c7192A72106a36995B44454
12373a70657A41539c33429A89501O4604B823J45668a58005k4251j39962A77456
12362a71088F0593c6211R236A66142a20098H0152a51595j31938J27331k4265e0039
12350A87558m6708a37477r318C3822c04775i3725k4374a822k4229A0969d2290
12338b7930B09890b50345B1931c33931G9655J96746A830e9305j97352f1285I3101
12326D9132L03768A11198D9229a28082J5915D4335e34199H7989J46224a63654
12315g0664j03652F5032j9159a96619Q7745B11907b11618B10679N4593d38324
12304b0206k76248c764C4244J75133E9779J88925A04415a29293B06787k5596c6594
$$ plain form
12385 -17425 -163058 -11846 -9363 126706 138258 -252606 -224835 -37192 172106 -136995 244454
12373 -170657 141539 -333429 189501 254105 2823 148491 -158005 -182256 -322218 177456
12362 -171088 60593 -36211 -26975 166142 -120098 80152 -151595 -283533 -156202 -180467 -50039
12350 187558 140850 -137477 -146795 33822 -304775 -93725 -118099 -1822 -26051 10969 -42290
12338 -27930 209890 -250345 21931 -333931 79655 276401 1830 -59305 -256657 -61285 93101
12326 49132 352900 111198 49229 -128082 -112167 44335 -534199 87989 234213 -163654
12315 -70664 -174316 65032 45873 -196619 -108874 211907 -211618 210679 265272 -438324
12304 -20206 -296454 -3764 34244 209377 59779 248704 104415 -129293 206787 181191 -36594
12292c6697B7390J25712K5532h8176n3248A97212d0538A17679a31162k49545F1767
12280B66048a63587N6000I7803J51109H3961J45842A06546m3683L7333D086R2405
12269I6491b4708j13023d7156B42349a19818B77213C2157a38994F3428e5485B30354
12257D8964J50122M68262G6574a283q5427A02271a42927f9795B19434d0431k8617
12246f9048B08947g2479l457B07171a46768B92461C9242b0140r4000M4713I4988
12234a32785N6661B38090J0102B8463A1714L08097m3735A18373O9314p6147a33369
12222B54761K8654N951o7043H1115J30957L04405b0575f753r5078I6433a21835
12210A91660L778K06709A53126J72545c5726G4102L14913j62834q2846J82994
$$ plain form
12292 -36697 27390 153102 178634 -88176 -141424 197212 -40538 117679 -131162 -380707 61767
12280 266048 -163587 -107587 97803 248912 83961 229803 106546 62863 100196 4086 96491
12269 96491 -24708 -137731 -47156 242349 -119818 277213 32157 -138994 63428 -55485 230354
12257 48964 199086 667348 76574 -1283 -86710 102271 -142927 -69795 219434 -40431 -69048
12246 -69048 208947 -72479 -75936 207171 -146768 292461 39242 -20140 -114140 -69427 94988
12234 -132785 -76124 238090 248192 28463 11714 319811 276076 118373 187687 111540 -133369
12222 254761 283415 289366 222323 81115 212072 516477 -20575 -6753 -101831 96433 -121835
12210 191660 195438 402147 153126 325671 -35726 74102 389015 226181 143335 326329
12200C26329J8666r2943H8198R9361H4538J38238o0381J25885D7352a39816B88519
12188a6760A32220K196J04497f7017J4673A40875h9114D10218a5685B56921g0760
12176E7991b0920C71974n8095A49870c22194B11809q5611E0573Q0405e7563D2351
12164A99163F0257a06427j96344f3895G6035C501L2924c58332B51457d32803h4077
12152F6477O6024A4276L565a9716B32538F4632K3298j2846c9065B04048g2934
12140A47779l5146O1422b78449B384a02793B98020f2664C71980b8882r2371N5734
12129f5519l03001Q0687N5470A8435a20022p3711R3849D9239K547J35509Q4905
12118B72200A6064b56790A06990K20198j35313E1841b21780f6918G0369k0512
$$ plain form
12200 326329 344995 252052 88198 187559 84538 222776 162395 288280 47352 -139816 288519
12188 -16760 132220 134416 238913 -67017 -52344 140875 -89114 410218 -15685 256921 -70760
12176 57991 -20920 371974 313879 149870 -322194 211809 126198 50573 130978 -57563 42351
12164 199163 60257 -106427 -302771 -63895 76035 3501 36425 -358332 251457 -432803 -84077
12152 66477 132501 14276 17841 -19716 232538 64632 87930 75084 -39065 204048 -72934
12140 147779 112633 174055 -278449 2384 -102793 298020 -62664 371980 -28882 -121253 -65519
12129 -65519 -368520 -287833 -232363 18435 -120022 -193733 -99884 49239 51786 187295 272200
12118 272200 16064 -256790 106990 327188 191875 51841 -221780 -66918 70369 49857
12108D9857g8201L6707D5624J62161d7973l4817A28634a75181I6385i0720f303
12096B32003J95387i2351E2711P3220O7406C4062M2968R2409j9346b90055i4608
12084B62707a77713A45081b78890g2198B25885a50514B99342N1256N46303N53356
12074A450257l65818B94452j43234C8752J05779N738B6507O3809c2143o5141B88576
12062C723N2616K769d5707E6493R2117f0962j3631j28360O8279C1121f2378j59148
12050b21526J09458j26002j10981E396b47164A38230D0628b14373i3098A30620
12039G3709J66587a07406b3975j89072A23275a85216C4807i5989m8486j33291
12029b77766J07420B42819a47613A8456Q2046l8226b33455g3245A8493Q5544J36905
$$ plain form
12108 49857 -78201 -41494 45624 207785 -47973 -82790 128634 -175181 96385 -90720 -6303
12096 232003 427390 -92351 52711 125931 193337 34062 77030 169439 150093 -290055 -94608
12084 262707 -177713 145081 -278890 -72198 225885 -150514 299342 350598 896901 1450257
12074 1450257 1084439 294452 151218 38752 144531 150269 26507 90316 -32143 -97284 288576
12062 3723 56339 59108 -45707 56493 148610 -60962 -74593 -202953 -134674 31121 -62378 -221526
12050 -221526 -112068 -238070 -349051 5396 -247164 138230 40628 -214373 -93098 130620
12039 73709 240296 -107406 -23975 -213047 123275 -185216 34807 -95989 -144475 -277766
12029 -277766 -170346 242819 -147613 18456 100502 62276 -233455 -73245 18493 104037 240942
12018B40942a23890A17541l6103d274A10774l6248J40613K50921A96026e9835
12007c6686a1379j37870A12996c06032O0520B51906B7653b18842P573A2338K4698
11996C7036Q5374k64l079b08544l0326j82074F1978d8747j49524O0037d667j55425
11984a60092b801j40543O2016A29718a05104C96597a12248m2745j57344K4507
11974b87830B30370b00215A51610D1981J2765B1751K50459A27566a07435j04944
11964b12379c8342A49700D3237m852K42539d6857l4385H7120e364A34523a91262
11952F4503a16066C676J19367i1244l6668C32236e661B19704a69712j02570G7167
11940C0754J8605A7038L4418c84204J28782A9856g8121G0470K6168a07088H6362
$$ plain form
12018 240942 -123890 117541 81438 -4274 110774 74526 215139 466060 196026 -59835
12007 -36686 -11379 -149249 112996 -306032 -245512 251906 27653 -218842 -211269 12338 37036
11996 37036 122410 122146 119067 -208544 -238870 -420944 61978 -48747 -198271 -138234 -4667 -160092
11984 -160092 -2801 -143344 -81328 129718 -105104 396597 -112248 -154993 -312337 -287830
11974 -287830 230370 -200215 151610 41981 54746 21751 272210 127566 -107435 -212379
11964 -212379 -38342 149700 43237 38385 280924 -46857 -81242 87120 -5364 134523 -191262
11952 64503 -116066 3676 123043 -91244 -127912 332236 -5661 219704 -169712 -272282 77167
11940 30754 49359 17038 51456 -384204 -255422 19856 -78121 70470 96638 -107088 86362
11928a08325A60649D1420b83432G2846a83026D5500Q695a61975B4462J03838a40804
11916a0982n6391A24401P5416j5126M6025b46343A05577C2897K58198a82348q9775
11905b72123C00644a5601l44752a07586k8407I9411O5240b41402F488i2700G8553
11893b06555b6759j75752b8341D5332g8033H891b25517Q94B37875i8506J5507
11882h2999k7228j63126c2055k78991I1109a85090B02588h8949l9974m6735J2213
11871a63445K0200J194M2231j42777b4465A96920e9930r6687B2400e3036J6587
11860c6449j88082h668k181j36500k8844B7560J70417N6062j04078b47053b2092
11848g5063B04128d61273G3739J41848a41317K6545b5159k21850F3021c58678
$$ plain form
11928 -108325 160649 41420 -283432 72846 -183026 45500 54195 -161975 24462 128300 -140804
11916 -10982 -67373 124401 199817 184691 230716 -246343 105577 32897 291095 -182348 -272123
11905 -272123 300644 -15601 -360353 -107586 -135993 99411 164651 -241402 6488 -92700 78553
11893 -206555 -26759 -202511 -28341 45332 -78033 8891 -225517 -224623 237875 -98506 -82999
11882 -82999 -110227 -273353 -32055 -311046 91109 -185090 202588 -88949 -128923 -175658 -163445
11871 -163445 -143245 -142051 -99820 -242597 -24465 196920 -59930 -156617 22400 -53036 -36449
11860 -36449 -224531 -8668 -10849 -147349 -176193 27560 197977 254039 149961 -247053 -22092
11848 -75063 204128 -461273 73739 215587 -141317 -114772 -25159 -247009 63021 -358678
11837H2654d3714a2709B2885K46334d5599A84809G5397i7618k07167O8852A13135
11825E0093e8355n8000p163H8749k3279K4225c23435H4021a05079k5450M0576
11814h9953j10254h7876C57166g5468F1522b12898j02189R1564c6564j15796l1542
11803a83902c9730a5933A11911f6801j74689d5586A72587n2391k4708a58779l255
11792a62034A02138a54165A48366a20884j28084j0264a2595A09455J2759J99418
11782C21632b9386A81095o6871a00427A0808K86480A28862b01888f7613D07166
11771A95801F1706a17413p6691j95175e5449I7905I926K51290c7699j06530A12961
11759C2852Q3436R8378b61066o6694k04860C19446C955J55847C3947J56679d7068
$$ plain form
11837 82654 -43714 -12709 22885 269219 -45599 184809 75397 -97618 -304785 -235933 113135
11825 50093 -58355 -116355 -123518 88749 65470 89695 -323435 84021 -105079 -130529 -89953
11814 -89953 -200207 -87876 357166 -75468 61522 -212898 -315087 -223523 -36564 -152360 -183902
11803 -183902 -39730 -15933 111911 -66801 -241490 -45586 172587 120196 95488 -158779 -162034
11792 -162034 102138 -154165 148366 -120884 -248968 -259232 -12595 109455 122214 321632
11782 321632 -29386 181095 114224 -100427 10808 297288 128862 -201888 -67613 407166
11771 195801 61706 -117413 -194104 -389279 -55449 97905 9926 261216 -37699 -144229 112961
11759 32852 116288 214666 -261066 -327760 -532620 319446 3955 159802 33947 190626 -47068
11747a35948F4570a71246A974d6637j96503A03681J25823b06670a1793D1148a05885
11735A96609a41047N4364K6715H022J0146c48762a54448j83644a39435C34981
11724A70895h2272L4798I7049a4748A57311C1453R0303M0924a64851B07330a50019
11712A7598J20804a58339A9166g0377j230L4887F5888P7734P542f2273A44467
11700a66465A34445d6816A19358a16136c7592B51202c7254a8444p6543k5067A34996
11688D1372j2625M4905a45692N9058b9905j26341C07971c59759B37911E4529K922
11677E7451e6396C7741R3138j6514b92455D55735A23300a79704D0138A9348a55112
11665A59209J03470a68587B03653C1616J14258A5918J56424b29904d104A63213
$$ plain form
11747 -135948 64570 -171246 1974 -46637 -243140 103681 229504 -206670 -11793 41148 -105885
11735 196609 -141047 -86683 -59968 8022 18168 -348762 -154448 -338092 -139435 334981
11724 170895 -82272 -47474 97049 -14748 157311 31453 121756 162680 -164851 207330 -150019
11712 17598 138402 -158339 19166 -70377 -71607 -36720 65888 143622 151164 -62273 144467
11700 -166465 134445 -46816 119358 -116136 -37592 251202 -37254 -18444 -94987 -120054 134996
11688 41372 28747 73652 -145692 -86634 -29905 -156246 307971 -359759 237911 54529 57451
11677 57451 -56396 37741 130879 114365 -292455 455735 123300 -179704 40138 19348 -155112
11665 159209 262679 -168587 203653 31616 145874 15918 172342 -229904 -4104 163213
11654F8351a5803B26065q7061a56508n4236d497C10353j18462d5506o9221E6723
11642C06008i2776B07361h6370D0315b4386i044B39339b97025D1460a29594J6274
11631a13320A24728J30896d6998D9879f0264j29476j44789a07159j1512m2402
11621a61073L3062M0266C52655b7886F5698h8716A18603J64296A08594a32254
11610a10267E6649C622f150m7392D6049L9934K3565P7929j6662L0461b40451a0157
11597B36911m3064c8026C74674A330N5584J77144r4527d3664C97723H4966O0446
11586A45412c7939p3920c4137k05734B24063A2755b34676B60009b07212B26110
11575A41996K88268A71756N7481I7677f9403A82657J10581a20886a5846C36272
$$ plain form
11654 68351 -15803 226065 139004 -156508 -210744 -4497 310353 191891 -45506 -114727 56723
11642 306008 -92776 207361 -86370 40315 -24386 -9044 239339 -297025 41460 -129594 -113320
11631 -113320 124728 255624 -46998 49879 -60264 -189740 -334529 -107159 -118671 -161073
11621 -161073 -128011 -87745 352655 -27886 65698 -88716 118603 282899 108594 -132254
11610 -110267 56649 3622 -6150 -53542 46049 85983 109548 187477 170815 201276 -240451 -10157
11597 236911 193847 -38026 374674 1330 56914 234058 139531 -43664 397723 84966 145412
11586 145412 -37939 -111859 -34137 -239871 224063 12755 -234676 260009 -207212 226110
11575 141996 430264 171756 229237 97677 -69403 182657 293238 -120886 -15846 336272
11564b8665I3500d2940A51989a43311l02735B29847a34846d5595o3194G7782L80044
11553D57826g3348n3345A16689e6238B57933f1100D9322h0645k01218c4691A93658
11541F7865l0121J77458A93M8795f0970F1229K45538a9236k2553L41B67279b10311
11528C0352A3271P7904M13736D4490a4207j29746L5405A01091a81304A36949J4292
11517A51241a45458A11023m7937Q5682g8525L5783A17996d6814A52503C8168b9575
11505B63092p4808d9450Q186F6530a96892B11551J90664f463C8406K69984a13421
11493b35083A62361c4176A10634e4145B3538a01793B59593e9428C36493n9921
11483B76572k62l0584J6162H2241C6081b7445A96408G9623J57500m8553a67537
$$ plain form
11564 -28665 93500 -42940 151989 -143311 -446046 229847 -134846 -45595 -108789 77782 457826
11553 457826 -73348 -126693 116689 -56238 257933 -61100 49322 -80645 -281863 -34691 193658
11541 67865 37744 215202 193 48988 -60970 61229 306767 -19236 -41789 -41448 267279 -210311
11528 30352 13271 91175 504911 44490 -14207 -143953 -108548 101091 -181304 136949 151241
11517 151241 -145458 111023 63086 148768 -78525 -42742 117996 -46814 152503 38168 -29575
11505 263092 188284 -49450 -41264 66530 -196892 211551 402215 -6463 38406 308390 -113421
11493 -235083 162361 -34176 110634 -54145 23538 -101793 259593 -59428 336493 276572
11483 276572 276310 245726 261888 82241 36081 -27445 196408 79623 237123 188570 -167537
11471d00009A52200D2655K18838J70432a68664C67064I1173c1660F030K15468
11461B21498f9154j2207l5728F5903a01929E6888K04144i1257M879A00159b09272
11449a1300A27330i4388p340B63126J54393E7658J77221C6976L2841O5206i808
11437B9087N3461j7570g6320C72946b72630D54758f0126b4369j46764C574J66364
11426A69938k4359h738m8146A46319e0926m4154j0045N0923a4908I4649a01428
11414A0131J11532a8401G8546b91684a8531m7913j5551F8176K07485f0047F1957
11402a52264c5613A41329L1074B5485c57139c1071p9750A14892Q535b31706A28198
11390a06125F810b06643P9453A42262G389a06482k40397R4424h0842L104I4817
$$ plain form
11471 -400009 152200 42655 261493 431925 -168664 367064 91173 -31660 6030 221498
11461 221498 -69154 -81361 -117089 65903 -101929 56888 261032 -91257 -86378 100159 -209272
11449 -11300 127330 -94388 -101728 263126 417519 57658 234879 36976 69817 135023 -9808
11437 29087 82548 64978 -76320 372946 -272630 454758 -60126 -24369 -171133 3574 169938
11426 169938 145579 -8738 -56884 146319 -50926 -95080 -105125 -54202 -14908 94649 -101428
11414 10131 121663 -18401 78546 -291684 -18531 -66444 -81995 68176 275661 -60047 61957
11402 -152264 -35613 141329 172403 25485 -357139 -31071 -110821 114892 123427 -231706 128198
11390 -106125 6810 -206643 -127190 142262 7389 -106482 -346879 -252455 -80842 -77738 94817
11378C7484K44308d04956i6453C31741a46371A82573O0667a38964b9880e362D8387
11366A66023f7379E56268b37180H6123a65633C478a9669B65399C7815B579d63524
11354A2068a08906d98p1808A91250p5062d80598J83592f8823L3104j54905L8581
11343a52043a3661B61192d6676I0530l1631k6025d1449j36472d6725C24744a05687
11331g2847j61200O639q2085B3280a87825n348A86674h3667A53323a60824F3544
11319A39041a29748B02874J8510b67331E5725B3045n153f0197a0118k40810p5490
11308c26418g431I6167a29002j32825B1487a85217B42721d05772K8268F1576a97441
11296A76328f6133j35648A63696a14739k20641D4760a19696k04322h5526o4162
$$ plain form
11378 37484 281792 -404956 -96453 331741 -146371 182573 243240 -138964 -29880 -5362 48387
11366 166023 -67379 556268 -237180 86123 -165633 3478 -19669 265399 37815 2579 -463524
11354 12068 -108906 -498 -72306 191250 116188 -480598 -297006 -68823 -35719 -190624 -152043
11343 -152043 -13661 261192 -46676 90530 58899 32874 -41449 -177921 -46725 324744 -105687
11331 -72847 -234047 -227408 -309493 23280 -187825 -193173 186674 -83667 153323 -160824 63544
11319 139041 -129748 202874 221384 -267331 55725 23045 17892 -60197 -10118 -250928 -326418
11308 -326418 -7431 96167 -129002 -261827 21487 -185217 242721 -405772 -377504 61576 -197441
11296 176328 -66133 -201781 163696 -114739 -335380 44760 -119696 -324018 -85526 -149688
11286a49688j64468c455j22199d0875m5496I6029d26757A50723b0728j3444j39020
11275a73192P5955o6236I7860a56273j27112H2877a28923j377P861i116B29275
11263A40079a2320A4301b18839I1114H495d576q1118n189A85296C0275a51827
11251D2440L04605A43221c63681B24978H5243A8208J05716a3391A08750a08062
11240a507H223b35876N8987h1253I1366m5639b52162o2161b6946k470k1992j71404
11228b22812H002J03156D8366c2167A85306a08672r6025B01535A5890j026c52872
11216F4230J86618d33332a70458E3631B5259h1453G7193b21609m5862B81369m6723
11205B34646a42527A36895E4731R523J36608a73987B5596a32111O3876J8143B13371
$$ plain form
11286 -149688 -314156 -3455 -125654 -40875 -86371 96029 -426757 150723 -20728 -34172 -173192
11275 -173192 -97237 -163473 97860 -156273 -283385 82877 -128923 -130300 -122439 -9116 229275
11263 140079 -12320 14301 -218839 91114 8495 -4576 -85694 -90883 185296 30275 -151827
11251 42440 347045 143221 -363681 224978 85243 18208 123924 -13391 108750 -108062
11240 -1507 8223 -235876 -176889 -81253 91366 45727 -252162 -314323 -26946 -29416 -51408 -222812
11228 -222812 8002 111158 48366 -32167 185306 -108672 -204697 201535 15890 14864 -352872
11216 64230 250848 -433332 -170458 53631 25259 -81453 77193 -221609 -267471 281369 234646
11205 234646 -142527 136895 54731 64254 200862 -173987 25596 -132111 -68235 -50092 213371
11193a90422a5298E4130J72282j05508c24035I7639a32590m4716N5680j74599
11183b96225A43671g1387D7443a02005D4337J03643K23812a13027B09204b41216
11172C6144a28350A88384d20722B94197C3829N6104b70474A52907c352A58279
11161B53686g6777B14965d3815A29212A3876b43007C0351f925l54887C354j74
11150C180R3258D4024c8762A67134i3901c6559A21730A7419Q0668B9152b98241
11138B0301Q616N8893l2513k0242d0367j64264I2195e4287m7948H3095b11817
11126a67888F5667M4418L3450c1281O349k11151j13493a25117B08236c07084i8301
11114A49149b0277F8057N1946a55266A32782k6267J0805E8341a67714E42221f5321
$$ plain form
11193 -190422 -15298 54130 226412 120904 -324035 97639 -132590 -177306 -121626 -296225
11183 -296225 143671 -71387 47443 -102005 44337 147980 371792 -113027 209204 -241216
11172 36144 -128350 188384 -420722 294197 33829 89933 -270474 152907 -3352 158279
11161 253686 -76777 214965 -43815 129212 13876 -243007 30351 -6925 -361812 3354 3180
11150 3180 96438 44024 -38762 167134 -93901 -36559 121730 17419 98087 29152 -298241
11138 20301 28917 87810 55297 35055 -40367 -204631 92195 -54287 -102235 83095 -211817
11126 -167888 65667 110085 143535 -31281 -24932 -236083 -349576 -125117 208236 -307084 -98301
11114 149149 -20277 68057 120003 -155266 132782 106515 117320 58341 -167714 542221 -65321
11102C4860d1047C10830D0645J62595K8321F0582K18278o4796J24588j06089a03889
11090D8124a00317F9238J90515G9473J04193G6502k3674K2328A5038J41178e2972
11078G8897K58867A52155J48692A23282K82524j47162J01995j42614K39887E1056
11067A62225J70701l424F7659J87816L9933K82765r9024A16730Q6629J16980q1970
11056B38369L42467K9261Q5585J11987P4073k32792J14024r9718R2990k6703j3702
11045G15841j24300N5808J27875k87008J36383L32427m4829l17721L10585A31544
11034G73145C38867R7810J91849r2279J83660j04597M7588j59384j94271P07200
11024A016443l0729m24894q8977j04317L6551J22605J97710l14118J05703k22117
$$ plain form
11102 34860 -41047 310830 40645 203240 231561 60582 278860 214064 338652 232563 -103889
11090 48124 -100317 69238 259753 79473 183666 76502 52828 75156 15038 156216 -52972
11078 78897 337764 152155 300847 123282 405806 258644 360639 218025 457912 51056
11067 162225 332926 329502 67659 255475 295408 578173 479149 116730 203359 320339 238369
11056 238369 580836 610097 695682 807669 881742 648950 762974 663256 756246 729543 715841
11045 715841 591541 647349 775224 488216 624599 957026 912197 594476 905061 131544
11034 773145 338867 436677 628526 536247 719907 615310 662898 503514 309243 1016443
11024 1016443 985714 560820 471843 367526 404077 526682 724392 410274 515977 293860
11014B93860K19273O559J6045M5779q805k41498O6485K28709H6164N52041o8079
11003E70126J31946k1815k17300J51688R8777R1892C29040J51020L72729l64529
10993D88260k30438J75526K62982N1807k18761J67485k01501P5076J61725J66941
10983H99102j95366J13531N0242J25846k3606K17180J70291J9612N36132L2409
10973A945373N97265q6396j77421K45247m15833j18400M09708o61367l2095m2548
10963A663533k24108O4128n1505J38840j24468M8041L11681r7198k54130r1617
10953A383197o1490j12391k09064j84607R1761k53867k58644J57667k21802m4333
10943B86427D3187P3851b04322I1323J62450O7142L7492A32620K46443C2437J86816
$$ plain form
11014 293860 513133 519692 535737 581516 572711 331213 397698 626407 86164 638205 570126
11003 570126 702072 680257 462957 614645 713422 805314 329040 480060 852789 488260
10993 488260 257822 433348 696330 748137 529376 696861 495360 570436 732161 899102
10983 899102 703736 817267 867509 993355 969749 1186929 1357220 1376832 1912964 1945373
10973 1945373 2542638 2456242 2278821 2524068 2108235 1989835 2399543 1738176 1706081 1663533
10963 1663533 1439425 1503553 1452048 1590888 1466420 1514461 1826142 1728944 1474814 1383197
10953 1383197 1321707 1209316 1000252 815645 907406 653539 394895 552562 330760 286427
10943 286427 43187 117038 -204322 91323 253773 320915 358407 132620 379063 32437 219253
10932B19253H7596K5267h6150j8303M4061A11898J52252D6266J41853L3708r6908
10921A24919f5947A30945k876a1395j85318Q0003q479B7519O2902D0498K60451
10910C00949H2358a05282l0013G3652J45570q4923C4396J51812a18373L4368j00490
10899a84495j90149A86001a43703o4972j2656J03626o9280B37446b10051C0340
10888B16815b38134P9738A90672l2432E3241K11938b11936B71215a19242A41336
10877A89542o7603e6047j27004n6279I6124J40079g667A52738J57375A367g5252
10865g5431G1073a01566A50034f904B04194a72070C8137f2069I6472h2527k58791
10854c41318a62332b0502B84490a61600A68233d1800A01319J60303G1692i1348
$$ plain form
10932 219253 87596 112863 -86150 -104453 -60392 111898 264150 46266 188119 221827 124919
10921 124919 -65947 130945 128069 -11395 -196713 -116710 -125189 27519 90421 40498 300949
10910 300949 82358 -105282 -135295 73652 219222 134299 34396 186208 -118373 -84005 -184495
10899 -184495 -374644 186001 -143703 -208675 -221331 -117705 -186985 237446 -210051 30340
10888 216815 -238134 -158396 190672 158240 53241 265179 -211936 271215 -119242 141336
10877 189542 121939 -56047 -183051 -239330 96124 236203 -7667 152738 310113 1367 -75252
10865 -75431 71073 -101566 150034 -6904 204194 -172070 38137 -62069 96472 -82527 -341318
10854 -341318 -162332 -20502 284490 -161600 168233 -41800 101319 261622 71692 -91348
10843b5279j68505I3094a01829A20913K73247B8003J7161c51643a01952a3158
10832a89435k56152c28B9872P1790A27b08883e1119L312l47114a61540j3227j39903
10820c14670G1125J14217e6601p7796c6502m1007k16404k6661F9016C4286J00415
10809A34701f5715A51519e7828E16396b9092j34806l7730R2833L9925A16525c1250
10797A15223a09587A8397J64507a59894C99747H3414a89675D2555a19597E0179
10786c63078a06015r0916A8084M2618d036j26311Q07p0712Q6161A67049g5475
10774b43895L4289A19856N846d3829G4631J15991q1052a63313d0363A76771d3474
10762a32725A1960L9269B2059c977F1105K33131b37901A22025a36591M2332c1891
$$ plain form
10843 -25279 -193784 93094 -101829 120913 394160 28003 45164 -351643 -101952 -13158
10832 -189435 -445587 -328 29872 101662 127 -208883 -51119 -47807 -394921 -161540 -174767 -314670
10820 -314670 71125 185342 -56601 -134397 -36502 -77509 -293913 -320574 69016 34286 134701
10809 134701 -65715 151519 -57828 516396 -29092 -163898 -201628 -108795 -68870 116525 -31250
10797 115223 -109587 18397 182904 -159894 399747 83414 -189675 42555 -119597 50179
10786 -363078 -106015 -196931 18084 60702 -4036 -130347 -129540 -200252 -114091 167049 -75475
10774 -243895 -209606 119856 125702 -43829 74631 190622 109570 -163313 -40363 176771 -43474
10762 -132725 11960 51229 22059 -3977 61105 294236 -237901 122025 -136591 -94259 -31891
10750a61038K340J5332Q502A36111J3207a15805M2395D2712a79340O4557N1872
10739f2911B37212b45197A64026b64374N3544d6545k8968I6236e6848j71113a5297
10727a73771k6766g3952k30903A2949O1564g6504a7337A98140a42621F9510a16034
10715C3842N0307L17638a81292h4320j45842f705m38240i0081o8798B1562a78203
10703h3192j65417R1578B15370a97127f5818k11169m6619D1274b41257A47752
10692a94460p9055a28626c1188E3987J07130I920C822a30352a3757B48755r0783
10681A57972J92757A37408b48644a05535I4089b9232m15070F1782b21987i2736
10670a65478L8403L0278B20740H8556a40930I8194k853a1946l3700i10k22888
$$ plain form
10750 -161038 -158698 -143366 -134864 136111 149318 -115805 -73410 42712 -179340 -114783 -62911
10739 -62911 237212 -245197 164026 -264374 -210830 -46545 -75513 96236 -56848 -227961 -15297
10727 -173771 -200537 -73952 -304855 12949 74513 -76504 -17337 198140 -142621 69510 -116034
10715 33842 84149 401787 -181292 -84320 -230162 -6705 -444945 -90081 -158879 21562 -178203
10703 -83192 -248609 -157031 215370 -197127 -65818 -276987 -323606 41274 -241257 147752
10692 -194460 -273515 -128626 -31188 53987 161117 9920 3822 -130352 -13757 248755 157972
10681 157972 350729 137408 -248644 -105535 94089 -29232 -444302 61782 -221987 -92736
10670 -165478 -127075 -96797 220740 88556 -140930 98194 95341 -11946 -45646 -910 -223798
10659b23798e9902J1617k69626C27757a17828m8255j26568F6811a94723A4673
10648c7406m4519j04122b5370l3285K636n0678I5327C5604N6539b68631J2080
10637b56551G6643H192i6323I0073a635F5114i9985A65678c68909a82498j35333
10626c17831A80079N1719f7905j66918i0352F4532a4868A98505c56271a39908
10615g3729n6816C7691K93250j14774f465B43858b5629B43644c5490n8810B40266
10603a08155j96250H6425j8883i0526k2280m51712a71650B4M1604P6359a87937
10591a93359P5231k2824f6487C4145J5893d18064e8950G6844J4779a56307N468
10580a50839k19B50165F2832L9324d24739A40907D6374M1116b48970K1225Q0452
$$ plain form
10659 -223798 -59902 -48285 -317911 327757 -117828 -166083 -292651 66811 -194723 14673
10648 -37406 -81925 -186047 -25370 -58655 -56019 -106697 95327 35604 92143 -268631 -256551
10637 -256551 76643 8192 -96323 90073 -1635 65114 -99985 165678 -368909 -182498 -317831
10626 -317831 180079 231798 -67905 -234823 -90352 64532 -14868 198505 -356271 -139908
10615 -73729 -130545 37691 330941 216167 -6465 243858 -25629 243644 -35490 -94300 240266
10603 -108155 -304405 86425 67542 -90526 -112806 -564518 -171650 24 41628 117987 -187937
10591 -193359 -118128 -140952 -66487 34145 50038 -418064 -58950 76844 91623 -156307 -150839
10580 -150839 -151058 250165 62832 102156 -424739 140907 46374 87490 -248970 -227745 -147293
10569a47293p6196c5225B84431g8627F5096J33259b36334g5899B04220i950k46376
10558b56326j36352d8364j44175A60902e7608I3232d3322B99823c9690j11159
10548a50849g1216A97446e524j00532l6252A93309K2712a84977g5952B15890a57044
10536c80703d6387B39513C1070b45503g7267M462A32223a00408m48088a94652
10525a65006C01343g0997B36220a33543A7925m940J65285d6791A9034O0132C6806
10513d3890j65085A16381e22319b05629o9589g177B2492c45700g3419B3187d2870
10501a45181p3847A03635b7324l7078B0435c76218a66689O1625l2523D89246c09268
10489a53964p4077A44675a00857R694j9911n5607P3495C81543A72037L83494B41370
$$ plain form
10569 -147293 -223489 -35225 284431 -78627 65096 198355 -236334 -75899 204220 -9950 -256326
10558 -256326 -392678 -48364 -192539 160902 -57608 93232 -43322 299823 -39690 -150849
10548 -150849 -71216 197446 -5524 -106056 -142308 193309 216021 -184977 -75952 215890 -157044
10536 -380703 -46387 239513 31070 -245503 -77267 -72805 132223 -100408 -548496 -194652
10525 -165006 301343 -70997 236220 -133543 17925 12985 178270 -46791 19034 79166 36806
10513 -43890 -208975 116381 -522319 -205629 -275218 -7177 22492 -345700 -73419 23187 -42870
10501 -145181 -219028 103635 -27324 -64402 20435 -376218 -166689 -105064 -137587 489246 -309268
10489 -153964 -228041 144675 -100857 -91163 -111074 -166681 -93186 381543 172037 555531 241370
10477E13338j63876c9292p6324b6316C1025J20892Q2370a92761h1655D9584e4667
10465F7699c18336a9637B39399d6915a4613l1491N506j63970a1742k6624A19170
10453B9060n513b11396B62773b68148c0749F0498a22680N0534A58555J5156N4816
10442B28527h2611a7427q3255l6158q1769J05782B6086A287N8730a72643j76749
10431c49392A9161a46236n9153e774j5152j8147o5058B15551B5433a59098A10708
10419b51743J04961k00377B87259N249I0808b4024A38242J11622a2963j92631
10409b05594D1278a51458H0485a7503C3655a17805p3947F9769a82494c719l05240
10398c08959A12761K054J70590G9746M9670b83794A03850Q0597N2319B3904R7372
$$ plain form
10477 513338 349462 -39292 -115616 -26316 31025 151917 234287 -192761 -81655 49584 -54667
10465 67699 -318336 -19637 239399 -46915 -14613 -46104 -40598 -204568 -11742 -38366 119170
10453 29060 23547 -211396 262773 -268148 -30749 60498 -122680 -72146 158555 173711 228527
10442 228527 -82611 -17427 -100682 -136840 -218609 -112827 26086 1287 60017 -172643 -349392
10431 -349392 19161 -146236 -205389 -5774 -20926 -39073 -104131 215551 25433 -159098 110708
10419 -251743 -146782 -347159 287259 292508 90808 -24024 138242 249864 -12963 -205594
10409 -205594 41278 -151458 80485 -17503 33655 -117805 -191752 69769 -182494 -3719 -308959
10398 -308959 112761 114815 285405 79746 129416 -283794 103850 184447 236766 23904 121276
10387A21276K7914e786l4722A3833J58508a28654A74790A6239K83912a9194B72707
10375C85693I4724e4817B87898A1163O6038K78651j6848j16730J64835J21253
10365E08362A39631K75888J40364B34981N7948j34384J69353b08351A14744N3807
10355A68551a56090G1140M35117j62087L75142j19370k44823K91207k38230j80653
10345B27443o4243N35195A69842m024H2610B3344K78604m3980o8551I3304i6663
10333A98220g7998I3491H729J76880a05390D2129b18926j9832B03212H8863J44184
10322B33047L8190I4359J46028d8958j64374A25271C4697c4822B96616L8776F5070
10310H1730b3008n894j29157c7524I6856M9981o4975d5637D0802f9721C18155
$$ plain form
10387 121276 149190 -5786 -40508 13833 172341 -128654 174790 16239 300151 -19194 272707
10375 385693 94724 -54817 287898 11163 77201 355852 339004 222274 387109 508362
10365 508362 139631 415519 555883 234981 292929 158545 327898 -208351 114744 168551
10355 168551 -156090 71140 506257 344170 719312 599942 355119 646326 408096 227443
10345 227443 163200 698395 169842 165818 82610 23344 301948 257968 189417 93304 -96663
10333 198220 -77998 93491 8729 185609 -105390 42129 -218926 -238758 203212 88863 233047
10322 233047 271237 94359 240387 -48958 -213332 125271 34697 -34822 296616 335392 65070
10310 81730 -23008 -28902 -158059 -37524 96856 146837 81862 -45637 40802 -69721 318155
10298d8806A97565J01535a72139q9855i8490R683A56662a93759R2801k3360k8912
10287a53230G8680b33329L5940i1892K6901C4931b04785e9167j13099C75478d648
10275a92348L178l44912A79499a89819M6012o481A28816c2206C2060a18723C96847
10263B45741b72472J22922B39805Q5444j54649K25426j04075O6483e8913D14738
10252A26682A740a35r39j08819m9241J8219d6630j06300A5638a6269l6292j7429
10240f9990A90043b08966R6133j27537A3254L3525i1975A13970n5295K32114b54846
10228d94639K12208J08400C30204G0066b94285a01793E1948J30389a68650A24903
10217E0248R1976a22094D2085i9741M4761q4156A02254i8644o2191E6318c9208
$$ plain form
10298 -48806 197565 299100 -172139 -261994 -98490 -88807 156662 -193759 -100958 -124318 -153230
10287 -153230 78680 -233329 -197389 -91892 -64991 34931 -204785 -59167 -172266 375478 -4648
10275 -192348 -189170 -534082 179499 -189819 -143807 -150288 128816 -32206 32060 -118723 396847
10263 245741 -272472 -149550 239805 325249 170600 396026 291951 358434 -58913 414738
10252 126682 1740 -135 -1074 -109893 -159134 -140915 -46630 -152930 15638 -16269 -52561 -69990
10240 -69990 190043 -208966 -112833 -240370 13254 46779 -91975 113970 58675 290789 -254846
10228 -494639 -282431 -174031 330204 70066 -294285 -101793 51948 182337 -168650 124903
10217 50248 142224 -122094 42085 -99741 -54980 -139136 102254 -98644 -160835 56318 -39208
10205b31977N2594l5325b5485A29348h9137b7594B05227b707l0943G7522J42926
10194B20448D5154a75739A69969M3572H9185P7164b43118B03914d36349B08982
10183F3998a9402k7965k87303E4125c15127F4331b6814k15197j72423b2694j62242
10172a84936A0050a48906B08697b54010a05631o0503l605h3242k32857G5292L7318
10161A12610A5211a09260m9509a3876I6967f9667C51483G330M7137a09127A3242
10149A8669a28754l66736d0475A05111J00149l5158a79657d6070j23422j42785
10139c12277J11055I3980l8347J78627q4523a51820B3202b18778A90304m8550
10129A41754b89665h8824j46054i4544A50237K44063e5238M396j64851q2456f1212
$$ plain form
10205 -231977 -179383 -214708 -25485 129348 -89137 -27594 205227 -2707 -33650 77522 220448
10194 220448 45154 -175739 169969 213541 89185 166349 -243118 203914 -436349 208982
10183 63998 -19402 -47367 -334670 54125 -315127 64331 -26814 -242011 -414434 -22694 -184936
10172 -184936 10050 -148906 208697 -254010 -105631 -166134 -169739 -83242 -316099 75292 112610
10161 112610 15211 -109260 -158769 -13876 96967 -69667 351483 7330 54467 -109127 13242
10149 18669 -128754 -495490 -40475 105111 205260 170102 -179657 -46070 -169492 -312277
10139 -312277 -201222 93980 55633 234260 149737 -151820 23202 -218778 190304 141754
10129 141754 -289665 -88824 -234878 -94544 150237 394300 -55238 -50842 -215693 -298149 -61212
10117d0580j09485c9575l20165f0628a70j58539g5989l8858B95352n8050a19495
10105c9325k31801a25491n1430o1180A90856a93869C64463a07784n737A02671
10094e2519B3210J49094D0851d99940A91429A4292c43803e7827b0864o8170m2382
10083a31416B16573c58186N1526a26351q7769B06557r5974A5606c47721a69458
10072a16159d8692A09546b97580L9952f3270k10637A26405i4935j2339H8879L4598
10061A23477R5290f3123j99615A2265f7857D4182e3005E6533K4313l3165f7076
10049A84402a76675e1069j2007k18738a13459A70093B6645b09449L1617F4753
10038H7582f6741o5317o8995N9881L0416C3490c01087b8576j2190a8259o2416
$$ plain form
10117 -40580 -150065 -39575 -359740 -60628 -170 -158709 -75989 -114847 295352 237302 -119495
10105 -39325 -271126 -125491 -176921 -238101 190856 -193869 364463 -107784 -113521 102671
10094 -52519 23210 172304 40851 -499940 191429 14292 -343803 -57827 -20864 -89034 -131416
10083 -131416 216573 -358186 -306660 -126351 -214120 206557 110583 15606 -347721 -169458
10072 -116159 -48692 109546 -297580 -257628 -63270 -273907 126405 -94935 -107274 88879 123477
10061 123477 218767 -63123 -262738 12265 -67857 44182 -53005 56533 80846 47681 -67076
10049 184402 -176675 -51069 -63076 -281814 -113459 170093 26645 -209449 -177832 64753
10038 87582 -66741 -132058 -201053 -141172 -110756 33490 -301087 -28576 -40766 -18259 -80675
10027h0675k41854f0990b5120j10249j74104H8293f7843q8052A20399d6433j57239
10016b03672A6174i2734B1107a43902D8489l88J27232c06938a41989e2058F3280
10004I0479a76170A25966K0002f1021K4832F2629a3534A74299C9875J11768c8744
9992a41226k48017F6347b46813a2120A07147b5024k23166o5253C38377A14758
9981B64461a45463O9678C0306a13266M7986p7170k27857a3567j46176j31685R4555
9970a96873j26160J02865j77088h2262j45747a06873A93581d7615k8684l55146
9960d31445a81300A53694A5395b81396J276e716j03448d1681k4294A48115J43522
9949B91637A45280h3261j42896E1490c10374B79024b86552j1053A42060c02048
$$ plain form
10027 -80675 -322529 -60990 -25120 -135369 -309473 88293 -67843 -155895 120399 -46433 -203672
10016 -203672 16174 -92734 21107 -143902 48489 48101 175333 -306938 -141989 -52058 63280
10004 90479 -176170 125966 145968 -61021 -36189 62629 -13534 174299 39875 151643 -38744
9992 -141226 -389243 66347 -246813 -12120 107147 -25024 -248190 -313443 338377 114758
9981 264461 -145463 -75785 30306 -113266 -65280 -142450 -370307 -13567 -159743 -291428 -196873
9970 -196873 -323033 -220168 -397256 -82262 -228009 -106873 193581 -47615 -76299 -431445
9960 -431445 -181300 153694 15395 -281396 -280120 -5716 -109164 -41681 -65975 148115 291637
9949 291637 145280 -83261 -226157 51490 -310374 279024 -286552 -297605 142060 -302048
9938c64445K4514B91143g2139H3610g2871J671k3318A34798b8602r8872L59n0964
9926a78079l1847J00905O877M4344g998C8451o352q975b30573b80j45728A87814
9913D2735J47876C1882A1607e184j18384j64256M3024g7443r4547j30038a40722
9901a22057G8609h64k74268g7649k87371B04030i0038I3650b14454d9288j10557
9890a59845H724J79854a33020n284D9893p763M1408I021a84938L6366k37504J20194
9878b65882A72307c16100a34148I7549k126J2364b54705M4041g3791k5063l9954
9867a38808e4569j95986C0705a71422k14803a35411B10632b4380n55030A05881
9856B10401e2652k732a9456B44225A05312e8769C0865c34885A77747a79268A75562
$$ plain form
9938 -364445 -339931 291143 -72139 83610 -72871 -71200 -94518 134798 -28602 -127474 -127115 -178079
9926 -178079 -209926 -109021 -102144 -57800 -7998 38451 32099 23124 -230573 -280 -146008 187814
9913 42735 190611 31882 11607 -5184 -123568 -287824 -244800 -77443 -171990 -302028 -140722
9901 -122057 78609 -864 -275132 -77649 -365020 204030 -90038 93650 -214454 -49288 -159845
9890 -159845 8724 188578 -133020 -138304 49893 42130 83538 9021 -184938 -148572 -386076 -265882
9878 -265882 172307 -316100 -134148 97549 95423 107787 -254705 -210664 -73791 -98854 -138808
9867 -138808 -54569 -250555 30705 -171422 -386225 -135411 210632 -24380 -579410 105881
9856 210401 -52652 -55384 -19456 244225 105312 -58769 30865 -334885 177747 -179268 175562
9844f0929B6879L0696c27646R0934a3201k39082O7858g5487B72483K9335A11059
9832G4548a11722r9098R4044i923j11205A44392a47271O8396k50989A42889a88157
9820f6380j16125J8099k9403d2r6293I4846j3737g6133D2170d7365j51583d5740
9807F6792b69817J01723B5423b6805j05205n5324C8704a31713l61638F0661c0117
9795D0636c10979e1896E8352l731d17179b9459j4238k34174A74318o30b16961
9783f082q4221F7742a76598L9561j73008F8538a48193B00308a71098j15366B21845
9771B27584i3008G8146b06574c779B29435f8146j71136I5268M7604E2385K3500
9760G5885A8930a57733g0473m4206n6186C6496a52474J802C15741a19432l4782
$$ plain form
9844 -60929 26879 57575 -327646 -236712 -13201 -252283 -184425 -75487 272483 301818 111059
9832 74548 -111722 -210820 -116776 -9923 -121128 144392 -147271 -78875 -329864 142889 -188157
9820 -66380 -182505 -164406 -193809 -42 -96335 94846 81109 -76133 42170 -47365 -198948 -45740
9807 66792 -269817 -168094 25423 -26805 -132010 -187334 38704 -131713 -493351 60661 -30117
9795 40636 -310979 -51896 58352 54621 -417179 -29459 -43697 -277871 174318 173688 -216961
9783 -6082 -90303 67742 -176598 -137037 -310045 68538 -148193 200308 -171098 -286464 221845
9771 227584 -93008 78146 -206574 -3779 229435 -68146 -239282 95268 142872 52385 75885
9760 75885 18930 -157733 -70473 -114679 -170865 36496 -152474 -150672 315741 -119432 -154214
9749a54214F2076g0294k55603a21755c4775l07532A814P4232a49074E3419K7300
9738H0719h4156A62771e5876G9835c42723G813L0503J70597n6107b29064B64730
9726H0218B4812J03124o2016B2608a2243q0518q5947B59489a16639A07057D1643
9714e2695j72381R6269D4175e6403j92365c7156A1550Q6334a22006j52804K5760
9703b49050D38685A47862b45489B12646M586A5891i0706k34812B65741g415A31223
9691A48765k6303b80691A9058d1633J1415k26191i1536j6187G5202c82207I2062
9679b05108O2996l66706F7629J63451c03906p7311J81519i1228i339k80239J27636
9668a61942h0527L2185A13863b730o9375j85971D6723A1788K25911e7521q5714
$$ plain form
9749 -154214 62076 -70294 -325897 -121755 -34775 -342307 1814 76046 -149074 53419 80719
9738 80719 -84156 162771 -55876 79835 -342723 7813 38316 208913 152806 -229064 264730
9726 80218 24812 127936 65920 22608 -12243 -92761 -178708 259489 -116639 107057 41643
9714 -52695 -225076 -128807 44175 -56403 -248768 -37156 11550 97884 -122006 -274810 -249050
9703 -249050 438685 147862 -245489 212646 217232 15891 -90706 -325518 265741 -7415 131223
9691 148765 122462 -280691 19058 -41633 -30218 -256409 -91536 -107723 75202 -382207 92062
9679 -205108 -142112 -508818 67629 231080 -303906 -381217 -199698 -91228 -9339 -289578 -161942
9668 -161942 -80527 -48342 113863 -2730 -72105 -258076 46723 11788 237699 -57521 -143235
9657a43235j97070g1088o1926B2833q572J03670a11665j80355a04351I0344a0367
9645a29363i375j46781O3794k78046g0074G1659A3776a86603A00966g5548j55700
9634b31248A55570C2763a89755H3654b02984i5662r3775o4169h8461K6756A93372
9622F4516N1655L1245o5153c90541J26417D9906b69000A7225O6876h4454o5835
9611a50289E6362K21153d08651H3441a66822d6971C05511b3909j27797H7367h8244
9599a6758k60456M7909j78964f1137N23E594a53936p2643A02156d79084g7909
9587a1749k0960q4484j87979k83F6631j2321a54852F5757a77219d7990G9599a24709
9574d1143j58486O0168d9559j9663k28328f3853j1123A65028b49720a00719q94
$$ plain form
9657 -143235 -340305 -71088 -133014 22833 14261 117931 -111665 -292020 -104351 90344 -10367
9645 -129363 -9375 -156156 -92362 -370408 -70074 71659 13776 -186603 100966 -75548 -231248
9634 -231248 155570 32763 -189755 83654 -202984 -95662 -189437 -253606 -88461 -61705 193372
9622 64516 116171 147416 82263 -390541 -264124 49906 -269000 17225 84101 -84454 -150289
9611 -150289 56362 277515 -408651 83441 -166822 -46971 305511 -23909 -151706 87367 -88244
9599 -16758 -277214 -229305 -408269 -61137 -60614 5594 -153936 -226579 102156 -479084 -77909
9587 -11749 -32709 -117193 -305172 -305455 66631 54310 -154852 65757 -177219 -47990 79599 -124709
9574 -41143 -199629 -139461 -49559 -69222 -297550 -63853 -74976 165028 -249720 -100719 -101613
9563a01613o7099j00008A74656M2957c67885h9685E8883i9577K5822l5848j9076
9552a28679d4196j53060A86606b1694j55127G0375J99235b46067l30535A84952
9541B22413q5137d8259A34867l3338m1241c0861B4505Q6237a4932j69280o2800
9530b47012q7861N928g1731A53627B5570L28825c03381e7839G8694a58740G9790
9518a19938H6920m1597c1290k97608l1636A26045a18754J5472j53197A4329a05817
9506c27715A6413J45180c07739f644n6847l01533i7787B67039H2100b1959j47087
9495a69046l0641N5491F7329d4389k84634A75644H083Q1395d6014A5133b72182
9483h3380q6039q775b6482j04775j30271C881c78356E9235a038n678C5711a54418
$$ plain form
9563 -101613 -168712 -268720 174656 217613 -367885 -89685 58883 -99577 -73755 -109603 -128679
9552 -128679 -44196 -197256 186606 -21694 -176821 70375 269610 -246067 -576602 184952
9541 222413 137276 -48259 134867 101529 60288 -30861 24505 110742 -14932 -184212 -247012
9530 -247012 -334873 -328945 -71731 153627 25570 354395 -303381 -57839 78694 -158740 79790
9518 -119938 86920 45323 -31290 -328898 -360534 126045 -118754 -103282 -256479 14329 -105817
9506 -327715 16413 161593 -307739 -6644 -63491 -365024 -97787 267039 82100 -21959 -169046
9495 -169046 -199687 -144196 67329 -44389 -329023 175644 8083 89478 -46014 15133 -272182
9483 -83380 -169419 -178194 -26482 -131257 -261528 3881 -378356 59235 -1038 -6716 35711 -154418
9470d9748j45990L2458A8851g6163k1046A79477e1083b5227j60410K8184E0915
9458B54932l2348M0552C458c62395Q1332f2540o8780A82567b13429o7704I8661
9446b24083a11310q7770C11731d6214j92129A11296f450o6495R145j24571d6726
9434d8565k75782B56939b11503A55954E7825a55307P3859j39543o39B82857j20985
9423A61872H0042b95477A90878n6936c00737J12680Q1747j50625j89281a29654
9412a82278A00813J34267b15905b2014k34761J05722P1678k00092d3597n9889
9402a03486C9898L12849D5306b5821j68903d8169k39801B70662a92420C21468
9391f8773A72604c10619H3234h1311F528i0040A61452b35415P1563n7637f5874
$$ plain form
9470 -49748 -195738 -163280 18851 -76163 -97209 179477 -51083 -25227 -185637 -157453 50915
9458 254932 222584 263136 3458 -362395 -281063 -62540 -131320 182567 -213429 -281133 98661
9446 -224083 -111310 -199080 311731 -46214 -238343 111296 -6450 -72945 -63800 -188371 -46726
9434 -48565 -324347 256939 -211503 155954 57825 -155307 -81448 -220991 -221630 282857 161872
9423 161872 80042 -295477 190878 133942 -300737 -188057 -106310 -256935 -446216 -129654
9412 -182278 100813 235080 -215905 -22014 -256775 -151053 -79375 -279467 -43597 -103486
9402 -103486 39898 352747 45306 -25821 -194724 -48169 -287970 270662 -192420 321468
9391 -68773 172604 -310619 83234 -81311 6528 -90040 161452 -235415 -163852 -221489 -65874
9379F4246b47717a00547C3854i407k70076d5454r3692N9229J812a7654n9974j964
9367g9592j365n5622r0930N4061Q3465B4264J7637b52368h648k22536a7126E5483
9354b62063f6449l42838B78507a12733K5888k56645q310A06068b29788G0118j9802
9343E0316l427f3765I917a92354A77424c7951F4211a37713D2432c5345A66757
9331A23362a48468C08097d7747A11727d69477A79627a87371E0161a48099B02792
9320B5017i1581A19640a84977N6777C35049a46014C8596i6975A37971j8654b10301
9308c23399a5875p1931A24701O1912r1946a67779k40184B89958c00815c81j37132
9297a37513K4366A8065a53624A4002A160b98575H7201A2476c9795k38792A50106
$$ plain form
9379 64246 -247717 -100547 33854 -9407 -279483 -45454 -139146 -79917 -78105 -17654 -77628 -79592
9367 -79592 -80957 -136579 -227509 -173448 -89983 24264 41901 -252368 -8648 -231184 -17126 55483
9354 -262063 -66449 -409287 278507 -112733 -86845 -343490 -351800 106068 -229788 70118 50316
9343 50316 46889 -63765 9917 -192354 177424 -37951 64211 -137713 42432 -35345 166757
9331 123362 -148468 308097 -47747 111727 -469477 179627 -187371 50161 -148099 202792
9320 25017 -91581 119640 -184977 -128200 335049 -146014 38596 -96975 137971 119317 -210301
9308 -323399 -15875 -87806 124701 186613 94667 -167779 -407963 289958 -300815 -381 -137513
9297 -137513 -113147 18065 -153624 14002 1160 -298575 87201 12476 -39795 -278587 150106
9285c59215J50137B39745A6778g0773c217E6623Q5568b31792G7657b17100m1719
9274b58819h1404j11261a1904A07572i3120j51159A28976f6237m44444b22563
9263b36605J08058k8119r4227B783b29545j05565h832k16082Q0701H3205a82104
9251E6948J05243e8817j08752k1523n3966a7277A93206e4547m37990B02343a82106
9239c41709A10810d2042j99833O1158B05447c78261A32076i1869j08250B90837
9228E343J1408p055f3218k14019C79025a41718O9357A078J95665L3581d4391j80160
9216b24551j50312J12883K630p6655f2605F5508c63492A32021b12525P3407M3819
9205i5299k91165b0274A43089i0569D3693b61016f5682I7557P5273e2810l6718
$$ plain form
9285 -359215 -209078 239745 16778 -70773 -3217 56623 142191 -231792 77657 -217100 -258819
9274 -258819 -81404 -192665 -11904 107572 -93120 -244279 128976 -66237 -510681 -222563
9263 -236605 -128547 -156666 -250893 2783 -229545 -335110 -8832 -224914 -144213 83205 -182104
9251 56948 162191 -58817 -167569 -189092 -243058 -17277 193206 -54547 -492537 202343 -182106
9239 -341709 110810 -42042 -241875 -180717 205447 -378261 132076 -91869 -200119 290837
9228 5343 16751 9696 -63218 -277237 379025 -141718 -72361 1078 196743 230324 -44391 -224551
9216 -224551 -374863 -261980 -259350 -336005 -62605 65508 -363492 132021 -212525 -139118 -95299
9205 -95299 -386464 -20274 143089 -90569 43693 -261016 -65682 97557 172830 -52810 -89528
9194h9528B67731a29568B5310b2360r9448A04371c60665B3446d2860J2223A41777
9182A57648d30359a83932r8646A62317C1685b51739G0216M832i2969p8600j16235
9171b87804h8885k263L1591q056A04790J78047a1504k35556L2777j80723C8751
9159a14475c3260A72392b53891B93647b12269H5474i856A26208J1813b91837c1337
9147e2213E7502b58386R1847E1164a8161B1670K8434a50685e2737K1040d965n9318
9135f4283A59169C9831a9165A47317b36826A76383b69411f4767K3123A80489a29354
9123B70159a18554r456A30484a08089I2476i0373k21357B1042a75662B3033a28569
9111b51614k9524c9482B42211c03685c4779k00584F4986b70566o099C37574A0162
$$ plain form
9194 -89528 267731 -129568 25310 -22360 -121808 104371 -360665 23446 -42860 -30637 141777
9182 157648 -430359 -183932 -282578 162317 31685 -251739 70216 75048 -92969 -171569 -287804
9171 -287804 -88885 -91148 -59557 -67613 104790 282837 -11504 -247060 -214283 -395006 38751
9159 -114475 -33260 172392 -253891 293647 -212269 85474 -9856 126208 138021 -291837 -31337
9147 -52213 57502 -258386 -166539 51164 -18161 21670 50104 -150685 -52737 -31697 -4965 -64283
9135 -64283 159169 39831 -19165 147317 -236826 176383 -269411 -64767 -41644 180489 -129354
9123 270159 -118554 -128010 130484 -108089 92476 -90373 -311730 21042 -175662 23033 -128569
9111 -251614 -281138 -39482 242211 -303685 -34779 -235363 64986 -270566 -276665 337574 10162
9099i6914j91097b3718k25979a04077C19656A54108b73478C7369K757A5021a28545
9087a45819O8569o1654I3875K07370a32534B19010F0784J06583b62808a22426
9076c94802j2556d1575k07082C6857e4987A77877b1366A35289J28863a52019j04834
9065b56853e9859G4582b1807D1923K61086I8530M0674f0751A30796M1677a02898
9053a5417j82485R8524l98021c7417J2924m69367O1043e4688j70821B88710F1881
9041A80194b57002R5129D803c1882j00739b8705D8682f1376j9096J5466b1658
9029c1975j45611I546f3031k19698A47038b7470J1394A68907a44355j51261N7941
9018b37675A4107J042L3755a79062A95582E5877M7474J09c25992J37233G5740
$$ plain form
9099 -96914 -288011 -23718 -249697 -104077 319656 154108 -273478 37369 40126 15021 -128545
9087 -145819 -77250 -138904 93875 301245 -132534 219010 60784 167367 -262808 -122426
9076 -394802 -407358 -41575 -248657 36857 -54987 177877 -21366 135289 264152 -152019 -256853
9065 -256853 -59859 74582 -21807 41923 303009 98530 139204 -60751 130796 172473 -102898
9053 -15417 -197902 -99378 -497399 -37417 -24493 -493860 -432817 -54688 -225509 288710 61881
9041 180194 -257002 -161873 4803 -31882 -132621 -28705 48682 -61376 -80472 -65006 -21658
9029 -31975 -177586 9546 -63031 -282729 147038 -27470 -16076 168907 -144355 -295616 -237675
9018 -237675 14107 15149 48904 -179062 195582 55877 103351 103460 -325992 -188759 75740
9006b34906H3430a06395A90216f3992a3822j41070b7461j57425E4616d3531B46410
8994E9333L17992j03280A00782b50345b9711k32832c8930m03172A99972J4471
8984B14443a49740M558A52961j8516a80217A87421E3120a6718m7192j18086o3962
8973b45958K4592A03076a49970O6685K7505A5843a98659j98250B25671A07930
8962b02804B3621a00022M8629K0379j91946g1097K5207j55843L2788f6883o8492
8951a35375j33522j51024g7355j54922j67409c6150j65290M2197A72543c08279
8940b07479j35208d1716C61491J35775A02212O2098K86714A33960a00333C316
8929i0097a8400C2977L0482a1253D35829L67478K125654M710838J0562368F090931
$$ plain form
9006 -234906 83430 -106395 190216 -63992 -13822 -154892 -27461 -184886 54616 -43531 246410
8994 59333 377325 274045 100782 -250345 -29711 -262543 -38930 -442102 199972 214443
8984 214443 -149740 -145182 152961 134445 -180217 187421 53120 -16718 -63910 -181996 -245958
8973 -245958 -221366 103076 -149970 -83285 -55780 15843 -198659 -396909 225671 107930
8962 -202804 23621 -100022 -51393 -31014 -222960 -71097 -45890 -201733 -168945 -66883 -135375
8951 -135375 -268897 -419921 -77355 -232277 -399686 -36150 -201440 -159243 172543 -308279
8940 -207479 -342687 -41716 361491 497266 102212 164310 451024 133960 -100333 3316
8929 -90097 -18400 32977 63459 -11253 435829 803307 2928961 7639799 18202167 6090931
8918A756198q35400K2682D35260A35858n5386C3579g3312C85338L4133I6530L40751
8907D37281I0125C1479J64736d27794e5965A38409Q4097o1586i7677F0068b68822
8895A93545g3715j13225j6589A57235F94e2681k27146a01519j00431O3142k48755
8884c87563D9171a48733k70345A35158D2985c59535j66418b06218r5536d8242
8873G0356d34064A27350a50157K3296o4051B5617a90040A96982b57205g7591C00371
$$ plain form
8918 1756198 920798 943480 435260 135858 80472 33579 -73312 385338 419471 96530 437281
8907 437281 90125 31479 196215 -427794 -55965 138409 222506 160920 -97677 60068 -268822
8895 193545 -73715 -186940 -203529 157235 694 -52681 -279827 -101519 -201950 -138808 -387563
8884 -387563 49171 -148733 -419078 135158 42985 -359535 -525953 -206218 -301754 -48242
8873 70356 -434064 127350 -150157 -126861 -190912 25617 -190040 196982 -257205 -77591 300371
$$ [...]
##END NTUPLES=NMR SPECTRUM
##END=
