##TITLE=AC1540_ROEFFECT0011_8214838_SN4dJS9b3Q
##JCAMPDX= 6.0         $$ Bruker NMR JCAMP-DX V2.0
##DATA TYPE= NMR SPECTRUM
##DATA CLASS= NTUPLES
##ORIGIN= BRUKER
##OWNER= Administrator
$$ 1.72 TOPSPIN		Version 2.1
$$ 2013-10-11 19:22:49.082 -0700  Administrator@X
$$ Compression mode = diff/dup
##.OBSERVE FREQUENCY= 400.02188249412
##.OBSERVE NUCLEUS= ^1H
##.ACQUISITION MODE= SIMULTANEOUS (DQD)
##.ACQUISITION SCHEME= undefined
##.AVERAGES= 64
##.DIGITISER RES= 22
##SPECTROMETER/DATA SYSTEM= spect
##.PULSE SEQUENCE= noesygpps1d.comp
##.SOLVENT NAME= COFFEE_meoh
##.SHIFT REFERENCE= INTERNAL, COFFEE_meoh, 1, 14.96115
##AUDIT TRAIL= $$ (NUMBER, WHEN, WHO, WHERE, PROCESS, VERSION, WHAT)
$$ ##TITLE= Audit trail, TOPSPIN		Version 2.1
$$ ##JCAMPDX= 5.01
$$ ##ORIGIN= Bruker BioSpin GmbH
$$ ##OWNER= Administrator
$$ $$ E:\/data/COFFEE/nmr/AC1540_ROEFFECT0011_8214838_SN4dJS9b3Q/12/pdata/1/auditp.txt
$$ ##AUDIT TRAIL=  $$ (NUMBER, WHEN, WHO, WHERE, PROCESS, VERSION, WHAT)
(   1,<2013-10-11 19:22:44.097 -0700>,<Administrator>,<X>,<go>,<TOPSPIN 2.1>,
      <created by zg
	started at 2013-10-11 19:11:14.299 -0700,
	POWCHK enabled, PULCHK disabled,
       configuration hash MD5:
       C8 4E 4E 5D D3 5C D8 9E 9F 52 82 E0 59 8A DE 15
       data hash MD5: 64K
       15 56 1C 5F 64 1D 48 81 A2 07 58 E3 59 B5 58 1B>)
(   2,<2013-10-11 19:22:47.129 -0700>,<Administrator>,<X>,<proc1d>,<TOPSPIN 2.1>,
      <Start of raw data processing
       efp LB = 0.3 FT_mod = 6 PKNL = 1 PHC0 = 0 PHC1 = 0 SI = 128K 
       data hash MD5: 128K
       7E 75 A0 B7 EF FD 35 3E 7E 45 C3 D0 E4 15 CD 3D>)
(   3,<2013-10-11 19:22:48.097 -0700>,<Administrator>,<X>,<proc1d>,<TOPSPIN 2.1>,
      <pk PHC0 = -81.74377 PHC1 = 0 
       data hash MD5: 128K
       3C 7F 72 CB 6F F3 C5 01 61 24 F6 D9 20 D4 48 08>)
(   4,<2013-10-11 19:22:48.472 -0700>,<Administrator>,<X>,<proc1d>,<TOPSPIN 2.1>,
      <abs ABSG = 1 
       data hash MD5: 128K
       AA 7C 84 FF 32 58 BB 10 90 CC D5 27 16 C6 74 B4>)
(   5,<2013-10-11 19:22:48.582 -0700>,<Administrator>,<X>,<proc1d>,<TOPSPIN 2.1>,
      <abs ABSG = 2 
       data hash MD5: 128K
       9D B1 9A 28 E3 B3 01 71 02 B0 F5 44 14 A9 1B 0E>)
(   6,<2013-10-11 19:22:48.707 -0700>,<Administrator>,<X>,<proc1d>,<TOPSPIN 2.1>,
      <abs ABSG = 3 
       data hash MD5: 128K
       1C 79 3C DF CB 5D 22 AA 4D C2 BB 53 FA 58 7C 36>)
(   7,<2013-10-11 19:22:48.785 -0700>,<Administrator>,<X>,<proc1d>,<TOPSPIN 2.1>,
      <abs ABSG = 4 
       data hash MD5: 128K
       52 B3 CA DA FB 50 8E 18 13 20 8A 62 D9 5B 9C 28>)
(   8,<2013-10-11 19:22:48.894 -0700>,<Administrator>,<X>,<proc1d>,<TOPSPIN 2.1>,
      <abs ABSG = 5 
       data hash MD5: 128K
       FF 4B C7 3F 06 75 33 AA 7F 1B F7 B6 7D 02 49 D0>)
$$ ##END=
$$ 
$$ $$ hash MD5
$$ $$ 2E AA C5 EB 78 E1 42 BA C6 A0 ED 85 E3 F7 9C 8E
##$RELAX= 
##$RELAX= 
##$RELAX= 
##$RELAX= 
##$RELAX= 
##$RELAX= 
##$RELAX= 
##$RELAX= 
$$ Bruker specific parameters
$$ --------------------------
##$DU= <E:\>
##$EXPNO= 12
$$ [...]
##$TP07= 0
##$TPNAME0= <>
##$TPNAME1= <>
##$TPNAME2= <>
##$TPNAME3= <>
##$TPNAME4= <>
##$TPNAME5= <>
##$TPNAME6= <>
##$TPNAME7= <>
##$TPOAL= (0..7)
0.5 0.5 0.5 0.5 0.5 0.5 0.5 0.5
##$TPOFFS= (0..7)
0 0 0 0 0 0 0 0
##$TUNHIN= 0
##$TUNHOUT= 0
##$TUNXOUT= 0
##$USERA1= <user>
##$USERA2= <user>
##$USERA3= <user>
##$USERA4= <user>
##$USERA5= <user>
##$V9= 5
##$VALIST= <valist>
##$VCLIST= <CCCCCCCCCCCCCCC>
##$VD= 0
##$VDLIST= <DDDDDDDDDDDDDDD>
##$VPLIST= <PPPPPPPPPPPPPPP>
##$VTLIST= <TTTTTTTTTTTTTTT>
##$WBST= 1024
##$WBSW= 4
##$XGAIN= (0..3)
0 0 0 0
##$XL= 0
##$YL= 0
##$YMAX_a= 6059907
##$YMIN_a= -12459184
##$ZGOPTNS= <>
##$ZL1= 120
##$ZL2= 120
##$ZL3= 120
##$ZL4= 120
##$ABSF1= 14.96115
##$ABSF2= -5.597032
##$ABSG= 5
##$ABSL= 3
##$ALPHA= 0
##$AQORDER= 0
##$ASSFAC= 0
##$ASSFACI= 0
##$ASSFACX= 0
##$ASSWID= 0
##$AUNMP= <proc_prof1d_extract.lims>
##$AXLEFT= 0
##$AXNAME= <>
##$AXNUC= <1H>
##$AXRIGHT= 0
##$AXTYPE= 0
##$AXUNIT= <>
##$AZFE= 0.1
##$AZFW= 0.1
##$BCFW= 0
##$BC_mod= 0
##$BYTORDP= 0
##$COROFFS= 0
##$CY= 15
##$DATMOD= 1
##$DC= 0
##$DFILT= <>
##$DTYPP= 0
##$F1P= 0
##$F2P= 0
##$FCOR= 0.5
##$FTSIZE= 131072
##$FT_mod= 6
##$GAMMA= 0
##$GB= 0
##$INTBC= 1
##$INTSCL= 1
##$ISEN= 128
##$LB= 0.3
##$LEV0= 0
##$LPBIN= 0
##$MAXI= 10000
##$MC2= 0
##$MEAN= 0
##$ME_mod= 0
##$MI= 0
##$NCOEF= 0
##$NC_proc= -2
##$NLEV= 6
##$NOISF1= 0
##$NOISF2= 0
##$NSP= 0
##$NTH_PI= 0
##$NZP= 0
##$OFFSET= 14.96115
##$PC= 1
##$PHC0= -81.74377
##$PHC1= 0
##$PH_mod= 1
##$PKNL= yes
##$PPARMOD= 0
##$PPDIAG= 0
##$PPIPTYP= 0
##$PPMPNUM= 2147483647
##$PPRESOL= 1
##$PSCAL= 4
##$PSIGN= 0
##$PYNMP= <proc.py>
##$REVERSE= no
##$SF= 400.020009576933
##$SI= 131072
##$SIGF1= 0
##$SIGF2= 0
##$SINO= 400
##$SIOLD= 131072
##$SPECTYP= <>
##$SREGLST= <1H.CDCl3>
##$SSB= 0
##$STSI= 131072
##$STSR= 0
##$SW_p= 8223.68421052631
##$SYMM= 0
##$S_DEV= 0
##$TDeff= 65536
##$TDoff= 0
##$TI= <>
##$TILT= no
##$TM1= 0
##$TM2= 0
##$TOPLEV= 0
##$USERP1= <user>
##$USERP2= <user>
##$USERP3= <user>
##$USERP4= <user>
##$USERP5= <user>
##$WDW= 1
##$XDIM= 131072
##$YMAX_p= 410728119
##$YMIN_p= -11449
##$CURPLOT= <Network HP LaserJet P1505>
##$CURPRIN= <$Network HP LaserJet P1505>
##$DFORMAT= <normdp>
##$LAYOUT= <+/1D_H.xwp>
##$LFORMAT= <normlp>
##$PFORMAT= <normpl>
##$SURQMSG= 1
$$ End of Bruker specific parameters
$$ ---------------------------------
##NTUPLES= NMR SPECTRUM
##VAR_NAME=  FREQUENCY,     SPECTRUM/REAL,   SPECTRUM/IMAG
##SYMBOL=    X,             R,               I
##VAR_TYPE=  INDEPENDENT,   DEPENDENT,       DEPENDENT
##VAR_FORM=  AFFN,          ASDF,            ASDF
##VAR_DIM=   131072,        131072,          131072
##UNITS=     HZ,            ARBITRARY UNITS, ARBITRARY UNITS
##FACTOR=    0.0627417313425164, 1,          1
##FIRST=     8223.62146879497, 1196,         -61062
##LAST=      0,             3457,            -60854
##MIN=       0,             -11449,          0
##MAX=       8223.62146879497, 410728119,    0
$$ Real data points
##PAGE= N=1
##DATA TABLE= (X++(R..R)), XYDATA
$$ [...]
65248 145739 145867 144911 143389 141729 140186 139081 138487 137894 136811 135570 134903 134864 134833 134562 134549 135254 136572
65231 136572 138131 139487 139960 139001 136990 135040 133768 132818 131811 131021 130758 130765 130772 131023 131668 132153 131931 131393
65213 131393 131350 131868 132282 132280 132214 132363 132521 132495 132494 132802 133422 134201 135013 135648 135726 134934 133331 131379 129712 128774
65193 128774 128606 128979 129744 130878 132181 133316 134355 135961 138610 141821 144576 146424 147773 149154 150681
65178 150681 152279 153949 155545 156583 156653 155893 154859 153992 153372 152933 152691 152758 153347 154798 157400 160951 164617
65161 164617 167519 169566 171484 173941 176834 179619 182087 184527 187238 190317 193917 198384 204008 210871
65147 210871 218935 228107 238201 249203 261536 275664 291329 307506 323296 338521 353334 367617
65135 367617 381044 393420 404705 414967 424533 433800 442496 449382 453108 453286 450501 445528 438968
65122 438968 431454 423598 415555 406878 396961 385518 372670 358775 344179 329078 313687 298574
65110 298574 284568 272112 260908 250426 240539 231378 222835 214718 207313 201242 196630 192780 188879
65097 188879 184747 180761 177309 174448 171951 169514 167084 165065 164006 163939 164189 164018 163338 162610 162095 161500
65081 161500 160433 159001 157739 156983 156531 156033 155514 155324 155616 156112 156432 156516 156647 157100 157797 158308 158292 157977
65063 157977 157998 158608 159327 159689 160095 161351 163438 165357 166349 166648 166793 166791 166445 165970 165659 165250 164223 162630
65045 162630 161047 159824 158863 158078 157517 157051 156447 155816 155452 155138 154121 152065 149568 147417 145654 143738
65029 143738 141449 139205 137526 136512 135914 135483 135098 134667 134091 133428 133010 133200 133976 134887 135514 135861 136198
65012 136198 136695 137400 138443 139981 141986 144287 146815 149538 152191 154339 155813 156905 158044 159423 160956
64997 160956 162408 163468 163884 163711 163355 163238 163439 163706 163827 163937 164452 165710 167661 169968 172392 174999
64981 174999 177896 180874 183455 185238 186125 186262 185899 185275 184486 183429 181897 179744 176941 173619 170141
64966 170141 167023 164580 162706 161072 159495 157986 156523 154953 153161 151236 149456 148143 147433 147119 146788
64951 146788 146272 145847 145889 146389 146954 147265 147425 147806 148579 149367 149495 148759 147867 147762 148497 149212 149357 149430 150103
64932 150103 151120 151669 151574 151448 151699 152010 151856 150987 149315 146919 144411 142755 142378 142771 143277 143891 144963
64915 144963 146435 147825 148865 149740 150751 152049 153654 155474 157326 159135 161109 163506 166300 169303
64901 169303 172583 176447 180978 185839 190744 195896 201757 208446 215558 222518 228886 234324 238564 241610
64887 241610 243824 245566 246796 247245 246923 246158 245098 243454 240950 237824 234617 231542 228256 224254 219398
64872 219398 214153 209434 206039 204040 202737 201440 200144 199302 199050 199014 198825 198443 197870 196849 195089 192657
64856 192657 189973 187477 185321 183277 180893 177863 174348 170907 168095 166096 164659 163276 161564 159709
64842 159709 158445 158279 158735 158689 157637 156331 155972 156927 158430 159417 159452 158964 158801 159519 160966 162552 163950
64825 163950 165374 167112 169051 170948 172982 175558 178514 181037 182726 184443 187619 192747 198964 205177
64811 205177 211158 217296 223741 230306 237062 244341 251966 258855 263728 266027 265962 263919 260168 255055 249114
64796 249114 242878 236673 230607 224711 219150 214330 210610 207810 205192 202199 199100 196651 195238 194584
64782 194584 194178 193680 192939 191992 191197 191067 191811 193217 195131 197882 201933 207173 212743 217773 222254 227074
64766 227074 233108 240356 248065 255584 262838 269974 276865 283131 288388 292386 295224 297616 300523 304145
64752 304145 307584 309899 311162 311987 312383 311799 310054 307329 303234 296910 288417 279173 270495 262373 254239
64737 254239 246281 239201 233189 228001 223844 221253 220104 219548 219053 218754 218636 218122 216907 215512 214533 213812
64721 213812 212950 212325 212908 215103 218294 221596 224726 228110 232385 237746 243422 247795 249462 248344 245545
64706 245545 242177 238617 234868 231066 227358 223693 220060 216643 213463 210229 206888 203996 202058 200770
64692 200770 199487 198225 197513 197358 197146 196759 196987 198416 200458 202063 202986 203870 205335 207556 210597 214559
64676 214559 219363 224762 230677 237266 244619 252625 261071 269545 277198 282909 285920 286246 284411 280905
64662 280905 275949 269672 262466 255091 248345 242577 237642 233323 229646 226656 224109 221633 219148 216996
64648 216996 215714 215737 217210 219988 223931 229161 235784 243305 250782 257812 265082 273568 283423 293984
64634 293984 304599 314933 324555 332832 339422 344513 348330 350597 350667 348141 343303 336975 329947 322570
64620 322570 314925 307241 299857 292731 285446 277863 270509 264028 258563 253935 250163 247463 245929 245478
64606 245478 245852 246402 246263 245190 244046 244020 245504 247941 250384 251855 251669 250087 248385 247606 247367 246525
64590 246525 244762 242792 241191 239878 238790 238213 238278 238775 239661 241126 243103 245327 247983 251567 255866
64575 255866 259770 262372 263686 264090 263765 263002 262343 261857 260721 257991 253516 247854 241698 235643 230023
64560 230023 224629 219042 213518 209025 206063 203930 201566 198743 196075 194307 193889 194733 195942 196292 195514
64545 195514 194675 194806 195615 196165 196259 196378 196616 196655 196737 197692 199677 201563 202029 200935 199281 197954 196829 195152
64527 195152 192663 190161 188818 189056 190390 192246 194446 196793 198749 199930 200557 201056 201481 201678 201745 201982
64511 201982 202656 204106 206739 210499 214623 218411 222086 226472 231965 238246 244866 251661 258536 265225
64497 265225 271313 276399 280294 283183 285391 286853 287085 285766 282995 278833 273225 266774 261000 257107
64483 257107 254785 252838 250723 248764 247112 245319 243044 240518 238158 236167 234513 232848 230440 226854
64469 226854 222803 219757 218413 217986 217226 215788 214354 213814 214630 216733 219617 222611 225281 227568 229411
64454 229411 230458 230410 229594 228854 228732 228949 228976 228949 229600 231160 232858 233903 234623 236024 238469 241533 245092
64437 245092 249711 255715 262689 270278 278799 288645 299712 311903 325592 341020 357887 376234 397181
64424 397181 421971 450740 483095 519561 561584 610324 666284 729821 800902 878213 959252
64413 959252 1041349 1121978 1198364 1268011 1329952 1384646 1432249 1471552 1500646 1517914 1522236 1513262
64401 1513262 1492091 1461014 1421944 1375351 1320976 1259045 1190457 1116370 1038257 958169 878546
64390 878546 801792 730027 664779 606600 555340 510903 473374 442257 416252 394181 375695
64379 375695 360615 348023 336637 325874 315999 307312 299685 292889 286891 281676 276994 272430 267608
64366 267608 262290 256438 250321 244545 239871 236776 235028 233699 231806 229096 226276 224558 224904 227424
64352 227424 231289 235391 239242 243151 247498 252169 256824 261292 265301 268219 269565 269549 268624 266793 263917
64337 263917 260418 256963 253620 250073 246589 243874 241912 239788 236991 234199 232505 232459 234131 237322 241210
64322 241210 244353 245769 245860 245874 246614 247856 248730 248460 246974 245012 243446 242425 241438 240134 238541 236484
64306 236484 233470 229456 225204 221533 218587 216012 213350 210106 206059 201885 198954 198044 198657 199886 201420
64291 201420 203320 205352 207146 208732 210415 212306 214386 216777 219649 223112 227456 233169 240352 248379
64277 248379 256380 263791 270350 276039 281278 286606 291885 296373 299867 303042 306155 308226 308257 306704 304876
64262 304876 303348 301850 300355 299248 298548 297795 296727 295311 293151 289597 284523 278432 271801 264901 258148
64247 258148 251946 246172 240442 234892 230102 226259 223043 220345 218395 217075 215862 214659 214066 214527 215759
64232 215759 217264 218816 220197 221048 221425 222039 223430 225160 226208 226015 224906 223718 223200 223496 223926 223467
64216 223467 221645 218869 215834 212946 210435 208568 207353 206290 204860 203162 201760 200962 200560 200282 200219
64201 200219 200650 201615 202871 204230 205820 207900 210591 214006 218577 224846 232726 241386 250212 259634 270499
64186 270499 282829 295728 308401 320577 331778 340872 346732 348964 347722 343219 335876 326541 316100
64173 316100 305008 293584 282546 272680 263975 255585 246856 238148 230515 224760 220897 218271 216029
64160 216029 213652 211285 209592 209147 209838 210891 211513 211542 211529 212184 213814 216266 219332 222961 226975 230732
64144 230732 233421 234818 235607 236725 238433 240141 241072 240925 239894 238372 236779 235489 234683 234332 234386 234809
64128 234809 235310 235370 234867 234545 235369 237488 240174 242786 245377 248396 252282 257431 264021 271576 279232 286766
64112 286766 294953 304514 315038 325356 334663 342787 349635 355032 359041 361932 363795 364721 365505 367690
64098 367690 372587 380273 389660 399377 408598 417158 425011 431661 436325 438694 439236 438502 436403 432601 427388
64083 427388 421655 415910 409760 402492 393901 384408 374641 365015 355564 346136 336960 328931 322992 319109
64069 319109 316146 312990 309583 306656 304661 303259 301862 300377 299187 298566 298363 298333 298493 298879 299188 299085
64053 299085 298914 299643 301947 305703 310504 316263 323031 330652 339000 348284 358692 370025 382043 394883
64039 394883 408611 422589 435862 448023 459143 468925 476574 481515 483750 483507 481099 477169 472452
64026 472452 467123 460954 454237 447968 442840 438600 434696 431025 427600 423948 419336 413364 405930 396950
64012 396950 386621 375818 365793 357436 351007 346340 342922 339912 336575 332790 328931 325313 322034
63999 322034 319345 317709 317316 317753 318408 319182 320560 322909 325833 328417 330171 331561 333450 336170 339387
63984 339387 342811 346614 351081 356254 362197 369301 377873 387549 397447 406948 416067 425085 434160 443432
63970 443432 453195 463683 474856 486690 499638 514461 531456 550126 569866 590825 613834 639563
63958 639563 668116 699549 734490 774083 819600 872294 933412 1004063 1085178 1177793 1283254
63947 1283254 1403026 1538402 1690451 1859813 2046077 2247508 2461754 2686770 2920687
63938 2920687 3160894 3403664 3644775 3880074 4105223 4315192 4504367 4667418 4800358
63929 4800358 4900960 4968106 5000627 4997002 4956356 4879445 4768364 4625729 4454774 4259986
63919 4259986 4046847 3820722 3586456 3348916 3113018 2882823 2661060 2449791 2251051
63910 2251051 2066525 1897200 1743747 1606754 1485992 1379840 1286158 1203727 1132328 1071482
63900 1071482 1019667 974957 936067 902498 873797 848949 826554 805526 785438 766163 747426
63889 747426 728981 711028 693926 677515 661265 645247 630352 617214 605489 594753 585685 579583
63877 579583 576903 576962 579154 583704 590962 600559 611707 624044 637765 653128 670258 689296 710246
63864 710246 732524 755035 776976 798351 819443 839919 858826 875491 890053 902975 914273
63853 914273 923389 929566 932197 931064 926608 919754 911087 900257 886503 869720 850665 830136 808320
63840 808320 784946 759749 732728 704270 675093 645835 616745 588016 560338 534592 510997
63829 510997 489090 468616 449843 432753 416515 400269 384143 369122 356105 345336 336414 328572
63817 328572 321216 314469 308824 304024 298803 292372 285749 280877 278465 277329 275844 273401 270371 267317
63803 267317 264642 262567 260951 259230 256804 253544 249881 246522 244081 242721 242001 241218 240037 238688 237506
63788 237506 236504 235544 234687 234014 233205 231726 229620 227758 226986 227141 227284 226807 225883 224804 223455 221755
63772 221755 220123 218965 218025 216886 215942 216075 217240 218133 217658 216183 214901 214376 214266 214205 214307 214713 215148
63755 215148 215136 214526 213671 213113 213115 213548 214259 215393 217087 218897 219998 220069 219738 219966 221236 223431 226121 228777
63737 228777 231033 233004 235097 237328 239159 240236 240912 241781 243078 244929 247723 251694 256370 260973 265183
63722 265183 269019 272244 274587 276501 279027 282673 286854 290500 292879 293747 293159 291342 288568 285154 281715
63707 281715 279188 278093 277841 277333 276250 275235 274740 274381 273748 273237 273547 274710 276172 277671 279545 282225
63691 282225 285789 289973 294315 298239 301344 303774 306153 309028 312319 315335 317275 317825 317348 316450 315364
63676 315364 313908 312070 310418 309663 309916 310655 311411 312186 313072 313783 313896 313463 313053 313110 313458 313520 312804 311030
63658 311030 308054 304010 299465 295089 291075 287096 282918 278852 275487 273147 271681 270650 269599 268305
63644 268305 266920 265801 265160 264994 265396 266664 268908 271687 274291 276422 278495 281288 285309 290414 295953
63629 295953 301341 306497 311746 317435 323848 331324 340074 349838 360152 371022 382926 395987 409705
63616 409705 423916 439562 457884 478996 501791 525194 549006 573582 599251 626179 654269
63605 654269 682739 709973 734078 753620 767899 776829 780852 780838 777746 772256 764812 756009 746753
63592 746753 737780 728997 719526 708512 695765 681422 665265 646799 626035 603792 581195 559164
63580 559164 538454 519661 502901 487825 474315 462883 454126 447995 443935 441490 440433 440536 441651
63567 441651 443949 447713 452890 459113 466086 473675 481712 490005 498598 507813 518009 529358 541817
63554 541817 555271 569882 586353 605571 627878 652982 680710 711374 745001 780430 815448
63543 815448 847490 873989 892694 902538 904296 899993 891682 880955 869156 857376 846211 835906
63531 835906 826594 817954 808887 798086 784900 769229 750843 729458 705417 679660 652985 625851
63519 625851 598808 572465 546952 522015 497791 475016 454385 436180 420493 407195 395604
63508 395604 384876 374893 366216 358972 352434 346042 340249 335890 333100 331225 329518 327604 325465 323262
63494 323262 321084 318880 316826 315601 315766 316893 317861 318127 318154 318522 319310 320586 322732 325839 329374 332972
63478 332972 337018 341873 346902 350888 353225 354216 354374 353883 352674 350703 348167 345563 343292 341149 338553
63463 338553 335420 332331 329658 327080 324351 321983 320560 319774 318806 317467 316446 316597 318422 322003 326897
63448 326897 332220 337402 342843 349467 357706 367284 377829 389283 401721 415189 429762 445567 462858
63435 462858 482145 503856 527518 551519 574094 594282 611634 625576 635842 643332 649784 656645
63423 656645 664869 675629 690306 709572 733063 760098 790137 822424 855834 889289 921704 951247
63411 951247 975415 992482 1002582 1006987 1006655 1001956 993452 982318 969906 957201 944633 932024
63399 932024 918661 903582 885955 865254 841320 814443 785337 754917 724122 693817 664533
63388 664533 636229 608669 582280 558284 537666 520229 505068 491816 480935 472788 466961 462725
63376 462725 459836 458604 459391 462305 467279 474085 482241 491160 500622 511044 523220 537805 555033
63363 555033 574744 596507 619786 644225 669939 697475 727376 759687 793778 828501 862431
63352 862431 894042 921881 944752 961853 972803 977598 976638 970791 961338 949677 937033 924355
63340 924355 912225 900502 888035 873223 855253 834666 812464 788865 763357 735809 707015
63329 707015 678120 650075 623818 600420 580516 563855 549828 538348 529850 524513 521708 520049
63317 520049 517675 512673 503861 491428 476701 461163 445712 430678 416170 402336 389542 378431
63305 378431 369551 362788 357277 352051 346764 341790 337754 335007 333371 332212 330793 328710 326068 323252
63291 323252 320613 318346 316523 315039 313616 312021 310371 309027 308124 307371 306510 305795 305651 305864 305540 304124
63275 304124 302138 300612 299999 300054 300547 301519 302763 303661 303805 303457 303190 303379 304260 306053 308652 311429 313761
63258 313761 315626 317412 319338 321462 324072 327544 331790 336301 340870 345843 351472 357378 363001 368368
63244 368368 374136 380950 389016 398279 408733 420465 433530 447909 463538 480308 498086 516799
63232 516799 536492 557278 579207 602245 626274 651023 675987 700588 724519 747861 770767
63221 770767 793160 814870 835993 856893 877825 898764 919664 940686 961905 982760 1001901
63210 1001901 1017710 1029017 1035322 1036402 1031984 1022059 1007340 988900 967233 942083 913522 882856
63198 882856 851986 822115 793580 766770 742562 721714 704343 690181 678965 670451 664497 661369
63186 661369 661620 665418 672234 681378 692548 705645 720380 736343 753246 770854 788877 807098
63174 807098 825475 843974 862459 880793 898746 915767 931168 944714 956656 966999 975082 980099
63162 980099 981665 979579 973420 962762 947554 927986 904311 877161 847758 817363 786682 756108
63150 756108 726244 697735 670853 645717 622766 602470 584675 568733 554302 541574 530722
63139 530722 521553 513760 507128 501387 496178 491365 487154 483853 481603 480330 479797 479789 480416 482087 484963
63124 484963 488516 491968 495140 498599 503019 508582 514926 521414 527477 532911 537818 542194 545788 548552
63110 548552 550976 553560 556133 558101 559316 560269 561378 562463 563059 563025 562680 562402 562185 561564 560073 557795
63094 557795 555314 553127 551329 549903 548942 548400 547992 547601 547458 547716 548268 549240 551108 553912 556936 559742
63078 559742 563011 567614 573311 579200 585107 591609 598882 606532 614525 623317 633017 643315 654314 666488
63064 666488 679718 693390 707747 724068 743061 764079 786514 811021 838571 869111 902060
63053 902060 937528 976064 1017638 1061888 1109105 1159995 1214412 1271121 1328872 1387034 1445134
63042 1445134 1502535 1558838 1614084 1668273 1721141 1772617 1823127 1873107 1922492 1970940 2018373
63031 2018373 2064854 2109904 2152097 2189386 2219726 2241348 2252682 2252444 2240108 2216175 2181648 2137206
63019 2137206 2083241 2020854 1952479 1881171 1809360 1738455 1669492 1603776 1542865 1488187 1440725
63008 1440725 1400919 1368687 1343606 1325168 1313043 1307186 1307692 1314464 1326935 1344158 1365136 1389010
62996 1389010 1415072 1442851 1472185 1503002 1534913 1567193 1599228 1630809 1661861 1692053 1720874
62985 1720874 1747968 1773169 1796073 1815645 1830427 1839176 1841232 1836224 1823664 1803198 1775189 1740492
62973 1740492 1699535 1652223 1599147 1542391 1484496 1426963 1370304 1315144 1262403 1212503 1165372
62962 1165372 1121335 1081127 1044766 1011176 979338 949143 920791 894120 869101 846275 825915
62951 825915 807153 788670 770019 751659 733959 716857 700374 684743 669979 655884 642559
62940 642559 630394 619454 609337 599798 591161 583859 577805 572423 567204 562132 557618 554061 551486
62927 551486 549652 548449 547947 547979 548000 547606 546926 546251 545500 544429 543111 541818 540512 538887 536816 534367
62911 534367 531428 527795 523657 519497 515414 511070 506541 502684 500204 498676 497011 494728 492321 490401
62897 490401 489004 487894 487116 486919 487319 488012 488589 488639 487845 486372 485059 484767 485419 486049 485972 485553 485526 485907
62879 485907 486046 485599 485056 485229 486495 488504 490372 491251 490991 490227 489653 489303 488765 487891 486854 485661 484132
62862 484132 482412 481027 480333 480266 480631 481205 481523 481138 480321 480012 480798 482274 483640 484541 485095 485498 485897 486382
62844 486382 486822 486923 486602 486043 485274 484121 482669 481305 480027 478240 475554 472372 469366 466898 465265
62829 465265 464915 465792 466942 467464 467488 467609 467800 467726 467852 469196 471892 474873 477250 479331 481959 485458 489602
62812 489602 494158 498957 503695 508057 512062 516159 520997 527043 534162 541592 548608 555320 562532 570778
62798 570778 579793 589107 598766 609155 620331 632023 644344 658173 674572 693856 715570 739477
62786 739477 766424 797918 834852 876901 923272 973775 1028999 1089692 1156266 1228776 1307048
62775 1307048 1390621 1478522 1569071 1659996 1749040 1834526 1915104 1988905 2053332 2105861 2144763
62764 2144763 2168895 2177353 2169915 2147569 2112010 2064587 2006137 1937853 1861859 1780806 1697049 1612254
62752 1612254 1527536 1443882 1362462 1284420 1210337 1140216 1074209 1013042 957354 906922 861011
62741 861011 819356 782240 749634 720777 694796 671317 650312 631705 615366 601261 589332
62730 589332 579272 570548 562656 555360 548755 543087 538469 534788 531939 530024 529289 530004 532447 536711
62716 536711 542376 548638 555113 562400 571617 583474 597929 614418 632204 650837 670747 693293
62704 693293 719792 750519 784867 822296 862819 906722 954345 1006108 1062303 1122677 1186370
62693 1186370 1252341 1319763 1388041 1456490 1523750 1587454 1644849 1693968 1733848 1763436 1780938
62682 1780938 1784851 1775181 1752985 1719141 1674383 1620274 1559147 1493030 1423418 1352129 1281329 1212356
62670 1212356 1145223 1079785 1016892 958027 904257 855855 812525 773588 738240 706047 677079
62659 677079 651394 628556 607828 588690 571120 555509 542262 531184 521364 511956 502956 494809
62647 494809 487465 480405 473500 467100 461237 455557 450213 446044 443451 441769 440130 438403 436887 435698
62633 435698 434888 434530 434160 432702 429700 426161 423477 421791 420175 418155 416238 415009 414501 414621 415505 417169
62617 417169 419291 421691 424746 429013 434541 440691 446515 451331 455120 458581 462714 468290 475644 484764
62603 484764 495442 507425 520708 535737 553118 573085 595379 619781 646677 676901 710928
62592 710928 748276 787839 828756 870734 913490 956172 997488 1036125 1070798 1100229 1123524
62581 1123524 1140328 1150153 1151832 1144355 1128291 1105699 1078473 1047296 1012296 973993 933318 891364
62569 891364 849549 809473 772008 736883 703569 672209 643269 616788 592570 570790 551804
62558 551804 535553 521671 509932 500055 491291 482917 475025 468207 462537 457529 453058 449567 447167
62545 447167 445237 443280 441617 440850 441007 441627 442388 443215 443933 444229 443959 443255 442372 441595 441220 441427 442241 443794
62527 443794 446554 451088 457552 465551 474558 484374 495279 507900 523004 541163 562395 586181 611983
62514 611983 639742 669736 702048 736410 772573 810473 849854 889985 929986 969185 1006782
62503 1006782 1041367 1071309 1095700 1114479 1127561 1134305 1134210 1127794 1116468 1101709 1084685 1066568
62491 1066568 1048792 1032781 1019475 1009212 1002087 998452 998986 1004139 1013584 1026429 1041980 1060077
62479 1060077 1080542 1102475 1124170 1143630 1159182 1169864 1175375 1175596 1170124 1158394 1140158 1115595
62467 1115595 1085049 1049110 1009023 966579 923360 880314 838164 797721 759512 723523 689823
62456 689823 659193 632655 610450 591855 575969 562385 551154 542442 536259 532233 529611 527753
62444 527753 526729 527298 530133 535145 541525 548398 555386 562628 570283 578150 585781 592813 598917 603457
62430 603457 605539 604544 600402 593330 583590 571658 558366 544647 531178 518273 505971 494199 483083
62417 483083 473058 464344 456433 448577 440845 434099 428777 424394 420545 417641 416066 415236 414294 413278
62403 413278 412761 412629 412103 410951 409844 409432 409736 410572 411924 413708 415720 417950 420458 422837 424385 425048
62387 425048 425644 426851 428514 430256 432286 435119 438877 443349 448507 454478 461166 468277 475672 483387
62373 483387 491429 499829 508824 518681 529413 540898 553183 566452 580908 596998 615613 637581
62361 637581 662947 691211 722344 757131 796246 839339 885408 933803 984402 1036791 1089582
62350 1089582 1140664 1187910 1229627 1264541 1291621 1310098 1319772 1321354 1316266 1305846 1290696 1270939
62338 1270939 1246890 1219165 1188255 1154480 1118536 1081708 1045367 1010592 978320 949274 923352
62327 923352 899598 877326 856938 839055 823191 807974 792506 776706 760368 742752 723408
62316 723408 702785 681743 660918 640708 621309 602483 583846 565734 549265 535235 523401
62305 523401 513180 504455 497229 491076 485593 481015 477694 475280 473092 471069 469657 468877 468272 467844 468345
62290 468345 470385 473693 477499 481262 484892 488631 492939 498169 504109 510029 515420 520574 526308 533177
62276 533177 541102 549690 558815 568817 580146 592840 606475 620683 635606 651833 669945 690152
62264 690152 712224 735769 760772 787869 817888 851119 887303 926332 968559 1014264 1063172
62253 1063172 1114640 1167857 1221552 1273842 1322700 1366366 1403256 1432070 1452449 1465076 1470623
62242 1470623 1468904 1459480 1442617 1418936 1388486 1350998 1306992 1257957 1205448 1150693 1095114 1040445
62230 1040445 988026 938472 892230 849992 812228 778686 748671 721610 697224 675376 655967
62219 655967 638883 623963 611103 600320 591496 584097 577403 571030 565044 559605 554764 550589 547186
62206 547186 544534 542455 540766 539382 538383 538104 538956 540971 543677 546631 549840 553532 557842 562990 569332
62191 569332 576798 584673 592450 600519 609379 618544 627076 635017 643445 653082 663615 674409 685058
62178 685058 695025 703593 710552 716427 721793 726956 732527 739648 749252 761575 776734 795256 817669
62165 817669 843974 873851 906971 942741 980096 1017893 1055158 1090681 1122819 1150035 1171354
62154 1171354 1186101 1193811 1194909 1190950 1183419 1172446 1157265 1137800 1115147 1090494 1064187 1036149
62142 1036149 1006886 977720 950099 924817 901893 881134 862722 847182 834863 825617 818925 814093
62130 814093 810310 806807 803177 799375 795341 790814 785639 780119 774980 771094 769224 769792 772697 777377
62116 777377 783022 788614 792981 795190 795028 792907 789337 784715 779505 774187 768880 763294 757091 750056
62102 750056 741932 732508 722013 711144 700633 691030 682887 676754 672940 671535 672571 675688 679674
62089 679674 683025 685262 687311 690398 694958 700746 707477 715001 723238 732318 742527 753862 765947
62076 765947 778609 792231 807276 823749 841322 859758 879025 899235 920565 942944 965789
62065 965789 988498 1011290 1035111 1060518 1087175 1114508 1142094 1168928 1193003 1212318 1226056
62054 1226056 1234379 1237538 1235718 1229429 1219355 1205870 1189058 1168958 1145459 1118218 1087164 1052884
62042 1052884 1016173 977549 937671 897894 859713 823703 789433 756327 724241 693399 664363
62031 664363 638026 615119 595536 578397 562771 548196 534698 522534 511776 501908 492068 481998
62019 481998 472464 464378 457795 452138 447062 442562 438527 434890 432058 430528 430076 429971 430039 430895 432999
62004 432999 436061 439565 443364 447472 451732 456058 460699 465919 471549 477066 482005 486126 489312 491452
61990 491452 492437 492195 490766 488243 484548 479406 472779 465250 457719 450723 444273 438287 432849 427951 423351
61975 423351 418863 414660 411092 408280 405954 403643 400992 397998 395050 392716 391358 390798 390335 389247 387481
61960 387481 385803 385006 385060 385314 385480 385943 387028 388500 390045 391724 393555 395080 395971 396845 398880 402677
61944 402677 407894 413918 420398 427200 434344 442139 450946 460645 470613 480385 490075 500031 510310 520630
61930 520630 530703 540450 549918 558998 567272 574192 579461 583130 585333 586142 585801 584791 583469 581801
61916 581801 579695 577402 575399 574047 573575 574239 576247 579678 584615 591147 599050 607718 616590 625394 633807
61901 633807 641309 647646 652950 656957 658555 656747 651827 645053 637374 629056 620308 611503 602797 594175
61887 594175 585884 578313 571410 564766 558248 552013 545921 539566 532912 526267 519521 512109 503961 495907
61873 495907 488813 482797 477531 472879 468893 465587 463022 461336 460541 460589 461771 464538 468753 473634 478703
61858 478703 484342 491122 499080 508095 518486 530664 544513 559645 576061 593950 613019 632577
61846 632577 652302 672310 692333 711384 728462 743256 755790 765693 772242 775112 774707 771608 766066
61833 766066 758335 749384 740767 733600 728000 723748 721249 721325 724169 729007 734934 741675 749254 757191 764352
61818 764352 769586 772312 772518 770349 765749 758461 748348 735622 720753 704257 686720 668836 651134
61805 651134 633728 616613 600228 585377 572442 560975 550263 540147 531055 523361 516943 511373
61793 511373 506354 501938 498370 495755 493824 492003 489759 486962 483932 481070 478426 475736 472999 470766
61779 470766 469512 468780 467458 465080 462366 460148 458212 455750 452681 449877 448123 447411 447291 447396 447523
61764 447523 447685 448232 449488 451104 452219 452564 452972 454414 456808 459233 461131 462787 464548 466024 466352
61749 466352 465112 462749 460086 457607 455317 453108 450995 448959 446877 444788 443042 441926 441249 440566 439740
61734 439740 439029 438644 438518 438542 438830 439663 441287 443711 446528 448988 450531 451379 452378 454114 456322 458257
61718 458257 459550 460556 461892 463780 465914 467867 469399 470315 470294 469184 467355 465410 463542 461524 459291
61703 459291 457038 454666 451740 448299 445058 442363 439465 435424 430424 425538 421443 417993 414845 411790
61689 411790 408522 404745 400658 396827 393538 390705 388381 386787 385768 384723 383243 381380 379135 376217
61675 376217 372578 368836 365850 363980 362905 362075 361291 360900 361267 361988 361986 360694 358817 357453 356846 356607 356839
61658 356839 358133 360479 363064 365313 367392 369428 370970 371585 371397 370723 369757 368972 369240 370969 373481 375806
61642 375806 377872 380434 383927 387805 391040 393063 394105 394665 394727 393775 391671 389176 387146 385494 383494
61627 383494 380971 378505 376466 374588 372668 371004 369851 369006 368234 367611 367187 366766 366272 365826 365235 363941
61611 363941 361818 359519 357627 355855 353521 350467 347125 343910 340888 337893 334709 331295 327899 324738
61597 324738 321618 318242 314812 311797 309171 306551 304108 302449 301466 300262 298638 297618 297860 298446 298141
61582 298141 297111 296413 296295 296064 295358 294526 293844 293254 292883 292974 293205 292846 291749 290604 290026 289890 289763 289540
61564 289540 289439 289736 290640 292129 293729 294778 295103 295318 296247 298132 300467 302554 304135 305437 306635 307470
61548 307470 307611 307237 306902 306877 307037 307419 308404 310149 312305 314513 316775 319093 321135 322567 323334 323435 322845
61531 322845 321930 321406 321535 321817 321847 321904 322242 322369 321749 320796 320436 320839 321277 321122 320420 319507 318564 317562 316303
61512 316303 314596 312705 311414 311273 311958 312682 313042 313092 312949 312751 312748 312965 313013 312682 312410 312672 313213 313474 313513
61493 313513 313849 314566 315227 315618 315950 316383 316889 317554 318493 319492 320215 320682 321087 321295 321158 321263 322614 325388
61475 325388 328471 330502 331047 330749 330642 331367 332742 333998 334578 334574 334266 333615 332629 331800 331576 331670 331535 331321
61457 331321 331666 332641 333646 334326 334915 335642 336488 337569 339050 340585 341524 341847 342184 342728 342796 341854 340419
61440 340419 339538 339730 340732 341952 342892 343429 343854 344452 345016 345198 345332 346288 348232 350054 350482 349503 348376
61423 348376 348412 349926 352190 354212 355631 356867 358310 359571 359910 359273 358409 357977 358040 358490 359328 360284 360688
61406 360688 360127 358911 357638 356575 355707 355042 354571 354092 353359 352306 351095 350079 349739 350344 351597 352879
61390 352879 353905 354841 355775 356476 356802 356953 357136 357338 357609 358213 359277 360622 362160 364099 366425 368483
61374 368483 369477 369327 368723 368420 368739 369682 371200 373248 375687 378300 380903 383358 385501 387171 388508 390083
61358 390083 392459 395568 398838 402076 405821 410633 416413 422714 429299 435995 442451 448591 454848 461250
61344 461250 466625 469664 470686 471427 473055 475292 477553 479854 482135 483664 483956 483651 483653 483731 482780 480364
61328 480364 477336 474865 473344 472364 471421 470422 469651 469371 469522 469810 470072 470449 471321 473224 476661 481642 487398
61311 487398 492969 498226 504109 511751 521532 533053 545741 559315 573790 589125 604811 619868
61299 619868 633339 644672 653538 659650 663166 664947 665758 665274 662462 656999 649781 641936 633943 625839
61285 625839 617699 609523 601089 592293 583424 574894 566941 559727 553409 547975 543313 539559 537057 535835
61271 535835 535436 535350 535318 535190 534950 535061 536234 538576 541303 543626 545566 547706 550508 554193 558890 564418
61255 564418 570090 575223 579799 584241 588515 591780 593142 592605 591093 589537 588122 586532 584708 582916
61241 582916 581090 578704 575608 572538 570319 568881 567572 566158 564987 564366 564429 565404 567389 570023 573054
61226 573054 577088 582978 590457 598199 605361 612339 619859 628111 636999 646469 656214 665721 674970 684495
61212 684495 694399 703878 712123 719145 725323 730682 735159 739176 743437 748367 754099 760766 768478 777237
61198 777237 787055 797981 809890 822572 836060 850480 865489 880278 894210 907042 918440 927851
61186 927851 935007 940070 943160 944252 943601 941671 938495 933698 927282 919734 911260 901600 890803 879372
61172 879372 867372 854195 839622 824403 809340 794460 779453 764280 748910 733157 717213
61161 717213 701743 687073 672951 659450 647284 636779 627407 618840 611608 606070 601624 597741 594907
61148 594907 593626 593290 593020 592885 593139 592859 590668 586569 581873 577414 572929 568182 563653 559908 557137
61133 557137 555615 555960 558618 563432 569825 577236 585441 594756 605753 618568 632727 647867 664250
61120 664250 682321 702234 724137 748304 774483 801652 828943 856331 883912 911192 937718
61109 937718 963730 989318 1013467 1034866 1053307 1069444 1083519 1095127 1103895 1109522 1111460 1109348
61097 1109348 1103514 1094408 1082008 1066556 1049245 1031048 1011347 988934 964092 938467 913103 887927
61085 887927 863135 839662 817922 797283 777218 758111 740609 725017 711620 700794 692388 685664
61073 685664 680099 675673 672237 669392 667183 666186 666584 667803 669440 671963 676138 682229 690059 699412 710044
61058 710044 721540 733479 745710 758528 772639 788681 806504 825242 844429 864632 886555
61047 886555 910093 934902 961321 989820 1019920 1050717 1082304 1115709 1151531 1189549 1229550
61036 1229550 1271508 1314932 1359012 1403595 1449293 1496582 1545555 1596502 1649882 1705680 1763454
61025 1763454 1822869 1883507 1944535 2005619 2068040 2133920 2204579 2280675 2363561 2455023 2555768
61014 2555768 2665599 2785263 2917147 3064678 3232949 3430054 3666318 3952293 4299188
61005 4299188 4720982 5234049 5855364 6603779 7501272 8566514 9806056 11219629 12816710
60996 12816710 14610568 16567784 18551396 20330524 21677396 22481119 22785581 22736772 22508429
60987 22508429 22265676 22149652 22234204 22463021 22638290 22504012 21874156 20710931 19111557
60978 19111557 17241973 15275431 13357058 11586210 10012086 8644742 7474193 6483540
60970 6483540 5652541 4959120 4382692 3905521 3510904 3182563 2906766 2673269 2473516
60961 2473516 2299569 2145538 2008459 1886674 1778237 1681330 1594972 1518375 1450380 1390067
60951 1390067 1337104 1290750 1249089 1209784 1171253 1132958 1095235 1059108 1025578 994557 964981
60940 964981 936153 908435 882384 857939 834778 812834 791938 771540 751355 731909 713953
60929 713953 697591 682446 668416 655823 644958 635816 628168 621590 615544 609701 604093 598773 593515
60916 593515 588194 583369 580039 578621 578345 577919 576731 575225 574185 573953 574416 575331 576319 576860 576873 577142 578553
60899 578553 580864 582751 583187 582136 579814 576078 571039 565573 560483 555506 549762 542940 535544 528260
60885 528260 521615 515991 511302 506749 501393 494974 487800 480176 472374 464982 458619 453368 448943 445282
60871 445282 442441 440022 437367 434442 432007 430759 430582 430761 430652 430188 429999 431021 433728 437698 442042
60856 442042 446058 449382 451885 453836 455880 458428 461246 464010 466938 470400 474171 477624 480462 482683
60842 482683 484034 484156 483240 481913 480439 478534 475997 473042 469982 466949 463896 460527 456439 451804 447658
60827 447658 444902 443197 441530 439682 438284 437442 436254 433946 430724 427123 423197 418797 414157 409770
60813 409770 406022 403132 401037 399087 396331 392445 388051 383906 380173 376702 373508 370620 367824 364924
60799 364924 361995 359084 355996 352742 349877 348049 347350 347444 348035 348865 349518 349696 349656 349952 350693 351352 351425 351058
60781 351058 350927 351562 352907 354501 356022 357577 359467 361762 364226 366624 369001 371644 374802 378325 381563
60766 381563 383866 385311 386700 388594 390574 391749 391787 391055 389935 388541 387057 385837 385023 384406 383768 383064
60750 383064 382282 381444 380720 380142 379298 377809 376116 375201 375278 375301 374094 371525 368270 364822 361187 357308 353306
60733 353306 349337 345487 341822 338357 335047 331918 329155 326952 325339 324165 323157 322073 320877 319756
60719 319756 318848 318172 318042 319159 321768 324921 327257 328531 329660 331231 332756 333725 334563 335970 337937
60704 337937 340040 342261 344800 347395 349577 351470 353669 356359 359126 361678 364181 366764 369126 370837
60690 370837 371775 372163 372387 372767 373353 373962 374572 375452 376657 377669 378010 378018 378432 379265 379772 379600 379311 379475 379922
60671 379922 380315 380921 382094 383262 383099 380822 376899 372452 368279 364555 361172 358138 355702 354099 353185
60656 353185 352537 352039 352156 353297 355135 356922 358417 360056 362230 364893 367927 371310 374668 377194 378387
60641 378387 378514 377925 376316 373219 368986 364675 361018 358073 355829 354521 354112 353974 353454 352484 351422 350504
60625 350504 349739 349198 349142 349809 351069 352371 353212 353752 354691 356235 357518 357548 356540 355677 355610 355889 356015 356244
60607 356244 356954 357863 358428 358605 358718 358918 359230 359805 360633 361259 361307 361059 361067 361367 361632 361930 362801 364544 366860
60588 366860 369199 371191 372765 374139 375597 376976 377641 377321 376807 377278 378965 380960 382360 383139 383889 385179
60572 385179 387392 390800 395521 401523 408724 417023 426274 436446 447726 460181 473261 485791 496510
60559 496510 504688 510420 514386 517044 517887 515916 511083 504803 498574 492639 486593 480893 476795 474915
60545 474915 474767 475802 478088 481767 486540 492106 498560 506116 514909 525297 537813 552511 568771
60532 568771 585947 603662 621205 637197 650319 660034 666325 669218 669008 666421 661987 655527 646842
60519 646842 636664 626358 616860 608395 601119 595301 590813 587024 583490 580402 578153 576796 576184 576418
60505 576418 577897 581109 586649 595273 607542 623372 642252 664027 689185 718202 750881 786620
60493 786620 825050 865863 908043 949802 989547 1026522 1060292 1090001 1114485 1132884 1144887
60482 1144887 1150567 1150145 1143568 1130072 1108583 1078985 1042675 1001499 956672 909298 861389 815296
60470 815296 772195 732005 694748 661025 630996 603898 579114 556989 538002 521730 507230
60459 507230 494111 482628 472951 464809 457749 451386 445536 440316 435996 432485 429172 425487 421419 417316
60445 417316 413467 410189 408030 407417 408037 408823 408660 407185 405080 403582 403381 403905 403886 402761 401171 399966
60429 399966 399160 398228 397052 396064 395580 395424 395235 394817 394177 393514 393224 393659 394763 396088 397251 398285 399451
60412 399451 400775 401936 402661 403152 403942 405291 406921 408427 409712 410861 411805 412481 413184 414350 415985 417655
60396 417655 419059 420299 421588 423047 424853 427222 430097 433134 436103 439049 442023 444941 447765 450518
60382 450518 453002 454877 456165 457343 458745 460153 461223 462086 463255 465087 467460 469911 471994 473638
60368 473638 475214 477186 479644 482233 484444 485893 486602 487226 488708 491316 494291 496948 499794 503895 509346
60353 509346 515338 521709 529348 538672 548641 557922 566287 574111 581001 585825 587884 587369 584728 580230
60339 580230 574222 567317 560144 553137 546592 540721 535521 530685 525758 520554 515501 511350 508276 505453
60325 505453 501917 497724 493766 490572 487949 485715 483989 482618 481206 480064 480302 482451 485780 489635
60311 489635 494721 502248 512265 523722 535797 548296 561000 573561 586129 599292 613102 626592
60299 626592 638327 647084 652104 653243 651045 646323 639509 630547 619380 606301 591965 577328 563438
60286 563438 550961 539956 530289 522125 515759 511153 507891 505364 502790 499421 495075 490229 485248 479890
60272 479890 474017 468345 463802 460356 457197 453990 451209 449208 447626 445965 444197 442578 441260 440355
60258 440355 440005 440146 440365 440222 439609 438808 438326 438650 439931 441898 444205 446751 449436 451818 453428 454346
60242 454346 455059 455741 456030 455643 454848 454156 453756 453408 452836 452164 451960 452774 454588 456912 459528 462797 467011
60225 467011 471729 476153 479935 483172 485837 487809 489477 491744 495199 499617 504384 509181 514162 519729
60211 519729 526190 533445 540989 548475 556188 564619 573608 582343 590269 597544 604391 610405 614884 617686
60197 617686 619508 621332 623674 626206 627989 628212 626909 624860 622698 620267 616991 612724 607912 602949
60183 602949 597678 591809 585648 580037 575489 571586 567435 562610 557465 552699 548851 546146 544467 543375
60169 543375 542378 541263 540086 538916 537793 536853 536199 535679 535066 534366 533629 532588 531000 529364 528725 529599
60153 529599 531506 533669 535633 537129 538010 538658 539858 541880 544160 546227 548357 550921 553710 556505 559721
60138 559721 563792 568403 573150 578536 585341 593117 600306 606000 610874 616120 622057 627978 632903 636232
60124 636232 638066 639131 640208 641499 642722 643764 644984 646831 649386 652270 654783 656238 656451 655893 655221
60109 655221 654655 653926 652654 650572 647562 643728 639355 634676 629840 625186 621152 617700 614234 610420 606737
60094 606737 603832 601703 599995 598783 598484 599124 600258 601564 603081 604852 606686 608306 609528 610362 611065
60079 611065 611896 612690 612900 612110 610159 606788 601854 596024 590428 585251 579443 572336 564668 557353 550202
60064 550202 542802 535768 529871 524605 519033 513631 509750 507425 505245 502479 499859 498022 496589 495328
60050 495328 494967 496179 498707 502142 506652 512272 518216 523683 528774 533951 539061 543492 547018 549973
60036 549973 552830 555891 559075 561717 562954 562574 561159 559228 556677 553262 549097 544375 539091 533398
60022 533398 527800 522584 517390 511685 505414 498889 492305 485602 478615 471206 463491 456070 449745 444868
60008 444868 441190 438309 435965 433948 432212 431152 431233 432219 433250 433835 434278 434978 435863 436802 438050 439944
59992 439944 442434 445204 447983 450572 452890 455205 457973 461259 464562 467323 469328 470545 470941 470588 469640
59977 469640 468088 465897 463444 461399 459995 458697 456735 453762 450026 446198 443011 440735 439038 437584
59963 437584 436608 436541 437410 439087 441828 445805 450312 454237 457284 459946 462337 463917 464467 464456 464245 463702
59947 463702 462828 461979 461251 460405 459600 459356 459478 458852 456818 454037 451588 449770 448234 446664 444893 442889
59931 442889 441040 440020 440110 441117 443087 446403 450973 456148 461761 468406 476166 483830 489972 494200 496876
59916 496876 498295 498733 498669 498265 497143 495285 493738 493720 495386 498028 501128 504611 508315 511836 514857 517331
59900 517331 519445 521519 523705 525734 527372 529063 531543 534730 537760 540316 543120 546804 550997 554945
59886 554945 558378 561448 564544 568438 573783 580085 586008 591079 596252 602323 608748 614609 619694 623909
59872 623909 626569 627201 626296 624470 621654 617874 613923 610303 606302 601196 595656 590906 587177 584089 581882
59857 581882 580982 580902 580861 581133 582525 584882 587395 590130 593919 598937 604693 611362 619644 629037 637534 643463
59841 643463 646715 647896 647366 645607 643681 642605 642553 642944 642921 641662 638667 634007 628110 621465 614737 608727
59825 608727 603581 598362 592189 585648 580304 576819 574250 571169 566830 561300 555183 549314 544180 539529
59811 539529 534908 530409 526419 522909 519598 516583 514110 511963 509868 508272 507808 508016 507504 505543 502785
59796 502785 500301 498629 497850 497810 498019 497859 497185 496347 495630 495060 494699 494624 494702 494796 495025 495304 494944 493435 491453
59777 491453 490323 490552 491540 492575 493384 493796 493729 493545 493775 494500 495612 497450 500324 503609 506254 508173
59761 508173 510251 512996 516191 519868 524437 529644 534525 538830 543500 549205 555343 561092 566697 572979
59747 572979 580069 587349 594377 601340 608661 616360 623710 629627 633772 637143 641018 645354 648965 651207
59733 651207 652696 654164 655420 655815 655048 653188 650493 647580 645234 643672 642370 640833 639067 637101 634642
59718 634642 631512 627990 624435 620906 617344 613703 609849 605792 602086 599412 597717 596306 594886 593836
59704 593836 593342 593058 592846 593089 593869 594579 594854 595278 596670 599134 602240 605590 608710 610820 611367 610621 609358
59687 609358 608110 607021 606140 605489 604927 604216 603204 601893 600401 598763 596584 593132 588178 582508 577084
59672 577084 571914 566444 560892 556344 553373 551369 549432 547260 544950 542693 540924 540140 540252 540696 541348
59657 541348 542634 544507 546143 547127 548229 550432 553745 557461 561139 564724 568016 570517 571688 571141 568798
59642 568798 565021 560336 555058 549531 544585 541048 538760 536766 534610 532664 531074 529285 526968 524622
59628 524622 522740 521048 519032 516605 513838 510597 506938 503316 500033 496994 494281 492323 491086 489759
59614 489759 487685 485029 482241 479589 477620 477228 478608 480803 482873 484800 486699 487974 488110 487664 487613
59599 487613 488216 489263 490894 493256 495749 497565 498740 499961 501571 503408 505284 506895 507612 507108 505907
59584 505907 504585 502824 500067 496787 494123 492386 490874 489114 487365 485854 484380 482917 481797 481044
59570 481044 480140 478780 477397 476615 476557 476912 477380 477831 478243 478660 479086 479406 479513 479460 479364 479277 479275 479497 479928 480404
59550 480404 481018 482190 484092 486340 488661 491529 495695 501321 508050 515706 524400 534085 544664 556613
59536 556613 570903 587885 606237 623032 634959 639928 638063 631402 622621 613912 606635 601331 597811
59523 597811 595636 594712 595110 596214 596712 595881 594329 592942 591530 589053 584829 578932 571665 563360 554601
59508 554601 546118 538390 531654 526096 521658 517847 514150 510548 507249 504156 501016 497912 495194 493072
59494 493072 491648 491082 491271 491586 491493 491278 491682 492969 494833 497056 499574 501930 503454 504253 505486 508178
59478 508178 512016 515681 518334 520525 523587 528268 534050 539754 544542 548190 550679 552120 553047 554226
59464 554226 555909 557686 559248 560855 562822 565035 567354 570073 573580 577913 582987 588921 595717 602952
59450 602952 610206 617465 624669 631168 636115 639212 640647 640544 638884 635763 631304 625476 618404 610707
59436 610707 603274 596797 591705 588143 585725 583740 582005 581153 581661 583074 584739 586902 590413 595671 602630
59421 602630 611638 623355 637697 653629 670356 688187 707798 728938 750436 771584 793032 815664
59409 815664 838336 857250 868257 869860 863696 852627 839245 825971 815087 807930 804822 806130
59397 806130 812191 821371 829248 831105 825110 812474 795313 775516 755110 736054 719213 704325
59385 704325 691137 679954 671078 664378 659506 655964 652957 649767 646285 642810 639451 636290 633924 633090
59371 633090 633679 634663 635126 634984 634728 634853 635577 636814 638414 640549 643608 647525 651702 655941 660928 667281
59355 667281 674695 682672 691631 702442 715177 729123 743783 759065 774663 790111 805437 821012
59343 821012 836733 851967 866179 879023 889937 898373 904277 907644 907790 903919 896411 886690 875694
59330 875694 863198 848764 832626 815381 797441 779118 760862 743205 726668 711703 698382
59319 698382 686289 675073 664926 656138 648394 641095 634131 627780 622037 616664 611759 607721 604757
59306 604757 603039 603084 605287 609231 614162 620092 627723 637366 648579 660663 672600 682423 687553 686324
59292 686324 679006 667396 653805 640216 627745 616672 607105 599357 593440 588839 585373 583764 584622
59279 584622 587369 591080 595910 602651 611214 620631 630384 640652 651414 662435 674001 686513 699364
59266 699364 711359 722236 732600 742314 750270 755879 759525 761247 760354 756845 752003 746941 741604 735754
59252 735754 729942 724768 720072 715653 712049 709865 708867 708386 708190 708497 709568 711670 714957 719083 723400
59237 723400 727731 732357 737030 740797 743142 744564 745641 746137 745442 743224 739303 733513 726080 717548 707989
59222 707989 696947 684509 671768 659876 649247 639941 632029 625196 618769 612612 607272 602787 598224
59209 598224 592989 587865 584017 581595 580019 579029 578682 578758 579023 579738 581184 582860 583866 584111 584603 586486
59193 586486 589969 594132 597644 599891 601549 603845 607264 611297 615318 619084 622347 624742 626331 627623
59179 627623 628761 629337 629305 629424 630372 632012 633920 636046 638391 640593 642403 644182 646504 649508 652916
59164 652916 656310 659139 660939 661787 662081 661717 660023 656725 652342 647316 641411 634336 626274 617401 607591
59149 607591 597140 587199 578791 571753 565110 558191 551004 543977 537813 533244 530391 528498 526569 524101
59135 524101 521208 518461 516680 516297 516694 516671 515735 514474 513638 513511 514282 516151 518814 521633 524745 529201
59119 529201 535633 543450 551736 560213 568943 577843 587005 596748 606831 616344 624888 633121 641618 649952
59105 649952 657533 664547 671258 677033 680996 683215 684431 684923 684429 682950 680929 678652 675906 672255 667548
59090 667548 662346 657797 654646 652407 650140 647887 646436 645599 643950 640661 636417 631964 626895 620694
59076 620694 613926 607433 601100 594414 587604 581319 575749 570841 566837 563755 560906 557740 554674 552297
59062 552297 550251 547727 544579 541259 538040 535037 532542 530660 529090 527782 527243 527548 527752 527074 526019
59047 526019 525510 525533 525485 525288 525229 525203 524977 524781 524833 524776 524365 524168 524707 525484 525863 526434 528482 532414 537588 543371
59027 543371 549514 555871 562559 570115 578840 588428 598857 610826 624404 637965 649558 658729 665948
59014 665948 670997 673320 673435 672481 670553 666839 661343 655249 649671 645150 642244 641383 642112 643596 645830
58999 645830 649372 654022 658882 663658 668699 673730 677776 680519 682650 684666 686342 687560 688637 689569
58985 689569 689844 689332 688563 687974 687628 687779 688922 691095 693943 697609 702741 709462 717169 725637 735563 747657
58969 747657 761687 776661 791480 805333 818044 830177 842380 854620 866395 877478 887763
58958 887763 896508 902511 905128 904616 901515 896183 888806 879251 867052 852147 835511 818494 801694
58945 801694 785086 768912 753717 739678 726625 714610 703831 694323 686401 681003 678694 678569 679017
58932 679017 679344 679836 680593 681333 682121 683169 684053 684170 683827 683763 683676 682446 679899 677182 675163 673570 671952
58915 671952 670463 669313 668349 667564 667306 667699 668519 669837 672127 675638 680248 685986 692977 700986 709740
58900 709740 719622 731157 743957 757144 770731 785438 801078 816348 830524 844292 858518 873250
58888 873250 888507 905120 923983 944865 966293 986254 1002933 1015460 1024322 1030647 1034981 1037056
58876 1037056 1036537 1033262 1026893 1017177 1004643 990389 975202 959567 944387 930760 919055 909014
58864 909014 900658 894139 888695 882892 876152 869166 862587 856172 849408 842130 834269 825754 816870 808024
58850 808024 799116 789847 780614 772223 764726 757421 749996 742671 735221 726964 717900 708816 700087 691401
58836 691401 682778 674806 667629 660759 654156 648414 643659 639383 635691 633493 632985 633076 632931 633112 634503
58821 634503 637023 640109 643757 648418 654279 661035 667930 673917 678429 682105 685994 690062 693338 695517
58807 695517 697226 698502 698301 695999 692285 688043 683332 678013 672380 666554 660116 652899 645383 637834
58793 637834 629931 621656 613647 606174 598794 591648 586093 583227 582504 582551 582707 583133 584097 585867 588733 592441
58777 592441 596099 599203 602208 605595 608861 610988 611426 610103 606957 602031 595753 588752 581565 574678
58763 574678 568487 563073 558332 554297 550913 547686 544236 541061 539040 538326 538560 539855 542487 545633 547722
58748 547722 548259 548270 548753 549781 551366 553964 557712 562105 566894 572432 578856 585789 593019 600563 607965
58733 607965 614536 620337 625874 630873 634649 637654 641216 645583 649783 653602 657972 662967 667211 670035
58719 670035 672666 676500 681629 687768 695061 703144 710862 717804 724686 731432 736512 739166 740571 741588
58705 741588 740944 737066 730267 721563 710697 697117 681870 666651 651685 636191 620396 605425
58693 605425 591563 578088 564786 552426 541791 533095 526191 520628 515711 511029 506573 502111 497243
58680 497243 492454 489074 487510 486516 484921 483126 482079 481838 482106 483238 485714 489424 494365 501096 509601
58665 509601 518666 527382 536310 546179 556421 566059 574961 582889 588287 589574 587147 582811 577680 571781
58651 571781 565158 558143 550839 543312 535991 529174 522673 516631 511935 509030 507099 505297 504014 503997 505036
58636 505036 506496 508420 511117 514290 517462 520588 523467 525337 525912 525983 526210 526186 525463 524521 523876 523252 522566
58619 522566 522606 523775 525370 527106 530092 535039 540757 545796 550381 555279 559897 563140 565168 566740 567659
58604 567659 567486 566932 566965 567183 566568 565134 563466 561493 559231 557835 558234 559453 559931 559794 560203 561252 562387
58587 562387 564297 568514 575367 583945 593676 604358 615025 624497 632872 641132 649521 657592 665368 673082
58573 673082 680269 686552 692917 700818 710498 721495 734226 749571 767382 786905 808196 831711
58561 831711 857000 883212 910300 938158 965107 988848 1008513 1024307 1035640 1041329 1041385 1037155
58549 1037155 1029986 1021059 1012048 1004392 998023 991914 985445 978150 968955 957013 942669 926440 907917
58536 907917 887016 865250 844216 823799 803487 784358 767954 754164 742051 731768 723717 716876
58524 716876 710150 704418 700977 698777 695599 691208 686963 683015 678499 673962 670930 669270 667427 665079
58510 665079 663138 661380 658654 655351 653206 652528 651927 650809 649832 648862 646876 644072 641853 640525 639130
58495 639130 637698 637456 638674 640390 642416 645541 649653 653735 657849 663088 669548 676394 683929 693445
58481 693445 705017 717552 731001 746286 763026 779526 795041 809856 823183 833324 839981 844074
58469 844074 845263 842048 834519 824702 814053 802861 792116 783477 777248 772734 770547 772051 776621
58456 776621 782204 788681 797808 809588 821620 832471 842813 852656 860265 864527 865753 863602 857006
58443 857006 846807 835738 825068 813913 802420 792672 785573 779711 774360 770886 770063 770628 771659
58430 771659 773940 777861 782369 787008 792708 799665 806732 813654 821451 829860 836870 841460 844158 844353
58416 844353 840156 831867 822589 814248 805905 797050 789358 783654 778144 771459 764814 759455 754439 748671
58402 748671 742858 737951 733800 730674 729751 730881 732194 733089 735097 738696 742056 744240 746826 750780 754510
58387 754510 756750 758822 762300 766872 772131 779078 788247 798670 810217 824583 842514 862391 882730
58374 882730 903428 923287 939319 950248 958001 964160 967800 968595 969045 971513 975562 980127 985723 992647
58360 992647 999568 1005900 1013158 1022191 1031426 1039387 1046408 1052374 1055672 1056056 1055744 1056000 1055511 1053817 1053121
58345 1053121 1054842 1057485 1059960 1063871 1070450 1078341 1086504 1096185 1107903 1119735 1130802 1143189 1158145
58332 1158145 1173745 1188652 1204594 1222465 1239433 1252860 1263882 1274234 1282710 1287739 1290498 1292561
58320 1292561 1293397 1292860 1293112 1295351 1297752 1299256 1302005 1307383 1313246 1318029 1323955 1333020 1343462 1353472
58306 1353472 1364783 1379069 1394352 1408559 1423151 1439670 1456186 1470850 1485542 1502311 1519668
58295 1519668 1536076 1553469 1573418 1593461 1611235 1628728 1648469 1669159 1689131 1710339 1734604
58284 1734604 1759673 1783389 1808026 1836043 1865376 1893581 1922721 1955265 1988973 2020960 2053172
58273 2053172 2088802 2126875 2165410 2206157 2250987 2297352 2342637 2389303 2440406 2493919 2546894
58262 2546894 2601242 2659746 2720385 2780443 2842130 2908095 2975393 3040079 3103811 3169781 3236317
58251 3236317 3300923 3366480 3436954 3511090 3586706 3666705 3754218 3846533 3940689 4040220 4149395
58240 4149395 4266055 4387456 4517625 4661095 4815043 4975813 5147316 5334338 5533688
58231 5533688 5741115 5960775 6198312 6450996 6714864 6995059 7298556 7623375 7966218
58222 7966218 8333816 8735013 9168723 9631994 10132690 10681417 11278881 11925011 12632480
58213 12632480 13416787 14281682 15229995 16280097 17455794 18770491 20239809 21900279
58205 21900279 23797637 25969451 28461715 31352738 34741757 38732171 43454609 49093481
58197 49093481 55864747 63987280 73710557 85354657 99290501 115894572 135523098
58190 135523098 158433319 184634931 213874939 245845537 280202310 315923366 350397110
58183 350397110 379384163 398390746 404525151 397405787 378739706 351362865 318503340
58176 318503340 283296130 248340472 215406293 185476077 158993011 136047874 116464646
58169 116464646 99904654 85990736 74358343 64645511 56509756 49669499 43902981
58162 43902981 39015149 34836036 31242730 28149407 25474869 23140388 21090903 19291444
58154 19291444 17703988 16287716 15017459 13881029 12860549 11934004 11091564 10332591
58146 10332591 9648870 9026324 8459933 7951218 7493567 7074714 6691117 6345504 6032366
58137 6032366 5739579 5462723 5204990 4964733 4735609 4517616 4315892 4129409 3951892
58128 3951892 3782775 3626575 3482424 3344505 3211988 3088746 2974177 2863774 2757824
58119 2757824 2660361 2570373 2483023 2398692 2322033 2252793 2186071 2121031 2061066 2005900 1951630
58108 1951630 1898124 1848619 1802429 1755681 1708794 1665700 1625991 1585190 1542660 1502121 1464523
58097 1464523 1427413 1391211 1359155 1330848 1302459 1273471 1246917 1222990 1198736 1174116 1152122
58086 1152122 1132724 1112844 1092506 1074905 1059994 1043947 1025517 1007316 990249 972154 952584
58075 952584 933724 916031 897763 879161 862252 846456 829257 811229 795443 781947 767968
58064 767968 753572 741804 732948 723938 713956 705466 699066 692292 684255 676617 669325 660220 649661
58051 649661 640719 633878 626239 616932 608648 602686 597013 590497 584655 579810 573738 565667 557849 551702
58037 551702 545929 539611 533618 527866 520761 512502 505472 500229 494440 486747 478404 470236 461426 452278
58023 452278 444779 439322 434061 428334 423475 419458 414254 407569 401800 398143 394959 391077 387521 384836
58009 384836 381847 378315 375752 374463 372621 369374 366005 363080 359406 354794 350753 347486 343259 337858
57995 337858 333532 331254 329178 326164 323844 323679 324874 326749 330391 336208 342346 347198 351243 354993
57981 354993 357424 357857 357241 356240 354218 351272 349002 348058 347089 345212 343254 341501 338745 334875 332044
57966 332044 331740 332863 334009 335494 337681 339515 340297 341076 342776 344615 345647 346202 346659 346487 345550 344723
57950 344723 344190 342815 340046 336795 333744 330676 328043 327062 327507 327527 326591 326508 328702 332646 337741 344385
57934 344385 352172 359423 365624 372125 379414 386028 391190 395909 400198 401829 399495 394811 389546 383222
57920 383222 375227 366938 359716 352766 345031 337418 331212 325971 320913 316819 314651 313754 313155 313201 314264
57905 314264 315310 315478 315638 316712 317889 318236 318662 320499 323377 326166 328829 331675 334008 335203 336111
57890 336111 337850 340194 342463 344892 347776 350439 352375 354162 355992 356649 355332 353125 351220 349127
57876 349127 346109 342898 340277 337316 332859 327642 323176 319584 316228 313445 311957 311482 311506 312464 314576
57861 314576 316581 317290 317501 318763 321139 323832 327059 331531 336787 341743 346315 351007 355499 359107 362032
57846 362032 364804 367140 368569 369389 369765 368811 365980 362433 359566 357047 353865 350450 348129 347119 346584
57831 346584 346020 345162 343273 340050 336628 334183 332228 329698 326933 325005 323802 322457 321100 320476 320213
57816 320213 319140 317071 314834 312807 310720 308513 306080 302514 296957 289899 282518 275248 268172 262106
57802 262106 257789 254468 250736 246463 242642 239759 237660 236600 236986 238360 239817 241130 242363 242962 242565
57787 242565 242232 243459 246241 249347 252129 254838 257570 260268 263437 267639 272485 277256 282132 287774
57773 287774 294103 300510 306736 312527 317059 319855 321575 322857 323191 322181 320863 320347 320077 319048 317684
57758 317684 316733 315272 312008 307817 304705 302756 300440 297637 295835 295311 294570 292998 291754 291451 291036
57743 291036 289724 288218 287191 286189 284858 283829 283560 283524 283224 282939 282904 282872 282961 283808 285396 286845 287850
57726 287850 289233 291546 294151 296230 297782 299171 300581 302356 305020 308467 311826 314450 316313 317308
57712 317308 317033 315606 313825 312228 310668 308995 307342 305556 303120 299948 296597 293505 290628 287921
57698 287921 285560 283644 282143 281006 279784 277544 273956 270098 267267 265326 263142 260339 257531 255160
57684 255160 253253 252032 251642 251559 251468 252394 255652 261126 268008 276792 288817 304148 321967 343087 369835
57669 369835 402950 440650 481519 526416 576266 629114 680016 722491 749625 755926 740205 706445
57657 706445 661099 609990 557728 508174 463896 425633 393162 366162 343912 325226 309541
57646 309541 297282 288459 281701 275401 269114 263208 257927 253498 250341 248374 246685 244597 242569 241572
57632 241572 242042 243757 246014 247546 247165 245051 242679 241016 239585 237787 236132 235386 235268 234862 233765
57617 233765 232168 230376 228867 228255 228508 228672 227954 226652 225529 224827 224396 224233 224324 224381 224257 224280 224800 225791
57599 225791 227047 228153 228099 225777 221341 216414 212502 209826 207969 206675 205497 203526 200297 196453 192991
57584 192991 190415 188950 188768 189371 189522 188531 187046 186016 185433 184679 183419 181608 179260 176830 175135 174334
57568 174334 173712 172987 172889 173650 173932 172389 169567 167089 165500 164157 162849 162164 162288 162611 162676 162650 162736 162878
57550 162878 163126 163651 164328 164908 165599 166821 168351 169363 169481 169204 169104 169127 168955 168699 168872 169768 171068 172037
57532 172037 172064 171067 169489 167997 167165 167191 167674 167888 167582 167343 167888 169215 170871 172759 175015 177301 179035
57515 179035 180300 181746 183551 185245 186566 187632 188300 188355 188438 189634 191865 193781 194633 195076 195607 195525 194238
57498 194238 192412 190777 188753 185444 181294 177602 174907 172878 171364 170433 169711 168714 167681 167195 167128 166735
57482 166735 165675 164292 163069 162410 162696 163908 165369 166378 166822 166750 165851 164033 162054 160787 160179 159626
57466 159626 159067 158916 159234 159754 160508 161607 162563 162602 161602 160064 158277 156213 154224 153104 153276 154282
57450 154282 155129 154994 153862 152740 152841 154199 155500 155713 155336 155547 156699 158332 160125 161954 163406 164132
57434 164132 164490 165068 165743 165922 165432 164472 162963 160814 158639 157387 157328 158037 159137 160362 161175 161239 161092
57417 161092 161470 162105 162118 161582 161666 163067 165191 167149 168738 170179 171605 173187 175206 177578 179623 180595
57401 180595 180268 178972 177366 176164 175741 176022 176856 178270 180054 181526 182196 182382 182674 183192 183945 185424
57385 185424 187983 190989 193528 195724 198341 201221 203280 204117 204534 205133 205449 204921 203845 202770 201619
57370 201619 200017 198016 195985 194144 192706 192144 192815 194415 196141 197409 198218 198890 199585 200101 200192 200038
57354 200038 200166 200852 201887 203120 204733 206693 208393 209437 210351 211844 213652 214898 215425 216010 217268
57339 217268 219050 220900 222439 223239 223016 222140 221428 221298 221538 221941 222625 223658 224846 225937 226697 226827 226244
57322 226244 225413 224916 224735 224356 223487 222248 220843 219552 218841 218941 219477 220003 220629 221567 222470 223024 223839 225721
57304 225721 228182 229725 229671 228777 227979 227512 227438 228002 229062 229975 230465 230998 232025 233477 235228 237325 239481
57287 239481 241033 241767 242236 243067 244495 246770 250347 255366 261449 268252 275735 283808 292286 301300 311164
57272 311164 321797 332882 344581 357279 370530 383109 394331 404471 413769 421902 428728 434603
57260 434603 439624 443425 446178 448940 452576 457067 462265 468393 475297 482060 488069 493790 499908 506383
57246 506383 512907 519581 526551 533618 540782 548480 556677 564469 571351 578226 586408 596120 606746 618021
57232 618021 630190 643399 657674 673197 689866 706884 723394 739184 754258 768186 780602
57221 780602 792014 803443 815479 828230 841790 856108 870691 885013 898988 912601 925542
57210 925542 937792 950082 963130 976836 990851 1005438 1020894 1036519 1051085 1064130 1076060
57199 1076060 1087268 1098068 1109320 1122104 1136657 1152329 1168667 1185900 1204387 1224261 1245689
57188 1245689 1268897 1293830 1320256 1348124 1377310 1407178 1437016 1466890 1497486 1529091 1561241
57177 1561241 1593312 1624944 1656007 1686740 1717906 1750235 1783704 1817941 1853222 1890442 1930100
57166 1930100 1972005 2016039 2062513 2111555 2162735 2215584 2270013 2326047 2383565 2442584 2503531
57155 2503531 2566987 2633176 2701608 2770971 2839542 2905954 2969352 3028693 3082576 3130495 3173838
57144 3173838 3214756 3254352 3292881 3331402 3371757 3414656 3459039 3503901 3549639 3596798 3644411
57133 3644411 3690660 3734818 3777753 3820845 3865186 3911520 3960057 4010088 4060229 4109173 4156098
57122 4156098 4200654 4243029 4283969 4324480 4365571 4408496 4454938 4506620 4564935 4631223 4707046
57111 4707046 4793802 4892441 5004149 5131250 5277168 5446020 5642922 5874481 6148374 6472914
57101 6472914 6858231 7318256 7871251 8538869 9345859 10320661 11494862 12901027 14570590
57092 14570590 16531920 18806859 21406445 24328929 27559941 31071115 34817377 38737989
57084 38737989 42760809 46801464 50757305 54512743 57966694 61060915 63772739 66068235
57076 66068235 67858368 69002357 69356519 68829175 67408896 65162083 62210839 58702450
57068 58702450 54782809 50585226 46234057 41850138 37548100 33428568 29572330 26037244
57060 26037244 22855993 20036384 17566303 15420716 13567018 11969080 10591500 9402697
57052 9402697 8375228 7485089 6711978 6039325 5452819 4939314 4487648 4089305 3737083
57043 3737083 3423852 3143567 2892485 2668133 2467769 2288919 2130503 1992022 1872179
57034 1872179 1769496 1683620 1614734 1562195 1524965 1502733 1495406 1502344 1523482 1559575 1607986
57023 1607986 1657689 1691065 1692733 1656989 1587833 1494329 1386666 1274126 1163894 1060762 967778
57012 967778 886575 817033 757698 707136 664508 628770 598264 571552 547946 526931 507748
57001 507748 489922 473499 458357 443878 429657 415988 403352 391978 382096 373986 367498 362177
56989 362177 358265 356964 359217 364604 371858 380110 389286 399590 410870 422157 431490 436453 435274
56976 435274 427610 414489 397763 379380 360756 342781 326491 313257 303767 297246 292430 289174
56964 289174 288449 291077 297264 307106 320489 336469 353708 371755 391005 411151 430334 445908
56952 445908 455365 456722 449237 434216 414370 392119 369136 347311 328756 314384 303513 295441
56940 295441 290466 288954 290516 294881 302681 314575 330298 349294 371569 397052 424720 452969
56928 452969 480032 503117 517880 520280 509204 486855 456899 422920 388127 355147 325504 299559
56916 299559 277009 257254 239632 223860 210217 198924 189560 181424 174223 168021 162798 158553 155618
56903 155618 154342 154578 155919 158242 161572 165580 169763 174092 179030 184941 191948 200428 211102 224308
56889 224308 239448 255490 271990 289418 308344 328322 347623 363938 375222 380093 378049 369726
56877 369726 356734 340859 323533 306178 290533 278107 269607 265435 266301 272603 283554 298009
56865 298009 316193 339692 369651 405788 447234 493343 543252 595283 646810 693824 730606
56854 730606 751280 752840 736568 706589 667920 625819 585200 549283 519176 495346 478850 470664
56842 470664 470796 479010 495816 521968 557578 602462 656777 720519 792846 872445 957511 1043885
56830 1043885 1123345 1185005 1219260 1221122 1191368 1135906 1063592 983086 900910 821981 750700
56819 750700 690246 641273 602654 573716 554953 546733 548440 559335 579488 609295 648326 695097
56807 695097 747887 805362 865616 923910 971694 999325 1000994 977217 932961 874445 807877 739295
56795 739295 673537 613320 560090 515260 479646 452359 431685 417030 409029 407998 413409 424747
56783 424747 441677 463337 488610 517126 548633 580799 608531 626095 629637 617932 592119 555491
56771 555491 512759 468439 425620 386059 350679 319627 292399 268505 247929 230774 216748
56760 216748 205193 195363 186516 178000 169602 161766 155281 150609 147335 144319 140608 136318 132324 129044
56746 129044 125974 122576 119079 116099 113968 112804 112592 112709 112031 110232 108425 107762 107947 108029 108065 108856 110335
56729 110335 111468 111787 111943 112574 113553 114476 115093 115133 114556 114145 114971 117068 119403 121385 123560 126490 129751
56712 129751 132558 134809 136954 139182 141240 142826 143826 144219 143968 143066 141809 141008 141477 143028 144383
56697 144383 144632 144351 144668 145586 146096 145731 145068 144695 144516 144251 143913 143576 143264 143186 143561 144196 144718 145206 146026
56678 146026 147143 148237 149369 150843 152519 153941 155076 156119 156734 156396 155476 155018 155234 155154 154032 152274
56662 152274 150701 149688 149395 150099 151865 154326 157102 159986 162661 164777 166349 167526 168036 167573 166643
56647 166643 166181 166268 166149 165606 165361 165871 166754 167687 168925 170430 171432 171426 170852 170228 169385 168163 167161 167036
56629 167036 167494 167666 167185 166346 165414 164221 162416 159928 157281 155347 154503 154199 153681 152853 151831 150186
56613 150186 147700 145558 145408 147082 148562 148545 147776 147416 147461 147513 147898 148962 150147 150782 151119 151669 152171 152167
56595 152167 152105 152861 154431 155879 156437 156066 155201 154520 154701 155864 157411 158758 159961 161311 162758 164043
56579 164043 164999 165447 165260 164808 164791 165322 165816 166066 166716 168276 170466 173048 176472 180972 185750 189932 193840
56562 193840 198489 204235 210705 217728 225510 234011 242752 251187 258800 265041 269553 272300 273286 272553 270712
56547 270712 268868 267600 266460 264865 262913 260876 258493 255400 251827 248348 245323 242990 241569 240750
56533 240750 239608 237611 235251 233206 231446 229720 228344 227677 227236 226118 224095 221775 219830 218446 217193
56518 217193 215085 211283 206221 201527 198346 196242 194263 192413 191334 191023 190784 190258 189807 189907 190646 191773
56502 191773 192999 194367 196337 199093 201790 203226 203364 203321 203700 203958 203823 204113 205385 206812 207380 207350 207543
56485 207543 207933 207940 207555 207202 206993 206917 207223 207809 207910 207268 206889 207681 209019 209723 209851 210352 211484 212731 213867
56466 213867 215004 215894 216311 216764 217774 218789 218888 218234 217734 217625 217517 217504 218012 218709 218798 218313 218086 218494 219217
56447 219217 220069 221066 221862 222165 222522 223635 225074 225796 225711 225628 225820 225956 226307 227601 229470 230405 229658 228178
56429 228178 227284 227375 228213 229527 230889 231746 231992 232001 231994 231913 231871 232029 232141 231911 231660 231834 232074 231755 231278 231723
56409 231723 233202 234675 235409 235563 235198 234021 232431 231606 231962 232427 231866 230487 229333 229049 229648 230917
56393 230917 232511 234068 235575 237351 239450 241457 243032 244262 245385 246483 247488 248190 248359 248194 248455
56378 248455 249682 251520 253244 254645 255820 256547 256660 256697 257393 258714 260203 261957 264324 266893 268863
56363 268863 270269 271809 273472 274412 274323 273993 274320 275550 277594 280252 282991 285231 286971 288552 289840
56348 289840 290387 290322 290348 290828 291601 292619 294034 295730 297435 299230 301309 303420 305216 306882 308772 310785
56332 310785 312878 315688 319719 324321 328484 332202 336050 339925 343377 346687 350291 353541 355485 356543
56318 356543 357921 359613 360518 360363 359896 359257 357922 356407 356287 358129 360823 363302 365574 367850 370121
56303 370121 372946 377204 382685 388183 393264 398623 404538 410408 416126 422337 428963 434976 440127 445449
56289 445449 451565 457919 464231 471192 479127 487387 495720 504901 515312 526213 537136 548687 561174
56276 561174 573687 585462 597180 610144 624987 641701 659983 679093 698421 718654 741362
56265 741362 767096 795137 825432 859327 897787 940322 986464 1037127 1093755 1157226 1228398
56254 1228398 1308688 1399342 1500916 1613984 1739361 1877245 2027224 2189479 2364738 2552490
56244 2552490 2750252 2954954 3163818 3373460 3579468 3777390 3963042 4131502 4277209
56235 4277209 4395579 4483417 4537776 4556179 4538487 4487010 4404379 4292964 4156715 4001484
56225 4001484 3832583 3653577 3467988 3280130 3093290 2908978 2729070 2556845 2394669
56216 2394669 2242341 2098962 1964878 1840656 1725849 1620157 1524303 1438332 1360480 1288997
56206 1288997 1223751 1164843 1111145 1061575 1016402 975944 939302 905696 875668 849606 826393
56195 826393 804879 785352 768224 752677 738073 725324 715241 706709 698065 689310 681518 675041
56183 675041 669596 665119 661301 657279 652913 649272 646889 644839 642555 641001 640851 641094 640790 640680 641681
56168 641681 643327 645129 647896 652075 656413 659933 663768 669299 675924 682461 689262 697090 705235 712775
56154 712775 720541 729974 741150 753673 768333 786022 806228 828459 854142 885316 922493 965455
56142 965455 1015097 1072752 1138754 1213091 1296177 1387194 1482799 1578935 1672549 1760231 1837226
56131 1837226 1900151 1949586 1988377 2018888 2043484 2065452 2086655 2105384 2118588 2124960 2124241 2115615
56119 2115615 2099336 2078210 2054678 2027607 1994209 1953446 1905117 1847539 1779530 1703656 1624720
56108 1624720 1545976 1469311 1397658 1333965 1278546 1230185 1189026 1155796 1129200 1106955 1088680
56097 1088680 1075242 1066110 1059788 1055891 1054354 1053770 1052981 1053131 1055621 1059418 1062979 1067199 1073508 1080652
56083 1080652 1086554 1091901 1098565 1105931 1112324 1118793 1127719 1138689 1149482 1160292 1173230 1188300 1203519
56070 1203519 1218556 1234728 1251862 1268545 1285023 1302619 1320805 1338005 1354622 1372111 1389955
56059 1389955 1406808 1423621 1442151 1461357 1478860 1494950 1511553 1528280 1543372 1557605 1573352
56048 1573352 1590669 1608176 1626774 1648417 1672119 1695338 1718484 1743915 1771465 1799243 1827843
56037 1827843 1859311 1892837 1926015 1959478 1995675 2033967 2071700 2109264 2149305 2191783 2234742
56026 2234742 2278995 2326897 2377321 2427033 2476231 2527533 2580552 2633082 2686637 2745007 2808131
56015 2808131 2873159 2940552 3012968 3089146 3165466 3242838 3325414 3413213 3502813 3594603 3692229
56004 3692229 3795455 3900956 4009828 4126817 4252426 4383387 4520585 4668715 4828412
55995 4828412 4996678 5174634 5366500 5571373 5784849 6008420 6248234 6505019 6774857
55986 6774857 7059526 7365914 7695443 8044637 8416079 8817903 9252636 9718129 10219447
55977 10219447 10767650 11366855 12015499 12720502 13496721 14352639 15291502 16326989 17482563
55968 17482563 18775699 20220338 21846048 23697924 25819093 28255182 31078795 34391016
55960 34391016 38302348 42939834 48475579 55122718 63104795 72662459 84094504 97761203
55952 97761203 114042387 133301313 155824296 181686790 210682726 242485327 276790592
55945 276790592 312888034 348672593 380104804 402129732 410728119 404590288 385291491
55938 385291491 356238892 321403171 284440643 248197938 214500816 184247647 157716667
55931 157716667 134849448 115391811 98972536 85190144 73666263 64042898 55982196
55924 55982196 49196644 43462089 38593077 34426716 30835891 27732248 25042264 22694114
55916 22694114 20631347 18818658 17224533 15812260 14553064 13432031 12434089 11537322
55908 11537322 10725380 9992945 9333107 8731424 8177635 7671541 7211985 6790589 6400970
55899 6400970 6043758 5717761 5415874 5134072 4875215 4639786 4421752 4217441 4029758
55890 4029758 3859580 3701410 3551462 3412091 3284441 3164543 3050458 2945670 2851396 2762529
55880 2762529 2674874 2589515 2506638 2422209 2334801 2249188 2169053 2092036 2015641 1942104 1873475
55869 1873475 1807496 1742345 1680509 1624221 1571636 1520864 1473319 1430058 1389151 1349487 1312860
55858 1312860 1279724 1247336 1214575 1184055 1156987 1130632 1103387 1077644 1054822 1032153 1007387
55847 1007387 982307 958568 934297 907989 881800 857830 834817 811461 789455 770291 752493
55836 752493 734828 718847 705476 692463 678011 663746 651409 639794 627654 616425 607284 598592
55824 598592 589056 580445 574261 568473 560472 550793 541193 531487 520996 510810 501957 493386 484202 475813
55810 475813 469647 464807 460109 456346 454436 453536 453022 454109 457465 461450 464819 468939 475137 481966 487243
55795 487243 490773 492999 492969 489816 484441 477794 469352 459047 448713 439824 431821 424379 418920 415818
55781 415818 412361 405784 396465 386133 375100 363593 353830 348058 345933 346029 348548 354396 362828 371880
55767 371880 379840 384694 383834 376320 364146 349669 333346 315460 298038 282910 269444 256163
55755 256163 243145 230994 219209 207664 198240 192897 191348 192324 195520 200402 204852 207297 208843
55742 208843 211198 213793 215140 215802 217641 220900 224042 225737 225384 222658 218336 214547 212522 211079 208787
55727 208787 206308 204898 203966 202113 199405 196651 193600 189885 186695 185345 185055 184151 182748 182273 183095
55712 183095 184514 186486 189513 193321 197234 201255 205274 208025 208395 207008 205039 202419 198736 194761
55698 194761 191157 186680 179792 171379 163847 158058 153099 148611 145313 143441 142426 142085 142592 143516 144248
55683 144248 145183 147202 150343 154110 158547 163690 168538 171934 174023 175638 176820 177098 176491 175036 172165
55668 172165 167956 164175 162541 162620 162792 162561 162431 162417 162355 162984 164983 167449 168977 169745 170922 172605 174044
55651 174044 175423 177598 180417 182887 184753 186307 186969 185701 182659 178968 175062 170658 166035 161829
55637 161829 157711 152712 146745 140602 134733 129259 124754 121651 119276 116876 115120 115059 115996 116060 114701
55622 114701 113070 112073 111573 111382 111508 111394 110265 108327 106444 104761 102782 100590 98742 97201 95575
55607 95575 94101 93131 92032 90017 87708 86368 85854 84936 83441 82451 82370 82428 82210 82140 82180 81491 79801 77937
55589 77937 76708 76186 76162 76324 75995 74779 73444 73103 73539 73429 72226 70823 70406 71611 74624 79004 83553
55572 83553 87386 90988 95270 99960 104093 107681 111553 115752 119463 122360 124663 125991 125552 123497 120774
55557 120774 117701 113907 109627 105723 102437 99361 96578 94546 92933 90878 88408 86306 84706 83210
55543 83210 82240 82662 84041 84879 84849 85249 86868 88896 90368 91324 92019 92209 91774 91033 90018 88440 86655
55526 86655 85617 85497 85302 84186 82266 79953 77394 74780 72398 70222 68205 66820 66403 66205 65206 63660
55510 63660 62593 62021 61081 59836 59355 59838 60163 59610 58633 57731 56908 56596 57559 59424 60625 60384 59627 59526
55492 59526 60263 61559 63142 64255 63923 62293 60640 59660 58779 57476 56114 55104 54334 53822 53833 54119 54145
55475 54145 54245 55226 56665 57150 56583 56602 58086 59828 60490 60335 60037 59234 57497 55642 54780 54785 54756 54368 53955
55456 53955 53843 54292 55481 56954 57726 57463 56843 56397 55868 55130 54757 55088 55633 55912 56036 56007 55447 54563 54305
55437 54305 54942 55512 55330 55050 55522 56563 57532 58166 58227 57343 55917 55125 55237 55041 53818 52751 53321 55247
55419 55247 57147 58426 59376 60174 60914 62063 63785 65251 65547 64801 63672 62363 60961 60034 59908 59939 59458
55402 59458 58929 59218 60169 60842 60730 59875 58346 56528 55463 55822 56853 57270 56871 56395 56168 56020 56323 57882
55384 57882 60596 63094 64084 63528 62333 61311 60607 59935 59247 59063 59842 61099 61757 61468 60886 60410 59556
55367 59556 58100 56976 57257 58817 60726 62443 63880 64774 64843 64256 63301 61899 60045 58356 57536 57580 58044
55350 58044 58761 59707 60522 60818 60757 60796 61113 61630 62263 62766 62729 62152 61602 61428 61332 61101 61118 61642 62215 62415 62574
55329 62574 63067 63403 62797 61274 59557 58229 57583 57856 58958 60303 61415 62326 62996 62997 62304 61726 61831 62075
55311 62075 61731 61021 60511 60046 59259 58607 58792 59491 59666 58969 57948 57117 56690 56984 58084 59259 59624 59322
55293 59322 59177 59273 58797 57357 55577 54233 53530 53425 54029 55391 57314 59495 61579 63102 63793 63875 63785
55276 63785 63667 63482 63361 63475 63720 63931 64219 64721 65231 65399 65082 64233 62886 61587 61348 62566 64346 65477
55258 65477 65799 66083 66891 68160 69659 71205 72529 73409 73883 74036 73820 73364 73050 72954 72662 71955 71150 70360
55240 70360 69113 67341 66102 66463 68038 69388 69620 68998 68276 68076 68602 69396 69655 69222 68829 68951 69073
55223 69073 68650 68073 67939 68050 68052 68348 69371 70499 70818 70572 70733 71428 71908 71822 71436 70767 69571 68164 67243
55204 67243 66876 66542 66094 65861 65919 66095 66543 67504 68636 69451 70161 71127 71805 71336 70093 69467 70095 71385
55186 71385 72719 73993 74853 74647 73460 72220 71497 71087 70968 71622 73012 74191 74387 73853 73338 73342 74072 75430
55168 75430 76814 77573 77837 78265 78950 79306 79059 78503 77695 76338 74694 73673 73676 74159 74656 75423 76719 78211
55150 78211 79470 80429 81037 81125 80860 80716 80708 80368 79642 79058 78793 78375 77579 76773 76011 74750 73010 71933 72467
55131 72467 74051 75282 75460 75001 74754 75385 76932 78493 78820 77673 76181 75492 75495 75315 74574 73680 73233 73610
55113 73610 74822 76335 77295 77222 76328 75055 73748 72897 73069 74207 75518 76452 77361 78755 80401 81660
55097 81660 82370 82873 83454 84192 85152 86299 87359 88128 88782 89605 90552 91336 91778 91892 91779 91653 91760 92076
55079 92076 92269 92125 91877 91931 92403 93010 93337 93191 92813 92642 92755 92745 92417 92276 92857 93877 94699 95381 96478
55060 96478 97805 98274 97212 95113 92854 90821 89117 87933 87277 86799 86291 85986 86117 86552 87065 87473 87377
55043 87377 86383 84889 84049 84534 85775 86803 87356 87708 87900 87666 86917 85831 84585 83306 82165 81295 80731
55026 80731 80500 80469 80159 79135 77714 76803 76873 77509 78139 78696 79282 79680 79625 79296 79208 79726 80756 81727 81972
55007 81972 81507 81283 82130 83548 84274 83984 83570 83648 83799 83672 83802 84614 85434 85351 84658 84608 86020 88642 91658
54988 91658 94291 96078 96986 97189 96667 95405 94048 93649 94421 95403 95794 95950 96493 97138 97202 96746 96299 95820
54970 95820 94844 93528 92713 92904 93822 95000 96217 97249 97774 97731 97469 97427 97832 98644 99537 100030 99846 99077
54952 99077 97886 96331 94711 93710 93724 94219 94213 93330 92060 91093 90714 90791 91009 91104 91066 91113 91408 91925 92644 93608
54932 93608 94667 95523 96241 97419 99525 102280 105014 107501 110226 113952 119137 125555 132319 138488 143777
54917 143777 148529 153008 157055 160418 162909 164116 163553 161350 158290 154870 150805 145808 140329 135121
54903 135121 130438 126148 122195 118547 115053 111793 109243 107610 106364 104898 103406 102563 102531 102731 102555
54888 102555 101984 101647 102482 105075 109059 113299 116900 119839 122628 125851 130134 135865 142558 148992 154384
54873 154384 158909 162758 165392 166282 165741 164305 161807 157835 152713 147289 142053 137118 132672 128694 124590
54858 124590 119934 115408 112187 110555 109856 109543 109393 108810 106955 103835 100543 98176 96976 96548 96302 95611
54842 95611 94172 92437 91223 90785 90727 90825 91363 92543 94080 95628 97091 98389 99303 99751 99866 99637 98848
54825 98848 97529 96179 95298 94915 94714 94494 94381 94700 95633 96933 97992 98304 97820 96831 95688 94723 94156
54808 94156 93918 93814 93999 94897 96451 97911 98677 98936 99096 99087 98713 98221 97932 97736 97556 97878 99035 100329
54790 100329 100774 100501 100508 101144 101754 101952 102266 103183 104343 105086 105359 105701 106678 108483 110797 112964 114638 116260
54772 116260 118529 121466 124514 127499 130895 135118 140091 145641 151741 158161 164314 169659 173980 177154
54758 177154 178976 179274 177905 174682 169632 163273 156327 149359 142994 138057 134749 132019 128621 124742
54744 124742 121652 119794 118244 116268 114380 113357 113093 112999 112841 112602 112094 111401 111235 112268 114329 116744
54728 116744 119133 121529 124057 126993 130783 135558 140850 146165 151566 157263 162935 167907 171760 174252
54714 174252 174844 172927 168583 162718 156362 150121 144340 139410 135640 132895 130559 127980 124979 121899
54700 121899 119138 116801 114961 113943 113951 114493 114653 114004 112920 111951 111388 111472 112414 113905 115073 115338 114940
54683 114940 114318 113388 111948 110411 109541 109535 109876 110128 110408 110979 111670 111882 111080 109295 107258 105911 105578 105647
54665 105647 105280 104396 103728 103927 104841 105732 105978 105472 104509 103538 102953 102935 103362 103911 104328 104625 104989 105517 106014
54646 106014 106060 105335 103991 102745 102394 103019 103821 103966 103490 103006 102684 102054 100934 99920 99611 99816 99967 99935
54628 99935 99955 100072 100285 100991 102616 104784 106407 106751 106034 105006 104321 104279 104737 105157 105111 104740 104433 104176 103650
54609 103650 102929 102567 102899 103709 104692 105750 106742 107343 107428 107272 107175 107115 106928 106606 106340 106407 106967 107782 108266 108154
54589 108154 107972 108431 109449 110350 110915 111594 112520 113061 112686 111786 111160 111027 110988 110734 110429 110393 110700 111130 111428
54570 111428 111598 111848 112213 112484 112670 113226 114395 115604 116035 115710 115392 115484 115639 115531 115342 115285 115160 114691 113913
54551 113913 113081 112554 112814 114075 115785 117001 117419 117557 117920 118563 119574 121144 122928 124094 124425 124643
54535 124643 125207 125523 124956 123946 123349 123195 122899 122311 121687 120822 119168 116834 114780 113796 113734 113884 113720 113217
54517 113217 112820 113161 114500 116345 117755 118056 117175 115517 113783 112717 112633 113168 113703 113999 114247 114650 115250
54500 115250 116019 116797 117186 116893 116219 115946 116572 117791 118785 118983 118470 117735 117090 116467 115810 115435 115675 116265
54482 116265 116499 116155 115844 116282 117496 119039 120673 122476 124382 126003 126980 127332 127431 127662 128081 128376 128245
54465 128245 127777 127350 127176 127150 127122 127054 126897 126573 126156 125871 125780 125695 125438 125021 124536 124094 123870 124019 124567 125493
54445 125493 126725 127805 127918 126783 125341 124886 125548 126255 126196 125573 124803 123751 122187 120375 118825 117843
54429 117843 117609 118226 119489 121035 122894 125282 127712 129100 129108 128662 128663 128913 128877 128740 128925 129132 128739 127841
54411 127841 127130 127002 127457 128555 130191 131583 131837 130989 129869 128981 128211 127603 127713 128926 130928 133067
54395 133067 134916 136321 137228 137636 137618 137336 137100 137227 137654 137874 137538 136964 136797 137211 137720 137715 137081 136322 136139
54376 136139 136700 137337 137302 136789 136789 137864 139681 141870 144600 147910 151237 154253 157568 161826 166561 170739
54360 170739 174192 177685 181682 185733 189058 191124 191650 190607 188353 185429 182176 178757 175324 171880
54346 171880 168272 164653 161627 159499 157696 155427 152676 150086 148114 146755 145800 144869 143516 141827 140526
54331 140526 139945 139292 137643 135333 133587 133053 133473 134535 136119 137802 139013 139761 140531 141441 142191 142695
54315 142695 143050 142942 141925 140300 138881 137843 136616 134975 133412 132294 131464 130853 130674 130717 130285 129195
54299 129195 128151 127765 127830 127948 128222 128878 129665 130148 130266 130315 130661 131637 133300 135056 135962 135637 134616 133718
54281 133718 133395 133718 134459 135096 135222 135095 135337 136019 136576 136733 136876 137379 138170 139178 140552 142138 143333
54264 143333 143849 144164 144900 146172 147759 149368 150488 150553 149642 148598 148125 148194 148498 148962 149519 149946 150226 150508
54246 150508 150474 149468 147631 146144 145766 145841 145462 144917 144989 145358 144890 143442 142318 142589 143756 144490 144229 143595
54228 143595 143483 144113 145018 145725 146221 146685 147004 146946 146737 146951 147669 148192 147884 146918 145909 145156 144620 144266 143986
54209 143986 143423 142329 140906 139484 138075 136681 135754 135838 136827 138060 139129 140096 140891 141085 140513 139779 139768
54192 139768 140740 142125 143151 143555 143644 143827 144197 144557 144702 144622 144537 144829 145792 147260 148606 149264 149187 148631 147740
54173 147740 146631 145697 145370 145572 145817 145840 145832 146063 146619 147397 147984 147669 146123 144096 142876 142988 143938 145172
54155 145172 146597 148007 148783 148610 147942 147386 147076 146967 147252 148023 148890 149346 149254 148718 147810 146707 145732 145027
54137 145027 144521 144352 144801 145592 145872 145293 144546 144418 144816 145216 145588 146316 147543 149121 150905 152651 153991
54120 153991 154883 155713 156505 156601 155665 154490 154100 154494 155015 155569 156650 158372 160308 162114 163563 164169 163681
54103 163681 162911 163177 164765 166750 168472 170387 173155 176651 180369 184229 188446 192887 197036 200338 202276
54088 202276 202336 200367 196973 193225 189826 186683 183369 179919 176923 174775 173106 171352 169737 169143 169923
54073 169923 171387 172726 173934 175428 177322 179546 182188 185064 187364 188434 188720 189242 190305 191423 192355
54058 192355 193381 194551 195456 195904 196090 195900 194775 192608 190254 188739 188347 188729 189495 190379 191201 192093 193554
54041 193554 196030 199555 203936 209012 214532 220020 225109 229865 234625 239612 244824 250186 255613 260963
54027 260963 266034 270625 274634 278098 281072 283428 284927 285628 285966 286254 286320 285913 285151 284181 282648 280164
54011 280164 277169 274666 272870 270704 266954 261596 255683 250207 245399 240978 236749 232880 229648 226983
53997 226983 224435 221689 218936 216527 214482 212644 211131 210098 209166 207651 205516 203580 202560 202280 202048
53982 202048 201510 200817 200236 199877 199744 199822 200075 200366 200378 199807 198822 198176 198498 199575 200657 201375 201934 202527 203215
53963 203215 204471 207114 211380 216631 222376 229068 237394 247216 257822 268887 280369 291524 300792
53950 300792 306919 309674 309271 305710 299236 291033 282746 275258 268464 262369 257811 255654 255634 256561 257575
53935 257575 258675 260082 261754 263728 266335 269668 273185 276286 278973 281630 284459 287536 291072 295135
53921 295135 299403 303731 308645 314636 321218 327420 333100 338898 344966 350737 356215 362478 370297 378919
53907 378919 386847 393274 398121 401159 402037 401060 399210 397225 395186 393083 391244 389882 388499 386141 382303
53892 382303 377377 372090 366560 360089 351998 342529 332790 323870 316158 309349 302799 295946 288793 282050
53878 282050 276566 272464 269100 265860 262657 259529 256214 252394 248183 244078 240472 237309 234140 230588
53864 230588 226901 223938 222253 221267 219791 217439 214974 213184 211965 210849 209802 208997 208168 206837 205028
53849 205028 203260 201917 201004 200465 200318 200482 200765 201063 201343 201474 201321 200940 200468 199926 199340 198992 199240 200094
53831 200094 201207 202225 202997 203483 203731 203943 204324 204873 205419 205792 205797 205184 203926 202476 201416 200857 200476 200152
53813 200152 200225 201022 202475 204382 206779 209793 213302 217072 221098 225491 230094 234570 238923 243527 248480
53798 248480 253354 257900 262610 268000 273560 278171 281609 284833 288455 291748 293805 295033 296558 298497
53784 298497 299858 300096 299750 299263 298135 295724 292184 288039 283433 278446 273676 269741 266390 262774 258528
53769 258528 254052 249803 245821 241963 238127 234194 230147 226329 223212 220789 218519 216015 213528 211600
53755 211600 210433 209713 208928 207743 206205 204610 203198 202049 201372 201642 203132 205323 207161 207943 207782 207157
53739 207157 206360 205499 204732 204203 203870 203589 203309 203048 202785 202563 202605 203082 203801 204346 204626 205089 206272 208276
53721 208276 210779 213344 215551 217006 217629 217953 218797 220469 222512 224350 225874 227287 228754 230562 233277
53706 233277 237178 241639 245546 248393 250556 252576 254649 256913 259647 262904 266368 269861 273615 277735
53692 277735 281721 284980 287552 289888 292023 293452 293844 293456 292711 291630 289932 287606 285209 283520 282841
53677 282841 282669 282125 280767 278941 277347 276373 275816 275153 274048 272747 271928 271968 272391 272220 270947 268964 267117
53660 267117 266100 266181 267039 267755 267453 266167 264762 263848 263198 262477 261974 262170 262986 264038 265373 267343 269865
53643 269865 272397 274653 276849 279136 281227 282797 283917 284903 285925 286947 287968 289174 290749 292540
53629 292540 294062 295127 296411 298969 303006 307562 311743 315759 320273 325171 329720 333732 337778 342188
53615 342188 346582 350545 354104 357283 359811 361646 363322 365349 367645 369954 372488 375624 379235 382829
53601 382829 386248 389751 393380 396700 399273 401052 402174 402668 402563 401999 401030 399557 397740 396283 395894
53586 395894 396451 397032 396890 396058 394886 393400 391537 389714 388549 388045 387542 386601 385442 384368 383234 381842
53570 381842 380381 379035 377474 375308 372900 371132 370316 369787 368753 367189 365751 365083 365347 366237 367248
53555 367248 367973 368289 368290 368173 368217 368674 369442 370010 370055 370033 370818 372703 375024 376896 378117 379304 381287 384469
53537 384469 388542 392736 396438 399701 403113 407207 412074 417459 423108 429033 435554 443053 451603 461008
53523 461008 471271 482698 495264 508159 520501 532353 544528 557468 570940 584936 600130
53512 600130 617046 635314 654277 673979 694993 717349 740228 762817 785096 807612 830632
53501 830632 853709 876036 897200 917534 937656 957708 977257 995942 1013906 1031448 1048532
53490 1048532 1064977 1080991 1097119 1113668 1130455 1147197 1163891 1180720 1197744 1214813 1231682
53479 1231682 1248138 1264081 1279610 1294959 1310181 1324828 1338003 1348945 1357637 1364754 1370797 1375334
53467 1375334 1377279 1376026 1372076 1366366 1359191 1350057 1338577 1325156 1310640 1295550 1279928 1263854
53455 1263854 1247736 1231955 1216383 1200464 1183799 1166460 1148754 1130820 1112615 1094194 1075838
53444 1075838 1057858 1040321 1023072 1006053 989596 974364 960974 949796 941077 935039 931577 929924
53432 929924 929002 928238 927806 927977 928567 929282 930300 932139 935108 939258 944769 951915 960593 970338 981004
53417 981004 993127 1007348 1023691 1041578 1060404 1079897 1100156 1121595 1144740 1169789 1196327
53406 1196327 1223586 1251010 1278562 1306659 1336016 1367422 1401356 1437778 1476461 1517484 1561063
53395 1561063 1606842 1653729 1700774 1748066 1796482 1846626 1898310 1950975 2004158 2057382 2110008
53384 2110008 2161600 2212205 2261887 2309997 2355350 2397256 2436091 2472653 2507105 2538714 2566464
53373 2566464 2589777 2608718 2623623 2634614 2641421 2643575 2640683 2632446 2618608 2599075 2574003 2543632
53361 2543632 2508191 2468176 2424565 2378394 2330239 2280467 2229916 2179766 2130674 2082519 2035151
53350 2035151 1988878 1944036 1900659 1858868 1819016 1781004 1743931 1706966 1670210 1634173 1598872
53339 1598872 1564147 1530538 1499026 1469941 1442855 1417528 1394180 1372657 1352153 1332228 1313642
53328 1313642 1297664 1284712 1273895 1263710 1252996 1241393 1229129 1216489 1203566 1190540 1177900
53317 1177900 1166092 1155101 1144714 1134986 1126077 1117856 1110228 1103763 1099297 1096871 1095665 1095178 1095833 1098157
53303 1098157 1101890 1106326 1111172 1116738 1123581 1132212 1142845 1155173 1168703 1183469 1200109 1218985
53291 1218985 1239609 1261169 1283263 1305838 1328798 1352058 1375671 1399476 1422795 1444863 1465352
53280 1465352 1484184 1501004 1515256 1526664 1535347 1541516 1545230 1546330 1544466 1539463 1531835 1522585 1512149
53267 1512149 1499815 1484594 1466443 1446253 1424878 1402654 1379711 1356144 1331816 1306458 1280123
53256 1280123 1253257 1226277 1199332 1172463 1145752 1119287 1093213 1067760 1043005 1018707 994718
53245 994718 971380 949112 927604 905951 883693 861289 839391 818143 797441 777510 758770
53234 758770 741330 724989 709654 695457 682480 670617 659771 650040 641731 635180 630334 626281
53222 626281 621438 614649 606146 597057 587928 578126 566824 554078 540614 526981 513477 500648 489067
53209 489067 478544 468227 457764 447793 439016 431289 424075 417248 410870 404563 397861 390967 384439
53196 384439 378237 371777 364917 358076 351311 344080 336276 328752 322358 316978 311932 306827 301605 296256
53182 296256 291043 286629 283439 281123 279041 276973 274951 272854 270741 269158 268384 267669 266039 263700 261831
53167 261831 260979 260499 259742 258905 258352 257815 256862 255630 254509 253449 252165 250791 249762 249090 248274 247004
53151 247004 245521 244180 243025 241907 240770 239583 238287 237042 236315 236369 236827 237061 237023 237232 237913 238595 238799
53134 238799 238662 238508 238204 237540 236995 237393 238810 240467 241862 243376 245497 247953 250038 251442 252407 253382
53118 253382 254755 256639 258587 259782 259834 259199 258640 258562 258970 259630 259954 259209 257279 254859 252571 250371 248181
53101 248181 246458 245455 244462 242670 240516 239277 239424 240208 240780 240933 240767 240459 240491 241251 242215 242280 241175
53084 241175 239796 238898 238189 237126 235890 235007 234509 234076 233625 233269 232952 232584 232319 232314 232438 232494 232498 232413 231936 230904
53064 230904 229644 228576 227672 226649 225479 224353 223368 222672 222720 223891 225884 227905 229431 230501 231208 231356
53048 231356 230791 229854 229256 229421 230003 230136 229305 227969 227137 227284 227858 227941 227163 225853 224554 223663 223387 223744
53030 223744 224555 225500 226196 226337 226004 225795 226320 227492 228609 229268 229743 230355 230891 231094 231245 231761 232457 232793
53012 232793 232769 233022 233950 235182 236044 236196 235665 234596 233264 232243 232204 233365 235131 236448 236726 236329 235979
52995 235979 235811 235403 234746 234528 235157 236033 236367 236358 236914 238414 240363 242212 243820 245069 245712 245921 246463 247914
52977 247914 250000 252014 253648 255097 256542 257845 258728 259052 258971 258930 259406 260528 261921 262965 263175 262463
52961 262463 261204 260048 259391 258976 258182 256775 255152 253764 252619 251549 250621 249971 249359 248327 246863 245569
52945 245569 244978 244930 244832 244433 244021 243816 243566 243004 242455 242516 243130 243514 243202 242695 242694 243081 243155 242654 241958 241368 240764
52924 240764 240042 239344 238695 237907 237026 236412 236214 236184 236224 236593 237310 237870 237990 238127 238751 239499 239695 239359 238997
52905 238997 238638 237829 236541 235283 234257 233165 232100 231842 232777 234078 234563 234062 233467 233628 234608 235867
52889 235867 236779 237005 236716 236458 236593 236920 236984 236611 235959 235224 234572 234220 234280 234617 235091 235874 237248 239169 241333
52870 241333 243635 246215 249039 251721 253855 255354 256399 257272 258226 259269 260054 260221 259895 259574 259407 258851
52854 258851 257241 254496 251076 247388 243532 239596 235934 232987 230847 229118 227288 225276 223507 222452
52840 222452 222186 222476 223074 223707 223890 223159 221600 219931 218903 218696 218933 219143 219141 219070 219172 219557 220138 220755 221238
52821 221238 221331 220781 219627 218281 217200 216677 216985 218312 220273 221952 222914 223828 225513 227643 229153 229680
52805 229680 229710 229406 228339 226530 224710 223133 221160 218663 216883 216948 218182 218816 218017 216386 214789 213616
52789 213616 213045 213173 213855 214884 216218 217551 218087 217441 216464 216313 216929 217323 217226 217413 218339 219502 220415 221306
52771 221306 222423 223409 223798 223540 222697 221242 219518 218288 217896 217865 217728 217748 218422 219659 220862 221488 221282
52754 221282 220356 219328 218936 219286 219871 220492 221538 223159 224890 226542 228703 231786 235149 237812 239486
52739 239486 240354 240502 240321 240787 242314 243814 243997 243268 243151 244022 244722 244546 244258 244645 245207 245054 244298 243665
52721 243665 243291 242724 241848 241020 240359 239580 238624 237970 238039 238543 238647 237763 236136 234615 233833 233676 233685 233845 234627
52702 234627 236195 237912 238937 239132 239087 239317 239737 239952 239844 239667 239639 239698 239726 239836 240204 240712 241048 241169 241318
52683 241318 241482 241190 240162 238815 237794 237236 236893 236744 236957 237355 237510 237462 237763 238637 239571 239970 239849 239584
52665 239584 239395 239386 239782 240654 241589 242072 242202 242689 244110 246394 249060 251743 254365 256958 259420 261398 262355
52648 262355 261863 259927 257039 253901 251096 248996 247828 247655 248220 248909 249121 248704 247982 247348 246985 247005 247617
52631 247617 248951 250832 252911 254881 256475 257460 257882 258140 258490 258594 257917 256507 254938 253506 252022 250496
52615 250496 249479 249288 249318 248657 247292 246240 246415 247713 249265 250378 251043 251680 252540 253396 253813 253678 253448
52598 253448 253841 255291 257628 260148 261977 262574 262052 260988 259888 258872 257850 256754 255556 254310 253379
52583 253379 253405 254750 257066 259640 262065 264277 266060 266968 266870 266181 265317 264240 262847 261547 261010 261360
52567 261360 262032 262509 262801 263072 263121 262582 261486 260285 259332 258555 257629 256283 254492 252584 251176 250721 250986
52550 250986 251158 250626 249619 248973 249294 250397 251529 252159 252515 253264 254644 256118 257102 257784 258845 260492
52534 260492 262208 263491 264288 264523 263801 262028 260027 258986 259360 260639 262104 263448 264655 265695 266470
52519 266470 266941 267125 266986 266390 265298 264155 263908 265234 267709 270261 272578 275517 279718 284381 288054
52504 288054 290271 291614 292333 291757 289303 285397 281108 277288 274297 272103 270298 268285 265792 263093 260680
52489 260680 258891 257940 257920 258579 259340 259806 260092 260489 260990 261317 261332 261249 261415 261945 262563 262887 262923 263161 264034 265416
52469 265416 266823 267953 268844 269724 271019 273243 276424 279849 282833 285543 288447 291211 292966 293650 294087
52454 294087 294427 293540 290559 286266 282176 278791 275558 272129 268810 265901 263429 261558 260570 260320 260249 260125
52438 260125 260279 260843 261101 260072 257738 255396 254570 255502 256911 257381 256753 255834 254995 253867 252495 251897 252881
52421 252881 254957 257052 258884 260826 262845 264504 265925 267834 270476 273261 275771 278556 282604 288411
52407 288411 295772 304082 312647 321088 329605 338423 346809 353086 355960 355495 352465 347262 340002 331486
52393 331486 323312 316764 311849 307660 303536 299711 296871 295210 294098 292758 291135 289956 289937 291165 293266
52378 293266 295917 298965 302176 305210 307925 310561 313423 316445 319333 322200 325731 330337 335298 339249
52364 339249 341612 343022 344148 344688 344007 342308 340509 339114 337937 336856 336181 336162 336672 337529 338667 339825
52348 339825 340592 340990 341559 342621 343863 344934 346072 347796 350361 353838 358393 364039 370356 376906 383739
52333 383739 391089 398763 406319 413804 421843 430982 441255 452472 464556 477471 491150 505663 521208
52320 521208 537694 554426 570497 585571 600242 615459 631570 647988 663925 679339 694971
52309 694971 711495 728987 747217 766036 785193 804127 822402 840186 857897 875513 892591
52298 892591 908852 924273 938566 951030 961080 968544 973354 975388 974857 972456 968727 963512 956460
52285 956460 947944 939030 930562 922628 915012 907804 901352 895797 891015 887042 884383 883687 885122 888172
52271 888172 892195 897101 903267 910769 918975 927157 935325 944057 953544 963257 972781 982623 993792 1006681
52257 1006681 1020707 1035056 1049487 1064286 1079626 1095169 1110263 1124415 1137498 1149399 1159485
52246 1159485 1166683 1170313 1170701 1168671 1164607 1158426 1150388 1141284 1131608 1121128 1109652 1097751 1086150
52233 1086150 1074742 1062903 1050605 1038550 1027184 1016245 1005467 995125 985566 976672 968162 960084
52221 960084 952689 946093 940383 935790 932410 929960 928135 927032 926892 927636 929044 931205 934379 938411 942675
52206 942675 946578 949829 952278 953946 955368 957538 961222 966391 972434 978800 985352 992189 999295 1006399
52192 1006399 1013250 1019898 1026475 1032627 1037556 1040879 1043083 1044624 1044850 1042506 1037353 1030630 1023651 1016543
52178 1016543 1008713 1000079 991270 982875 975022 967657 960830 954657 949293 944938 941710 939523 938237 937877
52164 937877 938568 940338 943054 946389 949708 952262 953840 955097 956908 959421 962015 964101 965616 966774
52150 966774 967727 968564 969349 970018 970466 970834 971484 972588 973916 975110 975965 976381 976260 975641 974849 974392 974772 976318
52132 976318 979060 982794 987552 993963 1002850 1014436 1028266 1043932 1061417 1080611 1100995 1122196
52120 1122196 1144496 1168386 1193890 1220638 1248278 1276279 1303632 1329464 1353907 1377735 1401031
52109 1401031 1422836 1442350 1459875 1476203 1491460 1505121 1516935 1527301 1536668 1544993 1551948 1557374
52097 1557374 1561250 1563248 1562602 1558584 1551146 1540962 1528776 1514832 1498985 1481217 1461855 1441482
52085 1441482 1420861 1400901 1382342 1365395 1349892 1335835 1323592 1313487 1305427 1299036 1294001 1290264
52073 1290264 1288123 1288205 1291140 1297002 1305148 1314619 1324698 1335219 1346572 1359326 1373467 1388062 1402099
52060 1402099 1415683 1429886 1445269 1461131 1476456 1490958 1504638 1516864 1526657 1533728 1538510 1541244
52048 1541244 1541688 1539734 1535659 1529590 1521261 1510523 1497700 1483210 1467236 1450026 1432246 1414722
52036 1414722 1397911 1381739 1365777 1349592 1333147 1316925 1301361 1286136 1270469 1254169 1237914
52025 1237914 1222166 1206297 1189255 1170888 1152167 1134213 1117548 1102241 1088274 1075598 1064066
52014 1064066 1053530 1043874 1034845 1025926 1016511 1006262 995322 984173 973198 962290 950887 938399
52002 938399 924618 909864 894887 880548 867319 855039 843375 832528 823142 815369 808350 800883
51990 800883 792355 782776 772122 760134 746726 732243 717210 701984 686667 671196 655557 640040
51978 640040 625176 611261 597985 584807 571758 559711 549822 542792 538616 536872 537180 539403 543349
51965 543349 548412 553806 559248 565042 571240 577108 581798 585175 587380 587850 585586 580461 573594 566225
51951 566225 558840 551616 545090 539930 536526 535173 536193 539421 544046 549552 556471 565628 576937 589627
51937 589627 603426 618690 635299 652170 668055 682264 694479 704488 712505 719238 725245 730390
51925 730390 734084 735595 733850 727460 715601 698791 678494 656148 632830 609524 587129 566195
51913 566195 547034 530053 515691 504028 494828 487944 483357 480887 480192 481104 483603 487358 491565 495367
51899 495367 498208 499739 499628 497554 493207 486332 477101 466472 455797 445886 436740 428322 421188 416041
51885 416041 413006 411718 411909 413483 416120 419276 422686 426662 431826 438669 447210 456756 466001 473726
51871 473726 479516 483656 486339 487272 486124 483086 478778 473851 468889 464525 461312 459395 458521 458396 458896
51856 458896 459857 460878 461568 461972 462495 463238 463568 462588 460020 456371 452198 447487 441970 435816 429658 423998
51840 423998 418835 413966 409423 405527 402630 400870 400061 399771 399553 399194 398774 398533 398699 399300 400005 400240 399689
51823 399689 398613 397429 396054 394035 391407 389012 387709 387480 387658 387879 388437 389698 391462 393012 393674
51808 393674 393283 392251 391212 390461 389714 388573 387180 386205 386086 386529 386895 386928 386858 386894 386877 386419 385222 383251
51790 383251 380845 378659 377308 376923 377180 377759 378568 379504 380360 381175 382402 384395 386877 389259 391429 393913
51774 393913 397252 401545 406643 412485 419109 426531 434636 443044 451148 458550 465397 471905 477494 480827
51760 480827 480853 477522 471415 463240 453891 444426 435419 426626 417685 408885 400782 393372 386259 379527 373887
51745 373887 369903 367536 366474 366492 367434 369208 371859 375351 379292 383203 387036 391095 395490 399985 404254
51730 404254 407839 409971 410025 408320 405975 403856 402077 400579 399616 399343 399335 398819 397208 394401 390923 387807
51714 387807 385894 385152 385070 385657 387304 389641 391438 392114 392538 393761 395671 397533 399211 400965 402540 403435
51698 403435 403833 404372 405126 405655 405984 406658 407767 408738 409264 409661 410038 409872 408716 406736 404138 400636 396051
51681 396051 391072 386868 384037 382310 381174 380451 380243 380545 381001 381076 380551 379789 379411 379771 381005 383409 387363
51664 387363 392774 398957 405152 410889 415742 419126 420585 420172 418481 416504 415372 415871 418105 421877 427343
51649 427343 434752 443463 451715 457683 460408 459596 455188 447601 437974 427544 416986 406746 397657 390530
51635 390530 385231 380847 376919 374062 373186 374494 377354 380849 384198 386889 388713 389659 389688 388639 386432
51620 386432 383312 379806 376420 373336 370375 367278 363972 360502 356810 352883 349161 346428 345040 344437
51606 344437 343742 342718 341875 341755 342476 344000 346489 350200 355171 361167 367981 375712 384700 395023 405959
51591 405959 416068 423826 428186 428681 425484 419637 412833 406518 401328 397557 395754 396260 398504 401617
51577 401617 405791 412251 421565 432682 444101 455467 467445 480479 494368 508859 523846 538918
51565 538918 553366 567014 580760 596046 614090 635703 661461 691508 725179 761068 797480
51554 797480 832689 864901 892412 914085 929538 938655 940955 935707 922718 902774 877184 847126
51542 847126 813668 778169 742151 706699 672405 640063 610982 586214 565741 548831 534998
51531 534998 524113 515749 509134 503929 500422 498483 496791 493711 488797 482953 477153 471497 465558 459128
51517 459128 452363 445484 438672 432132 426061 420579 415771 411687 408194 404949 401620 398094 394462 390894
51503 390894 387573 384571 381758 379054 376746 375237 374337 373245 371515 369705 368617 368218 367888 367529 367671
51488 367671 368404 368966 368815 368467 368736 369537 370090 370106 370069 370338 370573 370266 369373 368138 366654 364940 363219 361717
51470 361717 360228 358249 355671 353088 351215 350059 348894 347089 344857 343006 341982 341365 340417 338949 337452
51455 337452 336461 336135 336498 337750 339970 342683 345143 347231 349841 354188 360788 369267 379012 389692 401023
51440 401023 412275 422368 430547 436776 441359 444328 445468 444933 443589 442431 441599 440132 436825 431341
51426 431341 424524 417748 412056 407734 404409 401386 398073 394345 390518 387012 384077 381871 380506 379755
51412 379755 378869 377127 374719 372777 372286 373090 374184 374796 374959 375107 375520 376265 377387 378919 380745 382657
51396 382657 384555 386564 389025 392450 397307 403637 410897 418423 426153 434849 445554 459009 475578
51383 475578 495457 518718 545282 575220 609060 647467 690510 737426 787127 838512 890034
51372 890034 939263 983394 1020289 1048836 1068483 1078762 1079363 1070337 1052068 1025233 990943 950755
51360 950755 906417 859528 811409 763109 715534 669780 627300 589461 556711 528366 503368
51349 503368 481210 462083 446275 433574 423150 413935 405290 397383 390763 385443 380697 375946 371549
51336 371549 368359 366670 365969 365645 365456 365257 364784 364013 363451 363713 364875 366454 367921 369049 369841 370366 370716
51319 370716 370931 370873 370324 369310 368233 367549 367338 367297 367142 366893 366745 366739 366636 365973 364282 361468 358129 355318
51301 355318 353711 353033 352516 351788 351039 350390 349560 348274 346587 344661 342567 340568 339196 338690 338631 338626 339112
51284 339112 340956 344312 348372 352360 356382 361100 366818 373011 378512 382130 383378 382778 381364 379880
51270 379880 378627 377955 378368 379990 382302 384712 387142 389798 392556 394857 396120 396106 394982 393158 390889
51255 390889 387916 383741 378470 373112 368707 365275 362013 358425 354875 352010 350044 348796 348075 347734 347460
51240 347460 346800 345467 343578 341644 340374 340275 341262 342702 344013 345272 346999 349344 351704 353347 354272
51225 354272 355173 356550 358215 359739 361005 362066 362733 362797 362548 362577 362997 363241 362871 362252 362165 363018 364625 366573
51207 366573 368554 370438 372290 374250 376280 378143 379744 381273 382818 384094 384832 385223 385610 385897 385648
51192 385648 384736 383497 382323 381495 381432 382538 384597 386682 387898 387984 387088 385344 383039 380882 379687 379800
51176 379800 380985 382702 384270 384980 384525 383406 382631 382890 384105 385707 387199 388449 389677 391203 393084
51161 393084 395002 396593 397804 398805 399650 400250 400550 400417 399380 396873 392893 388158 383526 379506 376408
51146 376408 374484 373548 372799 371481 369673 368070 367054 366358 365600 364760 364083 363861 364369 365629 367151 368334
51130 368334 369257 370642 372755 374862 376227 377243 378981 381793 385033 388047 390764 393166 394905 395814 396354
51115 396354 397108 398140 399189 400227 401448 402892 404467 406165 407922 409377 410221 410724 411552 412984 414677
51100 414677 416258 417782 419447 421140 422531 423424 423798 423639 422972 422022 421181 420763 420882 421518 422489 423332 423407
51083 423407 422424 420898 419856 419927 420778 421616 422046 422191 422111 421636 420908 420620 421361 423039 425285 428140 431798
51066 431798 435954 440105 444569 450575 458980 469329 480612 492642 506159 521508 537617 552582
51054 552582 565241 576029 586252 596694 607181 617417 627680 638286 648601 657151 662765 665311
51042 665311 665334 663376 659701 654306 647022 637970 628074 618884 611636 606541 602892 599489 595001 588495 580035
51027 580035 570510 560701 550837 541239 532856 526653 522685 520221 518671 518015 518446 520080 523038 527506 533582
51012 533582 541129 549769 558906 567978 576867 585991 595818 606379 617286 628001 638008 647003 655101
50999 655101 662610 669499 675338 679810 682886 684447 684401 683419 682778 682926 682937 682114 681464 682639 685898 690177
50983 690177 694983 701091 709454 720440 734147 750310 767659 784478 800258 816066 833092 851750
50971 851750 872601 897066 926455 960980 1000249 1044074 1092185 1143890 1198775 1257172 1319236
50960 1319236 1383980 1449903 1516088 1582022 1646801 1709212 1768230 1822704 1871077 1912302 1946765
50949 1946765 1975524 1998893 2016547 2028669 2036022 2039082 2038201 2034688 2030687 2027569 2025029 2021878 2017043
50936 2017043 2009663 1999043 1985058 1968314 1949674 1929759 1908681 1885758 1859662 1829486 1795599
50925 1795599 1758761 1718594 1673931 1624780 1572907 1520130 1467013 1413676 1360899 1309669 1260441
50914 1260441 1213686 1170552 1132052 1097906 1066990 1038689 1013047 989842 968383 948317 929903
50903 929903 913277 897948 883231 868901 855293 843041 832693 824299 817321 811185 805921 802016
50891 802016 799652 798340 797373 796432 795712 795602 796257 797431 798768 800278 802402 805562 809889 815443 822326
50876 822326 830345 838949 847900 857760 869212 882032 895290 908572 922524 938054 955457 974568
50864 974568 995429 1018395 1043732 1071545 1102217 1136703 1176113 1220978 1271075 1326083 1386311
50853 1386311 1452708 1526296 1607799 1697690 1796266 1903585 2019517 2143849 2276035 2414840
50843 2414840 2558600 2705932 2855765 3006446 3155106 3298111 3431801 3552693 3657570
50834 3657570 3744064 3811145 3858797 3887451 3897996 3892059 3871859 3839942 3799391 3753957 3707477
50823 3707477 3663118 3623325 3590033 3564277 3545642 3532534 3522948 3514568 3504279 3488230 3462652 3424639
50811 3424639 3372590 3306519 3227785 3137900 3037537 2927042 2807641 2681573 2551338 2419691
50801 2419691 2290231 2166772 2051599 1944978 1846689 1757276 1677387 1606722 1544438 1490092
50791 1490092 1443511 1404047 1370679 1342699 1319757 1301433 1287238 1276813 1269540 1264053 1258752 1252893
50779 1252893 1246806 1241077 1235914 1231194 1226583 1221472 1215187 1207436 1198364 1188230 1177286 1165875 1154161
50766 1154161 1141744 1127968 1112812 1097084 1081610 1066552 1051812 1037782 1025328 1015060 1006869
50755 1006869 1000162 994421 989628 986282 985035 986282 990179 997037 1007471 1021988 1040542 1062696 1088178
50742 1088178 1117170 1150103 1187379 1229269 1275853 1326931 1382103 1441026 1503546 1569544 1638747
50731 1638747 1710744 1785058 1861083 1938029 2015116 2091777 2167526 2241666 2313249 2381239 2444452
50720 2444452 2501319 2550066 2589221 2617687 2634178 2637076 2625422 2600078 2563703 2519617 2470891
50709 2470891 2420287 2370522 2324295 2284046 2251482 2227009 2209697 2198115 2191190 2187950 2186654 2184793
50697 2184793 2180020 2170598 2154810 2130685 2096785 2052952 1999964 1938874 1871134 1798969 1725019 1651677
50685 1651677 1581104 1515497 1456533 1404487 1358465 1317777 1282759 1254194 1232412 1217177 1208115
50674 1208115 1204835 1206759 1213110 1223145 1236279 1251973 1269583 1288407 1307910 1327795 1347665 1366628
50662 1366628 1383542 1397884 1410198 1421520 1432590 1443873 1455971 1469447 1484208 1499667 1515620
50651 1515620 1532547 1550877 1570468 1591174 1613566 1638654 1667045 1698730 1733568 1771561 1812667
50640 1812667 1856697 1903500 1952930 2004446 2056944 2109194 2160372 2210085 2258065 2304148 2348488
50629 2348488 2391431 2433076 2473286 2512300 2550762 2588221 2621272 2643819 2650094 2638006 2610019
50618 2610019 2571391 2527836 2484163 2443841 2408960 2380484 2358680 2343343 2333769 2328862 2327373 2327895
50606 2327895 2328629 2327476 2322576 2312601 2296472 2273057 2241392 2201102 2152420 2095990 2032909 1964949
50594 1964949 1894424 1823649 1754415 1687756 1624012 1563104 1504950 1449709 1397667 1349011 1303837
50583 1303837 1262310 1224604 1190660 1160153 1132774 1108502 1087584 1070317 1056905 1047396 1041589 1039011
50571 1039011 1039132 1041704 1046835 1054631 1064834 1076957 1090734 1106240 1123481 1142119 1161776 1182458
50559 1182458 1204408 1227623 1251757 1276473 1301628 1327085 1352646 1378240 1403902 1429455 1454395
50548 1454395 1478216 1500667 1521688 1541431 1560580 1580321 1601696 1625205 1651306 1681024 1715602
50537 1715602 1755643 1801064 1851830 1908251 1970470 2038114 2110694 2188109 2270627 2358720 2452978
50526 2452978 2553775 2660610 2772033 2886459 3002826 3120171 3236866 3350680 3459313
50517 3459313 3560299 3650607 3727137 3787948 3832508 3860482 3870677 3861608 3832817 3785340 3721219
50506 3721219 3643079 3554073 3457629 3357034 3255511 3156729 3064849 2983757 2916246 2863882 2827312
50495 2827312 2806502 2800835 2809212 2830086 2861392 2900572 2944630 2989862 3031380 3063287 3079923 3077268
50483 3077268 3053322 3007562 2940628 2854593 2753021 2640238 2520402 2397199 2274056 2154121
50473 2154121 2039839 1932661 1833334 1742435 1660534 1587857 1523920 1467585 1417467 1372284 1331009
50462 1331009 1293009 1258234 1227175 1200470 1178474 1161213 1148584 1140444 1136502 1136349 1139640 1146145
50450 1146145 1155586 1167548 1181656 1197753 1215814 1235754 1257371 1280481 1305065 1331215 1358776
50439 1358776 1386814 1413495 1436778 1455374 1469018 1477935 1482469 1483382 1482035 1479747 1476987 1473499 1469078
50426 1469078 1463873 1458081 1451996 1446545 1443275 1443429 1447259 1454482 1465116 1479530 1498074 1521168 1549608
50413 1549608 1584143 1624593 1669829 1718841 1771547 1828211 1888243 1949819 2010774 2069796 2126652
50402 2126652 2181206 2232277 2277749 2315966 2346670 2370122 2385477 2390583 2383451 2363458 2331109 2287376
50390 2287376 2233656 2171855 2103961 2031879 1958090 1886017 1818901 1758341 1704466 1657484 1618475
50379 1618475 1588655 1568540 1557992 1556482 1562909 1575585 1592792 1613071 1634616 1654661 1669924 1677744
50367 1677744 1676690 1666335 1646784 1618393 1581751 1537890 1488638 1436521 1384032 1332856 1283823
50356 1283823 1237442 1194264 1154807 1119416 1088292 1061510 1038865 1019832 1003857 990837 981120
50345 981120 974740 970422 965573 957659 945799 931049 915317 900232 886814 875610 866799 860407 856644
50332 856644 855927 858375 863390 869784 876255 881924 886783 891768 898082 906226 915858 926504 937943 949763
50318 949763 961084 971089 979519 986264 990869 992948 992908 991801 990473 989138 987597 985550 982910 980185
50304 980185 978391 978243 979599 982014 985564 990657 997325 1005260 1014410 1024973 1037024 1050788 1067009
50291 1067009 1086226 1107823 1130755 1155169 1181818 1209172 1232142 1244842 1244457 1232087 1210779 1183849
50279 1183849 1154630 1126225 1100738 1079035 1061331 1047518 1036932 1028487 1021447 1015825 1011871 1009459
50267 1009459 1008082 1007187 1006409 1005791 1005880 1007324 1010224 1014091 1018559 1023884 1030640 1039192 1049644 1061973 1075824
50252 1075824 1090376 1104793 1118881 1133023 1147441 1161800 1175643 1189008 1202340 1215848 1229216
50241 1229216 1241932 1253607 1263699 1271057 1274158 1272095 1265208 1254612 1241254 1225663 1208527 1191048
50229 1191048 1174478 1159491 1146175 1134467 1124163 1114398 1103416 1089165 1070286 1046643 1019192
50218 1019192 989497 959254 929935 902597 877827 855716 835920 818006 801967 788238 776938
50207 776938 767293 758226 749510 741845 735645 730295 724972 719754 715375 712097 709397 706732 704018 701295
50193 701295 698388 695105 691429 687430 683331 679703 677044 674942 672155 667882 662654 657564 653028 648791
50179 648791 644843 641612 639245 637323 635503 633919 632688 631453 629898 628548 628542 630443 633538 636417 638193
50164 638193 639065 639851 641183 643180 645617 648195 650703 653228 656244 660302 665522 671562 678174 685609 694245
50149 694245 703978 714228 724519 734885 745722 757477 770467 784843 800602 817816 836945 858795
50137 858795 884058 912869 944811 979275 1015672 1053351 1091445 1128984 1165269 1200188 1234159
50126 1234159 1267661 1300636 1332040 1359887 1381884 1396324 1402521 1400413 1389976 1371316 1345360 1314082
50114 1314082 1279722 1243742 1206651 1168737 1130868 1094639 1061811 1033497 1009621 989099 970523
50103 970523 952737 934961 916805 898430 880516 863737 848317 834241 821700 810972 801841 793617
50091 793617 785912 779160 774107 770999 769568 769636 771301 774441 778390 782390 786215 790146 794432 799027 803792
50076 803792 808679 813626 818509 823318 828206 833239 838207 842766 846614 849446 850989 851313 850884 850065 848734
50061 848734 846655 843978 840932 837283 832673 827463 822616 818561 814734 810507 806088 802185 799228 797347
50047 797347 796743 797568 799670 802879 807384 813398 820638 828616 837336 847208 858297 870116 882225 894560
50033 894560 907106 919695 932293 945092 958056 970679 982465 993386 1003621 1013106 1021768 1030118
50021 1030118 1039127 1049301 1060128 1070721 1080904 1091404 1102910 1115216 1127424 1138737 1148742
50010 1148742 1157200 1164181 1170496 1177400 1185425 1193783 1201208 1207007 1210865 1211999 1209238 1201921 1190135 1174132
49996 1174132 1154142 1130967 1106092 1080776 1055367 1029828 1004621 980592 958181 937108 916743
49985 916743 896519 876086 855423 834890 814933 795695 777061 759102 742259 726962 713225
49974 713225 700849 689978 681215 674914 670470 666672 662862 659466 657107 655519 653777 651494 649216 647579
49960 647579 646666 646501 647677 650867 655875 661710 667689 674143 681920 691398 702090 712986 723131 731988
49946 731988 739402 745317 749659 752529 754378 755673 756312 755543 752598 747327 740147 731518 721657 710689
49932 710689 698776 685996 672314 657931 643607 630420 619113 609746 601992 595644 590775 587542
49920 587542 585917 585633 586365 587999 590629 594161 598016 601501 604491 607464 610808 614449 618332 622941 628973
49905 628973 636731 646149 657159 669570 682686 695573 707744 719201 729724 738598 745240 749768
49893 749768 752653 754067 753790 751539 747134 740423 731310 719957 706932 693253 680136 668375 657788
49880 657788 647488 636900 626376 616629 607733 599067 590277 582017 575486 571238 568656 566699 565045
49867 565045 564311 565155 567539 571011 575353 580609 586716 593636 601773 611759 623708 637102 651446 666500
49853 666500 681630 695472 706790 715499 722497 728562 733750 737677 739998 740536 739251 736200 731424 724829
49839 724829 716250 705749 693889 681715 670336 660314 651506 643676 637170 632662 630214 628968 627925
49826 627925 626796 625993 626148 627834 631411 636820 643600 651320 659797 668860 678289 688158 698791 709977
49812 709977 720579 729457 736557 742612 747885 751755 753543 753240 751285 747948 743125 736627 728626 719876
49798 719876 711357 703548 696189 688870 681501 673946 665670 656317 646404 636857 628064 619989 613043 608005
49784 608005 604946 603018 601547 600708 600842 601705 602810 604002 605280 606542 607971 610294 614176 619602 626175
49769 626175 633659 641794 649972 657647 664816 671553 677325 681475 684233 686457 688247 688509 686241 681814
49755 681814 676560 671344 665821 659009 650356 640320 629977 620092 610660 601490 593046 586339 581984 579676
49741 579676 578593 578026 577578 577194 577150 577689 578537 579151 579627 580915 583740 587686 591822 595952 600686 606316
49725 606316 612308 618125 624153 631516 641091 652883 666163 680047 693942 707508 720242 731196
49713 731196 739285 743851 744871 742738 738083 731731 724477 716760 708724 700595 692776 685526 678888 673121
49699 673121 668883 666676 666110 665957 665016 662970 660516 658672 657883 657775 657879 658441 660215 663607 668447 674620
49683 674620 682294 691310 700948 710802 721499 734015 748599 764884 782792 802490 823359 843530
49671 843530 860578 872481 878205 878076 873795 867586 861124 855338 850895 848145 846723 846037 846215 847638
49657 847638 849169 847811 840946 828538 812645 795284 777412 759523 742246 726264 712125 700188
49645 700188 690386 682255 675541 670573 667657 666408 666197 666934 668733 671006 672647 673072 672425 670733 667636
49630 667636 663080 657611 651740 645603 639474 633977 629429 625403 621319 617067 612849 608877 605540 603346
49616 603346 602252 601418 600100 598502 597334 596844 596778 596986 597508 598192 598809 599536 600849 602843 605039 606913
49600 606913 608293 609212 609693 609821 609747 609570 609401 609599 610705 612949 615881 618582 620278 620929 621283 622170 623604
49583 623604 624794 625226 625430 626303 627919 629533 630704 631845 633548 635916 638751 642006 645729 649866 654420
49568 654420 659621 665714 672777 680894 690277 700910 712235 723423 733807 742898 750219 755500 758916
49555 758916 760849 761399 760363 757598 753216 747547 741225 735221 730431 727106 724904 723466 722644 722165 721485
49540 721485 720263 718809 717852 717886 718850 720386 722300 724771 728152 732634 738275 745432 754857 767053 781644
49525 781644 797794 815159 833971 854117 874622 894150 911537 925650 935402 940559 942242 942129
49513 942129 941309 940274 939681 940401 942803 946491 950726 954603 956911 956449 952700 945787 935773 922570 906731
49498 906731 889782 873395 858517 845425 834041 823858 814106 804577 796043 789427 784764 781368 778753
49485 778753 776859 775601 774773 774455 774993 776478 778529 780695 782772 784679 786300 787521 788284 788606 788679 788883
49469 788883 789532 790680 792352 794757 797963 801522 804785 807498 809741 811408 812209 812171 811675 810948 809932 808664
49453 808664 807239 805318 802224 797858 793059 788699 784790 780871 776952 773590 771252 770005 769778 770523 772159
49438 772159 774665 778230 782998 788738 795032 801874 809777 819159 829796 841024 852370 863833 875598
49425 875598 887552 899198 910080 920295 930463 941016 951379 959831 964256 963400 957715 949056 939473
49412 939473 930308 922397 916711 914202 915013 918378 923569 930657 940122 952084 966205 982016 998917
49399 998917 1016046 1032595 1048324 1063526 1078594 1093755 1108974 1123733 1137062 1148244 1157363 1164738
49387 1164738 1169914 1171831 1170114 1165577 1159179 1151023 1140833 1128991 1116474 1103921 1091377 1079001
49375 1079001 1067513 1057697 1049777 1043512 1038733 1035590 1034369 1035199 1037861 1041787 1046321 1051060 1055798 1060076
49361 1060076 1063046 1064059 1063280 1061385 1058659 1054706 1049151 1042338 1035130 1028229 1021883 1016143 1011102 1006961
49347 1006961 1004025 1002572 1002496 1003096 1003477 1003178 1002293 1000989 999185 996698 993500 989739 985691 981756 978361
49332 978361 975743 973962 973054 972992 973534 974432 975845 978209 981575 985508 989897 995496 1003277 1013558 1026218
49317 1026218 1041415 1059235 1078363 1095719 1107993 1113538 1112773 1107253 1098766 1089022 1079338 1070096 1060664
49304 1060664 1050241 1038819 1027199 1016173 1006002 996735 988683 982292 977693 974707 973104 972496 972061
49291 972061 970886 968809 966518 964578 962676 960109 956665 952577 947870 942291 935957 929565 923866 919215
49277 919215 915810 914011 914145 916105 919369 923393 927857 932550 937214 941650 945923 950258 954587 958320
49263 958320 960775 961841 962004 961760 961319 960937 961251 963031 966841 972967 981347 991342 1001950 1012493 1022675
49248 1022675 1031619 1037458 1038571 1034904 1027460 1016907 1003685 989232 975802 964593 954951 945887 937567
49235 937567 930770 925704 922202 920547 921173 923830 927863 933087 939605 946928 954182 961285 969125 978291
49221 978291 988252 998109 1007538 1016572 1024958 1032305 1038715 1044734 1050669 1056259 1061118 1065320 1069471 1074232
49207 1074232 1079838 1086204 1093506 1102441 1113659 1127028 1141752 1157148 1173010 1189296 1205930 1223028
49195 1223028 1240806 1258945 1276418 1292340 1306780 1320341 1333127 1344565 1354237 1362478 1370047 1377479
49183 1377479 1384882 1392187 1399460 1407107 1415944 1427037 1441332 1459337 1481044 1506134 1534314 1565582
49171 1565582 1600135 1637890 1677928 1718161 1755408 1785990 1806952 1817432 1819190 1815728 1810564 1805954
49159 1805954 1802692 1800741 1799991 1800487 1802002 1803625 1804198 1803429 1802348 1802383 1804116 1807201 1811300 1816675 1823863
49144 1823863 1833086 1844069 1856184 1868743 1881433 1894539 1908512 1923288 1938331 1953337 1968528
49133 1968528 1984149 2000169 2016652 2033938 2051981 2069893 2086705 2102456 2118022 2133949 2150000
49122 2150000 2165865 2181788 2198278 2215702 2234478 2255314 2278854 2305270 2334651 2367748 2406024
49111 2406024 2450825 2502804 2562462 2631323 2712196 2807338 2915136 3028113 3135416 3229444 3311399
49100 3311399 3389688 3470898 3550852 3614379 3644804 3635088 3591355 3527015 3453702 3376283 3293994
49089 3293994 3204728 3108610 3008957 2910936 2819442 2737725 2667327 2608585 2560829 2522389 2491113
49078 2491113 2465246 2443772 2425938 2410716 2396914 2383675 2370743 2358315 2346731 2336187 2326634
49067 2326634 2317882 2309789 2302244 2295038 2287984 2281225 2275171 2269955 2265142 2260238 2255333 2250915 2247068 2243249
49053 2243249 2239109 2235239 2232762 2232195 2233047 2234614 2236867 2240372 2245526 2252185 2259934 2268314 2276602 2283626
49039 2283626 2288083 2289124 2286707 2281697 2275757 2270735 2267688 2266448 2266331 2267135 2269099 2272038 2275094 2277505
49025 2277505 2279211 2280488 2281351 2281639 2281415 2280838 2279795 2278053 2275832 2273903 2273029 2273447 2274938 2277249 2280407
49010 2280407 2284779 2290818 2298595 2307559 2316920 2326324 2336005 2346287 2357107 2368100 2378956 2389454 2399198
48997 2399198 2407550 2413994 2418555 2421716 2423919 2425208 2425436 2424691 2423330 2421559 2419197 2415977 2411999 2407761
48983 2407761 2403838 2400595 2398037 2395693 2392714 2388356 2382517 2375780 2368922 2362378 2356031 2349338 2341739 2333131
48969 2333131 2323983 2314796 2305554 2295965 2286298 2277554 2270668 2265794 2262658 2261345 2262377 2266033 2271995 2279696
48955 2279696 2288737 2298895 2310034 2322212 2335668 2350463 2366231 2382517 2399284 2416870 2435446
48944 2435446 2454699 2474144 2493615 2513424 2534163 2556403 2580475 2606424 2634236 2664098 2696401
48933 2696401 2731415 2769084 2809131 2851236 2895081 2940393 2987124 3035472 3085557 3137197 3190187
48922 3190187 3244703 3301115 3359356 3418710 3478280 3537356 3595296 3651435 3705543 3758173 3810086
48911 3810086 3861289 3910995 3958593 4004218 4048210 4090417 4130521 4168794 4205943 4242169 4276894
48900 4276894 4309631 4340651 4370443 4398858 4425195 4448926 4469853 4487775 4502616 4514913 4525488
48889 4525488 4534389 4540686 4543704 4544004 4542644 4539780 4534582 4526340 4515050 4500874 4483683 4463387 4440300
48876 4440300 4414756 4386495 4354749 4318924 4279078 4235737 4189386 4140250 4088552 4034852 3979955
48865 3979955 3924483 3868814 3813505 3759443 3707295 3657124 3608877 3562944 3519692 3478644 3438810
48854 3438810 3399960 3362968 3328741 3297364 3268611 3242659 3219781 3199693 3181883 3166520 3154502
48843 3154502 3146498 3142229 3140775 3141314 3143482 3147181 3152265 3158538 3166155 3175840 3188367 3203620 3220435
48830 3220435 3237586 3254774 3272486 3291088 3310427 3330187 3350233 3370489 3390747 3410768 3430435
48819 3430435 3449720 3468563 3486903 3504831 3522650 3540690 3559033 3577477 3595823 3614056 3632173
48808 3632173 3650072 3667911 3686383 3706160 3727050 3748186 3769214 3790837 3813926 3838521 3864007
48797 3864007 3889872 3915819 3941389 3965946 3988980 4010158 4029275 4046517 4062518 4077748 4091941
48786 4091941 4104583 4115821 4126382 4136457 4145062 4150593 4151735 4147888 4139145 4126070 4109263 4089026
48774 4089026 4065517 4039066 4009992 3978172 3943259 3905456 3865629 3824509 3782136 3738385 3693686
48763 3693686 3648777 3603870 3558548 3512618 3466810 3422378 3380040 3339504 3300047 3261393 3223846
48752 3223846 3187770 3153346 3120842 3090659 3062769 3036385 3010605 2985276 2960996 2938507 2918410
48741 2918410 2901280 2887478 2876851 2868985 2863721 2860947 2859921 2859429 2858827 2858468 2858805 2859583 2860353 2861384 2863433
48726 2863433 2866718 2870645 2874658 2878980 2884255 2890585 2897121 2902681 2906778 2910022 2913377 2917009 2920036 2921551
48712 2921551 2921696 2921496 2921755 2922452 2923242 2924123 2925339 2926859 2928383 2929849 2931605 2933916 2936536 2938983 2941029
48697 2941029 2942746 2944307 2946096 2948875 2953328 2959278 2965648 2971287 2975594 2978470 2980189 2981509 2983339 2985916
48683 2985916 2988700 2991374 2994503 2998705 3003618 3008309 3012446 3016373 3020179 3023462 3025992 3027886 3029037 3029086
48669 3029086 3028198 3027114 3026022 3023913 3019557 3012643 3003331 2991021 2974305 2952235 2925208 2894540 2861592
48656 2861592 2827371 2792545 2757394 2721793 2685616 2649393 2614517 2582558 2554238 2529115 2506274
48645 2506274 2485080 2465124 2445741 2426082 2405722 2384880 2363960 2343166 2322634 2302620 2283357
48634 2283357 2264922 2247362 2230729 2214774 2198763 2181806 2163325 2143248 2122017 2100570 2080084
48623 2080084 2061363 2044461 2029049 2015012 2002507 1991542 1981911 1973723 1967730 1964834 1965225 1968169 1972565
48610 1972565 1977470 1982054 1985486 1987299 1987726 1987248 1985807 1982954 1978843 1974579 1971308 1969382 1968773 1969760 1972537
48595 1972537 1976268 1979203 1979859 1977789 1973331 1967057 1959524 1951032 1941371 1930079 1917096 1903062 1888937
48582 1888937 1875434 1862694 1850297 1837681 1824843 1812493 1801307 1791247 1782047 1774108 1768289 1764876
48570 1764876 1763364 1763361 1765042 1768474 1773022 1777755 1782066 1785566 1787651 1787520 1784459 1778023 1768202 1755613 1741305
48555 1741305 1726209 1710918 1696033 1682298 1670180 1659530 1649764 1640092 1629475 1616863 1601944 1585550
48543 1585550 1568960 1552841 1536955 1520778 1504189 1487626 1471786 1457192 1444004 1432172 1421700
48532 1421700 1412697 1405345 1399948 1396867 1396157 1397438 1400329 1404891 1411415 1420035 1430912 1444369 1460006
48519 1460006 1475523 1487115 1491501 1487564 1476319 1460005 1441398 1423248 1407566 1395265 1386519 1381305
48507 1381305 1379537 1380920 1384885 1390783 1398385 1408225 1421052 1436540 1452993 1468923 1484530 1500673
48495 1500673 1516384 1528375 1533321 1530069 1519487 1503103 1482459 1459150 1434646 1409992 1385869 1362785
48483 1362785 1341161 1321411 1303939 1288766 1275306 1262993 1252001 1242809 1235126 1227998 1221036 1214750
48471 1214750 1209501 1204957 1200898 1197817 1196202 1195745 1195746 1195943 1196652 1198430 1201830 1207046 1213568 1220470 1227065
48456 1227065 1232924 1237460 1240242 1241622 1242174 1241489 1238561 1233533 1228003 1223197 1218807 1214046 1208784 1202982
48442 1202982 1196106 1187967 1179394 1171184 1162962 1153857 1143784 1133325 1122872 1112654 1103143 1094675 1086928
48429 1086928 1079375 1072032 1065325 1059576 1054929 1051239 1047716 1043255 1037565 1031429 1025551 1019801 1013879 1007886
48415 1007886 1001757 995036 987781 980883 974868 969258 963748 959051 955765 953193 950162 946303 941834 936882
48401 936882 931872 927731 924775 922069 918740 915200 912232 909730 907296 905213 903717 902064 899445 896174
48387 896174 892950 889727 886400 883812 882739 882470 881691 880250 878809 877368 875514 873703 872931 873297 873991
48372 873991 874450 874481 873649 871627 868962 866654 865269 865061 866332 868913 872131 876040 881751 889705 898764
48357 898764 908045 918422 930984 945299 960551 976939 994203 1010034 1021923 1029723 1034653 1036998
48345 1036998 1036711 1035245 1034562 1035111 1036701 1040435 1047739 1058370 1071382 1087021 1105690 1126365 1148347
48332 1148347 1173371 1203499 1238167 1275846 1317278 1364501 1418154 1478634 1548320 1629591 1722338
48321 1722338 1826785 1947156 2089503 2258447 2460086 2705582 3007553 3375972 3822722
48312 3822722 4367174 5032530 5841428 6819675 7993025 9367324 10923186 12651206 14577093
48303 14577093 16697771 18857619 20711763 21863052 22069334 21341454 19881395 17961597
48295 17961597 15844040 13742908 11800725 10082504 8599855 7343416 6296034 5432174
48287 5432174 4722639 4142808 3672333 3290361 2977234 2719195 2506812 2330500 2181518
48278 2181518 2055266 1949544 1860781 1784969 1720448 1666615 1621404 1582785 1551014 1526534 1507175
48267 1507175 1490080 1474925 1462616 1452334 1442590 1433934 1427897 1424209 1421483 1419695 1419574 1420356 1420528 1420214
48253 1420214 1420727 1422314 1424279 1426775 1430554 1435386 1440317 1444871 1448369 1448738 1443925 1434193 1421515 1407145
48239 1407145 1391332 1374977 1359756 1346628 1335446 1325927 1317875 1310655 1303561 1296470 1289313 1281366 1272010
48226 1272010 1261713 1251323 1240934 1230309 1219710 1209219 1197890 1184753 1170151 1154982 1139090
48215 1139090 1121526 1101921 1080549 1057571 1033341 1009068 985971 963980 942225 920461 899184
48204 899184 878735 859165 840608 822926 805525 788348 772496 758912 747079 735988 725757
48193 725757 717075 709662 702607 695868 690119 685343 680808 676290 672193 668525 664831 661085 657665 654531
48179 654531 651349 648292 645825 643829 641847 640020 638900 638444 638075 637561 636976 636039 634413 632464 630816
48164 630816 629363 627662 626045 625222 624966 624358 623320 622752 623043 623597 624003 624620 625712 626957 628086 629091
48148 629091 629550 628725 626847 625455 625781 627323 628596 628891 628828 629428 631030 633072 634753 635899 637078 638771
48132 638771 640744 642539 644173 645899 647653 649314 651256 653875 656815 659441 661930 665029 668728 672080
48118 672080 674540 676709 679465 682995 687039 691479 696282 701240 706209 711466 717598 725116 734171 744486
48104 744486 755516 766781 778009 788963 799511 810049 821392 833844 846704 859175 871375
48093 871375 884052 897659 912289 928017 944550 960873 976083 990426 1004842 1019659 1034455
48082 1034455 1048875 1062691 1075295 1086255 1096378 1107140 1118827 1130122 1139806 1147964 1155269 1162016
48070 1162016 1168408 1175020 1182291 1189984 1197660 1205310 1213231 1221623 1230524 1239668 1248152 1254760 1259065 1261844
48056 1261844 1264078 1265887 1266738 1266235 1264228 1260438 1254521 1246492 1236794 1226029 1214782 1203551 1192500
48043 1192500 1181237 1169015 1155271 1140014 1123705 1106734 1089051 1070471 1051301 1032302 1013903
48032 1013903 995849 977889 960402 943891 928176 912670 897152 881650 865806 849164 832134
48021 832134 815878 801034 787143 773570 760399 748132 737014 727056 718365 711015 704713 698876
48009 698876 692979 686769 680292 673872 667950 662847 658649 655203 652175 649288 646627 644525 643046 641894
47995 641894 640971 640482 640170 639051 636609 633806 632085 631611 631372 630805 630341 630215 629731 628163 625740 623341
47979 623341 621617 620640 619991 618956 617043 614518 612175 610575 609835 609995 610958 612043 612280 611396 609976 608539
47963 608539 607033 605412 604080 603426 603398 603805 604598 605636 606617 607571 608950 611004 613471 616165 619384 623397
47947 623397 627950 632690 637785 643730 650683 658316 666227 674323 682909 692454 703055 714085 724545
47934 724545 733828 741977 749309 756138 762736 769082 774669 778972 782102 784512 786090 786121 784238 780770 776166
47919 776166 770710 764925 759446 754102 747839 739992 731152 722323 713780 705269 696868 689032 681976 675530
47905 675530 669585 664343 660200 657460 656050 655433 655076 654991 655505 656600 658004 659932 663059 667569 672878
47890 672878 678475 684332 690226 695537 700361 706041 713783 723129 732552 741231 749468 757599 765396 772586
47876 772586 779306 785803 792028 797608 801980 804588 805248 804326 802320 799370 795318 790068 783613 775895 766992
47861 766992 757349 747532 737720 727694 717257 706511 695710 684983 674233 663359 652653 642876
47849 642876 634698 628110 622630 617957 614100 610970 608408 606613 605960 606309 607123 608433 610984 615060 619791
47834 619791 624090 627752 631255 634950 639000 643638 648837 654042 658741 663099 667600 672364 677271 682408
47820 682408 687873 693401 698759 704386 711140 719466 729155 739780 751117 763380 777359 793962 813223
47807 813223 834063 855469 877492 900525 923983 946471 967088 985841 1002735 1017171 1028386
47796 1028386 1035974 1039870 1040277 1037771 1033121 1026801 1018889 1009440 998766 987316 975533 963848 952636
47783 952636 942229 933002 925195 918487 912093 905645 899715 895024 891347 887646 883137 877772 871837 865595
47769 865595 859347 853287 847141 840239 832174 823229 814137 805474 797205 788778 779838 770944 763247 757278
47755 757278 752423 747853 743493 739764 736849 734823 734051 734753 736350 737991 739643 742064 745796 750827 757107
47740 757107 764654 773114 781979 791431 802331 815105 829200 843866 858927 874461 890209 905731
47728 905731 920864 935633 949890 963320 975656 986692 996112 1003483 1008442 1010941 1011324 1010029 1007078
47715 1007078 1002079 994822 985599 974703 962081 947946 933362 919495 906373 893098 879229 865293
47703 865293 851895 839107 827028 816280 807498 800749 795752 792287 790086 788740 788107 788588 790658 794337
47689 794337 799344 805586 813237 822482 833350 845609 858701 872069 885701 900111 915502 931208
47677 931208 946247 960218 973377 985894 997441 1007566 1016247 1023852 1030545 1035849 1038974 1039566 1037961
47664 1037961 1034589 1029447 1022403 1013758 1004021 993259 981177 967888 954132 940584 927389 914556
47652 914556 902358 891021 880397 870337 861140 853197 846338 839968 833932 828895 825683 824486 824882
47639 824882 826525 829503 833887 839191 844682 850298 856977 865798 876923 889571 903028 917424 933561
47626 933561 952106 973009 995684 1019699 1045119 1071897 1099034 1124774 1147761 1167589 1184066
47615 1184066 1196526 1204255 1207113 1205109 1197769 1184565 1165751 1142092 1114032 1081891 1046790 1010501
47603 1010501 974240 938259 902661 867955 834673 803244 774436 749149 727441 708436 691546
47592 691546 677083 665202 654973 645170 635507 626421 618017 610018 602564 596339 591750 588416 585534
47579 585534 582518 579344 576508 574576 573552 572805 571756 570426 569096 567733 566077 564066 561841 559496
47565 559496 557134 554965 552956 550571 547300 543414 539839 537239 535485 533939 531973 529248 525850 522305
47551 522305 519220 516798 514766 512769 510750 508970 507711 506885 505955 504501 502981 502570 503867 506001 507469
47536 507469 507751 507642 507933 508338 508026 506840 505462 504458 503700 502935 502538 503154 504686 506146 506796 506987 507473
47519 507473 508256 508716 508740 508942 509604 510140 510063 509923 510689 512493 514560 516213 517391 518225 518693 518841 518917 519116
47501 519116 519441 519944 520788 521933 522981 523528 523569 523451 523547 523990 524539 524611 523696 521956 520298 519630 520039 520873
47483 520873 521608 522399 523721 525690 527971 530298 532830 535939 539720 543779 547447 550237 552248 554141 556528
47468 556528 559407 562339 565168 568173 571389 574192 575896 576520 576631 576657 576759 577132 577930 578954 579861 580681
47452 580681 581776 583351 585409 588090 591525 595464 599679 604787 611957 621565 632733 644538 657114
47439 657114 671223 687228 704921 723925 743828 764218 785028 806508 828447 849706 868978
47428 868978 885755 900100 911830 920482 925993 928820 929384 927774 923947 917891 909615 899349 887663
47415 887663 875078 861649 847311 832511 818027 804184 790700 777367 764480 752420 741127
47404 741127 730239 719570 709320 699860 691416 683910 677057 670628 664602 659197 654884 652269 651565 652141
47390 652141 652960 653603 654528 656274 658959 662797 668306 675451 683132 690276 697096 704523 712705 720937 728822
47375 728822 736505 743722 749594 753693 756539 758718 760151 760470 759408 756519 751292 744018 735869 727542
47361 727542 718438 707811 696133 684473 672962 660843 647966 635249 623553 612853 602759 593166
47349 593166 584042 575130 566401 558460 551987 546912 542486 538085 533573 528985 524310 519773 516001 513574
47335 513574 512423 511843 511104 510031 509051 508832 509820 511947 514743 517796 521120 524941 529158 533239 536717
47320 536717 539664 542533 545711 549243 552746 555374 556134 554653 551650 548411 545789 543829 542228 540820
47306 540820 539587 538508 537496 536348 534851 533208 532239 532739 534551 536679 538471 540350 543140 547094 551899
47291 551899 557309 563317 569762 576261 582656 589332 596949 605877 615851 626169 636324 646523 657380
47278 657380 669092 681167 693160 705322 718222 731981 746306 761091 776435 792006 806833
47267 806833 819848 830208 837013 839221 836386 829367 819899 809470 798673 787498 775891 764015
47255 764015 752228 740942 730454 720823 711893 703397 695061 686822 679026 672280 666932 662714 659040
47242 659040 655556 652267 649313 646875 645294 644947 645871 647674 649906 652426 655347 658800 662865 667630 673164
47227 673164 679435 686301 693596 701308 709676 718984 729067 739149 748450 756890 764903 772654 779865 786434
47213 786434 792571 797991 801571 802413 801008 798730 796245 792992 788198 781834 774453 766590 758608 750780
47199 750780 743238 736005 729271 723434 718760 715156 712394 710405 709277 709214 710533 713472 717845 723103 728861
47184 728861 735282 742856 752046 763159 776234 790864 806353 822268 838730 856112 874605 894077
47172 894077 914072 933822 952565 969972 986020 1000400 1012503 1022159 1029924 1036351 1041405 1044876
47160 1044876 1046855 1047317 1045738 1041781 1036047 1029440 1022031 1013319 1003458 993328 983328 973056 962507
47147 962507 952676 944350 936988 929564 922079 915448 910112 905660 901895 899429 898882 900036 902186 904965
47133 904965 908396 912471 917205 922974 930172 938424 946604 953813 959958 965202 969291 971835 972871 972602
47119 972602 970752 966783 960698 953027 943980 933272 921068 908412 896203 884170 871482 858107
47107 858107 844913 832484 820541 808646 796977 786045 775956 766264 756533 746792 737466 728933
47095 728933 721253 714310 708093 702675 697971 693819 690381 688169 687460 687917 689047 690791 693365 696684 700339
47080 700339 704118 708224 712978 718495 724587 730705 736097 740380 743952 747550 751359 754883 757703 760003
47066 760003 762172 764160 765457 765671 765032 764364 764524 765744 767532 769218 770484 771326 771852 772409 773655 776052
47050 776052 779365 783099 787348 792773 799651 807365 814987 822089 828892 835870 843269 850813 857853 864055
47036 864055 869899 876169 883079 890274 897612 905358 913561 921873 930195 938884 947939 956603 964314 971679
47022 971679 979903 989383 999295 1008372 1015591 1020311 1022419 1022468 1021322 1019459 1016824 1013286 1008877 1003512 996919
47007 996919 989134 980940 973498 967471 962558 957924 953108 948479 944810 942474 941202 940564 940333 940346 940434 940860
46991 940860 942548 946321 951864 957868 963343 968488 974141 980749 988207 996463 1005720 1015996 1026870 1037908
46977 1037908 1049105 1060635 1072335 1083812 1095082 1106699 1119046 1131793 1144303 1156352 1168134
46966 1168134 1179657 1190548 1200424 1209091 1216331 1221910 1225921 1228798 1230803 1231817 1231913 1231802 1232273 1233287
46952 1233287 1234021 1233894 1233259 1232976 1233525 1234655 1235855 1237013 1238643 1241505 1246049 1252174 1259423 1267280 1275342
46937 1275342 1283459 1291840 1300832 1310430 1320055 1329036 1337305 1345468 1354170 1363488 1372930 1381902 1390101 1397533
46923 1397533 1404272 1410262 1415281 1419006 1421000 1420682 1417561 1411628 1403437 1393601 1382232 1369074 1354212
46910 1354212 1338458 1322837 1307826 1293288 1279145 1265815 1253905 1243789 1235724 1230151 1227474 1227580
46898 1227580 1229984 1234514 1241488 1251109 1263132 1277386 1294180 1313737 1335434 1358092 1380931 1403816
46886 1403816 1426594 1448703 1469592 1489171 1507581 1524689 1540065 1553398 1564857 1574974 1584160
46875 1584160 1592334 1599139 1604501 1608754 1612168 1614803 1617109 1620232 1625093 1631396 1638122 1645027 1653015 1663015
46861 1663015 1675064 1688642 1703331 1718826 1734724 1750650 1766310 1781238 1794892 1807170 1818492
46850 1818492 1829069 1838430 1845907 1851223 1854311 1854997 1853231 1849363 1843776 1836531 1827721 1817910 1807743 1797355
46836 1797355 1786683 1776194 1766796 1759037 1752851 1748112 1744967 1743510 1743585 1745115 1748357 1753622 1760915 1769964
46822 1769964 1780495 1792388 1805681 1820424 1836414 1853003 1869291 1884558 1898456 1910837 1921509
46811 1921509 1930178 1936486 1940058 1940616 1938145 1932997 1925876 1917582 1908596 1898873 1888130 1876325 1863661
46798 1863661 1850232 1836089 1821758 1808277 1796328 1785563 1775091 1764465 1753929 1743953 1735012 1727724
46786 1727724 1722700 1720029 1719102 1719083 1719459 1720198 1721521 1723516 1725892 1728189 1730316 1732638 1735350 1738080 1740491
46771 1740491 1743025 1746424 1750589 1754510 1757548 1760244 1763562 1767756 1772401 1777294 1782861 1789719 1798207 1808337
46757 1808337 1819887 1832498 1845857 1859861 1874522 1889691 1905071 1920479 1935890 1951129 1965706
46746 1965706 1979089 1991074 2001731 2011137 2019322 2026370 2032335 2037041 2040231 2042050 2043161 2044224 2045379
46733 2045379 2046335 2046872 2047094 2047408 2048392 2050562 2053994 2058304 2063191 2068848 2075592 2083310 2091636 2100484 2109864
46718 2109864 2119218 2127561 2134382 2139882 2144111 2146473 2146441 2144258 2140361 2134463 2125775 2114067 2100020 2084528
46704 2084528 2068012 2050422 2031538 2011159 1989236 1965924 1941473 1916135 1890291 1864539 1839394
46693 1839394 1814886 1790595 1766134 1741595 1717591 1694880 1673757 1653809 1634490 1615963 1598999
46682 1598999 1583901 1569933 1556218 1542899 1530969 1521040 1512721 1505181 1497947 1491102 1485038 1480164 1476709
46669 1476709 1474690 1474083 1474966 1477413 1481341 1486566 1492926 1500257 1508415 1517434 1527536 1538842 1551232 1564495
46655 1564495 1578329 1592047 1604648 1615481 1624616 1632371 1638771 1643691 1647149 1649029 1648873 1646445 1642367
46642 1642367 1637776 1633522 1630058 1627887 1627541 1629223 1632932 1638873 1647323 1658243 1671501 1687309 1705840
46629 1705840 1726496 1748231 1770635 1793993 1818062 1841519 1862930 1881737 1897891 1911053 1920687
46618 1920687 1926676 1929259 1928483 1924083 1915888 1904021 1888739 1870344 1849339 1826457 1802414 1777686
46606 1777686 1752608 1727749 1704005 1682103 1661875 1642278 1622437 1602666 1584225 1568108 1554239
46595 1554239 1541724 1529656 1517697 1506132 1495455 1485755 1476572 1467412 1458294 1449599 1441534 1433905 1426223
46582 1426223 1417942 1408897 1399765 1391642 1384741 1377921 1370076 1361646 1354029 1347833 1342595 1338046 1334566 1332204
46568 1332204 1330301 1328584 1327794 1328663 1330894 1333677 1336595 1339385 1341411 1342167 1342057 1341974 1342282 1342789 1343537 1344986
46552 1344986 1347422 1350726 1354737 1359356 1364267 1369058 1373765 1378953 1385091 1392173 1400053 1408839 1418696 1429449
46538 1429449 1440683 1452231 1464364 1477473 1491751 1507342 1524677 1544293 1566163 1589435 1613121
46527 1613121 1636970 1661455 1687007 1713552 1740768 1768400 1796315 1824528 1853211 1882330 1911174
46516 1911174 1938603 1963854 1986867 2007695 2026013 2041430 2053993 2064155 2072348 2078759 2083373 2086136
46504 2086136 2087253 2087283 2086678 2085262 2082578 2078828 2074954 2071517 2067895 2062968 2056355 2048703 2040925 2033370 2025528
46489 2025528 2016323 2004905 1991310 1976203 1959964 1942401 1923403 1903262 1882006 1858979 1833623
46478 1833623 1806359 1778146 1749377 1719771 1689214 1658183 1627294 1596844 1566909 1537607 1509254
46467 1509254 1482419 1457858 1436227 1417884 1402982 1391552 1383396 1378156 1375692 1376078 1379115 1384219 1391087
46454 1391087 1400063 1411415 1424647 1439074 1454643 1471422 1488431 1503946 1517166 1528868 1540039
46443 1540039 1550445 1559030 1565345 1569973 1573639 1576458 1578233 1579096 1579461 1579407 1578440 1576049 1572277 1567561 1562293
46428 1562293 1557008 1552851 1551137 1552140 1554824 1558209 1562626 1569176 1578289 1589513 1602598 1618175 1637149
46415 1637149 1659828 1685837 1714578 1745619 1778800 1814111 1851448 1890481 1930818 1972153 2014115
46404 2014115 2056104 2097524 2138102 2177707 2215837 2251461 2283436 2311084 2334397 2353674 2368762
46393 2368762 2378712 2382471 2379981 2372261 2360380 2344840 2326172 2305428 2283505 2260401 2235795 2210119
$$ [...]
##END NTUPLES=NMR SPECTRUM
##END=
