##TITLE=AC1541_ROEFFECT0011_8214791_Kw8PcNv59o
##JCAMPDX= 6.0         $$ Bruker NMR JCAMP-DX V2.0
##DATA TYPE= NMR SPECTRUM
##DATA CLASS= NTUPLES
##ORIGIN= BRUKER
##OWNER= Administrator
$$ 1.72 TOPSPIN		Version 2.1
$$ 2013-10-12 12:37:57.465 -0700  Administrator@X
$$ Compression mode = diff/dup
##.OBSERVE FREQUENCY= 400.02188249412
##.OBSERVE NUCLEUS= ^1H
##.ACQUISITION MODE= SIMULTANEOUS (DQD)
##.ACQUISITION SCHEME= undefined
##.AVERAGES= 8
##.DIGITISER RES= 22
##SPECTROMETER/DATA SYSTEM= spect
##.PULSE SEQUENCE= zg30
##.SOLVENT NAME= COFFEE_meoh
##.SHIFT REFERENCE= INTERNAL, COFFEE_meoh, 1, 14.98509
##AUDIT TRAIL= $$ (NUMBER, WHEN, WHO, WHERE, PROCESS, VERSION, WHAT)
$$ ##TITLE= Audit trail, TOPSPIN		Version 2.1
$$ ##JCAMPDX= 5.01
$$ ##ORIGIN= Bruker BioSpin GmbH
$$ ##OWNER= Administrator
$$ $$ E:\/data/COFFEE/nmr/AC1541_ROEFFECT0011_8214791_Kw8PcNv59o/10/pdata/1/auditp.txt
$$ ##AUDIT TRAIL=  $$ (NUMBER, WHEN, WHO, WHERE, PROCESS, VERSION, WHAT)
(   1,<2013-10-12 12:37:37.593 -0700>,<Administrator>,<X>,<go>,<TOPSPIN 2.1>,
      <created by zg
	started at 2013-10-12 12:36:30.642 -0700,
	POWCHK enabled, PULCHK disabled,
       configuration hash MD5:
       C8 4E 4E 5D D3 5C D8 9E 9F 52 82 E0 59 8A DE 15
       data hash MD5: 64K
       98 E2 33 A0 AD 6C 6B 0A 99 D6 64 72 B3 23 57 19>)
(   2,<2013-10-12 12:37:52.828 -0700>,<Administrator>,<X>,<proc1d>,<TOPSPIN 2.1>,
      <Start of raw data processing
       efp LB = 0 FT_mod = 6 PKNL = 1 PHC0 = 0 PHC1 = 0 SI = 32K 
       data hash MD5: 32K
       C1 9C 00 5B F1 E7 50 61 8A 97 30 0C C3 5E D0 28>)
(   3,<2013-10-12 12:37:53.555 -0700>,<Administrator>,<X>,<proc1d>,<TOPSPIN 2.1>,
      <pk PHC0 = 97.16309 PHC1 = 0 
       data hash MD5: 32K
       78 53 19 A4 D5 6C 6C E8 33 6F 7E AF 57 AA 5E 84>)
(   4,<2013-10-12 12:37:53.648 -0700>,<Administrator>,<X>,<proc1d>,<TOPSPIN 2.1>,
      <abs ABSG = 1 
       data hash MD5: 32K
       46 A8 2A 3A D4 E2 E6 79 69 D8 CB 28 15 4C 59 62>)
(   5,<2013-10-12 12:37:53.741 -0700>,<Administrator>,<X>,<proc1d>,<TOPSPIN 2.1>,
      <abs ABSG = 2 
       data hash MD5: 32K
       98 E5 F7 60 9E A2 72 37 0C 7F D5 7A 6E 0D 80 1D>)
(   6,<2013-10-12 12:37:53.849 -0700>,<Administrator>,<X>,<proc1d>,<TOPSPIN 2.1>,
      <abs ABSG = 3 
       data hash MD5: 32K
       6E 7F 35 14 14 8C 09 DE C4 E9 82 F1 FA BA A6 17>)
(   7,<2013-10-12 12:37:53.896 -0700>,<Administrator>,<X>,<proc1d>,<TOPSPIN 2.1>,
      <abs ABSG = 4 
       data hash MD5: 32K
       7B 5F A4 14 18 BF 5C 1C 76 68 65 E0 E6 5D 08 18>)
(   8,<2013-10-12 12:37:53.957 -0700>,<Administrator>,<X>,<proc1d>,<TOPSPIN 2.1>,
      <abs ABSG = 5 
       data hash MD5: 32K
       BD 0B 67 82 18 8E 4A 97 53 90 AC 4C 0E B8 08 EF>)
$$ ##END=
$$ 
$$ $$ hash MD5
$$ $$ C3 7B 9B DC 7E 58 C6 60 C1 59 B9 59 AD E4 FF B0
##$RELAX= 
##$RELAX= 
##$RELAX= 
##$RELAX= 
##$RELAX= 
##$RELAX= 
##$RELAX= 
$$ Bruker specific parameters
$$ --------------------------
##$DU= <E:\>
##$EXPNO= 10
$$ [...]
150 150 150 150 150 150 150 150
##$TP07= 0
##$TPNAME0= <>
##$TPNAME1= <>
##$TPNAME2= <>
##$TPNAME3= <>
##$TPNAME4= <>
##$TPNAME5= <>
##$TPNAME6= <>
##$TPNAME7= <>
##$TPOAL= (0..7)
0.5 0.5 0.5 0.5 0.5 0.5 0.5 0.5
##$TPOFFS= (0..7)
0 0 0 0 0 0 0 0
##$TUNHIN= 0
##$TUNHOUT= 0
##$TUNXOUT= 0
##$USERA1= <user>
##$USERA2= <user>
##$USERA3= <user>
##$USERA4= <user>
##$USERA5= <user>
##$V9= 5
##$VALIST= <valist>
##$VCLIST= <CCCCCCCCCCCCCCC>
##$VD= 0
##$VDLIST= <DDDDDDDDDDDDDDD>
##$VPLIST= <PPPPPPPPPPPPPPP>
##$VTLIST= <TTTTTTTTTTTTTTT>
##$WBST= 1024
##$WBSW= 4
##$XGAIN= (0..3)
0 0 0 0
##$XL= 0
##$YL= 0
##$YMAX_a= 642002
##$YMIN_a= -546835
##$ZGOPTNS= <>
##$ZL1= 120
##$ZL2= 120
##$ZL3= 120
##$ZL4= 120
##$ABSF1= 14.98509
##$ABSF2= -5.573092
##$ABSG= 5
##$ABSL= 3
##$ALPHA= 0
##$AQORDER= 0
##$ASSFAC= 0
##$ASSFACI= 0
##$ASSFACX= 0
##$ASSWID= 0
##$AUNMP= <proc_prof1d_extract_pilot.lims>
##$AXLEFT= 0
##$AXNAME= <>
##$AXNUC= <1H>
##$AXRIGHT= 0
##$AXTYPE= 0
##$AXUNIT= <>
##$AZFE= 0.1
##$AZFW= 0.1
##$BCFW= 0
##$BC_mod= 0
##$BYTORDP= 0
##$COROFFS= 0
##$CY= 15
##$DATMOD= 1
##$DC= 0
##$DFILT= <>
##$DTYPP= 0
##$F1P= 0
##$F2P= 0
##$FCOR= 0.5
##$FTSIZE= 32768
##$FT_mod= 6
##$GAMMA= 0
##$GB= 0
##$INTBC= 1
##$INTSCL= 1
##$ISEN= 128
##$LB= 0
##$LEV0= 0
##$LPBIN= 0
##$MAXI= 10000
##$MC2= 0
##$MEAN= 0
##$ME_mod= 0
##$MI= 0
##$NCOEF= 0
##$NC_proc= -8
##$NLEV= 6
##$NOISF1= 0
##$NOISF2= 0
##$NSP= 0
##$NTH_PI= 0
##$NZP= 0
##$OFFSET= 14.98509
##$PC= 1
##$PHC0= 97.16309
##$PHC1= 0
##$PH_mod= 1
##$PKNL= yes
##$PPARMOD= 0
##$PPDIAG= 0
##$PPIPTYP= 0
##$PPMPNUM= 2147483647
##$PPRESOL= 1
##$PSCAL= 4
##$PSIGN= 0
##$PYNMP= <proc.py>
##$REVERSE= no
##$SF= 400.02
##$SI= 32768
##$SIGF1= 0
##$SIGF2= 0
##$SINO= 400
##$SIOLD= 32768
##$SPECTYP= <>
##$SREGLST= <1H.CDCl3>
##$SSB= 0
##$STSI= 32768
##$STSR= 0
##$SW_p= 8223.68421052631
##$SYMM= 0
##$S_DEV= 0
##$TDeff= 65536
##$TDoff= 0
##$TI= <>
##$TILT= no
##$TM1= 0
##$TM2= 0
##$TOPLEV= 0
##$USERP1= <user>
##$USERP2= <user>
##$USERP3= <user>
##$USERP4= <user>
##$USERP5= <user>
##$WDW= 1
##$XDIM= 32768
##$YMAX_p= 451989150
##$YMIN_p= -676178
##$CURPLOT= <Network HP LaserJet P1505>
##$CURPRIN= <$Network HP LaserJet P1505>
##$DFORMAT= <normdp>
##$LAYOUT= <+/1D_H.xwp>
##$LFORMAT= <normlp>
##$PFORMAT= <normpl>
##$SURQMSG= 1
$$ End of Bruker specific parameters
$$ ---------------------------------
##NTUPLES= NMR SPECTRUM
##VAR_NAME=  FREQUENCY,     SPECTRUM/REAL,   SPECTRUM/IMAG
##SYMBOL=    X,             R,               I
##VAR_TYPE=  INDEPENDENT,   DEPENDENT,       DEPENDENT
##VAR_FORM=  AFFN,          ASDF,            ASDF
##VAR_DIM=   32768,         32768,           32768
##UNITS=     HZ,            ARBITRARY UNITS, ARBITRARY UNITS
##FACTOR=    0.250966925370066, 1,           1
##FIRST=     8223.43324360094, -73147,       -400241
##LAST=      0,             -108964,         -66524
##MIN=       0,             -676178,         0
##MAX=       8223.43324360094, 451989150,    0
$$ Real data points
##PAGE= N=1
##DATA TABLE= (X++(R..R)), XYDATA
$$ [...]
23857 69534 -282777 72180 10889 101690 -269891 -81364 -14866 -212395 -557727 -69850 -22704
23845 -88150 -177308 -21737 18298 -112681 -150714 -280015 -38431 86223 -156634 -24560 43927
23833 -217888 138125 -269801 -299202 -9432 82288 -39741 54661 -54347 56759 -172022 -164858
23822 -164858 -158184 -138385 -40888 102920 -202129 -172958 -136946 256422 -73585 209039 -65597
23810 171503 -225340 202249 176803 -311045 -200966 79581 -88244 340037 186366 -22256
23799 -16884 -278172 201484 -157856 -198255 -7647 141435 -133914 -250513 288201 32515
23788 -253136 326199 -61792 63310 -29318 81280 -25622 123489 -340720 -62887 200788 155015
23777 155015 -197480 -109716 -151432 -134900 433004 66503 -156846 102028 171517 97514 110689
23766 110689 113399 -475616 116475 -161616 3657 218043 68298 4496 -165193 108944 54411
23754 -314347 219618 -54729 331822 53830 41856 -95407 196326 274048 -193500 54645 -82676
23742 -57161 -100027 -68876 -60114 -202305 -50176 19170 348383 10445 270225 -302812 -48337
23730 373833 20637 119094 -7295 142399 78279 185286 27452 104052 -97891 6422 240327
23719 240327 -108842 -63269 -12819 106532 -7999 -34850 127070 143621 -63469 29665 -94918
23707 73841 -80677 23496 -181339 -210447 89292 165402 -269965 -533 -181993 -100600 -165956
23696 -165956 315156 -14041 -70685 -49498 -18898 -81593 95756 -43627 -69848 367522 -45844
23684 -13427 -210342 157893 -37843 -106140 -6744 8873 -42786 -132442 -4409 85591 107137 207973
23672 207973 -50624 -36290 -186725 -293548 213078 92901 -137432 169948 -452155 334885
23661 -62607 -70922 22635 -43677 -414012 -160549 -135188 -75433 277080 80712 27949 290668
23650 290668 185973 -69934 -87640 -46014 258236 229020 -301314 38235 231918 358450
23640 358450 185537 -472307 48844 -39692 25565 32285 -176419 -280694 201517 -217016
23629 -31649 -46691 -37339 31197 162983 248150 139380 -60197 -36825 176141 181981 212386
23618 212386 1266 -141277 18533 94590 -36107 -186721 115781 -222620 -293063 -256455 9603
23606 -305117 108413 144623 -107939 120717 -22955 -120957 -183413 11357 -13098 5888 157048
23595 157048 -37715 -88676 61541 -183033 -37786 -127006 237500 84540 -120803 106551 -60696
23583 346865 41972 -95089 207231 -319382 78979 285092 251893 -323664 1729 94147 -60901
23571 -53255 59041 21113 -116979 44452 -297902 -40941 20359 135671 153587 -196494 -56923
23559 104876 -166466 -82644 -19145 -292137 136377 74531 -132418 63268 -85671 117515
23548 -98369 29295 36721 -20628 53765 -47265 -133961 -214047 325115 156029 -60186 40914
23536 128004 -466466 -164590 227351 -369845 112325 -165754 -125302 -207769 -109246 25451
23525 -303109 -68871 82451 188690 223206 221367 -32925 31185 -144317 -165868 -92195 -269001
23514 -269001 51015 -133127 145563 -473359 32738 80482 8637 172423 52156 158520 12016
23502 461898 140174 65926 19130 119759 -426794 -263954 -271151 -183012 94907 -54798 517245
23490 -192667 -154855 -58871 64708 -48800 20199 13177 -406030 -159627 -105276 171215 104727
23479 104727 -49754 42081 -14407 -314556 -148907 476976 140230 143628 149406 -266287 255195
23467 -77533 -224780 -111190 -197903 128865 -104828 13527 -149786 -61531 154674 -52656
23456 51914 -89309 -72753 -158724 -266998 39263 27422 336274 -155259 -17429 327843 108804
23444 -135905 -109979 -1961 92535 220584 47120 -332799 109814 52015 -205319 -161764 -177562
23433 -177562 -203303 -145992 97559 -70617 196241 -117956 -293519 -21003 -163137 -314965
23423 -314965 222471 26018 -128785 83491 -248797 -26371 -1377 84528 -378516 -160241 -78591
23411 88834 210598 65715 -20904 153125 -117625 249848 99142 59685 -61059 22000 256615
23400 256615 43589 223688 2738 251097 -172648 -318039 270330 -77419 -167556 248727
23389 -278 84540 17240 -172942 -9071 -88021 -47708 -22621 108572 -221975 -321632 246947
23377 -259476 -117621 -60841 -327 -64528 -196454 -43340 320531 49844 277111 -54362 34126
23365 17783 205882 -154941 120042 -109059 -47399 -4784 -106801 257428 -89887 -80086 -126642
23354 -126642 -94469 73207 76312 -78943 319189 -115876 -185068 -200509 -75813 -85067 191791
23342 168843 237014 127809 91144 -185376 -77751 186302 -204874 95000 -155652 -159240 123781
23330 335605 -160242 26083 201011 23904 235250 -470361 -174926 101336 -193377 -54910
23319 -73089 139969 39047 -101919 145785 -377568 -70675 -85338 218873 67425 204340
23309 204340 110359 212488 142893 -264415 -93768 15162 69864 126225 -446089 -180682 222180
23297 68542 -5525 -5848 -96317 107678 15738 -262932 -8339 -208216 -211701 42617 -70092 73535
23284 -29935 176967 57681 171238 75406 -184402 -54451 -278320 -20888 70143 -97496 -97771
23273 -97771 36656 -5537 -267903 -205809 305433 258343 60355 -48570 -188271 -35740 -206098
23262 -206098 -70613 117267 205101 62743 169079 78205 -3117 39430 58875 303882 -98047
23250 6703 -6309 -103770 -442104 -127555 25957 110401 -92867 300400 -162099 -302862 -264923
23239 -264923 87185 237830 140112 10989 -79018 282267 -125222 -368016 -21990 27309 344188
23228 344188 29290 -100580 23554 -279617 57730 -75905 117705 366101 58476 -139740
23217 -92166 -137325 -199547 -372821 -163002 -208348 68492 -47871 89509 -30090 -286614 143409
23205 91578 244778 -195869 -163434 -354198 109876 -31444 -63613 -230347 -60080 -301854
23195 -301854 -285725 -134474 -61246 154805 -185406 -273147 155309 -76515 -263396 -121783
23184 -164014 200603 -56512 -185645 -373487 -74501 -208782 141357 265740 -7386 66670
23173 164208 62581 -102725 138053 290687 27233 -216496 114550 54497 -100121 -1808
23162 -146472 236065 -153835 -187688 -23523 -319207 -35909 -114372 -206401 -14607 -108115 134005
23150 158292 -112112 206187 53082 -169429 -51645 -227710 44164 -78283 224093 -212973
23139 53328 274150 215583 -163947 -24489 -467311 -205388 140680 7399 169727 -115286
23128 280085 -198240 -90327 40877 55542 272790 -428560 -21081 247977 -71291 -297355
23118 -297355 -13237 -80969 -108389 97854 -52020 49531 19358 -972 79388 154130 40657 54776
23106 54776 -156929 -105086 48093 24776 -123777 26724 53220 187607 63753 282813 -117515
23094 -30204 -4374 -133289 -27750 -110174 -176223 -241992 48111 176396 -122183 53378 84596
23083 84596 43851 -16236 95762 122089 181139 -156448 -209582 -169637 78955 -248704 167761
23071 31685 25031 -266618 52026 -199913 91881 -316207 -291352 -5337 92177 -74635 3397 -346474
23058 -129563 117890 -71936 -166836 -125754 146029 -35751 -7164 -112967 5995 -118327 -178857
23047 -178857 -73285 -27287 -167125 -163762 118734 -96765 8332 96181 238433 -59433 108542
23035 88767 -266977 171156 -5027 266822 121460 -52179 -119903 390207 -283253 176833
23024 -110830 76232 105276 -165405 -254678 -344375 -2806 -257547 170022 246701 -52310 -70707
23013 -70707 -197263 -11399 121397 226882 -14100 -510451 121061 -15791 -177702 -132998
23003 -132998 -63215 -12050 -6792 -139295 165553 -97447 -164506 -182992 274999 107886 -191112
22991 94627 162326 -221527 45519 -175352 -89582 -74562 -68725 -399010 169183 39849 -59212
22979 -27271 -33369 -39899 82384 -151016 -151432 133666 -113426 -35252 39008 14597 -23978 -339368
22967 -339368 -413638 170414 -104270 33777 332681 130581 -140898 -115882 36702 184762
22957 184762 -215204 11797 -192395 -200572 192507 -39370 261026 -167031 -134566 184655
22946 -52946 -200757 -12328 -3900 24827 -276431 -132277 -33628 -148693 202258 122195 53317
22934 184922 -130429 155282 -69542 -24808 39106 -12332 -292040 -223410 23057 39859 -85139
22922 36491 -213353 81445 382269 -149891 -37671 151049 -121117 -468241 -192359 -375869
22912 -375869 -80670 -234146 74769 -99469 -308275 181816 40184 201104 333177 -176404
22901 -107269 17308 -158925 8495 91730 -238128 -51099 -73385 223502 -49015 4468 99695
22890 99695 -152148 131377 -152268 79615 -285066 -387553 169808 245829 -228623 -61194
22879 -176928 22861 -442595 -39038 -258370 358499 151236 -186312 -8242 -78155 1508 -95600
22867 -121990 -77934 99689 -101684 290226 107286 27248 23757 227 126571 241891 253510
22856 253510 35396 100752 -179176 -164417 -224450 149971 240971 -45542 -134962 -207324 325884
22844 291604 -80085 -180891 14620 -286850 -142572 97681 -101642 91194 -103513 -176083
22834 -176083 -216181 -167200 -78950 111778 -43570 -220579 44424 156258 -15162 81543 -361223
22822 10337 -143620 99871 113412 -149959 -19807 -46794 -114559 8020 27621 -360465 -65060
22810 127890 20924 -420689 -22645 -113924 244954 -250478 -66985 135531 7764 213 -30201
22798 -12384 -198165 294694 -176323 -280764 130215 58134 -151721 87143 162967 -248884
22787 -276774 -39496 -336880 -151960 -44308 93783 -100768 92527 -90505 -203250 -56810 15131
22775 -153730 -88705 -271540 46064 161884 230664 71323 171697 -84545 -220589 -122090 379331
22763 -184844 88483 80634 -119412 -29803 223187 -194268 159902 -201615 -76967 -326900
22753 -326900 304124 -116821 -116044 -112712 140057 16899 -5588 186041 -106093 72927 189663
22742 189663 322399 -107295 -136517 -159894 -96008 22382 -98746 181450 -114932 -286537
22732 -286537 169069 -208623 49283 -112534 162981 271896 45483 103970 279115 -76431
22721 29571 100488 -36271 -369220 -192649 43724 24258 -95885 -188560 69636 -147952 -132832
22710 -132832 -199526 -16028 277079 -52909 -114964 -24022 175363 -180326 168797 16202 -39679
22698 -174825 360800 59935 142099 20131 -68194 -193272 16706 -97607 -32004 87864 22937
22686 146071 -329770 217170 -77068 -30678 -42806 -221109 -39305 147979 185594 25124 61371
22675 61371 -49920 199151 -269139 -159637 -4901 -296475 -146801 85179 -117458 265221
22664 -181948 249363 -299461 -209962 -191342 -83941 -228558 355308 -9018 -267557 141702
22653 -40382 61105 -114132 -382619 -437540 -2672 85471 203263 -268128 81173 59531 -92647
22641 -61309 -116011 -14278 316315 5871 -5563 56707 47190 -104805 -28764 119625 100986 90489
22629 90489 -267848 -41726 -64059 138957 111826 -47473 -227902 -334167 -58836 -245189 -197154
22618 -197154 -198655 304734 58711 340248 -32177 100113 -201181 -91989 86360 8287 3114
22606 118056 6881 -369658 233056 324662 24421 119219 -95019 96500 -148542 -72790 -104261
22595 -104261 225333 88683 52945 18754 -69514 63944 -150384 -87629 -348644 46844 85523
22584 85523 95562 -343052 -245591 74553 113923 -169011 -34629 -224104 160839 -228148 -84971
22572 -50866 -142806 101699 94673 -143211 201526 45089 327871 48324 -284771 -68143 -356879
22561 -356879 -51290 -312934 81516 93443 24685 49840 -41615 -59350 -341801 -335846 -202480
22550 -202480 -70345 -86923 8108 66571 -110052 65144 -61895 -19366 -57794 -177598 46652
22538 -1321 41547 -72321 -149816 171473 -27548 110765 299958 162181 -150919 -4148 -73267
22527 -73267 -63230 -354582 -94872 -328206 -254455 -62938 42850 -57931 174887 -56459 56874
22515 27889 45113 -123433 -133613 -94739 292684 -41603 317560 -217340 149799 296693
22505 296693 75341 115510 169445 -203594 140132 -154092 -108614 -219737 91471 -69133 -288122
22494 -288122 -175601 117647 196263 130744 -114987 -166605 -227381 -82546 47075 317763 -27281
22482 258854 -310657 -189595 114417 191306 -37488 250500 -250089 -95607 -133887 -9587 -91467
22471 -91467 -348326 -257964 70334 -349252 -100589 -155967 -2667 -113151 -347729 -107981 19665
22459 -71850 -116355 -337654 28069 -53709 -206784 135756 261805 -78277 -44491 -2923 -24850
22448 -24850 56127 -41489 176213 39173 424551 78164 16084 60511 -35192 -98999 -91705
22437 -91705 -36612 76083 206512 166998 -48788 17288 57211 228995 -214547 39137 -92273
22425 133325 -68763 56535 72427 -53983 -205820 190524 -369325 -62431 30683 -104192 -44765
22413 47441 -296956 36685 185986 -68510 255153 -241960 -282375 -76529 140223 -14181 -150376
22402 -150376 -155297 -166077 30892 -207902 -134276 121031 -508425 226600 -340020 -5021 -143291
22391 -143291 -283042 34010 -206268 526 -121866 7307 -196322 -121518 -5391 -85576 -13956
22379 -161211 -98210 -35927 203208 -302468 35918 75804 162206 -45282 142920 -222752 -45836
22367 110421 -63244 -61756 12151 -183725 -92119 -274806 -83580 78758 -456879 -95141 266767
22355 69176 36614 192441 -126954 -490929 162093 -7426 -265440 233988 371770 140825
22344 34002 14418 -65345 96364 42010 17593 147751 -126311 383152 -4078 -58353 291907
22332 -189444 139675 -104737 -362554 -57953 -29913 -32244 38062 129185 -28910 119728 132696
22321 132696 -90576 -91655 201518 113499 -157607 -52287 257063 -301468 -61300 -103712 47403
22309 241347 -375794 23352 -183293 -29747 87070 30444 51218 254936 -151343 -14916 207546
22297 -118631 -196590 -89271 -206078 -157352 -125437 -173501 -108691 65876 -69701 -34718 177823
22285 158863 -50720 -233902 232978 154027 28619 -11458 -98335 -37488 -97098 -32521 146233
22273 -57394 142245 -310816 -260692 -178870 367742 132021 -116135 162884 -262121 63084
22262 182243 84571 -272595 -261002 17225 -222752 157803 59267 -182564 -13357 257073
22251 255054 69820 -147533 -246731 370051 374806 73424 130430 83086 -154623 -71912 -99724
22240 -99724 -90537 64582 44311 -66409 -36092 -246980 -151994 -139856 -232968 -191782 205385
22228 115280 204738 -163394 156428 -10890 154269 -186035 91908 97621 106230 -80038 176202
22216 9934 46507 -246257 -267279 -203625 70192 -98196 324695 -454710 -25019 -33651 61222
22204 -143209 45339 -10953 209959 121436 -169531 625 -67504 73049 7038 -55422 -125968 -9229
22191 372320 106670 -93072 -105776 262549 -181109 -560105 -75691 -471558 -123524 46141
22180 321235 82229 -72977 -268664 -52478 136676 49432 76948 26973 -45847 -113249 -359077
22169 -359077 -4630 -172469 75906 -156100 -197153 108882 56961 -64297 85628 -88547 -81454
22158 -81454 45681 -63220 -280442 -61786 73478 -356095 -197648 -2191 -172376 180229 -57365
22146 -141250 39036 -280610 -70375 -31239 332605 230065 159464 180296 -36571 -248537 -127461
22135 -127461 57019 -151759 149904 -426163 -255789 11203 81187 -126860 101718 -5022
22124 -163333 -388202 -143158 50762 96096 110099 -42713 215173 -55798 -194799 -53427 -348558
22113 -348558 32691 -348490 104064 117575 -119934 79579 287388 51146 66261 62850 -8129
22101 -114451 -174736 8462 105538 -60924 -88559 46978 -133097 223358 139647 -218954 -691
22089 140965 9913 20462 -2275 -124859 13001 -225572 102047 -395925 -15717 78598 -13431
22077 -92874 -19786 -95975 110789 -135468 25471 -292719 -162752 -258802 32651 331387 27772
22065 -65953 140090 -81492 26258 -77657 -46521 -23330 -107903 20787 207241 194798 58143
22053 108849 61204 -294553 -423062 363511 -116893 -30329 -298467 -99539 -155447 4975 269837
22042 269837 -102831 -226425 293834 -67632 -130332 -271467 -187123 106856 -209232 -93373
22031 -94063 -41077 -214457 -481807 -238719 116280 224509 129076 -391213 -242553 -209355
22021 -209355 108939 -24630 -84170 -84512 -144594 -84903 -24148 312062 -160048 -33042 -119377
22010 -119377 -25348 67151 -326658 -105166 87962 -284544 -166243 52502 -213811 -78693
21999 -289556 -158359 -207998 55505 -6020 -115619 -266968 -21758 21070 -67049 392859 -35562
21987 328663 -55173 -221226 -82310 393330 30537 -7869 -64158 -44410 44266 113821 -165851
21975 107462 -138112 -177154 -158621 -252555 103904 118895 -291489 231669 67152 -202066
21964 4844 -190787 -121762 -188030 147059 -231411 43443 -134096 -243480 -77981 -63619 100473
21952 163236 -85777 -192613 -54966 -241580 -208116 7445 -434580 15241 181902 21130 298786
21941 298786 232894 -173008 -61618 479096 -160876 21288 -60479 -26870 55068 -142235 -209730
21930 -209730 41546 -92190 -210584 45494 -261979 -132644 -235693 71474 -10711 101796
21919 51348 79559 41288 278081 -113757 -192010 -214454 -73333 -93494 -39919 40466 -26245
21907 336299 131607 -262505 -78561 -64897 209016 -155118 195411 147273 469 38268 -294836
21895 -215556 126728 9161 -103328 -201124 -178080 -85184 -170190 -42632 88734 1789 -35457
21883 -119749 -172149 -58597 -127190 5421 61610 14682 -2405 -223309 -177715 -415158 140706
21871 -37892 131264 -112764 9667 -110408 143151 127130 -299970 109414 255792 25090
21860 -15405 -339793 138858 141707 -50550 380079 -118955 -164024 -226682 -297798 276826 -172875
21848 -192669 -360455 -47577 70265 441096 82169 -81213 -39739 -234314 -73621 28779 -284587
21836 -4999 -210988 -178808 -74278 326957 94465 -209794 117825 122765 543 -122000 -225027
21825 -225027 -99651 -221055 -67284 -226853 231426 -86494 -358774 -321566 303380 -42552
21814 10269 -196058 199066 -127520 -97317 169179 -98225 188191 489 201893 265993 94571
21802 -30685 -75453 -173830 104576 -162765 -162870 -151251 -51737 -85799 -9279 -61640 -112348 -123918
21790 -123918 -164857 -365187 -63199 103994 204642 -171779 22108 -17227 -27632 -208436
21780 -208436 216619 -73848 -13333 25939 -5376 50052 140346 -70194 -310938 -42064 302085
21768 105942 126816 295875 12903 -178654 22216 -205214 -16055 -32822 99715 -200259 -47589
21756 -222083 -24903 -32351 -285007 -409233 226722 25404 -88261 93644 -95214 42593 126278
21745 126278 133698 -76328 -78820 95022 -269639 -322019 -75330 -336692 8217 116983 118561 -318224
21732 61547 -304627 -312460 36811 57170 -179428 130062 -83622 -79556 45565 -225272 -14076
21720 358630 -96670 70068 -129556 -106987 5272 -170735 -23706 369968 59085 174526 29981
21708 -11970 102354 -26430 231164 186850 -213919 -80850 -47124 -6200 -258379 -41527 -135866
21697 -135866 109147 -21626 -560822 43261 -184978 -465818 -390020 207238 264528 176986
21687 176986 196190 -39776 -287684 161896 11699 -237513 -12914 71489 253359 -177982
21676 214259 66989 -184772 70503 433845 42718 -30450 249274 -135911 -182562 117191
21665 196579 -180491 72175 313873 -225750 -259653 11807 -14237 -74472 -288754 227675
21654 188104 -249713 172209 82454 -106115 -69324 -79320 -137955 176440 -334317 41523 183081
21643 183081 -283429 -202976 -228587 -9360 -41395 -150583 4046 -233161 -125155 -97336 125918
21631 -46996 -19944 102884 -234172 -47852 -176092 182606 109863 -278138 -144158 -146935 -122972
21620 -122972 -22053 -240912 -172999 369021 175234 49155 249037 1772 -147874 -64833 -79846
21609 -79846 174350 191121 -115075 -175961 -20883 112030 -236940 -180214 -311679 15047 106258
21598 106258 -49769 112956 -79073 -292182 -123174 -113339 150261 377803 5135 16860 210652
21587 210652 220236 -50488 97426 -154034 -81701 -151626 -384066 42998 94475 -208413 -136324
21576 -136324 -182095 43138 80763 -476156 179387 -158835 -289311 -154279 -101964 -43425
21565 -251159 55435 -37893 -6279 -62318 -343390 235853 290851 242922 -102490 71894 -62481
21553 14441 12495 -55301 198643 23065 -21294 -173640 -190864 107806 372519 -66164 -106507
21542 -106507 -214831 -263381 111507 129563 -199821 23778 54476 -37768 -56844 -181354 28276
21530 165585 171613 -144576 -116922 -149460 -354448 52132 111277 -40891 43316 195199 135821
21519 135821 -120841 -42634 -132290 5223 21866 -229580 -286848 116744 126882 -156830 45657
21507 -384728 -65772 -431653 -217036 -57022 25958 95482 196169 -138665 309513 -54668
21496 -218300 -1329 -202772 215274 -228653 336218 54454 -155416 -185884 93222 -235058
21485 204804 -8508 -324623 -171770 -4345 168246 -79730 -50581 93495 -300109 419888 1169
21473 -118973 -17714 -173418 -69261 -90991 160108 -52796 -222560 311367 -37098 51502 252356
21462 252356 335954 237339 150507 -44713 -66295 -220604 -207203 -464632 46089 71911 -343638
21450 -92970 -85841 262642 -323171 242492 35043 -152626 94133 -22146 18065 258339 154285
21439 154285 183711 188913 165559 379024 461597 308339 222737 85728 -109040 129405 -134563
21427 -10111 -270960 33597 17008 24741 -4178 -107455 329730 217648 89232 -23413 -150514
21416 -150514 -33741 -320990 -397241 20474 -195636 210606 142456 -253407 -22443 -101638 412985
21404 215807 -174584 40077 -349303 -60160 280643 -15345 -171705 -342068 6011 41305 -180040
21392 -289680 212179 -555 29460 -28825 64461 -17345 120179 78984 301975 156426 -352194
21380 -151106 103825 -286625 -242965 -238397 156540 -82255 -59709 -44803 34104 -223962 -63140
21368 -33281 -103079 -126897 -156450 -145364 -130378 -4811 -118568 23318 -159032 40873 -175408
21356 144484 190738 65478 -184966 -17197 90671 11203 -297713 142154 17436 -58771 -178401
21345 -178401 36950 -38279 -339709 36626 -17169 -302995 -181775 107798 -212701 122962
21334 153365 -157569 3179 345105 133741 -166297 -13881 -16159 -21808 38858 159941 158374
21323 158374 135034 -32490 -172716 -235859 78335 -34023 -75821 106976 49115 77672 -256891
21311 -208685 -41981 24242 -63389 -205599 9936 -243917 107469 -51866 -188386 513344 -132331
21299 -247161 -65207 -31476 -174863 -218696 4780 9844 -73396 -24645 -55515 -83044 37554 -87308
21286 -90484 -43525 -70951 -78650 -87213 57061 36759 121142 -106215 -20865 -182221 30876 -115453
21273 -31775 -114100 116429 -147684 -161817 -45763 -37205 240408 -228583 85475 -258721 -318100
21262 -318100 37132 -183198 36515 -49370 194604 44662 -83518 -2762 -232361 25870 -37143
21250 -48648 22826 380833 26310 19440 -42261 328014 -37515 -272483 252784 -260602 13742
21238 -298894 -120068 31722 -322506 -219300 228751 -126971 81857 276133 -109393 -188701
21228 -188701 30633 118927 -163938 -118305 -249815 119767 39054 -311792 44480 -142987
21217 225441 -214172 -250268 -325685 50664 14702 235994 138076 37079 -263055 -110896 -174150
21206 -174150 252023 52482 -23191 -22365 159044 97466 -424449 -152908 -105144 -2255 -231971
21195 -231971 133552 130283 34242 -339465 82557 -234902 33970 63970 -163837 -207902 -133275
21184 -133275 17023 -36365 -244725 -68412 7580 -121550 -271254 -144127 120645 -286315
21173 -127094 -231656 30817 -113488 -238389 50749 -16988 -265762 142507 -68354 -93939
21163 -93939 -118903 -79453 -33666 27677 -267179 75875 211337 162661 -119282 12145 231277
21152 231277 -414386 -159990 -34698 -3017 -107639 41923 -153525 -50268 -110389 -225290 -41504
21140 -149360 -242082 184045 15461 -279731 36903 92274 216149 -102461 -1120 -131711 -30525
21128 75717 -175987 -251695 35461 139160 -58908 -395190 -149488 333861 -132659 -173224
21118 -173224 62426 -6163 -90327 136575 367317 -33483 -323117 78874 -39740 408153 -158343
21106 -89162 111717 9028 -258205 -85955 -72687 -179225 -90783 137759 57386 -192141 101143
21094 11698 75843 109073 101406 161720 1627 -202703 60393 -170704 136632 82802 -260854
21082 -170435 166021 -120403 -120205 -305049 180197 -39872 -283933 -235362 -232998 -161604 -4092
21070 -80629 -115730 293036 109982 385983 -134602 138579 277415 -17705 -72512 -202998
21060 -202998 -26600 22657 -186385 -73916 -330261 -46616 -104049 -345891 56408 -181895 -144660
21049 -144660 64457 -284073 252799 -69104 69064 -93922 185544 -133175 19396 70485 -48103
21037 -51745 61150 167694 -263477 167481 126967 44897 -112417 -114165 -167474 -284079 -141806
21025 22692 -215094 -11501 -118522 181982 -102649 181 -279521 -61940 -270920 98809 -118257
21013 59162 146712 -117109 -316103 -21052 48485 -61390 -129931 61912 175149 221176 -252926
21001 -129613 29983 -363654 -36561 -245354 -100399 128739 -32726 211940 -100985 20768
20990 -141664 -670658 -141154 -61709 -154875 -68004 -126560 97368 -235438 -54075 -81385 128090
20978 384493 -97448 3672 247174 -273370 -129606 121837 -213242 -179495 171690 105415
20968 105415 173495 -66333 -44191 -4832 -206311 -245430 -245447 -118163 -181954 -352288 71359 179420
20956 179420 -218996 150168 40978 -66114 -157323 -40050 -269994 -107423 -200356 -37478 -229224
20945 -229224 215509 -56068 -173139 -25900 -16678 -1532 33750 124730 342324 172350 -272532
20933 -132107 -284891 208836 -55092 -186816 -56071 -62387 -116827 -59379 -284152 -182751 169928
20921 -135190 -69146 -23969 -19450 -56487 -121053 114203 -366960 -175984 -188341 -82541 170157
20909 -179437 8574 101342 119577 -120009 52079 -228193 -118810 -186895 -114905 -515785 -212309
20897 57039 -57916 -175117 -121437 -7355 -216468 -229110 -44517 -215489 -146118 -328641 19378
20885 -33923 -17213 -224013 -200012 -201628 126422 -267196 -261892 326741 62977 34601 -233843
20873 66094 -227155 8122 125218 -62779 -189037 69686 -155581 -101315 208862 69054 -9664
20861 299382 -195718 217476 -77013 65623 -111643 -45917 386196 -229197 476895 -159466
20850 44454 10377 -11058 -49284 291020 -18715 -383061 -11694 70609 -195729 -158382 -25881
20838 -5770 -238903 -148566 -5932 -90255 73814 -207428 -438501 188880 49091 -171968 47044
20826 208122 -165472 -51996 -187178 -399358 -82196 -190167 -41437 195536 -101093 -370482
20816 -370482 -172937 -235244 -365036 -98916 -412507 98340 -95046 -472364 -36050 -112175 -108197
20805 -108197 -404503 -197813 38976 -255668 134527 3389 -300591 4982 -130979 -218784 33525
20793 -149704 -5290 187648 -174570 -55781 -257210 419209 -91790 -168665 94655 158095 -177448
20781 -275201 521648 -364782 254962 -13717 -86230 -187385 -100430 -10619 102401 308250
20771 308250 275581 113232 -477947 39709 128655 -116561 -27903 -62541 136717 43141 51337
20760 51337 -276118 241164 173294 108688 3042 -34426 -46700 -11504 -181146 -60712 45836
20748 14466 67538 8438 -275066 -47278 -83222 133852 -324280 103232 -13882 -82008 -164822
20737 -164822 -152225 77948 109612 -13314 -40737 64688 -442163 -512965 -50196 -85104 -239160
20726 -239160 97834 39288 -52712 -209098 3528 52951 -283502 -206205 20716 -51103 -109250
20715 -109250 48453 -175910 78602 -308374 -335233 -31560 -132677 -214670 -253830 -108275 -168298
20704 -168298 -43835 8644 16123 143830 320792 2661 -422268 -37892 146876 25190 -128348
20692 -125953 115656 -132023 -125707 140712 -51548 168177 -129475 -249767 -162264 169068
20681 -41400 23184 -136193 -145607 414346 -193927 -152586 -65034 -160954 72920 -153463 -115936
20670 -115936 243413 115591 75436 29375 -66306 319855 -121580 60374 -253391 53036
20659 129364 255942 -101552 -221904 -142659 12904 -220553 -206117 -13930 -282013 -104874
20648 92427 -388347 -74560 -27772 -25585 -6396 193988 -81511 -41577 -243436 -243898 188434 115427
20636 115427 31063 -144185 -47343 -330878 414427 14424 -153939 -82803 163103 124099
20626 124099 23178 -275305 -179527 88308 34582 -110893 -473661 -99959 -313404 -57812 -287976
20615 -287976 -94331 14250 -108164 -457656 -238315 -85476 61131 35491 236805 266013 -295391
20603 167371 -23364 -363607 216426 -197158 -682 181502 -104930 -22584 -239641 245377
20592 -200431 -19435 -255031 -210600 -143307 31055 288875 -109418 146455 128217 346671
20582 346671 -103121 -86637 176148 21072 119321 267837 -197820 46047 -412734 99907
20571 -291384 98598 46551 -77763 -524597 -255190 -243568 125157 224898 -259304 301384
20560 31064 -88321 8552 -351968 -4888 5359 107063 152548 30740 249218 -44237 -149429
20549 -149429 207088 -62446 -95851 81027 -259651 -294567 169042 -110109 -84342 -134951 -104022
20538 -104022 -31186 -167937 -111642 -158854 -194229 -282938 -340044 -126324 -5230 -110014 -87592
20527 -87592 -59759 -128834 35899 -35354 29164 142232 30756 -272368 -172480 147339 148015
20516 148015 22773 -57031 -112562 -183185 -88240 -198618 -399571 52294 -20955 -80977 254452
20504 25245 -199380 -124634 -117897 -93815 121998 328858 -79754 148155 872 -93313 -179460
20493 -179460 -168191 -311546 -161395 -284517 99968 172170 -308638 -140178 -227761 -20388
20482 68534 3626 8204 -55519 -198053 -83550 42196 -61310 -127788 -318646 309343 242850
20471 242850 -273852 -206172 165858 -104426 362022 -241571 -2048 -229763 256454 151243
20461 151243 27924 32339 288326 -34340 -309978 186024 9160 -56564 442136 281638 -170945
20449 -412970 133722 2016 -86814 139539 -111897 10124 -331091 -274186 19605 -372512 -252477
20438 -252477 -355611 165746 16797 -141073 -20677 -150119 43326 145017 -74819 -21144
20427 93503 -64866 43975 -69322 -127629 -17765 -102216 64552 53444 -100088 1122 130092
20416 130092 -236935 -65952 -201517 2822 33844 -33728 -42124 -55481 -204425 -160240 246153
20404 32490 -47893 -119062 -175806 -178964 -74915 -121519 -10738 -111369 -275762 -27934 49009
20392 61262 369215 341531 202490 -270261 240002 -241430 -12771 -429039 -26813 -237339
20382 -237339 -35117 -111390 -186584 -36139 177078 -101307 -68370 -320409 -356316 2862 96649
20371 96649 -221978 -61524 -42093 6515 -141900 164311 -76777 87155 24890 -99423 -53979
20360 -53979 10825 -269832 32584 128578 -109534 164901 -203168 -5761 -301315 -40518 -314422
20349 -314422 -116394 -209056 355489 -18317 -15779 -209722 -8448 -74983 38387 -437668 48904
20337 -262525 -31582 27797 -25304 -87392 -51144 -27592 -96238 180198 -140721 -167472 -234013
20326 -234013 378509 134217 261575 -114949 -34207 34618 -97110 36972 119868 -18131 176732
20314 -418871 324291 115522 -106739 -8464 -121671 -167765 -29154 -18431 -25126 -21994 -23308
20303 -23308 -38354 -15526 -69743 -159360 -70773 12950 127746 -12904 -137910 146930 -221090
20291 133508 -84426 19466 292809 -283802 -132120 74948 14333 -116763 -119853 -71262 -83935
20280 -83935 -207968 -69684 -75724 289892 -143450 -382368 -165382 -195689 5802 27798 -25105
20268 -170942 191842 42245 23134 -73572 -304728 101830 -256039 39070 -77959 -58380 190119
20256 197402 -73752 -308180 56189 23860 -98074 -119713 -181659 -236227 -349640 -361358 -175046
20244 -253173 -130457 -86107 178841 164920 -43880 127064 -24634 245088 -59435 76595 6275
20232 -8606 -88108 323117 -192378 -80882 -420902 -7638 -82300 -72618 136032 103035 11179
20220 285514 134772 -145598 -272809 -159532 -222652 -102244 -262595 -109177 3313 101663
20210 101663 -75211 57816 -255291 178306 -229484 132922 -27168 7582 223397 131232 -97589
20198 -67464 -86528 -94183 176172 -289868 -98489 -171716 -77379 -71476 7516 -3097 302514 52424
20185 -254457 -484011 -114870 -30361 -127828 -111402 -101738 155506 -27285 69742 -30745 -262772
20174 -262772 364 -38869 27400 177706 -170223 -52096 124749 -166251 -197051 -120763 4207
20162 -288555 -169951 -276190 -224614 -35186 -95310 -106076 19793 -146072 -85675 -210178 -302521
20151 -302521 272876 -141226 135095 -116860 301769 -81983 16285 -62891 135885 -119337
20140 -257399 90499 -151978 38836 8748 58258 100517 55358 331540 36061 -227272 108314
20128 58713 315612 -155003 32390 -200652 -236180 -79758 -60960 170149 -92952 -133584 -266630
20117 -266630 -85134 -14860 373 -85506 -320527 35350 232057 -293099 -246528 -32034 110090
20105 -161963 -43925 85077 -97664 -370124 -115556 61062 -490801 -155489 168723 -247993
20094 1970 133160 370383 -7333 -372600 -294307 -42747 -99224 141139 -370273 186987 -91253
20082 -5376 -94797 -156290 -117192 -220600 -151507 -13415 169672 -216698 257606 107822 149027
20071 149027 -298990 -11980 -146009 -121363 74597 -195136 -302976 -30451 121518 140312
20061 140312 199786 -172581 25536 59970 51696 -210039 -391195 -155939 98259 226957 67527
20049 -18324 191651 167508 -97768 172465 80651 326890 269395 -339433 -318732 164835 -22656
20037 -42265 -76552 87552 90537 -610 -252542 -29724 159075 -92923 3000 -68597 27647 -75121
20024 152799 -193084 -171557 13057 -510312 191105 -131173 -13785 -120268 -13171 -201328
20014 -201328 -50539 208808 -304338 -252734 41426 -93091 31739 -431704 -118490 -37016 424334
20002 -6740 -265433 -126789 -192326 94536 -101087 164369 29786 -135176 -256854 -88566 228338
19990 -326447 -48005 -249329 -59671 -106710 -197561 91934 -226401 23394 -62315 -160435 43483
19978 -437047 -9105 -145322 52395 -82368 63637 -200937 242214 -623836 -312677 161310
19967 -311101 134984 -117637 -7588 35837 -121204 100625 -210003 -101855 -84123 73677
19956 10485 -47312 -51278 -27199 -103122 -74066 75569 206287 -495724 -50136 -6375 -309849
19945 -309849 -176167 -96384 -132316 -48868 -16083 -197399 -474201 -164024 -336031 -148244
19934 194071 -307159 -69988 -94764 -294146 -252466 -116748 -196967 -326248 -138276 69770
19923 166990 52003 25635 197995 -315439 -17325 -122135 -226710 13427 -165081 -31806
19912 -145364 -131394 -78604 -116147 -93022 -14586 313072 19534 49483 19110 119441 -116214
19900 -51336 -460939 102729 -31771 262354 6714 23668 32466 -241404 217221 -78991 -188048
19889 -188048 -64902 264498 -132992 245805 -13670 -147201 155633 -409274 -43651 89757
19878 -60702 -353629 329771 -205466 -183679 -61416 -80181 -41036 47211 143003 243 -397624
19866 -107274 -151338 -327578 -369545 49888 -96949 60985 8547 123885 -113979 -369363 -114360
19854 -192478 182008 228905 -8453 5025 -178237 30799 118842 211540 -67566 209626 -86332
19842 29631 28486 28655 73692 -38030 -200856 10139 313783 124569 107576 -165946 -338282
19831 -338282 -29206 -59632 -200237 40298 96745 1848 355355 -118550 -250987 -97624 110447
19819 -257865 138049 -45015 85694 -8161 -107876 -106693 -523219 155638 25249 -113672 136914
19807 -29456 -301123 82057 95186 -18621 -129874 -56442 -140799 -36617 -94486 77103 140435
19796 140435 98487 -168775 -213830 71425 -17382 -48682 45431 -104699 -84660 12669 61235
19785 61235 -32956 66338 79384 25597 -67691 -76129 -280055 -324956 -153352 74242 -86095
19773 -181428 92035 -174552 -20356 -205973 -125403 -130769 -214545 -193349 -78907 -24091 180633
19761 267324 -107708 -12111 -184191 -238723 -218402 -367596 112726 152876 -65999 -56920 -59645
19750 -59645 -68891 58169 -144163 91896 78635 -79519 172747 -83075 -267234 381187 273135
19739 273135 -90976 -256455 175821 313084 8742 167296 -271521 -62847 36166 166211
19729 166211 -49838 -95848 -69088 -266572 99089 85310 65283 322785 130294 -139552 145988
19717 101711 -398513 -153891 137554 -355622 -324 133500 -361364 -62345 128409 -207351
19706 43562 254788 111676 61506 55828 334563 65522 158364 40370 -182595 -154369 -383289
19695 -383289 2775 -328611 -270113 -8744 -130907 108048 -131621 -81934 -89861 -133193 -168384
19684 -168384 -254732 -5258 19632 -174586 -93565 -395367 -246163 -209376 -71141 -108524 15662
19672 -27491 -178634 -73336 -80482 -59145 -180616 117203 -195826 43512 -293885 166344 -98879
19660 -82672 178657 -51569 -53179 92854 -35204 -214001 123036 53509 -12920 -57765 -222890
19649 -222890 40238 -62814 53920 10406 -235960 -64772 2751 -98792 22444 -97934 -302410
19638 -302410 -22017 95573 96985 45424 102392 -156439 -76614 -61972 121465 -24352 -78640
19627 -78640 -153552 -222289 125745 -200530 -154237 -351485 107057 -127177 -178133 179318
19616 -124207 -244774 -124577 -160713 327410 2342 -170881 -74386 170187 -102686 -73065
19606 -73065 -290516 -42324 42032 156821 49002 -171324 -304167 -284108 -3901 -88665 155878
19594 -42184 -327355 -8326 75432 -114026 -159311 276864 -219611 -159021 -33065 -198883 -36446
19582 104838 18771 43941 -26439 -167562 -7277 21620 -89842 -49560 254443 -266178 -111738
19570 -135798 228945 184335 55056 244740 31129 -18210 48448 -186560 -224486 -73155 -29100
19558 -305582 98764 -152529 -22118 -269000 -91450 389326 -139951 177249 73331 14172
19547 -58743 -240963 69205 -94350 6647 -90933 -61716 -94273 -161618 -24028 92813 74277 30104
19534 95632 -15399 219237 -371872 -69036 115452 -15877 -95493 -164546 -103136 24689 175942
19523 175942 -32159 2826 -201995 -89259 46710 -40862 -138965 -349717 -183782 -12016 10073
19511 36984 -181454 -14062 275878 -120493 -68551 193590 -78816 -117060 -16935 -85018 -59584
19500 -59584 269335 290802 -3211 -327815 -185238 20846 171062 -50887 342864 106829 -41385
19488 357738 -134045 -293053 133100 197876 -33914 206365 -393306 156335 268967 344499
19478 344499 -141834 138986 -278584 -278100 -208390 235086 -69445 -188020 -219283 -118551 109141
19466 -9454 -218307 -143491 55976 4361 169890 -22731 26375 -149136 -293418 252457 -113023
19454 -121270 -21464 -134948 61058 43097 54197 -51733 -390318 30540 441126 -535440 4697
19442 -24877 78441 18170 -309432 68283 -66512 -232927 -457729 -319622 -352175 -393515 113617
19430 56540 164437 2735 -143220 2966 -101194 99565 -251874 94482 9151 76287 -23002
19418 -262541 -129351 -81393 314730 354509 -4476 -28136 -227813 -99328 -104040 151937 -79641
19406 -10192 -48222 -4597 -76055 109350 -165057 159033 -99774 2546 183195 -261422 -200327
19395 -200327 -143777 135210 17053 -360023 -199998 -96763 -86989 -140215 -279564 -139746 -259348
19384 -259348 80758 50918 200705 65543 200442 -159246 -96043 -30291 347758 -235211
19373 -4542 -82166 35824 -58254 -164706 96924 160422 -36662 -98878 52203 -252597 -143595
19362 -143595 52520 10611 -161776 -245286 149274 -187429 291301 -151361 -148145 159277
19351 17085 322627 108510 -158288 -218494 94909 -113237 270660 -49423 61737 -45271 184157
19339 -55602 -203657 92705 192933 -284896 -165351 -248951 294415 -114552 -346375 -30420
19328 -260905 -4993 -53955 69652 -222559 -5305 -81040 -182290 -49093 -102729 -550835 276358
19316 261563 -300677 200285 -218213 -11981 -333552 -141282 188270 -395603 -152933 -272460
19306 -272460 -268811 -154121 -299594 -214615 85566 54988 -184586 63375 -135481 -211168 214073
19294 85997 -406817 -86360 72482 41677 -146922 -135347 11080 -181164 43052 334463 187996
19283 187996 30715 -378876 -266348 137518 334700 16000 -370760 -347970 170181 123670
19273 123670 -84833 -157659 -90556 205889 -260072 -85278 -53172 -22010 -88273 78860 -39332
19261 -309715 112095 -119483 238416 -162572 206758 -230244 246169 -174558 6002 93899
19251 93899 -162852 -143540 170513 -160429 -105334 -120454 317100 -263508 -289674 -167123
19241 -167123 -138249 -229767 288330 32246 -158798 11818 -218597 237703 335749 88101 -127793
19229 -163378 63555 17173 -129809 -264389 -88185 88112 -191155 -7171 75966 1954 -46822
19217 -147647 -364484 -111645 -56852 -32915 -224067 14266 -108893 -55605 23653 99694 -159234
19205 171566 11449 -189295 80632 115725 -158978 142943 -19671 -280076 -155243 -146475 -49997
19193 -139101 247279 -11933 -129560 -68487 -126490 101766 -289627 442503 -99256 16854
19182 -76312 95746 -8348 275506 -261924 55577 125874 107274 -402898 376181 -85916 -203230
19171 -203230 -16858 -433441 230118 1392 -49251 -286465 -198640 -46361 -80475 -118952 -932
19159 116288 214900 40618 -2295 98440 35428 186812 -137029 -139758 -495400 -38066 103197
19147 -182451 98544 102917 275885 351682 -245958 -2105 116232 -130197 -68898 -201380 154702
19135 -2660 -175727 155795 187444 -356426 -323978 -198451 -273290 150624 -102765 -201160 -315146
19124 -315146 1106 -38192 -126338 -442177 153671 3476 -139765 105613 -348574 84021 -171265
19112 -189489 -65966 -222956 -183584 92546 -80560 -209321 -178644 -364589 67568 85297 -21760
19100 208237 -78477 -28265 -18954 39712 -99763 384144 -203041 -176513 327133 140030 100826
19089 100826 -75266 355085 -165185 78027 -47443 -179834 -199827 58332 -2774 -247751 -82984
19077 -155227 -210789 -147563 -55661 -217587 100206 -235337 11145 32347 240576 -39483 -86876
19066 -86876 -348706 301855 87519 -309734 -167829 31538 -274664 149223 -147608 219323
19055 363846 107950 -98311 -204477 -107049 72807 -170691 -250146 -47679 -395318 -228658
19045 -228658 -118540 -179749 -168267 -99312 -296702 -103452 43134 293141 100315 236288
19035 236288 -124686 305836 -26320 -45895 264214 169280 105086 161802 -101615 131147
19024 302249 298663 -96416 204057 -67197 196169 60703 23062 -63709 122862 154724 209282
19013 209282 73517 125251 -35486 -37430 -92786 91113 11698 -4005 -16296 -112003 -407816 -208480
19001 -208480 -50805 -229887 15929 -42211 164203 -104375 -92463 -115436 -91760 163054 -398392
18989 -140453 41004 -18220 7930 131698 114784 -391387 44988 -439044 99997 -159373 -34645
18977 -192438 289795 -41883 -164205 6529 25096 -134996 55770 -40471 49876 23488 -4621
18965 142917 -52359 202431 -399551 59453 212444 -59923 -49464 302512 249259 -207799
18954 -84233 -50322 -300219 44523 -399558 75542 -53022 -41464 -96087 -24176 -59681 -258365
18943 -258365 -162114 -6899 -83306 -268331 -192303 4399 -73583 -245054 -54201 -186319 -1066
18931 125203 -267382 147525 -53546 -178693 300257 -181153 -347268 113343 -186485 -280319
18921 -280319 -329536 161687 -377338 -199879 60182 -75656 83722 -221555 134061 -167868
18910 -261405 191946 53709 54261 129316 -156968 -108732 175478 -76308 -123765 143287 -73244
18898 -128558 -207929 -51763 -29219 74807 -315306 -333450 -301081 -181146 -274294 162457 71351
18886 -12587 -5278 -257068 -202072 160101 40795 -51117 129768 21401 49579 -50200 -86608
18875 -86608 -151897 -281397 199771 -202878 76655 35233 -89353 156316 1233 75368 129809
18864 129809 55078 -366123 -188662 -188603 -279500 327100 56778 -164074 -21246 -5909 -193434
18853 -193434 -9867 -14659 -263260 55057 249358 -101735 79886 262392 158230 -116882 -215470
18842 -215470 -80832 238645 176353 -91043 45410 336768 165006 -399927 -168392 80966
18831 -270794 -241561 119608 14504 -90309 125592 236964 -271133 38530 17486 -17009 178043
18819 207190 -201833 75117 27724 78056 -45512 27134 -211697 212898 149325 167900 -4311
18807 148060 -135625 -130021 -1618 144268 -412657 39379 -23054 324823 -175163 5338 223109
18796 223109 -555918 -191622 -235749 -200761 -97919 -246815 92551 26621 243924 -455991
18785 -105892 -264702 85923 213016 -16709 -112626 96141 158968 -219915 -244869 -348550 367816
18773 -79020 -163153 -299687 -154712 142921 -150625 84208 7887 -250772 -159904 -100070 221943
18761 -215094 368693 -100268 -91394 -67667 -434544 42242 -30137 -144104 86769 90749 -181078
18749 56826 228202 -13815 141647 -24938 -379314 -169301 -77321 -53219 -92733 86579 -452271
18737 112021 205833 -39729 -213905 195363 -22333 -25680 -68211 -129834 -44081 -162096 -27667
18725 13382 39212 -104585 -193828 83142 -53482 -158004 -142853 -307517 321206 52141 395767
18714 395767 115969 -4770 -48568 137036 -80984 -273390 -184931 -228483 -170986 113439 -14380
18702 -136939 -6275 12170 -67304 -184317 -388158 -167229 -175490 109678 -185325 28597 -94244
18690 -21442 -164352 217438 -270430 124224 -510821 -230633 177707 -59616 -155481 -991 -53387
18679 -53387 -162094 -222668 -81327 74125 -137348 128886 -166605 -111333 -199253 -557410 187041
18667 3933 -139957 -20857 -38525 69413 -174711 -158581 -174418 -239954 -265777 -232658 -222798 -225676
18655 -225676 -55980 -99153 -11802 -97120 48805 -66554 -206372 -71122 -159428 126675 56665
18643 163761 -13712 -311536 135528 -272086 278403 -371592 -35025 102542 -331246 356171
18632 -182028 -267482 -14730 -99121 -1890 -28144 -47247 158499 -118451 90689 -88388 50500
18620 144564 -126560 -180699 101257 -163160 114487 187855 -76115 46746 -128447 298659
18609 116190 -226352 -45539 -181581 35820 -126343 11576 -57631 72387 -471907 -198499
18598 -402141 -73867 180544 -162708 -39685 -342572 -190797 -213160 -274820 7205 -357544 -467455
18587 -467455 -90711 -70265 -136225 -162311 185241 -136013 -175338 19559 93695 -329707 -176631
18576 -176631 242211 -25031 78586 139160 208702 141186 172700 -156706 -109525 5216 46824
18565 46824 -100072 132951 -567270 -178695 -212790 -182096 -53707 -16901 24483 243056 136491
18554 136491 -287758 -44384 -161406 -45674 -74234 -113280 222932 -289462 -42188 23227 -363640
18542 130083 110713 -288165 -89230 1790 47299 -226040 168432 -144791 -333979 92250 485141
18531 485141 -291403 -97466 8822 -106413 81785 -260049 -71941 -121674 177 -6141 21920 -210978
18518 -435387 -143625 -25934 -157646 -536982 -220411 49386 156468 -146551 -207428 31833
18507 -123321 -20783 -158384 -154135 -323437 103591 317722 -75582 -349374 -204386 -33058
18496 -346226 -54823 290834 -454772 115656 -162688 221419 -165060 -233941 -163405 -12168
18485 205353 113540 -416638 76151 307159 -215546 137323 85645 -43208 -104169 8544 71810
18474 71810 -17311 -86527 -64639 326171 67480 59102 4204 59176 -203811 -204480 152437 -124409
18461 -94558 160520 -53049 -166615 -109097 283146 -39875 265934 99222 199239 -123781
18450 -101909 76346 -25178 12419 -31666 354992 -175654 253545 57034 246685 107441
18439 -154905 137904 -269963 211013 8802 66170 -87760 -299282 -182470 228857 96693
18428 201810 -280322 103324 -108388 120393 -34123 -94204 156246 -65419 -13665 -164845
18418 -164845 -178754 -16466 8690 -117076 -62983 178009 64025 213159 -128940 343530 168979
18406 8465 -12352 134971 149922 3745 14561 -275888 86563 119766 134130 -184245 -53654
18394 124008 -193354 -122598 97103 -231981 81012 -25086 201593 -89247 26617 -119239 256980
18382 101579 -244745 177138 -375185 7721 106762 -340684 -169096 -248857 72154 -46184 -70769
18371 -70769 -75994 224272 3209 129882 -439957 -178865 83473 -140884 -180403 -6906 -52431
18360 -52431 -55519 147807 90852 -84058 -163807 -189267 30537 182879 -145572 87880 369371
18349 369371 -74796 76620 -18313 -191413 -21761 53381 -253138 -7625 42132 -110603 -117051
18338 -117051 -91665 -408592 -130061 197289 -98787 -80642 -212048 -198988 -49588 -86342 -26567
18326 2769 -320844 23867 255103 -441589 -77978 177281 257218 -228343 -187262 29796 -89731
18314 -193526 -160236 168830 -44301 -33643 -98172 25132 -191823 -334849 38283 -80695 -280756
18303 -280756 -158769 -123071 -212175 -42215 110356 -69639 -118037 -271277 -24864 -280922 -133278
18291 124504 67341 30895 117154 -198816 -37039 -77644 77222 -107967 -61621 406722 91117
18279 133234 -74507 399149 -6319 -47381 -145994 64892 -62903 337057 134347 -145368 -53573
18267 283571 -220955 138388 -227969 89563 71956 67732 -85762 25938 95313 78842 187767
18256 187767 23600 -101939 -176950 -266514 97699 26632 -383529 71002 -558146 -816 78128
18244 -142768 -22618 7102 74140 30026 17723 -171922 -168216 -246146 -172557 25172 -11789 -181347
18232 -181347 116714 -43976 98993 22655 45475 -25005 104049 -29446 65075 -352129 57822
18220 -15560 -292905 -228466 282063 61483 171714 230629 -91351 -352546 165212 -168706
18209 -21300 -81818 68167 -188339 15409 -130838 -50767 13275 11813 1792 -51768 -135673 89780
18196 48561 228066 -43448 14932 -128496 131687 104553 11933 -287809 184461 19224 45759
18185 45759 -43657 -29646 78312 135876 9356 -211400 92757 138674 -307539 -48974 -34332
18174 -34332 288463 -133910 -116450 -24056 13007 -275723 -258094 -58720 16563 -281033 -86749
18162 -79149 -6257 -45283 -238819 -123502 109917 155989 -38871 -61728 -201529 51184 82714
18151 82714 -229848 99452 -7609 387001 -16596 34830 44633 116882 -80895 -42496 -321053
18140 -321053 16170 36645 59169 297821 -35211 -241547 -326360 -318085 35179 -165187 -8233
18128 -101545 8928 -216939 -351072 -39865 164308 217083 75509 -28446 -284986 -290406 28096
18116 -297796 -101153 140463 -69073 72551 -19223 135294 15374 17960 -12503 113154 -100397
18104 -59979 -135251 -208801 301094 -275663 45144 -391680 -269791 7556 -80647 4418 -144720
18092 -117814 52762 -199056 -288342 -24795 66262 -202543 308958 254313 161169 -9972 -263273
18081 -263273 290443 -158625 -353261 126540 -129890 -89779 65816 203329 112249 26425
18070 -75242 155598 57494 98189 -238708 -336408 91876 -172345 -198271 53173 34062 -98682
18058 -32464 210077 189471 -205325 109728 -104782 -8389 17282 225449 -238196 -154430 38338
18046 117402 166645 -211211 -257459 114927 -47843 -265993 -10199 9156 -7994 -77705 260705
18034 -114592 -226146 -279821 69566 124142 64908 133322 245662 165107 -13411 382584 -73424
18022 166267 -170656 134399 -228354 -123931 -220076 -145848 158456 -254846 123182 27201
18011 -125976 130805 -190818 -4501 72989 -22382 -357950 75886 -84558 8838 217034 -229892
17999 268965 69136 -318027 -399849 -96932 -68579 120424 -295350 24129 -235103 -43319 15489
17987 96750 -56908 313621 197406 -364852 -170672 104369 -37352 58830 91833 -13627 -188962
17976 -188962 315480 4711 -348191 -121890 -168549 -207305 -35061 -198220 84417 69984 -246110
17964 122452 -150173 -443032 -24174 -1289 1259 -87260 103577 162414 -16604 64428 102066
17953 102066 -179414 -395594 596173 -41333 366430 -24241 -46638 40337 -67980 233276
17942 -136215 -63310 56001 -1687 -33325 54185 -389480 238117 101830 213130 98885 239118
17931 239118 21481 266429 -146056 1083 29327 -102352 -334001 9446 -162677 24809 -8398
17919 -395838 -178218 -202555 -20364 101627 207008 167912 209750 153538 30153 -278406 97939
17907 30591 22409 -230893 115227 288513 120238 5234 -306274 53270 -24852 -118967 80599
17895 -320492 -138898 279837 38340 37141 137611 -292598 189840 6739 -204383 -74930 -136880
17884 -136880 -135617 -7775 -297929 -218652 140480 255544 350572 -225188 147276 226821 -321188
17872 -75077 206183 93043 6797 -95554 275068 -194981 -142799 -2652 88642 -374531 55766
17860 -42298 143019 265779 -61707 -310890 -173556 -63662 -59750 -39146 23792 160590 -141454
17848 -47430 -319021 158237 72697 -24771 189432 38022 -243495 181188 -146000 141791
17837 26849 -31055 -120635 -98301 189610 108627 418537 -11768 155591 -81336 -274492 -23904
17825 166705 -71050 -99642 -160941 57329 34186 -122656 53520 93217 -282054 82914 -96980
17813 67756 -30447 -126360 1886 177243 -358079 -164134 -134388 16731 31469 -182742 59643
17801 315621 134248 -193467 -52098 -107730 -6387 -101242 97551 68280 -201304 -47280 33612
17789 157738 32933 88715 551399 226734 -103826 307421 60044 96914 47897 104207 -79407
17777 216669 206778 -33770 18266 377342 -163370 16884 101067 -122204 104717 271111 -93358
17765 -80787 7533 -84532 339153 3954 -27137 296402 187282 -190741 -98637 76321 17004
17753 191796 19930 -218219 -218997 -465522 -2244 3656 407760 -208668 -12064 140550 -118623
17741 60617 124785 32618 -266303 202793 141439 -103339 116515 -286607 180664 -9741 116544
17729 -136352 -60700 -44842 300185 80461 -255662 223665 26806 -43746 -276593 -158530
17719 -158530 -31193 -210730 16217 -27003 53169 217847 179354 -67814 -74857 -55233 -160599
17708 -160599 -265669 -16588 -100102 -317101 124575 -412915 49415 -100501 128968 138797
17698 138797 185641 88482 194661 -84504 250584 300473 10758 -254418 141260 -481178
17687 -46302 441372 117874 -148911 -126568 118342 119201 -37617 278073 -140311 -82111 -72846
17676 -72846 32917 -48545 117792 -82003 -137137 111693 353561 180923 278757 -127266 72154
17664 -73351 208901 195546 49991 -148287 -103974 19217 -125782 -80782 56924 -112127 -112205
17653 -112205 -24187 -229801 141945 -28854 -60142 96132 -211981 45030 94779 522005 -258313
17641 44752 127148 -244962 -205031 216380 -271516 9331 18929 107984 -134019 72894 -188725
17629 361837 -68303 127326 63768 313655 69077 151459 95877 -233738 269868 -198936
17618 64903 94527 124892 -88106 23576 -41746 26615 322259 330376 141962 94766 250403
17607 250403 292837 -203603 -80974 -187083 353276 -30533 -236690 -9107 -26401 -142691 203660
17595 196564 6556 126059 249226 -27065 24129 65083 -134299 282877 266114 14174 231031
17584 231031 -138923 -98650 268741 139920 -283511 -55623 -23815 -131003 -243423 -259990
17574 -259990 331934 49715 -143697 -128307 -183849 400334 -208173 120764 138825 196361
17564 196361 -160546 199542 -93145 123414 -95453 -295634 -279776 66535 35190 117565 111430
17553 111430 32087 -39708 -253927 85238 -192075 -218726 313121 443594 29734 -7385 137948
17541 205662 81060 52781 252686 607013 148674 233938 -59421 167989 155192 -354114
17530 -53737 255847 9399 152399 -41860 321155 -176966 163612 337295 55028 159050
17520 159050 107276 -195821 209487 -32500 -294089 -185461 70859 347837 73531 54434
17510 54434 -10685 11933 40573 102513 164868 -157630 -141725 48094 377979 143524 296192
17499 296192 316720 -98027 -23952 25619 150021 184703 221267 41827 140636 243458 261987
17488 261987 343981 -208990 81748 -140947 98736 149797 -219408 -46330 8248 262871 -259107
17476 109460 70504 82816 212273 -12373 -209157 98190 343004 -32502 -44736 184242 18279
17464 181797 -19376 -11738 332788 135764 121542 144870 203776 173385 14695 279066 38647
17452 80470 160013 -35349 189317 -119788 171186 131075 387649 469063 414004 194804 151739
17441 151739 72337 265894 484842 108662 -18511 -13296 351515 27634 267829 -117470
17430 249326 -161039 245526 292540 148254 275153 3232 391009 350885 207147 75196
17419 135429 154727 173834 -10138 -76769 -22913 36816 -3754 269326 85981 390485 -167890
17407 166828 -28754 232497 -97786 353563 99231 -10160 86259 36508 252010 168206 169092
17396 169092 476403 96186 57927 1905 149734 129749 244602 177824 145280 -45664 139037
17384 42049 162625 -168373 223702 193546 -24249 30894 141688 304372 187214 -197273
17373 -49375 143700 -148817 358192 389192 165452 100086 85345 -137999 -103575 163830
17362 382869 224910 300254 164941 90658 77583 254745 -119026 154679 -14869 -199471
17352 -199471 375310 279477 288562 82507 50315 266926 341356 17196 45931 5892 227249
17341 227249 -69232 287235 167350 481881 235695 -55412 116676 119912 95640 176733 -330201
17329 281769 177878 332235 220390 334515 53327 9909 244404 233878 170885 8483 263435
17318 263435 -46297 413805 61238 436171 106629 -48761 130312 259189 455925 167476
17307 -70101 -24295 163613 136680 61226 82562 314401 365356 241463 38089 -30222 -31220
17296 -31220 321033 172256 109608 272704 -172755 91180 191231 83536 -134826 332053
17285 244655 432978 -167512 243767 -35016 265011 90593 168 143410 75376 -26551 249445
17273 270833 -9095 282088 -89922 75240 -124184 150692 -7451 89330 77015 289660 375491
17262 375491 219552 277406 132255 187977 111024 -14021 258378 -109057 191147 436493
17252 436493 146911 56562 112005 246776 206657 210391 72028 423042 140738 180375 -98683
17240 357022 -138947 205567 -13251 109971 172502 507703 413874 319104 318887 67532 184517
17229 184517 309299 2538 301677 197384 527186 173434 339015 -226658 -72774 249823
17218 582796 296979 430527 529400 359279 23717 801982 157515 352863 482539 138830
17207 520519 227490 33264 158770 -121941 97726 62797 151373 281954 378313 79257 284279
17196 284279 -19956 150802 266883 250114 355811 196310 479369 78809 304136 279118
17186 279118 -220809 -128933 203986 414066 281183 209504 373599 170981 220951 -10480
17175 187763 178324 250450 306049 397947 86801 364104 307789 606112 -117045 349510 351920
17164 351920 742944 471858 498070 320922 124 356230 121363 359764 -38489 428556
17153 36560 297791 326265 437118 80251 -197921 245638 189267 356619 147554 191842
17143 191842 271543 389389 332694 154335 343700 146090 89176 42421 229962 313768
17133 313768 380295 348803 523244 527271 357536 51814 231305 357290 297697 203640 438118
17122 438118 308640 560185 324393 143366 325317 212008 316483 311996 459431 179468
17111 80596 255674 112382 457075 529821 334647 222245 334524 485606 337504 229319
17101 229319 416607 408438 431727 284130 161980 696310 397671 365629 652789 535071
17091 535071 309327 211114 608981 194832 636887 41640 327165 745399 319589 465764
17081 465764 183214 569007 487951 581415 372359 437081 425639 420244 323442 251963 426898
17070 426898 148843 592576 552574 438756 85096 657517 519767 591214 685175 227832
17059 144239 745195 252334 462426 396716 414501 510094 403885 368884 406215 488371 562049
17048 562049 620945 588848 386325 351182 366879 593386 610929 514881 610031 649531 414899
17037 414899 164229 612411 646923 531254 360969 239663 517157 505771 448158 791962
17027 791962 675092 552696 522061 589284 714577 647829 645922 598368 836254 467401 568786
17016 568786 647985 485003 631065 548976 627338 1043379 655499 1041459 781559 380527
17005 631214 844482 935609 610218 591759 690179 886886 907865 796847 489071 544840
16995 544840 742912 919106 950251 1075259 958674 738560 928140 676925 876105 894931
16985 894931 863516 875618 673049 664403 864910 633274 766691 859476 769552 859777 552398
16974 552398 819791 774586 671161 829690 1015585 836094 876754 840314 994316 639534
16964 639534 790998 938357 1012165 950258 955713 776678 1348075 941087 945448 808299 1065196
16953 1065196 1166411 962544 1126224 1251647 862253 1105023 1107964 773428 1256669 916361
16943 916361 1179993 857377 977568 1228479 903936 1392509 1100709 1406502 1132155 1221267
16933 1221267 1144941 1372964 1526517 1545028 1258955 1189783 1282265 1205380 1753414 1517302
16923 1517302 1369360 1477476 1473372 1322518 1390750 1466221 1475890 1688461 1439318 1340987 1309715
16912 1309715 1766865 1487416 1812704 1609896 1426247 1754681 1647614 1794507 1612933
16903 1612933 1577234 1587464 1696994 1558431 1546952 1476723 1748814 1942561 1726033 1878386
16893 1878386 2060373 2035693 1573569 1911031 2032628 1841194 2013922 2246492 2238388 2198463
16883 2198463 2114012 2239665 2109641 2054474 2116025 2142282 2418061 2212273 2037489 2278102
16873 2278102 2315146 2370506 2550927 2503898 2619337 2473178 2227884 2390565 2655911 2844955
16863 2844955 3044411 3011862 2600850 2837167 3084531 2919449 2957121 2902058 3196217 3157409
16853 3157409 2917390 3078992 2960663 3310629 3043751 3655333 3346623 3689766 3605168 3150688
16843 3150688 3560694 3553704 3919780 3801308 3917696 3972384 4085044 4272113 4139853 4542701
16833 4542701 4225356 4479527 4598647 4367190 4760207 4769788 4607388 4994656 5022551 4999608
16823 4999608 5154895 5183565 5107376 5222562 5291555 5475069 5723442 6052006 6104548 6011476
16813 6011476 6308298 6324677 6520216 6512774 6551884 6954634 6933868 7054594 7245275 7524647
16803 7524647 7577858 7813114 7963404 8041140 8239837 8724876 9106362 8877006 9006407 9499390
16793 9499390 9745129 9835809 10048022 10452921 10746760 11035392 11355126 11161194 11668987 12423971
16783 12423971 12099341 12774506 13263346 13823851 13998906 14710298 14837886 14984677 15807746
16774 15807746 16338493 17064938 17090502 17998073 18485383 18816833 19704720 20564044 21832863
16765 21832863 22183884 23105634 23794875 25000330 26157106 26999504 27858985 29378798 30551234
16756 30551234 31746245 32972238 34608094 36278201 38122701 39796271 41706928 44126074
16748 44126074 45847130 48211103 50787040 53251000 56228012 59062066 62567128 66128354
16740 66128354 69822390 73602600 77839858 82223460 87488738 92416890 97860941 103309275
16732 103309275 109809575 116005114 122473042 129371185 136133064 142904730 149889320 156259217
16724 156259217 163004406 169026009 174253542 179078525 182358448 185143237 186837831 186978723
16716 186978723 186381572 184056746 180837082 176930252 172096991 166380937 160240661 153720528
16708 153720528 146310010 139909467 132845798 125561000 119078138 112316479 106035751 100130858
16700 100130858 94263634 89121511 84260312 79175275 75257678 70672668 66558744 63131671
16692 63131671 59879605 56826519 53673092 51020207 48436517 45936658 43661430 41556628
16684 41556628 39769597 37885465 35788321 34361603 32614070 31097087 29917832 28856417
16676 28856417 27463398 26622915 25541477 24342012 23335011 22404315 21541633 20740111 19909433
16667 19909433 19441993 18474536 18210340 17564564 16608262 16301850 15681067 15275825 14690647
16658 14690647 13981366 13764675 13374446 12947077 12703213 12038254 11971868 11389800 10965175
16649 10965175 10702052 10458706 10171428 9992775 9644434 9202914 9132291 8838281 8494685
16640 8494685 8352187 8389183 8412405 7933657 7565112 6915653 7299516 6981582 6905894 7174580
16630 7174580 6713686 6415926 6100017 6325819 6120733 5873257 6130379 5610559 5379502
16621 5379502 5438961 5476877 5329311 4866762 5005557 4836724 4746623 4669547 4665242 4798436
16611 4798436 4416062 4355447 4287558 4202266 4286817 3988770 3752861 3776637 3717243 3609690
16601 3609690 3782767 3415101 3482463 3603108 3658682 3372353 3296095 3116726 3383317 2951901
16591 2951901 3510724 3072313 2956844 3167360 2883784 2850856 2669773 2937709 2693184 2623212
16581 2623212 2707559 2659222 2390917 2637157 2572232 2394548 2159325 2237665 2463522 2466512
16571 2466512 2210286 2348493 2398777 2166535 2328854 1894758 2612122 1861251 1741183 2149234
16561 2149234 1915310 1724161 2014785 2031816 1837241 1969941 1804913 2096943 1756178 1631260
16551 1631260 1727388 1779941 1578167 1478407 1528790 1588737 1444298 1664334 1619671 1482677
16541 1482677 1527377 1422117 1339735 1398129 1501709 1641328 1329103 1693820 1401826 1707422
16531 1707422 1482124 1661403 1435822 1366826 1346937 1507640 1360706 1557738 1160418 1092102
16521 1092102 1209150 1155656 1433161 893610 1109755 1228888 949238 917209 1234749 1053816
16511 1053816 1410672 1120463 586114 1147250 800119 1150401 736377 956548 1005548 863509
16501 863509 832627 1061511 667792 654769 1021910 1050220 1158449 787017 926113 835626
16491 835626 952333 851649 943563 795403 864279 801885 616056 828581 913302 623602
16481 623602 815872 786161 599957 771846 746817 944725 691838 588332 533504 650503
16471 650503 1213606 486748 653471 559243 586074 777391 758596 747095 735798 932242
16461 932242 720533 508587 547931 812143 474106 966735 714620 815270 389239 304330
16451 304330 444176 180502 825829 733463 448465 894950 938557 812699 627267 602839
16441 602839 688821 525086 527877 586342 656990 480849 603712 467587 500655 342734 643837
16430 643837 399348 705375 457741 687185 625726 172467 514135 485848 336569 518038
16420 518038 374278 427378 481065 303963 561837 632328 498161 349134 391385 488695
16410 488695 423727 355708 416564 494497 274009 637751 308634 533155 479058 364220
16400 364220 250241 381351 473639 266473 180420 201095 -64281 356116 368492 133063
16389 -75692 443291 339160 428654 364142 436962 368804 695997 426357 397120 96573 148133
16378 148133 230357 539546 483125 300931 61848 345630 506945 361752 426388 300340
16368 300340 223872 489327 346092 315483 367897 440417 393839 467315 99379 125856 121266
16357 121266 159594 505024 340167 645383 86272 319229 -64802 290807 323836 315747 -52293
16345 -151250 255095 254242 251025 131182 242652 128585 282691 -27447 322942 362661 329625
16334 329625 271506 313332 81518 325468 88834 519047 385689 136232 -13835 229951
16323 520058 311038 409765 183730 372105 282106 463713 330185 365866 88383 159722
16313 159722 231930 305555 -59705 225173 324973 113584 85019 9175 248498 -20188 17860
16301 58737 347327 -78662 215670 377452 494669 -99439 183466 350876 -42456 13634
16290 153655 227896 -165587 194253 439866 54264 79405 307188 -259860 177319 -269926
16279 143056 185031 83837 404458 122734 58853 260305 -3122 205136 80092 -210744 183652
16267 298202 435346 -229184 -262622 131792 335521 438029 241958 244581 448979 112207
16256 59083 44507 -28512 275513 21691 -113029 -50872 146359 151725 367662 172631 -10345
16244 -175006 186447 220582 -168544 288027 242915 192114 -218865 -228388 421918 129944
16233 399214 379868 85519 58316 -2931 213198 -86772 295815 -34487 -12759 -421 116519
16221 209972 116482 288891 55728 221511 -61118 -1974 -235790 117203 42140 -72671 -271340
16210 -271340 -88641 -145506 113387 224801 356656 -13956 37656 -76936 195621 121047 -19303
16198 97235 68959 -100545 -83162 163661 -142510 169210 54877 -25103 150056 209540 122857
16187 122857 332691 240327 94087 -82824 -107287 190264 -1614 -290424 -94053 69642 -147694
16175 92023 36216 -513291 159032 -72538 31529 265816 -52708 -204497 117477 29598 45375
16164 45375 -138437 330726 183250 183096 107310 3697 -295856 159557 -167222 -135177 -124890
16153 -124890 81499 -12687 -26274 -243215 58365 208969 69953 57134 121613 -202104 117850
16141 69440 140315 4422 -140226 -121565 177138 -18006 171090 78559 543661 173995 251874
16130 251874 -40840 -323410 188205 28623 121891 -283134 -100197 45965 -56042 -163667
16120 -163667 49392 -117653 -380950 -36136 7373 20672 69415 -331300 241344 30719 -239077
16108 14614 -36162 267470 -44957 -81043 -184770 167648 -132950 148845 49251 -185289
16097 -304076 -167770 -385502 257787 130904 70678 48152 -136352 97102 58499 22883
16086 -1158 160059 70300 -87320 -157136 -51692 -184226 181718 297637 -60085 -95327 281719
16074 -105587 50752 7215 -195810 183159 -147727 335569 38425 -104749 -209628 -3514 -63152
16063 -63152 300665 55819 -24137 108109 226368 132724 16408 -14624 138705 131424 9583
16051 14278 -11562 65236 210606 -261999 -60620 125479 9747 143459 62222 -9458 -38322
16040 -38322 -59403 77074 -231550 100878 -23058 318617 52581 -72456 -11377 64741 77845
16029 77845 758 312146 -178998 -265966 271893 103669 106914 33362 72347 -87547 -59623
16018 -59623 -13642 117689 2011 115421 66237 424176 -111410 -102803 -99205 -70559 61859
16006 252270 -92078 -62583 25709 -133396 -18039 -75714 -366016 73143 77163 64077 -216791
15994 206616 -12041 -28498 148151 6513 -166448 195532 30350 55033 -252338 140008 55058
15982 174264 2608 397032 283637 229162 210674 -251038 -119806 -79114 273735 -363340
15971 109247 25239 -292973 -338734 172016 157792 245257 -284911 97178 -274829 -56301 -217454
15960 -217454 -248161 -242070 -243535 -135814 206692 -151387 -42788 -482761 57078 -149506 -55704
15948 133387 45392 -290266 -203052 185629 -4259 58726 -180959 -15425 20500 300390 51352
15936 23072 -129070 15866 -63727 254698 -45557 -130274 71726 -332248 -68409 -188513 38650
15924 156842 -32577 51007 -145196 22003 127543 -170373 -128930 -89212 1482 -59507 -269329
15913 -269329 -148203 92964 -174755 -106517 144218 -339895 255181 -310879 29243 133435
15903 133435 32980 995 153919 -122276 -314702 -172091 -62569 -31261 97854 99988 -153437
15891 95533 -52618 -290631 -304948 -96350 15022 -102173 93691 80198 13457 116360 314414
15880 314414 131442 -57363 -155937 166397 -185415 -301764 -97739 165336 30421 140249
15870 140249 -99253 -70344 -62812 11790 -238314 14780 -46611 1917 -137911 -87777 230231
15858 -41613 -292184 -86493 221456 -82347 45341 142043 -169036 101595 -25918 165173 -128243
15846 -41636 -14049 -395157 102160 72526 23337 -183608 545780 -131426 -129381 -254677 69710
15834 281634 -88052 166761 110312 -147508 -228707 -13068 -206840 261103 3268 -285188 150620
15822 -158161 -46904 -249048 60810 276398 232160 -180633 -79624 24744 -45740 -35941 -139678
15811 -139678 -330434 -35881 -24996 -309743 -24793 -35084 -18178 430735 80800 -202130 133769
15799 93663 -165143 -337030 -62002 -67075 235730 -47223 -39847 -33510 -197311 11003 -147438
15787 30469 317090 -425236 -7098 -186690 -18745 241504 46959 -356796 79737 -160540 -152781
15776 -152781 125193 90741 -27522 -59956 -31788 -29019 -63895 -201345 48535 -280571 -155391
15765 -155391 60341 -25086 -15217 3810 -76754 -149623 -62448 51082 -170215 -260845 14170 58653
15753 58653 127850 -44067 40992 16893 -118045 -39440 40025 45686 -237275 23432 17294 -325473
15740 -146232 -66771 -268939 296633 37151 139769 -560541 -164211 -42591 -101292 -60793
15730 -60793 -226376 142379 -76730 -189965 -82916 106048 190665 -169625 -45450 116392
15719 24280 -139078 55586 83823 -219217 288985 -55626 -171453 170951 -113094 54572
15708 -181517 -206932 48146 17293 52782 -138280 -95662 -488859 320383 175385 130856 330036
15697 330036 -43864 -135924 -142843 112000 73148 -283632 -121580 -151849 206090 416455 -23436
15685 -214099 26052 324932 164791 279192 -56427 174900 87791 103544 -133525 -116921
15675 -116921 91944 -166350 -84394 79455 -280853 -140448 108201 -48189 -83787 2935 -108722
15663 93147 -164862 106651 -27183 -372913 -126211 45226 66967 61885 -302288 367589 174162
15651 159916 185242 164855 -1880 280335 78419 -257907 -25497 196818 62364 155375 -192707
15639 -124710 -310853 25900 -77491 -128778 249631 134090 244477 107540 -546282 -98451
15628 -147543 -227683 9597 -161794 133501 236182 95243 -91293 47446 154341 -105638 147719
15616 61650 -229966 262658 -178614 -222869 -297459 -114662 -110375 260234 -4609 -316169 89465
15604 -62373 56933 -33005 16181 -174789 -65327 -69805 -277127 -28428 138058 -149120 -144790
15593 -144790 305188 -162569 144588 -46407 576830 92739 178431 239567 275918 30263 -427318
15581 130500 -112001 -31335 -79032 -36460 59348 -206008 -37330 -192354 -176146 -318271 126353
15569 12477 -196294 -58559 33039 279714 93581 124475 143301 163307 73155 306360 73521
15557 130589 -282611 62739 -8318 100427 -16960 -34826 -58513 389752 -185873 -238017 304198
15545 -187071 212453 130502 -170473 -71210 390612 12801 118040 -18194 -99907 208017
15534 -67305 -114065 -122604 -127941 -26980 154767 -64561 180816 126323 -132082 -23558 60455
15522 118704 -18744 -141356 2600 -33298 125602 -196141 -100737 -136260 -2963 257971 180074
15511 180074 -158819 -107966 -121199 -98654 -44451 -298408 -95505 -50938 348717 103164 -64253
15499 109811 -191683 212697 183852 131561 -231887 -102595 216171 114755 211927 43977
15488 -19577 -72179 -27282 71290 58610 -106602 35477 -172056 -246111 -220174 -336355 121958
15476 -21881 114121 -323579 202668 59081 158248 11472 -48915 134345 -64115 -194956 7186
15464 -151938 -42667 -75411 -195680 -148200 165681 93052 194283 245949 -433150 -61739 -118853
15453 -118853 -183984 -182107 195877 -161076 -106949 -106635 40154 -128285 60658 93655 109249
15442 109249 300233 144796 34705 50595 -142975 -83981 -482242 111747 -162864 69232
15431 -258686 -25654 -49263 142542 75335 -22802 -40579 221390 78997 214151 -208530 117190
15419 -47793 -132497 39384 -210822 -320158 -53017 -216867 -410264 -219786 125287 62539
15408 -92027 156394 -19323 -80361 215808 -278432 194530 -79222 -78169 159492 -115035 27134
15396 80145 183767 -11982 -12251 59475 -5576 67431 40250 344326 -75183 -177062 -22990 2741
15383 87328 48457 172536 -202546 -101372 -169542 -98650 221311 -66649 125320 11198 -98811
15371 33436 -8232 234021 -423356 80037 -23242 28940 2292 24601 -6220 -282982 -100773
15359 252385 81631 -136303 156160 214679 193312 -84162 -237217 168993 69360 276481
15349 276481 188451 -129423 -235210 -79467 17498 -94150 -37448 -37477 74945 -7090 -148181 -150822
15337 -150822 -271175 -117458 130166 -29707 214675 438458 295480 -339091 -168822 -136340
15327 -136340 -122455 -81384 125504 -180041 -133603 130334 -23858 -83800 -260855 -15941 285650
15315 -89635 -33182 139527 258027 36293 108105 327481 31904 -306837 -10090 -84481 115166
15303 -92636 -932 -200441 -89414 174116 163732 -97592 -235968 47618 -39708 -194507 278524
15291 100598 59906 -11665 -173565 132368 328259 148957 -155594 -116736 -105888 52333
15280 -183326 184344 -31180 -73143 -68917 138071 -213855 42296 32287 312387 -194739 -70113
15268 -131065 61965 338608 -53059 -16340 67811 161704 19763 392901 264335 135840 -99423
15256 197641 11893 91548 188362 96219 242644 95152 359762 759348 1416551 1454754 1416733
15245 1416733 1002659 306792 244994 353822 234060 162434 -57315 -85053 150697 -223864
15234 24304 231257 -5559 208457 -101826 242899 103521 117553 314660 132243 -43703
15223 -396569 84912 -20920 75689 -36176 -240136 83141 276372 -85458 304742 152132 -30757
15211 -196777 287377 60914 317564 -36491 184222 307245 403544 324518 396975 60012 91679
15200 91679 359534 191357 -38523 -3969 -28408 119264 -9767 -154488 383054 205352 82819
15188 164642 348452 301230 34846 245650 35635 146513 -66372 61564 285329 308533 -48853
15176 78433 -41554 232526 158661 -95033 -41902 80829 84541 -67764 144036 239601 131364
15165 131364 77994 105499 -324698 -187930 168502 -16322 95816 18659 -202819 93932 -133725
15153 82547 257579 -12497 -205422 -104320 -65135 -206907 235383 76060 36905 416 412051
15142 412051 80125 245294 206482 152906 101543 316218 -126490 256006 49779 261991
15132 261991 150073 167749 240336 148716 303654 -235568 -24505 334992 361036 353748 -282745
15120 32137 62776 9463 390229 24141 270493 30796 -88010 56011 124859 203065 -164943
15108 169039 60044 36966 390446 187430 79499 -55640 161931 -45680 -311782 -22988 176623
15096 290891 291663 -184048 -70472 -132377 112321 -116511 -62704 -20639 -113169 -49537 145492
15084 218059 273959 148095 194317 6496 202418 287467 -309272 63787 121499 191810 44377
15072 242855 -67326 108020 109389 -97791 246079 -71847 280823 182607 95516 77029 186362
15061 186362 220851 -25839 283717 305765 85434 214079 354693 149211 -124744 100973
15050 217581 476152 437106 -81690 -28620 206164 -3361 180173 120905 -186079 500229 278334
15039 278334 -31290 198972 246111 58189 54360 60448 58966 272427 304436 301385 358107 212477
15027 212477 207241 96752 382161 258753 468298 -71889 -66761 347329 237156 306759 -108744
15015 228888 109148 112485 87743 214006 256968 244305 118565 88793 234257 457601 193179
15003 331028 97969 303327 299308 203503 163301 -185567 380997 224821 223529 -130529 568251
14991 -108778 270458 42968 -83361 200299 26545 42371 342592 246464 68676 264185 291845
14980 291845 -308820 459173 349844 204052 86515 422130 226827 77614 6865 468891
14970 468891 397168 -216460 -121656 181458 208881 -76939 386107 243687 270218 173101 73346
14958 373422 162273 438611 -11540 265152 -92626 -33384 129288 292149 411920 54293
14947 257490 375822 428224 155598 91757 479390 279180 368 191632 370338 198141
14937 198141 72958 274153 69457 98285 225622 208858 125074 247969 228271 352974 -33014
14925 179116 -63170 173363 345302 -45434 418262 232359 570705 411095 398232 75539
14914 469009 334717 404633 447264 385084 634846 405652 155705 540033 235863 443245
14904 443245 552460 387712 149895 245867 13529 367527 393728 432567 67065 445508
14894 445508 56763 212229 473062 203298 369332 -80590 277101 476972 133942 410467
14884 410467 55619 539349 265300 225735 327139 573537 573150 303299 338894 368309 409597
14873 409597 468407 332584 406966 263633 418258 377196 435719 42940 238094 132392
14863 132392 245281 140076 594057 265108 181102 133314 471131 416214 386723 446021
14853 446021 518948 719238 357405 438485 472398 174017 587913 494277 276766 330483
14843 330483 396780 349301 385134 187006 490702 679803 136035 626583 171258 307442
14833 307442 195949 440223 236023 232418 318439 590878 750184 439814 367264 603158
14823 603158 344194 392495 429217 489666 280877 347124 566349 747441 479422 299839
14813 299839 398721 467195 433800 426083 585418 448719 229954 547025 701178 412425
14803 412425 599839 389687 682560 597274 687740 401867 487687 400889 514091 590548
14793 590548 656913 626061 892644 567563 645099 713193 534954 519354 616511 254700 656273
14782 656273 306588 297595 392433 619799 662547 692072 558569 656501 476978 1042111 687718
14771 687718 691669 738513 721131 488227 494782 601041 729239 509064 340931 270301 670625
14760 670625 620893 417617 538217 411962 503540 602685 615917 630389 764794 1083627
14750 1083627 126944 244883 578215 679563 815186 823040 454977 611863 590631 855035
14740 855035 384834 857488 524540 825352 748210 598235 623659 623741 565325 524199 884954
14729 884954 706565 1014248 869629 936179 950492 485581 802312 791140 741234 736436 668467
14718 668467 600015 1010678 651108 642982 724700 562694 668773 1024378 915902 727421
14708 727421 584452 783185 874639 759172 755616 541397 576964 749409 705748 778452 861229
14697 861229 737320 718299 725456 923374 852927 940238 843648 916035 658952 938853 1102989
14686 1102989 906139 861814 1127068 887399 1257948 810027 1075314 784584 809310 1155419
14676 1155419 1072720 1003182 516799 888403 957032 761507 808362 890385 1040274 1416626
14666 1416626 1003684 934721 1135483 760336 1305442 948539 1124288 1262345 1010419 1312356
14656 1312356 1525328 1331529 1242966 1034404 1084969 1007480 961488 1269548 1320709 856511
14646 856511 1015448 866136 1429058 1105584 893912 1134487 1306594 1268269 1072587 908981
14636 908981 895990 923760 1397571 1263735 1352958 1391385 1371725 1240117 1199004 1099695 1103467
14625 1103467 1542044 1312308 1553823 1149292 1506889 1853986 1244946 1398468 1218910
14616 1218910 1804898 1422239 1615074 1048487 1583528 1884311 1323205 1531484 1492630 1457455
14606 1457455 1630895 1457925 1571582 1638747 1524040 1607469 1657592 1461456 1428141 1481553
14596 1481553 2000572 1664221 1471918 1675667 1676299 1882772 1495747 1812103 1604478 1734317
14586 1734317 1622740 1879542 1853165 2026204 1686388 2101562 2344355 2005073 1688078 2091808
14576 2091808 1868570 2298563 2217407 1975317 2103881 1989936 1967110 2073816 2254344 2318882
14566 2318882 2278037 2529816 2428118 2652901 2691278 2520890 2540785 2837048 2834486 3091764
14556 3091764 3263215 3109275 3633227 3959888 4443048 4658839 6074179 8125833 12907890
14547 12907890 22642907 39354013 40752116 21873968 8850357 4611306 3247440 2616599
14539 2616599 2156793 2248674 2268217 2175633 1830280 2095289 2138905 1946072 2102663 2106281
14529 2106281 2021126 2033557 2447782 2478490 2323419 2377928 2482441 2423361 2451508 2541661 2433397
14518 2433397 2512838 2670183 2504438 2512100 2752148 2755255 3159310 2834928 2844393 2902925 2928828
14507 2928828 2980097 3218352 3065767 3081398 2998021 3033701 3142029 3209832 3221179 3269493 3276684
14496 3276684 3089558 3224706 2808152 3484895 3290388 3272619 3537427 3496225 3651401 3486645
14486 3486645 3421350 3709006 3525222 3672220 3860538 3872150 3673664 3643666 4045191 4279590
14476 4279590 4018493 4291053 4213605 4504511 4419776 3963483 4129162 4327348 4167265 4552916
14466 4552916 4695451 4500308 4462582 4414324 4837076 4858743 4885373 4694370 4755615 4538137
14456 4538137 5176156 4983545 4755072 5338335 4968100 5297671 5300913 5418445 5677485 5792612
14446 5792612 5389891 5682196 5935591 6029389 6231379 5897037 5777025 6136497 6402715 5988372
14436 5988372 6116376 6160426 6312343 6367806 6388940 6505871 6930295 7061117 6752145 7140590
14426 7140590 7007124 7473364 7334853 7629496 7646065 7825422 7602032 7957684 8184324 8165582
14416 8165582 8382419 8435793 8137323 8358269 8528148 8938605 8914330 8980218 9010010 9161245
14406 9161245 9420274 9853465 9939466 10137417 10387415 10375146 10500351 10561110 10793625 11050799
14396 11050799 11015384 11369436 11553141 11791939 12102128 11908392 12411559 12736420 12779428 12982063
14386 12982063 13155569 13213290 13482888 13770805 14370618 14426882 14730191 14860635 15471167 15104156
14376 15104156 15821881 16099538 16158412 16759771 16995167 17353677 17490738 18096268 18363633
14367 18363633 18785392 19274616 19808099 20274599 20312135 20897964 21153224 21746776 22174981
14358 22174981 22812268 23381105 23652952 24468161 24882584 25305093 26113503 26973352 27110677
14349 27110677 27924434 28839805 29133405 30233676 30863866 31421625 32491452 33304907 34341033
14340 34341033 35183370 36239241 37184434 38400150 39004218 40114058 41277058 42247761 43637996
14331 43637996 45000849 46756523 48014034 49416326 51176852 52759777 54315927 56237705
14323 56237705 58057538 60181044 62174360 64348481 66336353 68898250 71831700 74462085
14315 74462085 77191165 80302451 83151404 86731659 89968550 93824133 97578945 101783068
14307 101783068 106046059 110923913 115635018 120697889 126077453 132199022 138074333 144643214
14299 144643214 151776068 158951558 166783703 174843625 184097843 192806023 202914624 212936600
14291 212936600 223772469 235059209 247209373 259717777 272758160 286428679 300518543
14284 300518543 315075623 329479112 344547159 359151911 373753101 387987201 401678401
14277 401678401 413983093 425427682 435553704 444097902 450016682 451989150 451126661 451162279
14269 451162279 449550402 448594184 446664529 440238250 432259349 422867733 411844790 399606017
14261 399606017 386292711 372004640 357062313 341630657 326760836 311630824 297656366
14254 297656366 283604307 269485387 256703298 244133036 232176356 220868499 209857298
14247 209857298 199655576 190148399 180994148 172476554 164408445 156658841 149480798 142449395
14239 142449395 136481813 130467130 124860481 119115665 114069268 109645945 104992069 100605733
14231 100605733 97016212 93049789 89296387 85863414 82776456 79347019 76480763 73594390
14223 73594390 70809962 68577924 66376115 63949651 61971351 59689658 58014175 55449041
14215 55449041 54178692 52586122 51094147 49426351 47563664 46239169 44878701 43700115
14207 43700115 43196392 41947947 40574391 39044036 38391359 36881939 36194590 35663156 34324265
14198 34324265 33404653 32299825 31440784 30804568 29910839 29581956 28496438 28132586 26954452
14189 26954452 26201306 25916269 25282287 24662502 24111082 23372698 23284682 22446952 22125999
14180 22125999 21738923 21231680 20484706 20189058 20021816 19528424 19037899 18756979 18603981
14171 18603981 18179654 17440703 17503673 17229840 16237883 16162118 16186901 15704484 15571000 15145021
14161 15145021 14806466 14180856 14391565 14413745 14018550 13690082 13370864 13054095 13093350 12762665
14151 12762665 12809138 12408041 12357937 11664371 11601092 11586548 11459264 11373747 11013470 11013185 10694356
14140 10694356 10281267 10359468 10373010 10209263 9822108 9800257 9422431 9470789 9423821 9380335
14130 9380335 9254315 9052430 8542793 8852447 8663016 8504475 8650567 8215631 8516221
14121 8516221 8162420 7922317 7926011 7821018 7755855 7629242 7264152 7420791 7213743 7365650
14111 7365650 7252862 6934467 6950646 6737753 6845898 6972913 6475817 6410552 6532979 6289139
14101 6289139 6176292 5913810 6106015 6247067 5779051 5935466 5793493 5744710 5902295 5792857
14091 5792857 5658697 5445248 5473566 5572671 5020160 4899589 5135536 5157171 5266481 5106171
14081 5106171 5030566 5291621 4974911 5183813 4827094 4399161 4759165 4474649 4693557 4571721
14071 4571721 4372066 4326697 4399405 4321207 4189323 3899541 4686020 4019128 4381119 4003199
14061 4003199 4049351 4198644 4299147 4370411 4553799 4303938 3872218 3542637 3599336 3620023
14051 3620023 3661627 3548960 3852907 3468419 3578035 3633911 3566686 3046379 2963373 3246714
14041 3246714 3338982 3341256 3292378 3139476 3149968 3085503 3010934 3077152 3296163 3193046 2982997
14030 2982997 3146822 2812518 2775848 2951903 2918654 2878733 2782341 2883930 2760499 2404323
14020 2404323 2509632 2578073 2432515 2653142 2355739 3004481 2395034 2464918 2713002 2521257
14010 2521257 2144519 2416641 2458305 2377172 2528148 2414808 2217095 2277387 1855799 1867873
14000 1867873 2152857 2391500 2326879 2030224 2048304 1762512 2240041 1870601 2398053 2595115
13990 2595115 2975631 4140785 7580437 15830334 33129928 41006152 26507944 13868511
13982 13868511 8423463 6075686 5021388 4274503 3728413 3586916 3167290 2875433 2975260
13973 2975260 3175060 2644162 2795808 2325900 2527483 2252624 2317229 2241513 2216198 1959040
13963 1959040 2109425 2118180 2078307 2507806 1845276 2270019 2198912 2026729 1886610 2431875
13953 2431875 2147510 1854165 1933431 1944186 1992091 1671094 1908393 1961783 1841075 1602331
13943 1602331 1875419 1939203 2000845 1738127 2009564 1944091 1893588 1754129 1653301 1732241
13933 1732241 1687081 1742818 1824655 1698084 1329811 1785534 1604451 1746989 1520407 1325390
13923 1325390 1451150 1221323 1959194 1203436 1510696 1750618 1519054 1857810 1308711
13914 1308711 1465596 1404692 1573883 1719974 1385172 1376066 1427817 1514266 1524582 1381317
13904 1381317 1366639 1405017 1389905 1369667 1395358 976038 1494568 1108971 1249625 1062495
13894 1062495 1145516 1247017 1433083 1301060 1387947 1185088 1068111 1318780 1352399 1146472
13884 1146472 1246107 1298678 1306020 1271328 1130194 1460477 1508825 1101015 1163880 1073794 1212655
13873 1212655 1253055 1298938 1270317 1189131 1219499 1294377 1026464 1162690 1121153 1229790 1421057
13862 1421057 1241153 940250 981649 1239684 1060421 1077269 1066385 1105858 1037458 991856
13852 991856 1444253 981464 1067608 929661 1146708 1021164 986418 698947 1057471 1011605
13842 1011605 902186 1318157 1059097 1061628 964485 697789 1233529 1063335 1024116 844590
13832 844590 1122980 934325 1098565 1076537 930518 911366 694281 1211532 1002383 511130
13822 511130 821042 606689 1030101 1165717 692533 932015 720734 1082213 1119174 1019856
13812 1019856 632874 779271 866483 475077 668208 942086 530824 745632 824768 1060915
13802 1060915 682583 1032397 839616 1024141 936050 974524 818435 961168 801420 727144
13792 727144 431503 791368 326563 716067 627829 770959 646665 809854 665992 701134
13782 701134 526648 1073582 621582 853704 556194 738319 909845 831548 919375 914327
13772 914327 812994 1109938 555104 529079 1076934 638888 704432 919392 705119 395230
13762 395230 689929 610738 621754 500476 730467 902210 578116 809026 754888 600319
13752 600319 617985 541004 384210 868513 502038 768491 593568 709802 586810 412071
13742 412071 630557 624843 632320 818257 679088 556921 292274 613170 179980 583532
13732 583532 601744 874249 495196 217607 822974 474175 368648 538768 742111 629651
13722 629651 715152 224169 483029 808560 695239 952212 634106 446476 303715 452431
13712 452431 382038 504865 504923 445587 696349 278020 710252 404784 446818 580180 285514
13700 423358 809363 517034 76803 357968 687495 449620 564839 666754 519262 369556
13690 369556 481794 739558 613960 462728 842346 762780 743855 815813 393218 516067
13680 516067 428522 207401 384052 498174 335396 660402 760858 331804 156473 541070
13670 541070 630804 656824 540971 720004 270011 686501 753529 227576 327486 525028
13660 525028 385848 471469 367541 505330 510386 225752 598532 627513 140369 367404
13650 367404 204601 137070 316689 348543 396153 389183 41398 526644 338149 228324 353660
13639 353660 181128 561338 497689 85108 379745 105595 405111 370488 657680 602926
13629 602926 275456 341214 548357 537222 186710 483117 417056 510260 148265 307741
13619 307741 277163 341764 212504 418023 366607 510701 648722 429454 108253 409985
13609 409985 381238 543335 666370 533871 298360 443479 328230 313097 237008 368714
13599 368714 403730 565622 439103 585149 310848 257788 426987 434840 454783 353988
13589 353988 683253 555300 403981 326833 129351 244483 270914 394558 275610 300304
13579 300304 246033 -30676 379197 456833 464495 28544 440212 619735 413519 59593 354119
13568 354119 140759 291849 251379 208314 530704 167921 398904 144848 69061 133527
13558 133527 721433 -303909 148618 89195 112040 547998 315050 521487 236008 662760
13548 662760 219537 379656 205031 157071 311399 206783 -72233 151069 363502 345174
13538 345174 94186 65624 104860 566623 272662 291499 309269 190084 390197 451194 332988
13527 332988 43742 170606 436899 426874 270557 230770 343099 109617 274928 476924
13517 476924 315611 418862 125509 219909 253754 102132 376629 254848 175353 232522
13507 232522 301824 154892 -54234 -16755 166174 119510 276206 252374 98499 -47126 64040
13495 562778 377325 129238 300447 496365 373997 247275 30662 278414 109438 7587
13484 301740 10129 269899 107149 274132 304123 81496 280199 186265 164731 -172875
13473 278698 379256 276578 415039 349199 64619 428024 76872 23652 123497 253178
13463 253178 128700 211558 311504 130346 548519 148872 367264 524035 523688 18807 201582
13452 201582 410474 295895 -36782 455077 345950 311928 351701 377250 195413 -76249
13441 703168 86489 -2678 479078 278361 279390 440248 217567 163281 196424 400073 -35654
13429 238711 225512 299197 179399 209376 69806 184440 363097 269667 428429 183344
13418 161694 -17264 38702 -244437 -180547 360725 208708 468486 205089 198967 306597
13408 306597 350065 23742 202551 376955 209880 -213538 90443 63695 233950 316675
13398 316675 -143952 131448 380672 204208 -52483 -160098 369489 110494 157099 333375
13388 333375 318999 171586 402143 183662 109032 481717 306279 104225 363576 304418
13378 304418 203581 292923 -145770 -16593 293919 202960 292193 -5634 107695 225214 239018
13367 239018 -143737 316631 149362 183327 145370 -104206 144471 189662 90166 109456
13357 109456 191098 326411 430860 -6625 343669 254304 215202 66350 321862 122499 148164
13346 148164 413750 423861 -30234 460762 127574 57707 458842 205189 92153 233441
13336 233441 -9511 191946 -11794 42112 229514 -99831 60043 33297 476704 217858 314959
13325 314959 120534 448976 35893 340971 151010 261834 139409 126043 73656 156601
13315 156601 -162798 468767 73120 -70555 176684 475034 75193 257179 158361 343004
13305 343004 19444 232527 640277 94763 189821 1951 282410 87543 413346 162006 128430
13294 128430 144143 -51191 43848 -93407 -52380 193265 144332 -39918 276319 443962 61897
13282 185239 264498 98740 156473 141330 98824 139072 -124597 83577 456492 263656 17620
13270 214075 420498 -21788 264430 -529981 82355 -69528 50153 278311 383103 21144
13259 299395 155992 276442 -292047 208052 123713 160193 436475 206093 31029 254331
13249 254331 336544 125018 186815 117914 31243 -127567 135984 -110196 320891 111442
13238 -292680 177487 81359 -39866 -16210 204636 288176 -33732 210532 110863 192164 272078
13227 272078 42875 163971 392267 268829 45427 -57743 237008 162390 379574 181878
13216 292406 82470 -53073 -173301 216982 -182928 153114 142809 104869 100274 268537 119607
13204 -54472 -227668 62741 210464 -9728 159183 232380 5484 205736 63870 -37659 52277
13192 -131716 215339 120951 8168 38253 127494 431676 -151869 442458 -21818 48146 159494
13181 159494 5392 -77480 22520 406519 173138 90971 90271 43085 -8004 13726 -27679 -43385
13169 -43385 -184167 25510 -126826 146592 8918 -78327 332828 161300 185435 90563 110976
13158 110976 169966 30659 231088 -171554 78083 -172512 -216303 194860 54140 -287580
13147 57961 312383 6684 -63574 -44321 102407 122683 16516 28184 130415 -199779 368200
13135 201261 62479 -165293 46832 -104579 329197 29432 -120300 7207 6605 369425 -214845
13123 133144 -8841 330092 -98046 206896 -132095 -20908 331026 -56118 -205576 178394
13112 45397 -1688 135468 99298 21323 281594 171678 51816 340679 326709 4098 -115234
13100 37476 -284568 128972 -107945 -66123 184354 6773 321156 -95905 366118 -40378 306692
13088 119160 73748 33494 103855 116819 -45596 122966 -18748 278273 61051 129689 190036
13077 190036 198393 170405 72404 172239 218156 128419 504112 -42079 -196965 73428 -111173
13065 21112 454202 289873 75926 103090 40042 212748 -114145 -66153 271698 -5333 31964
13053 -47562 64912 -63151 111802 295423 113929 195843 62609 212645 -193197 208361
13042 -206738 182436 377293 -26995 278491 474945 229066 141151 -73563 -49940 69980
13031 -114437 20120 86243 149093 -33466 197698 19244 12624 509182 93694 154869 -118568
13019 188586 -113945 314033 250164 98484 -9943 213921 -24671 85722 167814 -18372 358149
13007 149636 218386 138743 28162 -78896 94366 145501 71718 103020 421296 191019 117673
12996 117673 476834 -221526 159401 -252319 160189 -136290 117277 -210032 221029 190548
12986 190548 311991 -151611 31478 71609 125186 -56023 -14137 -114419 202899 16520 -86352
12974 -127375 -212835 103142 -262056 246671 -122138 95646 -222469 -151273 169571 -67054
12963 -46584 -44226 320225 -44999 161154 73858 -241154 -170706 259992 340134 -211962 -74117
12951 -94560 -30939 149200 -49974 -3342 -55195 -52930 115706 -121286 89584 55624 -155772
12939 9050 -204636 24400 75913 2081 107664 -33619 -208609 -233589 -7704 -219840 -54941
12927 31688 231489 218351 62173 -31417 -4545 -89865 67708 -111783 -239938 -118897 -8757
12915 -16053 169078 11854 -67837 51405 -177896 182064 -434 -21553 33826 83865 -44533
12903 88273 183998 -17752 247733 104436 12255 8538 151886 99180 50423 -170235 -19751
12891 149957 -177896 28629 -37055 50952 78253 87987 -76308 -61369 -165163 -76683 11002
12879 156861 -105576 -228028 -7724 16244 -64816 22320 134760 85094 125749 27514 240788
12868 240788 58198 -100116 -94099 105355 23065 230282 162097 -218957 179230 57956 -219554
12856 253311 4688 152012 -268681 -30379 123892 6419 208125 -198164 254684 -245788
12845 16957 -152008 85096 335763 135459 -103112 18550 84638 216085 -120436 -233486
12835 -233486 49686 -64701 -72095 33777 287537 167203 25535 -119206 32981 -118528 239440
12823 -82825 32458 -72561 -101380 -166759 209973 126358 -8477 -248848 194507 82001 -231886
12811 316993 239558 13964 -155389 -204684 146446 -152872 269930 -135960 135878 27577
12800 443410 147904 89502 108251 432033 -218949 -63395 -9268 43343 -65643 -24204 94342
12788 82900 -142478 435402 208012 278424 54790 130573 -108648 17188 277787 -147790
12777 -302822 177725 61028 -14102 -185529 -214935 24699 300390 -1290 48754 -182719 69004
12765 149728 -29379 188923 -225943 86357 226378 -283824 -25613 194790 -40772 -84548
12755 -84548 -143247 -95339 -198886 -161161 -3179 342491 179442 -44999 167125 268913 384949
12744 384949 -100677 -55114 47320 125033 56100 133876 18914 259086 327366 -17578 -20959
12733 -20959 63203 -71581 5803 184182 -7395 171392 -50672 -306408 -370205 247555 147350
12722 147350 81092 102049 95644 135839 -165646 -90429 -63470 -3038 99516 13117 238798
12711 238798 170791 90333 59237 296857 173354 224994 155530 38973 -4081 50241 8217
12699 -56912 -39836 -61737 -32020 15703 145369 116481 119876 -101461 -29848 61644 -43585
12687 -67351 -249286 17860 -192626 41780 62275 -83480 333076 15862 473700 51028 221145
12676 221145 81334 23937 148106 -127354 -97453 -84009 33755 268954 -130840 141297
12665 -254249 246204 47405 -52721 114537 304479 2706 229139 63264 106715 474236 71482
12653 212179 39437 79822 188274 -201496 181865 -173385 145333 160090 139912 340861
12643 340861 329965 -103923 78589 -52859 -120295 261039 -162600 -110811 166910 -18610 -54965
12632 -54965 198831 189644 -224 50021 179035 118261 89570 -22561 219653 167528 157473 157256
12620 157256 -447992 109349 -161860 184155 -63262 130089 -94433 130693 -54484 -401 351637
12608 240095 -65129 128588 -237590 207916 -49302 71514 440074 -39060 22276 144021
12598 144021 446704 259877 70958 -147641 257803 153593 14397 -168684 87639 -25531
12587 95698 -300848 -281959 307979 30572 110963 -137864 16841 62101 2549 86387 172012
12576 172012 58541 49084 -125047 -132267 185376 -41825 55112 -138238 65816 125252 -114199
12564 152995 9652 111852 -171033 -49305 9743 31515 393145 -109949 17312 154984 131151
12553 131151 11050 236262 186229 18521 -137249 193480 -316916 311985 131617 -114707
12542 -280563 186428 1014 -239107 -130741 -180528 -30572 83222 22321 23983 165175 96277
12531 96277 67536 -41428 13551 -497869 -244599 -40316 -163976 -40649 126663 -223468 -121132
12520 -121132 -66886 274184 106414 -237985 24414 289546 67923 383536 -16099 163481
12509 143438 6902 153622 -1067 -236097 -169567 -193777 62459 30709 32322 -240687 12454
12497 -6833 265079 75642 -49481 169755 -123428 45281 109875 -111851 -84420 -304637 -312439
12486 -312439 108488 91220 271894 -30372 33709 -20584 -165228 -330069 211772 58837
12475 17935 52411 93343 446646 -156253 -65423 -323917 -155090 -177442 -204733 48294 -311661
12463 -82303 -29696 187829 -35548 -85207 69510 461043 242464 158929 -147847 270763 92305
12451 -80373 -20056 -206596 -312788 -196226 -5114 -294116 260566 -37451 -89016 -27887 13223
12439 -7129 -198029 -5154 -306910 261240 145622 286843 -372012 -18308 -183318 163148
12428 -100392 -242422 353490 -106327 -89731 -122232 -83225 78185 -328767 -96344 -66235 -41259
12417 -41259 -229634 182385 194752 -39702 -327275 -47008 39737 -39960 160979 -676178 -171579
12405 -2499 72841 -125735 35579 255302 153487 -177372 -102874 -219691 -265651 -234569 145355
12393 81802 233024 164924 271690 -35852 284130 80132 -31684 148554 62358 16723 178977
12382 178977 -125963 -15985 -240571 143023 181339 141656 6547 140752 468087 -244107
12371 108539 -39833 -140283 -83438 255019 -4341 -210417 -43896 473887 -307881 240778
12360 -71644 -150698 165362 193533 -334856 -18596 -252246 -8084 -123573 -81132 -168581 -97157
12349 -97157 -295739 174005 -43071 258381 85353 39529 -2884 -214833 190010 30071 -168008
12337 12185 -233911 8009 -103105 251294 41818 80304 -159936 124842 -113 50095 -105053
12325 -248869 115057 17717 -114644 -250427 276609 -25038 -341691 -50417 -304169 111438
12314 -179517 -180838 137201 -1164 24080 167192 -30678 -98755 140196 40001 -111078 119639
12302 -124973 96713 -99748 -93006 -82450 59390 71167 58326 29641 350355 -67541 -203170
12291 -203170 164021 234071 -16597 -276008 -140942 130613 47193 104708 22813 -66529 209786
12279 92122 -102031 100622 199002 45930 31854 580476 131650 164569 252166 40972 -42598
12267 179595 -177579 -97415 227238 64539 -118444 -60644 340261 213944 -40791 166305
12256 129442 185657 102219 80474 -50820 219855 49387 191407 50650 11961 50634 6967
12244 73179 78883 -41387 17496 -48280 -249225 252067 343138 -77980 -108070 272701 308042
12233 308042 149918 -59206 -8662 -146329 169778 211332 175450 65807 357392 -35398 -72612
12222 -72612 206603 468905 418206 -107263 148808 -710 229339 302806 139853 110564 138325
12211 138325 158353 -126641 173821 190546 -11686 25820 -74616 -116407 180996 160825 -136864
12199 534872 117929 96281 -24439 199432 -107079 165227 215992 162873 -104217 548476
12188 27596 268306 114608 207956 37597 -10833 7919 106064 111874 -59970 -85423 -12008 269888
12175 -77450 144036 265 -110784 279376 -22845 225181 351864 267865 170486 11297 91460
12164 91460 87977 44905 -829 34379 419970 360131 121877 142600 303723 106152 212145
12153 212145 7955 -104577 206423 257463 1743 39465 -166442 -160638 167495 -54292 491079
12141 280723 191743 22104 -146302 -51260 -473311 76791 43919 51301 53902 -15242 5891 24953
12129 24953 47728 30915 194743 4073 175577 -5007 111494 -47139 185980 172674 68352
12117 23756 -164572 -187507 187275 -46033 174493 -444903 -69779 168370 -195315 -149205
12107 -149205 -111852 28961 107193 111470 -49725 271010 -226454 23058 -96747 338129 -22163
12095 -110568 -61367 -331407 98914 99739 282553 -110659 264242 147697 48721 21630 -201392
12083 250414 174684 -49865 -238231 -22837 170478 -228474 168870 527589 1113582 1403846
12073 1403846 512001 157780 -81141 204760 62818 49068 236368 163225 197939 174246
12063 174246 -35352 190811 10708 251112 221363 54970 -91399 -28762 241252 320074 -155192
12051 -97378 -213327 207609 126938 -16976 113272 4168 -129712 -139084 192568 63256 -66864
12039 65538 111553 -66262 232234 -120927 -137365 -366282 -2889 -222799 -87823 -200442 27417
12027 -80356 -338146 -101688 -344003 286468 -134721 386558 67267 -18569 483320 -116096
12016 35386 -18196 -88020 -87208 -47432 -22389 -126677 -313027 -108666 49426 -270664 -190218
12005 -190218 -43011 -142256 -40297 -38067 131022 -202558 -174391 189408 -17441 55008 -234708
11993 -150006 87563 -88791 -565035 74920 184034 -314642 86373 -34888 41159 -102608 -354390
11982 -354390 -131985 -134193 -79076 -58790 25455 123932 -29378 120015 135150 150673 -374157
11970 147024 -69183 -120394 -256270 -80690 -37082 88753 79030 73851 -170292 301021 124222
11958 -141264 -258533 -144498 484694 -226787 255251 -117756 92156 -45591 156768 -93688
11947 185874 -150729 -1072 61451 -185196 207452 20578 -151190 -40111 191581 -29642 122863
11935 -91960 30275 -93613 -173077 -106698 -198482 52328 -270342 -29606 -143253 -188986 254850
11923 198927 -294237 44895 -164065 -58840 -102627 51215 -319385 205310 1109 -79908 -101678
11912 -101678 -327402 -46927 53603 197477 -354924 8795 -123766 260197 147894 2052 -37452
11900 -277 -234886 -154851 -21105 -29380 43451 -189371 138022 102144 168860 35479 4990 212220
11888 212220 -5838 -91616 -292661 389131 42896 264411 -327084 196761 123063 169043 -272850
11876 -51994 -53864 53358 54437 -27745 30306 -97250 -93613 50133 -41957 228801 25175 -153596
11863 -19649 196733 30395 257072 140891 104059 253162 -416182 -42009 -188659 129264
11852 13175 -285804 121866 57635 37407 -146490 -129311 -156601 -618917 -116943 -167336 -53747
11840 -74360 128895 330337 -120381 -23877 85485 -31479 -329112 28815 171985 91111 37591
11828 -191190 363619 -289131 162901 -304559 -104387 272676 -9300 -34262 99054 266440
11818 266440 9803 496140 124259 -189991 68402 -324117 -223052 -103072 -275382 202894
11807 146758 -8446 210544 -182102 -523136 -233591 279846 -45927 -211268 -142594 45362
11796 -252928 -236270 154517 -82497 -69141 138606 -26613 134894 30289 222073 261199 127417
11784 -112188 -149565 -67123 -129403 -210200 -168538 -16209 -293016 -266741 -298867 83101 154879
11773 154879 212164 -636020 136723 -94483 -264289 -117672 -233847 -139398 314213 -137859
11762 312432 -8499 343697 64094 -32911 193810 148021 -10522 79284 281736 86105 -140820
11750 -67652 -73957 188166 105968 -77207 87959 24531 35415 -7379 -23340 -116946 -44162 -218883
11738 -218883 -16775 -186329 -24562 -279104 -105444 328399 45219 130014 257199 -212947
11727 126310 -161163 47471 175470 251277 -53464 -8385 228350 -102182 1447 -104055 77896
11715 342686 -79424 264219 98367 -805 173743 8273 99574 -310448 159406 117918 -107516
11703 27505 88201 483021 107630 55382 -211856 229181 -74203 97224 106036 366901 6639
11691 -144544 227922 158944 -1779 234352 127136 -79025 103846 116912 -142832 91118 187976
11680 187976 -196163 397337 -39803 100661 118810 331120 -6633 -162502 -181757 -59453 46123
11668 194190 1820 -161229 106556 -261972 6446 -126077 -121563 140743 -164817 95674 -64136
11656 14409 -23874 -150398 -137521 29551 27648 100725 91082 -18915 -254792 68122 -127026
11644 -167239 -107334 199441 11250 92252 399323 121082 -523145 -49396 -281725 136332
11633 800 -77922 204608 -98485 180041 96995 26746 -109944 177168 965 108461 -6070 37498
11620 60868 216616 -73253 55239 316327 -57646 -143268 202311 346479 -43936 149781 -173048
11608 -263034 -77212 106623 -152646 -38311 -143192 -62564 270540 79973 111222 136585 73568
11597 73568 -127845 127722 35043 -117023 82252 74357 -245688 -245112 172750 -7714 191701
11585 287543 170549 68091 76396 234790 6451 215716 91430 110438 74228 93730 -11055
11573 -216953 -240459 112700 3678 253392 237808 -245741 -151297 288333 10783 23138 153093
11562 153093 22362 152318 100022 25964 349663 -15494 -23136 -71427 233198 7068 106150
11551 106150 143955 -17515 82326 176986 109505 -119299 161339 -284616 110800 -29787 -114421
11540 -114421 -262514 235942 98368 171906 85962 112629 447008 46455 67927 61245 -59628
11528 -157236 223356 154879 182944 114535 -11413 113161 165561 26624 -36955 -208766 -72748
11516 101520 12134 162555 97867 -32674 -148587 195408 -68891 81182 296674 -152240
11505 167662 -20567 291272 189985 -76428 -51457 -231291 -217854 413377 -65353 -34884 39025
11493 359194 214457 -98422 110066 -13350 291710 239867 68283 -14261 -36667 11569 -34389
11481 130931 76934 415618 256574 163243 290595 31383 8079 -168941 113022 248999
11471 248999 306638 174877 164550 367557 158188 -104328 100345 76094 240484 19492
11460 -95819 -5645 17239 230985 -159143 44133 343195 199926 1643 171135 -112717 222285
11448 -16604 -43744 22942 -158425 151513 -139075 114712 -104056 142275 69584 436691
11438 436691 319086 79345 -300408 -138294 295261 -107114 278085 120371 110159 190949
11428 190949 -24061 -164492 351079 -263462 87898 -153814 56536 297330 273840 -162847
11417 350986 182832 -81054 -35295 138407 287294 100431 -261956 -71249 172610 112683
11407 112683 -164283 220172 135507 75724 -13948 3665 34231 189694 -199437 69206 25849
11395 51727 -145838 -243555 -148212 144428 133683 -517315 177602 -102604 294460 21287
11384 -194012 123315 -163166 -278408 -103534 -54294 222090 -180789 -256123 74380 454376
11374 454376 211079 179274 -88578 297121 -44321 346127 -78629 -2129 -297594 30125 -462602
11362 78647 -23965 38836 105920 473049 -102207 -57901 -22256 -161835 20290 38790 -42608
11350 -87596 113607 248385 -111620 -33336 -168822 51793 -149693 -9972 247241 90714 85221
11339 85221 -72109 -181008 -255527 184604 115968 -173161 -61650 -191692 -74657 -47526 -148305
11328 -148305 -255728 267246 -27902 -144027 -11758 -184183 204205 -30788 37845 119489
11318 119489 -48641 -75748 35238 -79772 231293 -118153 -42080 -42511 -25091 -177170 198059
11306 17877 34830 -185245 -74069 48143 128343 -125735 269093 -40940 197032 29990 -4238
11294 -115091 -239409 77460 92077 142342 21548 -368484 45522 173890 113187 -93291 -82437
11283 -82437 -431559 64834 159623 -26523 -110522 -48999 -174121 7837 -68275 -155155 -25125
11271 37484 -88081 -175595 -54337 -112060 -200263 247160 -295465 -32002 159165 237325 -295824
11259 -167791 48430 3587 69514 -73006 -197145 -79125 -127685 102514 181012 -75535 -37618
11247 41115 65953 -27610 95067 -7711 -190949 117798 -129768 -201704 -385172 -19235 -83088
11236 -83088 -207297 -75493 25944 -44218 -282 -25842 -418500 15927 -52247 13080 -64425 176499
11223 1827 52938 396075 16636 21856 -154977 -72723 -117548 -21953 6283 218525 -103494
11211 -511656 134936 -407144 275737 76523 -233235 197083 -144241 -471716 118953 61941
11201 61941 5999 -157272 -321941 196025 -280039 7810 192951 -351482 -335963 -5955 -214815
11190 -214815 -147703 26336 -41321 -131276 176987 150242 -342893 20023 198466 -186933 -82573
11178 169947 -225491 -140225 81109 245943 -133823 63954 153703 -19749 -328986 -82018 312487
11166 -323223 -268320 -318908 -298646 -76456 26942 487700 34512 -265887 241795 -68169 136665
11154 67139 92953 -154750 -119158 -69162 -233711 -267062 3962 -270999 -262542 -155749 83057
11142 -323783 49226 13452 -124225 155877 -247 42775 -360716 113653 91676 165610 55552
11130 -254085 156191 59872 -59761 65394 90703 -82349 -148796 114237 -49198 31613 60740
11119 60740 324870 254218 125885 333954 111885 8038 123769 190321 102648 348450 -27608
11107 -48657 104236 -135391 315223 411524 148157 53722 3001 128173 205040 153402 149230
11096 149230 -75155 -60352 306129 190146 67960 466400 183922 235046 84948 113961 175220
11085 175220 368468 192085 213875 60887 62723 123748 281740 146911 364972 48205 363191
11074 363191 241487 272359 231743 38170 214617 364282 61525 257870 265345 142296 382294
11063 382294 440706 66218 288121 248040 557061 526325 421776 428767 561884 383675 601440
11052 601440 479095 600776 549572 661037 806754 780753 726467 739971 493371 351393
11042 351393 1111710 565034 875526 534602 528769 326431 934465 145005 536711 817910
11032 817910 780436 483173 420780 554586 359470 512649 441253 551615 530746 386612
11022 386612 528398 451725 330043 304517 507290 578378 650287 620038 549924 844869 691880
11011 691880 669348 265320 663601 750597 580824 402538 559512 320449 797460 692957
11001 692957 683535 550469 536988 689232 303079 667053 292615 835368 856367 439379
10991 439379 672754 568838 538781 1124875 656304 922204 1095512 353321 749338 1121193
10981 1121193 835065 1152488 1120844 1208043 1457062 1604792 1717801 2056147 1898165 2290068
10971 2290068 2452741 2117856 2194033 2142606 2047757 1462721 1542311 1419582 1621258 1461391
10961 1461391 1628415 1470478 1609404 1390397 1668130 2037998 1335340 1407213 932564 931913
10951 931913 677935 909147 561548 501615 389801 312200 136606 363114 187895 59247
10940 405654 103399 309474 213200 128240 73081 96560 14747 24900 459196 70713 63707
10929 63707 107426 -321872 242442 416080 113788 -91852 251833 402415 278725 -274356
10918 169418 96027 94715 34291 268294 -129770 95395 409426 413643 -21747 40174 11774
10906 -104132 -35029 -180179 68636 -20833 -206872 244088 62195 61751 217118 219544 -22755
10894 112479 -225316 -357817 -121149 -177958 -408348 -138117 -13871 -219814 -4622 -213879
10884 -213879 -86031 -262857 -10932 156707 75821 -113749 99514 198508 -162326 -38987 -47782
10873 -47782 10560 -82662 139404 -58521 161754 -378383 93527 7255 -114055 69021 -98637
10861 78958 -244758 28264 18662 89381 48781 -62088 46379 -476193 132097 148489 137757
10850 137757 -255937 15910 -358916 50957 -3446 -58615 -117908 -24601 -319251 -123118 -17190
10838 56288 13011 -179302 -83251 186603 78363 -113613 -97913 -226261 193615 -33279 -213547
10827 -213547 147357 -144091 -21424 -294918 89793 111941 63261 -14833 339576 -89221 -105029
10816 -105029 -36007 -217384 -427931 -84569 -104822 -19446 91121 -11783 12968 90486 -86039
10804 -454125 -134589 215855 9346 -90341 85141 132527 -101357 -138873 133267 -290920 231985
10792 -259627 316896 -173108 -133669 140741 87996 120346 1613 -130560 -111960 160120 -149723
10780 -33071 -303613 -208216 -16428 -40307 261998 -145156 52919 14409 -231552 150767 -3569
10768 275389 -256679 -25653 80619 -27944 59629 118516 -103285 317829 -98622 -22977 -87911
10757 -87911 179776 217459 -9686 -192901 -6511 -142820 -4453 -213411 110525 -112815 -256689
10746 -256689 -58380 -45712 109931 62929 -237635 243076 -233289 300811 -67150 -60402 553
10734 116717 -410634 -209432 -150973 -331655 -130179 149946 235259 -73722 -60565 -45534
10724 -45534 200760 48582 -22270 248039 78469 89006 -372377 -43030 210909 -32688 187205
10712 -175769 -79075 47174 -35679 -92512 27073 -221496 241901 -34411 -229663 -21846 366104
10700 -247200 34073 -100721 120848 -130832 -172638 -261940 19018 -208915 -194977 -28211 -313056
10689 -313056 222111 -154810 121311 314839 -62397 100524 -228189 92395 -107445 -207684
10679 -207684 38577 -320720 111728 29697 157366 437853 17062 79496 -244353 227118
10668 -334127 -53684 -238859 79608 255126 168282 -275011 43177 -12340 -276327 -266948 177195
10656 -325172 54353 50642 -213352 -137899 -8771 166396 -202602 -118275 -265275 -8229 228239
10644 229423 -116092 -67463 148940 152280 -150892 399632 119542 128006 19618 -424382 26659
10632 -97942 157057 -44679 -111832 -116386 112655 71007 69339 -147655 -340 26039 -6683 229391
10619 230260 1642 -48907 -359736 -457636 25150 53828 -14489 156295 -207298 66295 -230023
10607 -341238 -82865 -265354 73230 2499 2627 -245585 -135861 -60081 -346503 4362 -568948
10595 -407162 -171152 23898 -75259 35766 121924 38827 -144104 -130202 13995 -133969 152825
10583 76 -232 227553 -36036 21672 -182875 -48540 -178378 -43450 -151358 141162 -145930
10571 -143905 -247752 -262081 -135108 -95765 52636 -39688 136729 293949 -64481 -208047
10561 -208047 204181 -260427 -68727 -130075 -188767 73553 -122907 -94488 79649 -343148 327610
10549 -78595 -128300 -79333 -41232 -25490 -75403 47277 -152093 146010 138507 207707 82076
10537 -228426 82114 47353 -287971 28515 -4869 124630 116757 -195462 -97086 94550 -197045
10525 -316526 -395651 125594 -9937 -85421 -125868 -68248 101355 69572 -204517 -234205 -337217
10514 -337217 438120 -41591 -59940 -349685 158042 -87300 42622 21540 -197230 219817
10503 325240 -73025 144829 206225 -36999 -235860 50764 95532 -163932 -524649 -31515 237876
10491 42090 -246703 54786 11636 -286984 127085 6411 -196423 385329 447482 -105692 318382
10479 265007 329805 378666 438041 -301142 76171 -75956 -97893 114220 235357 114271 72823
10468 72823 -96188 261618 105286 193210 98175 180940 73851 -21343 -36258 -176900 -163969
10457 -163969 -228551 516575 5436 -95259 232720 136338 -219273 99035 198711 -376070 207695
10445 32719 -280829 140969 27463 -157285 -192205 -95472 -164206 -17036 299008 -92034 229161
10433 -46206 -382410 170408 -100226 -20944 141293 -184488 -2772 -265993 65655 -3000 368
10421 -60402 -194896 -114552 174571 194443 172130 -89566 -534442 -100559 36941 -17104 -182899
10410 -182899 236899 57837 -45213 102160 256204 137373 -16866 20636 -179944 37497
10399 -318202 -66269 -271002 -163782 129563 -247534 218638 -65674 45143 252892 206255
10389 206255 -149784 26458 33865 129160 -193986 124652 164655 -170184 68027 -17311 330883
10377 215445 302258 109041 454976 170392 262247 330451 310781 336860 12605 334203 180241
10366 180241 364433 317891 266040 67838 318229 -123352 476552 262229 262878 343335 145762
10354 431564 243533 301279 442818 304678 577994 703982 220646 243449 161892 526106
10344 526106 605197 -20434 180079 -128976 302029 265036 518162 -156719 244138 206918
10334 206918 211780 109839 229187 38535 -195984 -86072 213952 87719 282757 130630
10323 136640 -93653 -15057 211062 162373 -116957 -203065 176300 -196758 36527 -40400 230914
10311 381537 82512 186861 -31138 353910 -92396 109385 152094 143872 -442612 36859 -105776
10299 -193945 -216763 -177442 -181334 -215416 -52927 -350255 117390 52518 107702 -83141 142229
10287 117044 148430 3823 -125193 -7222 160125 -144763 110126 59267 144590 -35956 -238043
10276 -238043 92974 -127505 -59174 -28632 -367744 -381590 125644 -75629 12491 117008 -185783
10264 -334408 87131 30094 -16196 140961 -95957 -140997 -131034 2567 344017 84093 -101798
10252 35761 237982 -48217 56336 -193985 -87500 -203135 195669 -378545 -137391 -15141
10241 234901 -49751 -119487 74767 194 -363399 -27670 -91730 -425459 203145 -123628 -11022
10229 -60367 213671 69941 -19476 -67268 89034 -10394 108809 -301976 -248490 16329 372054
10218 372054 26366 -183145 -239055 74960 71204 -120501 -165226 -313873 -432305 274509 40697
10206 52011 52156 -83044 218750 -353160 2992 -299340 -43101 -79236 248341 -27297 87138
10194 245482 39976 -464819 -124291 -524213 -144391 132463 -38515 146852 -117002 -133164
10184 -133164 48954 -65243 -147978 37872 -221523 -63365 -98839 -29912 -282039 185766 -343203
10172 -131262 -239293 9533 -191136 396470 -216547 -384712 427569 291440 -37021 29585
10161 83988 302370 -173296 -298353 79344 181819 -245557 153948 -204196 79736 76084
10151 76084 81046 23971 -102200 364540 -82953 6028 -126319 -175228 65929 197540 106018
10140 106018 178775 196159 -146477 101370 -230025 -57992 -311145 18137 -118194 117609
10129 -130797 95278 -222875 40494 134067 -112139 -76523 20971 115501 -20103 -193995 -166193
10118 -166193 -247017 -369239 -144855 -258345 -247660 -186083 -154742 108789 -336844 -176040
10108 -176040 -37876 -52661 -113375 -212876 -204616 -304949 -413857 -100507 -121137 -272734 -123711
10096 -548669 -114269 -59679 71625 -64883 -114713 -174536 158936 75805 23683 -99805 -166249
10085 -166249 -24304 -39017 -148573 341738 209519 328853 -107406 433833 -166067 20536
10074 -340459 -112028 62579 -263058 54358 -239005 -314155 -426465 154891 -97786 -383054
10064 -383054 -132825 -97819 -35265 87265 378391 9430 110221 -188432 -44895 51731 161817
10053 161817 -148594 -163281 -11157 -39896 -110634 -60077 -23077 204672 101943 44406 -9125
10041 -55599 -232281 168183 -42463 -68688 -30617 88069 -255591 -100105 90695 -369609 -205271
10030 -205271 -252483 -13975 -318553 -113795 -40077 -321058 -150171 156488 193618 -31020
10019 79075 185856 148874 -143323 23443 -28870 -216628 -28833 -244665 431093 -275803
10008 -80260 -202011 -224104 -374378 157780 110229 63098 -169348 -134881 -664195 -360525
9998 -360525 -211863 -295340 -182416 -61740 301980 -361705 -198598 -101999 -91110 222960
9987 165953 -110499 210718 149199 17580 -37045 -314257 -420796 -290328 91240 -93447 238965
9975 -105510 -355757 71739 30018 -372238 -310337 141358 -348990 170898 35449 -49686 -228269
9964 -228269 31400 62594 -297123 71407 650 -177560 -116791 -163995 113708 210421 -248706
9952 -224183 -18119 -76602 -118278 -317398 -80841 -246423 -98549 174475 12989 126625 -116804
9940 -220073 -28927 -109396 -176108 120359 -137657 -49908 -339074 107778 -103669 -225148
9930 -225148 23699 -71423 -36529 -219024 89413 149934 -336770 142507 170022 -133558 -140915
9919 -140915 -356517 -210881 -124735 -233394 388092 -93216 -329091 78429 -252179 -6166 154487
9907 -28250 82086 106642 -228721 326780 -8494 68141 -366582 37299 150219 40510 60540
9896 60540 43527 -12153 -29120 7831 31087 8702 -52671 -132797 -238039 -25130 -371934 -2054
9883 142139 94695 -6506 -128276 -851 99467 -189973 -158043 -188251 158466 12748 83515 -311433
9870 -3864 -116148 -102785 121179 -168791 -118468 -6062 -150132 192042 -135226 125535 239554
9859 239554 58552 -149258 -49140 -209256 -346898 134088 52276 99166 -47336 -208855 59318
9847 -97998 -192558 -321135 -276264 13091 -67533 4393 -293871 183457 -151486 -131437 241941
9835 -206013 -85040 -13333 -414485 -386862 33384 154438 31095 -248332 120735 -22463 -208299
9824 -208299 -119718 -49394 97837 275082 -51358 132625 -48765 -159741 -322763 80373 -154265
9812 -170442 -169656 295079 11916 58822 -80441 55903 24306 210793 -24989 139232 353967
9801 353967 -51085 -6410 128604 141900 -50347 36668 -46216 86590 80878 155663 61520 -79261
9788 18085 87810 155857 -30097 -33947 311064 -220527 -138283 308212 170187 81600 -42226
9776 161854 57075 -362447 82009 -172138 71529 -179300 -113816 -44461 -50378 -99368 -86448
9765 -86448 -52528 -295403 -197847 -37389 281999 -36147 -224902 -175444 108490 62072 215058
9754 215058 -85571 -139094 192696 -220238 -204445 -276178 -216127 -298597 197658 -310822 -151769
9742 -250764 -118465 114401 -165488 -269172 294457 314198 -95406 -298749 186120 127268
9732 127268 -50311 -49681 80315 -236322 7130 -9811 -184776 -159195 41241 104371 -252607 -23748
9719 58088 -11662 -419810 -150451 -281382 -36262 -197293 -86549 221104 -200796 -350652
9709 -350652 109692 39654 -275407 -41692 -238191 76545 -33651 -63826 480969 149513 172178
9698 172178 -71682 -182705 5541 -115175 111250 -176024 -285189 13011 43606 -469485 10471
9686 41838 -526241 -289853 11610 263399 70879 73313 -240236 174219 -364737 -77139 294012
9674 -2680 21213 -27592 173413 291718 63086 -247217 156236 184930 -9500 68901 -151232
9662 -31872 -58629 95250 -522989 -93279 133377 206953 46328 -111422 52533 161048 280865
9651 280865 -400155 -259882 -25094 -131046 -212602 -3499 46105 -225042 128884 -181478 -13910
9639 -279897 -102932 15857 -178020 413710 121051 400295 -63446 158674 -185664 94337
9628 -222721 -120128 193940 -167344 56338 -235535 395545 -245695 28179 -432910 -110106
9617 18200 -91886 87995 -322399 -18762 -38313 -134978 -142203 27042 -144611 -372751 -270192
9606 -270192 -259913 90606 -26904 -70099 -305889 -69231 13060 251212 -163291 13402 10572
9595 10572 -102525 -228360 -70149 -319998 101919 95331 102131 -369193 -121576 -209507 -157114
9584 -157114 41532 -235426 -152321 5019 95514 -211154 13434 -143439 4095 -187236 -133896
9573 -133896 56890 -354102 -182072 41428 -303502 16684 -74137 -146546 -304565 -131400 160145
9561 -474043 188150 -67613 56975 132533 -338562 -123320 -184659 -207575 71090 -489898 -166102
9549 -51618 -160636 9899 -34429 -14503 -168856 -43687 -161202 -71654 -162973 -225354 -3699 -385016
9537 -385016 -207111 46336 -374655 71606 83439 194075 303450 -245738 177390 -74730
9526 -69703 -39797 -9062 -109203 -150732 -58241 -131412 -166420 100066 24694 36209 113841 -254481
9513 94205 -396155 -105129 16417 -218769 59118 4851 7352 106910 164233 -168596 100755
9501 -236070 -582224 123988 46711 -149481 -53405 131026 214767 -53861 -137917 -72946 -95429
9490 -95429 94641 -137374 -107156 323548 -135570 -185559 -293884 -268721 -14991 -22389 18392
9478 252473 -153675 116525 -65203 -112428 -211183 161529 -88459 -142039 80141 275464 94527
9466 -28848 176777 71342 533942 -246750 -296091 -134202 117329 -186015 157424 66676
9455 -38481 141031 46533 13403 -71585 -47213 55780 74723 141473 -320073 -157411 13683
9443 -146199 -116836 -22440 -13900 -76195 49290 -22353 31687 -60005 18860 -119476 200243
9431 -50061 -190902 271983 -159041 -37247 -33957 -43686 -48320 -52379 278158 241076 -80800 -120195
9419 -120195 7617 -223223 -118376 63751 49544 339709 163718 -223711 483824 -109272
9408 37420 80116 -216630 -96164 38579 3373 113016 -11417 102395 -53056 180998 -239964
9396 -328557 137315 -71120 200797 -394261 -249772 -2111 101509 -39502 64603 103940 -95069
9384 -246877 -190146 -165221 -64996 -163288 -296350 7942 -330937 -10560 262830 -3569 -331301
9373 -331301 -232047 -211642 -191865 -163810 -422442 -7062 7005 -87798 -438481 84856 -46343 175103
9360 71375 -203621 152534 -432332 -208957 -294511 13299 -153464 67100 -235533 -194490 -81768
9348 -120317 8092 -23478 35053 120840 -148352 158137 -16557 -463538 -133975 -275041 -312506
9337 -312506 129412 -168237 -167551 -57127 85371 -280933 138590 -197316 -31961 -240189 4646
9325 -131304 -109792 -17726 -88131 -116508 327637 60088 58705 257342 -307787 -268803 -96013
9313 108512 127689 100295 31794 74150 -186629 -164135 13341 -105224 162921 -285218 -286015
9302 -286015 164449 -246059 -254230 72919 190566 176985 -277567 219828 57246 -283176 -192578
9291 -192578 -61577 -108556 -64520 -195064 -143577 -25609 -58919 14670 -76295 308446 -68537
9279 108123 -143323 -204810 -211705 -1631 -242575 -430065 -291318 34635 36451 -59967 -161775
9268 -161775 65851 35369 58871 17694 57432 196592 -209629 227874 -338828 -102861 137599
9256 -47744 -338267 -177824 -6509 137058 140262 -184151 -303777 -164583 181774 73524 143504
9245 143504 -196537 20297 -112330 -187110 -102693 -197901 -403001 11253 163957 125396 -277162
9233 -5638 -324078 -242105 -237430 -163234 -413237 -285570 -49993 -212533 313687 -217646 -72846
9221 -453916 -87328 90796 -291187 -64395 -257797 -86583 -117216 -59192 -174126 -119624 -42015
9209 27573 -96155 52131 66410 131797 80194 177141 -27227 -236911 -197071 -45682 153395
9197 93561 92454 -172891 31807 136156 -2992 -32468 -156965 302046 -39337 -52942 59259
9185 175379 -15193 -10031 -243835 24535 102637 49970 80218 -32040 -225365 -133857 -136350 250087
9172 -252123 51925 -7054 -430305 -14822 13219 -57255 -292104 -383233 99303 211631 -71581
9160 -108184 -388588 -140483 -140246 -286733 214903 83046 250543 -60201 -95115 -3902 6262
9148 130295 -600078 193808 -198718 36276 -349499 -84450 -27281 208572 -41827 101208
9137 108446 -43458 -235053 -341989 79527 325705 -47258 58358 -232426 -92825 -75873 49346
9125 -118516 286980 161646 -398793 -191986 -283442 -51435 42359 -183881 26475 17494 -38259
9113 -234218 -145891 -195760 -160558 -310835 -843 -126501 106476 182348 -148554 -90597 -342413
9102 -342413 -67205 121996 -220828 -134092 -85028 109988 -151317 62594 -60700 -264007 5556
9090 -131569 -52632 -17728 -404332 -65118 -150866 -256240 -161374 -307437 -274622 248607 -111469
9078 -131241 -70083 -54406 108562 177727 -139469 -339082 -221399 20261 240288 -40943 -75748
9067 -75748 289844 -175916 -176714 35330 -104816 -210007 269384 -320383 -71806 -1071 -158215
9056 -158215 47749 29767 -76307 198650 28778 -119041 -36524 -51933 -191137 -293478 174947
9044 74693 -32879 353870 141429 57441 -95132 -63254 3034 94161 101280 145089 -232697 12263
9031 -116822 351165 -99612 -60511 30944 43964 -68403 273449 -25423 -110458 73050 -109050
9019 -16157 -224461 -54707 -42977 21971 -279812 92825 141798 161203 36694 -188281 -220645
9008 -220645 -35225 99916 232822 -141701 203957 76335 80179 -358564 -159302 87762 -316771
8996 229494 -254980 198572 54052 65961 -135982 -39977 -161009 -121098 -318825 221442
8985 -307488 144455 26829 38161 135424 -170323 128512 -154041 -56518 -71148 41318 -79207
8973 -222039 -403182 -119291 -282948 33977 114448 -228859 -252913 -32119 -3192 29010 -122575
8961 -18792 204323 66005 102412 -189242 -22497 -19740 135049 -307134 3906 -293978 9483
8949 -231715 25846 4121 -356473 84618 -277457 -44110 -44555 79665 -264119 -92307 230650
8937 -445095 304671 -82528 460547 250008 113208 -35892 -266862 285164 13279 -131050
8926 605201 426863 795316 2086593 5361851 14991063 10765543 3619756 822847 694700
8917 694700 526231 436686 -13448 80793 -127523 92509 24183 275494 -27938 299073 112443
8905 -109320 29805 55617 -11238 -25932 58047 -229818 -16656 128461 127166 180658 80208
8893 -174302 -82426 173918 80767 -364866 -138749 139613 -47293 -93675 79658 -64791 82957
8881 101506 -355002 -291742 80102 -75414 20867 -32119 -197542 -101552 -33163 -7294 149230
8869 46290 -23468 -272606 192511 -283186 72666 40247 -145028 -241503 -357472 85653 -58543
8857 80965 110111 -138399 -13450 -230821 -247976 28323 -136768 124607 212797 128213 -316301
8845 141941 -134362 -134974 117412 -114823 65789 -169636 -379396 -217227 -349796 -173238
8834 -91267 -216630 -205416 105405 -113417 41262 -11799 40402 -257992 -178887 -256073 -106550
8822 90894 48417 -176290 -42121 64775 265447 -191263 -50761 -55536 -2525 104959 162713
8811 162713 -191706 -38392 -57547 -162248 -155948 8149 -137320 411887 -176850 -168250 135625
8799 -142887 1823 47186 82971 209803 211417 -27757 120325 -250087 36505 -172998 -35754
8787 -124433 143306 10569 214672 281861 -135261 43386 32830 -29384 112573 -61588 36648
8775 94786 -57619 62930 -172126 101606 -163872 -46232 -188139 307012 120524 -112581
8764 -134613 -263782 -58698 -209249 -328182 -198601 -132633 -106756 -88682 224935 22546 -375609
8752 64768 230859 35569 182542 -210323 321691 156166 -144593 -2960 -102040 -111115 -38547
8740 -78804 -214915 63440 -243581 -131489 228544 -200456 87929 63085 202442 -51081 -232055
8729 -232055 -318948 10663 -338080 70037 45832 63245 8184 -132090 -105016 223265 -168926
8717 24432 -322563 80981 -350469 -222623 -35004 -26489 -53148 49817 -131254 -99895 -56015
8706 -56015 -133480 -248818 -132553 -311569 -142600 368344 -150320 72208 -14714 344123
8695 -68318 -167768 -55940 -52239 -17504 107158 -73963 32014 -55207 -223564 137795 47173
8683 189273 -80210 203129 -43165 -53038 -225380 41429 3601 -135907 26647 -447834 85812
8671 56371 80751 -247526 318215 -43083 131289 87049 144858 -113985 -101411 -13264 -134633
8660 -134633 57995 38073 -222484 153441 -348791 -307708 35084 -228524 84226 -417389 -117453
8648 -181095 -512255 -99487 -68779 168506 138383 134592 106467 -126932 -216907 46091 -389934
8636 144529 -497301 154522 214162 104860 -174036 -43841 207731 311280 -30380 12663
8625 -28026 -292457 194665 -161639 -104746 13644 143097 140091 237433 3337 60021 -72703
8613 -43731 -95345 76978 -172338 9633 -74822 -69973 204535 -134978 -133669 38546 -133817 -86805
8601 -86805 -129323 -422948 -264689 54313 275644 131071 -140308 -220775 -127160 262730 -131042
8589 108056 204595 -73227 -116835 -93063 -12686 41907 -24264 357843 -173601 -242722 20419
8577 95927 189620 -47099 -93821 -332018 -214913 387532 59911 -264075 -263041 -329533 194344
8565 17935 -233799 -7633 -192981 -88663 53880 212705 69523 186422 -78074 51362 193215
8554 193215 -379168 215345 -407476 -94331 109557 -171902 -249630 47222 -416423 -20768
8543 154264 80258 69662 -161489 236453 -62587 -216490 -235849 -201911 -110730 36014 150247
8532 150247 -8028 -179945 -87064 -369904 -75767 91585 76996 -114271 -442440 60499 -46756
8520 -27902 -43802 35960 -894 89194 -88520 -299322 87763 44733 -73513 7376 -54336 20641
8507 -42035 -218653 -56322 -85084 -24102 109193 142027 100572 -289487 91423 50695 175480
8496 175480 127011 25106 -181472 -229241 -55407 -103352 87469 -223645 -464594 -98593 -208482
8485 -208482 151750 10050 -168892 -212742 -5782 98083 -125338 -312993 -110606 -411382 -298105
8474 -298105 228281 156574 17669 -285947 74950 -104863 -90533 64617 -221437 39324 -41024
8462 -37162 -69066 59111 27044 -123196 -275207 -235727 -149514 102293 -50574 -181686 166408
8450 -194368 64402 -100525 -332746 159 165294 223635 -152359 -339226 -112159 -249699 -84695
8438 -336976 15078 -311800 99420 -226852 -419524 30159 38322 40175 178919 -441939 6129
8426 153141 -36613 -389493 27001 116344 -339205 -232146 40092 -332864 -34425 -43241 -25965
8415 -25965 -193795 -181388 128407 2262 95194 9944 29656 -180377 -134532 92189 159348 -61981
8402 -83652 57942 45629 -41486 218248 45781 138135 -113214 -281333 -48373 -163807 149202
8390 -336605 -102875 127573 -175491 145999 175299 -348578 -310853 2541 25995 56286 -182329
8378 -86908 -317195 -143129 303991 -71463 292962 -117708 -17667 -73177 -321222 -244929 -118122
8366 65888 -58887 -329897 54465 -174315 194608 -136004 -80950 45717 220368 -44606 -176712
8355 -176712 -58323 -116796 -79863 -149075 -96011 -113206 178376 -214869 251445 251937 105356
8343 -86847 -59803 199694 162029 -94691 85269 -210482 -186911 330242 221936 -37228 -8322
8331 228047 253915 -67484 7591 -61840 465960 -224454 60056 78021 -101704 -36848 -155187
8320 -155187 320215 275591 165809 -206681 151400 179240 -99544 377193 -143361 -344257
8310 -344257 -151351 -124309 -132360 -170649 -223417 -65223 -33145 -296191 139198 37168 224191
8299 224191 54013 -154528 -84032 -333022 217537 -9374 -194702 439 -130007 -137188 193654
8287 161891 -249661 116866 186569 87824 87443 107924 -153161 91159 -133743 -75135 38215
8275 -106978 59849 -78232 -205568 6065 -55995 -82685 -215462 -157865 242317 -235318 293052
8263 -27654 -123932 11923 -60778 95565 -463410 104686 -223129 17775 272811 54032 -273639
8251 -161377 9629 214346 12437 -82074 22152 380380 237054 -313304 -106722 -173338 137964
8239 -95341 83304 37241 46714 -327023 -20231 165592 -420635 37334 -51765 -437976 -132620
8227 -168462 34945 -62869 40860 126003 -259381 180994 -84426 59648 44203 75296 -180159
8215 82690 59678 -178326 -141735 -103357 -248843 37929 -256711 -243751 82083 27355 -3817
8203 -385020 -648389 -36133 -282250 -160095 -38894 -152791 -74183 -232087 -127120 -167922
8193 -167922 -193408 107086 -444397 2854 64525 -328524 232370 368681 -211569 87002 -153499
8181 33896 -138133 156524 -180791 -114598 124027 -10273 -73523 -162674 -280882 -152442 -389150
8170 -389150 -249165 69953 -116369 -152813 -67887 -198791 172648 135356 -102690 151824
8159 45548 -411631 -28206 141471 -88718 -108529 -201881 -152057 205448 -168046 -176953 119550
8147 296825 -167671 -323606 -42560 3070 -169205 -109504 -149186 -261430 -219235 -26978 11086
8135 -143347 217246 -84595 -103299 -95451 24541 -286705 115620 -101557 -199813 -98011 -197952
8124 -197952 -218222 -13271 -22766 -230462 -270847 -239905 -124038 110556 -112594 -16195 -26728
8113 -26728 61156 -77118 -59653 132696 -148431 88484 76018 -259784 -81441 36486 -161501
8101 84287 73626 -419716 -173824 -158510 -102777 218415 -26244 1490 -173928 249468 -324210
8089 -215165 -126883 -136480 -19506 -38560 -64790 61598 5255 -289378 -61625 164148 -197019
8077 -175582 -104931 238953 179679 152957 186243 174060 179327 12688 130223 -146469 -143457
8066 -143457 -84225 86243 214624 -43151 -243788 -123885 -201396 -38056 -483983 -135713 -261409
8055 -261409 -156014 71967 -81580 -154186 108321 -18422 83978 -119881 -85423 -30670 -95427
8044 -95427 -238336 -261937 6836 -167216 -131033 183940 220853 -132027 -248373 85212 11405
8032 206297 -111758 24596 -133407 -78627 -14144 138843 -11558 -48384 -131911 -151924 -68413
8020 137868 -109570 -255364 -107835 -86300 151674 270042 96344 -34118 149044 -123088
8009 104033 370324 -180934 23633 -74044 44273 -219173 151950 120107 -95194 227961 -419411
7997 -276680 -52522 -45524 409834 -169800 66540 -229916 213451 -86821 85568 -239235 6884
7985 -180656 27843 -223126 -135798 337317 -90860 78407 -271722 171741 116262 -40833 -18367
7973 -115948 192701 -45166 -6659 40250 -35749 188798 -244716 -5774 -489042 -235590 -306558
7962 -306558 387031 -358580 -49307 112110 -323728 -46519 84786 61707 -575139 -358080
7952 -358080 -109219 -105487 291349 18547 -186948 -113162 256461 71862 -336900 12383 -181298
7940 193487 -104407 -111932 -159218 11507 29194 6197 -157522 -110072 -33521 -2427 -43831 -178647
7928 -178647 -145611 352270 170214 -156166 -21431 -263164 -3092 -56479 55874 -280644 282191
7916 111665 190969 -168283 218857 40589 -5873 414419 91489 -118059 -329557 -194595 -126462
7905 -126462 -120803 25402 -27530 50912 50887 115068 -145970 -163250 250220 -69124 -127854 -6648
7892 -236795 59278 -344469 -25234 250362 30503 80916 -74081 -94296 -64121 -183523 -254412
7881 -254412 108174 106937 170449 46404 -329808 -240857 353053 -70804 53224 22694 -242702
7869 57381 -38597 -150258 -30774 219883 -14435 -321161 61510 -58428 32886 -55291 -137882
7858 -137882 -8072 -430052 221664 58027 -60230 -120774 11675 245018 182250 -97781 43248
7846 -39057 -42991 -19873 -137831 -348164 -45112 -21585 -182288 -125495 -85293 -17125 4068 59743
7834 59743 -178229 -257402 -66912 119554 -141626 64653 -146583 -295584 -175692 -102351 -204119
7823 -204119 -161623 -183014 96418 83302 51723 140325 254230 234876 -35085 244909 -171071
7811 -221142 -8618 3143 234619 290265 116235 -33114 -143798 158789 1862 -279159 -63108
7799 -263567 -241609 -7346 46607 37357 176443 54813 97904 -86753 -100042 -151432 -201794 133797
7786 273590 150144 73579 37360 -366072 -183341 38739 6686 14812 -153607 61426 21459
7774 -121170 279072 299581 -437178 113581 -212509 156084 -39874 111560 -5555 80518 104282
7763 104282 -299678 102395 176818 326164 -140690 -117551 -15140 -13718 47394 214011 -101874
7751 -5029 -140410 -45520 -309354 166561 -151364 -92315 -335478 -263694 -208823 -16677 -15603
7740 -15603 -2344 -169933 36438 -178290 146425 -112720 110690 157096 -29546 -105552 -11919
7728 -62807 -90644 -256113 -14542 -138766 3466 33934 -199578 -69435 334284 -3415 -164368
7717 -164368 101045 -307961 -59683 -156738 -204166 82446 -131603 -26570 -83336 233351 -157572
7705 -46177 295486 -292839 166358 32539 97778 66194 159417 -141698 -60987 -314655 85261
7693 -235386 -262565 106317 -81449 -252919 -213799 -186434 -224303 -3448 -337206 -44752 34014
7681 -35857 2835 -115079 79788 -200271 -169207 -217260 56593 14691 -294181 -85437 -395718
7670 -395718 158333 335987 125527 119895 28610 -57883 4123 -97001 270072 -120204 -88615
7659 -88615 121567 -26501 -195583 201810 -176521 -193171 342259 -93994 100674 196949 -165043
7647 129504 -178835 -348878 -384704 264922 -196455 206816 149340 356426 -25298 -117440
7637 -117440 -186432 -139881 -193571 -332265 54953 -36213 -356190 -263120 99743 -88975 -285069
7626 -285069 363160 -224270 -216685 256185 -192842 13593 205075 78141 171771 -114826 269054
7614 36118 39873 48428 -159152 -260257 77904 -176618 42084 -108743 -243579 -113868 188742
7602 197561 -80336 236288 181203 220498 51194 -12669 -158172 14909 8244 -197715 -106407
7591 -106407 -320000 10632 -104610 -71816 -150055 340666 -325481 -159466 -156212 205340 -121595
7579 -189580 51146 -57223 13374 -79341 158668 -265278 76394 -258362 -115016 -32194 226395
7567 280818 264569 102361 -589 25969 -94508 171971 11683 -161365 -67465 -17522 90194
7555 246819 127715 54776 180381 91405 160056 -38333 -66026 53600 -23657 15144 142087
7544 142087 -25248 -193118 395711 -495231 123175 -214925 -157829 -101850 -261747 -29926
7533 -67982 -180271 62571 -323624 -3182 91931 176354 -302632 7165 179698 -184831 -61223
7521 -120521 -50386 110953 -28545 269824 -43732 -368913 108269 -159597 -172990 -233554 22784
7509 105141 8153 52591 -151713 -210726 84439 128902 97396 -11002 -94373 -4442 -47845 -332771
7497 -332771 14258 -208194 -161106 205943 45028 173259 270609 -338190 -109669 70153 176712
7486 176712 131110 214519 -142532 -24174 39258 -54336 -160804 -103402 294305 91443 -91265
7474 -135945 -119439 -38072 -357823 100555 -127096 308309 -30830 -122667 13262 -11664 -136757
7463 -136757 -333645 84732 -216602 -122681 -32246 50474 -134705 -259610 108047 71644 74416
7452 74416 101539 384286 -452683 -221333 -181807 81614 -31955 -78847 38491 -365712 151692
7440 16253 70369 -207506 80907 127264 -55207 -212528 -135606 -102419 39942 -276187 -188340
7429 -188340 -399466 -152882 418946 54020 -130052 -21044 7806 -35798 -23456 167016 -91319
7417 -43686 -184368 -80360 20545 -42610 -252417 254277 193073 41303 91981 -66288 162930
7405 -80192 -102830 96627 64099 4736 173874 -138544 -13291 116405 -99315 203378 -29040
7393 29841 -271883 76081 106359 -337161 76142 141696 107569 494255 -37024 124881 306996
7382 306996 218957 -44985 114738 200459 -323692 20560 -301869 -50580 65215 -188835 218324
7370 148783 -9687 -263336 -237358 -62907 -389332 90803 43603 24913 -94236 -365899 249996
7358 188403 -179512 67369 129608 -82196 -247488 147586 -64222 120872 201605 -320724 -206320
7347 -206320 -260903 100494 198447 17861 79371 -119439 -81839 116274 9590 -383156 -302785
7336 -302785 -308321 34769 -88189 -132768 -151718 312623 17476 127372 398351 202445 -61407
7324 -68520 -62849 -924 -145089 -246065 -218129 -255714 129680 185126 -164882 -110903 -89057 200556
7311 -108119 -122956 -10884 -230459 10964 88541 -134042 262155 15567 179405 -49352 -77516
7300 -77516 -153554 -226129 -105717 -158926 150975 130190 -58072 121898 -209859 -67488 -155309
7289 -155309 -68143 -54659 -153305 -294730 -64696 -137505 75379 -10917 138062 208789 -250267
7277 79667 -145237 31185 -225361 17990 -43439 240296 109548 107088 173300 -291086 -197873
7266 -197873 67544 208802 135873 122374 7167 -277938 59143 -11983 -112625 -177890 66262
7254 -221311 -17100 -359905 -42932 -308810 -285870 -183947 -393185 -36852 133521 -100258
7243 -123119 -53670 -123938 -151547 24503 132001 -45422 85400 -19584 -46121 -38305 297440
7231 197022 561 40282 -274640 -65097 -52459 91933 211429 -34983 161788 -32347 32184
7219 315782 -101138 -68296 129202 142283 -36021 -132989 4616 -22209 111116 130002 -222093
7207 59486 143929 -257431 -271002 -34954 84596 52544 172979 313048 130042 418408 24511
7195 -69939 130013 3251 -111635 307745 34643 67325 -117878 -220250 -251172 70975 142425
7184 142425 -605117 104703 304216 124694 13603 109825 -341609 -49954 206973 -192571
7173 108066 69048 -56853 -228541 -67352 279673 69404 -180203 -58573 280635 18009 -479941
7161 213173 -401272 -73472 -23530 136576 220241 -260820 -108449 288047 17693 -181098
7150 243191 355866 -139267 61525 42590 52445 19111 218811 -275830 -165124 167029 418
7138 39780 145417 17602 233231 -76681 269443 -104166 -71762 78180 261252 57549 108465
7127 108465 400449 104984 -162274 -125566 -57332 82058 22714 -103062 101773 -54784 -116743
7116 -116743 93812 65582 -262142 -22758 290922 12872 -191664 -39809 448838 77299 -218953
7104 -37610 29741 134901 -160156 -164186 -369856 86477 -12661 10439 76549 -129464 6765
7092 -136936 -16426 -139479 -278271 234955 75021 166961 -193808 -222053 257267 -171785
7081 109777 -100677 112120 23569 -41812 -23738 -71321 79723 -114374 45921 -88488 -130604
7070 -130604 -233237 88326 -16045 60685 31544 -194620 -91609 -169524 92935 -316887 -61867
7058 -201 -299381 -253274 -232997 -1452 -246113 97639 262821 -66506 -103673 -9332 -62308 96458
7045 -5350 -130678 207372 -253271 -33142 -42186 -36527 -6651 -54708 -222937 -17371 -111772 -152525
7033 -152525 -182646 -255083 121824 -15160 -252328 276261 -94343 -29846 266771 91030 222752
7022 222752 -441535 -103119 -319744 218260 -19738 -58214 -239406 158687 -214129 44469
7011 -267316 -31476 -85332 -296523 260821 103608 99883 3753 262766 -208821 -102505 52064
6999 -187639 48396 184773 146638 325854 -80605 -19139 -158993 -56924 241304 -84713 -100192
6988 -100192 -44534 -65062 -24857 128083 -274888 -40084 -37874 -109473 -80825 209242 -298266
6976 142309 -277881 -39645 -153489 19747 29988 -308888 131166 -74382 58833 -430418 -369673
6965 -369673 -173519 69085 -57902 415601 -23554 -58498 -202430 -81866 -56034 20853 -94834
6953 122593 -353086 -75585 -101380 131669 -70388 73760 240610 156617 188668 -39479 -313044
6942 -313044 -176297 209932 -125625 277449 -306028 -1703 279690 -2836 3125 -122489 38268
6930 -162434 -521594 59599 55738 333199 75110 -149155 381320 -3899 -19790 -183966 21535
6918 -122675 232108 -153716 89695 47171 -101945 39001 342423 -175517 123209 117349 -85464
6906 232648 -2344 -301780 -46766 -239499 182148 -211022 -256691 181183 -379309 -101505
6895 216167 -76009 -168406 193027 187139 -175162 -279666 61966 -23812 -208378 112938 -121325
6883 -54954 8608 -205016 50022 108381 -24060 -165831 -114621 -208259 573706 -302800 189494
6871 77845 -159006 -142959 222388 373277 116775 -399827 -126572 67393 -46564 11660 -19237
6859 -17593 61613 -352295 -228652 5699 -220130 -27649 71381 -11609 180718 143259 -157656
6847 213293 161693 -233575 -100884 279738 28557 -145340 -110688 -20353 221970 -417028
6836 -394048 69459 -46946 208873 59788 -45701 176679 -192860 -61352 338499 -19671 89795
6824 -110590 -50655 -28456 128650 -90282 -484175 414260 -218324 -23770 23506 306638 240140
6813 240140 167993 31111 -246027 189300 74343 157228 338700 -56016 36617 93850 -198401
6801 -1483 169498 -272118 -86812 -13311 -141710 100965 -250777 -255157 252587 -274403 -170629
6790 -170629 55507 91420 299135 52061 -267339 -42730 233353 176011 279476 -357691 199085
6778 -296267 -275596 68360 -74831 -17111 14091 -75122 -21858 244880 6217 -166109 137670
6766 -51000 -304590 -201362 -5934 -136407 120649 -54450 -480402 -98401 -230047 -21110 -72356
6755 -72356 -79668 5412 25811 -113537 -17711 36969 -61368 171258 -149950 -200403 233515
6743 -60966 -7512 134099 -14122 34082 -234847 149084 11257 -36417 105 -216083 119549
6731 -36349 459259 124336 65692 97602 202461 136656 -140516 90880 -70143 106509 -235293
6719 276240 -120978 37706 195113 38589 112172 -122756 -191308 -76818 194546 61225 102523
6708 102523 -3903 -262785 -265677 -127932 264259 153099 185587 82420 -79655 112899 -59284
6696 157418 -250298 -201207 206269 115012 -223648 -155064 -240188 156128 -55668 393352 187980
6684 -281688 311115 -49606 -148092 -103958 -391316 -43880 -230281 -354324 57583 -118045 -245614
6673 -245614 3024 137821 -138832 -240382 -141584 -62770 23386 -300624 146642 68748 22481
6661 236101 -297352 -347835 -248265 65041 -22121 45108 47737 -50653 53663 98609 -20336 215368
6648 -249102 217 83168 -145329 -383397 -32698 24844 92148 -66788 44706 130478 -107720
6636 255555 161748 192946 -96666 30150 -29031 -232031 -229416 -301394 -65901 5004 -291990 105784
6623 -85788 49482 -85493 14314 281548 -98299 199315 88942 -155838 -27465 145876 -140314
6611 181695 -57773 -124517 214110 -35261 33477 -336022 182836 182309 -115161 -190982 -50489
6599 95780 422635 -3103 -208349 761 -77143 -133676 84681 -128865 44320 27273 193615 110351
6587 110351 -103117 54041 -209878 -138970 -94660 -106480 74917 -49580 103135 66317 -184013
6575 -230347 -234410 -202570 16082 50211 296960 -87645 230612 147739 -247370 -398004 52633
6563 -32584 9136 -101269 -45349 -1825 -142884 332311 -59191 61959 -219394 236248 298674
6552 298674 239720 -258842 80724 -76131 -128601 108081 184186 -59306 -101874 -162407 -424535
6541 -424535 174186 -33699 -56461 -16793 -7113 350817 -9348 -20761 -202524 -103798 195630
6529 6423 -7023 52526 -9857 104127 -9215 61419 -126447 -148458 -147038 -129690 -109017 -90512
6517 -90512 -90820 84435 26162 -38788 -97330 -108491 220290 -100326 130074 4026 142405 18820
6504 89816 45446 43418 -76760 150496 -167062 -59990 -104748 -17813 19033 105135 -213424
6492 -152917 -149242 -10805 43870 122721 170058 -224492 -82475 -127584 257646 -162033 146601
6480 110801 89984 49249 -29971 105025 74737 -34813 15307 42774 221786 -116800 58052
6468 164688 -66036 -231618 -118084 -103314 -135378 -248746 321635 255325 83807 416715 16641
6456 156767 -257523 57805 -161166 -62987 -172339 105623 -137861 -165232 18371 -145865
6445 -49140 -118095 -248939 20079 -102221 -11900 26427 71819 -102374 -90364 -108107 -204592
6434 -204592 -155102 -218865 -74476 141750 -16567 -287217 128176 -13498 -305511 -35967 189294
6422 -29546 -39829 -253407 -153946 284326 256037 -182250 96475 -108493 -129010 -384193 -455147
6411 -455147 283872 -110766 -99235 134022 173218 149833 -237294 -98731 -349761 284271
6400 259234 -28720 -14339 -426825 315200 62648 111932 329633 122425 -35435 -109682 -295407
6389 -295407 27319 -73538 242607 -117144 104552 -202327 -298912 -37951 -293850 -140744
6378 196955 -42266 -209667 -260342 -108569 -13918 -171380 119071 152710 -19922 85063 -74376
6366 -229976 -335843 -52348 -166452 -45119 229472 380438 298363 -106143 -121128 -91978 -213914
6355 -213914 -40375 217895 -90837 59896 -24898 -261389 -244545 -143516 -155491 -20043 50486
6343 65452 -305921 201154 81843 299023 30505 100114 -172632 -122646 104098 236126 -218211
6331 -138807 202685 185875 -59027 -194736 -24293 66252 303748 -169931 284683 -19499 -132427
6320 -132427 54055 212556 288853 310003 -225162 -242595 256968 -19932 238224 -55034 -48516
6309 -48516 -292698 152927 41288 -102825 85365 -193001 -60170 91007 -62347 -29784 -243159
6298 -243159 195464 89130 -103240 -45480 -31545 251925 177861 -180516 -158190 289179 5857
6286 -160376 -221359 -50903 191047 42860 -89420 68261 -230152 181177 -106629 352955 -76712
6274 142817 20679 -113744 103432 206132 334656 -285593 355798 -50049 -358377 -79615
6263 -301742 73639 63053 77032 -349342 -102601 -80580 -89932 -206068 43029 309883 114063
6251 153517 143847 -18257 35529 94176 -174458 87566 -81441 62053 -110038 -194875 -448033
6240 -448033 -9278 178323 -122852 49822 210894 -162877 76702 283454 -156220 -37388 1300
6228 -85157 333457 8414 -214061 -199023 -60670 146472 -256088 -526853 -137848 30975 -51151
6216 -368558 78916 66233 106387 -131946 -211046 218005 -53211 44938 218183 7473 135072
6205 135072 -221792 154192 223905 -40631 32836 -36011 -68830 80810 190853 -193282 493788
6193 155246 -128910 100347 115096 188378 -8561 -13265 157523 -185161 97453 21810 -45456
6181 2182 -342578 -88491 -94258 -33389 115396 -251548 -174346 -29474 -249848 92416 -247250
6169 283332 -97092 -117830 -125558 -274647 -64825 39870 400585 -198457 -88917 -134911 -84246
6158 -84246 -200553 -302361 147783 21685 9319 -7828 -287323 -47785 -104774 29217 36867 -184574
6145 42019 -199922 357517 128228 208658 51138 156083 200939 -143661 45679 -124369 -199222
6134 -199222 29908 -76253 71592 -49881 -259705 16594 -191973 55728 -35260 148541 17343
6122 289146 25132 -127677 -263625 -218814 415714 115736 -11937 102519 -229820 -9973 114264
6110 14200 -180654 -128077 133475 228185 -321355 193216 -56310 -312517 56267 189926 100446
6099 100446 -171640 -197403 -267492 -223298 89796 128058 40191 74593 -37146 -224321 77426
6087 15650 360085 -156819 -11413 -201080 16525 6839 -13441 -62899 148772 178321 -1716
6075 98528 38978 68596 -142768 51857 -50616 -147152 -273852 70982 426052 -287231 -70466
6063 -10201 -112420 17480 5851 27561 -47314 -6877 313678 47748 256015 26196 53308 72529
6051 72529 352392 -197891 121511 -1083 -5022 39462 352178 211994 177307 333795 -14641
6039 4394 52418 111108 -242412 -141512 1452 13215 -26592 -47578 184791 -326832 87351
6027 340079 407115 -130822 -231668 56778 -174089 -14052 -139394 -279642 479477 -228584
6016 -151597 -145711 -95205 -96231 6824 -214302 -217700 -66799 77999 16223 -325947 -103101 -15124
6003 116536 180335 -68242 -163156 -74574 -137278 -268826 -139776 124408 296633 -179992 -17214
5991 -97512 -182333 -34738 -308984 58615 198354 -206010 -31418 -106362 -23371 45398 73157
5980 73157 414020 -3185 283151 -315271 -222690 -225319 299409 -222982 -121158 12921 1158
5968 -102552 -18994 -105835 -265020 -347252 -42095 -69705 -439001 104355 192230 222993 174095
5957 174095 115042 -256977 -85154 -177809 77138 -268635 -16979 14853 -207253 -86369 -125234
5946 -125234 -103079 -156669 43345 371157 -49603 104834 117853 204888 247256 -320868 -48892
5934 -60031 95727 -81586 253292 -56813 364255 132730 -168498 -440553 119842 -312274
5923 -109706 -138186 -81213 -11227 -157902 -299572 10373 -168776 -8694 44604 219070 -110461
5911 -89159 -63190 -134585 -19520 -38303 -195448 390998 -135610 -349314 95527 -100404 -44575
5899 -28510 200195 -98265 30799 77112 397405 37689 -146087 261283 -58426 178053 70039
5887 -348496 -278186 82920 325362 42403 -78637 258311 -59872 -229095 -95074 -209049 198496
5875 185856 -156034 258004 56334 -388225 314392 -147889 202460 25181 279830 -81935
5864 227040 -261520 103828 178734 340808 42987 -11537 302779 26242 171307 80 477521
5853 477521 240653 -2064 -300881 -278984 171327 -10632 -162769 254745 -32323 127826 -124889
5841 -30760 46933 -428696 -23257 111948 258008 -34215 -166238 44848 -58926 148171 -18949
5829 440377 46115 -407697 -186747 -76088 50125 -290283 -9451 -73942 67985 -349161 -305701
5818 -305701 -2178 -28585 182777 204423 38857 -6094 160373 274661 -95949 -140016 234213
5806 21314 -86482 173866 183612 146193 208974 -197606 -14262 -266260 120152 118818 57944
5794 1427 210897 -68196 53605 250469 -120128 172334 -237023 -60870 108618 -81022 34260
5782 223590 138123 -135262 121843 -55987 -77195 -25095 -137467 -201476 -236135 26566 -169813
5770 40072 -85965 267775 97268 100247 -81471 209176 -12529 -45014 -346487 189326 112011
5759 112011 -25441 -126130 183922 12874 22910 -151562 288006 -146269 101482 115823
5749 115823 -176666 200824 -85235 -130802 -192357 -209495 -133614 -107719 286609 31970 74277
5738 74277 -152277 44829 -88376 -6264 -159866 -124021 -17573 56540 7682 -306932 -7939 150256
5725 -73684 577 -53382 -189638 -50147 -25682 -104579 -1680 146891 -78553 15986 11842 174276
5713 174276 -267318 -50735 124035 117689 -17731 146040 -156366 -124951 -117713 13644 118850
5702 118850 60098 -20955 -90724 338275 120549 -90773 35618 -252485 -25980 -120500 258441
5690 54631 141718 -128123 50734 -232433 -172299 -145685 296469 65075 15621 -23343 70367
5678 -309012 -24397 -202461 133838 318376 217255 195056 9590 -224558 212695 35435 -162774
5666 -187984 145122 -107570 -10967 18674 147249 142476 -275881 -215140 -1119 316199 54157
5654 96442 -51903 -33447 73182 -169058 7905 -60312 -349898 -35340 501 -121661 49480 374319
5642 374319 19180 -131128 75135 -25585 219331 36257 108923 437353 -93751 93637 -48113
5630 -94995 130414 -40321 -11165 -179974 119688 87921 -29637 -137038 -30783 72705 -12239
5618 -169017 164682 96132 -247569 145820 -145551 -64218 -138587 74811 -53069 4402 -94684
5606 60395 200658 -60989 -184922 -448862 222009 161394 107228 104983 348795 -110127 20908
5594 -314162 33004 10992 -27271 88841 23728 -105047 -269090 -124411 -339228 -123487 367216
5582 54386 -40046 -193276 131431 -103399 -63021 23746 -24717 -146359 115410 -190499 202576
5570 -174140 -49331 -14800 -179571 -41362 263902 52403 -129496 87804 110358 -48702 125101
5558 -163899 -175942 -250136 -557874 198158 35034 197711 -142652 28236 232848 -215322
5547 -35120 -154295 280403 -209081 97069 185763 -51383 135037 224514 -63086 40924 -288125
5535 105392 -43858 -180155 -205648 19865 -48264 297626 -274751 -368343 106217 -31145 -224225
5524 -224225 111467 68177 -66447 -118132 -148115 -245279 27821 -214116 308879 56372 -75629
5512 -188392 68555 218701 260681 1739 -138040 -192231 -143407 -133731 298552 10123 141967
5501 141967 140611 -3405 -69467 373155 -251161 113400 26496 254881 -163337 -142059 -128236
5490 -128236 -290788 53439 211224 -839 13717 -26141 -127954 299226 155454 -41098 -527333
5479 -527333 -13720 -266305 27570 -353 103561 21755 -62757 135742 -149272 -180617 -26611
5467 298549 -285198 14080 34569 -249239 152555 27400 329739 -374640 -56655 -21780 -256881
5456 -256881 20628 44268 69031 304081 -165636 345517 -86655 -44447 -391074 162999 131572
5445 131572 116765 13276 300106 154166 -1670 22740 68301 115608 135702 175528 125815
5434 125815 -21622 268669 -292717 -332009 -27876 -190366 189876 60231 66399 -52311 326470
5422 -63370 -80168 -192061 -85104 -100529 325337 122824 209033 114081 -253496 103640 -101333
5410 100111 -73801 -107048 21126 396353 3883 -19001 -12103 -226645 339254 -145647 95351
5398 166824 -62676 -257392 -134338 72236 205085 45356 42114 -220638 397928 -364936 2979
5386 -365904 -172409 -61229 30687 114358 128433 245974 -93580 142119 -41360 28767 23659
5375 23659 134651 76164 82646 86232 367216 191659 39376 6973 119446 -116642 -18221
5363 -298419 257672 -183983 -234061 93428 65172 194463 -148709 38485 38217 279609 -185288
5351 -7274 -147865 -301497 -3607 216133 -63211 192073 53677 157215 104642 -503285 19671
5339 115494 80731 -24007 211507 309439 -333945 -250362 -8347 -220633 -71697 -306585 -81913
5327 -99898 -86956 52698 -38415 149493 -33883 15791 38401 -291535 245861 -44146 -286369
5316 -286369 -81597 -193903 118094 346580 -137137 62920 -33574 11694 -93009 -122280 -109689
5305 -109689 142496 106404 -134955 62188 18269 -147045 90038 3370 85639 35736 77724
5294 77724 -6968 -165760 -130697 -31545 -239975 -155442 327409 90538 -141294 86427 247400
5283 247400 -173506 53885 328284 124849 -273028 105587 183106 -416169 184306 -110366
5272 -45813 197849 -2148 -158734 463425 -20658 -6479 139509 -281117 -197681 -116582 -31945
5260 -285050 -101245 263898 122564 152366 -209785 15201 219474 13088 13382 -20998 136392
5248 -205532 -478 49985 -518897 113145 39899 -94948 -139742 -206865 272742 -131211 206745
5236 -107074 43191 -80885 -257409 -38849 -268864 196885 -57493 -34804 -22341 -352839 -94180
5224 -373847 323313 187029 -101654 -174361 -237867 219933 38940 -178313 139122 -25947
5213 -17499 -205752 106246 -119785 169773 -68666 102538 -16931 -114345 161564 -33782 -138058
5202 -138058 10234 82654 53706 -177441 -12853 218539 158944 116760 92576 175406 -185331
5190 163181 -197203 -67892 234404 -77339 -140578 21374 115170 281760 -19273 -180516 -17945
5178 -28720 -209868 -61953 127570 51113 15898 172192 -126857 -201557 108517 -87953 343883
5166 -138884 -97621 39066 -104525 -104513 -382861 41696 48431 -94516 -24069 64154 -115514 -24277
5153 -77846 16521 138320 -225977 132029 162424 247713 393084 -129623 -179783 -106162 -127101
5142 -127101 -88635 61946 -63839 104158 135686 15483 292364 128538 204261 58778 96532
5131 96532 -37111 132803 68283 -121593 50156 -57312 -13757 -215810 -280914 -67320 377309
5119 -144349 -233754 128347 -128192 36754 -27478 -212056 174866 -203850 17115 295973
5109 295973 -26363 246310 -202317 121780 266740 -108240 21068 154809 -86971 -219962
5099 -219962 -16497 57333 248261 219565 -190919 70749 -179225 -142939 32042 48237 214038
5088 214038 164803 236796 -422819 55424 5302 68065 76895 -200389 -2009 158489 -44162 -144024
5076 -144024 2852 -137569 63684 -136197 291345 271403 -523978 -42531 20452 303178 -36018
5064 22180 5953 174237 47414 64502 119008 98973 57351 34552 -27573 161114 -54833 -142010
5052 -142010 61514 -51233 319761 44240 -116383 -59980 -70041 102354 -226091 -128643 7674
5040 -61416 54681 35562 -114094 65534 121315 136954 106443 -97614 -122931 -206523 -53484 23135
5027 395026 81723 18262 151802 -25342 -247576 -58809 24046 75100 -107202 -149436 -169070
5016 -169070 -389831 -39024 24163 131045 -30051 -82135 74656 -29591 -345208 -44310 -16328
5004 183296 -286846 -140141 132556 262297 -249606 60147 57188 -178851 -217389 -80563 -90237
4993 -90237 159975 142007 139774 -318534 -156948 15923 -199 47422 246726 -334000 -129829
4981 -45354 128612 200716 97040 -34051 -57936 144656 -92017 -9049 -136690 -147448 -120708
4970 -120708 -175297 157262 -45580 -132416 -110952 -63160 -115408 -165924 -25032 -29371 -22750 17311
4957 129649 -225459 -220611 285555 -13013 -29213 -252356 114448 220192 217991 73051 450762
4946 450762 -64716 142653 -138727 242643 -137540 -124937 113418 89531 142732 -226730
4935 -231001 -37471 80067 204810 43461 -57401 -217410 98823 -41816 -97155 -228675 -31264
4923 -209398 66192 125337 -114910 197450 97171 109961 -139509 119991 383169 -121888
4912 261739 -127303 -223015 -65872 -262862 51243 181241 289746 -73864 62531 -2532 131564
4900 -225767 -325831 191438 70757 140681 109169 385135 -216353 -198500 -244702 199412 -2040
4888 131468 494637 -267714 84769 -238185 -27573 167345 117910 -169834 -25393 34924 159092
4877 159092 123715 82413 62720 248854 -217536 -138781 -237635 217239 138864 -158306 -73029
4865 247348 218436 24978 -171441 314681 -66992 170730 266666 278646 187584 -195266 147992
4853 105965 131130 227478 21067 170047 -345818 -59296 -61297 -52701 216151 225318 -206502
4841 -136015 28339 149468 308910 -173097 -7177 -70426 -243418 -65491 -167331 100797 112569
4830 112569 216744 188870 -197902 152717 -89201 -76576 82817 140805 -71065 120477 93201
4819 93201 12749 86313 -194933 -202929 163735 210544 136421 241636 184841 65437 174599
4808 174599 135939 149183 -184817 -131749 -221616 -36089 -247889 -22743 332478 42519 -219958
4796 -97242 110316 -487033 -176852 176491 -179088 -112389 -32692 -4690 -79083 248535 362387
4785 362387 94118 9024 -192468 -74983 89363 -175127 59100 86668 -10647 130882 360432
4774 360432 222732 49684 84407 80367 -176491 72281 -17413 48821 60 147293 -96720 -17066
4761 211031 114904 10695 -21134 -39623 -158954 271300 -115018 199901 5532 -36837 -252813
4750 -252813 -159171 14411 52962 -121496 -165487 -155845 -98986 140039 -30059 8849 365488
4739 365488 -181461 -93648 -26947 202518 120278 171151 14881 -98549 242540 -220062 -28454
4727 -8659 38310 -231927 -409269 -118061 161295 53707 93589 780 -241771 -205652 63724
4715 150721 122271 117715 -148361 -49005 -99864 81122 55536 202650 96895 -62639 -349200
4704 -349200 94257 -22000 195879 -2696 84048 129750 256716 96106 34351 146010 291915
4693 291915 -26816 27640 208852 -64864 30294 -78858 244040 111086 -217405 94968 105795
4682 105795 84888 -250757 -30510 -222530 -46234 56251 -100215 -98867 79286 -81045 -2852
4670 54496 -163915 66903 -289977 99115 197197 -36131 26590 -93768 -108339 304222 -115385
4658 159276 -301343 -144618 21422 -236457 -86401 167338 92971 167533 -134002 183260
4647 136831 -190018 -138602 -20731 139647 -272489 37717 97507 239345 189023 -28023 247427
4635 54003 240741 -128585 -25904 283626 76654 24094 38610 -16908 -126866 75672 184136
4624 184136 93898 23218 68974 221334 -196362 121847 151365 4569 200043 71938 -122333
4612 134288 289103 -236485 124505 -300498 -192185 237346 -168059 -55102 -132812 -186418
4602 -186418 196654 93378 -124892 -260521 92030 61554 331481 190632 -99396 -248476
4592 -248476 -17746 -364708 105858 44297 -30894 117331 277119 -13417 -131644 194697
4581 -95426 26809 84336 -141226 -65836 29532 -201400 -114878 -90341 -1154 188215 -28043
4569 241002 253936 -227046 -30746 50168 -2264 243023 -86070 13649 276019 -23207 13768
4557 -338786 -36260 544650 -167359 28684 294552 311663 116910 204383 -28433 28999 -72504
4545 173459 75903 -86693 384485 -230047 226056 -101216 -55661 -203576 38264 -135781
4534 -224105 -128463 34551 21593 -141228 -106839 20478 -172125 158537 53202 -143725 -172402
4523 -172402 -59987 -89026 278172 -19397 99395 10198 -19090 -250959 44944 -104714 19019
4511 -84816 -94305 280085 95151 -194102 85862 -102273 -122443 -211647 -211530 35884 20224 -116891
4498 -65540 -13281 -118452 280192 -294119 -48446 -218079 90224 103018 -131610 -49691 280610
$$ [...]
##END NTUPLES=NMR SPECTRUM
##END=
