##TITLE=AC1541_ROEFFECT0011_8214791_Kw8PcNv59o
##JCAMPDX= 6.0         $$ Bruker NMR JCAMP-DX V2.0
##DATA TYPE= NMR SPECTRUM
##DATA CLASS= NTUPLES
##ORIGIN= BRUKER
##OWNER= Administrator
$$ 1.72 TOPSPIN		Version 2.1
$$ 2013-10-12 12:50:55.221 -0700  Administrator@X
$$ Compression mode = diff/dup
##.OBSERVE FREQUENCY= 400.02188249412
##.OBSERVE NUCLEUS= ^1H
##.ACQUISITION MODE= SIMULTANEOUS (DQD)
##.ACQUISITION SCHEME= undefined
##.AVERAGES= 64
##.DIGITISER RES= 22
##SPECTROMETER/DATA SYSTEM= spect
##.PULSE SEQUENCE= noesygpps1d.comp
##.SOLVENT NAME= COFFEE_meoh
##.SHIFT REFERENCE= INTERNAL, COFFEE_meoh, 1, 14.96077
##AUDIT TRAIL= $$ (NUMBER, WHEN, WHO, WHERE, PROCESS, VERSION, WHAT)
$$ ##TITLE= Audit trail, TOPSPIN		Version 2.1
$$ ##JCAMPDX= 5.01
$$ ##ORIGIN= Bruker BioSpin GmbH
$$ ##OWNER= Administrator
$$ $$ E:\/data/COFFEE/nmr/AC1541_ROEFFECT0011_8214791_Kw8PcNv59o/12/pdata/1/auditp.txt
$$ ##AUDIT TRAIL=  $$ (NUMBER, WHEN, WHO, WHERE, PROCESS, VERSION, WHAT)
(   1,<2013-10-12 12:50:50.456 -0700>,<Administrator>,<X>,<go>,<TOPSPIN 2.1>,
      <created by zg
	started at 2013-10-12 12:39:20.605 -0700,
	POWCHK enabled, PULCHK disabled,
       configuration hash MD5:
       C8 4E 4E 5D D3 5C D8 9E 9F 52 82 E0 59 8A DE 15
       data hash MD5: 64K
       AB E4 2B 45 FE A7 39 93 46 13 29 FD E3 79 86 5F>)
(   2,<2013-10-12 12:50:53.346 -0700>,<Administrator>,<X>,<proc1d>,<TOPSPIN 2.1>,
      <Start of raw data processing
       efp LB = 0.3 FT_mod = 6 PKNL = 1 PHC0 = 0 PHC1 = 0 SI = 128K 
       data hash MD5: 128K
       17 E3 F0 8E A6 F1 45 BE 65 7B 7E 88 5A 01 46 D0>)
(   3,<2013-10-12 12:50:54.378 -0700>,<Administrator>,<X>,<proc1d>,<TOPSPIN 2.1>,
      <pk PHC0 = -80.62866 PHC1 = 0 
       data hash MD5: 128K
       AC 1E 94 CD ED CE 9F 70 95 18 34 AF 00 CC 19 90>)
(   4,<2013-10-12 12:50:54.768 -0700>,<Administrator>,<X>,<proc1d>,<TOPSPIN 2.1>,
      <abs ABSG = 1 
       data hash MD5: 128K
       EC 39 BA E1 33 EA F1 07 B5 4F E2 FB 0B D0 D1 2B>)
(   5,<2013-10-12 12:50:54.846 -0700>,<Administrator>,<X>,<proc1d>,<TOPSPIN 2.1>,
      <abs ABSG = 2 
       data hash MD5: 128K
       BB 3B 00 0C B5 5C 7C E5 66 0C 80 B0 D0 F4 56 09>)
(   6,<2013-10-12 12:50:54.940 -0700>,<Administrator>,<X>,<proc1d>,<TOPSPIN 2.1>,
      <abs ABSG = 3 
       data hash MD5: 128K
       00 B2 A2 DE 7B 4B 6B B8 6A D3 CB 01 9B 0E 74 41>)
(   7,<2013-10-12 12:50:55.003 -0700>,<Administrator>,<X>,<proc1d>,<TOPSPIN 2.1>,
      <abs ABSG = 4 
       data hash MD5: 128K
       0A E3 C8 BF 84 70 4E 65 E2 75 BD E4 64 B0 B8 33>)
(   8,<2013-10-12 12:50:55.065 -0700>,<Administrator>,<X>,<proc1d>,<TOPSPIN 2.1>,
      <abs ABSG = 5 
       data hash MD5: 128K
       E2 BA 81 CD 5F 11 E6 75 AB AA D9 8B AE F3 BC 66>)
$$ ##END=
$$ 
$$ $$ hash MD5
$$ $$ 51 7A 54 BF 89 86 8D 50 36 DD 2A 80 EA B7 EE 04
##$RELAX= 
##$RELAX= 
##$RELAX= 
##$RELAX= 
##$RELAX= 
##$RELAX= 
##$RELAX= 
##$RELAX= 
$$ Bruker specific parameters
$$ --------------------------
##$DU= <E:\>
##$EXPNO= 12
$$ [...]
##$TP07= 0
##$TPNAME0= <>
##$TPNAME1= <>
##$TPNAME2= <>
##$TPNAME3= <>
##$TPNAME4= <>
##$TPNAME5= <>
##$TPNAME6= <>
##$TPNAME7= <>
##$TPOAL= (0..7)
0.5 0.5 0.5 0.5 0.5 0.5 0.5 0.5
##$TPOFFS= (0..7)
0 0 0 0 0 0 0 0
##$TUNHIN= 0
##$TUNHOUT= 0
##$TUNXOUT= 0
##$USERA1= <user>
##$USERA2= <user>
##$USERA3= <user>
##$USERA4= <user>
##$USERA5= <user>
##$V9= 5
##$VALIST= <valist>
##$VCLIST= <CCCCCCCCCCCCCCC>
##$VD= 0
##$VDLIST= <DDDDDDDDDDDDDDD>
##$VPLIST= <PPPPPPPPPPPPPPP>
##$VTLIST= <TTTTTTTTTTTTTTT>
##$WBST= 1024
##$WBSW= 4
##$XGAIN= (0..3)
0 0 0 0
##$XL= 0
##$YL= 0
##$YMAX_a= 6002675
##$YMIN_a= -11998341
##$ZGOPTNS= <>
##$ZL1= 120
##$ZL2= 120
##$ZL3= 120
##$ZL4= 120
##$ABSF1= 14.96077
##$ABSF2= -5.597412
##$ABSG= 5
##$ABSL= 3
##$ALPHA= 0
##$AQORDER= 0
##$ASSFAC= 0
##$ASSFACI= 0
##$ASSFACX= 0
##$ASSWID= 0
##$AUNMP= <proc_prof1d_extract.lims>
##$AXLEFT= 0
##$AXNAME= <>
##$AXNUC= <1H>
##$AXRIGHT= 0
##$AXTYPE= 0
##$AXUNIT= <>
##$AZFE= 0.1
##$AZFW= 0.1
##$BCFW= 0
##$BC_mod= 0
##$BYTORDP= 0
##$COROFFS= 0
##$CY= 15
##$DATMOD= 1
##$DC= 0
##$DFILT= <>
##$DTYPP= 0
##$F1P= 0
##$F2P= 0
##$FCOR= 0.5
##$FTSIZE= 131072
##$FT_mod= 6
##$GAMMA= 0
##$GB= 0
##$INTBC= 1
##$INTSCL= 1
##$ISEN= 128
##$LB= 0.3
##$LEV0= 0
##$LPBIN= 0
##$MAXI= 10000
##$MC2= 0
##$MEAN= 0
##$ME_mod= 0
##$MI= 0
##$NCOEF= 0
##$NC_proc= -2
##$NLEV= 6
##$NOISF1= 0
##$NOISF2= 0
##$NSP= 0
##$NTH_PI= 0
##$NZP= 0
##$OFFSET= 14.96077
##$PC= 1
##$PHC0= -80.62866
##$PHC1= 0
##$PH_mod= 1
##$PKNL= yes
##$PPARMOD= 0
##$PPDIAG= 0
##$PPIPTYP= 0
##$PPMPNUM= 2147483647
##$PPRESOL= 1
##$PSCAL= 4
##$PSIGN= 0
##$PYNMP= <proc.py>
##$REVERSE= no
##$SF= 400.020009729866
##$SI= 131072
##$SIGF1= 0
##$SIGF2= 0
##$SINO= 400
##$SIOLD= 131072
##$SPECTYP= <>
##$SREGLST= <1H.CDCl3>
##$SSB= 0
##$STSI= 131072
##$STSR= 0
##$SW_p= 8223.68421052631
##$SYMM= 0
##$S_DEV= 0
##$TDeff= 65536
##$TDoff= 0
##$TI= <>
##$TILT= no
##$TM1= 0
##$TM2= 0
##$TOPLEV= 0
##$USERP1= <user>
##$USERP2= <user>
##$USERP3= <user>
##$USERP4= <user>
##$USERP5= <user>
##$WDW= 1
##$XDIM= 131072
##$YMAX_p= 400267358
##$YMIN_p= -11290
##$CURPLOT= <Network HP LaserJet P1505>
##$CURPRIN= <$Network HP LaserJet P1505>
##$DFORMAT= <normdp>
##$LAYOUT= <+/1D_H.xwp>
##$LFORMAT= <normlp>
##$PFORMAT= <normpl>
##$SURQMSG= 1
$$ End of Bruker specific parameters
$$ ---------------------------------
##NTUPLES= NMR SPECTRUM
##VAR_NAME=  FREQUENCY,     SPECTRUM/REAL,   SPECTRUM/IMAG
##SYMBOL=    X,             R,               I
##VAR_TYPE=  INDEPENDENT,   DEPENDENT,       DEPENDENT
##VAR_FORM=  AFFN,          ASDF,            ASDF
##VAR_DIM=   131072,        131072,          131072
##UNITS=     HZ,            ARBITRARY UNITS, ARBITRARY UNITS
##FACTOR=    0.0627417313425164, 1,          1
##FIRST=     8223.62146879497, 777,          -58738
##LAST=      0,             3251,            -58898
##MIN=       0,             -11290,          0
##MAX=       8223.62146879497, 400267358,    0
$$ Real data points
##PAGE= N=1
##DATA TABLE= (X++(R..R)), XYDATA
$$ [...]
63979C45228N619N780O684Q196R463R702Q983Q208Q345R621J1329J2502J2869
$$ 345228 350847 356627 363311 371507 380970 390672 399655 407863 416208 425829 437158 449660 462529
63966D62529J3029J3583J4441J5295J6376J8175K0562K2989K5463K8596L2540
$$ 462529 475558 489141 503582 518877 535253 553428 573990 596979 622442 651038 683578
63955F83578L6777M1252M6861N4294O3177P2964Q3855R6110J09207J22714J37345
$$ 683578 720355 761607 808468 862762 925939 998903 1082758 1178868 1288075 1410789 1548134
63944A548134J53898J71391J87528K01007K12228K21700K28947K33217K34109
$$ 1548134 1702032 1873423 2060951 2261958 2474186 2695886 2924833 3158050 3392159
63935C392159K31032K23066K09934J92275J70568J44729J15242Q3669N1141J7296
$$ 3392159 3623191 3846257 4056191 4248466 4419034 4563763 4679005 4762674 4813815 4831111
63925D831111j8270n4217q8309j19539j48113j73586j94364k09264k18533k23047
$$ 4831111 4812841 4758624 4670315 4550776 4402663 4229077 4034713 3825449 3606916 3383869
63915C383869k23475k20549k15209k07823j97872j85090j70460j55486j40770
$$ 3383869 3160394 2939845 2724636 2516813 2318941 2133851 1963391 1807905 1667135
63906A667135j25959j10944r6536q3794p3086o4015n5999m8753m2300l6751l2131
$$ 1667135 1541176 1430232 1333696 1249902 1176816 1112801 1056802 1008049 965749 928998 896867
63895H96867k8373k5361k3036k1431k0621k0474k0509k0171j9378j8602j8274
$$ 896867 868494 843133 820097 798666 778045 757571 737062 716891 697513 678911 660637
63884F60637j8160j7558j5981j3528j0604p588m744k230p6J794L504N227P179
$$ 660637 642477 624919 608938 595410 584806 577218 572474 570244 570168 571962 575466 580693 587872
63871E87872R437J1794J3915J5641J7045J8239J9303K0264K1021K1330K1113K0617
$$ 587872 597309 609103 623018 638659 655704 673943 693246 713510 734531 755861 776974 797591
63859G97591K0077J9286J7851J5857J3856J2084J0129P537M486J429j622n047
$$ 797591 817668 836954 854805 870662 884518 896602 906731 914268 918754 920183 918561 913514
63847I13514q854j2378j4920j6529j7960j9900k2314k4546k6058k6964k7787k8729
$$ 913514 904660 892282 877362 860833 842873 822973 800659 776113 750055 723091 695304 666575
63835F66575k9383k9200k8121k6602k5091k3701k2273k0661j8917j7341j6291
$$ 666575 637192 607992 579871 553269 528178 504477 482204 461543 442626 425285 408994
63824D08994j5821j5498j4759j3515j2187j1141j0264r268q180p279o608n895
$$ 408994 393173 377675 362916 349401 337214 326073 315809 306541 298361 291082 284474 278579
63812B78579m983m109l574l268k715j615k67N47K04j115k470l019k767k331k039
$$ 278579 273596 269487 265913 262645 259930 258315 258048 258595 258799 257684 255214 252195 249428 247097 245058
63797B45058j674j109p26q64j246j365j224j237j518j786j863j850j809j721j739
$$ 245058 243384 242275 241549 240685 239439 238074 236850 235613 234095 232309 230446 228596 226787 225066 223327
63782B23327k050k415k363j899j444j035k34Q99J442Q20k79p48m74j94k56k97
$$ 223327 221277 218862 216499 214600 213156 212121 211887 212786 214228 215048 214769 214021 213547 213353 213097 212800
63766B12800q0Q1j49o54j047r61k64O69J027M01n45q13m43l78r33j255o32L48
$$ 212800 212720 212801 212652 211998 210951 209990 209726 210395 211422 211823 211278 210465 210022 209644 208711 207456 206824 207172
63748B07172O73L51K45P10J186J147Q48Q46J214J596J839K170K717L157L044K440
$$ 207172 207845 208196 208441 209151 210337 211484 212332 213178 214392 215988 217827 219997 222714 225871 228915 231355
63732B31355J873J658J554J302J237J878L090M078M294L933L482L223L236L432
$$ 231355 233228 234886 236440 237742 238979 240857 243947 248025 252319 256252 259734 262957 266193 269625
63718B69625L383K657J557R83J247J503Q56m12j359j767k224k953l371l018k241
$$ 269625 273008 275665 277222 278205 279452 280955 281811 281399 280040 278273 276049 273096 269725 266707 264466
63703B64466j665j419j237r78o82l15J58O46J062J544K250L010L442L462L493
$$ 264466 262801 261382 260145 259167 258485 258170 258328 258974 260036 261580 263830 266840 270282 273744 277237
63688B77237M010M872N258M468K741J152N32O96Q85P53N21L18j04q00j274j087
$$ 277237 281247 286119 291377 295845 298586 299738 300270 300966 301851 302604 303125 303443 303339 302539 301265 300178
63672C00178m97r3O2M28J158J743J722J289Q38K13j054k751l883l825l232l287
$$ 300178 299681 299588 299650 300078 301236 302979 304701 305990 306828 307041 305987 303236 299353 295528 292296 289009
63656B89009m231n170n339m949m568m240l670k897k192j480m77N73R45M39k00
$$ 289009 284778 279608 274269 269320 264752 260512 256842 253945 251753 250273 249796 250369 251314 251753 251553
63641B51553j54M85J018J090J011J213J801K567L201L474L432L408L695M253M866
$$ 251553 251399 251884 252902 253992 255003 256216 258017 260584 263785 267259 270691 274099 277794 282047 286913
63626B86913N427N926O349O783P460Q366R073R319R684J1040J3325J5446J6625
$$ 286913 292340 298266 304615 311398 318858 327224 336297 345616 355300 366340 379665 395111 411736
63613D11736J7296J8300J9700K0948K1897K2948K4203K5142K5277K4644K3341
$$ 411736 429032 447332 467032 487980 509877 532825 557028 582170 607447 632091 655432
63602F55432K1040J7334J2449P268K720o88k897m179n031n921p007q138r191j0259
$$ 655432 676472 693806 706255 713523 716243 715555 712658 708479 703448 697527 690520 682382 673191 662932
63588F62932j1572j3273j5313j7416j9116j9955j9753j8714j7295j5964j4935
$$ 662932 651360 638087 622774 605358 586242 566287 546534 527820 510525 494561 479626
63577D79626j3982j2580j0522q339o905o375n839m253j642R39K573L308L786M456
$$ 479626 465644 453064 442542 434203 427298 420923 415084 410831 409189 410128 412701 416009 419795 424251
63563D24251N319O199O907P297P508Q011R150J0545J1430J1672J2117J3672J6342
$$ 424251 429570 435769 442676 449973 457481 465492 474642 485187 496617 508289 520406 534078 550420
63550E50420J9431K2428K5290K7979L0195L1613L1941L0676K7254K1706J4934
$$ 550420 569851 592279 617569 645548 675743 707356 739297 769973 797227 818933 833867
63539H33867Q080J905l100o448q032q560r005r545r608q965q407q984j0937j3676
$$ 833867 841947 843852 840752 834304 826272 817712 808707 799162 789554 780589 772182 763198 752261 738585
63525G38585j6568j9329k1756k3558k4633k5259k5742k5963k5466k4039k2053
$$ 738585 722017 702688 680932 657374 632741 607482 581740 555777 530311 506272 484219
63514D84219k0217j8929j7971j6787j5079j3101j1344j0013q808p367n808m704
$$ 484219 464002 445073 427102 410315 395236 382135 370791 360778 351970 344603 338795 334091
63502C34091m415m605m539l854k842k063j867k315l142l727l442k287r12J89J173
$$ 334091 329676 325071 320532 316678 313836 311773 309906 307591 304449 300722 297280 294993 294081 294270 295443
63487B95443K226K857K474J480J013J528K337K779L069L572L896L424K386J612
$$ 295443 297669 300526 303000 304480 305493 307021 309358 312137 315206 318778 322674 326098 328484 330096
63473C30096J334R50O7r31j553j920k455l178l706l748l386k886k489k276k114
$$ 330096 331430 332380 332447 331516 329963 328043 325588 322410 318704 314956 311570 308684 306195 303919 301805
63458C01805j751j111m40q7n5J03R14K359L698M061L388K661K974M452O262P636
$$ 301805 300054 298943 298503 298416 298361 298464 299378 301737 305435 309496 312884 315545 318519 322971 329233 336869
63442C36869Q586R630J1134J3043J5030J6759J8161J9501K0993K2291K2633K1576
$$ 336869 345455 355085 366219 379262 394292 411051 429212 448713 469706 491997 514630 536206
63430E36206J9376J6576J3532J0562Q170O746O287O692Q106J0563J3551J6404
$$ 536206 555582 572158 585690 596252 604422 611168 617455 624147 632253 642816 656367 672771
63418F72771J9061K1868K4703K6860K7961K8292K7912K5974K1617J5338Q818L401
$$ 672771 691832 713700 738403 765263 793224 821516 849428 875402 897019 912357 921175 924576
63406I24576p93m139o570p831q325r040j0506j2289j3792j5177j7080j9626k2242
$$ 924576 923783 919644 913074 905243 896918 887878 877372 865083 851291 836114 819034 799408 777166
63393G77166k4506k6571k8481k9643k9494k8337k6903k5205k2644j9281j6226
$$ 777166 752660 726089 697608 667965 638471 610134 583231 558026 535382 516101 499875
63382D99875j4382j3366j2111j0161p884n744l894k296p57J017K986M595N485
$$ 499875 485493 472127 460016 449855 441971 436227 432333 430037 429280 430297 433283 437878 443363
63369D43363O237P739R947J1913J3116J4085J5486J7304J9245K1318K3495K5314
$$ 443363 449600 457339 467286 479199 492315 506400 521886 539190 558435 579753 603248 628562
63357F28562K6470K7482K9073L0957L1862L0777K7733K3395J8418J3266Q212L273
$$ 628562 655032 682514 711587 742544 774406 805183 832916 856311 874729 887995 896207 899480
63345H99480j450n339p604q290q475r126j0152j0997j1859j3602j6516j9733k2176
$$ 899480 898030 892691 885087 876797 868322 859196 849044 838047 826188 812586 796070 776337 754161
63332G54161k3661k4690k5481k5678k4999k3693k2140k0261j7656j4200j0286
$$ 754161 730500 705810 680329 654651 629652 605959 583819 563558 545902 531702 521416
63321E21416o556l623k078k329m180o749r051j0701j1901j2870j3499j3546j2988
$$ 521416 514860 511237 509159 506830 502650 495901 486850 476149 464248 451378 437879 424333 411345
63308D11345j2103j1261j0650j0121r334q133o723n433m396l618l192l138l104
$$ 411345 399242 387981 377331 367210 357876 349743 343020 337587 333191 329573 326381 323243 320139
63295C20139k604j723j205j616k593l246l183k790k535k347j907j277r03j035
$$ 320139 317535 315812 314607 312991 310398 307152 303969 301179 298644 296297 294390 293113 292210 291175
63281B91175j385j487j164n56J58P68R83O89K97M76J314K019J729N61m89n93J64
$$ 291175 289790 288303 287139 286583 286741 287509 288492 289181 289478 289954 291268 293287 295016 295577 295088 294495 294659
63264B94659J088J602J616J400J273J377J656K045K606L387M185M639M579M205
$$ 294659 295747 297349 298965 300365 301638 303015 304671 306716 309322 312709 316894 321533 326112 330317
63250C30317L916M067M786N843O749P196P456Q130R450J1014J2274J3158J4071
$$ 330317 334233 338300 343086 348929 355678 362874 370330 378460 387910 398924 411198 424356 438427
63237D38427J5435J7235J9010K0239K0837K1187K1664K2197K2492K2502K2380
$$ 438427 453862 471097 490107 510346 531183 552370 574034 596231 618723 641225 663605
63226F63605K2124K1652K1177K1046K1226K1382K1545K2106K2930K3072K1885
$$ 663605 685729 707381 728558 749604 770830 792212 813757 835863 858793 881865 903750
63215I03750J9849J7876J6106J4055J1572Q840N546R65m932j1080j6377k0619
$$ 903750 923599 941475 957581 971636 983208 992048 997594 998559 993627 982547 966170 945551
63203I45551k4044k6519k7764k8065k8035k7753k6642k4389k1451j8410j5272
$$ 945551 921507 894988 867224 839159 811124 783371 756729 732340 710889 692479 677207
63192F77207j1781q232n366l400j610Q11L769O484Q533J0281J2229J4359J6229
$$ 677207 665426 657194 651828 648428 646818 647629 651398 657882 666415 676696 688925 703284 719513
63179G19513J7492J8058J7988J7476J6893J6535J6322J5851J4875J3574J2380
$$ 719513 737005 755063 773051 790527 807420 823955 840277 856128 871003 884577 896957
63168H96957J1556J0859R589P048L094j690o385j0382j3633j6435j9051k1546
$$ 896957 908513 919372 928961 936009 939103 937413 931028 920646 907013 890578 871527 849981
63156H49981k3935k6250k8341k9604k9370k7733k5757k4413k3531k2219k0179
$$ 849981 826046 799796 771455 741851 712481 684748 658991 634578 611047 588828 568649
63145E68649j7996j6122j4291j2183j0071q379p048n850m915m452m257m014l767
$$ 568649 550653 534531 520240 508057 497986 489607 482559 476709 471794 467342 463085 459071 455304
63132D55304l616l159j950l00R87J668K224K954L587L916M205M610M803M490M007
$$ 455304 451688 448529 446579 446279 447266 448934 451158 454112 457699 461615 465820 470430 475233 479723 483730
63117D83730L920M251M438L972K945J990J755K312L002L115K643K166J988J817
$$ 483730 487650 491901 496339 500311 503256 505246 507001 509313 512315 515430 518073 520239 522227 524044
63103E24044J370Q64O42O12M00q9n33n75k33J20J09j44k9Q46J901K068J067j69
$$ 524044 525414 526278 526920 527532 527932 527843 527310 526735 526502 526622 526731 526587 526558 527404 529305 531373 532440 532271
63085E32271o13k38L34R40J951L336M318M269L637L579M695O404P646Q052Q199
$$ 532271 531658 531420 531754 532694 534645 537981 542299 546568 550205 553784 558479 564883 572529 580581 588780
63070E88780Q782R842J0885J1607J2195J3021J4237J5642J6841J7685J8663K0631
$$ 588780 597562 607404 618289 629896 642091 655112 669349 684991 701832 719517 738180 758811
63058G58811K3846K7496L0569L3037L5710L8968M2273M4985M7092M8901N0444
$$ 758811 782657 810153 840722 873759 909469 948437 990710 1035695 1082787 1131688 1182132
63047A182132N1557N2244N2687N3136N3852N4869N5661N5530N4517N3480N3039
$$ 1182132 1233689 1285933 1338620 1391756 1445608 1500477 1556138 1611668 1666185 1719665 1772704
63036A772704N2794N1959N0334M8211M5672M2413L8156L2785K6238J8456R378
$$ 1772704 1825498 1877457 1927791 1976002 2021674 2064087 2102243 2135028 2161266 2179722 2189100
63025B189100j120j2985k5394l6881m6394n3910n9748o3712o5516o5589o4735
$$ 2189100 2187980 2174995 2149601 2112720 2066326 2012416 1952668 1888956 1823440 1757851 1693116
63014A693116o3088o0059n5306m9210m2444l5546k8918k2705j6637j0368m042
$$ 1693116 1630028 1569969 1514663 1465453 1423009 1387463 1358545 1335840 1319203 1308835 1304793
63003A304793J886P314J2426J7083K0814K3475K5404K6803K7557K7783K8000K8490
$$ 1304793 1306679 1313993 1326419 1343502 1364316 1387791 1413195 1439998 1467555 1495338 1523338 1551828
62991A551828K8928K8932K8535K7820K6474K4183K1126J7703J3913R315L580l179
$$ 1551828 1580756 1609688 1638223 1666043 1692517 1716700 1737826 1755529 1769442 1778757 1782337 1779158
62979A779158j0544j8095k5640l3116m0186m6019m9858n1885n3119n4241n4888
$$ 1779158 1768614 1750519 1724879 1691763 1651577 1605558 1555700 1503815 1450696 1396455 1341567
62968A341567n4298n2312m9407m6031m2370l8632l5165l2255k9963k8144k6438
$$ 1341567 1287269 1234957 1185550 1139519 1097149 1058517 1023352 991097 961134 932990 906552
62957I06552k4458k2186k0125j8799j8195j7894j7603j7308j6960j6378j5549
$$ 906552 882094 859908 839783 820984 802789 784895 767292 749984 733024 716646 701097
62946G01097j4719j4135j3777j3454j3053j2514j1775j0782r638q633q044p857
$$ 701097 686378 672243 658466 645012 631959 619445 607670 596888 587250 578617 570573 562716
62934E62716p657o970n703m216k928j995j390j106j100j140r62n86l71o63j378
$$ 562716 555059 548089 542386 538170 535242 533247 531857 530751 529651 528511 527549 526963 526592 525929 524551
62919E24551j918j691q45l34r38k183k743k120j370j708k831l392k953k567l192
$$ 524551 522633 520942 520097 519763 518825 516642 513899 511779 510409 508701 505870 502478 499525 496958 493766
62904D93766m361m932m596l909l210k378j568j305j577j575p54L30P84N72L63
$$ 493766 489405 484473 479877 475968 472758 470380 468812 467507 465930 464355 463601 463931 464715 465287 465650
62889D65650M01K86j15k45L35J237J708J543J143Q22M78r3p53j084p44J66J121
$$ 465650 466051 466337 466222 465977 466312 467549 469257 470800 471943 472765 473243 473150 472397 471313 470569 470735 471856
62872D71856J588J434Q79J21p61j582k034k057j877j605j066k30N16Q16P61O65
$$ 471856 473444 474878 475757 475878 475117 473535 471501 469444 467567 465962 464896 464666 465182 465998 466759 467424
62856D67424O39Q00J440K604L639L793L087K231J685J358J079P93K42q82k276
$$ 467424 468063 468863 470303 472907 476546 480339 483426 485657 487342 488700 489779 490572 490814 489932 487656
62841D87656l046k647j475k91N00Q20O47R3n13r31j181j274j064n94k03n5J23
$$ 487656 484610 481963 480488 480197 480697 481517 482164 482257 481744 480813 479632 478358 477294 476700 476497 476442 476565
62824D76565O15J291J900K431K865K957K627K320K450K816K995L070L414L905
$$ 476565 477180 478471 480371 482802 485667 488624 491251 493571 496021 498837 501832 504902 508316 512221
62810E12221M027L731L591L930M405M672M946N558O372P017P451P854Q217Q429
$$ 512221 516248 519979 523570 527500 531905 536577 541523 547081 553453 560470 567921 575775 583992 592421
62796E92421Q722R571J1081J2830J4478J6235J8473K1122K3758K6295K9268L3257
$$ 592421 601143 610714 621795 634625 649103 665338 683811 704933 728691 754986 784254 817511
62784H17511L8278M3873M9630N5356O0817O5756P0232P4633P9130Q3199Q5912
$$ 817511 855789 899662 949292 1004648 1065465 1131221 1201453 1276086 1355216 1438415 1524327
62773A524327Q6647Q5345Q2178P7142P0045O0807M9665L7130K3647R433n318k0023
$$ 1524327 1610974 1696319 1778497 1855639 1925684 1986491 2036156 2073286 2096933 2106366 2101048 2081025
62761B081025l3753m5722n5670o3712o9991p4625p7831p9923q1092q1200p9809
$$ 2081025 2047272 2001550 1945880 1882168 1812177 1737552 1659721 1579798 1498706 1417506 1337697
62750A337697p6550p1720o6444o1932n8391n4953n0810m6172m1792l7919l4137
$$ 1337697 1261147 1189427 1122983 1061051 1002660 947707 896897 850725 808933 771014 736877
62739G36877l0199k6481k3491k1179j8990j6461j3710j1368j0030r514q869p328
$$ 736877 706678 680197 656706 635527 616537 600076 586366 574998 564968 555454 546585 539257
62727E39257n255l746l202k764j555j5O42K16jJ180L366N230O259P119Q458J0067
$$ 539257 534002 530256 527054 524290 522735 522720 523362 523578 523577 524757 528123 533353 539612 546731 555189 565256
62711E65256J1529J3045J5169J8023K1193K4210K6859K9240L1860L5386L9888
$$ 565256 576785 589830 604999 623022 644215 668425 695284 724524 756384 791770 831658
62700H31658M4528M8430N1615N4645N7600O0059O1933O3525O4663O4498O2402
$$ 831658 876186 924616 976231 1030876 1088476 1148535 1210468 1273993 1338656 1403154 1465556
62689A465556N8494N3071M6068L7382K7219J5865L643q667k0003k9974l9050m7463
$$ 1465556 1524050 1577121 1623189 1660571 1687790 1703655 1707298 1698631 1678628 1648654 1609604 1562141
62677A562141n4511n9473o2586o4527o5501o5430o4511o2785n9695n5042m9985
$$ 1562141 1507630 1448157 1385571 1321044 1255543 1190113 1125602 1062817 1003122 948080 898095
62666H98095m6070m3330m0380l6383l2002k8250k5357k3033k1112j9428j7701
$$ 898095 852025 808695 768315 731932 699930 671680 646323 623290 602178 582750 565049
62655E65049j5903j4350j3226j2362j1649j1113j0503r420q010o978o592o273
$$ 565049 549146 534796 521570 509208 497559 486446 475943 466523 458513 451535 444943 438670
62643D38670n494m503l750l131k289j275m13J78M99M26j5m54o25p50j043j213
$$ 438670 433176 428673 424923 421792 419503 418228 417815 417993 418492 418918 418903 418449 417824 417074 416031 414818
62627D14818r38n29n12p36n40K62J122J603J903K420L177L953M592M971M913M502
$$ 414818 413880 413351 412839 412103 411563 411825 412947 414550 416453 418873 422050 426003 430595 435566 440479 444981
62611D44981M341N111O758Q347R005Q960R293J0626J2347J3551J4374J5847J8473
$$ 444981 449322 454433 461191 469538 478543 487503 496796 507422 519769 533320 547694 563541 582014
62598E82014K1631K4562K7359L0465L3730L6506L8491L9892M0845M1111M0417
$$ 582014 603645 628207 655566 686031 719761 756267 794758 834650 875495 916606 957023
62587I57023L8672L5850L1885K6810K0765J3900O470j058q217j4885k1173k7005
$$ 957023 995695 1031545 1063430 1090240 1111005 1124905 1131375 1130317 1122100 1107215 1086042 1059037
62575A059037l1994l5785l8274l9482l9476l8500l7043l5582l4226l2674l0558
$$ 1059037 1027043 991258 952984 913502 874026 835526 798483 762901 728675 696001 665443
62564F65443k7930k5315k3170k1332j9220j6660j4152j2285j1064j0062q963p762
$$ 665443 637513 612198 589028 567696 548476 531816 517664 505379 494315 484253 475290 467528
62552D67528o644n843n453n182m573l642k965k825k691j974r38k87p6K87R64J396
$$ 467528 460884 455041 449588 444406 439833 436191 433226 430401 427710 425736 424798 424511 424435 424722 425686 427082
62536D27082J172O18K77L01O02J120J629J765J586J801L003M934O862Q499J0097
$$ 427082 428254 428872 429149 429450 430052 431172 432801 434566 436152 437953 440956 445890 452752 461251 471348
62521D71348J1900J3893J6076J8505K1046K3500K6051K9110L2534L5361L6739
$$ 471348 483248 497141 513217 531722 552768 576268 602319 631429 663963 699324 736063
62510G36063L6926L6974L7470L7906L7323L5154L1363K6235K0379J4619R388M256
$$ 736063 772989 809963 847433 885339 922662 957816 989179 1015414 1035793 1050412 1059800 1064056
62498A064056j456p592j3084j7013j9357k0536k0705j9801j7957j5454j2432q970
$$ 1064056 1062600 1055008 1041924 1024911 1005554 985018 964313 944512 926555 911101 898669 889699
62486H89699n296j645J964N558R043J2459J6104J9952K3183K4795K4609K3224
$$ 889699 884403 882758 884722 890280 899323 911782 927886 947838 971021 995816 1020425 1043649
62474A043649K1033J7892J3751R014M026j343p330j3736k0010k5624l0215l3616
$$ 1043649 1064682 1082574 1096325 1105339 1109365 1108022 1100692 1086956 1066946 1041322 1011107 977491
62462I77491l5916l7321l7900l7659l6844l5786l4389l2208k9129k5626k2145
$$ 977491 941575 904254 866354 828695 791851 756065 721676 689468 660339 634713 612568
62451F12568j8724j5419j2652j0693r141p356n203l016r80R80K860M471N660O371
$$ 612568 593844 578425 565773 555080 545939 538583 533380 530364 529384 530364 533224 537695 543355 549726
62437E49726O577O427O306O400O278N296L372J040j200l256n158o832q253r534
$$ 549726 556303 562730 569036 575436 581714 587010 590382 591422 590222 586966 581808 574976 566723 557189
62423E57189j0653j1374j1581j1506j1436j1317j0839r804q367o907n802n214
$$ 557189 546536 535162 523581 512075 500639 489322 478483 468679 460312 453405 447603 442389
62411D42389n052n122n273n368n244m805m167l515k899k257j615j104p17l27M5
$$ 442389 437337 432215 426942 421574 416330 411525 407358 403843 400944 398687 397072 395968 395251 394924 394969
62396C94969J62j1n7M48J334J927J871J536J464J606J477J013Q39J514K781L913
$$ 394969 395131 395120 395063 395511 396845 398772 400643 402179 403643 405249 406726 407739 408578 410092 412873 416786
62380D16786M600N133N767O334O612O713O895P154P272P238P433Q330R977J1771
$$ 416786 421386 426519 432286 438620 445232 451945 458840 465994 473266 480504 487937 496267 506244 518015
62366E18015J2955J3532J4409J6364J9074K1676K4146K7305L1352L5335L8494
$$ 518015 530970 544502 558911 575275 594349 616025 640171 667476 698828 734163 772657
62355G72657M1310M4462M7252M8124M6537M3400L9641L5201K9681K3248J6469
$$ 772657 813967 858429 905681 953805 1000342 1043742 1083383 1118584 1148265 1171513 1187982
62344A187982R747L285k691q069j3022j7809k2409k6441k9345l0775l0978l0656
$$ 1187982 1197729 1201014 1198323 1190254 1177232 1159423 1137014 1110573 1081228 1050453 1019475 988819
62332I88819l0199k9220k7196k4378k1523j8890j6194j3604j2026j2042j3131
$$ 988819 958620 929400 902204 877826 856303 837413 821219 807615 795589 783547 770416
62321G70416j4278j4962j5309j5737j6699j8288j9835k0369j9730j8734j7976
$$ 770416 756138 741176 725867 710130 693431 675143 655308 634939 615209 596475 578499
62310E78499j7101j5662j4019j2757j1811j0811r821q999p960o383m856m217m203
$$ 578499 561398 545736 531717 518960 507149 496338 486517 477518 469558 463175 458319 454102 449899
62297D49899l749k590j550j129p99m3Q11J245J372J608K020K479L021L628M028
$$ 449899 446150 443560 442010 440881 440082 440039 440850 442095 443467 445075 447095 449574 452595 456223 460251
62282D60251M105M161M475M885N123N229N262N067M718M843O007P903R637J0718
$$ 460251 464356 468517 472992 477877 483000 488229 493491 498558 503276 508119 514126 522029 531666 542384
62268E42384J1414J2294J3735J5797J8261K0810K3414K6371K9798L3342L6708
$$ 542384 553798 566092 579827 595624 613885 634695 658109 684480 714278 747620 784328
62257G84328M0174M4104M8142N1425N3517N4572N4544N2859M9134M3751L7313
$$ 784328 824502 868606 916748 968173 1021690 1076262 1130806 1183665 1232799 1276550 1313863
62246A313863K9966K1691J3053N060j899q468j5452k2817k9854l6131m1697m6425
$$ 1313863 1343829 1365520 1378573 1383633 1381734 1373266 1357814 1334997 1305143 1269012 1227315 1180890
62234A180890m9725n1245n1413n0825m9471m7039m3754m0256l6792l3181k9561
$$ 1180890 1131165 1079920 1028507 977682 928211 881172 837418 797162 760370 727189 697628
62223F97628k6403k3674k0782j7612j4928j3267j2095j0643r001p768p077o642
$$ 697628 671225 647551 626769 609157 594229 580962 568867 558224 549223 541455 534378 527736
62211E27736o369o189n633m316k679j586j275j362j618k004k049j140N62K216
$$ 527736 521367 515178 509545 505229 502550 500964 499689 498327 496709 494705 492656 491516 492078 494294
62197D94294L391M338N124N395N244N438O390P548Q311Q827R425R836R657R156
$$ 494294 497685 502023 507147 512542 517786 523224 529614 537162 545473 554300 563725 573561 583218 592374
62183E92374Q959R132R193Q828Q141P325O459N678N175N041N270N870O881Q427
$$ 592374 601333 610465 619658 628486 636627 643952 650411 656089 661264 666305 671575 677445 684326 692753
62169F92753J0709J3696J6884J9810K2798K6525L0728L3959L5123L4573L3173
$$ 692753 703462 717158 734042 753852 776650 803175 833903 867862 902985 937558 970731
62158I70731L0889K7095K1936J6512J1736P588L511r10n649j0211j4019j7009
$$ 970731 1001620 1028715 1050651 1067163 1078899 1086487 1089998 1089088 1083439 1073228 1059209 1042200
62146A042200j9690k2297k4224k4842k4463k3852k3066k1535j9158j6540j4083
$$ 1042200 1022510 1000213 975989 951147 926684 902832 879766 858231 839073 822533 808450
62135H08450j1573q925o600n005l930k878j665m51M33O33P5p41j066o21K69J208
$$ 808450 796877 787952 781352 776347 772417 769539 767874 767423 767856 768489 768564 767823 766757 766136 766405 767613
62119G67613K061K759L230L487L374K335M3k771m828n710o109o577o857o781o932
$$ 767613 769674 772433 775663 779150 782524 784859 784902 782131 777303 771593 765484 758907 752050 745269 738337
62104G38337p856r244j0457j1273j1605j1057r508p654o202m868k941n88J211
$$ 738337 730481 721237 710780 699507 687902 676845 667337 659683 653481 648613 645672 645084 646295
62091F46295J945K042K126K443L083M013M834N114N080N430O345P290P999Q947
$$ 646295 648240 650282 652408 654851 657934 661947 666781 671895 676975 682405 688750 696040 704039 712986
62077G12986J0575J2571J4344J5762J6960J7821J8143J8133J8241J8588J8961
$$ 712986 723561 736132 750476 766238 783198 801019 819162 837295 855536 874124 893085
62066H93085J9380K0225K1720K3471K4668K4703K3609K1987K0443J8949J6804
$$ 893085 912465 932690 954410 977881 1002549 1027252 1050861 1072848 1093291 1112240 1129044
62055A129044J3421R037M514M27l404p370j1349j4832j7679k0428k3611k7076
$$ 1129044 1142465 1151502 1156016 1156443 1153039 1145669 1134320 1119488 1101809 1081381 1057770 1030694
62043A030694l0174l2493l4024l4724l4416l3292l2071l1262l0561k9337k7441
$$ 1030694 1000520 968027 934003 899279 864863 831571 799500 768238 737677 708340 680899
62032F80899k5249k3029k0849j8913j7490j6415j5172j3573j1918j0407q909p486
$$ 680899 655650 632621 611772 592859 575369 558954 543782 530209 518291 507884 498975 491489
62020D91489o634o626o979o993o597o226o105n983n535m646l398k061r94k98L62
$$ 491489 484855 478229 471250 464257 457660 451434 445329 439346 433811 429165 425767 423706 422712 422414 422776
62005D22776J286K215K653K612K629L091L944N036O194O900O466M891L101J981
$$ 422776 424062 426277 428930 431542 434171 437262 441206 446242 452436 459336 465802 470693 473794 475775
61991D75775J463R41K56l00p58j597l000m552n811o802p655q117p861p029o166
$$ 475775 477238 478179 478435 478135 477377 475780 472780 468228 462417 455615 447960 439843 431982 424953 418787
61976D18787n596n194m731m135l420k577j703r47l22K87P76P39q8j410k511k801
$$ 418787 413191 407997 403266 399131 395711 393134 391431 390484 390162 390449 391225 391964 391876 390466 387955 385154
61960C85154k140q87K90P99N88Q0l95q44j082m43J371L412M300L934L586M121
$$ 385154 383014 382127 382417 383216 383804 383884 383489 382645 381563 381120 382491 385903 390203 394137 397723 401844
61944D01844M999N507O040P263Q612Q867Q029P527Q327R797J0741J0794J0319
$$ 401844 406843 412350 418390 425653 434265 443132 451161 458688 467015 476812 487553 498347 508666
61931E08666R616Q796Q041P430O799O087N445M756L540J752J23p85j400k313l185
$$ 508666 518282 527078 535119 542549 549348 555435 560880 565636 569176 570928 571051 570266 568866 566553 563368
61916E63368l273k640j956j323k47J298K778M063N515O980P785Q055Q806J0226
$$ 563368 560095 557455 555499 554176 553929 555227 558005 562068 567583 574563 582348 590403 599209 609435
61902F09435J0897R625P081M710K698K62k599m958o453p647q726r054q392p643
$$ 609435 620332 629957 637038 641748 644446 644708 642109 637151 630698 623051 614325 605271 596879 589236
61888E89236p761q533r023q764q060p379o927o681o490o279o232o582p186p584
$$ 589236 581475 572942 563919 555155 547095 539716 532789 526108 519618 513339 507107 500525 493339 485755
61874D85755p569p288o702n482l754k443k331k996l208k248m77J307K632L481
$$ 485755 478186 470898 464196 458714 454960 452517 450186 447190 443982 441734 441257 442564 445196 448677
61860D48677M077M734N719P060Q515R759J0629J1335J2426J4328J6748J8718J9458
$$ 448677 452754 457488 463207 470267 478782 488541 499170 510505 522931 537259 554007 572725 592183
61847E92183J9109J8446J8008J7685J7083J5969J4331J2194R510O226K521j046
$$ 592183 611292 629738 647746 665431 682514 698483 712814 725008 734518 740744 743265 742219
61835G42219l817n556o583p203p284o535n067l338j634J21K043M006N715O889
$$ 742219 738402 732846 726263 719060 711776 705241 700174 696836 695202 695323 697366 701372 707087 713976
61821G13976P362P133O381N197L383O35k959o755r932j2014j3167j4011j5052
$$ 713976 721338 728471 734852 740049 743432 744067 741108 734353 724421 712407 699240 685229 670177
61808F70177j6165j6748j6510j5872j5330j4695j3422j1583r973r125q715q135
$$ 670177 654012 637264 620754 604882 589552 574857 561435 549852 539879 530754 522039 513904
61796E13904p333o700o385o101n537m718l964l547l392l090k389j643j473j887
$$ 513904 506571 499871 493486 487385 481848 477130 473166 469619 466227 463137 460748 459105 457632 455745
61782D55745k203k042j946k512l337l476k794k122j985j989j650j128p11k14M52
$$ 455745 453542 451500 449554 447042 443705 440229 437435 435313 433328 431339 429689 428561 427850 427636 428088
61767D28088O41k67j629j999q81P07J631J885K100K464K647K461K001J349O20
$$ 428088 428729 428462 426833 424834 423953 424660 426291 428176 430276 432740 435387 437848 439849 441198 441818
61752D41818J39J34L41L40J42O9P0k53r84j744k311k841l250k975j821o22m76
$$ 441818 441957 442091 442432 442772 442914 442983 443053 442800 441816 440072 437761 434920 431670 428695 426874 426252 425776
61735D25776j358k049j499P6J567K141J843J212O64L31L10P47J546K205K243J778
$$ 425776 424418 422369 420870 420946 422513 424654 426497 427709 428373 428704 429014 429761 431307 433512 435755 437533
61719D37533J429J577J910J844J237N15J52K17L41J38m34j065j470j650j740j727
$$ 437533 438962 440539 442449 444293 445530 446045 446197 446414 446755 446893 446459 445394 443924 442274 440534 438807
61703D38807j600j628k118k855l192k914k683l238m326m911m404l430l135l906
$$ 438807 437207 435579 433461 430606 427414 424500 421817 418579 414253 409342 404938 401508 398373 394467
61689C94467m981n294m553l386k566k297k292k184j721q71o3jq58j820j927j227
$$ 394467 389486 384192 379639 376253 373687 371390 369098 366914 365193 364322 364259 364258 363400 361580 359653 358426
61673C58426n54l08j71k0k87j061j669j584j174j026j070r32o65m78j44O08J466
$$ 358426 357872 357564 357393 357373 357086 356025 354356 352772 351598 350572 349502 348570 347905 347427 347283 347891 349357
61656C49357J894J941K023K153K045J785J671J551J066M58L96R73J648K152K685
$$ 349357 351251 353192 355215 357368 359413 361198 362869 364420 365486 365944 366340 367313 368961 371113 373798
61641C73798L101K797J668M65j64l28k95j1L95K90o01j582j887j761j965k519
$$ 373798 376899 379696 381364 381829 381665 381337 381042 381031 381426 381716 381115 379533 377646 375885 373920 371401
61625C71401k723k329j912j927k003j505n01K42J24o17j225j270j033j017j290
$$ 371401 368678 366349 364437 362510 360507 359002 358501 358743 358867 358250 357025 355755 354722 353705 352415
61610C52415j581j825k189k615k781k715k935l655m257l992l002k232k331l007
$$ 352415 350834 349009 346820 344205 341424 338709 335774 332119 327862 323870 320868 318636 316305 313298
61596C13298l514l489l147k819k533k141j721j571j714j700j201n31k53m04n39
$$ 313298 309784 306295 303148 300329 297796 295655 293934 292363 290649 288949 287748 287217 286964 286560 286021
61581B86021m42l15k68j55L7R5k3j58l72q90j478j510q72k32j24l09l45k49j16
$$ 286021 285579 285264 284996 284841 284878 284973 284950 284792 284420 283530 282052 280542 279670 279438 279314 279005 278660 278411 278295
61562B78295K59R07J310J103P92J097J933K560K541J974J111L09J03O67J329J258
$$ 278295 278554 279461 280771 281874 282666 283763 285696 288256 290797 292771 293882 294191 294294 294961 296290 297548
61546B97548N56R3L62J012J439J332P22M2J2Q54J696J381r6j525j867j111J66
$$ 297548 298104 298197 298559 299571 301010 302342 303064 303106 303118 303972 305668 307049 306953 305428 303561 302450 302616
61529C02616J420K140K016J333P55M60l0r61j847k185k140k115k067j676r80m05
$$ 302616 304036 306176 308192 309525 310280 310740 310710 309749 307902 305717 303577 301462 299395 297719 296739 296334
61513B96334k53m03m54q2O24J123R71L84mO5K75L65M43N27L28k12n51j59P62J416
$$ 296334 296081 295678 295224 295142 295766 296889 297860 298244 298240 298305 298580 298945 299388 299915 300243 300031 299480 299321 300083 301499
61493C01499J170j1j595k678k467r98P38J627J404O86J93J85N20J023J599K119
$$ 301499 302669 302658 301063 298385 295918 294920 295658 297285 298689 299375 299568 299753 300273 301296 302895 305014
61477C05014K271J798R59M85P94J392J481R82M53J82j8j13K39Q68R84L00m35m98
$$ 305014 307285 309083 310042 310527 311321 312713 314194 315176 315629 315811 315793 315680 315919 316787 317771 318071 317636 317138
61459C17138j76q2j21J84P15R35P87O45N74L51J48L98R48J101O08N4pL13O80J058
$$ 317138 316962 316880 316759 316943 317658 318593 319380 320025 320599 320950 321098 321496 322444 323545 324153 324207 324200 324513 325193 326251
61439C26251J467J679J542J294J191J063O24kl73k91N5L58M84M33K69J13J47M99
$$ 326251 327718 329397 330939 332233 333424 334487 335111 335109 334736 334445 334500 334858 335342 335775 336044 336157 336304 336803
61421C36803J095J616J709J372R62P24M40j42o80m88M71J363J426Q19J85k58p96
$$ 336803 337898 339514 341223 342595 343557 344281 344721 344579 343899 343411 343882 345245 346671 347490 347675 347417 346621
61404C46621j514k065k141j809j256n52J14L47m2o58r35q07o54o29m95j15K50
$$ 346621 345107 343042 340901 339092 337836 337284 337398 337745 337703 337045 336110 335303 334649 334020 333525 333410 333660
61387C33660M06N51Q51J022P62L29K32M52N85O42J051J776K121J779J359J434
$$ 333660 334066 334617 335468 336490 337252 337581 337813 338265 338850 339492 340543 342319 344440 346219 347578 349012
61371C49012J615J217M62K73Q98J560J538J112J102J807K672K889K191J112M99
$$ 349012 350627 351844 352306 352579 353477 355037 356575 357687 358789 360596 363268 366157 368348 369460 369959
61356C69959P71J735L016M408N644O283O100N470M964M815M962N290N489N043
$$ 369959 370730 372465 375481 379889 385533 391816 397916 403386 408350 413165 418127 423417 428906 433949
61342D33949L925K935K759K986K729K054J843K303K608K153J303N53j80j003j597
$$ 433949 437874 440809 443568 446554 449283 451337 453180 455483 458091 460244 461547 462100 461920 460917 459320
61327D59320j780j855j906j479n53ml26n99K40J673K300J924J713K344L188L630
$$ 459320 457540 455685 453779 452300 451747 451743 451417 450818 451058 452731 455031 456955 458668 461012 464200 467830
61311D67830M080N200O913Q735J0410J1778J2599J2981J3495J4232J4259J2688
$$ 467830 471910 477110 484023 492758 503168 514946 527545 540526 554021 568253 582512 595200
61299E95200R996P579O173N269M032K247K46j566k979m054n111o377p600q322
$$ 595200 605196 612775 618948 624217 628249 630496 630742 629176 626197 622143 617032 610655 603055 594733
61285E94733q586r020r972j0839j0641r194p351n993n082m009k649j679j638k055
$$ 594733 586147 577127 567155 556316 545675 536481 529130 523137 518055 514046 511397 509718 508080 506025
61271E06025j913q82L09Q01N95L94O93J369K028K460K681K842L208M038N253O258
$$ 506025 504112 503230 503539 504340 504935 505329 506022 507391 509419 511879 514560 517402 520610 524648 529901 536159
61255E36159O311N241L683K489J917J605J282J145J381J630J379O73pn17j174
$$ 536159 542470 547711 551394 553883 555800 557405 558687 559832 561213 562843 564222 564895 564888 564371 563197
61240E63197k024k591k560k296k249k258j845r23J83J170J752J593P89L34J327
$$ 563197 561173 558582 556022 553726 551477 549219 547374 546451 546634 547804 549556 551149 551938 552272 553599
61225E53599L669O048P358P627P484P378P586Q379R578J0360J0063Q999Q031P562
$$ 553599 557268 563316 570674 578301 585785 593163 600749 609128 618706 629066 639129 648128 656159 663721
61211F63721P383P372P633P937P603O301M622L526L370L719M023M196M561N427
$$ 663721 671104 678476 686109 694046 701649 707950 712572 716098 719468 723187 727210 731406 735967 741394
61197G41394O801Q430J0033J1464J2611J3299J3338J2728J1661J0285Q549O395
$$ 741394 748195 756625 766658 778122 790733 804032 817370 830098 841759 852044 860593 866988
61185H66988M092K194J003J77r25k452l887m794n473o484p735q554q712q842r567
$$ 866988 871080 873274 874277 874454 873529 871077 867190 862396 856923 850439 842704 834150 825438 816596 807029
61170H07029j0651j1378j1450j1104j0631j0283j0460j1454j2878j3873j3948
$$ 807029 796378 785000 773550 762446 751815 741532 731072 719618 706740 692867 678919
61159F78919j3322j2396j1317j0204r385r070r041q848q136o680m474k002j57
$$ 678919 665597 653201 641884 631680 622295 613225 604184 595336 587200 580520 576046 574044 573887
61146E73887M79R6q06k032l516m831n414n279m989m824m401l277j596J02J408
$$ 573887 574366 574462 573656 571624 568108 563277 557863 552584 547595 542771 538370 535093 533497 533599 535007
61131E35007K156K339K306K868M641P232R454J0544J0904J1476J2667J4233J5942
$$ 535007 537163 539502 541808 544676 549317 556549 566003 576547 587451 598927 611594 625827 641769
61118F41769J7829J9835K1631K3040K4253K5397K6181K6285K5892K5448K5014
$$ 641769 659598 679433 701064 724104 748357 773754 799935 826220 852112 877560 902574
61107I02574K4228K2852K0981J8744J6228J3725J1613R774P486M233L91l160o006
$$ 902574 926802 949654 970635 989379 1005607 1019332 1030945 1040719 1048205 1052438 1052829 1049669 1043663
61094A043663q513j1277j4440j7553j9927k1225k1766k2223k2930k3611k3762
$$ 1043663 1035150 1023873 1009433 991880 971953 950728 928962 906739 883809 860198 836436
61083H36436k3148k1833j9999j7927j5959j4352j3216j2598j2363j1948j0665
$$ 836436 813288 791455 771456 753529 737570 723218 710002 697404 685041 673093 662428
61072F62428q504o279m661l429k084p66J9L81R97K137L385M417N445O638P688
$$ 662428 653924 647645 642984 639555 637471 636705 636724 637105 638102 640239 643624 648041 653486 660124 667812
61057F67812Q313Q804R659J0951J2349J3621J4795J5958J7155J8392J9610K0818
$$ 667812 676125 684929 694588 705539 717888 731509 746304 762262 779417 797809 817419 838237
61045H38237K2277K4337K6923K9426L1340L2689L3697L4418L5040L6202L8443
$$ 838237 860514 884851 911774 941200 972540 1005229 1038926 1073344 1108384 1144586 1183029
61034A183029M1369M3955M5741M7320M9453N2121N4593N6270N7152N7700N8630
$$ 1183029 1224398 1268353 1314094 1361414 1410867 1462988 1517581 1573851 1631003 1688703 1747333
61023A747333O0756O4727P0605P7812Q5661R3966J03015J13016J23964J36384
$$ 1747333 1808089 1872816 1943421 2021233 2106894 2200860 2303875 2416891 2540855 2677239
61013B677239J51969J73079K01596K38557K84869L41870M11111M94110N92661
$$ 2677239 2829208 3002287 3203883 3442440 3727309 4069179 4480290 4974400 5567061
61004E567061P08968Q45257J003574J185129J385735J586149J744521J803341
$$ 5567061 6276029 7121286 8124860 9309989 10695724 12281873 14026394 15829735
60996A5829735J714929J471885J119658P39503M12988J92019Q9127Q3055J26824
$$ 15829735 17544664 19016549 20136207 20875710 21288698 21480717 21569844 21652899 21779723
60987B1779723J55550J02496p4106l68098p26324j075932j358410j547165j642809
$$ 21779723 21935273 22037769 21963663 21595565 20869241 19793309 18434899 16887734 15244925
60978A5244925j658146j607337j503803j362401j200138j033750q76266p35234
$$ 15244925 13586779 11979442 10475639 9113238 7913100 6879350 6003084 5267850
60970E267850o13397n10570m25232l55497k99452k55025k19718j91002j67182
$$ 5267850 4654453 4143883 3718651 3363154 3063702 2808677 2588959 2397957 2230775
60961B230775j47590j31667j18213j05921r4346q3829p4640o6666n9770n3927
$$ 2230775 2083185 1951518 1833305 1727384 1633038 1549209 1474569 1407903 1348133 1294206
60951A294206m8959m4694m1329l9096l7528l5652l3168l0798k9147k7771k5898
$$ 1294206 1245247 1200553 1159224 1120128 1082600 1046948 1013780 982982 953835 926064 900166
60940I00166k3603k1698k0651k0190j9852j9425j8817j7982j7060j6277j5627
$$ 900166 876563 854865 834214 814024 794172 774747 755930 737948 720888 704611 688984
60929F88984j4965j4304j3738j3071j1944j0393q879p686o676n746n087m798m606
$$ 688984 674019 659715 645977 632906 620962 610569 601690 594004 587328 581582 576495 571697 567091
60916E67091m274l904l578l032k121j260r03q29m98K4J27k95n32o1P34J122R62
$$ 567091 562817 558913 555335 552303 550182 548922 548019 547190 546692 546716 546843 546548 546016 545955 546689 547811 548773
60899E48773O16L21P8p0j21m00j210k233k726k467k082k271l038l937m795n780
$$ 548773 549389 549710 549788 549718 549597 549197 547987 545754 543028 540561 538479 536208 533170 529233 524438 518658
60883E18658o900p808q184q077p771p445p109o752o434o168n780n038l945k876
$$ 518658 511758 503950 495766 487689 479918 472473 465364 458612 452178 446010 440230 435192 431247 428371
60869D28371k261k153k245k299k346k381k142j417m17M56J167J969K792L103K611
$$ 428371 426110 423957 421712 419413 417067 414686 412544 411127 410710 411166 412333 414302 417094 420197 422808
60854D22808J797J403J546J726J628J570J966K634K944K501J587Q50P18J091J469
$$ 422808 424605 426008 427554 429280 430908 432478 434444 437078 440022 442523 444110 444960 445678 446769 448238
60839D48238J357O13n02j613k450k876k826k405j951j779j807j614j005l82l62
$$ 448238 449595 450208 449706 448093 445643 442767 439941 437536 435585 433806 431999 430385 429380 428998 428636
60824D28636j074k002k536k528k273k115k118k087j827j498j637k633m078m905
$$ 428636 427562 425560 423024 420496 418223 416108 413990 411903 410076 408578 406941 404308 400230 395325
60810C95325m431l174k344k512l118l351l145l082l456l924m037l795l472l127
$$ 395325 390894 387720 385376 382864 379746 376395 373250 370168 366712 362788 358751 354956 351484 348357
60796C48357k604j949j533j612j993k237k117j733j288r50q24q40o55N2J077J796
$$ 348357 345753 343804 342271 340659 338666 336429 334312 332579 331291 330341 329517 328677 328022 328074 329151 330947
60780C30947J829J467J184J084R73Q56R72J436K126K900L675M272M441M089L335
$$ 330947 332776 334243 335427 336511 337484 338340 339312 340748 342874 345774 349449 353721 358162 362251 365586
60765C65586K424J718J595J988K191J536L01n17m09J02K16k94j109j839k161j955
$$ 365586 368010 369728 371323 373311 375502 377038 377339 376822 376413 376515 376731 376437 375328 373489 371328 369373
60749C69373j509j273j170o22M20J020L96r62j931k200k373k821l306l726m358
$$ 369373 367864 366591 365421 364799 365219 366239 366635 365673 363742 361542 359169 356348 353042 349316 344958
60734C44958n139n432m923m189l951m095l900k961j578l73J81L8l55m04K2M66
$$ 344958 339819 334387 329464 325275 321324 317229 313329 310368 308790 308417 308598 308636 308281 307877 307899 308365
60718C08365M92K39J10J88K28J20L9J27L15N40R36J615K322K560K141J541J404
$$ 308365 308857 309096 309206 309394 309622 309742 309781 309908 310223 310763 311699 313314 315636 318196 320337 321878 323282
60701C23282J732J900J623J467J996K800L011K590K375K760L062K534J390M27
$$ 323282 325014 326914 328537 330004 332000 334800 337811 340401 342776 345536 348598 351132 352522 352949
60687C52949N7J99P13J393J773J464P38L32O54J369J827J680J119O01L27J6o56
$$ 352949 353006 353205 353918 355311 357084 358548 359286 359618 360272 361641 363468 365148 366267 366868 367195 367211 366555
60670C66555j466j841j676j513j716k021k125k239k585k838k612k201k131k209
$$ 366555 365089 363248 361572 360059 358343 356322 354197 351958 349373 346535 343923 341722 339591 337382
60656C37382j722n52N54R94J007J185J679K109K114J762J523J750K147J907O59
$$ 337382 335660 335108 335662 336656 337663 338848 340527 342636 344750 346512 348035 349785 351932 353839 354498
60641C54498r26j832j836j575j605j883k130k181j886j141j80M73M83L5m03l99
$$ 354498 353572 351740 349904 348329 346724 344841 342711 340530 338644 337503 337323 337796 338279 338314 337911 337512
60625C37512J58Q54R68L15l20j06O25P82O9n96m53O7J04m13q59r00q37j084j639
$$ 337512 337670 338524 339492 339807 339487 339381 340006 340788 340857 340261 339808 339875 339979 339566 338707 337807 336970 335886 334247
60606C34247k049j713m27J261K469K814K633K277J684Q35J49L9L35N51N09L91
$$ 334247 332198 330485 330058 331319 333788 336602 339235 341512 343196 344031 344180 344219 344554 345105 345614 346005
60590C46005L87N50Q83J225J285R62N44L01K11K24N41J232J839J844J432J379
$$ 346005 346392 346942 347825 349050 350335 351297 351841 352142 352353 352577 353118 354350 356189 358033 359465 360844
60574C60844K183L555M804N483N718O092P085Q486R507R656R275Q925Q566P726
$$ 360844 363027 366582 371386 376869 382587 388679 395764 404250 413757 423413 432688 441613 450179 457905
60560D57905O250M409K347pk429m272n077n013m539l902l097k095r13L43J396
$$ 457905 464155 468564 470911 470904 468475 464203 459126 454113 449574 445672 442575 440480 439567 439910 441306
60545D41306J953K096K406L510N477P740R567J0636J1250J1970J3007J3956J4156
$$ 441306 443259 445355 447761 451271 456748 464488 474055 484691 495941 507911 520918 534874 549030
60532E49030J3355J1896J0288Q669O737M206J279j414l400m764n850o720p152
$$ 549030 562385 574281 584569 593238 599975 604181 605460 604046 600646 595882 590032 583312 576160
60519E76160p104o820o423n789m955m237l752l122k007o31N53J453K289L217M449
$$ 576160 569056 562236 555813 550024 545069 540832 537080 533958 531951 531320 531873 533326 535615 538832 543281
60504E43281O451R457J2886J5820J8106K0456K3392K6636K9708L2620L5529L8039
$$ 543281 549732 559189 572075 587895 606001 626457 649849 676485 706193 738813 774342 812381
60492H12381L9297L8726L6445L2932K8527K3283J7213J0596L921k510q763j4968
$$ 812381 851678 890404 926849 959781 988308 1011591 1028804 1039400 1043321 1040811 1032048 1017080
60480A017080k0986k6560l1641l6204l9822m1809m1913m0545l8269l5359l2010
$$ 1017080 996094 969534 937893 901689 861867 820058 778145 737600 699331 663972 631962
60469F31962k8645k5676k3117k0656j8069j5428j3002j1103r895r202q570p676
$$ 631962 603317 577641 554524 533868 515799 500371 487369 476266 466371 457169 448599 440923
60457D40923o657n911n608n463n029m117k978k092j775j928k174k228k116k028
$$ 440923 434266 428355 422747 417284 412255 408138 405160 403068 401293 399365 397191 394963 392847 390819
60443C90819k036k020j879j676j558j523j420j178r57r33r74p98l88m8J02L10
$$ 390819 388783 386763 384884 383208 381650 380127 378707 377529 376572 375639 374665 373867 373479 373431 373533 373843
60427C73843P59J149J061N14q9m77p07q23p22l67J25O35J089J336J213Q31N89
$$ 373843 374602 375751 376812 377326 377237 376760 376053 375230 374508 374141 374266 374901 375990 377326 378539 379370 379959
60410C79959P60J199J500J428J101Q60R54J298J553J472J158R22R86J361J907
$$ 379959 380719 381918 383418 384846 385947 386807 387761 389059 390612 392084 393242 394164 395150 396511 398418
60395C98418K385K623K707K821K877K570K019J879K435K993K779K132K074K782
$$ 398418 400803 403426 406133 408954 411831 414401 416420 418299 420734 423727 426506 428638 430712 433494
60381D33494L316K995K275J949K186K750L537M340M561L879K870K429K683L053
$$ 433494 436810 439805 442080 444029 446215 448965 452502 456842 461403 465282 468152 470581 473264 476317
60367D76317L140L007K662J963J074M70L33M09O07J224K359L537M288M794N565
$$ 476317 479457 482464 485126 487089 488163 488633 488966 489375 489982 491206 493565 497102 501390 506184 511749
60352E11749O693P760Q367Q368P721O462M888L412K133P90p43k160l106l662m182
$$ 511749 518442 526202 534569 542937 550658 557120 562008 565420 567553 568343 567600 565440 562334 558672 554490
60337E54490m752n067m886m379l919l637l331k797k181j975k594l943n379o205
$$ 554490 549738 544671 539785 535406 531487 527850 524519 521722 519541 517566 514972 511029 505650 499445
60323D99445o165n506m658l917l356k815k044r22M88K093L818N400O440O990P808
$$ 499445 493280 487774 483116 479199 475843 473028 470984 470062 470550 472643 476461 481861 488301 495291 503099
60308E03099R569J1888J3671J4393J4429J4162J3481J2333J0994R275O278J634
$$ 503099 512668 524556 538227 552620 567049 581211 594692 607025 618019 627294 633572 635206
60296F35206l492p475j0014j2039j4060j5457j5524j4403j2755j1020r274p507
$$ 635206 631714 624239 614225 602186 588126 572669 557145 542742 529987 518967 509693 502186
60284E02186n779m340l505l259l121k793k628l029l564l404k530j749j534j594
$$ 502186 496407 492067 488562 485303 482182 479389 476761 473732 470168 466764 464234 462485 460951 459357
60270D59357j669j903k226k152j653j469k032k753k904k719k851l224l111k177
$$ 459357 457688 455785 453559 451407 449754 448285 446253 443500 440596 437877 435026 431802 428691 426514
60256D26514q66J79O22M83J32R7N42J014J013O56M74P25J176J439J228N50j81
$$ 426514 425648 425827 426449 426932 427064 427161 427703 428717 429730 430386 430860 431585 432761 434200 435428 435978 435797
60239D35797l80N4N51O19M44M71O90P83O70N33M93O69J258K116K533K026J120
$$ 435797 435417 435471 436022 436641 437085 437556 438246 439029 439699 440232 440725 441394 442652 444768 447301 449327 450447
60222D50447P88J237J837K178K509L101L764M281M810N611O660P684Q323Q223
$$ 450447 451235 452472 454309 456487 458996 462097 465861 470142 474952 480563 487223 494907 503230 511453
60208E11453P349O280N859O381P320P954P986P529O790N951N125M326L558K987
$$ 511453 518802 525082 530941 537322 544642 552596 560582 568111 574901 580852 585977 590303 593861 596848
60194E96848K788K875K890K512J562jj885l383l930l783l801m422n238n667n663
$$ 596848 599636 602511 605401 607913 609475 609474 607589 604206 600276 596493 592692 588270 583032 577365 571702
60179E71702n535n405n178m887m737m776m729m243l276k214j555j431j521j481
$$ 571702 566167 560762 555584 550697 545960 541184 536455 532212 528936 526722 525167 523736 522215 520734
60165E20734j324j294j500j808j967j712r89j96M3l48o89m18J31K95J09J11L97
$$ 520734 519410 518116 516616 514808 512841 511129 510140 509944 509987 509639 508950 508532 508663 508958 509067 509178 509575
60148E09575N94P49J280J942J834Q60K61R70K160K399J803J925L600N879P367
$$ 509575 510169 510918 512198 514140 515974 516834 517095 518065 520225 522624 524427 526352 529952 535831 543198
60133E43198P737P452O754N668M609M209M464M634M164L263K442J844J380J169
$$ 543198 550935 558387 565141 570809 575418 579627 584091 588725 592889 596152 598594 600438 601818 602987
60119F02987J419J921K166J984J805K078K689L071K754J702L76m88m91r4k19j162
$$ 602987 604406 606327 608493 610477 612282 614360 617049 620120 622874 624576 624952 624464 623973 623879 623660 622498
60103F22498k274k937l389m048m544m170l170k652l067l519l036j903j164j204
$$ 622498 620224 617287 613898 609850 605306 601136 597966 595314 592247 588728 585692 583789 582625 581421
60089E81421j409j172o26l01m46q67j149r06m1J013J503J053J01o20r85j520k487
$$ 581421 580012 578840 578214 577913 577467 576600 575451 574545 574504 575517 577020 578073 578174 577554 576569 575049 572562
60072E72562l409l827m068m667n445n801n845o263o998p063o145n444o078p328
$$ 572562 569153 565326 561258 556591 551146 545345 539500 533237 526239 519176 513031 507587 501509 494181
60058D94181p498o118m299l076k418j919j504j125n68J67P99J359K262L530M541
$$ 494181 486683 480565 476266 473190 470772 468853 467349 466224 465656 465823 466622 467981 470243 473773 478314
60043D78314M863M824M920N143N273N420N757N989N610M581L414K555K016J541
$$ 478314 483177 488001 492921 498064 503337 508757 514514 520503 526113 530694 534108 536663 538679 540220
60029E40220R43J85p63k005l529m921n595n524n472o095p065p516p276p001p073
$$ 540220 541163 541348 540585 538580 535051 530130 524535 519011 513539 507444 500379 492863 485587 478586 471513
60014D71513p055o460n495m736m412m346m303m122l698k975k009r99l81n87j371
$$ 471513 464458 457998 452503 447767 443355 439009 434706 430584 426886 423911 421902 420903 420522 419935 418564
59999D18564j694q72M30J021Q02P33J292J935K235K471K804K841K528K514L043
$$ 418564 416870 415998 416428 417449 418251 418984 420276 422211 424446 426917 429721 432562 435090 437604 440647
59984D40647L324K691J635R44N20j33q87j276j374j549j767j841j952k206k176
$$ 440647 443971 446662 448297 449241 449761 449628 448741 447465 446091 444542 442775 440934 438982 436776 434600
59969D34600j676j486k299l383l320j841N4J557K590L092K899K434K430K835K852
$$ 434600 432924 431438 429139 425756 422436 420595 420649 422206 424796 427888 430787 433221 435651 438486 441338
59954D41338K208J472R74M16k57n27k36J3k16o10q48j099j395j270o05j56n71
$$ 441338 443546 445018 445992 446408 446151 445624 445388 445401 445185 444575 443727 442628 441233 439963 439358 439202 438631
59937D38631j453j934j789j405j079r15j027j265j024J11J717L044L886M496M913
$$ 438631 437178 435244 433455 432050 430971 430056 429029 427764 426740 426851 428568 431612 435498 439994 444907
59922D44907M959M769M710M750M433L565K515J708J168P32L82J79K9k26m51j90
$$ 444907 449866 454635 459345 464095 468528 472093 474608 476316 477484 478216 478598 478777 478806 478580 478129 477939
59906D77939Q22K146K931K819K361K286K557K559K071J618J719K275K836L062
$$ 477939 478761 480907 483838 486657 489018 491304 493861 496420 498491 500109 501828 504103 506939 510001
59892E10001K867K458K419L261M635N449N118M345M227M869N407N187M458L920
$$ 510001 512868 515326 517745 521006 525641 531090 536208 540553 544780 549649 555056 560243 564701 568621
59878E68621L970M429M706M239L010J612O37Q1n14j406k413l210l644l785l854
$$ 568621 572591 577020 581726 585965 588975 590587 591224 591305 590791 589385 586972 583762 580118 576333 572479
59863E72479m038m184l805k620j077l2J28q9J71J319K987M448N279N691O193O872
$$ 572479 568441 564257 560452 557832 556755 556723 556851 556762 556933 558252 561239 565687 570966 576657 582850 589722
59847E89722P222O687N338L773K460J374L21n90j006q50o60j147k385l668m368
$$ 589722 596944 603631 608969 612742 615202 616576 616897 616307 615301 614451 613791 612644 610259 606591 602223
59832F02223m679n180n846o058n605n051m917n011m906m599m268l823l182k739
$$ 602223 597544 592364 586518 580460 574855 569804 564887 559876 554970 550371 546103 542280 539098 536359
59818E36359k931l547m019m182m264m234l827l205k914l077l207l029k820k706
$$ 536359 533428 529881 525862 521680 517416 513182 509355 506150 503236 500159 496952 493923 491103 488397
59804D88397k282j340m57k75o25r41j148j498j740j313l25M17N21M75P20R27O25
$$ 488397 486115 484775 484318 484043 483418 482477 481329 479831 478091 476778 476453 476870 477391 477866 478586 479513 480138
59787D80138M2k73l14n29j060j609k001k279k297j766q62k42k57n43o44o17p26
$$ 480138 480180 479907 479593 479064 478004 476395 474394 472115 469818 468052 467190 466948 466691 466148 465504 464887 464161
59770D64161q63o93j19P03J675K635L171K929K155J607J839K740L688M113L978
$$ 464161 463298 462605 462486 463189 464864 467499 470670 473599 475754 477361 479200 481940 485628 489741 493719
59755D93719L864M418N535O383O474O355O771P496P631O952O196N964O018N941
$$ 493719 497583 502001 507536 513919 520393 526748 533519 541015 548646 555598 561794 567758 573776 579717
59741E79717N847O042O373O341N688M525L179K034J276O08m39j679k213j565n26
$$ 579717 585564 591606 597979 604320 610008 614533 617712 619746 621022 621630 621191 619512 617299 615734 615208
59726F15208l35j261k431l007k968k788k795k973l102k969k660k584k989l459
$$ 615208 614873 613612 611181 608174 605206 602418 599623 596650 593548 590579 587919 585335 582346 578887
59712E78887l280k408j647j686k218k366j832j239j228j560j418m76P17J430J557
$$ 578887 575607 573199 571552 569866 567648 565282 563450 562211 560983 559423 558005 557529 558246 559676 561233
59697E61233J478J434J349J167R43O45K63J14N24J116R73j29j209j290p65q35
$$ 561233 562711 564145 565494 566661 567604 568249 568512 568626 569150 570266 571239 571110 569901 568611 567846 567011
59681E67011j753k422j929q15m24j332k900m162m722m770m619m442m288m084l703
$$ 567011 565258 562836 560907 560092 559668 558336 555436 551274 546552 541782 537163 532721 528433 524349 520646
59666E20646l122k522k129j977j897j718j310n31N74J517J664J035M42N35J076
$$ 520646 517524 515002 512873 510896 508999 507281 505971 505440 506014 507531 509195 510230 510672 511207 512283
59651E12283J497J840K502L279L435K769J872J159L53p70j812k390k768l343l895
$$ 512283 513780 515620 518122 521401 524836 527605 529477 530636 530989 530219 528407 526017 523249 519906 516011
59636E16011l938l501l000k605k244j995j960j945j709j432j417j558j594j691
$$ 516011 512073 508572 505572 502967 500723 498728 496768 494823 493114 491682 490265 488707 487113 485422
59622D85422k191k866l083k695k277k368k984l867m647m748l751k026n63L8N9
$$ 485422 483231 480365 477282 474587 472310 469942 466958 463091 458444 453696 449945 447919 447356 447394 447453
59607D47453P3L60R96K031L197L870L626K614J322K74k7O16J634K037J555R31
$$ 447453 447526 447886 448882 450913 454110 457980 461606 464220 465542 465816 465789 466405 468039 470076 471631 472562
59591D72562P80O98L3q97j146m68L29M32j32p93j129j138j099j323j817k179k082
$$ 472562 473342 474040 474073 473176 472030 471562 471891 472323 472191 471398 470269 469131 468032 466709 464892 462713 460631
59574D60631j817k003k692l099k505j093K64R00Q07L72k6k02k08k39l52l32J2
$$ 460631 458814 456811 454119 451020 448515 447422 447686 448586 449393 449765 449739 449537 449329 449090 448738 448406 448418
59557D48418M46M32j79q74j036o78k84n5L19J075J939K507K891L646N060O787
$$ 448418 448864 449296 449117 448243 447207 446529 446245 446190 446509 447584 449523 452030 454921 458567 463627 470414
59541D70414Q262R350J0579J2618J5424J7795J7997J5137J0010M509J99k563m334
$$ 470414 478676 488026 498605 511223 526647 544442 562439 577576 587586 592095 592294 589731 585397
59528E85397n759o955p472o779m868k460m54P48J297J442J228O72n9p67j405k146
$$ 585397 579638 572683 565211 558432 553564 551104 550650 551398 552695 554137 555365 556037 555978 555211 553806 551660
59512E51660l208m588n864o452o260n904o037o556o785o383n703n201m898m557
$$ 551660 548452 543864 538000 531548 525288 519384 513347 506791 500006 493623 487920 482719 477821 473264
59498D73264m048l379k568j700r74n58m28m88o57q13p63m05J58O99R78Q52M48
$$ 473264 469216 465837 463269 461569 460595 460037 459609 459121 458464 457651 456888 456483 456641 457340 458318 459170 459618
59481D59618K17N91J491K411K978L279L503L574L328K849K410K111J810J369R04
$$ 459618 459835 460426 461917 464328 467306 470585 474088 477662 480990 483839 486249 488360 490170 491539 492443
59466D92443P61J182K011K779L193L401L639L785L599L288L399M101M899N291
$$ 492443 493204 494386 496397 499176 502369 505770 509409 513194 516793 520081 523480 527581 532480 537771
59452E37771N340N416N558N397M652L577K770K548K500J843L63j343k676l766
$$ 537771 543111 548527 554085 559482 564134 567711 570481 573029 575529 577372 577735 576392 573716 569950
59438E69950m926n807n797n085m445l948k845j008M60O28O7M0R32K210L468M769
$$ 569950 565024 559217 553420 548335 543890 539942 537097 536089 536549 537177 537244 537284 538216 540426 543894 548663
59422E48663O178P672R432J1587J3788J5557J7010J8650K0601K2554K4241K5311
$$ 548663 554841 562513 571945 583532 597320 612877 629887 648537 669138 691692 715933 741244
59410G41244K4793K1556J5586Q283J331m288q141r936r663p784m884j442J816
$$ 741244 766037 787593 803179 811462 812793 808505 800364 790428 780765 772981 768097 766655 768471
59397G68471L686L088o4m729r387j2889j4932j5933j6353j6106j4757j2317r613
$$ 768471 772157 775245 775181 770452 761065 748176 733244 717311 700958 684852 670095 657778 648165
59384F48165p673o860o596n980m702l374k768k736k325j153q4k7o25q71o29n29
$$ 648165 640492 633632 627036 621056 616354 612980 610212 607476 605151 603998 603914 603887 603262 602391 601762 601233
59368F01233n60PJ134J688J103K78J45L58K91M71J786L782N128N596O337Q038
$$ 601233 600673 600680 601814 603502 604605 604883 605028 605386 605677 606148 607934 611716 616844 622440 628777 636815
59352F36815R956J1142J1694J2227J2910J3556J4131J4552J4372J3364J2140J1593
$$ 636815 646771 657913 669607 681834 694744 708300 722431 736983 751355 764719 776859 788452
59340G88452J1761J1739J0721Q800O635M652K665J79l018o423r111j0596j1330
$$ 788452 800213 811952 822673 831473 838108 842760 845425 845604 842586 836163 827052 816456 805126
59327H05126j2166j3398j4567j5164j5146j4669j3706j2248j0751r913r923j0158
$$ 805126 792960 779562 764995 749831 734685 720016 706310 694062 683311 673398 663475 653317
59315F53317r833q805p592o642n862m894l663k440j449n33O87K414M498O601Q434
$$ 653317 643484 634679 627087 620445 614583 609689 606026 603586 602137 601604 602291 604705 609203 615804 624238
59300F24238R719R989Q667N561J252l190o953r837j1900j3079j3262j2581j1372
$$ 624238 633957 643946 652613 658174 659426 656236 649283 639446 627546 614467 601205 588624 577252
59287E77252r913q374o955n784m666l181j189R19K527L392L855M517N704P182
$$ 577252 567339 558965 552010 546226 541560 538379 537190 538109 540636 544028 547883 552400 558104 565286
59273E65286Q432R196R687J0221J0765J1095J1244J1460J1616J1073R404P031
$$ 565286 573718 582914 592601 602822 613587 624682 635926 647386 659002 670075 679479 686510
59261F86510M834L181J731J03j594l044m196n174n886o082n797n444n354n312
$$ 686510 691344 694525 696256 696359 694765 691721 687525 682351 676465 670383 664586 659142 653788 648476
59247F48476m735l302j345M12J487J960K262K702L288L951M735N689O610P108
$$ 648476 643741 640439 639094 639506 640993 642953 645215 647917 651205 655156 659891 665580 672190 679298
59233F79298O908O029M687L175J823P99j37j476l345n219o487p210q008r239j0575
$$ 679298 686206 692235 696922 700097 701920 702719 702582 701106 697761 692542 686055 678845 670837 661598 651023
59218F51023j1417j1474j0857r914r068q503p863o581m804l555l565m177m035
$$ 651023 639606 628132 617275 607361 598293 589790 581927 575346 570542 566987 563422 559245 555210
59205E55210k871j866k028k798k791j628l04K14J29K80Q59J257J091Q89J424K651
$$ 555210 552339 550473 548445 545647 542856 541228 540924 541138 541267 541547 542406 543663 544754 545643 547067 549718
59189E49718L716L994L741L623L874M223M370M258L945L602L515L845M329M511
$$ 549718 553434 557428 561169 564792 568666 572889 577259 581517 585462 589064 592579 596424 600753 605264
59175F05264M248L770L275K848K700L025L544L612L065K468K270K184J791J278
$$ 605264 609512 613282 616557 619405 622105 625130 628674 632286 635351 637819 640089 642273 644064 645342
59161F45342J051R17L20p69j840k668l582m813o143p322q354r191r602r552r308
$$ 645342 646393 647310 647630 646861 645021 642353 638771 633958 627815 620493 612139 602948 593346 583794 574486
59146E74486r004q464p652o884o356n903n368m856m351l616k804k610l278l920
$$ 574486 565482 557018 549366 542482 536126 530223 524855 519999 515648 512032 509228 506618 503340 499420
59132D99420l479k103q96m77m13n0Q06K007L298M291M794N175N949O873P140O570
$$ 499420 495941 493838 492942 492465 492052 492002 492808 494815 498113 502404 507198 512373 518322 525195 532335 538905
59116E38905O003O182O873P489P957Q419Q574Q014P000O170N646N031M265L789
$$ 538905 544908 551090 557963 565452 573409 581828 590402 598416 605416 611586 617232 622263 626528 630317
59102F30317L710L505K785J952J550J380P24o20j969k571k389j935j598j419j403
$$ 630317 634027 637532 640317 642269 643819 645199 645923 645303 643334 640763 638374 636439 634841 633422 632019
59087F32019j625j907j771j082n34r84k346l587m029m182m836n819o242n814n175
$$ 632019 630394 628487 626716 625634 625100 624116 621770 618183 614154 609972 605136 599317 593075 587261 582086
59072E82086m898m813m612m512m784n067m777l979l287k919k511j890j442j460
$$ 582086 577188 572375 567763 563251 558467 553400 548623 544644 541357 538438 535927 534037 532595 531135
59058E31135j671j770j934k350k633k298j608j250j306j224q46o71q94r27l76
$$ 531135 529464 527694 525760 523410 520777 518479 516871 515621 514315 513091 512245 511574 510680 509753 509377
59043E09377J05l26j437k183k067j506q41J45J492K492K378J361N01O55J726L016
$$ 509377 509482 509156 507719 505536 503469 501963 501122 501267 502759 505251 507629 508990 509491 510146 511872 514888
59027E14888M077N124O542Q144R233R514R585J0168J1136J1744J1644J1020R878
$$ 514888 518965 524089 530631 538775 548008 557522 567107 577275 588411 600155 611799 622819 632697
59014F32697P945N445L198J595R9j772l517m351m278l867l271k245r79j17K02
$$ 632697 640642 646087 649285 650880 650979 649207 645690 641339 637061 633194 629923 627678 626699 626582 626784
58999F26784N99J563K822L855M572N169N615N645N108M088K769J457N78M22P81
$$ 626784 627383 628946 631768 635623 640195 645364 650979 656624 661732 665820 668589 670046 670624 671046 671827
58984F71827J033P16Jn05m14N2M68R09J921L764N995P970R513J0813J1904J2625
$$ 671827 672860 673576 673577 673072 672658 672710 673178 674087 676008 679772 685767 693737 703250 714063 725967 738592
58968G38592J2966J3061J2940J2595J2218J1996J1740J1089J0064Q938P583N558
$$ 738592 751558 764619 777559 790154 802372 814368 826108 837197 847261 856199 863782 869340
58956H69340L021Q88l80j619l960p190r922j1341j2096j3172j4521j5347j5387
$$ 869340 872361 873249 872869 871250 867290 860100 850178 838837 826741 813569 799048 783701 768314
58943G68314j5166j4986j4318j2661j0507q904q169p566o359m652l029j757p39
$$ 768314 753148 738162 723844 711183 700676 691772 683603 676037 669678 665026 661997 660240 659501
58930F59501Q3O52R92J089P80J10l50q5N23M26p81k261k883k434j627j166j130
$$ 659501 659584 660236 661228 662317 663097 663207 662857 662772 663295 663721 662940 660679 657796 655362 653735 652569 651439
58913F51439j186j060p33l54K3N90J624L073M485N418N930O534P675R234J0563
$$ 651439 650253 649193 648460 648106 648129 648719 650343 653416 657901 663319 669249 675783 683458 692692 703255
58898G03255J1059J0789J0488J0800J1567J2137J2293J2606J3696J5454J7119
$$ 703255 714314 725103 735591 746391 757958 770095 782388 794994 808690 824144 841263
58887H41263J8062J8222J7962J7604J7151J6340J4939J2994J0709Q129N119J696
$$ 841263 859325 877547 895509 913113 930264 946604 961543 974537 985246 993375 998494 1000190
58875A000190j806m938p384r030j0003j0666j1306j1731j1461j0497r556r258
$$ 1000190 998384 993446 986062 977032 967029 956363 945057 933326 921865 911368 901812 892554
58863H92554r345r060q145p116o557o598p043p595p891p713p347p446q237r138
$$ 892554 883209 874149 866004 858888 852331 845733 838690 831095 823204 815491 808144 800698 792461 783323
58849G83323r412q986q331p734p135o632o591p091p659p857p834p965q244q404
$$ 783323 773911 764925 756594 748860 741725 735093 728502 721411 713752 705895 698061 690096 681852 673448
58835F73448q429q445q200p246n725m462l993l944l623k880k021j212l61N59J465
$$ 673448 665019 656574 648374 641128 635403 630941 626948 623004 619381 616501 614480 613268 612907 613466 614931
58820F14931K348L219M003M706N452O113O223N655N059N059N285M872L755K700
$$ 614931 617279 620498 624501 629207 634659 640772 646995 652650 657709 662768 668053 672925 676680 679380
58806F79380K036J190k27j629k267k348k786m057n717o953p297o974o715p090
$$ 679380 681416 682606 682379 680750 678483 676135 673349 669292 663575 656622 649325 642351 635636 628546
58792F28546p917q502q462p927o974n471l692k412j893j375j81J174J668J332
$$ 628546 620629 612127 603665 595738 588764 583293 579601 577189 575296 573921 573740 574914 576582 577914
58778E77914J252K074L230L768L347K234Q15n68j680k579l580m829o013o601o300
$$ 577914 579166 581240 584470 588238 591585 593819 594634 594066 592386 589807 586227 581398 575385 568784 562484
58763E62484n341m394m080m353m495l985l182k800k801k388j146L24J241J605
$$ 562484 557143 552749 548669 544316 539821 535836 532654 529854 527053 524665 523519 523843 525084 526689
58749E26689K014K694L255L327L101L033L222L351L241L249L804M689N116M652
$$ 526689 528703 531397 534652 537979 541080 544113 547335 550686 553927 557176 560980 565669 570785 575437
58735E75437L768L252L327L699M190M865N635O183O305N985N231M217L506L565
$$ 575437 579205 582457 585784 589483 593673 598538 604173 610356 616661 622646 627877 632094 635600 639165
58721F39165M078M265M009M077M973O193O963P153P056O730O142N558N143M443
$$ 639165 643243 647508 651517 655594 660567 666760 673723 680876 687932 694662 700804 706362 711505 715948
58707G15948K866N61j788l841n691p288q492r654j1268j2970j3780j3576j3440
$$ 715948 718814 719375 717587 713746 708055 700767 692275 682621 671353 658383 644603 631027 617587
58694F17587j4025j4463j3636j1862j0352r444q471p169o154n830n780n540n213
$$ 617587 603562 589099 575463 563601 553249 543805 535334 528165 522011 516181 510401 504861 499648
58681D99648m992m670m107l555l136k526j582p54l57L4Q92J854K308K551L475
$$ 499648 494656 489986 485879 482324 479188 476662 475080 474326 473969 474003 474895 476749 479057 481608 485083
58666D85083N162O663P312P525P948Q424Q256P149N457L622J735k88k276l693
$$ 485083 490245 496908 504220 511745 519693 528117 536373 543522 548979 552601 554336 554048 551772 548079
58652E48079m140l955l961m457m815m453l816l716m003l713k620j657j540j676
$$ 548079 543939 539984 536023 531566 526751 522298 518482 514766 510763 507050 504430 502773 501233 499557
58638D99557j077J77J053R46M26N50J723L252L999L494K343J434R92P03M09J08
$$ 499557 498480 498657 499710 500656 501082 501632 503355 506607 510606 514100 516443 517877 518869 519572 519981 520089
58622E20089m77j544k416k044m40J259K399L437M648N304M889M111L775L494K649
$$ 520089 519612 518068 515652 513608 513168 514427 516826 520263 524911 530215 535104 539215 542990 546484 549133
58607E49133J817J932K537K262R72n2q1J55j18o10p62o50n88n59n71r11j505j603
$$ 549133 550950 552882 555419 557681 558653 558601 558520 558675 558557 557947 557185 556535 555947 555388 554817 553906 552401 550798
58589E50798o21J118K891M377N616O585P309Q054Q923R609R773R436Q752P780
$$ 550798 550177 551295 554186 558563 564179 570764 578073 586127 595050 604659 614432 623868 632620 640400
58575F40400O818O443O809P241P068O583O718P915R856J2129J4638J7316J9892
$$ 640400 647218 653661 660470 667711 674779 681362 688080 695995 705851 717980 732618 749934 769826
58562G69826K2037K3513K4102K3753K2842K1976K1272K0025J7325J3091Q319M254
$$ 769826 791863 815376 839478 863231 886073 908049 929321 949346 966671 979762 988081 992335
58550I92335J382o66k344l688m649n477o345o942o985p075q275j0728j3333j5174
$$ 992335 993717 993051 990707 987019 982370 976893 970548 963606 956621 949546 941271 930543 917210 902036
58536I02036j6586j8295j9989k0565j9656j8109j6792j5572j3819j1453q977o820
$$ 902036 885450 867155 847166 826601 806945 788836 772044 756472 742653 731200 722223 715403
58524G15403n122m085l860m065l903l233k951l771m939m973l659k434k419k993
$$ 715403 710281 706196 702336 698271 694368 691135 688184 684413 679474 674501 670842 668408 665989 662996
58510F62996k887k089j686k114k581k327j636j244j328j506j462j244j105j284
$$ 662996 660109 658020 656334 654220 651639 649312 647676 646432 645104 643598 642136 640892 639787 638503
58496F38503j740k064j827j086l03K53Q36J827L295N014O641P804Q241Q064P748
$$ 638503 636763 634699 632872 631786 631483 631736 632572 634399 637694 642708 649349 657153 665394 673458 681206
58481F81206P844Q667J0161J1860J3140J3703J3740J3488J2843J1634R917P721
$$ 681206 689050 697717 707878 719738 732878 746581 760321 773809 786652 798286 808203 815924
58469H15924M810J221k301m986o885q369r086q353o442m484k942j158J365M099
$$ 815924 820734 821955 819654 814668 807783 799414 790328 781975 775533 771049 768107 766949 768314 772413
58455G72413O352Q147R733J0883J1232J0773R535P366M484J753k17j800l699n915
$$ 772413 778765 786912 796645 807528 818760 829533 839068 846434 850918 852671 852454 850654 846955 841040
58441H41040p841r053r509r294q549p473o063m207k259r08j10J155L453N815O943
$$ 841040 833199 824146 814637 805343 796794 789321 783258 779051 776792 775884 775774 776929 780382 786197 793140
58426G93140P021P370Q513R516R374Q189O718N377M008K242j30k904n369o785
$$ 793140 800161 807531 816044 825560 834934 843123 849841 855218 859226 861468 861338 858434 853065 846280
58412H46280p078o939p105p645q077p976p401o683o028n424m874m412l832k751
$$ 846280 839202 832263 825158 817513 809436 801460 794059 787376 781348 775924 771050 766638 762806 760055
58398G60055j207K12J172K076L213L981L796L367L857M967N180M108L173L495
$$ 760055 758848 759060 760232 762308 765521 769502 773298 776665 780522 785489 790669 794777 797950 801445
58384H01445M397M767M651M570M337L712L343L849M603M631M233M482N468O317
$$ 801445 805842 810609 815260 819830 824167 827879 831222 835071 839674 844305 848538 853020 858488 864805
58370H64805O696P081P559P579P076O846P486Q674R799J0688J1561J2627J3774
$$ 864805 871501 878582 886141 893720 900796 907642 915128 923802 933601 944289 955850 968477 982251
58357I82251J4407J3809J2053J0193R019Q048O368M102K215J202Q60J088J956
$$ 982251 996658 1010467 1022520 1032713 1041732 1049780 1056148 1060250 1062465 1063667 1064527 1065615 1067571
58344A067571L051L731M060M733N989P347Q411R302J0206J1174J2324J3684J4908
$$ 1067571 1070622 1074353 1078413 1083146 1089135 1096482 1104893 1114195 1124401 1135575 1147899 1161583 1176491
58331A176491J5662J6147J6661J6878J6233J4788J3042J1185R258P687O779O007
$$ 1176491 1192153 1208300 1224961 1241839 1258072 1272860 1285902 1297087 1306345 1314032 1320811 1326818
58319A326818M723L268K437K239K265K857M572O714P950Q327R120J0566J1417
$$ 1326818 1331541 1334809 1337246 1339485 1341750 1344607 1349179 1355893 1363843 1372170 1381290 1391856 1403273
58306A403273J1244J1450J3127J5305J6358J6238J6146J6769J7742J8501J8773
$$ 1403273 1414517 1425967 1439094 1454399 1470757 1486995 1503141 1519910 1537652 1556153 1574926
58295A574926J8518J7974J7672J8041J9115K0674K2299K3465K4054K4668K5808
$$ 1574926 1593444 1611418 1629090 1647131 1666246 1686920 1709219 1732684 1756738 1781406 1807214
58284A807214K6946K7250K7046K7506K8972L0705L2315L4130L5948L6820L6615
$$ 1807214 1834160 1861410 1888456 1915962 1944934 1975639 2007954 2042084 2078032 2114852 2151467
58273B151467L6609L7841L9915M1941M3734M5429M6926M8346N0204N2530N4625
$$ 2151467 2188076 2225917 2265832 2307773 2351507 2396936 2443862 2492208 2542412 2594942 2649567
58262B649567N6261N8186O0805O3283O4718O5438O6410O7915O9600P1333P3324
$$ 2649567 2705828 2764014 2824819 2888102 2952820 3018258 3084668 3152583 3222183 3293516 3366840
58251C366840P5708P8408Q1251Q4151Q7533R2375R9063J06463J13091J19113J26012
$$ 3366840 3442548 3520956 3602207 3686358 3773891 3866266 3965329 4071792 4184883 4303996 4430008
58240D430008J34360J43192J51654J59894J68198J76720J86265J97756K10600
$$ 4430008 4564368 4707560 4859214 5019108 5187306 5364026 5550291 5748047 5958647
58231E958647K23280K35916K50524K68205K87899L08626L31097L56174L83597
$$ 5958647 6181927 6417843 6668367 6936572 7224471 7533097 7864194 8220368 8603965
58222H603965M13237M45962M82257N21642N64575O13290O69770P34505Q08149
$$ 8603965 9017202 9463164 9945421 10467063 11031638 11644928 12314698 13049203 13857352
58213A3857352Q92579R89414J099491J224954J369842J537704J731110J954939
$$ 13857352 14749931 15739345 16838836 18063790 19433632 20971336 22702446 24657385
58205B4657385K218029K530849K905076L357775L913634M601817N453845O505860
$$ 24657385 26875414 29406263 32311339 35669114 39582748 44184565 49638410 56144270
58197E6144270P797980R367519J1245558J3461466J6044238J9012361K2357532
$$ 56144270 63942250 73309769 84555327 98016793 114061031 133073392 155430924
58190A55430924K6014225K9783306L3211241L5518660L5713196L2922219K6804283
$$ 155430924 181445149 211228455 244439696 279958356 315671552 348593771 375398054
58183C75398054J7801662P067642l909852j3788716k1707381k7340563l0740791
$$ 375398054 393199716 400267358 396357506 382568790 360861409 333520846 302780055
58176C02780055l2144605l1867824l0279912k7785087k4779272k1604614j8522598
$$ 302780055 270635450 238767626 208487714 180702627 155923355 134318741 115796143
58169A15796143j5704019j3232569j1124633r358127p894308o687643n692232
$$ 115796143 100092124 86859555 75734922 66376795 58482487 51794844 46102612
58162D6102612m868795m186940l621646l150877k756820k426104k147348j910199
$$ 46102612 41233817 37046877 33425231 30274354 27517534 25091430 22944082 21033883
58154B1033883j706775j531498j379005j243968j122993j014557r16944q28068
$$ 21033883 19327108 17795610 16416605 15172637 14049644 13035087 12118143 11290075
58146A1290075p47121o74259o08775n49535m97004m52530m15585l83880l56118
$$ 11290075 10542954 9868695 9259920 8710385 8213381 7760851 7345266 6961386 6605268
58137F605268l32352l11561k91485k71511k53365k38080k24274k10287j96246
$$ 6605268 6272916 5961355 5669870 5398359 5144994 4906914 4682640 4472353 4276107
58128D276107j82999j70589j58761j47847j38248j29871j22500j15895j09359
$$ 4276107 4093108 3922519 3763758 3615911 3477663 3347792 3225292 3109397 3000038
58119C000038j02321r5399q9791q5538q1611p7714p4541p2132o9511o6246o3015
$$ 3000038 2897717 2802318 2712527 2626989 2545378 2467664 2393123 2320991 2251480 2185234 2122219
58108B122219o0258n7601n4897n2545n0523m8421m6582m5795m5689m4967m3444
$$ 2122219 2061961 2004360 1949463 1896918 1846395 1797974 1751392 1705597 1659908 1614941 1571497
58097A571497m2186m1327l9516l6254l2891l0556k8704k6694k5180k4663k4054
$$ 1571497 1529311 1487984 1448468 1412214 1379323 1348767 1320063 1293369 1268189 1243526 1219472
58086A219472k2129j9446j7519j6825j6773j6949j7297j7568j7546j7511j7738
$$ 1219472 1197343 1177897 1160378 1143553 1126780 1109831 1092534 1074966 1057420 1039909 1022171
58075A022171j7960j7876j7735j7868j8146j8299j8244j7762j6527j4812j3366
$$ 1022171 1004211 986335 968600 950732 932586 914287 896043 878281 861754 846942 833576
58064H33576j2268j0790q768p149o717p185q075r426j1067j2194j2410j2288j2241
$$ 833576 821308 810518 801750 794601 787884 780699 772624 763198 752131 739937 727527 715239 702998
58051G02998j1835j0899j0232j0300j0207r103p665p106p378p485p012o321n739
$$ 702998 691163 680264 670032 659732 649525 640422 632757 625651 618273 610788 603776 597455 591716
58038E91716n497n981p074p772p338o364n868n867n837n928o642p718q407q575
$$ 591716 586219 580238 573164 565392 558054 551690 545822 539955 534118 528190 521548 513830 505423 496848
58024D96848q553q291p575o756o317o060n610n266n336n120l799k053j435k264
$$ 496848 488295 480004 472429 465673 459356 453296 447686 442420 437084 431964 428165 426112 424677 422413
58010D22413l294l552l269k915k438j830j456j500j711j914k118k106j657j225
$$ 422413 419119 415567 412298 409383 406945 405115 403659 402159 400448 398534 396416 394310 392653 391428
57996C91428j596k833m234n379o399p139o958n636l717j786r1J073J414J236J205
$$ 391428 389832 386999 382765 377386 370987 363848 356890 351254 347537 345751 345660 346733 348147 349383 350588
57981C50588J296P85m44j473j581j141q51p73o84o50p39o21j13L17J78k76m18
$$ 350588 351884 352669 352225 350752 349171 348030 347179 346406 345722 345072 344333 343712 343599 343916 344094 343818 343400
57964C43400j91j11m32p70n71K43J171J519R82r6j124j863k433k850k931k720
$$ 343400 343209 343098 342666 341896 341325 341568 342739 344258 345240 345144 344020 342157 339724 336874 333943 331223
57948C31223k560k631k725k555k008j065J61J281J936K324K971L966M873N534
$$ 331223 328663 326032 323307 320752 318744 317679 317840 319121 321057 323381 326352 330318 335191 340725
57934C40725O341P461Q311Q258P396O229M986L647K351J217j9j671l468m751n356
$$ 340725 347066 354527 362838 371096 378492 384721 389707 393354 395705 396922 396903 395232 391764 387013 381657
57919C81657n820o579p344p553p175o722o432n832m387k380p56j01j35l13l89
$$ 381657 375837 369258 361914 354361 347186 340464 334032 328200 323813 321433 320677 320576 320441 320128 319739
57904C19739k32M47J610K522K510J860J410J383J341J161J239J609J687J220P95
$$ 319739 319507 319954 321564 324086 326596 328456 329866 331249 332590 333751 334990 336599 338286 339506 340301
57889C40301R30J256J104M84k3o3K38N90P07L49l99j111j532j919k634l628m594
$$ 340301 341231 342487 343591 344075 344052 343989 344227 344817 345524 345873 345474 344363 342831 340912 338278 334650 330056
57872C30056n346n758n684n229m822m601m115l055j886j170n82N50J966K556K013
$$ 330056 324710 318952 313268 308039 303217 298616 294501 291446 289560 288390 287808 288358 290324 292880 294893
57857B94893J457K035L477M618M963N082N560O216O443N973N065M122L296K434
$$ 294893 296350 298385 301862 306480 311443 316525 322085 328301 334744 340717 345782 349904 353200 355634
57843C55634J332O3r02j033k78P24J121O00m04j302k020k852l722l996l279k152
$$ 355634 356966 357029 356127 355094 354816 355540 356661 357261 356857 355555 353535 350683 346961 342965 339686 337534
57827C37534j645j996k373j958r60k01j6l4J7j00n77j039j081j052j745l337n065
$$ 337534 335889 333893 331520 329562 328602 328401 328385 328351 328368 328268 327691 326652 325571 324519 322774 319437 314372
57810C14372o089o314o181n989n720n326m858m353l831l346k991k836k958l299
$$ 314372 308283 301969 295788 289799 284079 278753 273895 269542 265711 262365 259374 256538 253580 250281
57796B50281l443k833j460j29L09j36p26q74n42R3Q91J659K151K359K479K615
$$ 250281 246838 244005 242545 242416 242725 242589 241863 240989 240447 240540 241431 243090 245241 247600 250079 252694
57780B52694K731K968L643M776N861O323O040N326M619M258M351M581M338L311
$$ 252694 255425 258393 262036 266812 272673 278996 285036 290362 294981 299239 303590 308171 312509 315820
57766C15820J924R59P13O52O0j101k183k726k986l380l656l158j939r35q01j138
$$ 315820 317744 318703 319416 320068 320128 319027 316844 314118 311132 307752 304096 300938 298999 298064 297263 296125
57750B96125j208r52o83k68O18J597J853J271O38M73M33Q9k89k02L10P50P86N14
$$ 296125 294917 293965 293282 293014 293632 295229 297082 298353 298991 299464 299897 299986 299697 299495 299805 300555 301341 301855
57732C01855L26O11J391K140K319K061J924K002J895J608J744K503L177L113K534
$$ 301855 302181 302792 304183 306323 308642 310703 312627 314629 316524 318132 319876 322379 325556 328669 331203
57717C31203J994J529J048R21J418J923J462o7j854l214l979m067l454k616k287
$$ 331203 333197 334726 335774 336695 338113 340036 341498 341431 339577 336363 332384 328317 324863 322247 319960
57702C19960k545k722k321j550p88q1N20O38l2j245k382l017l118k970l012l508
$$ 319960 317415 314693 312372 310822 310034 309953 310473 311111 311079 309834 307452 304435 301317 298347 295335 291827
57686B91827m208m487l950k804j564n54K29J025K206M055O559R537J3023J7258
$$ 291827 287619 283132 279182 276378 274814 274260 274489 275514 277720 281775 288334 297871 310894 328152
57672C28152K2156K7114L1633L6004M0897M6100M9728M8982M2022K9346J3486
$$ 328152 350308 377422 409055 445059 485956 532056 581784 630766 672788 702134 715620
57661G15620k647j7103k8887l7309m1955m3163m1964l9339l5844l1955k8196k4662
$$ 715620 712973 695870 666983 629674 587719 544556 502592 463253 427409 395454 367258 342596
57649C42596k0855j6541j2487r782q551p818o693n146l588k227j223q79j187j404
$$ 342596 321741 305200 292713 282931 274380 266562 259869 254723 251135 248908 247685 246806 245619 244215
57635B44215p36O48J726J812J169L83l03q17r01m45O6n2q55j679j917j626j317
$$ 244215 243479 244127 245853 247665 248834 249217 248914 248097 247196 246751 246817 246765 245910 244231 242314 240688 239371
57618B39371j380j753k077k121k078k237k450k198j440q21p84q78n39j40m48j313
$$ 239371 237991 236238 234161 232040 229962 227725 225275 223077 221637 220816 220032 219154 218615 218475 218027 216714
57602B16714j821j721j708k047j990j069p8j6p33j394j749k089k337k151j776
$$ 216714 214893 213172 211464 209417 207427 206358 206280 206264 205531 204137 202388 200299 197962 195811 194035
57587A94035j836k305k495k193k003k290k490j944q55L0L79M30L62Pp16j428j644
$$ 194035 192199 189894 187399 185206 183203 180913 178423 176479 175624 175654 176033 176463 176825 176832 176116 174688 173044
57570A73044j411j326j738k127j720p12k59r58j873j729o31K13K75K86Q37J345
$$ 173044 171633 170307 168569 166442 164722 164010 163751 162793 160920 159191 158560 158773 159048 159334 160171 161516
57554A61516R63o3o77l60M54J140J481J446R71K01l57l26Q0L80M68O27Q59P22
$$ 161516 162479 162416 161739 161379 161833 162973 164454 165900 166871 167072 166715 166389 166469 166849 167317 167944 168803 169525
57536A69525J3p05p43j92K91M83P21J072J073O00K69N08Q50P49M85O07Q94P77
$$ 169525 169538 168833 168090 167898 168189 168672 169393 170465 171538 172138 172407 172915 173765 174514 174999 175606 176500 177277
57518A77277M86Q46J898K722K720K253J792J252N52J44L88Q87J000N95k5o87j389
$$ 177277 177763 178609 180507 183229 185949 188202 189994 191246 191798 191942 192330 193217 194217 194812 194787 194100 192711
57501A92711k002k301k134j482n43P7k70j484k698l285l456l533l200k090p17
$$ 192711 190709 188408 186274 184792 184249 184326 184056 182572 179874 176589 173133 169600 166400 164310 163593
57486A63593r8m99j156j274p96k01J31J63J44L66P94J008P19K12L8K75M77K90
$$ 163593 163495 162996 161840 160566 159770 159569 159700 159863 160007 160373 161167 162175 162894 163106 163144 163419 163896 164186
57468A64186j68n60o87o22o67j112j817k153j666o97qJ17l1k36n86r64r39l72
$$ 164186 164018 163458 162771 162149 161482 160370 158553 156400 154734 154037 154029 154146 154115 153879 153293 152329 151390 151018
57450A51018K50M19J96q7l41n90n86o1P45J253J272J187J385J780J981J766J131
$$ 151018 151268 151687 151883 151796 151455 150865 150279 150218 150963 152216 153488 154675 156060 157840 159821 161587 162718
57433A62718J96q33j613j806j379o90k48k50l72j09N94J222J299R89P84P84O13
$$ 162718 162914 162081 160468 158662 157283 156593 156345 156095 155723 155614 156208 157430 158729 159718 160502 161286 161899
57416A61899R4m41o51o34n95l74K89J153J619J417Q70L71ll24n49o22o04n53l81
$$ 161899 161993 161552 160901 160267 159672 159298 159587 160740 162359 163776 164646 165017 165014 164690 164141 163519 162915 162362 161981
57397A61981m0K73K81m1l55k62L60J200J766J836J667J691K032K440K626K569
$$ 161981 161941 162214 162495 162454 162099 161837 162197 163397 165163 166999 168666 170357 172389 174829 177455 180024
57381A80024K492K666L139L566L430K679J968J925K338K405J710N30p06j732k212
$$ 180024 182516 185182 188321 191887 195317 197996 199964 201889 204227 206632 208342 208872 208166 206434 204222
57366B04222j868r82k75o2k0M1j43o21q82o65m44n83n94Q0J044J483J409J574
$$ 204222 202354 201372 201097 201035 201015 201056 200913 200292 199410 198745 198301 197718 197124 197204 198248 199731 201140 202714
57348B02714K240K826K697J843P69J73M97J334J554O24n04n53L24Q45M41k25n25
$$ 202714 204954 207780 210477 212320 213089 213262 213759 215093 216647 217271 216767 216214 216538 217383 217824 217599 217074
57331B17074o37o96k76P90J762J809R90K5n52n96q3Q83J931K547K340J291n1p73
$$ 217074 216437 215741 215465 216255 218017 219826 220816 220841 220289 219693 219610 220493 222424 224971 227311 228602 228551 227778
57313B27778m85J90M21L17N27R94J017N39L03M98L75l45p54j59P45R62O96Q26
$$ 227778 227293 227483 227904 228221 228748 229742 230759 231298 231601 232099 232474 232129 231375 231216 231961 232923 233619 234445
57295B34445J416J810J889K186K775L003K504J792J578J934K307K200J692J388
$$ 234445 235861 237671 239560 241746 244521 247524 250028 251820 253398 255332 257639 259839 261531 262919
57281B62919J783K606L037K710K168K115K563L014L175L083K796K367K014J943
$$ 262919 264702 267308 270345 273055 275223 277338 279901 282915 286090 289173 291969 294336 296350 298293
57267B98293K110K372K708L163L717M367N057N507N397M874M442M260M009L578
$$ 298293 300403 302775 305483 308646 312363 316730 321787 327294 332691 337565 342007 346267 350276 353854
57253C53854L256L115K829K411K406K958L429L420L465M051M672M641M201M042
$$ 353854 357110 360225 363054 365465 367871 370829 374258 377678 381143 385194 389866 394507 398708 402750
57239D02750M206M323M511N026N398N000M255M248N068N566M986M061M029N143
$$ 402750 406956 411279 415790 420816 426214 431214 435469 439717 444785 450351 455337 459398 463427 468570
57225D68570O511P186P161P312Q294R568R945R241Q713R392J0732J1531J1614
$$ 468570 475081 482267 489428 496740 505034 514602 524547 533788 542501 551893 562625 574156 585770
57212E85770J1617J1674J1324J0499R604Q716P766P293Q051R796J1469J2636J3788
$$ 585770 597387 609061 620385 630884 640488 649204 656970 664263 672314 682110 693579 706215 720003
57199G20003J5170J6333J7097J7938J9081K0056K0557K0952K1497K1741K1193
$$ 720003 735173 751506 768603 786541 805622 825678 846235 867187 888684 910425 931618
57188I31618K0047J8815J7632J6373J4992J3526J2017J0552R095P362N341L853
$$ 931618 951665 970480 988112 1004485 1019477 1033003 1045020 1055572 1064667 1072029 1077370 1081223
57176A081223L864N174O585P468Q357R795J1442J2761J3767J4544J4729J4179
$$ 1081223 1085087 1090261 1096846 1104314 1112671 1122466 1133908 1146669 1160436 1174980 1189709 1203888
57164A203888J3688J4218J5653J6910J7198J6724J6171J5886J5762J5749J6244
$$ 1203888 1217576 1231794 1247447 1264357 1281555 1298279 1314450 1330336 1346098 1361847 1378091
57153A378091J7761K0154K2508K4079K5053K6011K7006K7708K8172K8777K9584
$$ 1378091 1395852 1416006 1438514 1462593 1487646 1513657 1540663 1568371 1596543 1625320 1654904
57142A654904L0552L2195L5133L8834M1774M3093M3432M3847M4614M5414M6132
$$ 1654904 1685456 1717651 1752784 1791618 1833392 1876485 1919917 1963764 2008378 2053792 2099924
57131B099924M7014M8446N0779N4017N7541O0538O2849O4969O7202O9303P0985
$$ 2099924 2146938 2195384 2246163 2300180 2357721 2418259 2481108 2546077 2613279 2682582 2753567
57120B753567P2375P3874P5981P9150Q3408Q8261R3491R9872J08566J20035J34052
$$ 2753567 2825942 2899816 2975797 3054947 3138355 3226616 3320107 3419979 3528545 3648580 3782632
57109C782632J50336J68522J87953K08470K31176K57758K89613L28284L75987
$$ 3782632 3932968 4101490 4289443 4497913 4729089 4986847 5276460 5604744 5980731
57100E980731M34670N05482N90318O92851Q16546R62754J132170J326192J544045
$$ 5980731 6415401 6920883 7511201 8204052 9020598 9983352 11115522 12441714 13985759
57091A3985759J779751K024883K273103K519081K754898K972310L167605L339561
$$ 13985759 15765510 17790393 20063496 22582577 25337475 28309785 31477390 34816951
57083C4816951L484682L600426L687174L728449L661836L388144K835413K022271
$$ 34816951 38301633 41902059 45589233 49317682 52979518 56367662 59203075 61225346
57075F1225346J052468M7083r13530j791674k563019l201374l685076m004399
$$ 61225346 62277814 62324897 61411367 59619693 57056674 53855300 50170224 46165825
57067D6165825m161222m168023m048048l831214l547108l221994k879627k540226
$$ 46165825 42004603 37836580 33788532 29957318 26410210 23188216 20308589 17768363
57059A7768363k217501j918879j648921j410969j206019j032342q86905p66177
$$ 17768363 15550862 13631983 11983062 10572093 9366074 8333732 7446827 6680650
57051F680650o65855n81411n09344m47396l93934l47985l09221k76895k49183
$$ 6680650 6014795 5433384 4924040 4476644 4082710 3734725 3425504 3148609 2899426
57042B899426k24386k02133j82399j64174j46238j28691j12390r7339q2875o8941
$$ 2899426 2675040 2472907 2290508 2126334 1980096 1851405 1739015 1641676 1558801 1489860
57032A489860n5884m3193k9922j6450m858K520M102r01j2098k7304m3363n7999
$$ 1489860 1433976 1390783 1360861 1344411 1339553 1342073 1346175 1345274 1333176 1305872 1262509 1204510
57020A204510p0315p9615q4734q4915q0729p3796o5886n8273n1426m5174l9335
$$ 1204510 1134195 1054580 969846 884931 804202 730406 664520 606247 554821 509647 470312
57009D70312l4107k9700k5982k2838k0433j8701j7019j5080j3579j3222j3423
$$ 470312 436205 406505 380523 357685 337252 318551 301532 286452 272873 259651 246228
56998B46228j2850j1146r243q032p486p118o550n540m059k433q63J086L901P076
$$ 246228 233378 222232 212989 204957 197471 190353 183803 178263 174204 171771 170908 171994 175895 182971
56984A82971R367J0121R713Q613O764M079Q70k458n660q323r876j0181r777r229
$$ 182971 192338 202459 212172 220785 227549 231628 232498 230040 224380 216057 206181 196000 186223 176994
56970A76994q562p495n926l958j775M09K476M611P085R855J2586J5025J6983J7978
$$ 176994 168432 160937 155011 151053 149278 149687 152163 156774 163859 173714 186300 201325 218308 236286
56956B36286J7380J5028J1298O586J190m242q725j1687j3313j3983j3783j2852
$$ 236286 253666 268694 279992 286578 287768 283526 274801 263114 249801 235818 222035 209183
56944B09183j1694j0620r204o801l524l12K064L735N420P692J0667J4171J7861
$$ 209183 197489 186869 177665 170864 167340 167028 169092 172827 178247 185939 196606 210777 228638
56931B28638K1009K2499K1381J7543J1704M688k920j0335j6333k0020k1668k2259
$$ 228638 249647 272146 293527 311070 322774 327462 324542 314207 297874 277854 256186 233927
56919B33927k2246k1333j9442j7241j5312j3421j1041q368o275n270m902m330
$$ 233927 211681 190348 170906 153665 138353 124932 113891 105523 99248 93978 89076 84746
56907H4746l213j872p35J31R09J568J829J708J835K887M719O392P157P169P128
$$ 84746 81533 79661 78926 79057 79966 81534 83363 85071 86906 89793 94512 100904 108061 115230 122358
56892A22358P511Q360R590J1147J2894J4579J5869J6291J5237J2408Q309M002
$$ 122358 129869 138229 147819 158966 171860 186439 202308 218599 233836 246244 254553 258555
56880B58555K20l105o238q929j0558j0825r894p937n022j556J696M407P107J0539
$$ 258555 258775 255670 249432 240503 229945 219120 209226 201289 196267 194711 196407 200814 207921 218460
56866B18460J4771J9394K4276K9602L5176M0199M3698M4824M2746L6900K7649
$$ 218460 233231 252625 276901 306503 341679 381878 425576 470400 513146 550046 577695
56855E77695J6338M515o684j6344k3554k7764k9173k8415k6033k2304j7301j0974
$$ 577695 594033 598548 591864 575520 551966 524202 495029 466614 440581 418277 400976 390002
56843C90002l437M613J2248J9350K6960L6072M6293N6074O4101O9782P2387P0322
$$ 390002 386565 391178 403426 422776 449736 485808 532101 588175 652276 722058 794445 864767
56831H64767O1845M6618K6462M578j6037l3529m6985n5872o0115o0431n7971n3416
$$ 864767 926612 973230 999692 1004270 988233 954704 907719 851847 791732 731301 673330 619914
56819F19914m6862l8622k9567k0481j1563k853N454J3486K1885L0884L9437M5876
$$ 619914 573052 534430 504863 484382 472819 469966 475420 488906 510791 541675 581112 626988
56807F26988M9083M8532M3538L3516J9134K579j3577k7545l8469m6037n0221n1197
$$ 626988 676071 724603 768141 801657 820791 823370 809793 782248 743779 697742 647521 596324
56795E96324m9296m5185l9851l4136k8291k2259j6212j0422m763J162P316J3055
$$ 596324 547028 501843 461992 427856 399565 377306 361094 350672 345909 347071 354387 367442
56783C67442J7721K1052K2955K3196K1390J7134J0266J331q301j7137k4309k9469
$$ 367442 385163 406215 429170 452366 473756 490890 501156 502487 494186 477049 452740 423271
56771D23271l2296l2717l1460k9619k7621k5213k2470k0015j8054j5900j3030
$$ 423271 390975 358258 326798 297179 269558 244345 221875 201860 183806 167906 154876
56760A54876j0011p898o996o720o439n992n557n281n046m432l130j459k05K84
$$ 154876 144865 136967 129971 123251 116812 110820 105263 99982 94936 90504 87374 85915 85710 85994
56746H5994M17N35L21n13j348j299n47k23q55j590j402m93N4j99n77l70K67P25
$$ 85994 86411 86946 87267 86754 85406 84107 83560 83337 82482 80892 79490 78997 79051 78852 78275 77905 78172 78897
56728G8897Q49R28J014R01P17R70J719K234J916J105M97J13m62j028p77M61J728
$$ 78897 79746 80674 81688 82589 83306 84276 85995 88229 90145 91250 91747 91860 91398 90370 89593 90054 91782
56711I1782K060J606J216J239J265Q68J47m91p60o61m10k82m53q97j405j663j358
$$ 91782 93842 95448 96664 97903 99168 100036 100183 99692 98932 98271 97861 97579 97126 96229 94824 93161 91803
56694I1803m80M76Q34M36j46k30K39P18P18K82j46j62K58P66J002R48R00J081
$$ 91803 91323 91799 92633 93069 92923 92693 92932 93650 94368 94650 94504 94342 94600 95366 96368 97316 98216 99297
56676I9297J375J481J263Q95O52O31O97O82N97N28M27J32l12o54p71p13l76M87
$$ 99297 100672 102153 103416 104311 104963 105594 106291 106973 107570 108098 108525 108657 108345 107691 106920 106207 105831 106318
56658A06318J703K559K645K397K285J942Q69l76o86q3J69n86j463j470r11o53
$$ 106318 108021 110580 113225 115622 117907 119849 120718 120342 119656 119573 119742 119156 117693 116223 115312 114659
56642A14659p13n48k52l54p06n93K3K81k46q48o92R1Q09J183J434J667J761J639
$$ 114659 113946 113398 113146 112792 112086 111493 111516 111797 111551 110703 110011 110102 110911 112094 113528 115195 116956 118595
56624A18595J269M84p42j883k259j861j372j218j051m22M19Q32O44K13k81j001
$$ 118595 119864 120348 119606 117723 115464 113603 112231 111013 109962 109540 109959 110791 111435 111648 111367 110366
56608A10366j814k027j175K42J242J432J256J248J382J219M63o65j513j509p49
$$ 110366 108552 106525 105350 105592 106834 108266 109522 110770 112152 113371 113834 113169 111656 110147 109398
56593A09398J16O46J066J636J949J403L08j70N82J773K148J401L91R4O82J552
$$ 109398 109514 110160 111226 112862 114811 116214 116522 116352 116934 118707 120855 122256 122647 122741 123423 124975
56577A24975K029J913J486J032N75R0j80M7O72J366K053K916L957M935N729O341
$$ 124975 127004 128917 130403 131435 132010 132100 131920 131967 132639 134005 136058 138974 142931 147866 153595 159936
56561A59936O546O166N695O017P099P714O907N209L754K685J245p20k334k866
$$ 159936 166482 172648 178343 184360 191459 199173 206080 211289 215043 217728 218973 218253 215919 213053
56547B13053k606k268k067j817j527j466j691j893j783j468j353j630j984j962
$$ 213053 210447 208179 206112 204295 202768 201302 199611 197718 195935 194467 193114 191484 189500 187538
56533A87538j582j290j256j096o30l96r31j686j481q2J374J802J366Q45L78m19
$$ 187538 185956 184666 183410 182314 181684 181288 180357 178671 177190 177108 178482 180284 181650 182495 182873 182454
56517A82454j485k225k393k361k380k214j794j591j907k234j927j195p78p86n99
$$ 182454 180969 178744 176351 173990 171610 169396 167602 166011 164104 161870 159943 158748 157970 157184 156585
56502A56585jL63Kn56m74K52Q87J021Q92P24L49l20r40j085p01n9N59R15P82J48
$$ 156585 156584 156947 156949 156393 155919 156171 157058 158079 158971 159695 160044 159724 158784 157699 156998 156939 157498 158413 159195 159343
56482A59343o25j006o93J24Q98J122P68L07K19N08Q32R91J093J221J256J078Q00
$$ 159343 158718 157712 157019 157143 158041 159163 159931 160238 160457 160965 161797 162788 163881 165102 166358 167436 168236
56465A68236N67L05j97r33j510j389m33P84J403J124M94K34M17N72M49K54K34
$$ 168236 168803 169108 168911 167978 166468 165079 164646 165430 166833 167957 168451 168685 169102 169674 170123 170377 170611
56448A70611K91K02o3l54n05l91M7P47J525K087K133J559O60j01o24j198j807
$$ 170611 170902 171104 171041 170687 170182 169791 169838 170585 172110 174197 176330 177889 178549 178448 177824 176626 174819
56431A74819j865j012J53O89M87K58M57P96Q84P80P77J026J464J786J521N83l17
$$ 174819 172954 171942 172095 172784 173271 173529 173986 174782 175666 176446 177223 178249 179713 181499 183020 183603 183286
56414A83286k89O12J375J192J87r52j547j129J85J431J526N66k45j46M06P30R03
$$ 183286 182997 183609 184984 186176 186363 185411 183864 182735 182920 184351 185877 186443 186198 186052 186458 187188 188091
56397A88091J241J477J153M51K6K08P77J317J536J448J423J748K028J621P05K38
$$ 188091 189332 190809 191962 192413 192439 192647 193424 194741 196277 197725 199148 200896 202924 204545 205250 205488
56381B05488N63Q94O36L72P57J261R49K6m27k8N64P71P27P59R62J348J870K237
$$ 205488 206051 206945 207581 207953 208710 209971 210920 210946 210519 210491 211055 211826 212553 213312 214274 215622 217492 219729
56363B19729K214J957J687J249N38K9K63R15J214J073J117J542J837J727J644
$$ 219729 221943 223900 225587 226836 227374 227403 227666 228581 229795 230868 231985 233527 235364 237091 238735
56348B38735J938K283K226J835J479J289J116Q03L48k8R8R24K065K875L137L100
$$ 238735 240673 242956 245182 247017 248496 249785 250901 251704 252052 252024 252122 253046 255111 257986 261123 264223
56332B64223K899K451J911J739K111K642K925K992L048L044K705J919R59L32L25
$$ 264223 267122 269573 271484 273223 275334 277976 280901 283893 286941 289985 292690 294609 295568 295900 296225
56317B96225N98M16m83j396j391l76R02J817K392K859L141K933K161J199P40J281
$$ 296225 296823 297239 296756 295360 293969 293593 294495 296312 298704 301563 304704 307637 309798 310997 311737 313018
56301C13018K631M078N147N975O742P159O886O134N408M829M236L732L663M136
$$ 313018 315649 319727 324874 330849 337591 344750 351636 357770 363178 368007 372243 375975 379638 383774
56287C83774M984O048P118P834Q077Q276Q775R281R413R550J0370J1733J2832
$$ 383774 388758 394806 401924 409758 417835 426111 434886 444167 453580 463130 473500 485233 498065
56274D98065J3370J3834J4523J5139J5529J6141J7488J9582K2062K4466K6358
$$ 498065 511435 525269 539792 554931 570460 586601 604089 623671 645733 670199 696557
56263F96557K7738K9324L1923L5482L9352M3489M8725N5608O3617P1844Q0001
$$ 696557 724295 753619 785542 821024 860376 903865 952590 1008198 1071815 1143659 1223660
56252A223660Q8585R8295J09396J21353J33152J44255J54985J65546J75014J82051
$$ 1223660 1312245 1410540 1519936 1641289 1774441 1918696 2073681 2239227 2414241 2596292
56242B596292J86251J87873J86417J80650J70114J55515J37284J15016Q8763N9937
$$ 2596292 2782543 2970416 3156833 3337483 3507597 3663112 3800396 3915412 4004175 4064112
56232D064112L0169J09k9959n8963q5313j07966j26662j41502j52751j60771j65735
$$ 4064112 4094281 4094390 4064431 4005468 3920155 3812189 3685527 3544025 3391274 3230503 3064768
56221C064768j67660j66853j63876j58941j51918j43217j34025j25314j17163
$$ 3064768 2897108 2730255 2566379 2407438 2255520 2112303 1978278 1852964 1735801
56212A735801j09269j01458r3442q4945p6472o9203o3546n8618n3598m8794m4719
$$ 1735801 1626532 1525074 1431632 1346687 1270215 1201012 1137466 1078848 1025250 976456 931737
56201I31737m1012l7141l3454l0477k7778k4571k1141j8490j6792j5200j3201
$$ 931737 890725 853584 820130 789653 761875 737304 716163 697673 680881 665681 652480
56190F52480j1279j0030r338q613p441n903m499l748l626l617l415l225l079k511
$$ 652480 641201 631171 621833 613220 605779 599876 595377 591629 588003 584386 580971 577746 574667 572156
56176E72156j351l14r4l77l97j8L86P53J242J666J840K150K973L842M057L837
$$ 572156 570805 570491 570397 570020 569623 569605 569991 570744 571986 573652 575492 577642 580615 584457 588514 592351
56160E92351L971M559N157N943P606R930J1724J2376J2524J2969J3848J5269J7628
$$ 592351 596322 600881 606038 611981 619587 629517 641241 653617 666141 679110 692958 708227 725855
56147G25855K0794K3878K6542K9799L4781M1233M7969N4302O0263O5666O9847
$$ 725855 746649 770527 797069 826868 861649 902882 950851 1005153 1065416 1131082 1200929
56136A200929P2221P2533P0565O6257O0276N3919M8294M3791M0353L7817L5712
$$ 1200929 1273150 1345683 1416248 1482505 1542781 1596700 1644994 1688785 1729138 1766955 1802667
56125A802667L3081K8887K2731J5078O877j032q238j4793k1113k7718l4938m2711
$$ 1802667 1835748 1864635 1887366 1902444 1909321 1908289 1900051 1885258 1864145 1836427 1801489 1758778
56113A758778n0649n8141o4384o8527p0071o9176o6420o2321n7138n1027m4107
$$ 1758778 1708129 1649988 1585604 1517077 1447006 1377830 1311410 1249089 1191951 1140924 1096817
56102A096817l6525k8849k2322j8052j5819j4092j1636q671o182m526l235j914
$$ 1096817 1060292 1031443 1009121 991069 975250 961158 949522 940851 934669 930143 926908 924994
56090I24994p02K17J012J995L230M499N524O160O474O671O911P238P657Q162Q725
$$ 924994 924292 924509 925521 927516 930746 935245 940769 946929 953403 960074 966985 974223 981880 990042 998767
56075I98767R351J0140J1052J1758J1986J1999J2364J3218J4142J4792J5219J5576
$$ 998767 1008118 1018258 1029310 1041068 1053054 1065053 1077417 1090635 1104777 1119569 1134788 1150364
56063A150364J5879J6226J6749J7291J7514J7441J7360J7232J6825J6499J6973
$$ 1150364 1166243 1182469 1199218 1216509 1234023 1251464 1268824 1286056 1302881 1319380 1336353
56052A336353J8059J8526J7749J6705J6699J7734J8911J9851K0879K2103K3201
$$ 1336353 1354412 1372938 1390687 1407392 1424091 1441825 1460736 1480587 1501466 1523569 1546770
56041A546770K4007K4684K5378K6138K7116K8440K9989L1517L2870L3868L4444
$$ 1546770 1570777 1595461 1620839 1646977 1674093 1702533 1732522 1764039 1796909 1830777 1865221
56030A865221L4956L5943L7321L8444L9169M0167M1830M3649M5195M6843M8950
$$ 1865221 1900177 1936120 1973441 2011885 2051054 2091221 2133051 2176700 2221895 2268738 2317688
56019B317688N1096N2916N4944N7732O0839O3561O6118O9181P2708P6169P9550
$$ 2317688 2368784 2421700 2476644 2534376 2595215 2658776 2724894 2794075 2866783 2942952 3022502
56008C022502Q3232Q7257R1542R6366J01899J07654J13180J18793J24847J30938
$$ 3022502 3105734 3192991 3284533 3380899 3482798 3590452 3703632 3822425 3947272 4078210
55998D078210J36706J42819J50124J58463J67273J76778J87502J99227K11598
$$ 4078210 4214916 4357735 4507859 4666322 4833595 5010373 5197875 5397102 5608700
55989E608700K25173K40729K58091K76852K97562L20880L46215L72676M00805
$$ 5608700 5833873 6074602 6332693 6609545 6907107 7227987 7574202 7946878 8347683
55980H347683M31943M66538N04665N47582N97047O53558P17048P88871Q71335
$$ 8347683 8779626 9246164 9750829 10298411 10895458 11549016 12266064 13054935 13926270
55971A3926270R65841J073486J197126J341003J508963J705382J937681K216003
$$ 13926270 14892111 15965597 17162723 18503726 20012689 21718071 23655752 25871755
55963B5871755K551365K956923L451140M057770M803863N720354O842615Q205436
$$ 25871755 28423120 31380043 34831183 38888953 43692816 49413170 56255785 64461221
55955F4461221R837109J1761436J4003008J6582219J9498534K2704942K6054449
$$ 64461221 74298330 86059766 100062774 116644993 136143527 158848469 184902918
55948A84902918K9198316L1486753L2007770K9865253K4612804J6581213O855004
$$ 184902918 214101234 245587987 277595757 307461010 332073814 348655027 355510031
55941C55510031l117622j2045135j9140178k4151666k7174264k8440301k8224120
$$ 355510031 352392409 340347274 321207096 297055430 269881166 241440865 213216745
55934B13216745k6839209k4639913k1984573j9184270j6471470j3993547j1821106
$$ 213216745 186377536 161737623 139753050 120568780 104097310 90103763 78282657
55927G8282657r966545q408719p113042o040854n153559m417341l805760l297299
$$ 78282657 68316112 59907393 52794351 46753497 41599938 37182597 33376837 30079538
55919C0079538k872464k514730k212011j954890j734489j543485j377530j233599
$$ 30079538 27207074 24692344 22480333 20525443 18790954 17247469 15869939 14636340
55911A4636340j107907r96823q98546q12127p35659o67039o05656n51608n03818
$$ 14636340 13528433 12531610 11633064 10820937 10085278 9418239 8812583 8260975 7757157
55902G757157m60443m20874l85772l55182l27826l02394k78606k56768k36948
$$ 7757157 7296714 6875840 6490068 6134886 5807060 5504666 5226060 4969292 4732344
55893D732344k18825k02040j86565j72676j60336j48787j37282j26226j16753
$$ 4732344 4513519 4311479 4124914 3952238 3791902 3643115 3505833 3379607 3262854
55884C262854j09259j03205r8460r5609r4460r3436r1230q8097q4899q1848p8935
$$ 3262854 3153595 3050390 2951930 2856321 2761861 2668425 2577195 2489098 2404199 2322351 2243416
55873B243416p6618p5000p3078o9939o6162o3067o0919n8822n6117n2951m9663
$$ 2243416 2166798 2091798 2018720 1948781 1882619 1819552 1758633 1699811 1643694 1590743 1541080
55862A541080m6490m3736m1598l9786l7868l5853l4026l2362l0609k8776k7096
$$ 1541080 1494590 1450854 1409256 1369470 1331602 1295749 1261723 1229361 1198752 1169976 1142880
55851A142880k5760k4955k4850k5166k5103k4209k2993k2265k2148k2118k1691
$$ 1142880 1117120 1092165 1067315 1042149 1017046 992837 969844 947579 925431 903313 881622
55840H81622k0694j9217j7752j7002j7011j6934j6061j4752j3778j3186j2444
$$ 881622 860928 841711 823959 806957 789946 773012 756951 742199 728421 715235 702791
55829G02791j1436j0527r845r115q261p613p463p800q424r093r668j0304j1285
$$ 702791 691355 680828 670983 661868 653607 645994 638531 630731 622307 613214 603546 593242 581957
55816E81957j2372j2728j1925j0643r840r494q806p491o209n598n402m728k953
$$ 581957 569585 556857 544932 534289 524449 514955 506149 498658 492449 486851 481449 476721 473768
55803D73768l31K157L671M341N011O066O795O252M394K083J97r31j470j936k802
$$ 473768 473437 475594 479265 483606 488617 494683 501478 507730 512124 514207 514404 513473 512003 510067 507265
55788E07265l978m838n094n336o305p894r311j0038j0220j0291j0639j1406j2247
$$ 507265 503287 498449 493355 488019 481714 473820 464509 454471 444251 433960 423321 411915 399668
55775C99668j2450j1635j0132q415o525m428k596j631j524j797k130k425k495
$$ 399668 387218 375583 365451 357036 350511 346083 343487 341856 340332 338535 336405 333980 331485
55762C31485k255k055k284k878l587m486n630o539o722o485o548o979p274p262
$$ 331485 329230 327175 324891 322013 318426 313940 308310 301771 295049 288564 282016 275037 267763 260501
55748B60501p155o740n472l539j986j502j718j975k077k049j746j128n49l64n77
$$ 260501 253346 246606 241134 237595 235609 234107 232389 230414 228337 226288 224542 223414 222865 222501 221924
55733B21924r48j147q19oN19kj179j887j932k368l755n149n441m890m376l868
$$ 221924 220976 219829 219010 219004 219523 219521 218342 216455 214523 212155 208400 203251 197810 192920 188544 184676
55717A84676k750j257m13n34q17n91m3M88J130J975K610K673K399K155J833J119
$$ 184676 181926 180669 180256 179722 178905 178314 178271 178759 179889 181864 184474 187147 189546 191701 193534 194653
55701A94653R4r04j799k669l275l144k271j355j231k189l776n034n039l567j426
$$ 194653 194747 193843 192044 189375 186100 182956 180685 179330 178099 175910 172134 167100 162061 158494 157068
55686A57068J74P28P97J146J835K387K614K816L159L277K736J703P76K95P3j19
$$ 157068 157242 157970 158767 159913 161748 164135 166749 169565 172724 176001 178737 180440 181216 181511 181584 181465
55670A81465j34J49L13k65j492k423k327j573j010p89l64M72J258J701K091K548
$$ 181465 181331 181480 181793 181528 180036 177613 175286 173713 172703 171914 171550 172022 173280 174981 177072 179620
55654A79620K536J672N87K01N10P79P39P47Q22M49m92j332j579j677k323l439
$$ 179620 182156 183828 184415 184616 185126 185905 186644 187391 188213 188662 188170 186838 185259 183582 181259 177820
55638A77820m315m519m243l912l791l909m102m124l782l051k085j292j118j442
$$ 177820 173505 168986 164743 160831 157040 153131 149029 144905 141123 138072 135987 134695 133577 132135
55624A32135j416m49P99J044R3q99r91n21k72l09k87k48m84r80j525k061k494
$$ 132135 130719 130270 131069 132113 132206 131307 130316 129795 129523 129214 128927 128679 128195 127215 125690 123629 121135
55607A21135k578k408k487k871k766j679l90j7n45j125j381j497j392q25k30l38
$$ 121135 118557 116149 113662 110791 108025 106346 105956 105939 105394 104269 102888 101391 99999 99174 98944 98606
55591I8606r80j243q06k28J64O29J096J041N83O83J696K693K850K643K924L550
$$ 98606 97626 96383 95577 95349 95513 96142 97238 98279 98862 99545 101241 103934 106784 109427 112351 115901
55575A15901L882M104N019O700Q229Q810Q451P538O304M919L588K367J043o43
$$ 115901 119783 123887 128906 135606 143835 152645 161096 168634 174938 179857 183445 185812 186855 186212
55561A86212k698m815o526p426p427o781n867n082m735m851n073n045m832m634
$$ 186212 183514 178699 172173 164747 157320 150539 144672 139590 134855 130004 124931 119886 115054 110420
55547A10420m202l086j501l05P9J25K93L16j82q64j084p57l06j4J26J25P9K36
$$ 110420 106218 103132 101631 101326 101405 101530 101823 102139 101957 101093 100009 99252 98946 98932 99058 99183 99262 99498
55529I9498N64N10k83j278j634j299r47r51j043r48q16r11j367k223l264l872
$$ 99498 100062 100572 100289 99011 97377 96078 95131 94180 93137 92189 91373 90462 89095 86872 83608 79736
55513G9736l534k563j780j493j248o79pM95Q89J144Q17l70j906k869k837k133
$$ 79736 76202 73639 71859 70366 69118 68439 68432 68927 69816 70960 71777 71407 69501 66632 63795 61662
55497F1662j318o72p7P12J655K280K064J001l43j284j401o80L49Q25L85k38o1
$$ 61662 60344 59672 59595 60307 61962 64242 66306 67307 66964 65680 64279 63599 63948 64773 65158 64920 64859
55480F4859P65J099N15n5K00P39N98j16n68o09p87j125r46j04N51K80n82j180
$$ 64859 65624 66723 67238 67183 67383 68122 68720 68604 68036 67427 66640 65515 64569 64465 65016 65296 64714 63534
55462F3534j089m89J68L38l04j365j932j582q28l26r2J33L05L60O88J605K589
$$ 63534 62445 61956 62124 62462 62158 60793 58861 57279 56451 56125 56033 56166 56471 56831 57519 59124 61713
55445F1713K741J987J142P65N82J89k77m65m09m05n76p90q28n16R1O00N91J55
$$ 61713 64454 66441 67583 68348 68930 69119 68842 68377 67968 67563 66987 66197 65369 64853 64944 65544 66135 66290
55427F6290j74j01J59M34Q57J401J603J209O67M75L94p7p58j031q75q96j249j317
$$ 66290 66116 66015 66174 66608 67465 68866 70469 71678 72345 72820 73214 73137 72379 71348 70473 69577 68328 67011
55409F7011p36l5J61j0l2J16O8k21m18l29q9J40K41N5l86o49l41K50M50J78R1
$$ 67011 66275 66240 66401 66391 66359 66475 66543 66322 65904 65575 65486 65626 65867 65922 65536 64887 64546 64796 65246 65424 65515
55388F5515O32J395J724J474R14K12m75p25k10P37J360J302Q36L08k06o52q58
$$ 65515 66147 67542 69266 70740 71654 71866 71391 70666 70456 71193 72553 73855 74691 74999 74793 74141 73283
55371G3283q66j039j559k154k501k629k652k347j497m72K7j55l81rQ31J441J383
$$ 73283 72417 71378 69819 67665 65164 62535 59883 57536 56039 55567 55594 55439 55058 55049 55880 57321 58704
55354E8704Q83M91M02K51l76j257j659j220m74j94m35n59j74N04J164J773K223
$$ 58704 59587 60078 60480 60731 60355 59098 57439 56219 55745 55551 55116 54557 54383 54887 56051 57824 60047
55337F0047K133J376M98J90M50O28K79l02m70N6Q37J093M68n17r73o72k85m88
$$ 60047 62180 63556 64054 64244 64694 65322 65601 65299 64829 64885 65722 66815 67283 66766 65793 65121 64836 64348
55319F4348j055j219o61J41N07J51o56j248r60J93J253J176R4p08k51J094K201
$$ 64348 63293 62074 61413 61554 62061 62212 61556 60308 59348 59541 60794 61970 62064 61356 61105 62199 64400
55302F4400K446J974J071p6j053j272o57Q8K95J41K94Q68J232R16K69q5p1j07
$$ 64400 66846 68820 69891 69815 68762 67490 66833 66921 67216 67357 67651 68519 69751 70667 70936 70851 70780 70673
55284G0673l66n25l18M7J53j11m00k58L66R21P47p5o51l33L81M76k25r56j156
$$ 70673 70307 69782 69464 69511 69664 69553 69153 68895 69261 70182 70929 70854 70203 69870 70251 70727 70502 69546 68390
55265F8390j039q97o21j82J42L61R39J790J905O82r59j635j213n95j81L41Q48
$$ 68390 67351 66454 65833 65651 65793 66154 67093 68883 70788 71470 70511 68876 67663 67068 66887 67228 68076
55248F8076P50J94J08O76Q52J6q80p09O8P3r14j654j160J71J302J676J356O20
$$ 68076 68826 69020 69128 69804 70656 70672 69792 69083 69151 69224 68310 66656 65496 65667 66969 68645 70001 70621
55230G0621q3j73N45J433J513M77r98j980k133j738j133m48K19P09R98J150J032
$$ 70621 70538 70365 70910 72343 73856 74333 73335 71355 69222 67484 66351 65903 66122 66831 67829 68979 70011
55213G0011M40l73p19l77J5r9k81K36J242J702J209M65K03L05K91J20M9J54L24
$$ 70011 70451 70078 69359 68982 68997 68898 68617 68853 70095 71797 73006 73471 73674 73979 74270 74390 74439 74593 74917
55194G4917M56M69L39K45K91J12o90j640j675o27L00P0q32j236r22n93n89m97
$$ 74917 75373 75842 76181 76426 76717 76829 76139 74499 72824 72197 72497 72567 71735 70499 69577 68984 68395 67898
55176F7898l1N20P95Q22Q16R17J166J424J401J028O83O60O70L08k64o02p99j195
$$ 67898 67867 68387 69182 70004 70820 71737 72903 74327 75728 76756 77439 78099 78769 79077 78813 78211 77412 76217
55158G6217j503j014J57R21O37l6k05J2j35p91j370j446j145o93j46L65N85N48
$$ 76217 74714 73700 73857 74778 75415 75379 75174 75186 75051 74260 72890 71444 70299 69606 69460 69825 70410 70958
55140G0958O71J229J886K050J601J071J008J332J455R78J02o87j093j076o50L3
$$ 70958 71629 72858 74744 76794 78395 79466 80474 81806 83261 84239 84341 83654 82561 81485 80835 80868
55124H0868N37M04l20j100j478j429j091n27J01M04J51l55n89m05j36j52n25j044
$$ 80868 81405 81809 81489 80389 78911 77482 76391 75864 75965 76369 76520 76165 75576 75171 75035 74883 74358 73314
55106G3314j305q58L87J771K269J527L45j59K56Q74J028Q08O72P84R89J165J258
$$ 73314 72009 71151 71538 73309 75578 77105 77450 77291 77547 78421 79449 80257 80929 81713 82702 83867 85125
55089H5125J095N88P5J8L58N77N17O53J265J739J251o6j158j238n23L36J017J511
$$ 85125 86220 86808 86883 86901 87259 87836 88353 89006 90271 92010 93261 93195 92037 90799 90276 90612 91629 93140
55071I3140J701J425Q24K80n7l60p18r25q30n87l30J20P87J027J46j353j889o88
$$ 93140 94841 96266 97090 97370 97313 96953 96235 95310 94480 93893 93563 93683 94470 95497 95643 94290 92401 91713
55053I1713J022J425L58p29r36r40j529k167j844o87J60N7n48j011j173j068n85
$$ 91713 92735 94160 94518 93789 92853 91913 90384 88217 86373 85686 85846 85903 85355 84344 83171 82103 81518
55036H1518K15R02J089Q74O20N26N27M84L52K18K29L73M09J98K7K76Q26J101P90
$$ 81518 81733 82635 83724 84598 85218 85744 86271 86755 87107 87325 87554 87927 88336 88534 88561 88837 89663 90764 91554
55017I1554J57m42j011j656k137k073j473q27o33r52j372j339n71O66J700J979
$$ 91554 91711 91269 90258 88602 86465 84392 82919 82092 81459 80507 79135 77796 77225 77891 79591 81570
55001H1570J465O13po4L62Q74J088R34O51M58L92M34O93J286K132K944L385L227
$$ 81570 83035 83648 83641 83577 83939 84813 85901 86835 87486 87944 88336 88770 89463 90749 92881 95825 99210 102437
54983A02437K454J352L97j05k91n46j011j420j433j096q06q38j000q76l55J92
$$ 102437 104891 106243 106640 106535 106244 105698 104687 103267 101834 100738 99932 99094 98094 97218 96863 97055
54967I7055K61k74j027j439j166k61Q89J743J840J070j46j078j295j058q75p62
$$ 97055 97316 97042 96015 94576 93410 93149 94038 95781 97621 98691 98545 97467 96172 95114 94239 93477
54951I3477k42O91J195N67o54j229p16J48N92N70K75l40j012r34K55J645K020
$$ 93477 93235 93926 95121 95688 95034 93805 93089 93237 93829 94399 94674 94334 93322 92388 92643 94288 96308
54934I6308J466J189J732K233J727M92l66k88L39R48J466K109K865L446L628L522
$$ 96308 97774 98963 100695 102928 104655 105147 104781 104493 104832 105780 107246 109355 112220 115666 119294 122816
54918A22816L428L541L845M196M347M046L277K310J315M3j729l519m498m581m590
$$ 122816 126244 129785 133630 137826 142173 146219 149496 151806 153121 153164 151435 147916 143418 138837 134247
54903A34247n027n313m707l458k429j927j634j460j669k150k236j520l93L97M87
$$ 134247 129220 123907 119200 115742 113313 111386 109752 108292 106623 104473 102237 100717 100324 100721 101208
54888A01208J38m2L54J080J494J454J578K275K965K880K289K128K661L344L877
$$ 101208 101346 101304 101658 102738 104232 105686 107264 109539 112504 115384 117673 119801 122462 125806 129683
54873A29683M431M779M325L211K341J939J063q10k689l292k730k127k139k618
$$ 129683 134114 138893 143218 146429 148770 150709 151772 150962 148273 144981 142251 140124 137985 135367
54859A35367l290l831l669k583j383j117j647j874j332p60r32j667k298k496k299
$$ 135367 132077 128246 124577 121994 120611 119494 117847 115973 114641 113881 112949 111282 108984 106488 104189
54844A04189j806j235r37r84j056r79j049j507j949j776j054m56k99j49M15J053
$$ 104189 102383 101148 100211 99227 98171 97192 96143 94636 92687 90911 89857 89401 89102 88953 89368 90421
54828I0421J060L36m38o46l43M8K93L74K40j22n11o65n40k15K73P77R44O50L41
$$ 90421 91481 91817 91379 90733 90390 90438 90731 91105 91345 91223 90712 90047 89507 89292 89565 90342 91286 91936 92277
54809I2277M83Q36Q10M45L67P09Q38L87j37j89j2j45n26o84n06k84j87j55q8J48
$$ 92277 92760 93596 94406 94851 95218 95927 96765 97152 97015 96826 96814 96669 96143 95459 94953 94669 94482 94327 94239 94387
54789I4387P01J330J405P75K66O39J370J190j50j480j712j001j29N68J217J758
$$ 94387 95088 96418 97823 98598 98864 99503 100873 102063 101913 100433 98721 97720 97591 98159 99376 101134
54773A01134J951J891J987K456L140L866M581N086N060M584M315M667N028M431
$$ 101134 103085 104976 106963 109419 112559 116425 121006 126092 131152 135736 140051 144718 149746 154177
54759A54177K987J920J837J696K67j975l443l653l694m333m888m491l456k685
$$ 154177 157164 159084 160921 162617 162884 160909 157466 153813 150119 145786 140898 136407 132951 130266
54745A30266k406k370k563k916k783j777p30p87j688j991j059J90P03N66M50N99
$$ 130266 127860 125490 122927 120011 117228 115451 114721 113934 112246 110255 109196 109386 110089 110655 111105 111704
54729A11704Q83J319J941K504K758K838L075L531M005M276M256M054L916L905
$$ 111704 112587 113906 115847 118351 121109 123947 127022 130553 134558 138834 143090 147144 151060 154965
54715A54965L570K379N70q42j197j054j554l083m822n650n262m394l978m133m102
$$ 154965 158535 160914 161484 160642 159445 158391 156837 153754 148932 143282 138020 133626 129648 125515 121413
54700A21413l241j893r85r25j216j144n36K37O72M79j50n81l10M11P86L45o24
$$ 121413 118172 116279 115294 114369 113153 112009 111473 111710 112382 112861 112711 112130 111820 112231 113017 113362 112738
54683A12738j541k014j898j262n43l61r08j735k227k139j540o23K14M55j4o46
$$ 112738 111197 109183 107285 106023 105480 105119 104211 102476 100249 98110 96570 95947 96161 96616 96602 95956
54667I5956p55k11N47J033J108R66R08J043J133Q81L81N8R1K01J09q8j95k64l98
$$ 95956 95201 94990 95537 96570 97678 98644 99552 100595 101728 102609 102990 103048 103139 103340 103449 103361 103166 102902 102504
54648A02504n09n27o21q49q49k68N74R04M51j98l11J61O41O39K46p8o2J27J73
$$ 102504 101995 101468 100847 99998 99149 98881 99455 100359 100810 100612 100301 100462 101103 101742 101988 101910 101848 101975 102148
54629A02148Q9J80N85R92R67M16l42q87r59n69mL36L07J60J59J82o9m98n91j05
$$ 102148 102237 102417 103002 103994 104961 105377 105035 104148 103189 102620 102616 102952 103259 103419 103578 103760 103691 103193 102602 102497
54609A02497N41P49M94K73L98O67P92P68O62L53k10p02p95o23n09l74LL62K14
$$ 102497 103038 103787 104281 104554 104952 105619 106411 107179 107841 108194 107984 107282 106487 105864 105355 104981 104984 105346 105560
54590A05560j70R9J119J783J270K11l88o29j186j812j599n92J40J44J47O58J017
$$ 105560 105390 105489 106608 108391 109661 109872 109484 108855 107669 105857 104258 103666 103806 103950 104097 104755 105772
54573A05772M46p23j525j480p38L82J428J822J441Q60O14N45L21J51L67P10O30
$$ 105772 106218 105495 103970 102490 101752 102134 103562 105384 106825 107685 108299 108844 109165 109316 109683 110393 111023
54556A11023J05m10o33n09J32J272K204K070R37k04o16m27k7M58Q54P12j46j158
$$ 111023 111128 110718 110085 109576 109708 110980 113184 115254 116191 115987 115371 114944 114917 115375 116229 116941 116795 115637
54538A15637j491r17L8O93P84N37L11K71L17L39L62L66J08n73j376j770j585j119
$$ 115637 114146 113229 113267 113960 114744 115281 115592 115863 116180 116519 116881 117247 117355 116782 115406 113636 112051 110932
54520A10932o31n8O64J279J384Q42n6p65q15j89N80Q51M59k15p22q76o54j17M33
$$ 110932 110301 110243 110907 112186 113570 114412 114356 113591 112776 112587 113167 114018 114477 114262 113540 112664 112010 111893 112326
54501A12326N01q7r30j458j510j282r08l57L45R90J401J519J357R97O02K74p0
$$ 112326 112827 112740 111810 110352 108842 107560 106652 106295 106640 107630 109031 110550 111907 112904 113506 113780 113710
54484A13710m05l85K70J153J433Q84K13O1J97Q5j39K9M80N88K77K12P43J367J521
$$ 113710 113305 112920 113190 114343 115776 116660 116873 116934 117131 117216 117077 117106 117586 118174 118451 118663 119406 120773 122294
54465A22294J270Q73K76m42p92n37k11l39o21n47l54n43q39n56J91O03M36J94
$$ 122294 123564 124437 124713 124271 123479 122942 122731 122392 121771 121224 120870 120327 119488 118932 119123 119726 120162 120356
54447A20356O8k87p48n78L42J011O06m34j094j007m94O1M00L67J39J45M57O82
$$ 120356 120424 120137 119389 118811 119153 120164 120770 120336 119242 118235 117741 117802 118202 118569 118708 118853 119310 119992
54429A19992O50O48P61O09Q8k66l4N56J150J639J737J032m0l16M36R04J95o82
$$ 119992 120642 121290 122051 122660 122748 122482 122448 123004 124154 125793 127530 128562 128522 128206 128642 129546 129741 129059
54411A29059m30L62R7j267k137j556k00R42J539J502Q27P5j3M07M88J13N0N41
$$ 129059 128629 128991 129088 127821 125684 124128 123928 124870 126409 127911 128738 128813 128800 129207 129695 129808 129858 130399
54393A30399Q76O73M98P29Q70N56K96O01J064J054O30K18j41n47p98o92m28k26
$$ 130399 131275 131948 132446 133175 134045 134601 134897 135498 136562 137616 138246 138464 138323 137776 136978 136286 135858 135632
54375A35632K8M22P46R55J308J759J812J413J319K024K942L287L131K966K774
$$ 135632 135660 136082 136828 137783 139091 140850 142662 144075 145394 147418 150360 153647 156778 159744 162518
54360A62518K376K216K819L726L830K709Q81j096l002m421m746l933k719j944
$$ 162518 164894 167110 169929 173655 177485 180194 181075 179979 176977 172556 167810 163877 161158 159214
54346A59214j903k389k904k861k123j303j153j628k031j984j711j427j062p31
$$ 159214 157311 154922 152018 149157 147034 145731 144578 142950 140919 138935 137224 135797 134735 134004
54332A34004p44q95m54P31J645J270K3o78k46L70K7j096j838j614j071j035j369
$$ 134004 133260 132365 131911 132642 134287 135557 135580 134902 134656 135026 135053 133957 132119 130505 129434 128399 127030
54315A27030j250l39P82J352J172N72k9l45l43k77m14o41n95k22J12J61P6k9k95
$$ 127030 125780 125441 126223 127575 128747 129319 129290 128945 128602 128325 127911 127270 126675 126453 126565 126726 126802 126773 126478
54296A26478p14q82n10J04M96N69M89L62L38O25J038R55K03m42k27M82P25L20
$$ 126478 125764 124882 124372 124476 124972 125541 126030 126392 126730 127355 128393 129348 129551 129109 128882 129364 130089 130409
54278A30409q4j46j91l79l29K10R03J336J459J301P45j42r27j176p98P4J189K054
$$ 130409 130325 130179 129988 129609 129280 129490 130393 131729 133188 134489 135234 135092 134165 132989 132191 132265 133454 135508
54260A35508K121J343K69m99p27l84M28J270J558J166N67J75m4k05j54J18K03
$$ 135508 137629 138972 139241 138742 138015 137631 138059 139329 140887 142053 142620 142795 142751 142546 142392 142510 142713
54243A42713k01p55r09o48m06m02m78n38o91q68p25j31N12P19N53N04P50Q80N07
$$ 142713 142512 141757 140848 140200 139794 139392 138914 138376 137685 136817 136092 135961 136473 137192 137745 138249 138999 139879 140386
54224A40386j13m62n91r78j536j438l50P63P48j70p19l12L88O61O04N25K68l18
$$ 140386 140273 139811 139220 138242 136706 135268 134918 135681 136429 136259 135540 135228 135616 136277 136881 137406 137674 137356
54206A37356q23q04m76l88o10p26m60M1M85O25L67j04l64j90J93M65O30Q89J248
$$ 137356 136533 135729 135253 134865 134255 133529 133069 133110 133595 134220 134587 134483 134119 133929 134122 134587 135217 136106 137354
54187A37354J491J334N15r43k375k768j757j32R69J113O31Nl78k39L41Q21P83
$$ 137354 138845 140179 140694 139751 137376 134608 132851 132719 133688 134801 135432 135437 135059 134820 135161 135982 136765
54170A36765L97J4l89q71j052o17o3j74q05r97k65Q79J768K148J819N87j020j780
$$ 136765 137162 137176 136787 135916 134864 134247 134184 134010 133205 132208 131943 132822 134590 136738 138557 139144 138124 136344
54152A36344j096J46O29J21n73q44q32q56q58n58J37R21J277R65M12L43R30J544
$$ 136344 135248 135394 136023 136144 135571 134727 133895 133039 132181 131623 131760 132681 133958 134923 135335 135678 136608 138152
54134A38152J542R83K97l28q49r73m31M69J059J099Q99P35N77N08Q31J528J960
$$ 138152 139694 140677 140974 140646 139797 138824 138393 138862 139921 141020 141919 142654 143231 143739 144570 146098 148058
54117A48058J515M34l48j70P30J539J682J240O55K35l2k16k72j57L5K01L68N68
$$ 148058 149573 150007 149659 149489 150219 151758 153440 154680 155335 155570 155538 155322 155050 154893 154928 155129 155497 156065
54099A56065P36Q30R83J336J800K200K527K853L068L009K807K795K966K814J921
$$ 156065 156801 157631 158614 159950 161750 163950 166477 169330 172398 175407 178214 181009 183975 186789 188710
54084A88710N20p58j593k191k800l241l134k510j914j759j815j569r93n37m21
$$ 188710 189230 188472 186879 184688 181888 178647 175513 173003 171089 169330 167515 165946 164953 164416 163995
54069A63995l74k32k32m52m26J96R64J178Q22M20J98J09M64J629L113L864L696
$$ 163995 163621 163389 163157 162705 162279 162475 163439 164617 165439 165859 166057 166166 166630 168259 171372 175236 178932
54052A78932L526L896M142L567K614K089J910J527J040R57J139J051Q96J471K785
$$ 178932 182458 186354 190496 194063 196677 198766 200676 202203 203243 204200 205339 206390 207286 208757 211542
54037B11542L847M130M341N229O347O585N551L862K390J671J811K465L006L038
$$ 211542 215389 219519 223860 229089 235436 242021 247572 251434 253824 255495 257306 259771 262777 265815
54023B65815K680K254J883J592J414J178N15n79j507j889k260l324m686n174m533
$$ 265815 268495 270749 272632 274224 275638 276816 277331 276752 275245 273356 271096 267772 263086 257912 253379
54008B53379l969m544n579n453l753j900j444k379l482l864l621l189k714k204
$$ 253379 249410 244866 239287 233834 230081 228181 226737 224358 220876 217012 213391 210202 207488 205284
53994B05284j775j493j265j132j343j871k200j964j470j147q73m11j51o47j538
$$ 205284 203509 202016 200751 199619 198276 196405 194205 192241 190771 189624 188751 188340 188189 187542 186004
53979A86004j854j462j275j739k080j545n50J04M77J101J826K042J781J675J911
$$ 186004 184150 182688 181413 179674 177594 176049 175499 175603 176080 177181 179007 181049 182830 184505 186416
53964A86416J994J643J248J333K101L478N137O508P308P963Q969R963J0166R613
$$ 186416 188410 190053 191301 192634 194735 198213 203350 209858 217166 225129 234098 244061 254227 263840
53950B63840R056Q582P336M897J959p25l175n382o610o299n076l984l150k051
$$ 263840 272896 281478 288814 293711 295670 294945 291770 286388 279778 273479 268403 264419 261269 259218
53936B59218p09K60O08O84P59Q58J135J775K516K905L016L307L821M147M148M096
$$ 259218 258509 258769 259377 260061 260820 261678 262813 264588 267104 270009 273025 276332 280153 284300 288448 292544
53920B92544M077L984M073M798N933O614O523O290O489O865O960O775O287N040
$$ 292544 296621 300605 304678 309476 315409 322023 328546 334836 341325 348190 355150 361925 368212 373252
53906C73252K906P62k94j87K12J59m86j559k747l628m085m520n213n763n714n463
$$ 373252 376158 376920 376626 376439 376651 376810 376324 374765 372018 368390 364305 359785 354572 348809 343095 337632
53890C37632n786o651p234p165o938o960o942o474n632m734l999l684l968m456
$$ 337632 331846 325195 317961 310796 303858 296898 289956 283482 277850 273116 269117 265433 261465 257009
53876B57009m339l456k644k655l187l487l392l274l284l307l357l437l239k613
$$ 257009 252670 249214 246570 243915 240728 237241 233849 230575 227291 223984 220627 217190 213951 211338
53862B11338k105k330k945l040k464k007k089k147j695j183j194j338p32O28J693
$$ 211338 209233 206903 203958 200918 198454 196447 194358 192211 190516 189333 188139 186801 186069 186697 188390
53847A88390J632P11j83n24m10j59M7J88K71K65J20j76n17p14o08k17K17M26M05
$$ 188390 190022 190733 190550 190026 189616 189457 189504 189692 189963 190228 190348 190172 189655 188941 188333 188116 188333 188759 189164
53828A89164M16O14P82O49L27J82K93L76L12L69O93R65Q22M77M89J065J820K281
$$ 189164 189580 190194 190976 191625 191952 192134 192427 192803 193115 193484 194177 195142 195964 196441 196930 197995 199815 202096
53810B02096K363K325K475K917L499L971M223M382M577M803N070N467N864N786
$$ 202096 204459 206784 209259 212176 215675 219646 223869 228251 232828 237631 242701 248168 254032 259818
53796B59818M934L743K979K834K753K261J563J161J193J412J501J157J66j201
$$ 259818 264752 268495 271474 274308 277061 279322 280885 282046 283239 284651 286152 287309 287475 286274
53782B86274k067j797r36q17k025l636m362m066l739m043m503m348l631l113l234
$$ 286274 284207 282410 281474 280657 278632 274996 270634 266568 262829 258786 254283 249935 246304 243191 239957
53767B39957l685l993m062l998l756l258k705k376k255k063j655j212r99j116
$$ 239957 236272 232279 228217 224219 220463 217205 214500 212124 209869 207806 206151 204939 203940 202824
53753B02824j480j864k040j943j730j515j117l21O49J160Q12j07q68r66n16r1
$$ 202824 201344 199480 197440 195497 193767 192252 191135 190814 191463 192623 193435 193328 192460 191494 190978 190887
53737A90887j30m72n08M6P03Q28N21M81R50J300R86M35N52J523K507K608J776
$$ 190887 190757 190285 189777 189823 190526 191354 191875 192356 193306 194606 195592 196027 196579 198102 200609 203217 204993
53720B04993P91M71R65J668J859J459J038J062J369J590J761K135K555K478J716
$$ 204993 205784 206255 207220 208888 210747 212206 213244 214306 215675 217265 219026 221161 223716 226194 227910
53705B27910P52K85O18J509K393K736K545K473L076L957M134L319K296J821J718
$$ 227910 228662 228947 229565 231074 233467 236203 238748 241221 244297 248254 252388 255707 258003 259824 261542
53690B61542J457J113J020R24K12r95j747j433n43nk07q44j413j560j198n66o7
$$ 261542 262999 264112 265132 266056 266268 265273 263526 262093 261550 261545 261338 260494 259081 257521 256323 255757 255690
53673B55690J00Qk84p60j163j095o00k80n05q61p65k73J48L74O36R35R88P34L62
$$ 255690 255790 255798 255514 254754 253591 252496 251896 251616 251111 250250 249485 249212 249360 249734 250370 251305 252293 253027 253389
53654B53389j41q66j382r26N14J811J857P88k89n08J84J299K213K463K130J860
$$ 253389 253248 252382 251000 250074 250588 252399 254256 255044 254755 254247 254431 255730 257943 260406 262536 264396
53638B64396K099K450K182J391J018J584K437K621K170J998K619L442L523K724
$$ 264396 266495 268945 271127 272518 273536 275120 277557 280178 282348 284346 286965 290407 293930 296654
53624B96654J903J981L045M340N017M762L849K808K109J990K356K818K992K806
$$ 296654 298557 300538 303583 307923 312940 317702 321551 324359 326468 328458 330814 333632 336624 339430
53610C39430K480K275K330K667L169L571L601L266K876K688K627K388J829J181
$$ 339430 341910 344185 346515 349182 352351 355922 359523 362789 365665 368353 370980 373368 375197 376378
53596C76378Q46R90J297J188L84p28j431j456j259j368j631j410n23L63N27K5
$$ 376378 377224 378214 379511 380699 381083 380355 378924 377468 376209 374841 373210 371800 371277 371640 372167 372192
53580C72192n26q55j246j868k356k368k140k161k403k365j817j098o37m60l98
$$ 372192 371666 370811 369565 367697 365341 362973 360833 358672 356269 353904 352087 350989 350352 349892 349494
53565C49494m16n70p42p06m04M0N40J047J361J109J58r79j428q10K77Q70O88K76
$$ 349494 349078 348508 347766 347060 346656 346696 347236 348283 349644 350753 350911 349932 348504 347694 347971 348841 349529 349805
53547C49805J35K24M31R59J816K423K386K263K794L658L954L814M364N830O936
$$ 349805 349940 350164 350595 351554 353370 355793 358179 360442 363236 366894 370848 374662 379026 384856 391792
53532C91792O759O112O235P000P461P537P910Q609R004R079R561J0539J1180J1082
$$ 391792 398551 404663 410898 417898 425359 432896 440806 449415 458419 467498 477059 487598 498778 509860
53518E09860J1032J1814J3091J4050J4562J5156J6215J7747J9533K1068K1677
$$ 509860 520892 532706 545797 559847 574409 589565 605780 623527 643060 664128 685805
53507F85805K1258K0694K0979K2021K2756K2418K1306K0271J9729J9356J8579
$$ 685805 707063 727757 748736 770757 793513 815931 837237 857508 877237 896593 915172
53496I15172J7230J5724J4694J4506J5057J5861J6276J5982J5393J5325J5981
$$ 915172 932402 948126 962820 977326 992383 1008244 1024520 1040502 1055895 1071220 1087201
53485A087201J6596J6489J6085J6247J6824J6756J5611J4122J2977J1922J0506
$$ 1087201 1103797 1120286 1136371 1152618 1169442 1186198 1201809 1215931 1228908 1240830 1251336
53474A251336Q898P457O032M298K320K46k061m546o544p564q121r103j0570j1856
$$ 1251336 1260234 1267691 1273723 1278021 1280341 1280587 1278526 1273980 1267436 1259872 1251751 1242648 1232078 1220222
53460A220222j2641j3168j3505j3438j3163j3395j4476j5941j7110j7768j8036
$$ 1220222 1207581 1194413 1180908 1167470 1154307 1140912 1126436 1110495 1093385 1075617 1057581
53449A057581j8018j7774j7369j6750j5762j4483j3279j2399j1674j0749r528
$$ 1057581 1039563 1021789 1004420 987670 971908 957425 944146 931747 920073 909324 899796
53438H99796q237p104o015m606k768r83J08M86P59J294J793J978K212L022M368
$$ 899796 891559 884455 878440 873834 871066 870083 870191 870677 871436 872730 874523 876501 878713 881735 886103
53423H86103N846P329Q830J0064J0755J1320J2578J4719J7032J8721J9631K0241
$$ 886103 891949 899278 908108 918172 928927 940247 952825 967544 984576 1003297 1022928 1043169
53411A043169K1237K3000K5107K6599K7084K7348K8302K9740L0897L1872L3466
$$ 1043169 1064406 1087406 1112513 1139112 1166196 1193544 1221846 1251586 1282483 1314355 1347821
53400A347821L5742L7839L9361M0888M2757M4410M5444M6318M7405M8200M8189
$$ 1347821 1383563 1421402 1460763 1501651 1544408 1588818 1634262 1680580 1727985 1776185 1824374
53389A824374M7784M7577M7235M6050M4173M2454M1273M0222L8811L6798L4064
$$ 1824374 1872158 1919735 1966970 2013020 2057193 2099647 2140920 2181142 2219953 2256751 2290815
53378B290815L0785K7570K4767K1797J7855J3099Q471M365K36m379r204j3834
$$ 2290815 2321600 2349170 2373937 2395734 2413589 2426688 2435159 2439524 2439760 2435381 2426177 2412343
53366B412343j8362k3078k7858l2239l5861l8660m0759m2258m3128m3335m3134
$$ 2412343 2393981 2370903 2343045 2310806 2274945 2236285 2195526 2153268 2110140 2066805 2023671
53355B023671m2942m2741m1979m0422l8746l7748l7259l6518l5365l4333l3617
$$ 2023671 1980729 1937988 1896009 1855587 1816841 1779093 1741834 1705316 1669951 1635618 1602001
53344A602001l2892l2195l2040l2288l1816k9894k7262k5226k4076k3000k1236
$$ 1602001 1569109 1536914 1504874 1472586 1440770 1410876 1383614 1358388 1334312 1311312 1290076
53333A290076j8766j6139j4112j3232j3300j3481j3301j3227j3812j4628j4708
$$ 1290076 1271310 1255171 1241059 1227827 1214527 1201046 1187745 1174518 1160706 1146078 1131370
53322A131370j3830j2685j1801j1024j0124r271q639q075p333o370n205l900k723
$$ 1131370 1117540 1104855 1093054 1082030 1071906 1062635 1053996 1045921 1038588 1032218 1027013 1023113 1020390
53309A020390j905j177j9J511K754L477M308N723P268Q343R268J0787J2855J4714
$$ 1020390 1018485 1017308 1017289 1018800 1021554 1025031 1029339 1035062 1042330 1050673 1059941 1070728 1083583 1098297
53295A098297J6048J7266J8651K0002K1248K2596K3724K3659K2023J9818J8373
$$ 1098297 1114345 1131611 1150262 1170264 1191512 1214108 1237832 1261491 1283514 1303332 1321705
53284A321705J7815J7242J6104J4671J3205J1345Q676N409K262k24k083l784n778
$$ 1321705 1339520 1356762 1372866 1387537 1400742 1412087 1420763 1426172 1428434 1428210 1426127 1422343 1416565
53271A416565q096j0380j2361j4113j5739j7080j8106j9277k0981k2698k3479
$$ 1416565 1408469 1398089 1385728 1371615 1355876 1338796 1320690 1301413 1280432 1257734 1234255
53260A234255k3316k3346k4307k5449k5542k4453k3087k2049k1206k0499k0366
$$ 1234255 1210939 1187593 1163286 1137837 1112295 1087842 1064755 1042706 1021500 1001001 980635
53249I80635k1014k1862k2136k1728k1122k0669k0299j9833j9233j8530j7808
$$ 980635 959621 937759 915623 893895 872773 852104 831805 811972 792739 774209 756401
53238G56401j7253j7012j6897j6388j5138j3368j1672j0454r622q820p880p026
$$ 756401 739148 722136 705239 688851 673713 660345 648673 638219 628597 619777 611897 604871
53226F04871o662p014p927q989r828j0281j0407j0396j0460j0637j0713j0510
$$ 604871 598209 591195 583268 574279 564451 554170 543763 533367 522907 512270 501557 491047
53214D91047j0274j0522j1276j1774j1281j0062r032q471p722o347m979m519m949
$$ 491047 480773 470251 458975 447201 435920 425858 416826 408355 400633 394286 389307 384788 379839
53201C79839n548n982o452o876o771o139n756o154o813o872o249n571n234n039
$$ 379839 374291 368309 361857 354981 348210 342071 336315 330161 323348 316476 310227 304656 299422 294383
53187B94383m698m234l807l491l285l137k850k262j552j196j475k103k503k365
$$ 294383 289685 285451 281644 278153 274868 271731 268881 266619 265067 263871 262396 260293 257790 255425
53173B55425j855j364j153j265j650k239k817l005k543j609p04k06j71m88r94
$$ 255425 253570 252206 251053 249788 248138 245899 243082 240077 237534 235925 235221 235015 234844 234356 233362
53158B33362j373j196l39P66J439J325N90l51j163j666j768j418p29j19j05p30
$$ 233362 231989 230793 230454 231220 232659 233984 234574 234223 233060 231394 229626 228208 227479 227360 227255 226525
53142B26525j337j200m43O8j68o56n77J77R40J082O30J57K37R16J578J508P21
$$ 226525 225188 223988 223545 223613 223445 222789 222212 222389 223329 224411 225041 225198 225435 226351 227929 229437 230158
53125B30158N7K20R29J326J054O37Q02J650K570K774K019Q47P2k3J74K39J35j39
$$ 230158 230215 230435 231364 232690 233744 234381 235183 236833 239403 242177 244196 245043 245115 245092 245266 245505 245640 245501
53107B45501q20j933k848k854k042j166p26n94n47o37r60j371j567j290m71O24
$$ 245501 244681 242748 239900 237046 235004 233838 233112 232518 231971 231334 230374 229003 227436 226146 225675 226299
53091B26299J434J537J025K82m57j049j238r31n59o31j031j198r82p21n71l61
$$ 226299 227733 229270 230295 230577 230120 229071 227833 226902 226343 225712 224681 223483 222501 221780 221209 220848
53075B20848j88m11q86q97j77O06P88N53L49P8n84j411j873j880j721j418q24
$$ 220848 220660 220249 219363 218466 218289 218895 219683 220236 220585 220663 220079 218668 216795 214915 213194 211776 210952
53058B10952k09j59p14j173r15p2P48J089R04M45J11K01O37R97Q72K23n75r61
$$ 210952 210743 210584 209870 208697 207782 207710 208458 209547 210451 210896 211007 211208 211845 212842 213714 213937 213362 212401
53040B12401o15J58O35L95j79l85rN46Q54Q56O42K15l41o57l07P01J781K196J733
$$ 212401 211786 211944 212579 212974 212795 212410 212401 212947 213801 214657 215299 215514 215173 214516 214209 214910 216691 218887 220620
53021B20620Q75K91J47J40L7q9j62k76m13m13l78o76j240j315m34P41J161P83
$$ 220620 221495 221786 221933 222073 222110 222021 221859 221583 221170 220757 220379 219703 218463 217148 216714 217455 218616 219399
53003B19399N35R58J578J715J276N16l76j192j656j726j655j487r45m9O53Q14
$$ 219399 219934 220892 222470 224185 225461 225977 225601 224409 222753 221027 219372 217885 216940 216891 217544 218358
52987B18358P99J060J384J334J074J126J453J462R36L83K79N34Q71J289J852K340
$$ 218358 219157 220217 221601 222935 224009 225135 226588 228050 228986 229369 229648 230182 231053 232342 234194 236534
52971B36534K462K136J393K61r69j625j265k91L92M20K86N61J102J298Q74J73
$$ 236534 238996 241132 242525 242786 241817 240192 238927 238636 239028 239448 239734 240295 241397 242695 243569 243742
52955B43742l59p01j161j863k499k619k109j298o32l71m92p66q66n71l9K41j8
$$ 243742 243383 242682 241521 239658 237159 234540 232431 231133 230501 230130 229638 228872 228006 227435 227396 227637 227619
52938B27619n07o45l14Mj67p82j471j956k009j375j43R78J211O10m6k99m61q77
$$ 227619 227112 226467 226153 226157 225990 225208 223737 221781 219772 218397 218254 219232 220443 221053 221007 220708 220247 219370
52920B19370j250j098n11MK99O29J012J115Q52O04N71M06j44n84j96Q86J666J477
$$ 219370 218120 217022 216511 216515 216814 217443 218455 219570 220422 221026 221597 222003 221859 221275 221079 221965 223631 225108
52902B25108P19K01J38J06j75n30p72r49j022o74J84R78R67J66n90n63J60R10
$$ 225108 225827 226028 226166 226272 226097 225567 224795 223846 222824 222150 222334 223312 224279 224445 223855 223292 223452 224362
52884B24362J089N41m09j097j013l36K30L16L02O79J387K021K386K379J777O83
$$ 224362 225451 225992 225583 224486 223473 223137 223367 223683 223985 224664 226051 228072 230458 232837 234614 235297
52868B35297r2J19P94Q23K35K81J508K663K301P95j71J86R69R76K5j257k287k784
$$ 235297 235205 235324 236118 236941 237176 237457 238965 241628 243929 244724 244553 244739 245708 246684 246709 245452 243165 240381
52850B40381k660k122j739k021k901l708l695k713j461r14j333j988k069j661
$$ 240381 237721 235599 233860 231839 228938 225230 221535 218822 217361 216447 215114 213126 211057 209396
52836B09396j433j522j376p34r5K5j59j14K30N63P03O46K93l59q63o74J22P89
$$ 209396 207963 206441 205065 204331 204236 204261 204102 203988 204218 204781 205484 206130 206423 206064 205201 204527 204649 205438
52818B05438Q14M47K49L79N28M15J16j23k30m03p84j154j098n45N7K76J42p5l22
$$ 205438 206252 206699 206948 207327 207855 208270 208386 208263 208033 207630 206846 205692 204594 204049 204106 204382 204524 204449 204127
52799B04127o61q72o60k46k50q13j262r74k35J53l2j95J87Q49J134Q33L67J69
$$ 204127 203466 202594 201934 201688 201438 200625 199363 198389 198154 198307 198275 198080 198267 199116 200250 201083 201450 201619
52781B01619K06K33K45L69M54K07j58Q6J169K151J850L54j013j301r39q76j251
$$ 201619 201825 202058 202303 202672 203126 203333 203175 203261 204430 206581 208431 208785 207772 206471 205532 204656 203405
52764B03405j457j165o86l55l7N36J237J602J336O21k8j81J78P14J072J133J021
$$ 203405 201948 200783 200097 199742 199705 200241 201478 203080 204416 205037 205009 204828 205006 205720 206792 207925 208946
52747B08946R63J122J429J563J342J106J437K374L233L359K810K069J356O03j00
$$ 208946 209909 211031 212460 214023 215365 216471 217908 220282 223515 226874 229684 231753 233109 233712 233612
52732B33612m41k78K09P18R72P14j09j130j758j664r94k52m9p16j851k439j850
$$ 233612 233171 232893 233102 233820 234792 235506 235397 234267 232509 230845 229851 229599 229550 228834 226983 224544 222694
52715B22694o20J47L4m51p83r65j108j048n95J94J152J970K055R93n46j151l57
$$ 222694 222074 222221 222255 221804 221021 220056 218948 217900 217305 217499 218651 220621 222676 223669 223123 221972 221615
52698B21615N84L08p81j049P9J368J424L40p18r90o78k86RL15O72R36R15N61L6
$$ 221615 222199 222507 221726 220677 220756 222124 223548 223888 223170 222180 221502 221216 221225 221540 222212 223148 224063 224624 224660
52679B24660l92m92k25K05M51L21j6k22k00j48k18l28m09n23n80k78M07R40Q92
$$ 224660 224268 223776 223551 223756 224207 224528 224512 224290 224090 223942 223724 223396 222987 222464 221884 221606 222013 222953 223845
52660B23845O17P89J377J656J304Q87J036J602K019K062J856J342L19j040k097
$$ 223845 224462 225251 226628 228284 229588 230475 231511 233113 235132 237194 239050 240392 240711 239671 237574
52645B37574k338j814r22k5O84J078J073O25k21j223j860j640o10N39J103J038
$$ 237574 235236 233422 232500 232475 233159 234237 235310 235935 235714 234491 232631 230991 230381 230920 232023 233061
52629B33061Q81J058J491J839J883J557Q35j72j117j626j595j179n48J00M67L08
$$ 233061 233942 235000 236491 238330 240213 241770 242605 242433 241316 239690 238095 236916 236368 236468 236935 237243
52613B37243k42p10p47m02O3M55O75O72M83K14p8l01k00L83J044J053L04l43r9
$$ 237243 237001 236291 235544 235142 235205 235660 236335 237007 237490 237704 237626 237325 237125 237508 238552 239605 239909 239566 239467
52594B39467P36J202R57M99K21m4l94m41P4P38J056J183J495J683J047k65j090
$$ 239467 240203 241405 242362 242861 243082 243038 242644 242203 242277 243015 244071 245254 246749 248432 249479 249214 248124
52577B48124o88K58N76J52j43J58N34M09m0l74o02r15j104q53l90k33l70l07K8
$$ 248124 247436 247694 248270 248422 248279 248437 248971 249380 249340 248966 248364 247449 246345 245492 245102 244869 244499 244192 244220
52558B44220J56o3j07L41P64N65L4j23J24J22m26j025j094o30n0K32j4o67j121
$$ 244220 244376 244313 244206 244547 245311 245876 245910 245787 245911 246033 245607 244582 243488 242858 242808 243040 243026 242359 241238
52539B41238o44P29J945J925P79k46j75O44J093O86O8K9M65O82M09Kk32l32k72
$$ 241238 240594 241323 243268 245193 245972 245726 245551 246195 247288 247974 248042 248071 248536 249218 249627 249629 249397 249065 248793
52520B48793J39P18Q98O39O79J430K126J873J076R75J877K813K951K534K170J923
$$ 248793 248932 249650 250548 251187 251866 253296 255422 257295 258371 259346 261223 264036 266987 269521 271691 273614
52504B73614J514Q70P7q52j780k350k429k360k540k917l144l001k461j570n70
$$ 273614 275128 275998 276075 275223 273443 271093 268664 266304 263764 260847 257703 254702 252241 250671 250101
52489B50101R7J71j52m77o03n62l99j64N1J32Ll61q10r67n43K99J111J635J822
$$ 250101 250198 250369 250217 249740 249137 248575 248176 248012 248063 248195 248198 247837 247027 246060 245517 245816 246927 248562 250384
52470B50384J559Q45J81J76O89R92R62J370K609L817L895K931J909J365R71L59
$$ 250384 251943 252788 252969 253145 253834 254826 255788 257158 259767 263584 267479 270410 272319 273684 274655 275014
52454B75014l65r39j336j662j973k227k244j867j296j065j439k086k537k709k608
$$ 275014 274649 273710 272374 270712 268739 266512 264268 262401 261105 260040 258601 256515 253978 251269 248661
52439B48661j959p00M59O09k85j341j801j570q80j4O14O51K45r0p7J67N41J056
$$ 248661 246702 246002 246461 247070 246785 245444 243643 242073 241193 241179 241793 242444 242689 242599 242522 242689 243230 244286
52421B44286J541J721J632J520J360J030R29J718L285M597M950M785M944N631
$$ 244286 245827 247548 249180 250700 252060 253090 254019 255737 259022 263619 268569 273354 278298 283929
52407B83929O499P334Q091Q580Q540P823O210L423k55l717n898o743o920o842
$$ 283929 290428 297762 305853 314433 322973 330796 337006 340429 340174 336457 330559 323816 316896 310054
52393C10054o494n949n404m677l397j825q75r85j415j123m4R27J132Q00N38N69
$$ 310054 303560 297611 292207 287530 284133 282308 281433 280448 279033 277910 277866 278793 279925 280725 281263 281832
52377B81832P60J098J736K555L126L236L239L592M213M640M731M774M862M567
$$ 281832 282592 283690 285426 287981 291107 294343 297582 301174 305387 310027 314758 319532 324394 328961
52363C28961L460J748Q7j024j487j423r86l47L00P54Q01L56k94o43m51Q7P72J659
$$ 328961 332421 334169 334256 333232 331745 330322 329336 328989 329289 330043 330844 331200 330906 330263 329812 329899 330671 332330
52345C32330K647L202K937K275K034K403K825K936L107L869N267O940Q554R800
$$ 332330 334977 338179 341116 343391 345425 347828 350653 353589 356696 360565 365832 372772 381326 391126
52331C91126J0416J0546J0842J1778J2994J3748J4027J4677J6309J8442K0031
$$ 391126 401542 412088 422930 434708 447702 461450 475477 490154 506463 524905 544936
52320E44936K0590K0404J9831J8845J7491J6329J6040J6644J7433J7727J7397
$$ 544936 565526 585930 605761 624606 642097 658426 674466 691110 708543 726270 743667
52309G43667J6649J5643J4580J3806J3448J3134J2469J1700J1362J1335J0751
$$ 743667 760316 775959 790539 804345 817793 830927 843396 855096 866458 877793 888544
52298H88544R139P092N417M088K585R43l22j254k628m813p026q207q222p774p382
$$ 888544 897683 904775 910192 914280 916865 917808 917486 916232 913604 908791 901765 893558 885336 877562 870180
52283H70180p000o460n813n091m103k698r91P46K292L576M745O121P830R515J0634
$$ 870180 863180 856720 850907 845816 841713 839015 838024 838770 841062 844638 849383 855504 863334 872849 883483
52268H83483J1102J1271J1346J1194J0943J1194J2240J3385J3606J2826J2003
$$ 883483 894585 905856 917202 928396 939339 950533 962773 976158 989764 1002590 1014593
52257A014593J1835J1930J1453J0303R182Q666Q499P911O412M199J844k95k293
$$ 1014593 1026428 1038358 1049811 1060114 1069296 1077962 1086461 1094372 1100784 1104983 1106827 1106532 1104239
52244A104239m380o568q639j0383j1756j2760j3330j3374j2934j2334j2017j2157
$$ 1104239 1099859 1093291 1084652 1074269 1062513 1049753 1036423 1023049 1010115 997781 985764 973607
52232I73607j2348j1980j1010j0137r916r849q854o713m558l688m132m765m570
$$ 973607 961259 949279 938269 928132 918216 908367 899513 892800 888242 884554 880422 875657 871087
52219H71087l407j669K65J987K983L031K630K571L070L606L774L862M322M916
$$ 871087 867680 866011 866276 868263 871246 874277 876907 879478 882548 886154 889928 893790 898112 903028
52205I03028M928M206L513L534L968L995L475L137L547M288M476L862L138L115
$$ 903028 907956 912162 915675 919209 923177 927172 930647 933784 937331 941619 946095 949957 953095 956210
52191I56210L794M403M252L424K525J896J314M50o61j813l020m496o226p889r068
$$ 956210 960004 964407 968659 972083 974608 976504 977818 978268 977607 975794 972774 968278 962052 954163 945095
52176I45095r438q803p370n893n154n157n096m348l204k348j905j315j67J235
$$ 945095 935657 926854 919484 913591 908437 903280 898184 893836 890632 888284 886379 885064 884897 886132
52162H86132K285K841L350M170M969M958L812K220J341J637K432K620J739K99
$$ 886132 888417 891258 894608 898778 903747 908705 912517 914737 916078 917715 920147 922767 924506 924805
52148I24805q15j097p23k06J16L28O55J066J254J012N33K83O76J826L436M919
$$ 924805 923990 922893 922170 921964 922080 922408 923063 924129 925383 926395 926928 927211 927887 929713 933149 938068
52132I38068N767O080O593Q079J0642J3679J6466J8731K0643K2452K4214K5824
$$ 938068 943835 949915 956508 964587 975229 988908 1005374 1024105 1044748 1067200 1091414 1117238
52120A117238K7139K7989K8152K7554K6520K5624K5116K4561K3278K1088J8533
$$ 1117238 1144377 1172366 1200518 1228072 1254592 1280216 1305332 1329893 1353171 1374259 1392792
52109A392792J6284J4461J2601J0317P875N944M719L550J784k25j517k009k795
$$ 1392792 1409076 1423537 1436138 1446455 1454330 1460274 1464993 1468543 1470327 1470102 1468585 1466576 1463781
52096A463781m605o692q010q870j0417j2737j4717j5799j6688j7868j8552j7881
$$ 1463781 1459176 1452484 1444474 1435604 1425187 1412450 1397733 1381934 1365246 1347378 1328826 1310945
52084A310945j6285j4771j3484j1848r758p579n257k436N76K878M151N004O017
$$ 1310945 1294660 1279889 1266405 1254557 1244799 1237220 1231963 1229527 1230103 1232981 1237132 1242136 1248153
52071A248153P187Q507J0306J2519J4264J4745J4269J3878J4178J4851J5191J4758
$$ 1248153 1255340 1263847 1274153 1286672 1300936 1315681 1329950 1343828 1358006 1372857 1388048 1402806
52059A402806J3607J2138J0699R286P721O052M445K717M33k346m910o779q231
$$ 1402806 1416413 1428551 1439250 1448536 1456257 1462309 1466754 1469471 1469904 1467558 1462648 1455869 1447638
52046A447638r700j1125j2409j4004j6292j8713k0264k0785k0958k1016k0400
$$ 1447638 1437938 1426813 1414404 1400400 1384108 1365395 1345131 1324346 1303388 1282372 1261972
52035A261972j8901j7325j6448j6019j5427j4798j4629j4623j3858j2207j0750
$$ 1261972 1243071 1225746 1209298 1193279 1177852 1163054 1148425 1133802 1119944 1107737 1096987
52024A096987j0537j1441j2602j3472j4008j4136j3622j2483j1199j0382j0279
$$ 1096987 1086450 1075009 1062407 1048935 1034927 1020791 1007169 994686 983487 973105 962826
$$ [...]
##END NTUPLES=NMR SPECTRUM
##END=
