##TITLE=AC1542_ROEFFECT0012_8215128_l67O6OVqZC
##JCAMPDX= 6.0         $$ Bruker NMR JCAMP-DX V2.0
##DATA TYPE= NMR SPECTRUM
##DATA CLASS= NTUPLES
##ORIGIN= BRUKER
##OWNER= Administrator
$$ 1.72 TOPSPIN		Version 2.1
$$ 2013-10-11 19:57:17.348 -0700  Administrator@X
$$ Compression mode = diff/dup
##.OBSERVE FREQUENCY= 400.02188249412
##.OBSERVE NUCLEUS= ^1H
##.ACQUISITION MODE= SIMULTANEOUS (DQD)
##.ACQUISITION SCHEME= undefined
##.AVERAGES= 64
##.DIGITISER RES= 22
##SPECTROMETER/DATA SYSTEM= spect
##.PULSE SEQUENCE= noesygpps1d.comp
##.SOLVENT NAME= COFFEE_meoh
##.SHIFT REFERENCE= INTERNAL, COFFEE_meoh, 1, 14.96083
##AUDIT TRAIL= $$ (NUMBER, WHEN, WHO, WHERE, PROCESS, VERSION, WHAT)
$$ ##TITLE= Audit trail, TOPSPIN		Version 2.1
$$ ##JCAMPDX= 5.01
$$ ##ORIGIN= Bruker BioSpin GmbH
$$ ##OWNER= Administrator
$$ $$ E:\/data/COFFEE/nmr/AC1542_ROEFFECT0012_8215128_l67O6OVqZC/12/pdata/1/auditp.txt
$$ ##AUDIT TRAIL=  $$ (NUMBER, WHEN, WHO, WHERE, PROCESS, VERSION, WHAT)
(   1,<2013-10-11 19:57:12.364 -0700>,<Administrator>,<X>,<go>,<TOPSPIN 2.1>,
      <created by zg
	started at 2013-10-11 19:45:42.864 -0700,
	POWCHK enabled, PULCHK disabled,
       configuration hash MD5:
       C8 4E 4E 5D D3 5C D8 9E 9F 52 82 E0 59 8A DE 15
       data hash MD5: 64K
       AB 4E 5B E1 6F 71 13 89 FF FD F8 53 86 9D 9A 3F>)
(   2,<2013-10-11 19:57:15.411 -0700>,<Administrator>,<X>,<proc1d>,<TOPSPIN 2.1>,
      <Start of raw data processing
       efp LB = 0.3 FT_mod = 6 PKNL = 1 PHC0 = 0 PHC1 = 0 SI = 128K 
       data hash MD5: 128K
       D8 F7 8A D2 CD AE DC 06 12 CC 0A E8 48 6E CF 3E>)
(   3,<2013-10-11 19:57:16.364 -0700>,<Administrator>,<X>,<proc1d>,<TOPSPIN 2.1>,
      <pk PHC0 = -80.44189 PHC1 = 0 
       data hash MD5: 128K
       F4 0C 4C 94 6F DA 86 EB 80 6B A0 03 44 56 31 9A>)
(   4,<2013-10-11 19:57:16.770 -0700>,<Administrator>,<X>,<proc1d>,<TOPSPIN 2.1>,
      <abs ABSG = 1 
       data hash MD5: 128K
       F7 3E 61 27 11 D1 F6 0A 02 8A A4 1F 37 54 5A C7>)
(   5,<2013-10-11 19:57:16.880 -0700>,<Administrator>,<X>,<proc1d>,<TOPSPIN 2.1>,
      <abs ABSG = 2 
       data hash MD5: 128K
       35 07 14 CD AD 19 8C 10 24 4B CD 1B 0C 87 C3 EC>)
(   6,<2013-10-11 19:57:16.958 -0700>,<Administrator>,<X>,<proc1d>,<TOPSPIN 2.1>,
      <abs ABSG = 3 
       data hash MD5: 128K
       FF DA 79 B7 2A 55 AB 8A 0D F5 3C 5B 77 39 A2 82>)
(   7,<2013-10-11 19:57:17.067 -0700>,<Administrator>,<X>,<proc1d>,<TOPSPIN 2.1>,
      <abs ABSG = 4 
       data hash MD5: 128K
       80 D6 3C 32 61 D8 B8 A0 3E A6 A9 9B 0B 5B 20 13>)
(   8,<2013-10-11 19:57:17.161 -0700>,<Administrator>,<X>,<proc1d>,<TOPSPIN 2.1>,
      <abs ABSG = 5 
       data hash MD5: 128K
       D6 42 05 30 C2 3F DC C2 C7 FB 36 A7 EA B1 A2 9C>)
$$ ##END=
$$ 
$$ $$ hash MD5
$$ $$ 0C 29 58 E5 4E DC 1E EC AE 70 68 A4 C4 C8 06 74
##$RELAX= 
##$RELAX= 
##$RELAX= 
##$RELAX= 
##$RELAX= 
##$RELAX= 
##$RELAX= 
##$RELAX= 
$$ Bruker specific parameters
$$ --------------------------
##$DU= <E:\>
##$EXPNO= 12
$$ [...]
##$TP07= 0
##$TPNAME0= <>
##$TPNAME1= <>
##$TPNAME2= <>
##$TPNAME3= <>
##$TPNAME4= <>
##$TPNAME5= <>
##$TPNAME6= <>
##$TPNAME7= <>
##$TPOAL= (0..7)
0.5 0.5 0.5 0.5 0.5 0.5 0.5 0.5
##$TPOFFS= (0..7)
0 0 0 0 0 0 0 0
##$TUNHIN= 0
##$TUNHOUT= 0
##$TUNXOUT= 0
##$USERA1= <user>
##$USERA2= <user>
##$USERA3= <user>
##$USERA4= <user>
##$USERA5= <user>
##$V9= 5
##$VALIST= <valist>
##$VCLIST= <CCCCCCCCCCCCCCC>
##$VD= 0
##$VDLIST= <DDDDDDDDDDDDDDD>
##$VPLIST= <PPPPPPPPPPPPPPP>
##$VTLIST= <TTTTTTTTTTTTTTT>
##$WBST= 1024
##$WBSW= 4
##$XGAIN= (0..3)
0 0 0 0
##$XL= 0
##$YL= 0
##$YMAX_a= 6547789
##$YMIN_a= -12830798
##$ZGOPTNS= <>
##$ZL1= 120
##$ZL2= 120
##$ZL3= 120
##$ZL4= 120
##$ABSF1= 14.96083
##$ABSF2= -5.597352
##$ABSG= 5
##$ABSL= 3
##$ALPHA= 0
##$AQORDER= 0
##$ASSFAC= 0
##$ASSFACI= 0
##$ASSFACX= 0
##$ASSWID= 0
##$AUNMP= <proc_prof1d_extract.lims>
##$AXLEFT= 0
##$AXNAME= <>
##$AXNUC= <1H>
##$AXRIGHT= 0
##$AXTYPE= 0
##$AXUNIT= <>
##$AZFE= 0.1
##$AZFW= 0.1
##$BCFW= 0
##$BC_mod= 0
##$BYTORDP= 0
##$COROFFS= 0
##$CY= 15
##$DATMOD= 1
##$DC= 0
##$DFILT= <>
##$DTYPP= 0
##$F1P= 0
##$F2P= 0
##$FCOR= 0.5
##$FTSIZE= 131072
##$FT_mod= 6
##$GAMMA= 0
##$GB= 0
##$INTBC= 1
##$INTSCL= 1
##$ISEN= 128
##$LB= 0.3
##$LEV0= 0
##$LPBIN= 0
##$MAXI= 10000
##$MC2= 0
##$MEAN= 0
##$ME_mod= 0
##$MI= 0
##$NCOEF= 0
##$NC_proc= -2
##$NLEV= 6
##$NOISF1= 0
##$NOISF2= 0
##$NSP= 0
##$NTH_PI= 0
##$NZP= 0
##$OFFSET= 14.96083
##$PC= 1
##$PHC0= -80.44189
##$PHC1= 0
##$PH_mod= 1
##$PKNL= yes
##$PPARMOD= 0
##$PPDIAG= 0
##$PPIPTYP= 0
##$PPMPNUM= 2147483647
##$PPRESOL= 1
##$PSCAL= 4
##$PSIGN= 0
##$PYNMP= <proc.py>
##$REVERSE= no
##$SF= 400.020009702907
##$SI= 131072
##$SIGF1= 0
##$SIGF2= 0
##$SINO= 400
##$SIOLD= 131072
##$SPECTYP= <>
##$SREGLST= <1H.CDCl3>
##$SSB= 0
##$STSI= 131072
##$STSR= 0
##$SW_p= 8223.68421052631
##$SYMM= 0
##$S_DEV= 0
##$TDeff= 65536
##$TDoff= 0
##$TI= <>
##$TILT= no
##$TM1= 0
##$TM2= 0
##$TOPLEV= 0
##$USERP1= <user>
##$USERP2= <user>
##$USERP3= <user>
##$USERP4= <user>
##$USERP5= <user>
##$WDW= 1
##$XDIM= 131072
##$YMAX_p= 391321389
##$YMIN_p= -15306
##$CURPLOT= <Network HP LaserJet P1505>
##$CURPRIN= <$Network HP LaserJet P1505>
##$DFORMAT= <normdp>
##$LAYOUT= <+/1D_H.xwp>
##$LFORMAT= <normlp>
##$PFORMAT= <normpl>
##$SURQMSG= 1
$$ End of Bruker specific parameters
$$ ---------------------------------
##NTUPLES= NMR SPECTRUM
##VAR_NAME=  FREQUENCY,     SPECTRUM/REAL,   SPECTRUM/IMAG
##SYMBOL=    X,             R,               I
##VAR_TYPE=  INDEPENDENT,   DEPENDENT,       DEPENDENT
##VAR_FORM=  AFFN,          ASDF,            ASDF
##VAR_DIM=   131072,        131072,          131072
##UNITS=     HZ,            ARBITRARY UNITS, ARBITRARY UNITS
##FACTOR=    0.0627417313425164, 1,          1
##FIRST=     8223.62146879497, 2413,         -62600
##LAST=      0,             3662,            -62465
##MIN=       0,             -15306,          0
##MAX=       8223.62146879497, 391321389,    0
$$ Real data points
##PAGE= N=1
##DATA TABLE= (X++(R..R)), XYDATA
$$ [...]
63906B108840j60442j42856j26367j11367r8355q7123p6900o7242n8401n0772
63896A129015m4403l9058l4496l0578k7337k4880k3108k1681k0511j9978k0210
63885H22775k0443j9694j7984j6181j4623j2660r814o643l915j543J084M001O686
63872G11046R011J1419J4054J6239J7238J7308J7539J8635K0092K0756K0122J8712
63860I12171J7200J5567J3523J1346R572P933N432J795j908m631o737r293j2402
63847I59568j5121j6893j8160j9409k0489k1208k2036k3511k5334k6587k6827
63836G23993k6555k6567k7069k7438k6848k5175k3299k2275k2122k1769k0391
63825D54485j8379j6675j5496j4324j2894j1496j0295r073p866p216p314p456
$$ plain form
63906 2108840 1948398 1805542 1679175 1567808 1469453 1382330 1305430 1238188 1179787 1129015
63896 1129015 1084612 1045554 1011058 980480 953143 928263 905155 883474 862963 842985 822775
63885 822775 802332 782638 764654 748473 733850 721190 711376 704733 700818 699275 700359 704360 711046
63872 711046 720057 731476 745530 761769 779007 796315 813854 832489 852581 873337 893459 912171
63860 912171 929371 944938 958461 969807 979379 987312 992744 994539 992631 988000 981263 971970 959568
63847 959568 944447 927554 909394 889985 869496 848288 826252 802741 777407 750820 723993
63836 723993 697438 670871 643802 616364 589516 564341 541042 518767 496645 474876 454485
63825 454485 436106 419431 403935 389611 376717 365221 354926 345853 337987 330771 323457 316001
63813C16001o901n884n222n143n182n019m729m232l253j966j024o89n72m84q70
63798B64831j864k632k379j584j375j894k217j923j766k456l511l973l691l266
63784B30300k951k319j161p2J81l70r05p45OP21R43N89k05j148j734j497n32M84
63766B19585R41P63K26l78p63o82k87j35m80q01m95K22O00M35K31L10L83K18J07
63747B20000L17M86O8p29r58N7J835L115L109K268J658J643J642J190P09Q00J279
63730B38489J550J637K035K724L172L265L433L658L348K527K269L300M762N122
63716B81291L898J979M95m7J75N96O53K56k80q37j646k512k595j467M5P51M84
63699B81239l2l19l70p4P12J535J711J415J553K354K989K925K807L370M146M051
$$ plain form
63813 316001 309100 303216 297994 292851 287669 282650 277921 273689 270436 268470 267446 266757 266185 265701 264831
63798 264831 262967 260335 257956 256372 254997 253103 250886 248963 247197 244741 241230 237257 233566 230300
63784 230300 227349 225030 223869 223797 223978 223608 222703 221958 221964 222685 223628 224217 224012 222864 221130 219633 219101 219585
63766 219585 220526 221289 221515 221137 220374 219692 219405 219270 218790 217989 217494 217716 218316 218751 218982 219292 219675 219893 220000
63747 220000 220317 220803 220871 220142 219184 219241 221076 224191 227300 229568 231226 232869 234511 235701 236410 237210 238489
63730 238489 240039 241676 243711 246435 249607 252872 256305 259963 263311 265838 268107 271407 276169 281291
63716 281291 285189 287168 287663 287616 287791 288387 289040 289296 289016 288179 286533 284021 281426 279959 280004 280755 281239
63699 281239 281207 280888 280518 280444 281156 282691 284402 285817 287370 289724 292713 295638 298445 301815 305961 310012
63683C10012K946J754J133P81K04m77q41q86r57j149j232j098q73m90L27J439
63667C10593K070J705Q79N20O56N34r3o25p47j038j943k879l074k728k618k923
63651B98289l216l334l429l367k861k160j787j594r22K55J162J425J614K205K776
63636B85056K756K391K359K809L367L822M314M956N604O002N974N662N614O321
63622C47007P521Q420Q738R031R722J0435J0844J1534J3255J5679J7793J9330
63610D89309K0925K2809K4315K5005K5495K6605K8182K9350K9632K9179K7999
63599G78805K5511K1085J4891Q070K123k021m469n991p124p799p874p719q022
63586G99466r212j1343j4355j7915k1090k2811k2961k2599k2697k3007k2482k0654
$$ plain form
63683 310012 312958 314712 315845 316626 316830 316353 315512 314626 313669 312520 311288 310190 309317 308827 309154 310593
63667 310593 312663 314368 315247 315767 316423 316957 316864 316239 315492 314454 312511 309632 306558 303830 301212 298289
63651 298289 295073 291739 288310 284943 282082 279922 278135 276541 275619 275874 277036 278461 280075 282280 285056
63636 285056 287812 290203 292562 295371 298738 302560 306874 311830 317434 323436 329410 335072 340686 347007
63622 347007 354528 362948 371686 380717 390439 400874 411718 423252 436507 452186 469979 489309
63610 489309 510234 533043 557358 582363 607858 634463 662645 691995 721627 750806 778805
63599 778805 804316 825401 840292 848362 850485 848464 843995 838004 830880 823081 815207 807488 799466
63586 799466 790254 778911 764556 746641 725551 702740 679779 657180 634483 611476 588994 568340
63574E68340j8050j5434j3148j1207r479p623n265k536j07J498K414L116L891
63561D96410M824N953P094P808P854P584P612Q297R710J1765J4067J6007J7438
63548F22423J9051K1654K5193K8952L2416L5453L7828L9089L8777L6232L0560
63537I67628K1671J1360K368l909q083j1037j2541j2116j0408q837q289q873j0594
63524I08340j3466j7104k0883k4557k8220l1688l4383l5789l5737l4282l1724
63513F00507k8676k5751k3147k0799j8768j7136j5643j3938j2131j0644r551q576
63501C95747p737p417p564p363o112m121k423j716j842k159k128j614q75k92l8
63486C42346L6K00N02P01N17L4j86M14J672K708K875K506K344K435K134J212L10
$$ plain form
63574 568340 550290 534856 521708 510501 501022 493399 488134 485598 485491 486989 489403 492519 496410
63561 496410 501234 507187 514281 522089 529943 537527 545139 553436 563146 574911 588978 604985 622423
63548 622423 641474 663128 688321 717273 749689 785142 822970 862059 900836 937068 967628
63537 967628 989299 1000659 1003027 999118 991035 979998 967457 955341 944933 936096 927807 918934 908340
63524 908340 894874 877770 856887 832330 804110 772422 738039 702250 666513 632231 600507
63513 600507 571831 546080 522933 502134 483366 466230 450587 436649 424518 413874 404323 395747
63501 395747 388010 380593 373029 365666 359554 355433 353010 351294 349452 347293 345165 343551 342676 342384 342346
63486 342346 342382 342582 343084 343785 344302 344336 344150 344564 346236 348944 351819 354325 356669 359104 361238 362450 362760
63469C62760J8J1m02j256j992k371k752l351l746l383k328j179l73J59O33R82
63453C41430J009P93P38J122J805K460K970L460M147N223O737Q361R545J0150
63439C99950J0766J1965J3392J4210J4402J5011J6824J9486K2216K4792K7142
63428E90156K8367K7165K3327J8231J3659J0512Q822Q469R494J1823J5005J8309
63416G83339K1200K3788K6707L0303L3960L6434L6839L5033L1232K5649J8663
63405A103147J0949L344l201p692r647r836r904j0932j2611j4164j5594j7642
63393A006217k0736k4570k8526l2064l4723l6123l6136l4881l2677l0135k7974
63382F67672k6324k4465k1721j8456j5626j3503j1496r273p156n234k869L33L647
$$ plain form
63469 362760 362778 362789 362387 361131 359139 356768 354016 350665 346919 343536 341208 340029 339656 339815 340448 341430
63453 341430 342439 343232 343970 345092 346897 349357 352327 355787 359934 365157 371894 380255 389800 399950
63439 399950 410716 422681 436073 450283 464685 479696 496520 516006 538222 563014 590156
63428 590156 618523 645688 669015 687246 700905 711417 720239 728708 738202 750025 765030 783339
63416 783339 804539 828327 855034 885337 919297 955731 992570 1027603 1058835 1084484 1103147
63405 1103147 1114096 1117440 1114239 1106547 1096900 1087064 1077160 1066228 1053617 1039453 1023859 1006217
63393 1006217 985481 960911 932385 900321 865598 829475 793339 758458 725781 695646 667672
63382 667672 641348 616883 595162 576706 561080 547577 536081 526808 519652 514418 511549 511882 515529
63369E15529O038P482Q794J0343J1737J2782J3980J5782J7927J9921K1811K3963
63357F86089K6292K8294K9818L1304L3067L4709L5539L5288L4082L1856K8271
63346A034609K3184J6913J0060L334k409o553r184j0914j2053j2491j2495j2951
63334A009050j4419j6539j8928k1997k6012k9937l2235l2709l2441l2041l1003
63323G20789k8950k6322k3522k0335j6706j3139r876o669l966l311n577r550j3199
63310E39667j5692j7280j7957j7498j6408j5461j4414j2367r455o955n629m987
63298C85564m431m053l925l627k960k365k144j976j732j982l102m396m812m194
63284C39865l271k678k468k390k226j984j936k258k587k292j391o04l25j17M19
$$ plain form
63369 515529 521567 529049 537843 548186 559923 572705 586685 602467 620394 640315 662126 686089
63357 686089 712381 740675 770493 801797 834864 869573 905112 940400 974482 1006338 1034609
63346 1034609 1057793 1074706 1084766 1088100 1085691 1079138 1069954 1059040 1046987 1034496 1022001 1009050
63334 1009050 994631 978092 959164 937167 911155 881218 848983 816274 783833 751792 720789
63323 720789 691839 665517 641995 621660 604954 591815 581939 575270 571304 567993 562416 552866 539667
63310 539667 523975 506695 488738 471240 454832 439371 424957 412590 403135 396180 390551 385564
63298 385564 381133 377080 373155 369528 366568 364203 362059 360083 358351 356369 353267 348871 344059 339865
63284 339865 336594 333916 331448 329058 326832 324848 322912 320654 318067 315775 314384 313780 313455 313338 313757
63269C13757R49J102J222J733K214J960J217J018J772K771L181K991K815L224
63255C41926M322N610O270N946N324N468O568P740Q112P741P315P377Q051R236
63241D37006J0788J2561J4433J6176J7463J8222J8848J9821K1149K2518K3926
63230F32911K5627K7410K8470K8325K7440K6668K6346K6275K6236K6121K5807
63219I27636K5314K5032K5309K5881K6056K5486K4298K2436J9393J4962R790M765
63207A176358l4n343j1605j8254k4175k8625l1560l3297l4117l4122l3279l1545
63195H90402k8988k5810k2251j8542j4921j1581q545n680k893k28K283M722P160
63182G65128R530J1697J3541J5001J6124J7094J8035J8726J8787J8244J7549J6950
$$ plain form
63269 313757 314706 315808 317030 318763 320977 322937 324154 325172 326944 329715 332896 335887 338702 341926
63255 341926 346248 351858 358128 364074 369398 374866 381434 389174 397286 405027 412342 419719 427770 437006
63241 437006 447794 460355 474788 490964 508427 526649 545497 565318 586467 608985 632911
63230 632911 658538 685948 714418 742743 770183 796851 823197 849472 875708 901829 927636
63219 927636 952950 977982 1003291 1029172 1055228 1080714 1105012 1127448 1146841 1161803 1171593 1176358
63207 1176358 1176324 1170981 1159376 1141122 1116947 1088322 1056762 1023465 989348 955226 921947 890402
63195 890402 861414 835604 813353 794811 779890 768309 759764 754084 751191 750963 753246 757968 765128
63182 765128 774658 786355 799896 814897 831021 848115 866150 884876 903663 921907 939456 956406
63170I56406J6193J5082J3935J3070J2129J0374P526L873k82m819r541j4204j8728
63157A001014k2951k6363k8571k9964l1204l2176l2105l0823k9091k7431k5513
63146F84822k3044k0564j8671j7066j5051j2584j0237q428p307p019p417p634
63134E29800o731m828l006k022j592j040j78P06J429K137L060M106M844M932M628
63119E36245M567M982N412N441N266N252N234M785L922L067K457K135K272K849
63105E93886L149K351P23m54m53M2J7n17p34j84P68J558J919J842J436R56P07
63088F07012P47Q29O87L49J28L26R98J954K980L957M794N341N539N560N647N881
63072F52729O251O881P954R386J0861J2196J3492J4812J6019J7092J8391K0269
$$ plain form
63170 956406 972599 987681 1001616 1014686 1026815 1037189 1044715 1048588 1048306 1043487 1033946 1019742 1001014
63157 1001014 978063 951700 923129 893165 861961 829785 797680 766857 737766 710335 684822
63146 684822 661778 641214 622543 605477 590426 577842 567605 559177 551870 544851 537434 529800
63134 529800 523069 518241 515235 513213 511621 510581 510403 511109 512538 514675 517735 521841 526685 531617 536245
63119 536245 540812 545794 551206 556647 561913 567165 572399 577184 581106 584173 586630 588765 591037 593886
63105 593886 597035 599386 600109 599655 599202 599244 599261 598744 598010 597826 598594 600152 602071 603913 605349 606305 607012
63088 607012 607759 608588 609275 609624 609752 610078 611076 613030 616010 619967 624761 630102 635641 641201 646848 652729
63072 652729 658980 665861 673815 683201 694062 706258 719750 734562 750581 767673 786064 806333
63060H06333K2584K4851K6941K9296L2312L5741L8948M1747M4640M8090N1819
63049A203302N5110N7673N9866O2040O4036O5541O6501O6962O6719O5599O3935
63038A897284O2388O1288O0485N9809N9224N8452N6876N4115N0397M6057M0750
63027B507125L3537K3789J1832j323j4740k8001m1035n3568o4815p3736p9684
63016B219381q2768q3533q2338p9252p4450o8435o1680n4306m6324l8074l0015
63005A518206k2255j4635p358r64M476R646J5034K0084K3814K6078K7672K9227
62993A629025L0611L1433L1686L1658L1489L0970K9633K7155K3897K0805J8273
62982A936635J5338J0599L925l503j0845j8478k6917l5725m3922n0858n6195n9629
$$ plain form
63060 806333 828917 853768 880709 910005 942317 978058 1017006 1058753 1103393 1151483 1203302
63049 1203302 1258412 1316085 1375951 1437991 1502027 1567568 1634069 1701031 1767750 1833349 1897284
63038 1897284 1959672 2020960 2081445 2141254 2200478 2258930 2315806 2369921 2420318 2466375 2507125
63027 2507125 2540662 2564451 2576283 2574960 2560220 2532219 2491184 2437616 2372801 2299065 2219381
63016 2219381 2136613 2053080 1970742 1891490 1817040 1748605 1686925 1632619 1586295 1548221 1518206
63005 1518206 1495951 1481316 1473958 1472994 1477470 1487116 1502150 1522234 1546048 1572126 1599798 1629025
62993 1629025 1659636 1691069 1722755 1754413 1785902 1816872 1846505 1873660 1897557 1918362 1936635
62982 1936635 1951973 1962572 1966497 1962994 1952149 1933671 1906754 1871029 1827107 1776249 1720054 1660425
62970A660425o1239o1657o1414o0438n8628n6345n3808n0572m6334m1834l8098
62959A070058l5169l2358k9574k7480k6330k5474k4190k2461k0783j9647j9223
62948G87369j9169j8784j7671j6184j4876j3814j2902j2414j2530j2632j1933
62937F24460j0651r674r158q380p037n714m872m271l712l428l352k821j540k20
62923E49630L23P9n73j513k497k815k114j179j028j524j747j590j985l358m677
62908E23432m647l366k216k217l050l767m004m059m125l942l344k586j908j195
62894D79006l99J04O5j03O1K40j81r69j234p96m20n30n50P5R14J203R07O01O55
62875D78649J013J502J864J722R18k53j382k288k850k842k273j565j057n81J27
$$ plain form
62970 1660425 1599186 1537529 1476115 1415677 1357049 1300704 1246896 1196324 1149990 1108156 1070058
62959 1070058 1034889 1002531 972957 945477 919147 893673 869483 847022 826239 806592 787369
62948 787369 768200 749416 731745 715561 700685 686871 673969 661555 649025 636393 624460
62937 624460 613809 604135 594977 586597 579560 573846 568974 564703 560991 557563 554211 551390 549850 549630
62923 549630 549953 550032 549459 547946 545449 542634 540520 539341 538313 536789 535042 533452 531467 528109 523432
62908 523432 518785 515419 513203 510986 507936 504169 500165 496106 491981 488039 484695 482109 480201 479006
62894 479006 478607 478711 478776 478673 478734 478974 478793 477824 476590 475794 475374 474844 474294 474369 475283 476486 477393 477994 478649
62875 478649 479662 481164 483028 484750 485668 485415 484033 481745 478895 476053 473780 472215 471158 470577 470704
62860D70704Q66J155Q96M37J62K24N86J043J305J262J118J078J022O49j22r78
62844D81407j428j212o47m25q56j470j667j556j670k027k140j838j446j047l85
62829D61593L59N59K24K02R15J664J803J782K278K985L188K983L039L402L492
62814D90468L151K901L195M030N187O278O689O216N623N897O975P885Q155Q299
62800E70949Q823R519J0077J0745J1899J3357J4614J5610J6859J8798K1297K3907
62788G46454K6491K9373L2854L6755M0728M4917M9825N5544O1553O7470P3481
62777A265445P9689Q5587R0555R4502R7535R9364R9544R7929R4353Q8204P9004
62766B271711O7138N3454L8283K1596L933j3533k9905m4884n8234o9606p8951
$$ plain form
62860 470704 471570 472725 473621 474058 474220 474444 475030 476073 477378 478640 479758 480836 481858 482507 482385 481407
62844 481407 479979 478767 478120 477695 476839 475369 473702 472146 470476 468449 466309 464471 463025 461978 461593
62829 461593 461952 462511 462735 462937 463852 465516 467319 469101 471379 474364 477552 480535 483574 486976 490468
62814 490468 493619 496520 499715 503745 508932 515210 521899 528115 533738 539635 546610 554495 562650 570949
62800 570949 579772 589291 599368 610113 622012 635369 649983 665593 682452 701250 722547 746454
62788 746454 772945 802318 835172 871927 912655 957572 1007397 1062941 1124494 1191964 1265445
62777 1265445 1345134 1430721 1521276 1615778 1713313 1812677 1912221 2010150 2104503 2192707 2271711
62766 2271711 2338849 2392303 2430586 2452182 2456115 2442582 2412677 2367793 2309559 2239953 2161002
62755B161002q6557r2451r6248r7779r7423r5697r2815q8822q3872p8294p2598
62744A178446o7254o2271n7155n1630m6246m1742l8040l4400l0485k6697k3486
62733F99040k0819j8418j6043j3558j1122r263q296p759o943n813m835l968k671
62720E69532q88O78J544K072K887M190N820P507Q917R945J1099J3057J5788J8638
62706F70786K1349K4323K7742L1169L4282L7346M0700M4373M8442N3027N7653
62695A091192O1368O3985O6406O9194P1487P1985P0312O6827O1633N4607M5924
62684A794920L5855K4332J1477j843j4637k6672l8023m8191n6498o3085o8536
62673A549099p2647p4550p4150p2459p0295o7485o3733n9440n5164n0839m6140
$$ plain form
62755 2161002 2074445 1981994 1885746 1787967 1690544 1594847 1502032 1413210 1329338 1251044 1178446
62744 1178446 1111192 1048921 991766 940136 893890 852148 814108 779708 749223 722526 699040
62733 699040 678221 659803 643760 630202 619080 609817 601521 593762 586819 581006 576171 572203 569532
62720 569532 568644 569322 570866 572938 575825 580015 585835 593342 602259 612204 623303 636360 652148 670786
62706 670786 692135 716458 744200 775369 809651 846997 887697 932070 980512 1033539 1091192
62695 1091192 1152560 1216545 1282951 1352145 1423632 1495617 1565929 1632756 1694389 1748996 1794920
62684 1794920 1830775 1855107 1866584 1864741 1850104 1823432 1785409 1737218 1680720 1617635 1549099
62673 1549099 1476452 1401902 1327752 1255293 1184998 1117513 1053780 994340 939176 888337 842197
62662H42197m1290l7025l3805l1407k9140k6390k3131k0037j7817j6411j5139
62651E50605j3674j2360j1416j0463r222q146p698p477o745n676n157n342n225
62638D42004m040k316j084n05QO40R35O58K09m3k75p40j220j297r66n87l64j86
62620D30831Q0M19P43R65J132J545K569M077N305N678N614O078P307Q505Q949
62605D89797R049R887J1933J4522J6634J7977J9233K1254K4179K7417L0485L3549
62593G25916L6951M0429M3216M4985M6214M7451M8417M8144M5929M1948L6839
62582A206439L0896K3832J5364N844l920j3283k1963k9626l5727l9994m2722m4365
62570A050775m5070m4887m4137m3189m2019m0385l8232l5585l2332k8587k5059
$$ plain form
62662 842197 800907 763882 730077 698670 669530 643140 620009 599972 582155 565744 550605
62651 550605 536931 524571 513155 502692 493470 485324 477626 470149 463404 457728 452571 447229 442004
62638 442004 437964 435648 434564 434059 434067 434707 435642 436300 436509 436466 436191 435451 434231 432934 431968 431381 431017 430831
62620 430831 430911 431330 432073 433038 434170 435715 438284 442361 447666 453344 458958 465036 472343 480848 489797
62605 489797 498846 508733 520666 535188 551822 569799 589032 610286 634465 661882 692367 725916
62593 725916 762867 803296 846512 891497 937711 985162 1033579 1081723 1127652 1169600 1206439
62582 1206439 1237335 1261167 1276531 1282375 1278455 1265172 1243209 1213583 1177856 1137862 1095140 1050775
62570 1050775 1005705 960818 916681 873492 831473 791088 752856 717271 684939 656352 631293
62559F31293k2486k0672j8709j6146j3466j1252r494p884o398n304m870n172n840
62546D83600o009m956l006j382q84j101j100n39K04O75P73O78O34P30Q34Q73J118
62529D71142J918L071L925M228M576N717P706R904J1675J2930J4160J6027J8781
62516E85760K1990K5036K7799L0570L3461L6301L8939M1128M2204M1639M0000
62505I64827L8575L7723L6315L3214K8673K3665J8449J2517N720j216p316j1997
62493A179149j5235j7308j8369j8104j6110j2653q613m515j36M678R505J4102
62481A096391J8946K4329K9427L3159L5636L7824L9871M0618L8791L4084K6989
62470A456065J8387R499J466n488j2288j9983k8652l7344m4874n0563n4421n6754
$$ plain form
62559 631293 608807 588135 569426 553280 539814 528562 519068 511184 504786 499482 494612 489440 483600
62546 483600 477591 472635 469629 468247 467363 466262 465162 464623 464827 465502 466275 466953 467587 468317 469151 470024 471142
62529 471142 473060 476131 480056 484284 488860 494577 502283 512187 523862 536792 550952 566979 585760
62516 585760 607750 632786 660585 691155 724616 760917 799856 840984 883188 924827 964827
62505 964827 1003402 1041125 1077440 1110654 1139327 1162992 1181441 1193958 1199678 1198462 1191146 1179149
62493 1179149 1163914 1146606 1128237 1110133 1094023 1081370 1072757 1068242 1068106 1072784 1082289 1096391
62481 1096391 1115337 1139666 1169093 1202252 1237888 1275712 1315583 1356201 1394992 1429076 1456065
62470 1456065 1474452 1483951 1485417 1479929 1467641 1447658 1419006 1381662 1336788 1286225 1231804 1175050
62458A175050n7719n7258n5515n2971n0081m6939m3446l9510l4942k9545k3664
62447F83460j8249j3978j0615p719n472m240l541k375n31J209K201K690L250M031
62433F30121M803N174M627K814J41k369m117n509p165q934j0108j0499j0762j1513
62419E76704j2443j2673j1927j0964j0526j0228r062o949n135m736n470o260o530
62406D63801o338n727m754l943l898m377m445l568k053m62Q44J536J408Q24N35
62391D29383Q44J463K225L324M600N235M626L191J961J596K097L134M334N388
62377D73401O164O695P023P234P620Q478R678J0747J1438J1974J2641J3561J4869
62364F01523J6648J8585K0183K1550K3524K6677L0586L4416L7836M1080M4358
$$ plain form
62458 1175050 1117331 1060073 1004558 951587 901506 854567 811121 771611 736669 707124 683460
62447 683460 665211 651233 640618 632899 627427 623187 619646 617271 616740 617949 620150 622840 626090 630121
62433 630121 634924 640098 644725 647539 647680 645311 641194 635685 628520 619586 609478 598979 588217 576704
62419 576704 564261 551588 539661 528697 518171 507943 498881 491932 486797 482061 476591 470331 463801
62406 463801 457463 451736 446982 443039 439141 434764 430319 426751 424698 424236 425080 426616 428024 428848 429383
62391 429383 430227 431690 433915 437239 441839 447074 451700 454891 456852 458448 460545 463679 468013 473401
62377 473401 479565 486260 493283 500517 508137 516615 526293 537040 548478 560452 573093 586654 601523
62364 601523 618171 636756 656939 678489 702013 728690 759276 793692 831528 872608 916966
62353I16966M7664N0941N3964N6128N6684N5187N1554M5836L8238K9383K0258
62342A422803J1780M274k609r394j6057k1917k6429k9878l2953l5756l7777l8760
62330A187327l8927l8225l6133l2742k9331k7135k5825k4008k1152j8340j6936
62319H78573j7118j8022j8959j9952k1102k1954k1865k0922k0019j9775j9760
62308F59125j9167j7953j6680j5409j3616j1355r603q926q594p637o239n182m411
62295E14353l199j617o74p97j087o31K64P87R59J434K296K892K905K829L184L822
62279E27720M334M635M836M861M670M645N211O218P131P792Q499R369J0157J0841
62265F20919J1822J3309J5059J7028J9728K3407K7412L0976L4266L7904M1875
$$ plain form
62353 916966 964630 1015571 1069535 1125663 1182347 1237534 1289088 1334924 1373162 1402545 1422803
62342 1422803 1434583 1438857 1436248 1426854 1410797 1388880 1362451 1332573 1299620 1263864 1226087 1187327
62330 1187327 1148400 1110175 1074042 1041300 1011969 984834 959009 935001 913849 895509 878573
62319 878573 861455 843433 824474 804522 783420 761466 739601 718679 698660 678885 659125
62308 659125 639958 622005 605325 589916 576300 564945 555342 546416 537822 530185 523946 518764 514353
62295 514353 511154 509537 508863 508066 506979 506348 506612 507399 508358 509792 512088 514980 517885 520714 523898 527720
62279 527720 532054 536689 541525 546386 551056 555701 560912 567130 574261 582053 590552 599921 610078 620919
62265 620919 632741 646050 661109 678137 697865 721272 748684 779660 813926 851830 893705
62254H93705M5727M9669N4353N9468O3489O5220O4787O2666N8624N2270M4108
62243A514086L5223K6222J7052P702j503j0213j8241k5558l2469l9535m6829n3402
62231A372535n7910n9833n9736n8378n6071n2957m9465m6187m3321m0442l6926
62220H11309l2719k8614k5532k3476k1521j8988j6278j4248j3041j1971j0392
62209E94529q359o470n377n294n719n627m333k190k76O73Q42R84J663K809L863
62194E61718M364M453M710N426O321O958P223P227P143P253P827Q629R040Q984
62180F57276R230J0252J1231J0953R470Q061P631P939Q386Q851R487J0411J1910
62167G81088J4414J7924K1872K5790K9721L3705L7339M0115M1903M2725M2360
$$ plain form
62254 893705 939432 989101 1043454 1102922 1166411 1231631 1296418 1359084 1417708 1469978 1514086
62243 1514086 1549309 1575531 1592583 1600285 1598782 1588569 1570328 1544770 1512301 1472766 1425937 1372535
62231 1372535 1314625 1254792 1195056 1136678 1080607 1027650 978185 931998 888677 848235 811309
62220 811309 778590 749976 724444 700968 679447 660459 644181 629933 616892 604921 594529
62209 594529 586170 579700 574323 569029 563310 557683 553350 551160 550884 551557 552399 553383 555046 557855 561718
62194 561718 566082 570535 575245 580671 586992 593950 601173 608400 615543 622796 630623 639252 648292 657276
62180 657276 666506 676758 687989 698942 708412 716473 724104 732043 740429 749280 758767 769178 781088
62167 781088 795502 813426 835298 861088 890809 924514 961853 1001968 1043871 1086596 1128956
62156A128956M0445L6747L1143K3786J5576Q051K316j885n699r997j4819j9728
62144A234892k4260k8129l1301l3778l5215l5041l3207l0526k7789k4885k1288
62133I09473j7215j3716j1481j0131q793p017n010l363k650k930l488l402k481
62120H17796j334l72Q24K845N503P863Q992Q460O429L592Q67j297l154m911n989
62105H46114n615m050k659k622m011o233q688j0732j1555j0830r262p864o802
62092G55191n411l400j432k94P5M00J154K174L019L475L597L612L829M534N817
62077G76340P469R123J0545J1779J2969J4118J5176J6323J7877J9623K0634K0232
62065I52208J9153J9110K0939K3674K5824K7165K8522L0062L0709K9487K6637
$$ plain form
62156 1128956 1169401 1206148 1237291 1261077 1276653 1284704 1287020 1285135 1279436 1269439 1254620 1234892
62144 1234892 1210632 1182503 1151202 1117424 1082209 1047168 1013961 983435 955646 930761 909473
62133 909473 892258 878542 867061 856930 848137 841120 836110 832747 830097 827167 823679 820277 817796
62120 817796 816462 816090 816914 819759 825262 833125 842117 850577 857006 860598 861465 860168 857014 852103 846114
62105 846114 840499 836449 833790 831168 827157 820924 812236 801504 789949 779119 769857 761993 755191
62092 755191 749780 746380 744948 744654 744729 745129 746283 748457 751476 754951 758548 762160 765989 770523 776340
62077 776340 783809 792932 803477 815256 828225 842343 857519 873842 891719 911342 931976 952208
62065 952208 971361 990471 1011410 1035084 1060908 1088073 1116595 1146657 1177366 1206853 1233490
62054A233490K2892J8252J2275N378j068o080r968j3615j7477k1591k6016l0668
62042A165804l4930l8078m0078m1417m2212m1962m0359l7832l5012l2132k9238
62031G52554k6621k4563k2812k0803j8421j6197j4643j3593j2374j0614q764p687
62019E55462p617p762p277o440o306p104p728p191n922n000m640m246l640l251
62005D71338l157k825k058j391j152q10K73J851L089L467L091K333J598J214J212
61990D78073J235Q81L8j169k527l701m359m526m624m976n462n795n866n691n298
61975D26233m788m234l459k320j285j143j865k356j800p20j59k30k37O8J81k37
61959D01649q50j234j400j524j568j403j047n86n6N07J015J406J677J905K296
$$ plain form
62054 1233490 1256382 1274634 1286909 1292287 1291219 1285139 1275171 1261556 1244079 1222488 1196472 1165804
62042 1165804 1130874 1092796 1052718 1011301 969089 927127 886768 848936 813924 781792 752554
62031 752554 725933 701370 678558 657755 639334 623137 608494 594901 582527 571913 563149 555462
62019 555462 547845 540083 532806 526366 520060 512956 505228 498037 492115 487115 482475 478229 474589 471338
62005 471338 468181 465356 463298 461907 460755 459945 460218 462069 465158 468625 471716 474049 475647 476861 478073
61990 478073 479308 480189 480227 479058 476531 472830 468471 463945 459321 454345 448883 443088 437222 431531 426233
61975 426233 421445 417211 413752 411432 410147 409004 407139 404783 402983 402263 402104 401874 401637 401705 401886 401649
61959 401649 400799 399565 398165 396641 395073 393670 392623 392037 391981 392488 393503 394909 396586 398491 400787
61944D00787L089M234N384O304P123P981Q743R274R716J0203J0603J0919J1415
61931E05775J1974J1709J0065P966O981P342P646O686M819L259K665K712K544
61918E92143J359r65l494m889m670l562k468j568n81O78K265M137N920P118P792
61903E99215Q569R695J0597J0737J0233R240P389M509J396q71k105k854l451l847
61889F58452m107m292m142l542l080l339l885l858l441l690m860o015o568p131
61875E96502q280r445r779r466r338r626r855r675r063p975o387m566k759q03
61861D89485J383L180L843L627L666M651O245P836R266J0598J1733J2628J3530
61848E81671J4685J6026J7304J8281J8656J8169J6951J5510J4225J3050J1729
$$ plain form
61944 400787 403876 408110 413494 419798 426921 434902 443645 452919 462635 472838 483441 494360 505775
61931 505775 517749 529458 539523 547489 554470 561812 569458 576144 580963 584222 586887 589599 592143
61918 592143 593502 592537 589043 584154 579484 575922 573454 571886 571305 571983 574248 578385 584305 591423 599215
61903 599215 607784 617479 628076 638813 649046 658286 665675 670184 671580 670709 668604 665750 662299 658452
61889 658452 654345 650053 645911 642369 639289 635950 632065 628207 624766 621076 616216 610201 603633 596502
61875 596502 588222 578777 568998 559532 550194 540568 530713 521038 511975 504000 497613 493047 490288 489485
61861 489485 490868 494048 497891 501518 505184 509835 516080 523916 533182 543780 555513 568141 581671
61848 581671 596356 612382 629686 647967 666623 684792 701743 717253 731478 744528 756257
61837G56257R971P373L725l70l692n593o595p443p931p275n376l048j065N14K033
61822G31485L732N579P204P925P233N399L318J577r1k374n608r445j3011j5402
61808G27521j6274j6089j5580j5036j4338j3509j2768j2048j1036r846r134r183
61796E72680r334q758p501o279n451m725l851l090k817l007l334l568l694l715
61782E03556l531l053k335j573r34m37k0K68K84K4j95J3O84J384J611J372J251
61765D98369J791K847L706L954L992M492N540O571P074P035O688O206N750N554
61751E69569N647N606M773K860L18j925l262l996m959o453p841q384q167p855
61737E35931p745p554p029o210n161l914k721j853j165l41M12N97L66M74J045
$$ plain form
61837 756257 766228 773601 777326 776956 773264 767671 761076 753633 745702 738427 733051 730003 728938 729452 731485
61822 731485 735217 740796 748000 755925 763158 768557 771875 773452 773361 770987 765379 755934 742923 727521
61808 727521 711247 695158 679578 664542 650204 636695 623927 611879 600843 590997 581863 572680
61796 572680 563346 554588 547087 540808 535357 530632 526781 523691 520874 517867 514533 510965 507271 503556
61782 503556 500025 496972 494637 493064 492130 491693 491673 491941 492225 492249 492054 492067 492751 494135 495746 497118 498369
61765 498369 500160 503007 506713 510667 514659 519151 524691 531262 538336 545371 552059 558265 564015 569569
61751 569569 575216 580822 585595 588455 588773 586848 583586 579590 574631 568178 560337 551953 543786 535931
61737 535931 528186 520632 513603 507393 502232 498318 495597 493744 492579 492238 492650 493247 493613 494087 495132
61722D95132J232N22l54m68LK43J54L71J101J737J708J115M74J58K33M42L49k86
61704E03866j275k237k916l179l028k810l005l515l647l148k768l186l867l839
61690D61446l212l042l764m655m972m770m404l966l523l301l261k975k238j442
61676D11921j045j015j089j176j317j509j830k362k825k611j523j75O68Q78P88
61661C95778M92j89j067j468r42J16R01J136J283J747K237K238J868J714J849
61646D07693J662R09L55P68J764K257J871J277J167J457J594J187K95o39j072
61631D22545q75m71k82k57k61n52j327k102k222j907k001k751l515l744l580l308
61615C93390k928k493k265k296k327k302k470k856l189l462l977m624m830m460
$$ plain form
61722 495132 496364 496886 496532 496064 496067 496310 496464 496835 497936 499673 501381 502496 502970 503128 503361 503803 504152 503866
61704 503866 502591 500354 497438 494259 491231 488421 485416 481901 478254 475106 472338 469152 465285 461446
61690 461446 458234 455192 451428 446773 441801 437031 432627 428661 425138 421837 418576 415601 413363 411921
61676 411921 410876 409861 408772 407596 406279 404770 402940 400578 397753 395142 393619 393444 394112 394990 395778
61661 395778 396270 396081 395014 393546 392604 392720 393621 394757 396040 397787 400024 402262 404130 405844 407693
61646 407693 409355 410264 410619 411387 413151 415408 417279 418556 419723 421180 422774 423961 424256 423617 422545
61631 422545 421670 421199 420917 420660 420399 419847 418520 416418 414196 412289 410288 407537 404022 400278 396698 393390
61615 393390 390462 387969 385704 383408 381081 378779 376309 373453 370264 366802 362825 358201 353371 348911
61601C48911m086m015l786l106k556k727l221l245k778k458k523k594k353j905
61587C07558j470j175j111j219j240j098j143j664k290k308j551n63P5K66K64
61572B91331L18N26Q36J096J175R99N34j11n10k12O96J500J583J057N92O96J310
61555C03416J892J840J044J05k17K04Q48J269J397J230P56L10L82Q35R07K98k93
61538C16223j38N56J137J425J595J495Q23j54o83m11K05M67J33m67q69j012j248
61521C19077j659j635o99M21L97q62j873j554n66q8j17M8L38J65k69m4J015K044
61503C14139K344K125J851J601J270Q50K96l94r18q92m03J47O13J066J357J275
61487C26327J081J215J494J318O36P6k4J6o2m6J84M20O67J342K489L344L123J939
$$ plain form
61601 348911 344825 340810 337024 333918 331362 328635 325414 322169 319391 316933 314410 311816 309463 307558
61587 307558 306088 304913 303802 302583 301343 300245 299102 297438 295148 292840 291289 290726 290801 291067 291331
61572 291331 291649 292175 293011 294107 295282 296281 296815 296704 296194 295982 296678 298178 299761 300818 301410 302106 303416
61555 303416 305308 307148 308192 308297 308080 308284 309132 310401 311798 313028 313784 314094 314476 315311 316218 316516 316223
61538 316223 316085 316641 317778 319203 320798 322293 323116 322962 322279 321868 322073 322540 322673 322206 321337 320325 319077
61521 319077 317418 315783 315084 315505 315902 315040 313167 311613 311047 310959 310842 310890 311228 311393 311124 311080 312095 314139
61503 314139 316483 318608 320459 322060 323330 324180 324476 324082 323164 322272 321869 322016 322629 323695 325052 326327
61487 326327 327408 328623 330117 331435 332071 332147 332123 332139 332077 332031 332215 332635 333302 334644 337133 340477 343600 345539
61469C45539N71l26n96m33j78q5j41k42m81r03j120o84J55O63O37N16M33k5p96
61450C42504r63jJ275J773J605J678K148K222J507O95O52J377K207K651K708K594
61434C66632K398K013J310M14j41J86J318K381K355J071m95j086m29N17O86J11
61418C79241k99lO23R28P72M41J76P3K10N16O65L58l73j220j925k398k607k537
61400C72641k177j535p23k7K91K99K93L02O4m45p47m54J48M63M07N04J084J769
61382C72157J915J417Q45P72J191J701K173K876L870M594M444L552K674K309K318
61367D08808K341K106J368J29r27q03N56J884J943J001L50O13J203J428J380J502
61351D24882J893K453L330M670O024O580O010M841L808L168K752K448K369K625
$$ plain form
61469 345539 346110 345784 345188 344755 344577 344492 344351 344109 343628 342725 341605 340921 341076 341739 342376 342892 343325 343300 342504
61450 342504 341541 341540 342815 344588 346193 347871 350019 352241 353748 354443 355095 356472 358679 361330 364038 366632
61434 366632 369030 371043 372353 372767 372626 372812 374130 376511 378866 379937 379442 378356 377927 378444 379130 379241
61418 379241 378942 378939 379562 380490 381262 381703 381879 381952 382162 382678 383343 383701 383328 382108 380183 377785 375178 372641
61400 372641 370464 368929 368206 368179 368470 368769 369062 369364 369428 368983 368236 367782 367930 368393 368800 369304 370388 372157
61382 372157 374072 375489 376334 377106 378297 379998 382171 385047 388917 393511 397955 401507 404181 406490 408808
61367 408808 411149 413255 414623 414752 413825 413022 413578 415462 417405 418406 418756 419369 420572 422000 423380 424882
61351 424882 426775 429228 432558 437228 443252 449832 455842 460683 464491 467659 470411 472859 475228 477853
61337D77853L193L919M502M558L951L037K323J871J379Q42P12J165J656J491O73
61322E13125k14o91o78k88K90Q26J332K102L202M176M671N101O077P435Q525R288
61306E64279J0230J1336J1965J2000J2123J2512J2253J0681Q492O675N071K990
61294F80607O66j038k191l792o122q180r045q926q487q004p654p859q689r479
61280E91807r567r081q368p251n481l593k385j749q38N52J646J958K062K589L156
61265E55457K944K024J372J629K487L361M133M969N730N999N606M849M157L669
61251F08386L244K770K331K051J847J500R72N22M16N79O43L33k42p35r43j002
61235F22672j135j242r63k78K81K70O2L93J341K336L232M586O542Q119Q310P419
$$ plain form
61337 477853 481046 484965 489467 494025 497976 501013 503336 505207 506586 507428 508140 509305 510961 512452 513125
61322 513125 512911 512220 511542 511254 511544 512370 513702 515804 519006 523182 527853 532954 539031 546466 554991 564279
61306 564279 574509 585845 597810 609810 621933 634445 646698 657379 665871 672546 677617 680607
61294 680607 681273 680235 678044 674252 668130 659950 650905 641979 633492 625488 617834 609975 601286 591807
61280 591807 582240 573159 564791 557540 552059 548466 546081 544332 543494 544046 545692 547650 549712 552301 555457
61265 555457 558401 560425 561797 563426 565913 569274 573407 578376 584106 590105 595711 600560 604717 608386
61251 608386 611630 614400 616731 618782 620629 622129 623101 623623 624039 624618 625261 625594 625352 624617 623674 622672
61235 622672 621537 620295 619332 619054 619335 619605 619667 620060 621401 623737 626969 631555 638097 646216 654526 661945
61219F61945O619O555P040P797Q602Q890Q186P002O421O614O625N822M686L826
61205G56630L141K485K346L051L963M269M175M550N643O860P618P832P727P749
61191H28039Q408R635J0394R642P521N090K983J002j024k784m030m976n846o498
61177H57556o820p128p816q756r289q891p747o639o192o261o253o039o163p049
61163G56513q367r503j0224j0547j0367r737r178r172r487r517r062q275p088
61150F35989n375l529k264j777j627j453j371j701k682m311o055o951o557n600
61136E84736n023m648l592j900p18o63r60n31P90K541M438O388Q173R602J0751
61121F09384J1752J2677J3755J5294J7223J9060K0498K1537K2091K2075K1974
$$ plain form
61219 661945 668564 675119 682159 689956 698558 707448 715634 722636 729057 735671 742296 748118 752804 756630
61205 756630 759771 762256 764602 767653 771616 775885 780060 784610 790253 797113 804731 812563 820290 828039
61191 828039 836447 846082 856476 866118 873639 878729 881712 882714 881690 878906 874876 869900 864054 857556
61177 857556 850736 843608 835792 827036 817747 808856 801109 794470 788278 782017 775764 769725 763562 756513
61163 756513 748146 738643 728419 717872 707505 697768 688590 679418 669931 660414 651352 643077 635989
61150 635989 630614 627085 624821 623044 621417 619964 618593 616892 614210 609899 603844 596893 590336 584736
61136 584736 579713 575065 571473 569573 568855 568192 567232 566701 567491 570032 574470 580858 589031 598633 609384
61121 609384 621136 633813 647568 662862 680085 699145 719643 741180 763271 785346 807320
61110H07320K2534K3585K3979K3205K2194K1872K1584K0055J7352J4762J2774
61099A031216J0392O767K596p83l136n385q184j1163j3629j5473j6972j8136j8744
61086I39366j8882j9007j9355j9653j9576j9169j8630j7935j6923j5555j3905
61075G40776j2123j0484r240q233p012n486m150l346k802k170j533r40N9J823
61061F75139L934N653O781P463P617P271P107P856R267J0504J1386J2484J4061
61048G86523J5750J7240J8497J9363J9737K0179K1547K3864K6262K8104K9561
61037A026627L1029L2667L4538L6610L8462L9707M0705M2283M4683M7387M9923
61026A464621N2268N4446N6373N8083N9677O1199O3042O6143P1262P8475Q7826
$$ plain form
61110 807320 829854 853439 877418 900623 922817 944689 966273 986328 1003680 1018442 1031216
61099 1031216 1041608 1048375 1050971 1050188 1047052 1041667 1033483 1022320 1008691 993218 976246 958110 939366
61086 939366 920484 901477 882122 862469 842893 823724 805094 787159 770236 754681 740776
61075 740776 728653 718169 708929 700696 693684 688198 684048 680702 677900 675730 674197 673257 673316 675139
61061 675139 679073 684726 691507 698970 706587 713858 720965 728821 738088 748592 759978 772462 786523
61048 786523 802273 819513 838010 857373 877110 897289 918836 942700 968962 997066 1026627
61037 1026627 1057656 1090323 1124861 1161471 1199933 1239640 1280345 1322628 1367311 1414698 1464621
61026 1464621 1516889 1571335 1627708 1685791 1745468 1806667 1869709 1935852 2007114 2085589 2173415
61015B173415R9692J13794J28891J44680J63104J86712K16889K55026L03506L62990
61005D148699M30193N01508N77940O63329P59281Q66484R90097J138019J313890
60996A1389440J517490J746949J979867K140149K104471J782348J212019N66489
60988B4439222M5259k46661l19933k32890m2511J70348K70392J20427l09791q97955
60978B2995907j448093j818640j981355j983638j884039j724815j536920j344107
60970I274300j159452r87580q32330o98131n85406m90566m11037l46482k95321
60961C467995k54094k20640j94529j74081j56179j39584j25564j14548j04719
60952A984057r4554q4418p4954o6121n8486n3378n0943m9699m8564m7712m7049
$$ plain form
61015 2173415 2273107 2386901 2515792 2660472 2823576 3010288 3227177 3482203 3785709 4148699
61005 4148699 4578892 5080400 5658340 6321669 7080950 7947434 8937531 10075550 11389440
60996 11389440 12906930 14653879 16633746 18773895 20878366 22660714 23872733 24439222
60988 24439222 24484481 24237820 23917887 23684997 23642486 23812834 24083226 24203653 23893862 22995907
60978 22995907 21547814 19729174 17747819 15764181 13880142 12155327 10618407 9274300
60970 9274300 8114848 7127268 6294938 5596807 5011401 4520835 4109798 3763316 3467995
60961 3467995 3213901 2993261 2798732 2624651 2468472 2328888 2203324 2088776 1984057
60952 1984057 1889503 1805085 1730131 1664010 1605524 1552146 1501203 1451504 1402940 1355228 1308179
60941A308179m5659m3265m0627l8109l5357l2704l1117l0440k9426k7799k6606
60930I27070k6147k5435k4127k3103k2519k1255j8978j6916j5770j4643j2909
60919G05268j1365j0552r638q078o747o321o006n118m442m745n161m439k832j508
60905F18316r54r81j430j908j679p40j42m84j021j000p64p50o21k36k84j025j610
60888F02687j682k222l715m837m476l748m338n833o563o298o265o896p351p096
60874E31367o466n766n109m952n544o039n372l916l028l127l402l317l111k766
60860D69452j703J12J786K524K391J849J216P14N33O17P81J004J365J763K070
60845D86474K240K065J199j69j199j374j119j003j018j146j863l251m343m290
$$ plain form
60941 1308179 1262520 1219255 1178628 1140519 1105162 1072458 1041341 1010901 981475 953676 927070
60930 927070 900923 875488 851361 828258 805739 784484 765506 748590 732820 718177 705268
60919 705268 693903 683351 673713 665635 658888 652567 646561 641443 637001 632256 627095 622656 619824 618316
60905 618316 617362 616381 614951 613043 611364 610624 610482 609998 608977 607977 607213 606463 605842 605606 605322 604297 602687
60888 602687 601005 598783 595068 590231 585755 582007 577669 571836 565273 558975 552710 545814 538463 531367
60874 531367 524901 519135 514026 509074 503530 497491 492119 488203 485175 482048 478646 475329 472218 469452
60860 469452 467749 467861 469647 472171 474562 476411 477627 478341 478874 479491 480272 481276 482641 484404 486474
60845 486474 488714 490779 491978 491809 490610 489236 488117 487114 486096 484950 483087 479836 475493 471203
60831D71203l555l036k652j878j131j251j930j950r79J01N80N53J32q58k132k903
60815D48314k841k356j812j231q78j250k229k985l040k778k697k773k841k981
60801D15622l168l101k690k337k389k659k787k821l085l632m068l947l280k536
60787C73122k170k183k305k355k227j680o63K46L58j25l08J06M98N12N95J020
60771C62441J299J184J275J962K604K641K685L438M359M484L959L581L308K510
60757D01730J374P94R99J377J518J386P17o27j811j790q94m19o55o03J80P73L59
60740D04408o91j749k890m241n257n435n145n036n065m747m073l595l639l850
60726C48995l571k567j431j070j645k171j592r1J109J175L91m26p14l75K50N55
$$ plain form
60831 471203 467648 464612 461960 460082 458951 457700 455770 453820 452841 452942 453522 454075 454207 453349 451217 448314
60815 448314 445473 443117 441305 440074 439196 437946 435717 432732 429692 426914 424217 421444 418603 415622
60801 415622 412454 409353 406663 404326 401937 399278 396491 393670 390585 386953 382885 378938 375658 373122
60787 373122 370952 368769 366464 364109 361882 360202 359539 359785 360143 360018 359710 359816 360314 360826 361421 362441
60771 362441 363740 364924 366199 368161 370765 373406 376091 379529 383888 388372 392331 395912 399220 401730
60757 401730 403104 403898 404897 406274 407792 409178 409895 409268 407457 405667 404773 404354 403699 403096 403276 404049 404408
60740 404408 403717 401968 399078 394837 389580 384145 379000 373964 368899 364152 360079 356484 352845 348995
60726 348995 345424 342857 341426 340356 338711 336540 334948 334857 335966 337141 337532 337106 336392 336017 336267 336822
60710C36822K25l65o35n43m68n07m22j37K08N85R96J282J397J658K148K299J723
60693C46266J123J470K518L109K822K410K478K760K844K789K707K469K152K132
60679C80049K534L021L276L244K826J969J074P00Q19R64R84J034R00J20j157k277
60663D00080l072l868m508m305l282k461k467k687k412j961k007k328k017p55
60649C61950Q15J894K310K417K510K469K069J464J060Q58L49o17j431j619j584
60634C74914j848k117j933j669j939k392k244j641j319j150l96O68Q91J39l73
60619C57591l3L10k8m19j05N52Q07N99J95m17j116j327q03l2N19R11J081O85K4
60600C58994J42J256K131J803J021R98J590J800J518J509K028K497K511K278K035
$$ plain form
60710 336822 337047 336682 336047 335504 335036 334529 334107 333970 334178 334763 335759 337041 338438 340096 342244 344543 346266
60693 346266 347389 348859 351377 354486 357308 359718 362196 364956 367800 370589 373296 375765 377917 380049
60679 380049 382583 385604 388880 392124 394950 396919 397993 398693 399512 400476 401460 402494 403394 403514 402357 400080
60663 400080 397008 393140 388632 384327 381045 378584 376117 373430 371018 369057 367050 364722 362705 361950
60649 361950 362765 364659 366969 369386 371896 374365 376434 377898 378958 379816 380165 379548 378117 376498 374914
60634 374914 373066 370949 369016 367347 365408 363016 360772 359131 357812 356662 356266 356934 357825 357964 357591
60619 357591 357558 357868 357840 357421 357316 357868 358675 359274 359469 359052 357936 356609 355806 355774 356293 357204 358285 358970 358994
60600 358994 359136 360392 362523 364326 365347 366345 367935 369735 371253 372762 374790 377287 379798 382076 384111
60585C84111J679J026Q0r21j498j275n05J50N35J118J956K385K195K273L406N071
60569D01786O180O531O752P322Q298R664J1092J1722J0957R296P755O637N395
60556E09387L454P85k092m306n199n091m940m901l961j563J195K857L442M077
60542D93144N315O877Q612J0548J2193J2931J3162J4032J5857J7666J8495J8304
60530F47136J7387J5643J2870R303N436J580k201n787q819j0803j1508j1341j1012
60517F47884j0782j0270r189p785o293m566k605r39O8Q41J924L126M076N142P047
60502F17679R781J2690J5509J8547K1973K5622K9460L3474L7177L9809M1146M1532
60490I44399M1150L9799L7393L4108L0040K5281K0267J5510J0808N275j691r761
$$ plain form
60585 384111 385790 386816 386896 385975 384477 383202 382697 382847 383382 384500 386456 388841 391036 393309 396715 401786
60569 401786 407966 414497 421249 428571 436869 446533 457625 469347 480304 489600 497355 503992 509387
60556 509387 512841 513626 511534 507228 502029 496938 491998 487097 483136 481573 482768 485625 489067 493144
60542 493144 498459 505336 513948 524496 536689 549620 562782 576814 592671 610337 628832 647136
60530 647136 664523 680166 693036 702339 707775 709355 707154 701367 692548 681745 670237 658896 647884
60517 647884 637102 626832 617643 609858 603565 598999 596394 595455 595523 596364 598288 601414 605490 610632 617679
60502 617679 627460 640150 655659 674206 696179 721801 751261 784735 821912 861721 902867 944399
60490 944399 985549 1025348 1062741 1096849 1126889 1152170 1172437 1187947 1198755 1204030 1202339 1192578
60478A192578j8022k5686l2524l8785m4577m9137n1189n0407m8026m5393m2439
60467G46393l8400l3684k9765k7285k5331k2838j9842j6918j4279j2015j0515
60456D95521r980r801r074p620o092n103m566l949l026k204k014k384k684k515
60442D24509k128j893j781j663j713k042k233j875j251j003j185j294j058p06
60428D02684n51p82j476k301k458j597n05j70l30J06J260J986J565O72K48L28
60412C98679N29R48J771K498K368J378K69l53l95J8P28J452J908K085K191K285
60396D18359K181J784J422J698K876M383N109M481L125K164K025K268K506K839
60382D57220L290L434L004K387K134K269K466K648K891K951K486J737J403J710
$$ plain form
60478 1192578 1174556 1148870 1116346 1077561 1032984 983847 932658 882251 834225 788832 746393
60467 746393 707993 674309 644544 617259 591928 569090 549248 532330 518051 506036 495521
60456 495521 485541 475740 466666 459046 452954 447851 443285 439336 436310 434106 432092 429708 427024 424509
60442 424509 422381 420488 418707 417044 415331 413289 411056 409181 407930 406927 405742 404448 403390 402684
60428 402684 402133 401351 399875 397574 395116 393519 393014 392844 392514 392620 393880 395866 397431 398103 398351 398679
60412 398679 399208 400156 401927 404425 406793 408171 408440 408087 407692 407710 408438 409890 411798 413883 416074 418359
60396 418359 420540 422324 423746 425444 428320 432703 437812 442293 445418 447582 449607 451875 454381 457220
60382 457220 460510 463944 466948 469335 471469 473738 476204 478852 481743 484694 487180 488917 490320 492030
60368D92030K044J874J512J492J570J049R9j26R78K493L155L001L036L657M285
60353E22149M560M929N832P079Q408R838J1057J1245J0112Q518P295O006L659
60340F20687K81l071n660p639r273j0345j0531r844q657p532o954o835o505n562
60326E22560m547m227m495m581m163l591l160k835k618k469j863k39J969L545
60312D89286L946L940M502N716P073Q340R690J1268J3028J4745J6023J6579J6547
60299F20683J6187J5183J2749Q649L622j502o611j1814j6518j9617k0488j9460
60287E81063j7318j4751j2238j0051q188o480m939l890l608l885m158m125l997
60274D83435m045m099l764l056k450k291k484k797l077l207l131k995k928k673
$$ plain form
60368 492030 494074 495948 497460 498952 500522 501571 501670 501544 502522 505015 508170 511171 514207 517864 522149
60353 522149 526709 531638 537470 544549 552957 562795 573852 585097 595209 603727 611022 617028 620687
60340 620687 620968 617897 612237 604598 595325 584980 574449 564605 555948 548416 541462 534627 528122 522560
60326 522560 518013 513786 509291 504710 500547 496956 493796 490961 488343 485874 484011 483772 485741 489286
60312 489286 493232 497172 501674 507390 514463 522803 532493 543761 556789 571534 587557 604136 620683
60299 620683 636870 652053 664802 673451 677073 675571 668960 657146 640628 621011 600523 581063
60287 581063 563745 548994 536756 526705 518517 512037 507098 503208 499600 495715 491557 487432 483435
60274 483435 479390 475291 471527 468471 466021 463730 461246 458449 455372 452165 449034 446039 443111 440438
60260D40438j989j352j540k360k649j853q36n81r39j236j319j162k77J423K812
60245D26580K804J972J731K242K436J933J469J351R13lm11L61J526J959J692J539
60229D50094J835K250K532K748K995L269L476L434L036K514K250K251K295K579
60215D87558L605N192O285O197N557N507O298P175P480P403P544Q044Q376Q066
60201E80287P367O863O544N822M674L978M197M506M022L261L264L749L440K088
60187F44062P85J38m88j574k547k946l304m170n026n062m388l750l496l475l541
60172F01218l641l664l607l625l649l431l103l119l403l253k458j764j763k023
60158E58715j853j368j095j070r25n48n4N79J308J807J867J740J692J598J270
$$ plain form
60260 440438 438449 437097 435557 433197 430548 428695 427859 427278 426339 425103 423784 422622 422345 423768 426580
60245 426580 429384 431356 433087 435329 437765 439698 441167 442518 443431 443428 443017 443378 444904 446863 448555 450094
60229 450094 451929 454179 456711 459459 462454 465723 469199 472633 475669 478183 480433 482684 484979 487558
60215 487558 491163 496355 502640 508837 514394 519901 526199 533374 540854 548257 555801 563845 572221 580287
60201 580287 587654 594517 601061 606883 611557 615535 619732 624238 628260 631521 634785 638534 641974 644062
60187 644062 644847 644985 644497 642923 640376 637430 634126 629956 624930 619868 615480 611730 608234 604759 601218
60172 601218 597577 593913 590306 586681 583032 579601 576498 573379 569976 566723 564265 562501 560738 558715
60158 558715 556862 555494 554399 553329 552404 551856 551802 552381 553689 555496 557363 559103 560795 562393 563663
60143E63663Q21L75q9k95L25J751L121L891M539N526O282O121N522N452N764N472
60127F18241M520M000M377M572L498J720P92J213J916J846J365J554K498L120
60113F55232K800K393K932L981M212L359K531K432K442J823R02L58J20k86q26
60098F84405j162j358j749k271k537k406k078j784j631j562j326p74k79l58p85
60083F62345p72k41j46j089k358k965k900k722k566k366k463l168m096m732n296
60068F24465o239p246p604p310p039p092p194p160p089o928o504n906n361m853
60054E30940m347m135m314m261l323j855q31n40l75J86J070K033K894L408L472
60039E20022L519M041M801N151N040N025N221N030M079K766J574M24r29k263l025
$$ plain form
60143 563663 564484 564859 564770 564475 564800 566551 569672 573563 578102 583628 589910 596031 601553 607005 612769 618241
60127 618241 622761 626761 631138 635710 639208 640928 641720 642933 644849 646695 648060 649614 652112 655232
60113 655232 658032 660425 663357 667338 671550 674909 677440 679872 682314 684137 685039 685397 685517 685231 684405
60098 684405 683243 681885 680136 677865 675328 672922 670844 669060 667429 665867 664541 663767 663488 663130 662345
60083 662345 661573 661332 661186 660097 657739 654774 651874 649152 646586 644220 641757 638589 634493 629761 624465
60068 624465 618226 610980 603376 596066 589027 581935 574741 567581 560492 553564 547060 541154 535793 530940
60054 530940 526593 522458 518144 513883 510560 508705 507874 507334 506959 507145 508215 510248 513142 516550 520022
60039 520022 523541 527582 532383 537534 542574 547599 552820 557850 561929 564695 566269 566693 565764 563501 560476
60024E60476l058k900l296m371n342n346m561m074m499n315n925o574p526q013
60010D89676p071n155l798l666l900l503k532j647j237j282j580j751j467r02
59996D50185n55n41m65l1N92J168J692K192K596K875L076L233L478M024M726M902
59980D83147M184L150K531K045R46n03j195q96o90j345k247k559k511k764l122
59965D78171k790j602j95Q79J601K133K566L018L505L762L554L134K898K663J781
59950E05078J60j340j903j743j681j933j845r23L97J229J179N55j10m37l13l1
59934D96339j08o79j214j232j010j030r82q8J610L105L781M136M848N852O759
59919E20087P543Q325Q968R325R368Q873P584O027N316N652N869N069L878L252
$$ plain form
60024 560476 557418 554518 551222 546851 541509 536163 531602 527528 523029 517714 511789 505215 497689 489676
60010 489676 482605 477450 473652 469986 466086 462583 460051 458404 457167 455885 454305 452554 451087 450185
59996 450185 449630 449089 448624 448593 449185 450353 452045 454237 456833 459708 462784 466017 469495 473519 478245 483147
59980 483147 487331 490481 493012 495057 496003 495500 494305 493409 492719 491374 489127 486568 484057 481293 478171
59965 478171 475381 473779 473584 474463 476064 478197 480763 483781 487286 491048 494602 497736 500634 503297 505078
59950 505078 505238 503898 501995 500252 498571 496638 494793 493870 494267 495496 496675 497230 497120 496683 496370 496339
59934 496339 496231 495552 494338 493106 492096 491066 490084 489996 491606 494711 498492 502628 507476 513328 520087
59919 520087 527630 535955 544923 554248 563616 572489 580073 586100 591416 597068 602937 608006 611884 615136
59905F15136K926K136J206J079J643J782J017k8p39j082j072o77l31o27j368j663
59889F19338j136l10K81O36Q96J140J620K520L431L764L652L757M161M316M075
59874F52141L894L909L621K782J748P43m64j803k577k322j488r17j076j904k953
59859F53334l523l200k380j791j491j002l19N1J68Q67K504M311N420N860O128
59844F64937O366O296N553L783R82k003l912m376m139l793l029j630m93q30k700
59829F61012m994o706p688q239q474q237p462o484n812n482m902l660k296j710
59815E78866j942k188j977j592j314r80n32l60o91j219j569j715j700j448r92
59800E58647m99L3O28Q88L56o18j126r91j063j930l093l678l383k390j094k46
$$ plain form
59905 615136 618062 620198 621404 622483 624126 625908 626925 626897 626158 625076 624004 623327 622996 622369 621001 619338
59889 619338 618202 617892 618173 618809 619705 620845 622465 624985 628416 632180 635832 639589 643750 648066 652141
59874 652141 656035 659944 663565 666347 668095 668838 668374 666571 663994 661672 660184 659267 658191 656287 653334
59859 653334 649811 646611 644231 642440 640949 639947 639628 639679 639847 640714 643218 647529 652949 658809 664937
59844 664937 671303 677599 683152 686935 687917 685914 682002 677626 673487 669694 666665 665035 664542 663712 661012
59829 661012 656018 649312 641624 633385 624911 616674 609212 602728 596916 591434 586532 582872 580576 578866
59815 578866 576924 574736 572759 571167 569853 568873 568341 567981 567290 566071 564502 562787 561087 559639 558647
59800 558647 558148 558181 558809 559697 560053 559435 558309 557318 556255 554325 551232 547554 544171 541781 540687 540441
59784E40441n95j880k874k821k242j916j776j454j143j188j292r00r5N58Q26R73
59768E22622J276J865K768L772M456M752N134N929O753P090P060P088P182P096
59754E94843P085P801R339J0856J1415J1033J0597J0732J0968J0323Q697P124
59742G10813O432O176N414M078K816J856R17J5o23j342k664m076m381l480k691
59727G19260k903l521l733l772m185m745m892m619m205l671l076k769k785k580
59713F67804j905j285j112r62m82j18k70l30M77J868K928L425L868M565N361O135
59697F89967O827P161O892O284N922O149O858P509P281N772L684K209J521P12
59683G64748n81j552j677j632k053k439k246k066k615l475m033m835o593q413
$$ plain form
59784 540441 539846 537966 535092 532271 530029 528113 526337 524883 523740 522552 521260 520360 520265 520823 521649 522622
59768 522622 523898 525763 528531 532303 536759 541511 546645 552574 559327 566417 573477 580565 587747 594843
59754 594843 601928 609729 619068 629924 641339 652372 662969 673701 684669 694992 703689 710813
59742 710813 717245 723421 728835 732913 735729 737585 738502 738517 737894 736552 733888 729812 725431 721951 719260
59727 719260 716357 712836 709103 705331 701146 696401 691509 686890 682685 679014 675938 673169 670384 667804
59713 667804 665899 664614 663502 662540 662058 661940 661670 661340 661817 663685 666613 670038 673906 678471 683832 689967
59697 689967 696794 703955 710847 717131 723053 729202 736060 743569 750850 756622 760306 762515 764036 764748
59683 764748 764167 762615 760938 759306 757253 754814 752568 750502 747887 744412 740379 735544 728951 720538
59669G20538q596o975n074m045l719l646l735l663k808j158M99J585K241K744
59655F84188L133L586M462N779P081P903P987P208N747M132K681J091r07k882
59641G41189m311n431o744q045q823r242r830j0394j0282r554q864q246p130n660
59627F28633m858n210n991o309o133n869n679n599n773o179o501o490o217n853
59613E45972n567n570n818n794n030l814k840k272j688q84j55K26L04K05P3J45
59597E07493M68O19K70j73l3O70J273J289P49n8o14l96L24L40r65k471k694j864
59579E04227j432j841k202k152k366k964k934j872r56j312k373k822k378j724
59565D74899j248q11m26l52n50o77n59k18L89J206J798J687J008N20Q24J678K303
$$ plain form
59669 720538 711942 704967 699893 695848 692129 688483 684748 681085 678277 677119 677618 679203 681444 684188
59655 684188 687321 690907 695369 701148 708229 716132 724119 731327 737074 741206 743887 744978 744071 741189
59641 741189 736878 731447 724703 716658 707835 698593 688763 678369 668087 658533 649669 641423 634293 628633
59627 628633 623775 618565 612574 606265 600132 594263 588584 582985 577212 571033 564532 558042 551825 545972
59613 545972 540405 534835 529017 523223 518193 514379 511539 509267 507579 506695 506540 506766 507070 507275 507348 507493
59597 507493 507961 508580 508850 508677 508644 509314 510587 511876 512625 512567 511953 511557 511881 512221 511256 508785 506091 504227
59579 504227 502795 500954 498752 496600 494234 491270 488336 486464 485508 484196 481823 479001 476623 474899
59565 474899 473651 472840 472414 472062 471512 470835 470276 470058 470447 471653 473451 475138 476146 476666 477490 479168 481471
59548D81471K342K297K780L510L732L582M239O221Q384R354R269R220R709J0820
59534E66930J3197J6983J9949J8649J2207L719k881o247p396p435o693n330l561
59521F12091j500M90J553J170qq08q86r11j559k801m165n293o177o990p747q174
59505E68285q038p467o724n814m741l917l760l923l604k695j980k040k522k695
59491E08365k207j153J48J247J911K374K883L137K827K556L259M670N444N050
59477E40511M508M760N348N352M757M108L421K401J247M79J53j17m71o98o38l25
59461E74796J35N43P04P90J296K400L713M907O109P373Q255Q343P840P191O486
59446F40881N649M864M328L809K891J511q2j768l606n542p205q046p759o774o079
$$ plain form
59548 481471 483813 486110 488890 492400 496132 499714 503953 510174 518558 527912 537181 546401 556110 566930
59534 566930 580127 597110 617059 635708 647915 651634 648753 642506 635110 627675 620982 615652 612091
59521 612091 610591 611081 612634 613804 613796 612988 612102 611191 609632 606831 602666 597373 591196 584206 576459 568285
59505 568285 560247 552780 546056 540242 535501 531584 527824 523901 520297 517602 515622 513582 511060 508365
59491 508365 506158 505005 505153 506400 508311 510685 513568 516705 519532 522088 525347 530017 535461 540511
59477 540511 545019 549779 555127 560479 565236 569344 572765 575166 576413 576892 577045 576928 576457 575759 575121 574796
59461 574796 574931 575474 576178 576968 578264 580664 584377 589284 595393 602766 611021 619364 627204 634395 640881
59446 640881 646530 651394 655722 659531 662422 663933 663851 662083 658477 652935 645730 637684 629925 623151 617072
59431F17072o177o433o021n186m665m057k115J097L702M398M233N075P211R525
59417F17659J1325J2818J4143J5123J5872J6765J7954J9515K1672K3830K3693
59406H10369J8832R466j164r536j4211j5484j4029j0653o420j940L008Q126J1119
59393G87483Q990J340q407j5818j9088j9452j8609j6971j4397j1427q922p071
59381F57651n449l765k021j95J560K662K705K252K329L176M112M616M839N035
59367F79507N102M952M735M497M046L332K560J882J382J330J925K813L459M002
59353G25524N069O678Q035Q662R018R768J1005J2435J3790J4810J5313J5448J5456
59340H71011J5193J4421J3405J2539J1458R517P076N200L953K194n25l172m888
$$ plain form
59431 617072 610895 604462 598441 593255 588590 584533 582418 583515 587217 591615 595848 600923 608134 617659
59417 617659 628984 641802 655945 671068 686940 703705 721659 741174 762846 786676 810369
59406 810369 829201 838667 837503 827967 813756 798272 784243 773590 767170 765230 768238 776364 787483
59393 787483 796473 797813 789406 773588 754500 735048 716439 699468 685071 673644 664722 657651
59381 657651 652202 648437 646416 646221 647781 650443 653148 655400 657729 660905 665017 669633 674472 679507
59367 679507 684609 689561 694296 698793 702839 706171 708731 710613 711995 713325 715250 718063 721522 725524
59353 725524 730593 737271 745306 753968 762986 772754 783759 796194 809984 824794 840107 855555 871011
59340 871011 886204 900625 914030 926569 938027 947544 954620 959820 963773 965967 965442 962270 957382
59327I57382o248q086j0087j1527j2473j3263j3510j2732j1435j0570j0242r875
59315H27334r319q973r018r274r582r708r192p887o389n398m877m380l745k931
59301G26661j636K41K084L317M323N968Q257R946R395N592j100q727j4723j7767
59287G31831j8428j7815j6267j3875j1357r426p827n919l816k049n38J173K946
59274F28633M317N461O974Q767J0146J0926J1575J2274J2658J2576J2284J1846
59262G48437J0968R553P790N718L189L69k302m621o624q192r101r390r168q341
59248G28285p001n788n205m824l902k590j700j424j148n09J86P11J295K081K889
59233G01356L619M323M711M301L237K288J852J462O39l67j042j392j880k735l741
$$ plain form
59327 957382 951134 943048 932961 921434 908961 895698 882188 869456 858021 847451 837209 827334
59315 827334 818015 809042 800024 790750 781168 771460 762268 754381 747992 742594 737717 733337 729592 726661
59301 726661 725025 725266 727350 730667 734990 740958 749215 759161 768556 774148 773048 764321 749598 731831
59287 731831 713403 695588 679321 665446 654089 644663 636836 630917 627101 625052 624514 625687 628633
59274 628633 632950 638411 645385 654152 664298 675224 686799 699073 711731 724307 736591 748437
59262 748437 759405 768958 776748 782466 785655 786024 783722 779101 772477 764285 755184 745794 736626 728285
59248 728285 721284 715496 710291 705467 701565 698975 697275 695851 694703 694194 694380 695091 696386 698467 701356
59233 701356 704975 709298 714009 718310 721547 723835 725687 727149 727788 727421 726379 724987 723107 720372 716631
59218G16631m586n229n816o325o428n951n362n306n626n416m395l507l603m159
59204F44922m108l555l546m302m774m071k531j012J31J014J705K176K435K448
59190F26932K145J779J926K858M101M867M952N000N779P173Q167P950O889O040
59176F96558N858N842N453M725L862K905K062J703J709J455Q87Q57J863L093L414
59161G42246K739J764Q88P9o94j591k996m830o225o687o985q096r761j1010j1558
59146F77283j1685j1220r913q517q223q940r306q555p401o820o863o902o423n307
59132E61208l916k935k691k633k068j090k13N79J594K583L087L481M664O665Q572
59117E76887R777J0407J0584J0245R783R799J0079R785Q798P903P353O424M752
$$ plain form
59218 716631 712045 706816 701000 694675 688247 682296 676934 671628 666002 660586 656191 652684 649081 644922
59204 644922 640814 637259 633713 629411 624637 620566 618035 617023 617154 618168 619873 622049 624484 626932
59190 626932 629077 630856 632782 635640 639741 644608 649560 654560 660339 667512 675679 683629 690518 696558
59176 696558 702416 708258 713711 718436 722298 725203 727265 728968 730677 732132 733019 733876 735739 738832 742246
59161 742246 744985 746749 747637 747716 747022 745431 742435 737605 731380 724693 717708 709612 699851 688841 677283
59146 677283 665598 654378 644465 635948 627725 618785 609479 600924 593523 586703 579840 572938 566515 561208
59132 561208 557292 554357 551666 549033 546965 545875 545662 546241 547835 550418 553505 556986 561650 568315 576887
59117 576887 586664 597071 607655 617900 627683 637482 647561 657346 666144 674047 681400 687824 692576
59104F92576L144K396K163J606O00l66j039j600k300l230m243m861m635l709k731
59089F73771k141j846j617j404j279j392j924k710l148k926k595k788l236l339
59075F41426l347m024n226n908n636n094m892m805m545m389m578m809m692m223
59061E75258l522k630j804j539j992k788l455l741l539k998k606k600k452j608
59047E37984n38k71r49j664j713j217m96K98Q01N98k2j97M36J382K034K230K111
59030E40807K100K834M355N663N933N892O826Q518R540R500R505J0144J0658J0505
59016F42780J0360J0774J1038J0171Q145N424K255r56l461m995o028o702o435
59003F72370n091l576k558j553l7J416J957J799J804K236K685K854K759K449K020
$$ plain form
59104 692576 695720 698116 700279 701885 702485 702119 701080 699480 697180 693950 689707 684846 680211 676502 673771
59089 673771 671630 669784 668167 666763 665484 664092 662168 659458 656310 653384 650789 648001 644765 641426
59075 641426 638079 634055 628829 622921 617285 612191 607299 602494 597949 593560 588982 584173 579481 575258
59061 575258 571736 569106 567302 565763 563771 560983 557528 553787 550248 547250 544644 542044 539592 537984
59047 537984 537446 537175 536226 534562 532849 531632 531136 531434 532235 532833 532811 532614 533050 534432 536466 538696 540807
59030 540807 542907 545741 550096 555759 561692 567584 574410 582928 592468 601968 611473 621617 632275 642780
59016 642780 653140 663914 674952 685123 693268 698692 700947 699991 696530 691535 685507 678805 672370
59003 672370 667279 663703 661145 659592 659555 660971 662928 664727 666531 668767 671452 674306 677065 679514 681534
58988F81534J613J164N28J7J82R10J424J432J450J766K050K318L326N341P467
58973G12522Q843R740J0848J2139J3136J3691J3857J3608J3165J3060J3341J3379
58961H61329J2803J1942J0868Q959O027L051R22q48l327o611r810j2201j3710
58948H69394j4596j5251j5979j6540j6298j5131j3721j2664j1823j0815r520p827
58936G09229n663l579k505k543k746k414j746r32L19J829K609K219J480J184J012
58921F97753M72p2j76k34o88j185j324j486j947k036j140J48R15J300J970K909
58905F95179L728M671O232Q232J0183J2062J3805J4663J4125J3051J2742J3247
58893H21920J3629J3554J3507J3599J3389J2989J3273J4721J6601J7698J7446
$$ plain form
58988 681534 683147 684311 684839 684856 685038 685948 687372 688804 690254 692020 694070 696388 699714 705055 712522
58973 712522 721365 731105 741953 754092 767228 780919 794776 808384 821549 834609 847950 861329
58961 861329 874132 886074 896942 905901 911928 914979 915901 915053 911726 905115 895305 883104 869394
58948 869394 854798 839547 823568 807028 790730 775599 761878 749214 737391 726576 717056 709229
58936 709229 703566 699987 697482 694939 692193 689779 688033 687101 687420 689249 691858 694077 695557 696741 697753
58921 697753 698225 698153 697977 697743 697055 695870 694546 693060 691113 689077 687937 688085 689000 690300 692270 695179
58905 695179 698907 703578 709810 718042 728225 740287 754092 768755 782880 795931 808673 821920
58893 821920 835549 849103 862610 876209 889598 902587 915860 930581 947182 964880 982326
58882I82326J6230J4786J3403J1806R852Q011O619N042K470n63k680l725m951
58869A058626o893q542r166r390r622r005p178n666n999p500q418q410q459r035
58855I45343r848j0835j1997j2710j2520j2136j2405j2825j2304j0956r795r119
58843H07893q549q269q801r731j0065r721r543r885j0262j0277r938r213q185
58830F85454p363o913o084m375k731k302k539j872l3J718K556K902L310L766M201
58815F69695M693N012M867M476M135L515K300J133Q81J263J287P50J40o09j971
58800G01567l554m348m228m118m589n290n762n885n643n271n409o163o461n372
58786F29474l637k629k227j184P24K447L487M471N754O876P573Q079Q280P676
$$ plain form
58882 982326 998556 1013342 1026745 1038551 1048403 1056414 1063033 1068075 1070545 1069982 1067302 1063577 1058626
58869 1058626 1051733 1043191 1034025 1024635 1015013 1006008 998830 993164 987165 979665 971247 962837 954378 945343
58855 945343 935495 924660 912663 899953 887433 875297 862892 850067 837763 826807 817012 807893
58843 807893 799344 791075 782274 772543 762478 752757 743214 733329 723067 712790 702852 693639 685454
58830 685454 678091 671178 665094 660719 657988 655686 653147 651275 651242 652960 655516 658418 661728 665494 669695
58815 669695 674388 679400 684267 688743 692878 696393 698693 699826 700707 701970 703257 704007 704147 703538 701567
58800 701567 698013 693665 689437 685319 680730 675440 669678 663793 658150 652879 647470 641307 634846 629474
58786 629474 625837 623208 620981 619797 620521 622968 626455 630926 636680 643556 651129 659208 667488 675164
58772F75164O353M830L031N41k197m211n480o752p982q349p904p654p777p354
58758F24259o132n147n043n137m660l696k441p20J156K262K260J762J154J68q62
58743E99183p06J092L276M456M701M848N126N313N508N941O371O419O152N852
58729F63532N492M879M032L169K533K330K544K823K856K752K686K493K173K336
58715G06630L434M820N488N522N787O334O231M970L109J279m92k351m293o348
58701G40120q465j0232j1424j2560j4113j5491j5793j5332j5235j5652j5564j4411
58689E75848j2782j1273r779q128o561n307m406m006m101m166l806l482l698l879
58675D90474l145j898j307j394r80M38K075L215L955M472M737N088O025P326Q280
$$ plain form
58772 675164 681517 686347 689378 689919 687722 683511 678031 671279 663297 654948 647044 639390 631613 624259
58758 624259 618127 612980 607937 602800 598140 594444 592003 591283 592439 594701 596961 598723 599877 600045 599183
58743 599183 598477 599569 602845 607301 612002 616850 621976 627289 632797 638738 645109 651528 657680 663532
58729 663532 669024 673903 677935 681104 683637 685967 688511 691334 694190 696942 699628 702121 704294 706630
58715 706630 710064 714884 720372 725894 731681 738015 744246 749216 752325 753604 753112 750761 746468 740120
58701 740120 731655 721423 709999 697439 683326 667835 652042 636710 621475 605823 590259 575848
58689 575848 563066 551793 542014 533886 527325 522018 517612 513606 509505 505339 501533 498051 494353 490474
58675 490474 487329 485431 484124 482730 481750 482188 484263 487478 491433 495905 500642 505730 511755 519081 527361
58660E27361Q675Q633P693N335K217l25j901l047l907m302m722n752o727o506
58646E22725n419m778m724m281l434l210l631l521k605j899j746j261j10R41J580
58631D84627K319K997K776J886J553J781J271q7p16J3P57O14M63R88J419J287
58615E03948J514K550L321L193L233M141M769M101L147L248L896L797K976K292
58601E50126J870J440J377K046K836K927K359J525M59o13r20j99Q08J608K646
58586E70295M095N180N563O150P605R206J0090J0512J0933J0948J0156R080Q283
58573F78096P459O308N451N570O496P778R325J0933J2140J3080J4483J6382J8000
58560H11501J9192K0641K2240K2845K2169K1272K0427J8238J3830Q369L451n71
$$ plain form
58660 527361 536036 544669 552362 557697 559914 559589 557688 554641 550734 546432 541710 535958 529231 522725
58646 522725 517306 512528 507804 503523 500089 496879 493248 489727 487122 485223 483477 482216 482106 483047 484627
58631 484627 486946 489943 492719 494605 496158 497939 499210 499123 498407 498420 499177 499791 500254 501242 502661 503948
58615 503948 505462 508012 511333 514526 517759 521900 526669 530770 533917 537165 541061 544858 547834 550126
58601 550126 551996 553436 554813 556859 559695 562622 564981 566506 566965 566352 565432 565233 566041 567649 570295
58586 570295 574390 579570 585133 591283 598888 608094 618184 628696 639629 650577 660733 669813 678096
58573 678096 685555 691863 697314 702884 709380 717158 726483 737416 749556 762636 777119 793501 811501
58560 811501 830693 851334 873574 896419 918588 939860 960287 978525 992355 1000724 1004175 1003604
58548A003604l763n699o407o908p713q154p975q198r465j1004j2128j3317j4952
58535H87921j6447j7526j8694j9706j9333j7574j6194j5953j5235j2749r671p664
58523G01175o571n546m744m391l815k870k703l692m270l364k180k009k111j546
58509F51363j240k209l290k868j482p06o51n35n65j246j865j479n56j4L07P74
58493F33738Q24J73j00P21J632J788K218L923N896O860P497Q875J0225J0396J0234
58478G04900J1189J2760J3507J3601J4117J4772J4393J2883J0812P995M264P03
58466H35896j662l418n352o711o666o163o300o159m325j473P05K111L766N671
58452G99920P184Q529J0058J0935J0275Q618O611L628o57m721p091q400r661j0227
$$ plain form
58548 1003604 999841 994142 987735 980827 973114 964960 956985 948787 939322 928318 916190 902873 887921
58535 887921 871474 853948 835254 815548 796215 778641 762447 746494 731259 718510 708839 701175
58523 701175 694604 689058 684314 679923 676108 673238 670535 666843 662573 659209 657029 655020 652909 651363
58509 651363 650123 647914 644624 641756 640274 639568 638917 638382 637817 636571 634706 633227 632671 632657 632964 633738
58493 633738 634562 634735 634635 635356 636988 638776 640994 644917 650813 657673 665170 674045 684270 694666 704900
58478 704900 716089 728849 742356 755957 770074 784846 799239 812122 822934 830929 835193 835896
58466 835896 834234 830816 825464 818753 812087 805924 799624 793465 789140 787667 788372 790483 794249 799920
58452 799920 807104 815633 825691 836626 846901 855519 862130 865758 865101 860380 853289 844889 835228 825001
58438H25001r391q273p919p200m928k310q61L11K587M890N511N256N948P161P445
58423H23228P319Q061Q864Q178O717O097N728M008J467l91k114m980p853q656
58409H55673q004q049q628p923o163n190m967l857j962r80j090r54l14J76J071
58394G98839L158N141N211M146M006M662M548L780L432K851J006p36n72Q8j427
58379H38133m571o709p633q923r790p809l345Q17L868P167J0513J2215J2538J3295
58365H49766J4315J4048J3126J3463J4491J4262J3610J4872J7067J7001J4772
58354A010793J3555J3921J3127J0351P994P238O594N464N063N319M797L985M867
58341A113068P038Q180Q251R197J0729J0764R899J0855J3441J4691J4152J4401
$$ plain form
58438 825001 815610 807337 799418 792218 787290 784980 784119 784430 787017 791907 797418 802674 808622 815783 823228
58423 823228 830547 838608 847472 855650 862367 868464 874192 878200 879667 879276 877162 872182 864329 855673
58409 855673 847669 839620 830992 823069 816906 811716 806749 802892 800930 799950 798860 797906 797592 797768 798839
58394 798839 801997 807138 812349 816495 820501 825163 829711 833491 836923 839774 840780 840044 839472 839560 838133
58379 838133 833562 826853 819220 810297 800507 792698 789353 790170 794038 801205 811718 823933 836471 849766
58365 849766 864081 878129 891255 904718 919209 933471 947081 961953 979020 996021 1010793
58354 1010793 1024348 1038269 1051396 1061747 1069741 1076979 1083573 1089037 1094100 1099419 1104216 1108201 1113068
58341 1113068 1120106 1128286 1136537 1145734 1156463 1167227 1177126 1187981 1201422 1216113 1230265 1244666
58329A244666J6043J6954J6747J7274J8310J7484J4975J3578J3589J2416R701
58318A411737Q058Q166P858O671O615P901Q513Q386R454J1390J2087J2204J4261
58305A533301J7372J8263J7357J8145K0719K1808K1234K2024K4050K4039K2258
58294A760570K2529K5075K6149K5313K6140K8893K9766K8385K8724L1351L2278
58283B065173L0884L1394L4785L6996L6944L8454M2153M3471M1222M0353M3312
58272B485141M6336M7084M8395N1674N4009N4689N7114O1685O4300O4322O6153
58261C100902P0765P3843P4636P7764Q3852Q7530Q7392Q8583R2614R4507R3111
58250D025499R4098R9244J03207J04510J08917J17976J25408J29187J35718J47403
$$ plain form
58329 1244666 1260709 1277663 1294410 1311684 1329994 1347478 1362453 1376031 1389620 1402036 1411737
58318 1411737 1419795 1427961 1435819 1442490 1449105 1457006 1465519 1473905 1483359 1494749 1506836 1519040 1533301
58305 1533301 1550673 1568936 1586293 1604438 1625157 1646965 1668199 1690223 1714273 1738312 1760570
58294 1760570 1783099 1808174 1834323 1859636 1885776 1914669 1944435 1972820 2001544 2032895 2065173
58283 2065173 2096057 2127451 2162236 2199232 2236176 2274630 2316783 2360254 2401476 2441829 2485141
58272 2485141 2531477 2578561 2626956 2678630 2732639 2787328 2844442 2906127 2970427 3034749 3100902
58261 3100902 3171667 3245510 3320146 3397910 3481762 3569292 3656684 3745267 3837881 3932388 4025499
58250 4025499 4119597 4218841 4322048 4426558 4535475 4653451 4778859 4908046 5043764 5191167
58240E191167J57864J64480J73448J87045J98556K05641K15824K32354K47880
58231F974259K58834K72503K92647L12201L27816L47312L74574M01939M26056
58222I988141M55851M95722N36911N75155O20138O77207P37477P97105Q67954
58213A5751661R57220J055886J160180J284101J437200J611952J808200K047168
58205B7113568K345815K703153L129897L663987M335932N146336O095320P196755
58197F1730763Q438266R770244J1171212J2686102J4366597J6223013J8274936
58190A52661133K0583653K3171113K5962714K8829468L1468773L2983563L1706094
58183C47366511K5977206J5571521K406151j0361574k0134114k6037949k8738101
$$ plain form
58240 5191167 5349031 5513511 5686959 5874004 6072560 6278201 6494025 6726379 6974259
58231 6974259 7233093 7505596 7798243 8110444 8438260 8785572 9160146 9562085 9988141
58222 9988141 10443992 10939714 11476625 12051780 12671918 13349125 14086602 14883707 15751661
58213 15751661 16708881 17764767 18924947 20209048 21646248 23258200 25066400 27113568
58205 27113568 29459383 32162536 35292433 38956420 43292352 48438688 54534008 61730763
58197 61730763 70169029 79939273 91110485 103796587 118163184 134386197 152661133
58190 152661133 173244786 196415899 222378613 251208081 282676854 315660417 347366511
58183 347366511 373343717 388915238 391321389 380959815 360825701 334787752 306049651
58176C06049651k9465682k9179045k8278452k6779287k4659373k2086001j9369168
58169A26232643j6765040j4382724j2253597j0403285q834237p506013o376505
58162D9711242n432473m659067m015480l464899k999578k615711k290701k005201
58154B2228132j762686j567160j402945j254529j126200j024386r38646q56758
58146A2294822p82059p20081o63323o04256n49244n05306m66100m24124l84379
58137G195950l53379l26592k98938k76121k63509k54364k40652k25571k14616
58128D742208k04153j89613j75608j67324j60453j49643j38570j32052j26514
58119C298278j17575j09126j05524j02528r5161q7156q3591q1302p5504o9115
$$ plain form
58176 306049651 276583969 247404924 219126472 192347185 167687812 145601811 126232643
58169 126232643 109467603 95084879 82831282 72427997 63593760 56087747 49711242
58162 49711242 44278769 39619702 35604222 32139323 29139745 26524034 24233333 22228132
58154 22228132 20465446 18898286 17495341 16240812 15114612 14090226 13151580 12294822
58146 12294822 11512763 10792682 10129359 9525103 8975859 8470553 8004453 7580329 7195950
58137 7195950 6842571 6515979 6217041 5940920 5677411 5423047 5182395 4956824 4742208
58128 4742208 4538055 4348442 4172834 4005510 3845057 3695414 3556844 3424792 3298278
58119 3298278 3180703 3071577 2966053 2863525 2768364 2681208 2597617 2516315 2440811 2371696
58109B371696o6657o5310o0756n5834n4892n5256n2480m8701m7840m7805m5123
58098A771042m2196m2504m3518m1520l8610l7961l7171l3263k9344k9218l0156
58087A365581k7949k4511k3605k3657k1735k0121k1853k4067k2822k0479k1284
58076A113498k3450k2742k0285j9820k0447j8996j6668j6605j7591j6504j4388
58065I06002j4034j4163j2064r337r069r858q517o233o234p799q246q464j0796
58052G81188j3718j4192j3098j2993j2860j0500p771p828r337q884p110o927p722
58039F48248o898n297n584o943o705n689o544q374q266o787o792q098q390q055
58025E49826r093j0566j0093q646q863r897q890o446n604o314n911m205l271k964
$$ plain form
58109 2371696 2305039 2239729 2178973 2123139 2068247 2012991 1960511 1911810 1863970 1816165 1771042
58098 1771042 1728846 1686342 1642824 1601304 1562694 1524733 1487562 1454299 1424955 1395737 1365581
58087 1365581 1337632 1313121 1289516 1265859 1244124 1224003 1202150 1178083 1155261 1134782 1113498
58076 1113498 1090048 1067306 1047021 1027201 1006754 987758 971090 954485 936894 920390 906002
58065 906002 891968 877805 865741 856404 847335 837477 828960 822727 816493 808694 800448 791984 781188
58052 781188 767470 753278 740180 727187 714327 703827 696056 688228 678891 670007 662897 655970 648248
58039 648248 641350 636053 630469 623526 616821 611132 604588 596214 587948 581161 574369 566271 557881 549826
58025 549826 540733 530167 520074 511428 502565 492668 483778 477332 471728 465414 459503 455298 452027 449063
58011D49063j419N90N08j308k109j426r84p15Q59K882L013J495N11K68m78j109
57995D49641m06Q5j884m963o244o325p814j0018r965p847o546o434n512m128m504
57980C67136n914n393l213k619m008m345k730j622j916j553P4Q88L13M15J733
57965C37246K031M76p41j88Q32J172J421J657P83r44j774j490j658k456k443j765
57949C32159k245l771m059k593j475j628j524l09R55J954L704N792O335N464N578
57934C44337P222Q048O853N429N164M985L920K812K143Q86j174k594k924l661
57920C81446n425o765o833o787p325p296n961m372l318k035q9J526K194K577K892
57905C34429K322R14O2L14O45M79M69P08L56m84o63j74k25p69m07P58Q85l97j167
$$ plain form
58011 449063 447644 448234 448742 447434 445325 443899 442915 442200 443059 445941 448954 450449 450960 451228 450750 449641
57995 449641 449235 449320 447436 442473 436229 429904 422090 412072 402107 394260 387714 381280 375768 371640 367136
57980 367136 361222 355829 352616 349997 345989 341644 338914 337292 335376 333823 333897 334785 335098 335513 337246
57965 337246 339277 339753 339012 338824 339656 340828 342249 343906 344689 343745 341971 340481 338823 336367 333924 332159
57949 332159 329914 326143 322084 319491 318016 316388 314864 314555 315510 317464 321168 326960 333295 338759 344337
57934 344337 351559 359607 366460 371889 377053 382038 385958 388770 390913 391799 390625 388031 385107 381446
57920 381446 376021 369256 362423 355636 348311 341015 335054 330682 327364 325329 325240 326766 328960 331537 334429
57905 334429 336751 337665 337727 338041 338686 339165 339634 340342 340698 340214 339551 339377 339152 338383 337976 338734 339619 339222 338055
57886C38055m85M9q57k264k988l321l592l180k066j469j905k436k613l211m234
57871C03483m345l148k047j959k007j387o14j27N07J283J446J094J295K156K711
57856B98341L019M162N814O249N300M831N561N912M898L649L091K481J334M83
57842C55125J36q15k536l517l196l106m214n317n249m559l923l015k041k152l176
57827C08445l235j808q37j526k345j802q08o11n50K96J099P96j9l53m56p80r10
57810B94596q52j704l687n306n713o051p071p469o234m633m084l798k471o93K25
57795B35055M12O68P91L95J06M12O28L99Q23K532M176M409M032M444N368N774
57779B70424N852O278O702O532O267O442O293M982L159J927J256O34K09M5n64
$$ plain form
57886 338055 337570 337619 336762 334498 331510 328189 324597 321417 319351 317882 315977 313541 310928 307717 303483
57871 303483 299138 295990 293943 291984 289977 288590 287976 287849 288356 289639 291085 292179 293474 295630 298341
57856 298341 301360 305522 311336 317585 322885 327716 333277 339189 344087 347736 350827 353308 354642 355125
57842 355125 355261 354446 351910 348393 345197 342091 337877 332560 327311 322752 318829 315814 313773 311621 308445
57827 308445 305210 303402 302565 301039 298694 296892 296084 295473 294923 295219 296318 297114 297095 296742 296286 295506 294596
57810 294596 293744 292040 288353 283047 277334 271283 264212 256743 250509 245876 241792 237994 235523 234830 235055
57795 235055 235467 236135 236926 237321 237427 237839 238467 238866 239689 242221 246397 250806 254838 259282 264650 270424
57779 270424 276276 282554 289256 295788 302055 308497 314790 319772 322931 324858 326114 326748 326957 327002 326438
57764C26438j861k937l353m033n354o018n261m486n013n759n039l244j855j045
57750B71180k63J5q31j826j477J5J322J977K285K125J421R62J246J350M25o15
57734B79311m66N00J041J085J315J637J615J683K365L098L165K999L162L078K171
57719C07759J194Q73M44q73k115k140j810k549l725l642k461j942k728l863m710
57704B77712n450n919n640m904m387m001l377k923l036k920j739k92L9n51q23
57689B31789o09o76r60o98k2K45K10Q00K268M072N993Q133J0241J2272J4985J8703
57673C06746K2285K4749K7251L1649L7823M4131N0053N6369O2712O6475O4111
57662G94354N2654L1081K264k6772m8733o0839o5055o4370o0461n4357m7171l9662
$$ plain form
57764 326438 324577 321640 318287 314254 308900 302882 297621 293135 288122 282363 277324 274080 272225 271180
57750 271180 270917 270932 270101 268275 266798 266813 268135 270112 272397 274522 275943 276905 278151 279501 279926 279311
57734 279311 278845 279345 280386 281471 282786 284423 286038 287721 290086 293184 296349 299348 302510 305588 307759
57719 307759 308953 309826 310270 309397 307282 305142 303332 300783 297058 293416 290955 289013 286285 282422 277712
57704 277712 272262 266343 260703 255799 251412 247411 244034 241111 238075 235155 233416 233124 233163 232612 231789
57689 231789 231180 230504 229544 228846 228824 229069 229279 230079 232347 236419 242412 250545 260786 273058 288043 306746
57673 306746 329031 353780 381031 412680 450503 494634 544687 601056 663768 730243 794354
57662 794354 847008 878089 880353 853581 804848 744009 678954 614584 554123 499766 452595 412933
57650D12933l2381k6199k1662j8143j4797j1911j0016q414o170m027l471m226
57638B51516m457l403k056j329j113j153j343j201l01P65J093P42K24p23k330
57623B34931l532l201k162k082k785k699j610q55q47n84J25J14r88j943j840j259
57607B08783r58q82r59j518k343k518j691o03o6l20j301k581l124k352j225j132
57591A85210j943k436k280k117k030j592j207j658k389k095r28l29n49l20P23
57576A64060J244L96r68j882k475k948k814j925j059q39j041j391j977k596k734
57561A41051k468k315k155j463n03n3N7O02J218O90q59j713r67L91J151J202P92
57544A34658k0o75l05Q68J550J246Q21Q80R64P83Q27J246J411J056O69L55m14
$$ plain form
57650 412933 380552 354353 332691 314548 299751 287840 277824 269410 263240 259213 255742 251516
57638 251516 247059 243656 241600 240271 239158 238005 236662 235461 235160 235925 237018 237760 237984 237261 234931
57623 234931 231399 228198 226036 223954 221169 218470 216860 216005 215158 214574 214699 214813 213825 211882 210042 208783
57607 208783 207825 206943 205984 204466 202123 199605 197914 197311 197245 196925 195624 193043 189919 187567 186342 185210
57591 185210 183267 180831 178551 176434 174404 172812 171605 169947 167558 165463 164535 164206 163657 163337 164060
57576 164060 165304 165700 164732 162850 160375 157427 154613 152688 151629 150790 149749 148358 146381 143785 141051
57561 141051 138583 136268 134113 132650 132147 132094 132151 132753 133971 134661 133802 132089 131122 131513 132664 133866 134658
57544 134658 134638 133963 133658 134526 136076 137322 138143 139023 139987 140770 141597 142843 144254 145310 145979 146334 145920
57527A45920j495j862j128j05N75J167J760J798J090K28l71p67p53K6J054J339
57511A48476R00O10N99K86r6L21J263J536J114J108J506J009m74j332r42p22j655
57494A53507k740k895k543k254j616n52j00p33j371j121n28k08K34R39J048L04
57478A39371j42M18J106J095Q28O33k02j703k425j697r46j376k046j797j428k015
57462A27674k691k102q82n44r27p71q8O3m00o12m45m88o98m45L05J118J951K766
57444A22784K864J833N96L05P26R27R05J260J814J918J640J449J128K45p34r75
57428A38685n67k07K2N15J157J527J679J784J443L43q04r28N3J306K061J988J187
57411A51244M11N15J166J054k9n62L72J539J506P86N54M91l27j336j234j74N45
$$ plain form
57527 145920 144425 142563 141435 141330 141905 143072 144832 146630 147720 147948 147577 146810 146057 146083 147137 148476
57511 148476 149376 149986 150585 150871 150775 151096 152359 153895 155009 156117 157623 158632 158158 156826 155884 155162 153507
57494 153507 150767 147872 145329 143075 141459 140907 140807 140074 138703 137582 137054 136846 137080 138019 139067 139371
57478 139371 139229 139647 140753 141848 142676 143309 143107 141404 138979 137282 136336 134960 132914 131117 129689 127674
57462 127674 124983 122881 121999 121455 120528 119757 119669 119732 119332 118720 118275 117787 117089 116644 116949 118067 120018 122784
57444 122784 125648 127481 128077 128382 129108 130035 130940 132200 134014 135932 137572 139021 140149 140394 139660 138685
57428 138685 138118 137911 137933 138448 139605 141132 142811 144595 146038 146381 145577 144649 144702 146008 148069 150057 151244
57411 151244 151655 152170 153336 154390 154361 153799 154171 155710 157216 158002 158556 159047 158720 157384 156150 155976 156521
57394A56521O16Q93J753K758L640M219L854K388J168J582K957L514L029K902L718
57379A95512M513M519M065L525K773J961J633J750J595Q76Q5l25l71j69J17J76
57363B22235J5K23J038J721J641J361J623K010J792J410J687K217K090J697K155
57348B44915L255L688L220K974L424L804L633L380L294K942K203J587J280R84
57334B84583Q12J231K025K428K402K630L235L614L625L759M033L948L600L665
57320C25590M116M174L673L267L251L299L485M194M918M630L624L459M680N983
57306C82343O291O210O698P496P855P853P983Q190Q123P842P690P836Q382R332
57292D90124J0181J0141R159Q050P344O741N991N534N765O393P003P662Q456Q952
$$ plain form
57394 156521 157137 158030 159783 162541 166181 170400 174254 176642 177810 179392 182349 185863 188892 191794 195512
57379 195512 200025 204544 208609 212134 214907 216868 218501 220251 221846 222722 222807 222482 222111 221942 222059 222235
57363 222235 222250 222473 223511 225232 226873 228234 229857 231867 233659 235069 236756 238973 241063 242760 244915
57348 244915 248170 251858 255078 258052 261476 265280 268913 272293 275587 278529 280732 282319 283599 284583
57334 284583 285395 286626 288651 291079 293481 296111 299346 302960 306585 310344 314377 318325 321925 325590
57320 325590 329706 333880 337553 340820 344071 347370 350855 355049 359967 364597 368221 371680 376360 382343
57306 382343 388634 394844 401542 409038 416893 424746 432729 440919 449042 456884 464574 472410 480792 490124
57292 490124 500305 510446 519605 527655 534999 541740 547731 553265 559030 565423 572426 580088 588544 597496
57278E97496Q665P784P008O881P498Q559R617J0469J1317J2343J3384J4413J5954
57265G31388J8303K0660K1894K1975K1861K2100K2398K2457K2332K2018K1553
57254I68939K1428K1994K2508K1880K0245J8757J7864J6977J5960J5562J6089
57243A178203J6826J7391J8526K1012K4649K8778L3020L7013M0293M2872M5233
57232A503816M7438M8957M9632M9867M9652M8415M6271M4366M3370M2599M1268
57221B015651L9684L8486L7573L6646L6133L6566L7592L8435L9000L9727M0621
57210B436114M1230M1465M1792M2508M3315M3752M3847M4201M5383M7162M8581
57199B919350M9062M9158M9813N1099N2269N2918N3263N3383N3029N2258N1486
$$ plain form
57278 597496 606161 613945 620953 627834 635332 643891 653508 663977 675294 687637 701021 715434 731388
57265 731388 749691 770351 792245 814220 836081 858181 880579 903036 925368 947386 968939
57254 968939 990367 1012361 1034869 1056749 1076994 1095751 1113615 1130592 1146552 1162114 1178203
57243 1178203 1195029 1212420 1230946 1251958 1276607 1305385 1338405 1375418 1415711 1458583 1503816
57232 1503816 1551254 1600211 1649843 1699710 1749362 1797777 1844048 1888414 1931784 1974383 2015651
57221 2015651 2055335 2093821 2131394 2168040 2204173 2240739 2278331 2316766 2355766 2395493 2436114
57210 2436114 2477344 2518809 2560601 2603109 2646424 2690176 2734023 2778224 2823607 2870769 2919350
57199 2919350 2968412 3017570 3067383 3118482 3170751 3223669 3276932 3330315 3383344 3435602 3487088
57188C487088N0685M9285M7134M4843M2864M0893L8538L6019L3785L1894L0146
57177C933174K8566K7494K7394K8467L0215L1570L1900L1673L1603L1564L1125
57166D264745L0722L1227L2423L3073L2647L1905L1537L1245L0489K9193K7356
57155D606562K4828K1845J9086J6867J4961J3423J2778J3110J3722J4037J4073
57144D785292J3838J2996J1368R083O012J918k640o394q724j0196j1509j2718
57132D788326j3626j4189j4288j3910j3583j3759j3785j2676j0959j0408j1663
57121D645480j3541j5090j6790j8825j9676j7658j2854o443J093R928J9690K9376
57109D584690L8257M6233N3934O3058P6051R4608J18811J48240J83404K25632
$$ plain form
57188 3487088 3537773 3587058 3634192 3679035 3721899 3762792 3801330 3837349 3871134 3903028 3933174
57177 3933174 3961740 3989234 4016628 4045095 4075310 4106880 4138780 4170453 4202056 4233620 4264745
57166 4264745 4295467 4326694 4359117 4392190 4424837 4456742 4488279 4519524 4550013 4579206 4606562
57155 4606562 4631390 4653235 4672321 4689188 4704149 4717572 4730350 4743460 4757182 4771219 4785292
57144 4785292 4799130 4812126 4823494 4832577 4838589 4840507 4837867 4831473 4822749 4812553 4801044 4788326
57132 4788326 4774700 4760511 4746223 4732313 4718730 4704971 4691186 4678510 4667551 4657143 4645480
57121 4645480 4631939 4616849 4600059 4581234 4561558 4543900 4531046 4524603 4525696 4535624 4555314 4584690
57109 4584690 4622947 4669180 4723114 4786172 4862223 4956831 5075642 5223882 5407286 5632918
57099E632918K76291L36692M07966M90039N80779O76444P72402Q63260R43522
57090A0980313J009242J058799J091084J101953J081245J012798Q81036O84884
57082A8901354M50477K28018O8510m336n316K4253L8844N289r1369k48217m46765
57071A8920742o57493q48416r95556j089497j133726j137316j108928j055869
57063A0893941r85572r05629q22342p39978o61257n87966n21256m61762m09463
57054D798716l63600l23281k88275k58603k33452k11335j91446j73884j58394
57045B596446j44016j30414j18454j08761j00705r3429q6904q1154p5449o9186
57035A587974o2810n6967n1381m5400l9044l2726k6445k0027j3531o723J102R859
$$ plain form
57099 5632918 5909209 6245901 6653867 7143906 7724685 8401129 9173531 10036791 10980313
57090 10980313 11989555 13048354 14139438 15241391 16322636 17335434 18216470 18901354
57082 18901354 19351831 19579849 19648359 19644023 19638707 19662960 19701804 19707093 19615724 19367507 18920742
57071 18920742 18263249 17414833 16419277 15329780 14196054 13058738 11949810 10893941
57063 10893941 9908369 9002740 8180398 7440420 6779163 6191197 5669941 5208179 4798716
57054 4798716 4435116 4111835 3823560 3564957 3331505 3120170 2928724 2754840 2596446
57045 2596446 2452430 2322016 2203562 2094801 1994096 1900667 1813763 1732609 1657160 1587974
57035 1587974 1525164 1468197 1416816 1371416 1332372 1299646 1273201 1253174 1239643 1232920 1234022 1243881
57023A243881J7611K1422J9092R937m925k2423l8636n1202o0204o6269o8840o7233
57011I32211o2325n5931m9142m2354l6234l1370k7384k3564k0055j7411j5398
57000E51043j3251j0913r010p820p109o729o583o219n219l827k581j620q45k92
56986D69025J78J019K303L477M281M978N138L355q52n789r406j1503j3007j3955
56972D39242j3665j2242j0424q306n608k872j039n2R56K294L650N133P172R579
56958D13818J1778J3665J5204J5457J3227Q633L015k518p531j1625j4480j6326
56946D42317j7366j6990j4661j1219q174n936l828j537P01L068N975R037J1480
56933C92867J3529J6116J9217K1571K2019K0042J5147P180k538j1586j8229k2232
$$ plain form
57023 1243881 1261492 1282914 1302006 1311943 1307018 1284595 1245959 1194757 1134553 1068284 999444 932211
57011 932211 869886 813955 764813 722459 686225 654855 627471 603907 583852 566441 551043
57000 551043 537792 526879 517869 510049 502940 496211 489628 483409 478190 474363 471782 470162 469317 469025
56986 469025 469203 470222 472525 476002 480283 485261 490399 493754 492902 487113 477707 466204 453197 439242
56972 439242 425577 413335 402911 394605 388997 386125 385086 385034 385990 388284 391934 397067 404239 413818
56958 413818 425596 439261 454465 469922 483149 491782 494797 492279 484748 473123 458643 442317
56946 442317 424951 407961 393300 382081 373907 367971 364143 362606 363307 366375 372350 381387 392867
56933 392867 406396 422512 441729 463300 485319 505361 520508 527688 525150 513564 495335 473103
56921D73103k3957k3814k2558k1045j9473j7620j5674j3988j2318j0273q343p314
56909B76726o891o130m962m093l487k355p28L72M84L06M96R88J681K693L821M680
56893B63601N447O506P568Q213R097J1261J4326J6871J8504J9861K0386J8002
56881D19643J1811L684l627q870j2086j3365j2856j1215r090o550l482j02L329
56868C57224O734R966J2811J5449J8366K1771K5601K9994L4945L9535M2123M1246
56856F55765L5852K5378J0813m686j7532k6125l0746l1862k9917k6233k2173j7493
56844E21041j1180l831K797Q527J4944K2536K9815L5961M2218M9728N7752O4881
56832H35189O9988P0763O3364M5673K0170p569l2398n1031o1796o4970o2828n7903
$$ plain form
56921 473103 449146 425332 402774 381729 362256 344636 328962 314974 302656 292383 284040 276726
56909 276726 269835 263705 258743 254650 251163 248808 248080 248452 248936 249242 249738 250726 252407 255100 258921 263601
56893 263601 269048 275554 283122 291335 300432 311693 326019 342890 361394 381255 401641 419643
56881 419643 431454 435138 431511 422641 410555 397190 384334 373119 364029 357479 353997 353895 357224
56868 357224 363958 373924 386735 402184 420550 442321 467922 497916 532861 572396 614519 655765
56856 655765 691617 716995 727808 723122 705590 679465 648719 616857 586940 560707 538534 521041
56844 521041 509861 506030 508827 517354 532298 554834 584649 620610 662828 712556 770308 835189
56832 835189 905177 975940 1039304 1084977 1105147 1097578 1065180 1014149 952353 887383 824555 766652
56820G66652n1378m3648l5491k7601j9863j2057m621K188R013J6362K3624L0122
56808F53302L6273M2518M7662M9200M4940L3755J5903o046k7303m3395n2815n6699
56796G37295n6476n2907m6893l9900l3165k7061k1282j5455r654m538n81K851
56784D32234O966J1976J6766K0481K3301K5058K4094J8599Q738l297j4969k4546
56772E45401l1182l4734l5563l4196l1276k7738k4434k1485j8605j6040j4360
56761B55788j3297j1899j0016q514p681o718n194l791k974k278j551j602k603
56748A77670l241k582j650j840k745k937k150j256o46m0M47L56j23k69J01N49
56732A59644Q14R32P58J29o19r31p38l99j85j75l24l53Q3P83J130J065J227J826
$$ plain form
56820 766652 715274 671626 636135 608534 588671 576614 571993 574181 583194 599556 623180 653302
56808 653302 689575 732093 779755 828955 873895 907650 923553 917507 890204 846809 793994 737295
56796 737295 680819 627912 581019 541119 507954 480893 459611 444156 434502 429964 429383 432234
56784 432234 439200 451176 467942 488423 511724 536782 560876 579475 588213 584916 569947 545401
56772 545401 514219 479485 443922 409726 378450 350712 326278 304793 286188 270148 255788
56761 255788 242491 230592 220576 212062 204381 197663 192469 188678 185704 183426 181875 180273 177670
56748 177670 174429 171847 170197 168357 165612 162675 160525 159269 158623 158583 159030 159386 159263 158994 159095 159644
56732 159644 160458 161390 162148 162277 161658 160727 159989 159590 159405 159230 158906 158553 158636 159419 160549 161614 162841 164667
56714A64667K152J675Q54L81L21M76Q32J230J346J373J801K244J668K10o17j60
56698A80453L06k89j096r43l15l18o63l05O30J052N99j58p38r43m91N34J321J313
56680A79949R98Q85N65k64p90k84N07M79m4o2L31L17J8K20P69P16o6p49q82p36
56660A81877m36J57Q53J313J652K048K129J613J041R38Q59K67k86o0M41K60l20
56643A94346k79L19M87N2j82J9K7l30l28M44J422J799J304L09m12k64L06J18j045
56624A98112j883j438n54m38q22q13o28r22j242q00j71m83j375j577j099j058
56608A82809j557j608j092r58j354j261k95O86J026R90Q05L15j67L4P93J292J320
56591A81778J351J372R58M45N87J087Q85P4q5P46J322P21m29j072r41l30L59N64
$$ plain form
56714 164667 166819 168494 169348 169729 170050 170526 171358 172588 173934 175307 177108 179352 181020 181230 180613 180453
56698 180453 180759 180470 179374 178431 178116 177798 177135 176830 177460 178512 179111 178953 178215 177272 176781 177315 178636 179949
56680 179949 180947 181832 182397 182133 181343 181059 181566 182045 182001 181939 182270 182587 182605 182825 183594 184310 184244 183495 182613 181877
56660 181877 181441 181598 182451 183764 185416 187464 189593 191206 192247 193185 194044 194311 194025 193965 194406 194666 194346
56643 194346 194067 194386 194873 194925 194743 194762 194789 194459 194131 194575 195997 197796 199100 199409 198997 198733 199039 199157 198112
56624 198112 196229 194791 194237 193799 192977 192164 191536 190614 189372 188572 188401 187918 186543 184966 183867 182809
56608 182809 181252 179644 178552 177594 176240 174979 174684 175370 176396 177386 178191 178506 178339 178373 179166 180458 181778
56591 181778 183129 184501 185459 185904 186491 187578 188463 188537 188452 189198 190520 191241 190812 189740 188799 188469 188828 189392
56573A89392Q5k74L93J611K229K432L472N317O279N450M023L516M054N088O526
56558B39593Q354J0100J1330J1890J1305Q894N069J532l76q72r48j205j717k333
56544C00616k675k514k248k467l005l257l214l344l566l401l082l325m015m240
56530B56263l716l057k582j999j349j087j143j004q05j177j955k285k044j900
56516B30160j948j621j043j006j429j310m77Q9j6q5J77O7o82j266j193r81r79
56499B16457p30n5M56N35O30Q12M75l65p97n08l21p24j079q38l52J9M54Q45O23
56480B15537j19m83j70J35Q0J07K55j1m29O4J395K026J250L05L18O55L68j23O0
56461B21220O92R76P88M87K37J76N22R36O64k10p31o12o57j107j010J11J232J361
$$ plain form
56573 189392 189477 189203 189596 191207 193436 195868 199340 204657 210936 216386 220409 223925 227979 233067 239593
56558 239593 247947 258047 269377 281267 292572 301466 306535 308067 307691 306819 305871 304666 302949 300616
56544 300616 297941 295427 293179 290712 287707 284450 281236 277892 274326 270925 267843 264518 260503 256263
56530 256263 252547 249490 246908 244909 243560 242473 241330 240326 239521 238344 236389 234104 232060 230160
56516 230160 228212 226591 225548 224542 223113 221803 221326 221415 221399 221314 221491 221558 220876 219610 218417 217436 216457
56499 216457 215727 215672 216128 216663 217293 218105 218580 218215 217418 216910 216589 215865 214786 213948 213596 213615 214069 214914 215537
56480 215537 215418 214935 214765 214900 214980 215087 215342 215331 214902 214966 216361 218387 219637 219942 220260 220915 221283 221160 221220
56461 221220 221912 222888 223676 224163 224400 224576 225098 226034 226698 226488 225757 225145 224488 223381 222371 222482 223714 225075
56443B25075Q99O64O33N21N54Q15P65J47m27m61j81K89J271K428K531J101p06
56426B35918j522j257o44k68m47j084j272j32J657K405J704Q23O01N57M11O73
56410B38123J189Q04o93j976k164j834j431n52N15N15n87j102k92M50J86R9J192
56393B32442K389K506K152K040J354l53j447n38J113J564J191J481K172J935J020
56378B51021Q34J484J840J605J426J326P94J67K46Q32J052Q32P80R18Q24O43Q72
56361B67496J416J806J972K053J981J800J740J427J81j477j947r20rk06m45K42
56345B77110R87R67J158K451L642L318K301K205K747K583J840J680K125K261J976
56330C09351J810J755J707K320L903N322N460M826M337L629K195R84J032J568
$$ plain form
56443 225075 225974 226638 227271 227792 228346 229161 229926 230073 229646 229185 229004 229293 230564 232992 235523 236624 235918
56426 235918 234396 233139 232495 232227 231780 230696 229424 229292 230949 233354 235058 235881 236482 237039 237450 238123
56410 238123 239312 240116 239423 237447 235283 233449 232018 231466 231981 232496 231909 230807 230515 230965 231151 231250 232442
56393 232442 234831 237337 239489 241529 242883 242530 241083 240545 241658 243222 244413 245894 248066 250001 251021
56378 251021 251855 253339 255179 256784 258210 259536 260330 260497 260743 261575 262627 263459 264239 265157 265981 266624 267496
56361 267496 268912 270718 272690 274743 276724 278524 280264 281691 281872 280395 278448 277528 277519 277313 276868 277110
56345 277110 278097 279064 280222 282673 286315 289633 291934 294139 296886 299469 301309 302989 305114 307375 309351
56330 309351 311161 312916 314623 316943 320846 326168 331628 336454 340791 344420 346615 347599 348631 350199
56316C50199J282M87K50M27M05O68J787K827K699K094K240K768K747K684L462
56301C77026M404M527M608N785P139P007N829N304N600N715N784O552P307O821
56287D59408N743N660O435O852P211Q624J0361J0629R674R472J0578J1807J2782
56274E75236J4241J5937J6719J6764J7426J8923K0408K2020K4599K7539K9428
56263G99240L0678L3088L6866M0585M4062M8764N5131O1916O8488P5635Q3756
56252A378209R2404J01741J12468J24096J35254J45716J56223J66296J74332J79730
56242B766469J82990J83757J80885J74275J64634J51555J33972J12230Q7603O0146
56232D198516K9371l176l4462o2959q8824j11433j29393j42941j53711j61980
$$ plain form
56316 350199 351481 351968 352218 352645 353050 353718 355505 358332 361031 363125 365365 368133 370880 373564 377026
56301 377026 381430 385957 390565 396350 403489 410496 416325 421629 427229 432944 438728 445280 452587 459408
56287 459408 465151 470811 477246 484098 491309 499933 510294 520923 530597 540069 550647 562454 575236
56274 575236 589477 605414 622133 638897 656323 675246 695654 717674 742273 769812 799240
56263 799240 829918 863006 899872 940457 984519 1033283 1088414 1150330 1218818 1294453 1378209
56252 1378209 1470613 1572354 1684822 1808918 1944172 2089888 2246111 2412407 2586739 2766469
56242 2766469 2949459 3133216 3314101 3488376 3653010 3804565 3938537 4050767 4138370 4198516
56232 4198516 4227887 4224711 4190249 4127290 4038466 3927033 3797640 3654699 3500988 3339008
56222C339008j66551j67416j66071j63117j57955j50953j43509j35843j27093
56213A960500j17610j08892j01211r3638q6207p9714p3644o6907o0267n5364n1613
56202A065433m6968m1499l7160l4209l1001k7341k4701k3028k0642j7577j5741
56191G45566j5391j4679j3065j1833j0894q603n365l795m434m798l681k877l486
56178F42665l941l099k131j904j415k63K60j58J03J558K431J856J460K464L814
56163F43700M471M991N709N918N937P311R976J1889J2384J3145J4950J6449J7142
56150G73972J8547K1255K3850K5856K8742L2884L6614L9480M3359M9066N4941
56139A148566N9948O4902O9423P1076O9071O5524O1703N6365M9458M3884M1631
$$ plain form
56222 3339008 3172457 3005041 2838970 2675853 2517898 2366945 2223436 2087593 1960500
56213 1960500 1842890 1733998 1632787 1539149 1452942 1373228 1299584 1232677 1172410 1117046 1065433
56202 1065433 1018465 976966 939806 905597 874596 847255 822554 799526 778884 761307 745566
56191 745566 730175 715496 702431 690598 679704 671101 665736 661941 657507 652709 649028 646151 642665
56178 642665 638724 635625 633494 631590 630175 629912 630172 630014 630117 631675 634106 635962 637422 639886 643700
56163 643700 648171 653162 658871 664789 670726 678037 688013 699902 712286 725431 740381 756830 773972
56150 773972 792519 813774 837624 863480 892222 925106 961720 1001200 1044559 1093625 1148566
56139 1148566 1208514 1273416 1342839 1413915 1482986 1548510 1610213 1666578 1716036 1759920 1801551
56128A801551M1135M0209L8487L5417K9140J9479R216O66o328j1950j5453j8068
56116A963501k3230l2096m2061n1202o0466o9792p6109p7461p5615p2360o6827
56105A316282n8728n0509m3901l7599l0690k4838k0950j7179j2614r217p832o014
56093I96211k420N29R95R71K409L801L640L613N281O999P144P126Q289R231Q936
56078A062755R155J0792J1605J0336R501J1077J3083J3468J3691J5307J6671J6304
56066A213745J5945J7142J8358J8415J9008K0923K1733K0339J9587K1293K2938
56055A429426K2608K2580K4520K5729K4038K1931K1854K1938K0340J9306K0823
56044A675093K2699K2991K3769K6481K8436K8034K8444L1792L4816L4866L4861
$$ plain form
56128 1801551 1842686 1882895 1921382 1956799 1985939 2005418 2014634 2015300 2008972 1997022 1981569 1963501
56116 1963501 1940271 1908175 1866114 1814912 1754446 1684654 1608545 1531084 1455469 1383109 1316282
56105 1316282 1257554 1207045 1163144 1125545 1094855 1070017 1049067 1031888 1019274 1010057 1002225 996211
56093 996211 993791 994320 995315 996286 998695 1002496 1006136 1009749 1015030 1022029 1029173 1036299 1044588 1053819 1062755
56078 1062755 1071910 1082702 1094307 1104643 1114144 1125221 1138304 1151772 1165463 1180770 1197441 1213745
56066 1213745 1229690 1246832 1265190 1283605 1302613 1323536 1345269 1365608 1385195 1406488 1429426
56055 1429426 1452034 1474614 1499134 1524863 1548901 1570832 1592686 1614624 1634964 1654270 1675093
56044 1675093 1697792 1720783 1744552 1771033 1799469 1827503 1855947 1887739 1922555 1957421 1992282
56033A992282L7582M0419M0821M1408M4533M7350M7572M8467N2532N6064N5822
56022B504852N5162N7618O0493O1056O2701O8220P3370P4286P4862P9454Q4672
56011C256746Q6180Q7192R2101R8043J01086J04350J11475J18609J21742J25276
56001D302800J34108J44077J49831J55291J66090J78674J87383J95469K08162
55992E821885K21872K31546K41652K58242K77249K92582L08362L30913L56422
55983H340725L79326M04659M38763M76442N11316N49640N99117O54073P07553
55974A3061614P67510Q43992R31676J023513J129726J263371J420018J593681
55966B2035101J799878K059843K376741K753625L219599L809335M531396N384127
$$ plain form
56033 1992282 2029864 2070283 2111104 2152512 2197045 2244395 2291967 2340434 2392966 2449030 2504852
56022 2504852 2560014 2617632 2678125 2739181 2801882 2870102 2943472 3017758 3092620 3172074 3256746
56011 3256746 3342926 3430118 3522219 3620262 3721348 3825698 3937173 4055782 4177524 4302800
56001 4302800 4436908 4580985 4730816 4886107 5052197 5230871 5418254 5613723 5821885
55992 5821885 6043757 6275303 6516955 6775197 7052446 7345028 7653390 7984303 8340725
55983 8340725 8720051 9124710 9563473 10039915 10551231 11100871 11699988 12354061 13061614
55974 13061614 13829124 14673116 15604792 16628305 17758031 19021402 20441420 22035101
55966 22035101 23834979 25894822 28271563 31025188 34244787 38054122 42585518 47969645
55958D7969645O379816P516959Q753515J0053990J1443696J2972578J4655993
55951A19746192J6507363J8590442K0961435K3586999K6361997K9033556L0816958
55944B85604942L0124540K5187442J5479823K626371j0315417k0639489k7215823
55937C00852389l0342265l0883245k9676590k7407557k4608399k1631791j8690233
55930A17612309j5942069j3503222j1406569r621838q119921o882737n869472
55923D6266481n023792m312857l725328l238559k820783k459479k157218j904214
55915B0624251j681292j484325j320401j184392j062091r51678q60387p84398
55907A1295287p12505o45243n90940n46844n02718m59287m25072l98332l69485
$$ plain form
55958 47969645 54349461 61866420 70619935 80673925 92117621 105090199 119746192
55951 119746192 136253555 154843997 175805432 199392431 225754428 254787984 285604942
55944 285604942 315729482 340916924 356396747 359023118 348707701 328068212 300852389
55937 300852389 270510124 239626879 209950289 182542732 157934333 136302542 117612309
55930 117612309 101670240 88167018 76760449 67138611 59018690 52135953 46266481
55923 46266481 41242689 36929832 33204504 29965945 27145162 24685683 22528465 20624251
55915 20624251 18942959 17458634 16138233 14953841 13891750 12940072 12079685 11295287
55907 11295287 10582782 9937539 9346599 8799755 8297037 7837750 7412678 7014346 6644861
55898F644861l38526l13477k94008k72456k48971k30491k16612k00724j83495
55889D346101j71361j63221j52008j38107j28389j23119j16093j06734j00073
55880C146996r5772q8896q0786p7876q0120q1270q0092q0801q2930q1262p5866
55869B241325p2269p1478o9081o4264o0765n8917n5345n0458m7911m6896m3240
55858A600701l7771l5397l6242l5759l3288l2412l3134l1822k8785k7967k9131
55847A238993k8177k5219k4567k6497k6770k4630k3704k4540k3655k0666j9102
55836I71466j9440j8400j5766j4952j6070j5362j2428j1135j2345j2446j0301
55825H12821r090r950j0110q758q648j0420j1184j0104r760j0735j0538r012r116
$$ plain form
55898 6644861 6306335 5992858 5698850 5426394 5177423 4946932 4730320 4529596 4346101
55889 4346101 4174740 4011519 3859511 3721404 3593015 3469896 3353803 3247069 3146996
55880 3146996 3051224 2962328 2881542 2803666 2723546 2642276 2562184 2481383 2398453 2317191 2241325
55869 2241325 2169056 2097578 2028497 1964233 1903468 1844551 1789206 1738748 1690837 1643941 1600701
55858 1600701 1562930 1527533 1491291 1455532 1422244 1389832 1356698 1324876 1296091 1268124 1238993
55847 1238993 1210816 1185597 1161030 1134533 1107763 1083133 1059429 1034889 1011234 990568 971466
55836 971466 952026 933626 917860 902908 886838 871476 859048 847913 835568 823122 812821
55825 812821 803731 793781 783671 774913 766265 755845 744661 734557 724797 714062 703524 694512 685396
55812F85396j1060j1346q981p086o977o208l943k646k869j794J226L017K293J875
55798F30897L327M421L820L373L778K766k48k400k319k407m097n324m871m836
55784F25880o416p334n995m483m995o727q291r860j1086j0330p785n974n523l951
55770E27130k23L273N011O636Q935R308N823M98l808o839r134r909r029q335q797
55755E10540q876p610o772q088j0777j3470j6034j7960j7718j5350j3182j2331
55743C62372j1153q562o105n116m579l496k689k588j944m48J1j476l012k990k446
55728C05779k669l017k885l287m687n610n213m839n335n346l988k714k615k370
55714B51204q29P67J147J329K539L967M608N150O070N992M005J596K58p87k459
$$ plain form
55812 685396 674336 662990 654009 646923 639946 633738 629795 627149 624280 622486 623712 626729 629022 630897
55798 630897 634224 638645 642465 645838 649616 652382 652134 649734 647415 645008 640911 635587 630716 625880
55784 625880 619464 612130 606135 601652 596657 589930 581639 571779 560693 550363 542578 536604 531081 527130
55770 527130 526907 530180 535191 541827 550762 560070 565893 566391 562583 555744 546610 536701 527672 519337 510540
55755 510540 501664 494054 487282 479194 468417 454947 438913 420953 403235 387885 374703 362372
55743 362372 351219 342657 336552 331436 326857 323361 320672 318084 316140 315692 315703 314227 311215 308225 305779
55728 305779 303110 300093 297208 293921 289234 283624 278411 273572 268237 262891 258903 256189 253574 251204
55714 251204 250375 251142 252289 253618 256157 260124 264732 269882 275952 281944 285949 287545 287803 287016 284557
55699B84557l597l132k527l632n659o597o187n417m416l004k014k100k302j548
55685B32425m52K7L76J333K235K326K411L439M590M465L259K153J485Q80L22j51
55669B61123r18j929k362j969j547j392p80K48M01o04j144k87O54L87l03k07L69
55652B49740P58J313K151K185R61k12l51m04j284k173k307k606l723m326l324
55637B36398k110k445l679m193m285n222o566o744n636m484l815l225k637k189
55623A79168j485l33L98L0o98q24o88r87j444j650k142l211l804l091k006j736
55607A55497j811j218l10O7J82O00P40k2p61l50N00K72r54j785j636j032m09J6
55589A47586k73j360k218j956j109o27m16QL32J17k07j34M7J76R26K431L490L315
$$ plain form
55699 284557 280960 277828 275301 271669 266010 259413 253226 247809 243393 240389 238375 236275 233973 232425
55685 232425 231973 232000 232376 233709 235944 238270 240681 244120 248710 253175 256434 258587 260072 260952 261274 261123
55669 261123 260205 258276 255914 253945 252398 251006 250226 250474 250875 250271 249127 248840 249494 249881 249578 249371 249740
55652 249740 250498 251811 253962 256147 257108 256896 256545 256141 254857 252684 250377 247771 244048 239722 236398
55637 236398 234288 231843 228164 223971 219686 214464 207898 201154 195518 191034 187219 183994 181357 179168
55623 179168 177683 177350 177748 177778 177080 176256 175568 174581 173137 171487 169345 166134 162330 159239 157233 155497
55607 155497 153686 152468 152158 152225 152407 153007 153747 153725 152964 152614 153114 153386 152432 150647 149011 147979 147570 147586
55589 147586 147313 145953 143735 141779 140670 140043 139627 139635 139967 140084 139877 139743 139790 139966 140892 143323 146813 150128
55571A50128K867L093L304K751K411L383M730M769L470J870J82j706k906k649
55557A75697j873j904k370k204j803k249l179l395k966k837k933k498j735j357
55543A42394j016NJ190J523J325J564J956J528N55J16J91L2j27M59J223R08k93
55526A53533r85q03o72j008j331j527j941k366k348k232k574k869k345j597j838
55511A27097k892l509l313k926k511j784j103j013j048m76J83m8p55p45k1M95
55495A05631P71J411K001J555M13k25l38q84j730j726q11j88l05l77J4M71R28
55478A06611J625J997J261N3k33L35M02l23o99k94o3o01j380j951k378k333j342
55461A00687n9K95j37p9O27P38j62r64r12n36k66L06J242J804J651J234O58m29
$$ plain form
55571 150128 152995 156088 159392 162143 164554 167937 172667 177436 180906 182776 182958 181252 178346 175697
55557 175697 173824 171920 169550 167346 165543 163294 160115 156720 153754 150917 147984 145486 143751 142394
55543 142394 141378 141383 142573 144096 145421 146985 148941 150469 151024 151140 151331 151363 151236 151695 152918 153826 153533
55526 153533 152548 151745 151073 150065 148734 147207 145266 142900 140552 138320 135746 132877 130532 128935 127097
55511 127097 124205 120696 117383 114457 111946 110162 109059 108046 106998 106522 106705 106657 105902 105157 105136 105631
55495 105631 106402 107813 109814 111369 111782 111557 111219 110335 108605 106879 106068 105880 105575 105198 105212 105683 106611
55478 106611 108236 110233 111494 111547 111314 111649 112051 111728 111029 110735 110672 110071 108691 106740 104362 102029 100687
55461 100687 100628 100923 100786 100707 101334 102072 101910 100946 100034 99498 99232 99538 100780 102584 104235 105469 106127 105698
55443A05698j585j734q97l73p20j016n48J68N49P87R95Q04K60K0J62j8o90j122
55425A00740r70p82q77q32m24KL14P49J133J059Q79J248J758J417M74K46R16J148
55407A08198K35r03j355j378j363j024k17N62R89J145P87l93j627j596m03M18
55391A02075J61k70j79q0l48m30m1K46K11M16Q87P75o1n76k96q1m54o11N0P54
55371A02148O28j8n60j019j393j166l25K48J73K40R56J577J420R97R29P89m3j258
55353A04323k172k649k685k052j031n32q35j070o08K4K29L09O35R41J048J303
55337I5178J615J205J0q06n23J05L15N24J147J445P78n9j8N51O43K57O1P8j24
55318A02382l79j90L22N91M73J55l87j115j568j387q13j91M68J001R21K73j03
$$ plain form
55443 105698 104113 102379 101482 101109 100389 99373 98825 98993 99542 100329 101324 102128 102388 102408 102570 102552 101862 100740
55425 100740 99770 98988 98111 97279 96855 96857 97171 97920 99053 100112 100991 102239 103997 105414 105888 106134 107050 108198
55407 108198 108433 107530 106175 104797 103434 102410 102193 102755 103744 104889 105676 105283 103656 102060 101657 102075
55391 102075 102236 101966 101787 101707 101359 100929 100888 101134 101345 101761 102648 103423 103362 102786 102490 102409 101955 101344 101394 102148
55371 102148 102776 102758 102198 101179 99786 98620 98295 98543 98716 98956 99912 101489 102909 103906 104835 105624 105581 104323
55353 104323 102151 99502 96817 94765 93734 93202 92367 91297 90689 90713 90942 91251 91886 92827 93875 95178
55337 95178 96793 97998 98008 97202 96679 96784 97099 97623 98770 100215 100993 100934 100916 101467 102110 102367 102428 102506 102382
55318 102382 102003 101813 102135 102726 103199 103354 102967 101852 100284 98897 98084 97893 98361 99362 100283 100556 100453
55301A00453K50P01N37o3o53j251j837j917j303n80j83J91P58J084R61Q88J072
55284I9108R64M42L26R53J362Q56J99K36M27m4p03o76l06n02j092j217q09m87
55266I9037l71j85r9l29l76K32Q85P32J45J23N94N61k32r93j203j103q57k90L69
55247I6640M65j08n73k43O79J445J579J217Q04N51K03m77j140j215p80m21k72
55230I8354M0M33L45j69l68j34k52r51j359r43k96J54Q80J907K130J028j85l19
55212A00295M5j33m58o1N37K59n25n34K75P75O09N30Q28R14N50K54L10L75K16
55193A05061Oj58k95k72j21k77q22r67j55Q07P69n4n26l83m09q93j176q07k00
55174I9128Q2l3k88m05k55j21m33r37p60K26R29O16Q0K37N62J81l73k9Q43R90
$$ plain form
55301 100453 100703 101404 101941 101878 101225 99974 98137 96220 94917 94337 94154 94345 95103 96187 97148 98036 99108
55284 99108 100072 100514 100840 101793 103155 104011 104210 104446 104873 104829 104126 103450 103144 102642 101550 100333 99524 99037
55266 99037 98666 98481 98382 98053 97677 97909 98794 99526 99671 99794 100388 100949 100717 99724 98521 97418 96561 96271 96640
55247 96640 97105 96997 96424 96181 96860 98305 99884 101101 101905 102456 102659 102182 101042 99827 99047 98626 98354
55230 98354 98394 98827 99172 99003 98635 98501 98249 97298 95939 94996 94700 94854 95734 97641 99771 100799 100614 100295
55212 100295 100340 100207 99749 99688 100225 100484 99959 99425 99700 100475 101084 101614 102442 103356 103906 104160 104470 104845 105061
55193 105061 105067 104909 104614 104342 104221 103944 103122 102155 102000 102807 103576 103522 102996 102613 102204 101311 100135 99328 99128
55174 99128 99210 99177 98889 98484 98229 98108 97675 96738 95978 96204 97133 97749 97829 98066 98628 98809 98436 98407 99250 100240
55154A00240M36L64R65J157N41k3nR9J0K05P63R66N39J49J10k50j255j968j454
55135A01589k02N33L48j85n42p10p12l50M30J256J648J540J291J158R53N10K07
55118A08762M98J006Q40j50j133j522j568j511j087l07K34L47N51Q92O10l26o28
55101A05508L55J344J030Q6j25K10J36m3O17J579J361k3r34m46P30J659K090J919
55083A17053J154M12K92L95J10n0O64J455Q42r15j959j491m68L29J083J533P85
55066A21224q39j526m08J177J630J022K72k90p18p97n05l16m58n25l03j82l93
55049A18065o16o69o97n33J63R47Q35j51q75p64m97n93n48L3N63L51m91j478k224
55030A10821k200j040N10J067M64M6O63J532J619R95J95n80r89m22Q74J571R52
$$ plain form
55154 100240 100676 101040 102005 103162 103703 103680 103675 103774 103784 103989 104752 105718 106257 106406 106516 106266 105011 103043 101589
55135 101589 101387 101920 102268 102083 101541 100831 100119 99769 100199 101455 103103 104643 105934 107092 108045 108555 108762
55118 108762 109260 110266 111106 110956 109823 108301 106733 105222 104135 103828 104062 104409 104960 105852 106462 106136 105508
55101 105508 105863 107207 108237 108323 108198 108408 108544 108501 109118 110697 112058 112035 111101 110655 111385 113044 115134 117053
55083 117053 118207 118619 118911 119306 119416 119366 120030 121485 122327 121412 119453 117962 117494 117823 118906 120439 121224
55066 121224 120385 118859 118451 119628 121258 122280 122552 122262 121544 120747 120242 119926 119468 118943 118640 118458 118065
55049 118065 117449 116780 116083 115550 115713 116660 117495 117344 116469 115705 115208 114615 114067 114100 114663 115014 114523 113045 110821
55030 110821 108621 107581 108091 109158 109622 109668 110331 111863 113482 114477 114672 114092 113103 112681 113555 115126 116078
55013A16078r2m34j17L77J072J875J987J052M5NN55O54J67l03n44p14o64k09K80
54994A21070L80L39O19J060J178Q95M28j39o12n45R3N91M29M8P5L35K50k20p07
54975A25567j080j344j291q35l72k35k37j28p5k12k13J20L51R7k07J13R67J616
54957A22602J608J101N26K44L05L35l9n61o52l53k99o82j006j083j288j537j089
54940A18132J07R43P12J90L14P46P20N30R80J926K485K386K100J862J537J334
54924A37004J687K492L135L369L591M184N036N705N793N279M655M507M775M802
54910A96014M169L032J518m78k650m167m695m843n144n337n138n000n329n650
54896A56302n282m343l461k848k374k048j844j459q01k24J25O51J481J970J730
$$ plain form
55013 116078 115986 115552 115435 115812 116884 118759 120746 121798 121843 121848 122403 123057 123224 122921 122377 121663 120999 120790 121070
54994 121070 121450 121789 122408 123468 124646 125541 125969 125830 125218 124673 124766 125357 125786 125834 125909 126244 126494 126274 125567
54975 125567 124487 123143 121852 121017 120645 120410 120173 120045 119970 119758 119545 119665 120016 120113 119906 120019 120986 122602
54957 122602 124210 125311 125837 126081 126386 126721 126682 126121 125469 125116 124817 124135 123129 122046 120758 119221 118132
54940 118132 118239 119182 119894 120084 120398 121144 121864 122394 123374 125300 127785 130171 132271 134133 135670 137004
54924 137004 138691 141183 144318 147687 151278 155462 160498 166203 171996 177275 181930 186437 191212 196014
54910 196014 200183 203215 204733 204255 201605 197438 192743 187900 182756 177419 172281 167281 161952 156302
54896 156302 151020 146677 143216 140368 137994 135946 134102 132643 131842 131618 131743 132394 133875 135845 137575
54881A37575J476K068L224L956L938L645L535L758M340N074N548N671N746N715
54867A95269M928L171J147n60k186l929n266n916o480p240p330o110m481l629
54853A51388l358k958k814l580m404l801k025q34r01j134p61m57r59j818k204
54838A19380j926j139M6J231J684J149J82n65r52j079j015q75p76o19l41k19m39
54821A13727n70r0P29J152J053R03Q44N81J34o2J00K57K05P3j11l75l57L45J417
54802A19955K062J999J601J067K12q86j676j734j106k4J143J784J458M68l48m48
54786A25527J51J103J801J616O15k53k59K05M68O86J344K176K622K816L079K879
54770A46576J648K95M08K032L625M282M552M941N106M973N223N978O220N223L575
$$ plain form
54881 137575 139051 141119 144343 148299 152237 155882 159417 163175 167515 172589 178137 183808 189554 195269
54867 195269 200197 203368 204515 203955 201769 197840 192574 186658 180178 172938 165608 159498 155017 151388
54853 151388 148030 145072 142258 138678 134274 130473 128448 127614 126713 125579 124818 124361 123402 121584 119380
54838 119380 117454 116315 116361 117592 119276 120425 120607 120042 119090 118011 116996 116121 115345 114726 114385 114166 113727
54821 113727 113157 113067 113796 114948 116001 116904 117748 118329 118463 118401 118501 118758 118963 119036 118925 118550 118193 118538 119955
54802 119955 122017 124016 125617 126684 126896 126010 124334 122600 121494 121470 122613 124397 125855 126323 125975 125527
54786 125527 125678 126781 128582 130198 130813 130560 130301 130506 130974 131660 133004 135180 137802 140618 143697 146576
54770 146576 148224 148519 148927 150959 154584 158866 163418 168359 173465 178438 183661 189639 195859 201082 204657
54755B04657K108P75o90j965k723l296m061m785n245n798o660p189o606n035l255
54740A50232j891j218j292j672j522n72M48P19L06j87m21l50J17Q62J436J669
54724A46664K081L082M172M543M255M145M659N312N419M891M172L606L022K033
54710B02056O32p21j804l097n012o832p236o048m688m452m977m993m138l227k936
54695A42527k928k491j549o88l32k23J55Q13J225J080O34J80m14j246j852j780
54679A33111j406j469j899j826q67L21R25Q46M15j71p66j063q54l10J54K60N2
54662A25453j46k4K37O3o34j020l56Q69J475J119M71J3m42r73j200r70o26l68
54644A22941m0K36J3n94p41j9R07J289J250J265J274R47M12J19K22N01P10O58
$$ plain form
54755 204657 206765 207540 206850 204885 202162 198866 194805 190020 184775 178977 172317 165128 158522 153487 150232
54740 150232 148341 147123 145831 144159 142637 142065 142513 143232 143538 143351 142930 142580 142697 143559 144995 146664
54724 146664 148745 151827 155999 160542 164797 168942 173601 178913 184332 189223 193395 197001 200023 202056
54710 202056 202688 201967 200163 197066 192054 185222 177986 171938 167250 162798 157821 152828 148690 145463 142527
54695 142527 139599 137108 135559 134871 134539 134316 134471 135284 136509 137589 138223 138403 137989 136743 134891 133111
54679 133111 131705 130236 128337 126511 125644 125965 126890 127736 128151 127980 127214 126151 125297 124987 125141 125401 125453
54662 125453 125307 125283 125520 125583 124949 123929 123573 124442 125917 127036 127507 127520 127078 126105 124905 123935 123309 122941
54644 122941 122901 123137 123150 122556 121815 121796 122703 123992 125242 126507 127781 128728 129140 129259 129481 129982 130692 131350
54626A31350K15n02j150j542j707j520p43L86J094R49M15K51O58J203J279N09
54610A31145q99k085k308j820j473j384p76O39J946K148J418O82M00L01k7p06
54594A27201j503j938j715j143p60m90K09J266J802J357O05L83O32P85O44L24
54578A27659j53o75q71n95j66K12P20J240J070o0j296j722j524j349j068j79R57
54561A22200J363Q78L63L28K83k04o38k65P71J530J389P19L11M20N91M76M27Q98
54543A31840J521J461O58L7K33Q17J154J347J714J935J445L40p83j594k006j668
54527A38451l78J095J437K95j284k086j948j491j118p12j17M06L77l11j099j161
54511A30356k79Q62J331R13K40kJ94K75m6l58j39L65L15m62j018n30M78Q10K45
$$ plain form
54626 131350 131565 131063 129913 128371 126664 125144 124401 124787 125881 126830 127245 127496 128154 129357 130636 131145
54610 131145 130246 128161 125853 124033 122560 121176 120400 121039 122985 125133 126551 127233 127633 127934 127907 127201
54594 127201 125698 123760 122045 120902 120142 119652 119861 121127 122929 124286 124891 125274 125906 126691 127335 127659
54578 127659 127506 126831 125960 125365 125199 125411 126131 127371 128441 128381 127085 125363 123839 122490 121422 121243 122200
54561 122200 123563 124441 124804 125132 125415 125211 124573 124308 125079 126609 127998 128717 129028 129448 130039 130515 130942 131840
54543 131840 133361 134822 135480 135517 135750 136567 137721 139068 140782 142717 144162 144502 143719 142125 140119 138451
54527 138451 138073 139168 140605 140900 139616 137530 135582 134091 132973 132261 132144 132550 132927 132616 131517 130356
54511 130356 130077 130939 132270 133183 133423 133421 133615 133890 133844 133486 133347 133712 134027 133565 132547 132017 132495 133305 133550
54492A33550l71n32n73o99n51l7K82J18M0N09J062J029N45K23K48L95N45O28M20
54473A36831j09m89k92L74J200K085K819K832J920P85K71L15K43k06p01r40q94
54456A46044o21k71j19j47R7P64J211P59k62q92p64m14m55r50j539j778j416o62
54438A38585p6L6p4j06j39k34n8N68J140J038L89j78l60l12j19K99Q97J496J982
54419A44774K183J908J387J250J680J945J310L8j034j491j414r50l95k92p47j010
54403A49142m60M16P80P09Q59J170J004L79M6L12O99Q55R20R14O23K20K50P38
54385A59576J088R99Q09P52N46K1n40q87j107j188q42l8P67J162J175R44N55K81
54367A64073N18J217J836J993J894J939K326L056L844M071L345K213J689J920
$$ plain form
54492 133550 133179 132647 132074 131375 130824 130787 131069 131187 131227 131736 132798 133827 134372 134595 134843 135238 135783 136411 136831
54473 136831 136722 136233 135941 136315 137515 139600 142419 145251 147171 147956 148227 148542 148785 148579 147878 146938 146044
54456 146044 145423 145152 145033 144886 144983 145747 146958 147717 147455 146563 145799 145385 144930 143980 142441 140663 139247 138585
54438 138585 138509 138545 138471 138365 138226 137992 137934 138502 139642 140680 141069 140891 140531 140219 140100 140399 141296 142792 144774
54419 144774 146957 148865 150252 151502 153182 155127 156437 156475 155441 153950 152536 151586 151191 150899 150152 149142
54403 149142 148682 149098 149878 150587 151446 152616 153620 153999 154045 154357 155056 155911 156831 157745 158368 158588 158838 159576
54385 159576 160664 161663 162472 163224 163770 163791 163251 162364 161257 160069 159227 159189 159956 161118 162293 163237 163792 164073
54367 164073 164591 165808 167644 169637 171531 173470 175796 178852 182696 186767 190112 192325 194014 195934
54353A95934J985J220J57l44l37p02k004l842n153n089l785k424k148k868l417
54338A67183l001k031j342j166j194j190j132r42o09l66m78q00q79m37L49J014
54322A52979J151O89l3m76l14L21R57J125P28J14l23o50j232j958k040j000M35
54305A50473J023M78k62k88K84P12N16k22j034j324p37M05J220J127N05K73Q71
54288A54020J803K238J854R77J5q85j516j413m41O03P00o8n43j07M94L11m62r42
54270A56638q51n37j04O38J435J631J090M61L05M50M65L18L36O81J087J143P08
54253A65894R8k63k89j26K66J038J878K090J438M51l35q84j231j185q65q18j138
54236A66019j161n64p9l20o75k27P38J158P26L5m43o34m77j48l28j280k010j425
$$ plain form
54353 195934 197919 199139 199296 198952 198615 197913 195909 192067 186914 181825 178040 175616 173468 170600 167183
54338 167183 164182 162151 160809 159643 158449 157259 156127 155185 154576 154210 153732 152932 152053 151616 151965 152979
54322 152979 154130 154819 154786 154310 153996 154317 155274 156399 157127 157241 156918 156268 155036 153078 151038 150038 150473
54305 150473 151496 151974 151712 151424 151708 152420 152936 152714 151680 150356 149619 150024 151244 152371 152876 153149 154020
54288 154020 155823 158061 159915 160892 160907 160022 158506 157093 156652 157255 157955 157887 157344 157237 157731 158042 157580 156638
54270 156638 155787 155250 155146 155784 157219 158850 159940 160401 160706 161156 161621 161939 162275 162956 164043 165186 165894
54253 165894 165992 165729 165440 165314 165580 166618 168496 170586 172024 172475 172140 171256 170025 168840 167975 167157 166019
54236 166019 164858 164294 164215 163895 163220 162993 163731 164889 165615 165650 165207 164573 164096 163948 163620 162340 160330 158905
54218A58905j5P30L56k09k55J8L21O60P96L59l45o16m70m76o27m19j6j08n79n83
54198A57427j20j40p82q68K18J460J616Q04l3l32m0O69J218R36j8p03o39k14K82
54179A60741R93J703J735J102O18N32J96m78n55K70Q43L25n25o82m34n73r41r66
54161A63904q28j001j322j471j730k249k256j098M95J213Q18R0l83m55l4O66R21
54144A55280M09j45l4L04J54j24K95J212J685J400Q14K55j54n5O31J148Q22J49
54126A64046j5J11k26p90o79P5N59M97M55N59L73P5M78J577K309K051J332P63
54108A73550L31J7J13M79M63o7m12j71K18L95O80J236J489J008K41k24m88p84
54090A78074o84L73K042L290L544L176K916L162L753M148L857K842J457N4j142
$$ plain form
54218 158905 158890 159620 159976 159767 159512 159530 159851 160511 161307 161666 161321 160705 160235 159759 159132 158713 158697 158589 158010 157427
54198 157427 157307 157167 156385 155517 155735 157195 158811 159615 159582 159250 159210 159879 161097 162033 162015 161312 160673 160459 160741
54179 160741 161734 163437 165172 166274 166892 167424 167620 167142 166587 166857 167700 168025 167500 166818 166384 165811 164870 163904
54161 163904 163076 162075 160753 159282 157552 155303 153047 151949 152444 153657 154475 154565 154182 153727 153693 154359 155280
54144 155280 155689 155544 155510 155814 155968 155844 156139 157351 159036 160436 161250 161505 161351 161296 161927 163075 163897 164046
54126 164046 164031 164142 163916 163126 162447 162522 163081 163578 164033 164592 164965 165040 165518 167095 169404 171455 172787 173550
54108 173550 173881 173898 174011 174490 174953 174886 174474 174303 174521 174916 175596 176832 178321 179329 179570 179346 178858 178074
54090 178074 177390 177763 179805 183095 186639 189815 192731 195893 199646 203794 207651 210493 211950 212004 210862
54075B10862j848j840j346r70j079j491j804j733j113K0J225J859J656Q95J2p42
54059B02563j218j354j229r52m61K91J029J380J316J142J048J069J289J767K285
54044B09965K587K737K883K927K850L074L890M781N012M792N022N914O755P140
54030B70329P510Q116Q357P568N940M178K777J992J892K000J487K37p94q66o04
54015C20119j119k323k993k519j795k076l469m902n416n140m936n324n941o081
54001B66085n614n102n027n186m911l865k544j969k671l865l962k317j04R54N99
53986B20501N5J65L97l8r24j475j447j174q65m99k25k81n25n29j93J29R4k67o60
53967B12239p24k36N66R71N21k63l67M22J253J435J342J624K038J868J342J606
$$ plain form
54075 210862 209014 207174 205828 204858 203779 202288 200484 198751 197638 197658 198883 200742 202398 203293 203305 202563
54059 202563 201345 199991 198762 197810 197349 197640 198669 200049 201365 202507 203555 204624 205913 207680 209965
54044 209965 212552 215289 218172 221099 223949 227023 230913 235694 240706 245498 250520 256434 263189 270329
54030 270329 277839 285955 294312 301880 307820 311998 314775 316767 318659 320659 322146 322383 321589 320723 320119
54015 320119 319000 316677 313684 311165 309370 307294 303825 298923 293507 288367 283431 278107 272166 266085
54001 266085 260471 255369 250342 245156 240245 236380 233836 231867 229196 225331 221369 219052 218948 219902 220501
53986 220501 220556 220721 221118 221080 220156 218681 217234 216060 215195 214696 214471 214190 213665 213136 212943 213072 213166 212899 212239
53967 212239 211515 211279 211845 212816 213337 213074 212707 213129 214382 215817 217159 218783 220821 222689 224031 225637
53951B25637L064M598N058M815N112O238P365P991Q562R532J0735J2002J3418
53938C24127J4470J3792J0662O215K305n11k920n127o279n797m398l229k604k046
53924C38660j254m68pK53P48J724K935L909M513N040N709O295O523O515O643P023
53908C94761P432P527P008N713L896K149Q12l34j463k223k324k313l032m414n409
53893D07786n292m479l951m266n276o451p310p717p853p829p543p056o753o768
53879C19242o589n714m504l727l515l415l364l782m632n182m960m332l882l729
53865B57915l723l744l570k915j958j345j432j873k236k522k769k634j881r90
53851B24323o88j010j265r88m85l90q46j317j206n32J18L02J83J21J12n1k51j41
$$ plain form
53951 225637 228701 233299 238357 243172 248284 254522 261887 269878 278440 287972 298707 310709 324127
53938 324127 338597 352389 363051 369266 371571 371060 368140 363013 356734 350937 346539 343310 340706 338660
53924 338660 337406 336938 336931 337184 337932 339656 342591 346500 351013 356053 361762 368057 374580 381095 387738 394761
53908 394761 402193 409720 416728 422441 426337 428486 429298 428964 427501 425278 422954 420641 417609 413195 407786
53893 407786 402494 398015 394064 389798 384522 378071 370761 363044 355191 347362 339819 332763 326010 319242
53879 319242 312653 306939 302435 298708 295193 291778 288414 284632 280000 274818 269858 265526 261644 257915
53865 257915 254192 250448 246878 243963 242005 240660 239228 237355 235119 232597 229828 227194 225313 224323
53851 224323 223635 222625 221360 220372 219887 219497 218651 217334 216128 215596 215714 216016 216199 216320 216432 216381 216130 215989
53833B15989K43M32J90j49j58J86O47J116J624K148K510K420J637L33p27p13L96
53816B28124J614J781P27m71m45J063K803L318K602K005K463L410L855L788L913
53801B60550M428M923N155N168M866M228L831M233M908M644L145J471P63J125
53787C13438J951K629K705K056J149O06L83r2r45j707k214k905l921m761n107
53772C03265n331n722n876n353m446l818l700l902m213m430m301l760l037k311
53758B43065j611j109j070j358j502j404j477j887k180j945j350q21n23m19l75
53743B24034j87J08k5r08j763j395R8J260J198O04M30N47L77K8j7K54N63Q90J264
53724B27360J479J504J648J952K033J933K265K984K993J800N80O53J646K292K330
$$ plain form
53833 215989 216232 216664 216854 216705 216547 216733 217380 218496 220120 222268 224778 227198 228835 229168 228441 227728 228124
53816 228124 229738 231519 232246 231775 231330 232393 235196 238514 241116 243121 245584 248994 252849 256637 260550
53801 260550 264978 269901 275056 280224 285090 289318 293149 297382 302290 306934 310079 311550 312313 313438
53787 313438 315389 318018 320723 322779 323928 324534 324917 324825 323880 322173 319959 317054 313133 308372 303265
53772 303265 297934 292212 286336 280983 276537 272719 269019 265117 260904 256474 252173 248413 245376 243065
53758 243065 241454 240345 239275 237917 236415 235011 233534 231647 229467 227522 226172 225351 224828 224409 224034
53743 224034 223847 223955 223930 223022 221259 219864 219962 221222 222420 223024 223454 224001 224378 224406 224389 224643 225206 226096 227360
53724 227360 228839 230343 231991 233943 235976 237909 240174 243158 246151 247951 248531 249184 250830 253122 255452
53709B55452K348K317J726Q89P64J509K366K939L407L558K893J804J361J724J931
53694B86988J712K107L597M812M202K261Q83Q63J171P12k34p20n58l68n10o29
53678C06289m28l21q88j903k494k276j768j500j285p57j49N7p1j2L92P44O48Q8
53660B94366o72j249j265o88O4N73Q42J024J017P14L50K12K04J31J63N35R86J092
53642B98399R78J102J436J473J123J012J672K826L663L588K671J604J195J662
53628C24404K442K818K614K092J499J083J242K184L510M601N299N829O202O137
53614C71956N542M692L993L796M181M643M321L076J955J965K731L038K501J864
53600D20254J738J839J652J117M40j73m32j39L99N76K11l13o91r62j172j253j340
$$ plain form
53709 255452 257800 260117 261843 262732 263496 265005 267371 270310 273717 277275 280168 281972 283333 285057 286988
53694 286988 288700 290807 294404 299216 303418 305679 306562 307425 308596 309308 309074 308354 307796 307428 306918 306289
53678 306289 305861 305540 304652 302749 300255 297979 296211 294711 293426 292669 292520 292577 292506 292494 292886 293630 294278 294366
53660 294366 293694 292445 291180 290492 290556 291129 291971 292995 294012 294726 295076 295288 295492 295623 295786 296321 297307 298399
53642 298399 299377 300479 301915 303388 304511 305523 307195 310021 313684 317272 319943 321547 322742 324404
53628 324404 326846 329664 332278 334370 335869 336952 338194 340378 343888 348489 353788 359617 365819 371956
53614 371956 377498 382190 386183 389979 394160 398803 403124 406200 408155 410120 412851 415889 418390 420254
53600 420254 421992 423831 425483 426600 427040 426867 426435 426296 426695 427271 427482 427169 426478 425516 424344 423091 421751
53583D21751j682k135k275j989j556j114o02k55m73j155j693j804j723j567j210
53568D00518q83j106j740j920j326p12p06p84j76Q56J345R36J86k46r3N88J433
53551C96170J842J560J092J111J605K054K267K486K741K762K568K621L130L726
53537D27735M052M304M851N649O408P175Q241R462J0181J0069R726J0012J0979
53524E28844J1845J2045J1870J1963J2587J3561J4568J5287J5610J5986J7163
53513F81329J9174K0922K1427K1200K1683K3366K5222K6144K6202K6122K6107
53502I38898K5775K4940K3941K3166K2649K2142K1415K0454J9458J8683J8212
53491A179733J7932J7705J7478J7201J6841J6561J6740J7528J8459J8689J7879
$$ plain form
53583 421751 420069 417934 415659 413670 412114 411000 410398 410143 409670 408515 406822 405018 403295 401728 400518
53568 400518 399635 398529 396789 394869 393543 392831 392125 391341 391165 392021 393366 394302 394488 394242 394149 394737 396170
53551 396170 398012 399572 400664 401775 403380 405434 407701 410187 412928 415690 418258 420879 424009 427735
53537 427735 431787 436091 440942 446591 452999 460174 468415 477877 488058 498127 507853 517865 528844
53524 528844 540689 552734 564604 576567 589154 602715 617283 632570 648180 664166 681329
53513 681329 700503 721425 742852 764052 785735 809101 834323 860467 886669 912791 938898
53502 938898 964673 989613 1013554 1036720 1059369 1081511 1102926 1123380 1142838 1161521 1179733
53491 1179733 1197665 1215370 1232848 1250049 1266890 1283451 1300191 1317719 1336178 1354867 1372746
53480A372746J6748J6377J6785J6571J4514J1250Q644P419O367M204J346j025
53468A491946k925n395q582j1273j2621j3277j4256j5408j5829j5289j4568j4393
53456A348130j4734j5291j6190j7728j9627k0996k1236k0701k0088j9492j8519
53445A143528j7206j6101j5349j4441j3146j1881j0744q994o297l712k432k050
53433A021175j234K16J250J456J736K864M429N692O566P267P849Q561J0045J2490
53419A090362J5110J6973J7978J8616J9250K0055K1290K3073K5120K7067K8952
53408A323846L1072L3520L5974L7818L8559L8471L8739M0476M3492M6502M8602
53397A757071M9982N1172N2306N3358N4388N5162N5192N4501N3834N3639N3431
$$ plain form
53480 1372746 1389494 1405871 1422656 1439227 1453741 1464991 1473635 1481054 1487421 1491625 1492971 1491946
53468 1491946 1489021 1483626 1475044 1463771 1451150 1437873 1423617 1408209 1392380 1377091 1362523 1348130
53456 1348130 1333396 1318105 1301915 1284187 1264560 1243564 1222328 1201627 1181539 1162047 1143528
53445 1143528 1126322 1110221 1094872 1080431 1067285 1055404 1044660 1035666 1029369 1025657 1023225 1021175
53433 1021175 1019941 1020157 1021407 1022863 1024599 1027463 1031892 1037584 1044150 1051417 1059266 1067827 1077872 1090362
53419 1090362 1105472 1122445 1140423 1159039 1178289 1198344 1219634 1242707 1267827 1294894 1323846
53408 1323846 1354918 1388438 1424412 1462230 1500789 1539260 1577999 1618475 1661967 1708469 1757071
53397 1757071 1807053 1858225 1910531 1963889 2018277 2073439 2128631 2183132 2236966 2290605 2344036
53386B344036N2567N1192M9794M8269M6041M2897L9247L5654L2439K9442K5965
53375B797543K1363J5979J1048P244L768o32o143j1978j7677k3559k9930l6337
53363B730689m1800m5592m7812m9297n0824n2301n3041n2827n2219n1591n0562
53352B182823m8763m6668m4942m3464m1683l9712l8314l7825l7769l7585l7140
53341A728958l6449l5362l3763l1750k9522k7265k5210k3511k2026k0392j8380
53330A425328j6131j4096j2843j2700j3359j3960j3856j3254j2880j3031j3205
53319A276013j2692j1443j0168r596r592r272q089o559n495m784l544j470O81
53306A183990K204L350M669O054P087P940R335J1625J4425J7066J9076K0318K1050
$$ plain form
53386 2344036 2396603 2447795 2497589 2545858 2591899 2634796 2674043 2709697 2742136 2771578 2797543
53375 2797543 2818906 2834885 2845933 2853177 2856945 2856313 2850170 2838192 2820515 2796956 2767026 2730689
53363 2730689 2688889 2643297 2595485 2546188 2495364 2443063 2390022 2337195 2284976 2233385 2182823
53352 2182823 2134060 2087392 2042450 1998986 1957303 1917591 1879277 1841452 1803683 1766098 1728958
53341 1728958 1692509 1657147 1623384 1591634 1562112 1534847 1509637 1486126 1464100 1443708 1425328
53330 1425328 1409197 1395101 1382258 1369558 1356199 1342239 1328383 1315129 1302249 1289218 1276013
53319 1276013 1263321 1251878 1241710 1232114 1222522 1213250 1205161 1198602 1193107 1188323 1184779 1183309 1183990
53306 1183990 1186194 1189544 1194213 1200267 1207354 1215294 1224629 1236254 1250679 1267745 1286821 1307139 1328189
53293A328189K1781K2827K4028K5072K5906K6567K6731K5834K3713K0947J8485
53282A590080J6874J5760J4220J1718Q648N666K771m50l862o770q941j0955j3275
53269A621484j5699j7954k0199k2423k4134k5070k5729k6566k7289k7518k7622
53258A361281k8120k8718k8745k8247k7906k8018k8266k8343k8126k7381k5971
53247A053440k4349k3251k2894k2964k3218k3538k3489k2522k0730j8901j7671
53236H09913j7013j6564j6032j5256j4166j2849j1385r742q052o811o508p125
53224F68410q272r617j0883j1763j2207j2621j3358j4192j4728j4970j5070j4767
53212E15962j3706j2104j0574r449q723q449q571q575p975p017o365o163o006
$$ plain form
53293 1328189 1349970 1372797 1396825 1421897 1447803 1474370 1501101 1526935 1550648 1571595 1590080
53282 1590080 1606954 1622714 1636934 1648652 1657300 1662966 1665737 1665287 1661425 1654655 1645714 1634759 1621484
53269 1621484 1605785 1587831 1567632 1545209 1521075 1496005 1470276 1443710 1416421 1388903 1361281
53258 1361281 1333161 1304443 1275698 1247451 1219545 1191527 1163261 1134918 1106792 1079411 1053440
53247 1053440 1029091 1005840 982946 959982 936764 913226 889737 867215 846485 827584 809913
53236 809913 792900 776336 760304 745048 730882 718033 706648 696906 688854 682043 675535 668410
53224 668410 660138 650521 639638 627875 615668 603047 589689 575497 560769 545799 530729 515962
53212 515962 502256 490152 479578 470129 461406 452957 444386 435811 427836 420819 414454 408291 402285
53199D02285n769n806o353p256q207q832q743p978p173o746o273n299m347m147
53185C09356m236l550k264j748k483l349l382l000k878k744k135j475j389j619
53171B73104j532j281j506k192k669k676k638k835k912k388j291j65L44K6o93
53156B48696j144j124r92r54p68l41j25m65q99p13M6O76Q14P11O25M70K43K90
53138B45046Q57J677K231K238J758R87J46n31q63q00m24L4K60O4l38m76j62K03
53120B51907Q9m59q68p86m96l55j67M28J173J293N18m74q20l97K46M93N8q96j741
53101B48746j844j229n80k79M7P19J286J132M47p8k48l74n24m67l29n12r62j174
53083B43777j024r17r87q33k91K20L81M09N04L76k07r02j244j252j145p74M8Q53
$$ plain form
53199 402285 396516 390710 384357 377101 368894 360062 351319 343341 336168 329422 323149 317850 313503 309356
53185 309356 305120 301570 299306 297558 295075 291726 288344 285344 282466 279722 277587 276112 274723 273104
53171 273104 271572 270291 268785 266593 263924 261248 258610 255775 252863 250475 249184 249019 249363 249389 248696
53156 248696 247552 246428 245436 244482 243714 243373 243248 242783 241884 241171 241217 241893 242707 243418 244043 244513 244756 245046
53138 245046 245903 247580 249811 252049 253807 254794 254940 254409 253546 252746 252322 252356 252616 252680 252342 251866 251704 251907
53120 251907 251996 251537 250669 249883 249387 249032 248865 249293 250466 251759 252277 251803 250983 250586 250832 251325 251383 250487 248746
53101 248746 246902 245673 245093 244814 244861 245580 246866 247998 248445 248367 248119 247745 247221 246754 246425 245913 244951 243777
53083 243777 242753 241836 240849 240016 239725 239945 240326 240735 241239 241615 241408 240506 239262 238010 236865 236091 236139 236992
53065B36992P63m05j662j818p63L72M45m37j116p57K55R94J100Q70N65K04n9J
53047B35544L07N68P83J114J319R36R8n12o87r65j607j982j483m99J02O6j49j68
53029B32785K5L67P94J097J079Q93R12J227J526J464J006M30Q4P7J90J74O8Lj39
53010B44062n54r65q03j14K73j66q02o65J83P28L73k98l85J83O50M52j07k29M96
52991B42312J641K358K129J206M01L84J011J375P76l37p62m8Q76R46M33N02J561
52974B56764K722L022K494J863J662J826J856J195j75j446j684r68l43m42p05
52959B67641k66P48J365J028K06k60j03K35K04k41p20r62j070j239j475j730k042
52942B61319k306k198j644j098r59j012q66n93m71k84L19R88R74K10n59q19p57
$$ plain form
53065 236992 237755 237350 235688 233870 233107 233479 233924 233487 232371 231614 231869 232863 233963 234833 235398 235602 235543 235544
53047 235544 235851 236419 237202 238316 239635 240571 240669 240157 239470 238505 236898 234916 233433 232934 233036 233102 232953 232785
53029 232785 232810 233177 233971 235068 236147 237040 237952 239179 240705 242169 243175 243605 243689 243766 243956 244130 244198 244201 244062
53010 244062 243508 242543 241740 241626 241899 241733 240931 240266 240449 241177 241550 241252 240867 241050 241700 242152 242045 241816 242312
52991 242312 243953 246311 248440 249646 250047 250431 251442 252817 253593 253256 252494 252446 253322 254268 254701 255203 256764
52974 256764 259486 262508 265002 266865 268527 270353 272209 273404 273229 271783 270099 269131 268788 268346 267641
52959 267641 267375 268123 269488 270516 270722 270462 270359 270594 270798 270557 269837 268875 267805 266566 265091 263361 261319
52942 261319 259013 256815 255171 254073 253114 252102 251236 250643 250172 249888 250207 251195 252169 252379 251820 251001 250244
52925B50244o30m30k63l69n90n28l01m22q35q47k90J40J7j67N3L54L20J48R0j06
52905B45588n89q92o46k74k98n00m18j93j57j01L15P84P72M07K68M98Q14J115
52887B46493J419J432Q68P1l50l72m63q03j135j289j281r88l49K87N53O76J147
52870B45916J885K346K385K324K241J862J226Q40R21J057Q56N04L83M40K73k73
52854B65186q04p79k20J16m83j744k635k676k507k904l693m164m050l596k924
52839B32123k051j299r52o68J05J175J657J140J93l86l91r2K05M01O18J026J454
52822B34258J288K09j101j506p66J69L86P9J17P97J402J056j34j079r00M6O83
52805B35004O39N85J044J518J280L99n31j338k220l025l240k658j567m32K88K81
$$ plain form
52925 250244 249614 249184 248921 248552 247962 247434 247133 246711 245876 245029 244739 244879 244896 244729 244782 245136 245456 245604 245694 245588
52905 245588 244999 244107 243461 243187 242889 242389 241971 241778 241621 241520 241835 242619 243391 243798 244066 244564 245378 246493
52887 246493 247912 249344 250212 250283 249933 249561 249098 248295 247160 245871 244590 243602 243253 243540 244093 244769 245916
52870 245916 247801 250147 252532 254856 257097 258959 260185 261025 261946 263003 263859 264363 264746 265186 265459 265186
52854 265186 264382 263603 263383 263499 263016 261272 258637 255961 253454 250550 246857 242693 238643 235047 232123
52839 232123 230072 228773 227821 227153 227258 228433 230090 231230 231423 231037 230646 230554 230759 231160 231778 232804 234258
52822 234258 235546 235755 234654 233148 232382 232551 232937 233016 233133 233930 235332 236388 236254 235175 234275 234321 235004
52805 235004 235643 236228 237272 238790 240070 240469 239938 238600 236380 233355 230115 227457 225890 225458 225746 226027
52789B26027j51r3R01J991K036J119K93Ll00r21j249p44J31M75L0o97j081r33
52771B26837n70n25r73j437j313o20Q0M07M22K48j19n46p75p37n87m14k21j7K95
52752B19435R48J807K162J562O13L07P09J097J171J331J748K065K169K395K746
52737B42265K764K406K299K694K916K301J073m3n64k83P12J677J581M34m41m3
52721B61748R25J015j18j589k575k929k776k328k038k196k346j769n52M02N50
52706B43424K64J22J91K92M51O98P86N23J96K33N60O36J87m16o25l34J51M93N20
52687B48352J37n99j301j412o87N41J628K006J417P4j274j851j577j084q50o89
52671B42831l34J3N8k8K5K0l08n76k21M78O39J49l6P19J782K169J860J654K041
$$ plain form
52789 226027 225876 225783 226684 228675 230711 231830 232123 232126 231826 230905 229656 228912 229043 229518 229548 228851 227770 226837
52771 226837 226267 225742 224769 223332 222019 221399 221479 221886 222308 222556 222437 221891 221116 220379 219792 219378 219157 219140 219435
52752 219435 220383 222190 224352 225914 226527 226834 227543 228640 229811 231142 232890 234955 237124 239519 242265
52737 242265 245029 247435 249734 252428 255344 257645 258718 258675 258111 257828 258540 260217 261798 262232 261791 261748
52721 261748 262673 263688 263570 261981 259406 256477 253701 251373 249335 247139 244793 243024 242472 242874 243424
52706 243424 243688 243810 244001 244293 244744 245442 246228 246751 246947 247180 247740 248376 248563 248147 247522 247188 247339 247832 248352
52687 248352 248489 247890 246589 245177 244490 245031 246659 248665 250082 250156 248882 247031 245454 244370 243520 242831
52671 242831 242497 242510 242568 242540 242565 242585 242277 241701 241480 241958 242597 242746 242710 243429 245211 247380 249240 250894 252935
52652B52935K782L440L754L587K906J958J160O50J30p20j760k520k756k629k289
52637B60628j576m32O45J008O60J99l2j77k06K13R66J346J140J143J898K599K099
52620B72121N50q84j604j962k273k457k509k479k006q35L06L38n51r88k85P80
52604B55262J321J388J276P59k22r66q43j97J99J62L4N1K49O18R00O48j18p21
52586B59800o51k23ln0p6L3K21M86O60M57J1n0N24J127J140Q00P50J069J287J088
52566B68400M93m23j509k412k754k442j608n57J71J37l74n59k11l0m47p82k80
52549B54813N99P23q7q16o18K36R14R71N70N0m30q21r30m69M61J146J048N35L28
52530B58223L30j59j027j178k11P78P35J41R7O13Q23N43M98J147K108K819L069
$$ plain form
52652 252935 255717 259157 262911 266498 269404 271362 272522 273172 273302 272582 270822 268302 265546 262917 260628
52637 260628 259052 258620 259265 260273 260933 261132 261100 260923 260717 260930 261896 263242 264382 265525 267423 270022 272121
52620 272121 272671 271787 270183 268221 265948 263491 260982 258503 256497 255662 255968 256306 255755 254767 254482 255262
52604 255262 256583 257971 259247 260006 259784 258818 257975 257778 257977 258139 258173 258224 258473 259091 259991 260639 260521 259800
52586 259800 259149 258926 258923 258873 258797 258830 259051 259537 260197 260654 260665 260615 261139 262266 263406 264206 264956 266025 267312 268400
52566 268400 268893 268470 266961 264549 261795 259353 257745 257188 257359 257496 257122 256563 256352 256322 255875 255093 254813
52549 254813 255412 256135 256048 255232 254614 254850 255764 256735 257305 257355 256925 256104 255174 254705 255166 256312 257360 257895 258223
52530 258223 258553 258394 257367 256189 255978 256756 257491 257632 257729 258342 259165 259708 260206 261353 263461 266280 269349
52513B69349K893K442K012J766J529J183J010J221J442J185O19K56J00k38p94
52498B85975j206j409j703k209k685k947k938k510j602o05j07k26n26n98m04j80
52482B64120k51p13j058m95R75K219K240J404Q03P80Q88R61J265J646J499Q20
52466B77103M52R86J928K410K213J836J827K217K504K101R39m24j477k231k852
52451B89532l200l191l240l682m059l744k998k638k715k392j256P6Q44R60P26
52436B59023L73J49K74N85O34L73J75J72M3l34o57q25j101j413j125j4J193J701
52418B59226J709J881K178J867P41k84m1J625L638M649M216L127K562L015M052
52403B94161N000N656O248O858P033O055L696O19k148m118n421o042n609m161
$$ plain form
52513 269349 272242 274684 276696 278462 279991 281174 282184 283405 284847 286032 286651 286907 287007 286769 285975
52498 285975 284769 283360 281657 279448 276763 273816 270878 268368 266766 266161 266054 265828 265302 264704 264300 264120
52482 264120 263869 263156 262098 261603 262578 264797 267037 268441 269244 270024 270912 271873 273138 274784 276283 277103
52466 277103 277555 278541 280469 282879 285092 286928 288755 290972 293476 295577 296516 296092 294615 292384 289532
52451 289532 286332 283141 279901 276219 272160 268416 265418 262780 260065 257673 256417 256493 257337 258297 259023
52436 259023 259396 259545 259819 260404 261038 261411 261586 261758 261801 261467 260810 259985 258884 257471 256346 256332 257525 259226
52418 259226 260935 262816 264994 266861 267602 267318 267277 268902 272540 277189 281405 284532 287094 290109 294161
52403 294161 299161 304817 311065 317923 324956 331011 334707 335326 333178 329060 323639 317597 311988 307827
52389C07827k580j729j553j519j487j594j533q17L92J358J671J533J241J044J343
52374C03597K426L874M865N051M705M174L690L618M134M734M703M000L104K161
52360C58836J053J17j29L7j71p68r67n25n3J94O63J387J683J478J764K992M075
52343C71666L890K869K249K442L093M084N435O695P333P475P506P432P302P757
52329D47228R180J0794J1642J2126J3419J5641J7726J9064K0112K1194K1836K1740
52317F41702K1442K1473K1570K1246K0626K0169J9944J9707J9397J9181J9110
52306H65567J9046J8880J8573J8127J7524J6674J5403J3675J1841J0389R426Q570
52294A043695P397N726L521Q66j840m034n599o989q502r673r796q959q092p859
$$ plain form
52389 307827 305247 303518 301965 300446 298959 297365 295832 295015 295407 296765 298436 299969 301210 302254 303597
52374 303597 306023 309897 314762 319813 324518 328692 332382 336000 340134 344868 349571 353571 356675 358836
52360 358836 359889 360006 359877 359914 359743 358975 358008 357483 357430 357624 358287 359674 361357 362835 364599 367591 371666
52343 371666 375556 378425 380674 383116 386209 390293 395728 402423 409756 417231 424737 432169 439471 447228
52329 447228 456408 467202 478844 490970 504389 520030 537756 556820 576932 598126 619962 641702
52317 641702 663144 684617 706187 727433 748059 768228 788172 807879 827276 846457 865567
52306 865567 884613 903493 922066 940193 957717 974391 989794 1003469 1015310 1025699 1035125 1043695
52294 1043695 1051092 1056818 1060339 1061205 1059365 1055331 1049732 1042743 1034241 1024568 1014772 1005813 997721 989862
52280I89862p818p036n302l361j869n51J261L556N589O858P666Q567R697J0877
52266A017996J2136J3604J5018J5752J5431J4398J3419J3028J3208J3653J4151
52255A171794J4559J4541J3732J2310J1076J0520J0077Q790O548M061J688r29
52243A278767l967o873r093j0739j2055j2836j2937j2894j3371j4233j4792j4785
52231A140192j4565j4455j4442j4441j4301j3637j2207j0424q967p911o777n435
52219A002630m403m047m033l749k925j609J9J528K327K284K032K324L198M066
52205I99642M486M565M573M499M119L348K394J621J360J757K657L569L938L668
52191A046196L278L341L748L857L435K988K942K887K166R06j64r35k165m242o340
$$ plain form
52280 989862 982044 975008 969706 966345 964476 963925 965186 968742 974331 981189 988855 997422 1007119 1017996
52266 1017996 1030132 1043736 1058754 1074506 1089937 1104335 1117754 1130782 1143990 1157643 1171794
52255 1171794 1186353 1200894 1214626 1226936 1238012 1248532 1258609 1267399 1273947 1278008 1279696 1278767
52243 1278767 1274800 1267927 1258834 1248095 1236040 1223204 1210267 1197373 1184002 1169769 1154977 1140192
52231 1140192 1125627 1111172 1096730 1082289 1067988 1054351 1042144 1031720 1022753 1014842 1008065 1002630
52219 1002630 998227 994180 990147 986398 983473 981864 981883 983411 985738 988022 990054 992378 995576 999642
52205 999642 1004128 1008693 1013266 1017765 1021884 1025232 1027626 1029247 1030607 1032364 1035021 1038590 1042528 1046196
52191 1046196 1049474 1052815 1056563 1060420 1063855 1066843 1069785 1072672 1074838 1075744 1075580 1074645 1072480 1068238 1061898
52176A061898p386p485p703q469q921q133o385m778l906l423k806j991j138l07
52162I89067L74O42O27J057K383L918M449L684K513J744J278P65M06N26P74N08
52146A014715j99n17M3J091J998K640L230L730L851L528L067K799K828L222M150
52131A050176N650P410Q992J0365J1902J3854J6132J8666K1555K4536K6777K7819
52119A243834K8420K9714L1491L2275L1305K9672K8800K8486K7319K4737K1683
52108A557736J9219J7285J5204J2708J0021P373M948L118K104J427J91j863l944
52095A645527n195n783o631q199j0014j1513j2828j4413j6199j7577j8113j7950
52083A501112j7513j7105j6722j5997j4400j1858r040o678m671k284O67L440N293
$$ plain form
52176 1061898 1054512 1047027 1039324 1030855 1021934 1013801 1007416 1002638 998732 995309 992503 990512 989374 989067
52162 989067 989441 990083 990710 991767 994150 998068 1002517 1006201 1008714 1010458 1011736 1012501 1012907 1013433 1014207 1014715
52146 1014715 1014516 1013999 1014042 1015133 1017131 1019771 1023001 1026731 1030582 1034110 1037177 1039976 1042804 1046026 1050176
52131 1050176 1055826 1063236 1072228 1082593 1094495 1108349 1124481 1143147 1164702 1189238 1216015 1243834
52119 1243834 1272254 1301968 1333459 1365734 1397039 1426711 1455511 1483997 1511316 1536053 1557736
52108 1557736 1576955 1594240 1609444 1622152 1632173 1639546 1644494 1647612 1649716 1651143 1651334 1649471 1645527
52095 1645527 1640332 1634549 1627918 1619719 1609705 1598192 1585364 1570951 1554752 1537175 1519062 1501112
52083 1501112 1483599 1466494 1449772 1433775 1419375 1407517 1398477 1391799 1387128 1384844 1385511 1388951 1394244
$$ [...]
##END NTUPLES=NMR SPECTRUM
##END=
