##TITLE=AC1542_ROEFFECT0012_8215128_l67O6OVqZC
##JCAMPDX= 6.0         $$ Bruker NMR JCAMP-DX V2.0
##DATA TYPE= NMR SPECTRUM
##DATA CLASS= NTUPLES
##ORIGIN= BRUKER
##OWNER= Administrator
$$ 1.72 TOPSPIN		Version 2.1
$$ 2014-08-04 22:08:17.120 -0700  Administrator@X
$$ Compression mode = diff/dup
##.OBSERVE FREQUENCY= 400.02188249412
##.OBSERVE NUCLEUS= ^1H
##.ACQUISITION MODE= SIMULTANEOUS (DQD)
##.ACQUISITION SCHEME= undefined
##.AVERAGES= 8
##.DIGITISER RES= 22
##SPECTROMETER/DATA SYSTEM= spect
##.PULSE SEQUENCE= zg30
##.SOLVENT NAME= COFFEE_meoh
##.SHIFT REFERENCE= INTERNAL, COFFEE_meoh, 1, 14.98509
##AUDIT TRAIL= $$ (NUMBER, WHEN, WHO, WHERE, PROCESS, VERSION, WHAT)
$$ ##TITLE= Audit trail, TOPSPIN		Version 2.1
$$ ##JCAMPDX= 5.01
$$ ##ORIGIN= Bruker BioSpin GmbH
$$ ##OWNER= Administrator
$$ $$ E:\/data/COFFEE/nmr/AC1542_ROEFFECT0012_8215128_l67O6OVqZC/20/pdata/1/auditp.txt
$$ ##AUDIT TRAIL=  $$ (NUMBER, WHEN, WHO, WHERE, PROCESS, VERSION, WHAT)
(   1,<2014-08-04 22:08:09.575 -0700>,<Administrator>,<X>,<go>,<TOPSPIN 2.1>,
      <created by zg
	started at 2014-08-04 22:07:03.527 -0700,
	POWCHK enabled, PULCHK disabled,
       configuration hash MD5:
       16 EA D6 F4 BB 67 03 14 9B FF E7 A0 43 5B 48 2E
       data hash MD5: 64K
       F6 7B 60 A0 34 81 4E 01 AC 07 5C AC CA 6B 5E 5E>)
(   2,<2014-08-04 22:08:12.841 -0700>,<Administrator>,<X>,<proc1d>,<TOPSPIN 2.1>,
      <Start of raw data processing
       efp LB = 0 FT_mod = 6 PKNL = 1 PHC0 = 0 PHC1 = 0 SI = 32K 
       data hash MD5: 32K
       5B 8D 11 54 F7 D6 9D 37 E0 8E 6F E4 2B 58 6C C8>)
(   3,<2014-08-04 22:08:13.184 -0700>,<Administrator>,<X>,<proc1d>,<TOPSPIN 2.1>,
      <pk PHC0 = 113.2581 PHC1 = 0 
       data hash MD5: 32K
       8D FC 60 44 73 1C 94 F6 61 57 7B 4C E3 A3 EE 8B>)
(   4,<2014-08-04 22:08:13.339 -0700>,<Administrator>,<X>,<proc1d>,<TOPSPIN 2.1>,
      <abs ABSG = 1 
       data hash MD5: 32K
       17 89 17 B9 E4 3C 41 27 D0 EA C3 9A 08 07 E8 2B>)
(   5,<2014-08-04 22:08:13.408 -0700>,<Administrator>,<X>,<proc1d>,<TOPSPIN 2.1>,
      <abs ABSG = 2 
       data hash MD5: 32K
       3F 37 6C 2B 28 FF B5 72 53 30 DE 3F C9 09 2A ED>)
(   6,<2014-08-04 22:08:13.528 -0700>,<Administrator>,<X>,<proc1d>,<TOPSPIN 2.1>,
      <abs ABSG = 3 
       data hash MD5: 32K
       24 39 99 FB 99 36 8E 14 97 15 A7 A7 CE 75 73 DD>)
(   7,<2014-08-04 22:08:13.614 -0700>,<Administrator>,<X>,<proc1d>,<TOPSPIN 2.1>,
      <abs ABSG = 4 
       data hash MD5: 32K
       50 A6 32 51 8C 41 EB CB 54 F3 4A A8 BA 6E 77 92>)
(   8,<2014-08-04 22:08:13.700 -0700>,<Administrator>,<X>,<proc1d>,<TOPSPIN 2.1>,
      <abs ABSG = 5 
       data hash MD5: 32K
       62 6C 0C 5C 9C D0 CC 43 0F 5C 25 E5 78 18 0A B8>)
$$ ##END=
$$ 
$$ $$ hash MD5
$$ $$ BF 63 97 0E 87 43 54 1B CF CD 37 43 D7 21 A0 A3
##$RELAX= 
##$RELAX= 
##$RELAX= 
##$RELAX= 
##$RELAX= 
##$RELAX= 
##$RELAX= 
$$ Bruker specific parameters
$$ --------------------------
##$DU= <E:\>
##$EXPNO= 20
$$ [...]
##$TP= (0..7)
150 150 150 150 150 150 150 150
##$TP07= 0
##$TPNAME0= <>
##$TPNAME1= <>
##$TPNAME2= <>
##$TPNAME3= <>
##$TPNAME4= <>
##$TPNAME5= <>
##$TPNAME6= <>
##$TPNAME7= <>
##$TPOAL= (0..7)
0.5 0.5 0.5 0.5 0.5 0.5 0.5 0.5
##$TPOFFS= (0..7)
0 0 0 0 0 0 0 0
##$TUNHIN= 0
##$TUNHOUT= 0
##$TUNXOUT= 0
##$USERA1= <user>
##$USERA2= <user>
##$USERA3= <user>
##$USERA4= <user>
##$USERA5= <user>
##$V9= 5
##$VALIST= <valist>
##$VCLIST= <CCCCCCCCCCCCCCC>
##$VD= 0
##$VDLIST= <DDDDDDDDDDDDDDD>
##$VPLIST= <PPPPPPPPPPPPPPP>
##$VTLIST= <TTTTTTTTTTTTTTT>
##$WBST= 1024
##$WBSW= 4
##$XGAIN= (0..3)
0 0 0 0
##$XL= 0
##$YL= 0
##$YMAX_a= 665955
##$YMIN_a= -576433
##$ZGOPTNS= <>
##$ZL1= 120
##$ZL2= 120
##$ZL3= 120
##$ZL4= 120
##$ABSF1= 14.98509
##$ABSF2= -5.573092
##$ABSG= 5
##$ABSL= 3
##$ALPHA= 0
##$AQORDER= 0
##$ASSFAC= 0
##$ASSFACI= 0
##$ASSFACX= 0
##$ASSWID= 0
##$AUNMP= <proc_prof1d_extract_pilot.lims>
##$AXLEFT= 0
##$AXNAME= <>
##$AXNUC= <1H>
##$AXRIGHT= 0
##$AXTYPE= 0
##$AXUNIT= <>
##$AZFE= 0.1
##$AZFW= 0.1
##$BCFW= 0
##$BC_mod= 0
##$BYTORDP= 0
##$COROFFS= 0
##$CY= 15
##$DATMOD= 1
##$DC= 0
##$DFILT= <>
##$DTYPP= 0
##$F1P= 0
##$F2P= 0
##$FCOR= 0.5
##$FTSIZE= 32768
##$FT_mod= 6
##$GAMMA= 0
##$GB= 0
##$INTBC= 1
##$INTSCL= 1
##$ISEN= 128
##$LB= 0
##$LEV0= 0
##$LPBIN= 0
##$MAXI= 10000
##$MC2= 0
##$MEAN= 0
##$ME_mod= 0
##$MI= 0
##$NCOEF= 0
##$NC_proc= -8
##$NLEV= 6
##$NOISF1= 0
##$NOISF2= 0
##$NSP= 0
##$NTH_PI= 0
##$NZP= 0
##$OFFSET= 14.98509
##$PC= 1
##$PHC0= 113.2581
##$PHC1= 0
##$PH_mod= 1
##$PKNL= yes
##$PPARMOD= 0
##$PPDIAG= 0
##$PPIPTYP= 0
##$PPMPNUM= 2147483647
##$PPRESOL= 1
##$PSCAL= 4
##$PSIGN= 0
##$PYNMP= <proc.py>
##$REVERSE= no
##$SF= 400.02
##$SI= 32768
##$SIGF1= 0
##$SIGF2= 0
##$SINO= 400
##$SIOLD= 32768
##$SPECTYP= <>
##$SREGLST= <1H.CDCl3>
##$SSB= 0
##$STSI= 32768
##$STSR= 0
##$SW_p= 8223.68421052631
##$SYMM= 0
##$S_DEV= 0
##$TDeff= 65536
##$TDoff= 0
##$TI= <>
##$TILT= no
##$TM1= 0
##$TM2= 0
##$TOPLEV= 0
##$USERP1= <user>
##$USERP2= <user>
##$USERP3= <user>
##$USERP4= <user>
##$USERP5= <user>
##$WDW= 1
##$XDIM= 32768
##$YMAX_p= 475147885
##$YMIN_p= -687535
##$CURPLOT= <Network HP LaserJet P1505>
##$CURPRIN= <$Network HP LaserJet P1505>
##$DFORMAT= <normdp>
##$LAYOUT= <+/1D_H.xwp>
##$LFORMAT= <normlp>
##$PFORMAT= <normpl>
##$SURQMSG= 1
$$ End of Bruker specific parameters
$$ ---------------------------------
##NTUPLES= NMR SPECTRUM
##VAR_NAME=  FREQUENCY,     SPECTRUM/REAL,   SPECTRUM/IMAG
##SYMBOL=    X,             R,               I
##VAR_TYPE=  INDEPENDENT,   DEPENDENT,       DEPENDENT
##VAR_FORM=  AFFN,          ASDF,            ASDF
##VAR_DIM=   32768,         32768,           32768
##UNITS=     HZ,            ARBITRARY UNITS, ARBITRARY UNITS
##FACTOR=    0.250966925370066, 1,           1
##FIRST=     8223.43324360094, -285594,      -69935
##LAST=      0,             -38403,          -56185
##MIN=       0,             -687535,         0
##MAX=       8223.43324360094, 475147885,    0
$$ Real data points
##PAGE= N=1
##DATA TABLE= (X++(R..R)), XYDATA
$$ [...]
19505d89417a53276K4951A72110D7405c40335A77274B1378d98413M5264g7354
$$ -489417 -153276 -128325 172110 47405 -340335 177274 21378 -498413 -453149 -77354
19494a29587a7033A28420E0621b70831J02907B27512d3719j95003p5559d9385
$$ -129587 -17033 128420 50621 -270831 -167924 227512 -43719 -238722 -314281 -49385
19483b03923E8156c1523j41382G900K1495a59571o603B049d8720F477a38184C7782
$$ -203923 58156 -31523 -172905 7900 29395 -159571 -166174 2049 -48720 6477 -138184 37782
19470b36043h5659E7824d4025j78395J0590Q1972j58046A361b77500a35028D69373
$$ -236043 -85659 57824 -44025 -222420 -211830 -129858 -287904 1361 -277500 -135028 469373
19458h3866m0013k75697A25532R1194I1258e137A70903a80017M798A40628b70474
$$ -83866 -123879 -399576 125532 216726 91258 -5137 170903 -180017 -175219 140628 -270474
19446I4489Q1083b70264A90287b43219C1002m12a43176B14405c25876M7159J29433
$$ 94489 175572 -270264 190287 -243219 31002 30590 -143176 214405 -325876 -278717 -149284
19435a49284b3349a0733j63731A15200N9472p9284b28664g5682a2668r5515B3959
$$ -149284 -23349 -10733 -174464 115200 174672 95388 -228664 -75682 -12668 -108183 23959
19423b68360A7469L2017j8479Q7270b02109f2793k536B38689a55107D28300b26806
$$ -268360 17469 49486 31007 118277 -202109 -62793 -65329 238689 -155107 428300 -226806
19411A18106N3042c68532C35978a29356A70217b67415j25366a61659e7962l63167
$$ 118106 171148 -368532 335978 -129356 170217 -267415 -392781 -161659 -57962 -421129
19401d21129A9097H65b03160A47276a77885j82459D3986j6691K90186a19124b6119
$$ -421129 19097 865 -203160 147276 -177885 -360344 43986 27295 317481 -119124 -26119
19389g5672j11091L124F0100c4533p4529a7465p0875A1684a6459j73750N7512
$$ -75672 -186763 -183639 60100 -34533 -109062 -17465 -88340 11684 -16459 -190209 -132697
19378a32697H3732c9660j56189e0414I0305e6564k26782D8875b32561B06075B972
$$ -132697 83732 -39660 -195849 -50414 90305 -56564 -283346 48875 -232561 206075 2972
19366c50111h6107E1534a10330L822j2424m4032P3337n7570k49164g6446j88477
$$ -350111 -86107 51534 -110330 -106508 -118932 -162964 -89627 -147197 -396361 -76446 -264923
19355b64923M6554c92l08037k5077A5547J72429a33606k23216A70946a90811j61834
$$ -264923 -218369 -392 -308429 -333506 15547 187976 -133606 -356822 170946 -190811 -352645
19344c52645a47886K3013E9780M0757J01620D9339a4188k05580P5946B35074c89712
$$ -352645 -147886 -124873 59780 100537 202157 49339 -14188 -219768 -143822 235074 -389712
19332C35784a0575C02225I2844c1266D45207G4653h188D2960a50000C0c02732
$$ 335784 -10575 302225 92844 -31266 445207 74653 -8188 42960 -150000 30 -302732
19320c9659k1792C40550b06921k60518b6005k02329B3475P3767a82203B7383J92311
$$ -39659 -61451 340550 -206921 -467439 -26005 -228334 23475 97242 -182203 27383 219694
19309B19694c18743a05116j4468B06718p4902c07015O9424C69206j64158c21845
$$ 219694 -318743 -105116 -119584 206718 131816 -307015 -237591 369206 205048 -321845
19298b33015D8460b30267P9062b5093r6526j68348J138G482f1652l49400c8231
$$ -233015 48460 -230267 -151205 -25093 -121619 -289967 -288829 7482 -61652 -411052 -38231
19286a79647B48931j04016C0974a70499A8645O2178b43828A99705L7563f7171
$$ -179647 248931 144915 30974 -170499 18645 80823 -243828 199705 237268 -67171
19275a02948L5402j6982D4614h0665I1997a24272A59109a31903J8165l49336a28216
$$ -102948 -67546 -84528 44614 -80665 91997 -124272 159109 -131903 -113738 -463074 -128216
19263e34249b51796R7851A85765a05008a5167m5079j14987M5786I0600a38929
$$ -534249 -251796 -153945 185765 -105008 -15167 -60246 -175233 -129447 90600 -138929
19252A80913b17182g2242A30245b70847k00829J10949N1764A6712J39041a41168
$$ 180913 -217182 -72242 130245 -270847 -471676 -360727 -308963 16712 155753 -141168
19241B52321a40154e0250j81603a0917j81251k47018h7910B5736a32434d1988
$$ 252321 -140154 -50250 -231853 -10917 -192168 -439186 -87910 25736 -132434 -41988
19230I1605J6003b27158A91591b22984A32047h4222A34494a27647N1169G1307
$$ 91605 107608 -227158 191591 -222984 132047 -84222 134494 -127647 -76478 71307
19219B17824c7892N082j8047D4564J36267c16803B10136G6573h3483K6063E9721
$$ 217824 -37892 -32810 -50857 44564 180831 -316803 210136 76573 -83483 -57420 59721
19207h094E0327b25102d456k9095k9835m64056G8744h7872K4709m2687o6826C62213
$$ -8094 50327 -225102 -4456 -33551 -63386 -527442 78744 -87872 -63163 -105850 -172676 362213
19194d86029A10194g0419k04080r599a05722c0553B529a49359j0994j01446A95431
$$ -486029 110194 -70419 -274499 -284098 -105722 -30553 2529 -149359 -160353 -261799 195431
19182B37687A10697A7087f5275C58101E4662K65167a45m2035C7914M4271b09939
$$ 237687 110697 17087 -65275 358101 54662 319829 -145 -42180 37914 82185 -209939
19170b02607P9305l71q8393A9922J05321a69493B09236c17523j4290D4577c49035
$$ -202607 -123302 -123673 -212066 19922 125243 -169493 209236 -317523 -331813 44577 -349035
19158f1898l12603A7359A046O0466j3504a01010l12516c7529j64308r8096a14821
$$ -61898 -374501 17359 1046 61512 48008 -101010 -413526 -37529 -201837 -299933 -114821
19146a35244j5368O1074A12729b90794e3291G4247a01047A33372C2836J15685
$$ -135244 -150612 -89538 112729 -290794 -53291 74247 -101047 133372 32836 148521
19136A48521e5220l52336a14927p317M2705I8353J51821E5573a48344b442j29710
$$ 148521 -55220 -407556 -114927 -122244 -79539 98353 250174 55573 -148344 -2442 -132152
19125a32152a4963j47988B8380J19812c15223C53417D2949I603K16505G0917L18448
$$ -132152 -14963 -162951 28380 148192 -315223 353417 42949 9603 226108 70917 389365
19114C89365a12256O226D2224g81j91660k14302J48541A89890B2626b63456g1173
$$ 389365 -112256 -106030 42224 -781 -192441 -406743 -258202 189890 22626 -263456 -71173
19102B4331a07649p9600f2642B2481f9244j31973k5089i7531J6834m6202o6821
$$ 24331 -107649 -187249 -62642 22481 -69244 -201217 -226306 -97531 -80697 -126899 -193720
19091a93720A28351N2676q2381a50373q8007L6035B78423b8983k46706R1820d9037
$$ -193720 128351 181027 98646 -150373 -238380 -202345 278423 -28983 -275689 -183869 -49037
19079c32785C6079J2880b3407r7707A03923K3962b04513D0158d53755a04846k12571
$$ -332785 36079 48959 -23407 -121114 103923 127885 -204513 40158 -453755 -104846 -317417
19068c17417A77107c7569D48286a79579a3969j84447A73794F7500B3569a52463
$$ -317417 177107 -37569 448286 -179579 -13969 -198416 173794 67500 23569 -152463
19057a24157j43419C6965e8169b2040A5297K69346b77435A00991b45563D3059
$$ -124157 -267576 36965 -58169 -22040 15297 284643 -277435 100991 -245563 43059
19046a1344A56239d8932F3858b64130a12454j03069D6444J23776a80860d4604
$$ -11344 156239 -48932 63858 -264130 -112454 -215523 46444 170220 -180860 -44604
19035f072j3914B38482j05400O5850f8995A17640h1192A42710L3582e8477l13310
$$ -6072 -19986 238482 133082 198932 -68995 117640 -81192 142710 176292 -58477 -371787
19024c71787h5518B12828I2801C4228a04414F7322h435j34877B38770H3112b54197
$$ -371787 -85518 212828 92801 34228 -104414 67322 -8435 -143312 238770 83112 -254197
19012b48124r0085M1839J16002b3614K519A06425a88162A86802r0128L9903D4505
$$ -248124 -338209 -296370 -180368 -23614 -21095 106425 -188162 186802 96674 136577 44505
19000a66852I1893d1615B2773a38071A29597a12916N3781n1985k2041c152G6016
$$ -166852 91893 -41615 22773 -138071 129597 -112916 -59135 -111120 -133161 -3152 76016
18988b06776a3772B18903q0440o1839f0643j73690A54366b01423C3247a23610
$$ -206776 -13772 218903 138463 76624 -60643 -234333 154366 -201423 33247 -123610
18977B1715b26883l5559G5886b179o9441A68494a87168F3500J12916C5145K83190
$$ 21715 -226883 -262442 75886 -2179 -71620 168494 -187168 63500 176416 35145 318335
18966C18335G9121g6659r3455b0164A97955J21808m6563b90466B12470a14523
$$ 318335 79121 -76659 -170114 -20164 197955 319763 273200 -290466 212470 -114523
18955A36762d2434I9100a09919r6835A3976b6410D3311c5580C59768a57436A80756
$$ 136762 -42434 99100 -109919 -206754 13976 -26410 43311 -35580 359768 -157436 180756
18943i0743n604k33856A61727f7599j24568k37397a00065d492j41703B83264F2462
$$ -90743 -96347 -330203 161727 -67599 -192167 -429564 -100065 -4492 -146195 283264 62462
18931b54827C396c25910A89068j8955a48046e7981F4809a19011A08890f296n4280
$$ -254827 3396 -325910 189068 170113 -148046 -57981 64809 -119011 108890 -6296 -60576
18920f0576B08008r2764c11753B28216b1020k68242A4388J6590b60510R905n5808
$$ -60576 208008 115244 -311753 228216 -21020 -289262 14388 30978 -260510 -250605 -306413
18909c06413j41853f4871k0786r3255A39967o1120O8610a7263H4239k5640L828
$$ -306413 -448266 -64871 -85657 -178912 139967 78847 147457 -17263 84239 58599 62427
18898F2427b25490d3782l1072G2503c66947a11132j28995g3848j00041d6891o7861
$$ 62427 -225490 -43782 -74854 72503 -366947 -111132 -240127 -73848 -173889 -46891 -114752
18887a14752o443A91359C5796J77292H068a33166k25344B16989k6670b5276A00807
$$ -114752 -121195 191359 35796 213088 8068 -133166 -358510 216989 190319 -25276 100807
18875I0357J70474g4108F7998A2210e2090a6491k73887F3612K37074A17983j9642
$$ 90357 260831 -74108 67998 12210 -52090 -16491 -290378 63612 300686 117983 98341
18864I8341b44659k99820c295j41221K9515j57439J21678l3197a3495p5003G4926
$$ 98341 -244659 -544479 -3295 -144516 -115001 -272440 -150762 -183959 -13495 -88498 74926
18852c39013c1781B0483E133Q3887b20333c4981G6128a23189B1241i1867m5314
$$ -339013 -31781 20483 5133 89020 -220333 -34981 76128 -123189 21241 -91867 -137181
18841a37181f2592I0934c24047A01495a42710j71063a01698n8736j8694j6019
$$ -137181 -62592 90934 -324047 101495 -142710 -313773 -101698 -160434 -179128 -195147
18831a95147B5184a5943D7407b4124a0757m53209i8614M7592A40598f2026E2872
$$ -195147 25184 -15943 47407 -24124 -10757 -463966 -98614 -51022 140598 -62026 52872
18819A53852b72112h1345l84448E1595g6903p1394A76981L1914a43471B3072a64956
$$ 153852 -272112 -81345 -465793 51595 -76903 -148297 176981 208895 -143471 23072 -164956
18807a0952p945A739Q6881a07254A41245O2042b9085I5376b11687A04477Q486
$$ -10952 -18897 1739 88620 -107254 141245 203287 -29085 95376 -211687 104477 112963
18796A12963d7880C3037K0216J12533P8204f5657f598I4695J84412a67862A13226
$$ 112963 -47880 33037 53253 165786 243990 -65657 -6598 94695 279107 -167862 113226
18784h6863C62435c76864G5792h3849G7059B5652c62615E0575a55533o6645g9868
$$ -86863 362435 -376864 75792 -83849 77059 25652 -362615 50575 -155533 -222178 -79868
18772A49873J2175a22357A1576a25036E8978K40347a33904K5812j36527B022J6473
$$ 149873 162048 -122357 11576 -125036 58978 299325 -133904 -108092 -244619 2022 18495
18761A8495b49596h7750F9543A4896a16513A2696b94446R4333L6075m6463f785
$$ 18495 -249596 -87750 69543 14896 -116513 12696 -294446 -200113 -164038 -210501 -6785
18749A88650a6542j65512d767E78731I13b47430J05378O6356C7762a25084p0125
$$ 188650 -16542 -182054 -4767 578731 913 -247430 -142052 -75696 37762 -125084 -195209
18738a95209B52607c37633B67586i8436B93163b63931E8030J42206b58646c0927
$$ -195209 252607 -337633 267586 -98436 293163 -263931 58030 200236 -258646 -30927
18727b3682l81670a8764A1746K16703c53131C12866g9840C01151a9248l31413
$$ -23682 -405352 -18764 11746 228449 -353131 312866 -79840 301151 -19248 -350661
18717c50661R9696A22447J00899c70044a25816B46909b24805G6028a17115N923
$$ -350661 -250965 122447 223346 -370044 -125816 246909 -224805 76028 -117115 -111192
18707a11192L7261G2427a15183A36420a7218D1503a66911o3073j19065a57240
$$ -111192 -73931 72427 -115183 136420 -17218 41503 -166911 -229984 -349049 -157240
18696b46497A72677c57889d6565B01521d33092I1167R5773a88080D4249b6976
$$ -246497 172677 -357889 -46565 201521 -433092 91167 186940 -188080 44249 -26976
18685a79457j59515R9760i2376j37575B92794B4847d19462i1469A45560C5474
$$ -179457 -338972 -239212 -92376 -229951 292794 24847 -419462 -91469 145560 35474
18674d453k78832B00097d5618A20015a36084B56053a13328j64355h4392f955j67705
$$ -4453 -283285 200097 -45618 120015 -136084 256053 -113328 -277683 -84392 -6955 -174660
18663a74660A48639b70q7864k27040a13918f059k47729m6504E9462f3884j16048
$$ -174660 148639 -270 -88134 -315174 -113918 -6059 -253788 -300292 59462 -63884 -179932
18652a79932f3240j14394K5706r558F8482b2894k36443E5547c96084a08487D2840
$$ -179932 -63240 -177634 -151928 -161486 68482 -22894 -259337 55547 -396084 -108487 42840
18640d35960f6203A91400l2522G7704c22493a20364p2067D296a50926C4206b28100
$$ -435960 -66203 191400 158878 77704 -322493 -120364 -192431 4296 -150926 34206 -228100
18628H78K0457L00346c4585L521l2613A7333d16727J98745G5474a88965A80207
$$ 878 21335 321681 -34585 -31064 -63677 17333 -416727 -217982 75474 -188965 180207
18616h1264n7226j18106h1412A10770b6292I0508c4853k55430B04674b37818a5499
$$ -81264 -138490 -256596 -81412 110770 -26292 90508 -34853 -290283 204674 -237818 -15499
18604c4552k94842j44680a52686k17122A44800g2144k3055H5417J8647I633P1538
$$ -34552 -329394 -474074 -152686 -369808 144800 -72144 -95199 85417 104064 9633 81171
18593H1171i2767B29831a31321A12371J52037A19423a75703j51552D9886i5946
$$ 81171 -92767 229831 -131321 112371 264408 119423 -175703 -327255 49886 -95946
18582a24742q425D1352b47499A77525Q9818b29373B0446O1275b8474C93540e2162
$$ -124742 -133167 41352 -247499 177525 267343 -229373 20446 81721 -28474 393540 -52162
18570A71493c7582r5015L491o8643Q7404J0362M0539l17349A51289b3194j22494
$$ 171493 -37582 -132597 -129106 -197749 -110345 -99983 -59444 -376793 151289 -23194 -145688
18559a45688m74144a08194d8343H3439J7560e0505D3030J9190a31815B77954A8115
$$ -145688 -619832 -108194 -48343 83439 100999 -50505 43030 62220 -131815 277954 18115
18547b2810k21929d2867j79485f3541k35975N3040g4659F6786d6278A53624J21563
$$ -22810 -244739 -42867 -222352 -63541 -299516 -246476 -74659 66786 -46278 153624 275187
18536B75187a10425p4490E0750a9498k23987A44379c51285g1647A56788p4365
$$ 275187 -110425 -184915 50750 -19498 -243485 144379 -351285 -71647 156788 82423
18526H2423K3071a72951A98388m0803L5859C209i5611F2894a80338c9474n6119
$$ 82423 105494 -172951 198388 157585 193444 3209 -95611 62894 -180338 -39474 -95593
18515i5593b9067j40026d3622p5930r8715E5667B6122b2721j16963B27738C7487
$$ -95593 -29067 -169093 -43622 -119552 -218267 55667 26122 -22721 -139684 227738 37487
18503c78101c6653l31233C2457K88583J10E7309a15027F2459B3946a92179A56054
$$ -378101 -36653 -367886 32457 321040 321150 57309 -115027 62459 23946 -192179 156054
18491c07389A7361e91002b19130C8943a92958I3433b03111Q9603G2135b09210
$$ -307389 17361 -591002 -219130 38943 -192958 93433 -203111 -113508 72135 -209210
18480G3650c3044A10852R1495J4990f9090n4085O1490E532M46d0538j06870b3474
$$ 73650 -33044 110852 202347 217337 -69090 -123175 -61685 5532 5978 -40538 -147408 -23474
18467F3013K5145Q0707a57065e2598k93927i0172A28185a14152G9541b30522R7456
$$ 63013 88158 168865 -157065 -52598 -346525 -90172 128185 -114152 79541 -230522 -133066
18456a33066A26970F3266b07702o9695j42947B46232B9300d2499r80I6851E026
$$ -133066 126970 63266 -207702 -277397 -420344 246232 29300 -42499 -43479 96851 5026
18444a13446j38823g7768G7091a42264C5985d17616a81439a5084j04815j3044
$$ -113446 -252269 -77768 77091 -142264 35985 -417616 -181439 -15084 -119899 -132943
18434a32943K2840B61534b20523c0710A22851a96966j82250A59286c45591A31038
$$ -132943 -110103 261534 -220523 -30710 122851 -196966 -379216 159286 -345591 131038
18423A27320a45118k7741A7352J62762J94668A53671a54427A2873A760K14325
$$ 127320 -145118 -172859 17352 180114 374782 153671 -154427 12873 1760 216085
18413B16085k5968p0373f3036B27912m4043a92158j53046a42965M4124L3703m4972
$$ 216085 190117 119744 -63036 227912 183869 -192158 -345204 -142965 -98841 -65138 -110110
18402a10110l2999a306j21346m2459d5396B82763e733l11800a8785E0326C797
$$ -110110 -143109 -1306 -122652 -165111 -45396 282763 -5733 -317533 -18785 50326 3797
18390b8896E2124b1942l36662A7134J3011J09377d3747j75012a7946A63562G0005
$$ -28896 52124 -21942 -358604 17134 30145 139522 -43747 -218759 -17946 163562 70005
18378c25774F6072J18500k8244k3202C0511G597O6003l6465b65170m4487h8578
$$ -325774 66072 184572 156328 133126 30511 7597 73600 37135 -265170 -309657 -88578
18366A29382L248b19374I4894a80676I5394b8522m59o7403j06542R7672k1525
$$ 129382 132630 -219374 94894 -180676 95394 -28522 -28981 -96384 -202926 -105254 -126779
18355a26779H3374C2048a405E1142a73491o1253p4676K7185R7734E9280a835A92759
$$ -126779 83374 32048 -1405 51142 -173491 -234744 -309420 -282235 -184501 59280 -1835 192759
18342a70061c4571j54796D28898a48022J3452D4555M4020d1947B8898K35283R849
$$ -170061 -34571 -189367 428898 -148022 -134570 44555 88575 -41947 28898 264181 274030
18331B74030c96577e2091F8015k4303b68126j66189C7153h044j89974C44966f5986
$$ 274030 -396577 -52091 68015 43712 -268126 -434315 37153 -8044 -198018 344966 -65986
18319g6972H2971a43363E7629b47806F5192g680p4133B75732A01035R5994c620
$$ -76972 82971 -143363 57629 -247806 65192 -7680 -81813 275732 101035 197029 -3620
18307c47102J70441Q5402n5100h355k46121B65231a82902R240a5331j0947j9438
$$ -347102 -176661 -91259 -146359 -8355 -254476 265231 -182902 -173662 -15331 -26278 -45716
18296d5716a99o2935K6325B22159c62456B1642a69411A37474K24409a72844j7485
$$ -45716 -199 -63134 -36809 222159 -362456 21642 -169411 137474 361883 -172844 -190329
18285a90329E3582N3442k7715a77966K189A75379b5243B2948a84081C0154L10959
$$ -190329 53582 107024 79309 -177966 -175777 175379 -25243 22948 -184081 30154 341113
18274C41113b09925H36b31356N8015k27121a67384A34995G256a26412r8252b3089
$$ 341113 -209925 836 -231356 -173341 -400462 -167384 134995 7256 -126412 -224664 -23089
18262a39308D7823a3127n93141a02710n6927I6488L35769j48175a07123C22029
$$ -139308 47823 -13127 -606268 -102710 -159637 96488 432257 284082 -107123 322029
18251G9392L508f8730m9900B47975a4987j91700l5989A46748g1082A24514M0742
$$ 79392 82900 -68730 -118630 247975 -14987 -206687 -242676 146748 -71082 124514 165256
18240A65256a35235e8073C0080e8398B65687l9261d4680C9914R7326c331B97494
$$ 165256 -135235 -58073 30080 -58398 265687 226426 -44680 39914 137240 -3331 297494
18228a92638d814p0226j53877j19897m3714a88669A39507f0357k47449i0331k35457
$$ -192638 -4814 -75040 -228917 -348814 -392528 -188669 139507 -60357 -307806 -90331 -325788
18217c25788a42553j30361A98304a53633c265k159A45920f9198n4617j07403j6951
$$ -325788 -142553 -272914 198304 -153633 -3265 -5424 145920 -69198 -123815 -231218 -248169
18206b48169A77516b8316C0306r95J72419A9371a28716j65542A0518a45938A03257
$$ -248169 177516 -28316 30306 29311 201730 19371 -128716 -294258 10518 -145938 103257
18194h4961E9566J12429J67206G925D45b67152h3208k13041a02220M9322a3419
$$ -84961 59566 171995 339201 7925 445 -267152 -83208 -296249 -102220 -52898 -13419
18182a7765k25710J21726d920I3620c42873J43757f9738m4173k4505f5748a5189
$$ -17765 -243475 -121749 -4920 93620 -342873 -199116 -69738 -113911 -138416 -65748 -15189
18170b32079B57329a21471A10985P2387a40489j55606A36928k6874P0957q4222
$$ -232079 257329 -121471 110985 183372 -140489 -296095 136928 110054 181011 96789
18160I6789b7084A93670b01852M0204H5843i8152B5545b62949O4148k9844Q6573
$$ 96789 -27084 193670 -201852 -161648 85843 -98152 25545 -262949 -198801 -228645 -142072
18149a42072n5432K5286c0946H5330a69o1894K5785j30587c7949R439j87598i5082
$$ -142072 -197504 -172218 -30946 85330 -169 -62063 -36278 -166865 -37949 -28510 -216108 -95082
18136a60867j57058J23780B8339a03919K965K2794A01672a67605A00350c3602
$$ -160867 -317925 -194145 28339 -103919 -100954 -78160 101672 -167605 100350 -33602
18125a44444g1869E9702P3918a29617I4408a09849d7210B35996b19176A25863
$$ -144444 -71869 59702 133620 -129617 94408 -109849 -47210 235996 -219176 125863
18114B52482G5274a88484j12482B19989a38939f0715r2939D5007b75409A4993
$$ 252482 75274 -188484 -300966 219989 -138939 -60715 -153654 45007 -275409 14993
18103F5901h1756m9733N8124j63265c5743I9302d2573j35072K0923B47687a77655
$$ 65901 -81756 -131489 -73365 -236630 -35743 99302 -42573 -177645 -156722 247687 -177655
18091A46112d9569k04344E104a40543L2717B4969J67762p5043N1597K5895b25477
$$ 146112 -49569 -253913 5104 -140543 -107826 24969 192731 117688 169285 195180 -225477
18079b8362m4799p7328A63028h9262j9757M6390l88911J94059C5351a75936o5444
$$ -28362 -73161 -150489 163028 -89262 -109019 -62629 -451540 -257481 35351 -175936 -241380
18068b41380j17624A31751a12464A50082A3007M3338a50247K561A22806a07680
$$ -241380 -359004 131751 -112464 150082 13007 56345 -150247 -147686 122806 -107680
18057D0427f6042K4259j26950O5415r2728L2295b1389A12891M8967G7969e0099
$$ 40427 -66042 -41783 -168733 -103318 -196046 -163751 -21389 112891 161858 77969 -50099
18045g9039B01836a87578f7054K7611k65467J33531H1480d530B360b21156B66696
$$ -79039 201836 -187578 -67054 -39443 -304910 -171379 81480 -4530 2360 -221156 266696
18033b91778B28981e5519j3557A61479f6260r2509B23272J86408A04104a91611
$$ -291778 228981 -55519 -69076 161479 -66260 -158769 223272 409680 104104 -191611
18022c15930g3155j96102R6548H3932e3053D93J97401a22000H2405k9003L0582
$$ -315930 -73155 -269257 -172709 83932 -53053 493 197894 -122000 82405 53402 83984
18011H3984a48467c8155B97634b72714k2861N0190A34289b52307j45517a4829
$$ 83984 -148467 -38155 297634 -272714 -295575 -245385 134289 -252307 -397824 -14829
18000c20225B1626J8761b14860A7004Q1455P8364b8568A22816a17970n6040E6942
$$ -320225 21626 40387 -214860 17004 98459 176823 -28568 122816 -117970 -174010 56942
17988h9465C9394d55268d0288H9896b22237f2184o532A15731J8135E6016g2354
$$ -89465 39394 -455268 -40288 89896 -222237 -62184 -68716 115731 133866 56016 -72354
17976a0399n1231A66016l5140m1867c856B35180L6884a94381e583l1315k29477
$$ -10399 -61630 166016 130876 89009 -3856 235180 272064 -194381 -5583 -36898 -266375
17965b66375H9609a13324q2845A8650M3453f3765k89322A8593c6488I1179M787
$$ -266375 89609 -113324 -196169 18650 62103 -63765 -353087 18593 -36488 91179 95966
17954I5966G72K52244b31461B38492c57176J03992N5048k82788A11402J68276
$$ 95966 772 253016 -231461 238492 -357176 -253184 -198136 -480924 111402 279678
17944B79678a09641g503A66301O2645C9512b67500k6796a43321A48631m5492b75220
$$ 279678 -109641 -7503 166301 228946 39512 -267500 -294296 -143321 148631 103139 -275220
17932D5965a30098F4217a01799k53043G7766N241B2169K09010F2935P5692k1166
$$ 45965 -130098 64217 -101799 -354842 77766 83007 22169 231179 62935 138627 117461
17921A17461b20029B49068A00010e99678B48056p9275a68865N8567c2058J3341
$$ 117461 -220029 249068 100010 -599678 248056 168781 -168865 -110298 -32058 -18717
17911a8717E7101k2034b78215B9064a01674a7489j72881D34028B6291b33681B30961
$$ -18717 57101 35067 -278215 29064 -101674 -17489 -190370 434028 26291 -233681 230961
17899B30556n7893d605F4570J17245A6666e9184k019E462a82094h6328K8646k0240
$$ 230556 172663 -4605 64570 181815 16666 -59184 -61203 5462 -182094 -86328 -57682 -77922
17887g7922A5737h9521p4403k5501K2214I3995L5879N2576a58912A93881g1756
$$ -77922 15737 -89521 -163924 -189425 -167211 93995 129874 182450 -158912 193881 -71756
17875c03780A80694a58280k5619A51787L1475b28798A002a92213A77448a46167
$$ -303780 180694 -158280 -183899 151787 183262 -228798 1002 -192213 177448 -146167
17864a82844M5912q401i445D125b95566B08622b7188G9774O2084c9017B00797
$$ -182844 -136932 -145333 -9445 4125 -295566 208622 -27188 79774 141858 -39017 200797
17852A05898J30883C2519a39766B37387O2354A07982c09928J09745J6875H6927
$$ 105898 236781 32519 -139766 237387 299741 107982 -309928 -200183 -183308 86927
17841B56340G6015R5239i8128n6877I2084O4604a48713e7517k57207G6466J34552
$$ 256340 76015 171254 -98128 -155005 92084 156688 -148713 -57517 -314724 76466 211018
17830B11018N9769r4271e1613A2152h8416G4793k6791a7832G8411P2382b26669
$$ 211018 270787 176516 -51613 12152 -88416 74793 48002 -17832 78411 150793 -226669
17818e8391n6783j1881n3075c5503B54040A24260b1176A51295b41885e853k20374
$$ -58391 -115174 -127055 -180130 -35503 254040 124260 -21176 151295 -241885 -5853 -226227
17807b26227L6445d2722I159a4789m620k09995D69801G4083J80228C2410b76644
$$ -226227 -189782 -42722 9159 -14789 -19409 -229404 469801 74083 254311 32410 -276644
17795A03778f2921k247C6379R5910A3310a56444A74180i2765C07496H4740J50223
$$ 103778 -62921 -65168 36379 132289 13310 -156444 174180 -92765 307496 84740 234963
17784B34963c74867h5503A92758o7024l1339l5094b13345B64000B6291e9036L321
$$ 234963 -374867 -85503 192758 125734 94395 59301 -213345 264000 26291 -59036 -55715
17773e5715A9225a61467K9076A917K40974i352A06958c6755B3407b41493L2819
$$ -55715 19225 -161467 -132391 1917 242891 -9352 106958 -36755 23407 -241493 -208674
17762b08674J3809D3234K35761A36720C9770a39241A04473E2042P4107A4170K93763
$$ -208674 -194865 43234 278995 136720 39770 -139241 104473 52042 126149 14170 307933
17751C07933c01125J43958A71865G2407b7031I6079i5561r4621B61776a45181
$$ 307933 -301125 -157167 171865 72407 -27031 96079 -95561 -190182 261776 -145181
17740b51292f8122K0700A76719b39178C97186A879K85778F7387c09824d8346A44826
$$ -251292 -68122 -47422 176719 -239178 397186 1879 287657 67387 -309824 -48346 144826
17728D5838d0214C2647M2168C1971B753a07111k22141a13623q8485e7868A40662
$$ 45838 -40214 32647 74815 31971 2753 -107111 -329252 -113623 -202108 -57868 140662
17716c37899J61110j2029C243K6151J75986a49192j11290A07070h0638j25059
$$ -337899 -176789 -188818 3243 29394 205380 -149192 -260482 107070 -80638 -205697
17706b05697C18210A52529e0017a657A2806M24218a20589l2925B1355O8900a30068
$$ -205697 318210 152529 -50017 -1657 12806 437024 -120589 -153514 21355 90255 -130068
17694A40309b51133D6881J84478b9880p7277r5344D8985b5140C45757G6859k6677
$$ 140309 -251133 46881 231359 -29880 -107157 -202501 48985 -25140 345757 76859 50182
17683E0182j9740O2547k8907c14352I9169e7936l367A78929a70517H9710J27916
$$ 50182 30442 92989 64082 -314352 99169 -57936 -61303 178929 -170517 89710 217626
17672B17626B4409k725J2866E744J03652f8761A4284K16538a49310j7735C85427
$$ 217626 24409 21684 34550 5744 109396 -68761 14284 230822 -149310 -167045 385427
17660b10752H9080a45085I8820a13581l6936A50500a18203E546b8637j88165f9110
$$ -210752 89080 -145085 98820 -113581 -150517 150500 -118203 5546 -28637 -216802 -69110
17648c8990k25389j8302c5233A09074b42838N2896A49979b53387A0204f6885k9463
$$ -38990 -264379 -282681 -35233 109074 -242838 -189942 149979 -253387 10204 -66885 -96348
17637i6348A32446J41201c41503B89525P3539j54337b73214H5337Q321l485J24782
$$ -96348 132446 273647 -341503 289525 363064 208727 -273214 85337 93658 90173 214955
17626B14955c42147c3963B41471a19605K1472H7695J3885j006C9920J52372c4087
$$ 214955 -342147 -33963 241471 -119605 -98133 87695 101580 100574 39920 192292 -34087
17614B11119a2334j3692J2753j38988H1728J72962q8745D1002j5619a44542f3531
$$ 211119 -12334 -26026 -13273 -152261 81728 254690 165945 41002 25383 -144542 -63531
17602A04296a80942b0318h895C2937J64747e2611A05211j5505e2410D66187b1736
$$ 104296 -180942 -20318 -8895 32937 197684 -52611 105211 89706 -52410 466187 -21736
17590B64971E1895e6628B89819F3680K5413L35759a8885A83719m1377Q7560I0411
$$ 264971 51895 -56628 289819 63680 89093 424852 -18885 183719 142342 229902 90411
17578d6096b2370C4991M40734A39091a59858A57942l8510K88900a17160B33440
$$ -46096 -22370 34991 475725 139091 -159858 157942 119432 408332 -117160 233440
17567B21138a17488A73842J4953o9339a05632j84916K7954F4733b09667B0217
$$ 221138 -117488 173842 188795 119456 -105632 -290548 -262594 64733 -209667 20217
17556a15052j32000J13748o8114e3677E02535a6648H4161e289l9000B03266C6498
$$ -115052 -247052 -133304 -201418 -53677 502535 -16648 84161 -5289 -44289 203266 36498
17544A33269l8650m1456c1698A61221b8239A80181K4729I7328O0894a8779H2163
$$ 133269 94619 53163 -31698 161221 -28239 180181 204910 97328 158222 -18779 82163
17532c8153B79383H965b7309E44876A83888N6535j03445m1308J09704j0782k1099
$$ -38153 279383 8965 -27309 544876 183888 240423 136978 95670 205374 194592 173493
17521A73493H314a40874j47649d9062A64209J01339k8600m9558p2157a26969N1256
$$ 173493 8314 -140874 -288523 -49062 164209 265548 236948 187390 115233 -126969 -75713
17510g5713A74747q2959n745K0909f7812A20609i1243B20522K89512B41067r1591
$$ -75713 174747 91788 86043 106952 -67812 120609 -91243 220522 510034 241067 149476
17499A49476b03781C36698A65640b8718d13E0299b4109E0195K74171c24780b4798
$$ 149476 -203781 336698 165640 -28718 -413 50299 -24109 50195 324366 -324780 -24798
17487A65094L38754A88774M231M6856H1136a57726D18448e5788B0474k78J27775
$$ 165094 503848 188774 193005 239861 81136 -157726 418448 -55788 20474 20196 147971
17476A47971L36733B23830p0456R3061e4117A94726i1830A27105f4338N740A28529
$$ 147971 484704 223830 153374 246435 -54117 194726 -91830 127105 -64338 -58598 128529
17464F3112L84058a19492j8911B4397J74885p2702A3224M3345L40894E8710f7423
$$ 63112 447170 -119492 -138403 24397 199282 126580 13224 56569 397463 58710 -67423
17452A11388J32821b18671e1504f416A8239K50134J28596A54052a66065B14647
$$ 111388 244209 -218671 -51504 -6416 18239 268373 396969 154052 -166065 214647
17441A11751n3723a50337c4046j67739n9431A78059K56888j43671a2750A29674
$$ 111751 58028 -150337 -34046 -201785 -261216 178059 434947 291276 -12750 129674
17430B71417A24141D6116J20704J03094j280M3974j51006k4556l6453O6137J93323
$$ 271417 124141 46116 166820 269914 268634 312608 161602 137046 100593 166730 360053
17419C60053J3382I7598m2230a07268I8116O6781L87070B19322J50455A69402
$$ 360053 373435 97598 55368 -107268 98116 164897 551967 219322 369777 169402
17408A70655l3598j5485M7485J05343G1163L17356j78983k3450K78721B09139
$$ 170655 137057 121572 169057 274400 71163 388519 209536 186086 464807 209139
17397B60425j08165M22945j98442j3832L2323l8272L746n3667q4506a83609E20499
$$ 260425 152260 575205 376763 362931 395254 356982 360728 307061 222555 -183609 520499
17385G8170K7572J0928J25319n5054J85293n1879j41086J70188d6883A6165K00397
$$ 78170 105742 116670 241989 186935 372228 320349 179263 349451 -46883 16165 216562
17374B16562D6490N41025f3824C49012l2911j43618a51848G2940k3546K34279
$$ 216562 46490 587515 -63824 349012 316101 172483 -151848 72940 49394 283673
17364B83673j23196j051l6927A0640L80916H4542L58573g5123B97061j00709K34975
$$ 283673 160477 159426 122499 10640 391556 84542 443115 -75123 297061 196352 431327
17353D31327j22414m4041h5555A48993L86964g498D55165C6435f3618A50504F9937
$$ 431327 308913 264872 -85555 148993 535957 -7498 455165 36435 -63618 150504 69937
17341F6586a54444A97791D7874P9094M6931R8971o8069B4714L06813I2036K0631
$$ 66586 -154444 197791 47874 126968 173899 272870 204801 24714 331527 92036 112667
17330A12667C5464L49450j9681b84980C53616f6065B85711a9827H3928Q8071c9915
$$ 112667 35464 384914 365233 -284980 353616 -66065 285711 -19827 83928 171999 -39915
17318H1629j2564M5269L57980A67037J40595a0483B82912J94378o3946a02986
$$ 81629 69065 114334 472314 167037 307632 -10483 282912 477290 413344 -102986
17307E2272O9516K02282o8445b46860A42306h338C43434h4290B36535J9491r2019
$$ 52272 121788 324070 255625 -246860 142306 -8338 343434 -84290 236535 256026 164007
17296A64007E7577j1959e2941A13318J75558A27861K38221E7864P7696P5811K30445
$$ 164007 57577 45618 -52941 113318 288876 127861 366082 57864 135560 211371 441816
17285D41816a46386B70405B7413J0532K34504a13696C64608j44433r1886J00780
$$ 441816 -146386 270405 27413 37945 272449 -113696 364608 220175 128289 229069
17275B29069K4362a30365A77J5832K46552M5954o7867j2899P972J4939K31597
$$ 229069 253431 -130365 177 16009 262561 308515 240648 227749 235721 250660 482257
17264D82257j39849A13072J00695J1890J14146p2394K61609B4090a57747C66410
$$ 482257 342408 113072 213767 225657 339803 267409 529018 24090 -157747 366410
17253C05784A48704a75233C03008r4526E1604J98222L2705L18848A96054L02865
$$ 305784 148704 -175233 303008 208482 51604 249826 282531 601379 196054 498919
17243D98919Q6039B13413K76946A87409J97472H6823J43381L4338e3980B0530
$$ 498919 584958 213413 490359 187409 384881 86823 230204 264542 -53980 20530
17232A11969a8960E48903k09517j06533H1511J80991K16401F876L65296a66844
$$ 111969 -18960 548903 339386 232853 81511 262502 478903 6876 372172 -166844
17221C88213a3468A90327F201M86850H781a14815A99065J07630C7984L22975m017
$$ 388213 -13468 190327 6201 493051 8781 -114815 199065 306695 37984 360959 356942
17210C56942j08660A18653f7633B24865b07284D7220K65788R6024k0769a4393
$$ 356942 248282 118653 -67633 224865 -207284 47220 313008 409032 388263 -14393
17199A78127n2253M89401A29841R6142G3829L61844j88149A13129L78083c07557
$$ 178127 125874 615275 129841 225983 73829 435673 247524 113129 491212 -307557
17188E65596A69507O723J72694J108b35544D23433E962L68853j25129j01097L29594
$$ 565596 169507 176230 348924 350032 -235544 423433 5962 374815 249686 148589 478183
17177D78183A17227J37831A10068P6849M02404G1140A3475K20958J0061K124B4170
$$ 478183 117227 255058 110068 186917 589321 71140 13475 234433 244494 246618 24170
17165C27463c8602J3035B67655J68373F2367L02572A78344J54541J42963q1891
$$ 327463 -38602 -25567 267655 436028 62367 364939 178344 332885 475848 393957
17155C93957j26305J42002j80048L3536K62952R1187j38697A74024O5453N5220
$$ 393957 267652 409654 229606 263142 526094 617281 478584 174024 239477 294697
17145B94697k8512r798N8851j18789B8374M31874j0469j39542K6097j9077L7294
$$ 294697 266185 256387 315238 196449 28374 460248 449779 310237 336334 317257 354551
17134C54551J05964j23837p5618j0006C2534L05001j25222n2686E4999O62151
$$ 354551 460515 336678 261060 251054 32534 337535 212313 159627 54999 717150
17124G17150A15829M70339Q3052B15015R2019N1060A51521L19284j92260K2275
$$ 717150 115829 586168 669220 215015 307034 358094 151521 470805 278545 300820
17114C00820L09980C01787Q5390J58672k08887M14686j23771k44050G2800J84805
$$ 300820 610800 301787 387177 545849 336962 751648 627877 383827 72800 257605
17104B57605K35763A99800L58615O670A07396M15845j69279j23077n9098K38691
$$ 257605 493368 199800 558415 565085 107396 523241 353962 230885 171787 410478
17094D10478k28J93289A59853K30801m7938M3543J26340J2422j3206A57313J56904
$$ 410478 410250 603539 159853 390654 342716 386259 512599 525021 511815 157313 314217
17083C14217J02331L0208N4162A62550J3974J92030L6356J50294B51687J40899
$$ 314217 416548 446756 500918 162550 176524 368554 404910 555204 251687 392586
17073C92586K09736j73653P7362j04435J40491j92192P2170J02104m0723B00701
$$ 392586 602322 428669 506031 401596 542087 349895 422065 524169 483446 200701
17062D78542J29493J57796l75299J09884J36286r0613k27237L64265j71686j75672
$$ 478542 608035 765831 390532 500416 636702 546089 318852 683117 511431 335759
17052C35759L76778n3794O5778L7733D3830L41161M8232M95387m33319O2951J16961
$$ 335759 712537 658743 724521 762254 43830 384991 433223 928610 495291 558242 675203
17041F75203n1014j49925K53060l46099M16533j37377B95449K27317l2996Q5447
$$ 675203 624189 474264 727324 381225 797758 660381 295449 522766 489770 575217
17031E75217J42991l50801J49220O7174R8623N6727B53502K07439K26239J19443
$$ 575217 718208 367407 516627 583801 682424 739151 253502 460941 687180 806623
17021H06623Q537l37198J00027k18134M54832O9764D37087o3983K25648Q5704
$$ 806623 815160 477962 577989 359855 814687 884451 437087 373104 598752 684456
17011F84456j76972K88657k46719J50082J29526l13021J79070p0057J32936j11867
$$ 684456 507484 796141 549422 699504 829030 516009 695079 625022 757958 646091
17001F46091O0295J37324j02644K8970K8267j69093K22487j12504Q7756J03604
$$ 646091 706386 843710 741066 770036 798303 629210 851697 739193 826949 930553
16991I30553l31124M2546j9292q6863R2934N35020l02167j58363Q3824j38041
$$ 930553 599429 641975 622683 535820 628754 1163774 861607 703244 787068 649027
16981F49027M85677J2114E70785K64618M5035Q0752j31776j44271K10301O6058
$$ 649027 1134704 1146818 570785 835403 880438 961190 829414 685143 895444 961502
16971I61502l40301L94638m949P7950k93245R0417L4128P9621q5938j61990O6671
$$ 961502 621201 1015839 1010890 1088840 795595 886012 920140 999761 913823 751833 818504
16960H18504L03772p211j96085k38398N55224r8605P7001k70994J10542q6208
$$ 818504 1122276 1115065 918980 680582 1235806 1137201 1214202 943208 1053750 967542
16950I67542M86075l64858K15861m53272K69201m8459k6756L69703k0047m72326
$$ 967542 1453617 1088759 1304620 851348 1120549 1072090 1045334 1415037 1394990 922664
16940I22664L29544k42003l8451J37442J25359j34358J8328J76774K18300m18595
$$ 922664 1252208 1010205 971754 1109196 1234555 1100197 1118525 1295299 1513599 1095004
16930A095004P8353M25561j90785J37694k26298N3226M8994l52150M04477l78307
$$ 1095004 1173357 1598918 1408133 1545827 1319529 1372755 1421749 1069599 1474076 1095769
16920A095769R8175j49991L71401p5909j79697M29409m78193K19818J20298k87056
$$ 1095769 1193944 1043953 1415354 1339445 1159748 1589157 1110964 1330782 1451080 1164024
16910A164024L24448j01546K32489L03996n13599J19395p5061N5907N1400j2596
$$ 1164024 1488472 1386926 1619415 1923411 1409812 1529207 1454146 1510053 1561453 1548857
16900A548857Q5375O7595K7076k11865R4515j99336L26866q1631M61603l42395
$$ 1548857 1634232 1701827 1728903 1517038 1611553 1412217 1739083 1657452 2119055 1776660
16890A776660L3033l27258K46399l8861L24997j24728J60630j84403J4305l08385
$$ 1776660 1809693 1482435 1728834 1689973 2014970 1890242 2050872 1866469 1880774 1572389
16880A572389N37432L5675l74350K20163K13905R695r4870n3408N6991j56121
$$ 1572389 2109821 2145496 1771146 1991309 2205214 2214909 2120039 2066631 2123622 1967501
16870A967501K50457L4235R431k65709K25119J79842j27965k40531P04758k59630
$$ 1967501 2217958 2252193 2261624 1995915 2221034 2400876 2272911 2032380 2737138 2477508
16860B477508J16520n111K87519k19476j797m8823K81539j3824m54514M48361
$$ 2477508 2594028 2588917 2876436 2656960 2655163 2606340 2887879 2874055 2419541 2867902
16850B867902r3030N40165l16859p0174j90736J67729L3757p0040K92362n8998
$$ 2867902 2774872 3315037 2998178 2928004 2737268 2904997 2938754 2868714 3161076 3102078
16840C102078M939J14854J40295j34545j15696J26709L45728n28169M60844N20926
$$ 3102078 3107017 3221871 3362166 3227621 3111925 3238634 3584362 3056193 3517037 4037963
16830D037963l35934k64321K62732l2433N03060k24507M3599j55140K98904J70160
$$ 4037963 3702029 3437708 3700440 3668007 4171067 3946560 3990159 3835019 4133923 4304083
16820D304083j90062L2339P3634K23538j91368M02602k17322O4975N4317L30536
$$ 4304083 4114021 4146360 4219994 4443532 4252164 4654766 4437444 4502419 4556736 4887272
16810D887272p5922Q1015L58136k40488J43712n3208L75226R7813J35197j99168
$$ 4887272 4811350 4892365 5250501 5010013 5153725 5100517 5475743 5573556 5708753 5509585
16800E509585L36007p8875K5227J16392K40251R6073M6305K46207J15097J18675
$$ 5509585 5845592 5766717 5791944 5908336 6148587 6244660 6290965 6537172 6652269 6770944
16790F770944J56007K47392R8978K678K92274k36577L21901M50789j9507L52767
$$ 6770944 6926951 7174343 7273321 7275999 7568273 7331696 7653597 8104386 8084879 8437646
16780H437646J60018O5823J88280J68624K90756L06517J49665p3725L88213M70057
$$ 8437646 8597664 8663487 8851767 9020391 9311147 9617664 9767329 9693604 10081817 10551874
16770A0551874K89143L08708k02148N78076J00729Q69466k43877M42295O54016
$$ 10551874 10841017 11149725 10947577 11525653 11626382 12495848 12251971 12694266 13348282
16761A3348282j98006L82970L31162K95478N61901L84053N58191M09284O74044
$$ 13348282 13150276 13533246 13864408 14159886 14721787 15105840 15664031 16073315 16747359
16752A6747359K34575J42700P38329Q15387P33046K67044P51207O74161P25555
$$ 16747359 16981934 17124634 17862963 18678350 19411396 19678440 20429647 21103808 21829363
16743B1829363M70372J123543M92457J031266P93482J111037P45542J051402J060526
$$ 21829363 22299735 23423278 23915735 24947001 25740483 26851520 27597062 28648464 29708990
16734B9708990J264549J291838P94097J538417J701756J586028J382955J724650
$$ 29708990 30973539 32265377 33059474 34597891 36299647 37885675 39268630 40993280
16726D0993280J771229K155311J490623K119138K425175K240689K248737K904236
$$ 40993280 42764509 44919820 46410443 48529581 50954756 53195445 55444182 58348418
16718E8348418K764002K781859L150722L618839L126084L907972L746647M226566
$$ 58348418 61112420 63894279 67045001 70663840 73789924 77697896 81444543 85671109
16710H5671109M300577M393598N029163M780432M877159N235935N281742N355232
$$ 85671109 89971686 94365284 99394447 104174879 109052038 114287973 119569715 124924947
16702A24924947N554617N690018N011855N049915N131104M448102M271974L261695
$$ 124924947 130479564 136169582 141181437 146231352 151362456 155810558 160082532 163344227
16694A63344227L229676K349473J473831R03269j32097j208006j759789k377429
$$ 163344227 166573903 168923376 170397207 171300476 171168379 169960373 168200584 165823155
16686A65823155k960114l978318m077042m916152m682540n331470n454185n534764
$$ 165823155 162863041 158884723 154807681 149891529 145208989 139877519 134423334 128888570
16678A28888570n627875n626658n260469n396761m960295n153215m462425m781902
$$ 128888570 123260695 117634037 112373568 106976807 102016512 96863297 92400872 87618970
16670H7618970m173157m218339m088531l676858l472967l242201l427282k828365
$$ 87618970 83445813 79227474 75138943 71462085 67989118 64746917 61319635 58491270
16662E8491270k783175k502858k234715k381750k322449j792027k604248j101393
$$ 58491270 55708095 53205237 50970522 48588772 46266323 44474296 41870048 40768655
16654D0768655k026204j378072j910304j278973j671393q64192j564138r16027
$$ 40768655 38742451 37364379 35454075 34175102 32503709 31639517 30075379 29159352
16646B9159352j258714j190538r42703p12134q82550j081289n24668j159165o60852
$$ 29159352 27900638 26710100 25767397 25055263 24172713 23091424 22566756 21407591 20746739
16637B0746739o13102n93168p24191n09735r85291j88123m45053q40230l66913
$$ 20746739 20133637 19540469 18816278 18306543 17321252 17133129 16688076 15847846 15480933
16628A5480933j13047n14885q98213J77536p01645m4796n31819n39243o800n52677
$$ 15480933 15367886 14853001 13954788 14132324 13430679 13385883 12854064 12314821 12308021 11755344
16618A1755344j71138n17290l57839j91457q0964l18720J755o79268k31794l44410
$$ 11755344 11584206 11066916 10709077 10517620 10436656 10117936 10119691 9440423 9208629 8864219
16608H864219l8209j85408K46402m16907k57357j30927l59690J90441n39170j72654
$$ 8864219 8826010 8640602 8887004 8470097 8212740 8081813 7722123 7912564 7373394 7200740
16598G200740J0938k13350l91218M8345j70339k28538K01819k19831j73264k4032
$$ 7200740 7211678 6998328 6607110 6655455 6485116 6256578 6458397 6238566 6065302 6041270
16588F041270l85320J16975q1574l50451J96766m35519Q3522p2773l23123L10514
$$ 6041270 5655950 5772925 5691351 5340900 5537666 5102147 5185669 5112896 4789773 5100287
16578E100287j11097q47036K41656L26939K4353n56798J30118q8694l15445q5178
$$ 5100287 4989190 4142154 4383810 4710749 4735102 4178304 4308422 4219728 3904283 3819105
16568C819105O5223J63025l13447R2699p2342J66861q9417o40888O29142l71779
$$ 3819105 3884328 4047353 3733906 3826605 3754263 3921124 3831707 3190819 3819961 3448182
16558C448182L12664p03896R0991J67122m3903j36589l22574O6027m131K94757
$$ 3448182 3760846 3056950 3147941 3315063 3271160 3134571 2811997 2878024 2873893 3168650
16548C168650o83367J64686k5657K03610j36815m05036M98208j98947k3443j18711
$$ 3168650 2485283 2649969 2624312 2827922 2691107 2286071 2784279 2585332 2561889 2443178
16538B443178N7961K5033k76777J51862j22088K63505m85449N1341M26125q9665
$$ 2443178 2501139 2526172 2249395 2401257 2279169 2542674 2057225 2108566 2534691 2445026
16528B445026l83278N6953K14845k26202l37705L11831k82422K16963j88013L7418
$$ 2445026 2061748 2118701 2333546 2107344 1769639 2081470 1799048 2016011 1827998 1865416
16518A865416p9108m0656K16688j97145L52237J39010n52835K20545J02017l71976
$$ 1865416 1786308 1745652 1962340 1765195 2117432 2256442 1703607 1924152 2026169 1654193
16508A654193K40338n8268l38360L69692k10120k22983l4712k485L17192k18915
$$ 1654193 1894531 1836263 1497903 1867595 1657475 1434492 1399780 1397295 1714487 1495572
16498A495572J60964m0453l92878J30502L05693m0892j23456k7372l08446J29985
$$ 1495572 1656536 1616083 1223205 1353707 1659400 1618508 1495052 1467680 1159234 1289219
16488A289219N5779j54947K86662j07431j34019q8987p662o4733K69159j19423
$$ 1289219 1344998 1190051 1476713 1369282 1235263 1146276 1138614 1073881 1343040 1223617
16478A223617N3036l50057L11951l04196J26448K23027j48212O0925m4425j60325
$$ 1223617 1276653 926596 1238547 934351 1060799 1283826 1135614 1196539 1152114 991789
16468I91789J28132J9083M7415k04020j48488L67597r6888l93911N50988n51255
$$ 991789 1119921 1139004 1186419 982399 833911 1201508 1104620 710709 1261697 710442
16458G10442N14408l76212K60233k49414j08793L10170n1028j56027N8070l82698
$$ 710442 1224850 848638 1108871 859457 750664 1060834 1009806 853779 911849 529151
16448E29151M53028k91153L73276k37357O1561j88954K29657k6791o664k40405
$$ 529151 982179 691026 1064302 826945 888506 699552 929209 902418 895754 655349
16438F55349M26387j26335k52876k66903M80240N2333l74574Q7196j88037O02344
$$ 655349 1081736 955401 702525 435622 915862 968195 593621 680817 492780 1095124
16428A095124j24577J64368m48432K09581C56100N19018l19958K58222j45284
$$ 1095124 970547 1134915 686483 896064 356100 875118 555160 813382 668098
16419F68098j68412J89652M4524P5385k08913k67814L46018J41971k6472j55919
$$ 668098 499686 689338 733862 809247 600334 332520 678538 820509 794037 638118
16409F38118p2044K62573Q824J24513j91864k95891L25926o933C41800m7691J04962
$$ 638118 566074 828647 837471 961984 770120 474229 800155 793222 341800 294109 399071
16398C99071M16215C63397K94615k84746L62152o5108L9162k24843J83624K33968
$$ 399071 815286 363397 658012 373266 735418 670310 709472 484629 668253 902221
16388I02221l92657J67527k35601J90746j84379j12813M29977C52250J27408Q6495
$$ 902221 509564 677091 441490 632236 447857 335044 765021 352250 479658 566153
16378E66153B13018K99178j5222L13831l32342Q4056j48497k0713A72416M39915
$$ 566153 213018 512196 496974 810805 478463 562519 414022 393309 172416 612331
16368F12331L06965B47056J05661Q3669k9308O6134M6225M1625F7508L76266A61844
$$ 612331 919296 247056 352717 436386 407078 473212 519437 561062 67508 443774 161844
16356C16929L472K61984j11143o5932j67715J74988A53831M59704N1771l26401
$$ 316929 320401 582385 471242 405310 237595 412583 153831 613535 665306 338905
16346C38905P8399q0092m1691M2336G4504N95436A41264M25240l9971K9309B68307
$$ 338905 417304 337212 295521 337857 74504 669940 141264 566504 526533 555842 268307
16334E12967k8810B15004J0490J00178k8473k920o1649K5430K17713j81542j42901
$$ 512967 484157 215004 225494 325672 297199 294279 232630 258060 475773 294231 151330
16323A51330k977a32872C62580n8900k8531j16822C4948J75028K24790j44027
$$ 151330 148353 -132872 362580 303680 275149 158327 34948 209976 434766 290739
16313B90739J92614l4879q2110J85841B63154p5193l2650K23516n1240o6202P0722
$$ 290739 483353 448474 366364 552205 263154 187961 155311 378827 327587 261385 332107
16302C32107j48645m4410K92204A87188J0339B6861O93093j17556r4681D0659
$$ 332107 183462 139052 431256 187188 197527 26861 719954 602398 507717 40659
16291B46061J36707A41398P3150H0214K51520j740J1558k0385H3154J2854K61600
$$ 246061 382768 141398 214548 80214 331734 329994 341552 321167 83154 96008 357608
16280C57608I1792i637j17780B34898K11375A83592O9508k2446L16112I2406J28375
$$ 357608 91792 -9637 -127417 234898 446273 183592 253100 230654 546766 92406 220781
16269B20781J22148j49669o4362M7544K43629j7439E8437K29511J37509r7992
$$ 220781 342929 193260 128898 176442 420071 402632 58437 287948 425457 327465
16259C27465A20825D3681J65931a32151d8270A27809n7902a20017B43040K10152
$$ 327465 120825 43681 209612 -132151 -48270 127809 69907 -120017 243040 453192
16249D53192A45261Q8252J17975n203A08318A3622K85347A13996b03695C19328
$$ 453192 145261 233513 351488 346285 108318 13622 298969 113996 -203695 319328
16238A25401A5365M51602j58060J20674a85A76831K72636j75876E3330R5444B7330
$$ 125401 15365 466967 308907 429581 -185 176831 449467 273591 53330 148774 27330
16226A23904c7818j00239D00419A71437c6849C45390b40792G4619f95G2172J5592
$$ 123904 -37818 -138057 400419 171437 -36849 345390 -240792 74619 -695 72172 87764
16215H7764K55763a21207D07644b929A60529p6641a19169N3616j01571A07620
$$ 87764 343527 -121207 407644 -2929 160529 83888 -119169 -65553 -167124 107620
16204b17446E0924P4489a24854L1101A49551J21997A10872j5747K184J2671J10900
$$ -217446 50924 125413 -124854 -93753 149551 271548 110872 95125 97309 109980 220880
16193B20880I3380J01865J15837A06806N319R4724a07342d4760B04899i3700j21891
$$ 220880 93380 195245 311082 106806 112125 206849 -107342 -44760 204899 -93700 -215591
16182b15591H3489i6307C2239A2527K35112h7568B33610P9321D795J21178K70845
$$ -215591 83489 -96307 32239 12527 247639 -87568 233610 312931 4795 125973 396818
16171C96818G8282a77484L1255I0029j3776K18294F4413a95388A84478c80247
$$ 396818 78282 -177484 -146229 90029 76253 294547 64413 -195388 184478 -380247
16160C77172a22222e3025D7534K50071g7030C61087c6118L40j5435J6314E1765
$$ 377172 -122222 -53025 47534 297605 -77030 361087 -36118 -35778 -51213 -34899 51765
16148B8024C701J95571k1555d7945A55208p3125l8148a1154k34160A35286o859
$$ 28024 3701 199272 177717 -47945 155208 82083 43935 -11154 -245314 135286 128427
16137A28427J07720A7395K23131j04077d2241A55929F4830a67170N0821A85254
$$ 128427 236147 17395 240526 136449 -42241 155929 64830 -167170 -116349 185254
16126C70872j65896B2694K60178j11698k3490J20525d8325A83422L10177B28275
$$ 370872 204976 22694 282872 171174 147684 268209 -48325 183422 493599 228275
16115A7863L07645R2280b13504A97947F7320Q0848f3193p677K7999o9199N5687
$$ 17863 325508 417788 -213504 197947 67320 148168 -63193 -70870 -42871 -112070 -56383
16104e6383A14925J86101j4437b7227H7205P8659c7274m6504D05526C5879b2547
$$ -56383 114925 301026 286589 -27227 87205 165864 -37274 -83778 405526 35879 -22547
16092C3650D096a07259A0182a8461C56765e2110B3307a3676A34694j47b86418
$$ 33650 4096 -107259 10182 -18461 356765 -52110 23307 -13676 134694 134547 -286418
16080D0618R1963K34308j47852Q547A06902N11125g6927j34114j2654H813a55415
$$ 40618 132581 366889 219037 227584 106902 618027 -76927 -211041 -223695 8813 -155415
16068b16849A31836J51356b1174A75542a1593l8206B7675J02816c67308J77227
$$ -216849 131836 283192 -21174 175542 -11593 -49799 27675 130491 -367308 -190081
16058a90081c0316k39326A9802K2702a52468m7256B51726c7525A59043b90663
$$ -190081 -30316 -269642 19802 42504 -152468 -199724 251726 -37525 159043 -290663
16047g524D5775O4984b52404A37282B3615b20101C17493A2020f5758A22393A2212
$$ -7524 45775 110759 -252404 137282 23615 -220101 317493 12020 -65758 122393 12212
16035b28183g9426E9444a10680F2189a02421A61970q0965a99284A13183j5368
$$ -228183 -79426 59444 -110680 62189 -102421 161970 81005 -199284 113183 97815
16025I7815J13793a40302E3408J07174P2329E9262J53328C0071i4042C7152J39868
$$ 97815 211608 -140302 53408 160582 232911 59262 212590 30071 -94042 37152 177020
16014A77020D0854b87749i9464A62629b75403d9342m8810B82504A07785a23425
$$ 177020 40854 -287749 -99464 162629 -275403 -49342 -98152 282504 107785 -123425
16003g3191j4586l14033f1551B28316h3047r1515k42209J31855a30232m6799A73129
$$ -73191 -87777 -401810 -61551 228316 -83047 -174562 -416771 -284916 -130232 -177031 173129
15991a86777j97903G4354a77099j06533j9930D3094K45583a47052m9746B00821
$$ -186777 -384680 74354 -177099 -283632 -303562 43094 288677 -147052 -196798 200821
15980a53141f559L276A0880a5273A59902a16152j53382H1132J2979K65074g796
$$ -153141 -6559 -3283 10880 -15273 159902 -116152 -269534 81132 94111 359185 -7796
15968b91420I8822J154C5683P58b08454B39524J0707E7063j6638M05807j24556
$$ -291420 98822 99976 35683 36441 -208454 239524 250231 57063 40425 446232 321676
15957C21676K3293K43557j47761a786A86724R8484B2187d9527j31556g0221m8625
$$ 321676 344969 588526 440765 -1786 186724 285208 22187 -49527 -181083 -70221 -118846
15946a18846c6573B41474a46393H9376c25430g827A3902M9112h5206a297F1829
$$ -118846 -36573 241474 -146393 89376 -325430 -7827 13902 63014 -85206 -1297 61829
15934h9610E0724b25167B43206K60832a65166A30422e1750k5187A80098b54912
$$ -89610 50724 -225167 243206 504038 -165166 130422 -51750 -76937 180098 -254912
15923C00675E9040a92411K9263K9830A32283A949i5790j22306A78324a41415e1404
$$ 300675 59040 -192411 -163148 -133318 132283 1949 -95790 -218096 178324 -141415 -51404
15911A11440d46030K21545F2947a0142A05381a4718j98430f1448k16741b530k4361
$$ 111440 -446030 -224485 62947 -10142 105381 -14718 -213148 -61448 -278189 -2530 -26891
15900b6891j42483L4811F831L8869K305b43853F8764b44467E0146h0089A40095
$$ -26891 -169374 -134563 6831 45700 48005 -243853 68764 -244467 50146 -80089 140095
15888B20034d7856A7664a09626B37556j5778O0003c11283B80627a1475j17537
$$ 220034 -47856 17664 -109626 237556 221778 281781 -311283 280627 -11475 -129012
15878a29012H4914K03952p7371D4597a16573I5856a09951B01782G2061c892B79506
$$ -129012 84914 288866 211495 44597 -116573 95856 -109951 201782 72061 -3892 279506
15866A59573J028f9286B15678b65168B66567a19296a247k69317B07440J7964f9553
$$ 159573 160601 -69286 215678 -265168 266567 -119296 -1247 -270564 207440 225404 -69553
15854E7228N1019J74453a28494g345j41483I7535j684b6806A08779J36798B479
$$ 57228 108247 282700 -128494 -7345 -148828 97535 95851 -26806 108779 245577 2479
15842B16384A3868L4489O043b82475J08709p7882i5020A32380A5741g3443A8465
$$ 216384 13868 48357 54400 -282475 -173766 -251648 -95020 132380 15741 -73443 18465
15830C46614A4214c8258D3942i5476B19628q1069a69177j5034A82173d34524b9909
$$ 346614 14214 -38258 43942 -95476 219628 138559 -169177 -184211 182173 -434524 -29909
15818a84255A42224b73748E5969J29616m7512a52583l480A38863b2416H6352J48439
$$ -184255 142224 -273748 55969 185585 138073 -152583 -156063 138863 -22416 86352 234791
15807B34791a59449a1221j71159b9019l7013j6958q0287K9981A08587a62225A25443
$$ 234791 -159449 -11221 -182380 -29019 -66032 -82990 -163277 -133296 108587 -162225 125443
15795e61579E0452h5487a161o08323A2574M4738b14133h6752r8565l2029O0947
$$ -561579 50452 -85487 -1161 -609484 12574 57312 -214133 -86752 -185317 -217346 -156399
15784a56399a7413j92673B22245c00596E7082P7874a63644A26771o933h4382A34635
$$ -156399 -17413 -210086 222245 -300596 57082 134956 -163644 126771 119838 -84382 134635
15772a34777A57475d8799A05910a21621K1404k14282J21674j79868f0513C80659
$$ -134777 157475 -48799 105910 -121621 -100217 -314499 -192825 -372693 -60513 380659
15761h7486A67889L0860h6466I7110O8728b41755A23462a79681H6011b44383J1664
$$ -87486 167889 198749 -86466 97110 165838 -241755 123462 -179681 86011 -244383 -232719
15750b32719a13092q0076N6954L7485m1023b6515k49767d8865g224n2667b7251
$$ -232719 -113092 -193168 -136214 -98729 -139752 -26515 -276282 -48865 -7224 -59891 -27251
15738A44010d8578l0077I1365L02268a11455d950B10799i4310j81789C40373j58447
$$ 144010 -48578 -78655 91365 393633 -111455 -4950 210799 -94310 -276099 340373 181926
15727A81926a21990q1987c3594A11880a90058D6396A7320O3810M7056J55875E8228
$$ 181926 -121990 -203977 -33594 111880 -190058 46396 17320 81130 128186 284061 58228
15715d7034A52254c4370a5945k2753F1276b7485p0567c5184j09068C4328a20449
$$ -47034 152254 -34370 -15945 -38698 61276 -27485 -98052 -35184 -144252 34328 -120449
15703b47783A18276A410L0496q828J78399p9341a76679Q296e3122C4439b74658
$$ -247783 118276 1410 31906 23078 201477 122136 -176679 -168383 -53122 34439 -274658
15691b59332A95370B2784b2343A53172a03486c1727A72839C31M5890b89559A93644
$$ -259332 195370 22784 -22343 153172 -103486 -31727 172839 331 46221 -289559 193644
15679c775l7297j27429A14131C3963b1451l19641a36265A39194b50047I693P9927
$$ -3775 -41072 -168501 114131 33963 -21451 -341092 -136265 139194 -250047 9693 89620
15668H9620g9558H3383J7872M1678E390a41604c266q1184B83483c1726k29340
$$ 89620 -79558 83383 101255 142933 5390 -141604 -3266 -84450 283483 -31726 -261066
15657b61066A38746J41492b46459d6077j6127I09L2685a1377C78977a75527A20290
$$ -261066 138746 280238 -246459 -46077 -62204 909 33594 -11377 378977 -175527 120290
15645B85947C1660K88380b3828k97053f9385p2581F891d3445r4507E6733K43591
$$ 285947 31660 320040 -23828 -320881 -69385 -141966 6891 -43445 -137952 56733 300324
15634C00324E6833L0512l9489b47905J08924K2385l5271k3170A06308b02005C02151
$$ 300324 56833 87345 47856 -247905 -138981 -116596 -151867 -175037 106308 -202005 302151
15622c26387D0064A9165L27149a01828K5998A93499D4803c13939I8196a28332
$$ -326387 40064 19165 346314 -101828 -75830 193499 44803 -313939 98196 -128332
15611D8989a5217A30660b41137A65047G0028J74524a30143j69933q6464a5168
$$ 48989 -15217 130660 -241137 165047 70028 244552 -130143 -300076 -386540 -15168
15600b36760d5972B63822b24985C27460A58950F405i785k02707B84146A36842
$$ -236760 -45972 263822 -224985 327460 158950 6405 -9785 -212492 284146 136842
15589a06820A74135a21717J2017A66709g8637A97440b19408P5252C9922h0925
$$ -106820 174135 -121717 -109700 166709 -78637 197440 -219408 -144156 39922 -80925
15578h6548K9482D2760Q828J04613a62771f081A53314a35519H252J78555J33227
$$ -86548 -57066 42760 51588 156201 -162771 -6081 153314 -135519 8252 186807 320034
15567C20034b53510H9647J42275f9703j82383J02082C6366J04993J4477N7535
$$ 320034 -253510 89647 231922 -69703 -252086 -150004 36366 141359 155836 213371
15557B13371l2025f174A35285A7619b05107K3403j8161H6245a59900c1540m11203
$$ 213371 181346 -6174 135285 17619 -205107 -181704 -199865 86245 -159900 -31540 -442743
15546d42743a122l5406a7270A42519a91863Q4093a4114k96365h7392A10931a49471
$$ -442743 -1122 -36528 -17270 142519 -191863 -107770 -14114 -310479 -87392 110931 -149471
15534b7479p2726j67693A11297J8270a91390b0708N578j51085q4707A2352J01309
$$ -27479 -100205 -267898 111297 129567 -191390 -20708 -15130 -166215 -250922 12352 113661
15523A13661K18147D3762g2253I3240l840i6877A70870m5136E7094K6227c3101
$$ 113661 331808 43762 -72253 93240 89400 -96877 170870 125734 57094 83321 -33101
15511E7165k168c15993h1268j9449k1454E16789H2249J35763a70250B7696G569
$$ 57165 54997 -315993 -81268 -100717 -122171 516789 82249 218012 -170250 27696 7569
15499b12294H2239J3208c50898a68381j08047h7625j09020A16823D3200E610J05653
$$ -212294 82239 95447 -350898 -168381 -276428 -87625 -196645 116823 43200 5610 111263
15488A11263j4074b48507A83905h6993B1661L2676R0849a04414d6267A18264j682
$$ 111263 97189 -248507 183905 -86993 21661 54337 145186 -104414 -46267 118264 116582
15477A16582a30548A89949q2232m0353h8598F9981c09784J11054A34559O78B1056
$$ 116582 -130548 189949 107717 67364 -88598 69981 -309784 -198730 134559 135237 21056
15465A76908q0625K1060a81975m5332I7719b7258q7712B10695C324K53456c4914
$$ 176908 96283 117343 -181975 -227307 97719 -27258 -114970 210695 3324 256780 -34914
15453A67766h9804j00532B80310k2974a44069B00128H2264i7613A9106b44780
$$ 167766 -89804 -190336 280310 257336 -144069 200128 82264 -97613 19106 -244780
15442F098a42180H3666K83085a10608I3754a41809m6421A17954g4508k55738A69341
$$ 6098 -142180 83666 366751 -110608 93754 -141809 -188230 117954 -74508 -330246 169341
15430b74216E5083J715b9927n6700B20434C7293R3549c81275J70308R0451j58979
$$ -274216 55083 56798 -29927 -86627 220434 37293 130842 -381275 -210967 -120516 -279495
15419b79495B88301R6608E3008I326a4192A26224b98727F11426E8384K08837H2078
$$ -279495 288301 384909 53008 9326 -14192 126224 -298727 611426 58384 267221 82078
15407A4958P5929C8750d2286D24648A05719P761J32579G2716a37544G506P44R5873
$$ 14958 90887 38750 -42286 424648 105719 113480 246059 72716 -137544 7506 8250 104123
15395A04123b14726A38497m9433d3196A19874B392c03586h1726c9861A51233a10394
$$ 104123 -214726 138497 89064 -43196 119874 2392 -303586 -81726 -39861 151233 -110394
15383a73599H5851i0515a8489j75653L1114N1416F8947a78215I0069N8889n7221
$$ -173599 85851 -90515 -18489 -194142 -163028 -111612 68947 -178215 90069 148958 91737
15372I1737a30334E1179b03253B13181l761b8742D35425A23521e0633E9829k5635
$$ 91737 -130334 51179 -203253 213181 209420 -28742 435425 123521 -50633 59829 34194
15361C4194d62300J80673h3815q3187M5686j5554g966k4567p2512D85661D2215
$$ 34194 -462300 -281627 -83815 -167002 -121316 -136870 -7966 -32533 -105045 485661 42215
15349h0138A35930b903C0072a63588A39476p363D1027e5744B78192b59681i9833
$$ -80138 135930 -2903 30072 -163588 139476 132113 41027 -55744 278192 -259681 -99833
15337E2028g5429A24577m2410L6101E2816b0186H0345a34686B36620j06928c0293
$$ 52028 -75429 124577 82167 118268 52816 -20186 80345 -134686 236620 129692 -30293
15325A58206b61118Q8333a9545j18939A36672J34998a33666P203j55713A11320
$$ 158206 -261118 -172785 -19545 -138484 136672 271670 -133666 -126463 -282176 111320
15314h1847j18250O4595J2433e4135q1948A23818K2066b04962G0397J28483b16212
$$ -81847 -200097 -135502 -123069 -54135 -136083 123818 145884 -204962 70397 198880 -216212
15302b079H7535b56839I7304R0019k9383i3495K1989l00872g286j43574A74696
$$ -2079 87535 -256839 97304 187323 157940 -93495 -71506 -372378 -7286 -150860 174696
15290a68166m1965B8190O3736a6782H657a19705L9396C95777j01062a20572I1315
$$ -168166 -210131 28190 91926 -16782 8657 -119705 -80309 395777 294715 -120572 91315
15278i8401j31438B05410k1725e6846a2240A09941D4312K36077A396J8226R3580
$$ -98401 -229839 205410 183685 -56846 -12240 109941 44312 280389 1396 19622 113202
15267A13202J31730m8045D4700N3760a82723B85183q7814H6813a56689d9848H5893
$$ 113202 244932 196887 44700 98460 -182723 285183 197369 86813 -156689 -49848 85893
15255b60421H4493L57504c9759F1061M326L61886k08580j3648O8068b43432a0350
$$ -260421 84493 441997 -39759 61061 65387 427273 218693 205045 273113 -243432 -10350
15243b0546B78158f966A01465B1074c0473i139I0209C8720a09127C68574D8274
$$ -20546 278158 -6966 101465 21074 -30473 -9139 90209 38720 -109127 368574 48274
15231A13602k7814a23999j565A81585J36792n5353G0053J83833Q40463M08347
$$ 113602 85788 -123999 -125564 181585 318377 263024 70053 253886 1094349 1502696
15221A502696L4027J59239l4340F09806B90912a23458B67266D8676a30916b4243
$$ 1502696 1536723 1695962 1661622 609806 290912 -123458 267266 48676 -130916 -24243
15210a3896j88139A48655b55448A50447b8142k1085J3718k74485a10916J4994
$$ -13896 -202035 148655 -255448 150447 -28142 -49227 -35509 -309994 -110916 -95922
15200i5922C55614d750C6662a06027k05451D57356I3557K9850a06970B27354o3853
$$ -95922 355614 -4750 36662 -106027 -311478 457356 93557 123407 -106970 227354 163501
15189A63501n5098N9718A2902P5280P5365F3441d3700C75883A83269p5812m5572
$$ 163501 108403 168121 12902 88182 163547 63441 -43700 375883 183269 107457 61885
15178F1885b83387f6975c2649a4178D19825I3969k2535O8590b7723C8571b14176
$$ 61885 -283387 -66975 -32649 -14178 419825 93969 71434 140024 -27723 38571 -214176
15166A93349a35030B51603b12263B27449d5006H3294f0498D55433a40338A07601
$$ 193349 -135030 251603 -212263 227449 -45006 83294 -60498 455433 -140338 107601
15155A04845J02847q6417R5950J11191A6538d7047A4240J27508d8624l6360C95100
$$ 104845 207692 121275 217225 328416 16538 -47047 14240 141748 -48624 -84984 395100
15143a13992A30908d8212B06632K9330K8681a98220j71605I3567J89514j24932
$$ -113992 130908 -48212 206632 235962 264643 -198220 -369825 93567 283081 158149
15133A58149m592O7569b69036A68623g2646A46482M848n7093J13419j01999b24120
$$ 158149 153557 221126 -269036 168623 -72646 146482 151330 94237 207656 105657 -224120
15121B22174B2859J07349C551K44643F0723a58032e5044A08591H315J93922a75111
$$ 222174 22859 130208 3551 248194 60723 -158032 -55044 108591 8315 202237 -175111
15109b99277a05721A07666J33299a164A10757J16360j10114L230N2961m5500m2744
$$ -299277 -105721 107666 240965 -1164 110757 227117 117003 120233 173194 127694 84950
15098H4950A0118J16840b55274I5825K78600K1564j72540K3775g3021C61519a37235
$$ 84950 10118 126958 -255274 95825 374425 395989 223449 247224 -73021 361519 -137235
15086A48686i4944A84769p6665J67846J61822c9770B39906J10480A9616c79890
$$ 148686 -94944 184769 108104 275950 437772 -39770 239906 350386 19616 -379890
15075A96100J13901r8047b04279c1436I7382J27650J05445H706a4090B2541P4298
$$ 196100 310001 211954 -204279 -31436 97382 225032 330477 8706 -14090 22541 96839
15064I6839K15211D1695O6138L9589J88627j3389J35647A2882a59418A35224K3615
$$ 96839 312050 41695 107833 147422 336049 322660 458307 12882 -159418 135224 158839
15053A58839a3811C0119K8443L33458J66480I4824K18763A15153K75275A46172
$$ 158839 -13811 30119 58562 392020 558500 94824 313587 115153 390428 146172
15042A63270D8592L34601e6921A18142L83392B28740Q0039f2735A65135h3976
$$ 163270 48592 383193 -56921 118142 501534 228740 308779 -62735 165135 -83976
15031B46563a23764b5490c505B7567e8033B78997j12417R6176K28343A08761J17076
$$ 246563 -123764 -25490 -3505 27567 -58033 278997 166580 262756 491099 108761 225837
15020B25837p5626d6967D47556I3243B7107K32098r1076c8636B56303N0370A05050
$$ 225837 150211 -46967 447556 93243 27107 259205 168129 -38636 256303 306673 105050
15008f5658A04540a25716B20771G9581N9088R4895j01605L36463F8078B8392L74071
$$ -65658 104540 -125716 220771 79581 138669 233564 131959 468422 68078 28392 402463
14997D02463J36824k65100l0783j05052J23792H9892d3575A29869E8249J42476
$$ 402463 539287 274187 243404 138352 262144 89892 -43575 129869 58249 200725
14987B00725o9618j7067J62292L479G685K36956J66982J74475k68839A9355K00850
$$ 200725 131107 114040 276332 279811 7685 244641 411623 586098 317259 19355 220205
14976B20205J65965A40791a73060B46469J6910J44760B02699K59172B10871J38345
$$ 220205 386170 140791 -173060 246469 263379 408139 202699 461871 210871 349216
14966C49216b7392B77543L2161J66657H1316N7621n8235L12953d8707A57993h0861
$$ 349216 -27392 277543 309704 476361 81316 138937 80702 393655 -48707 157993 -80861
14954A23437K58878G1196J11529K64647I03J81786J10790G2951L84302J5072o8634
$$ 123437 382315 71196 182725 447372 903 182689 293479 72951 457253 472325 403691
14943D03691d0695B28957J22783p5723f8143B24652M56133A75315q2128a03426
$$ 403691 -40695 228957 351740 276017 -68143 224652 680785 175315 93187 -103426
14932B82876L2709A14037m9117N04335B49286k8566k7679J67567L3443f59B20262
$$ 282876 315585 114037 64920 569255 249286 220720 193041 360608 394051 -659 220262
14920D22967j92811J39360J07656a39658A12793Q2772m6013L92445B49602L0162
$$ 422967 230156 369516 477172 -139658 112793 195565 149552 541997 249602 279764
14910B79764K95566B52712J32337H8800J67539K96534i0882C91499A38706J16644
$$ 279764 575330 252712 385049 88800 256339 552873 -90882 391499 138706 255350
14900B55350J29946k2830j32574J0554J91921j61686k7793K47887A66805N2584
$$ 255350 385296 362466 229892 240446 432367 270681 242888 490775 166805 219389
14890B19389o4294j4310J49579p797J80470j98036K06011j9638B00662K82775
$$ 219389 155095 140785 290364 282567 463037 265001 471012 451374 200662 483437
14880D83437K83742A98956K40225j04266A10489J69130G9112L12980A27001o3080
$$ 483437 767179 198956 439181 334915 110489 279619 79112 392092 127001 63921
14870F3921R1520j277g8495B32095K12178p1199j85123O2668J7346O9738f0408
$$ 63921 155441 154164 -78495 232095 444273 373074 187951 250619 267965 337703 -60408
14858c8497B30289K95542A82673Q9545j05641K02596K37761k3653L0933k32719
$$ -38497 230289 525831 182673 272218 166577 369173 606934 583281 614214 381495
14848C81495r5486K08556j96696j16908J39103J71432O637B04423a7689F50635
$$ 381495 286009 494565 297869 180961 320064 491496 498133 204423 -17689 650635
14837A41410Q2226O5170A01709L43460j73068l7232K79369o5309l9269L36960
$$ 141410 223636 288806 101709 445169 272101 234869 514238 448929 409660 746620
14827G46620k57590J15746j69718j25951R3805L08073C28055N3633J33769j87433
$$ 746620 489030 604776 435058 309107 402912 710985 328055 381688 515457 328024
14817C28024K44058M16201D17643J78049I5962N24528j98921j88930J88121j27982
$$ 328024 572082 988283 417643 595692 95962 620490 421569 232639 420760 292778
14807B92778K02168k0363A43066M36469L2470A54415Q8104L08192l6530j05940
$$ 292778 494946 474583 143066 579535 612005 154415 242519 550711 514181 408241
14797D08241J79293L2564j77045J86220p7909J26190J0128j12706k68939K37104
$$ 408241 587534 620098 443053 629273 551364 677554 687682 574976 306037 543141
14787E43141R3420Q4319j63976j94120K50715P2941k65188o674L27245j31074
$$ 543141 636561 720880 556904 362784 613499 686440 421252 414578 741823 610749
14777F10749k71060p3323J27754K26070J3878k70304L53111k48772k7903L64699
$$ 610749 339689 266366 394120 620190 634068 363764 716875 468103 440200 804899
14767H04899m1898k52664n636K99939l92726R2636K77058l67280A27571M70993
$$ 804899 763001 510337 504701 804640 411914 504550 781608 414328 127571 598564
14757E98564J01369k46789n4560q3950K51491L172L80986l97728L7719K328P8402
$$ 598564 699933 453144 398584 314634 566125 569297 950283 552555 590274 592602 671004
14746F71004j0243j67746j04458M22470l44945J33381j02246j46709M01258l56951
$$ 671004 660761 493015 388557 811027 466082 599463 497217 350508 751766 394815
14736C94815J75115G9349O08751j87463j8847J54686Q2246Q6716k82513p556J59801
$$ 394815 569930 79349 688100 500637 481790 636476 718722 805438 522925 515369 675170
14725F75170k34562K74553J63284l32429J66864I3128L46760L30514j55226L07384
$$ 675170 440608 715161 878445 546016 712880 93128 439888 770402 615176 922560
14715I22560J8665D33867R2082L37335M4108k12198L2603o2419k4814J14253k10081
$$ 922560 941225 433867 525949 863284 907392 695194 727797 665378 640564 754817 544736
14704E44736J95792k55312M60686m37439M1571M33929j37455j22611k6319L3019
$$ 544736 740528 485216 945902 508463 550034 983963 846508 723897 697578 730597
14694G30597L73813j12833k42866j06413Q2907J74150k65794j85272M68757p3095
$$ 730597 1104410 991577 748711 642298 725205 899355 633561 448289 917046 843951
14684H43951C21145L16672J60066K97657l83090j26333L59295L48122n29410J45364
$$ 843951 321145 637817 797883 1095540 712450 586117 945412 1293534 764124 909488
14674I09488k31328k64993O12935l42384K62529j41710J31023j21668J4474k17070
$$ 909488 678160 413167 1026102 683718 946247 804537 935560 813892 828366 611296
14664F11296L43555l81320K65788R9939K91512m1712n6045L97150n70801M63954
$$ 611296 954851 573531 839319 939258 1230770 1189058 1133013 1530163 959362 1423316
14654A423316n45712K63707o5516j30774J28683j70293J36813q4400J41077J5681
$$ 1423316 877604 1141311 1075795 945021 1073704 903411 1040224 955824 1096901 1112582
14644A112582P992k51175L2984k566m7859o2419J36422J52724L21492j70048q0723
$$ 1112582 1120574 869399 902383 899817 851958 789539 925961 1078685 1400177 1230129 1149406
14633A149406m9161o9829M4590n2939K57867m46764J60495m5873L51828k32455
$$ 1149406 1100245 1030416 1075006 1022067 1279934 833170 993665 947792 1299620 1067165
14623A067165R9549K17673l91215J77868l61715L79364j35218J96816m34052L86488
$$ 1067165 1166714 1384387 993172 1171040 809325 1188689 1053471 1250287 816235 1202723
14613A202723l4939K2554j03761J62175O6302j39380J2854J90650l87368J08644
$$ 1202723 1167784 1190338 1086577 1248752 1315054 1175674 1188528 1379178 991810 1100454
14603A100454J26610J96211k88390N28338l89038J01018j3986M23740m18986l108
$$ 1100454 1227064 1423275 1134885 1663223 1274185 1375203 1361217 1784957 1365971 1362863
14593A362863j42789J10063J79168j42909j20813L90131J19912o9682j99692O9883
$$ 1362863 1220074 1330137 1509305 1366396 1245583 1635714 1755626 1685944 1486252 1556135
14583A556135l04796L77060k04124K35268k53203k61097M85332k25350K36342
$$ 1556135 1251339 1628399 1424275 1659543 1406340 1145243 1630575 1405225 1641567
14574A641567m24847P47075j49771P427k24428M59329j77768m12620K90758K06656
$$ 1641567 1216720 1963795 1814024 1821451 1597023 2056352 1878584 1465964 1756722 1963378
14564A963378n5385m520M6570l10069L08534o8530O3957q1289M81631k73784j26052
$$ 1963378 1907993 1903473 1950043 1639974 1948508 1879978 1943935 1862646 2344277 2070493 1944441
14553A944441j0471L3580r1990L28142j98337J45954j00407k38358N30004j1834
$$ 1944441 1933970 1967550 1875560 2203702 2005365 2151319 2050912 1812554 2342558 2330724
14543B330724L2217J16405k52570K91267k99091L74492K47769l48303j47823N80235
$$ 2330724 2362941 2479346 2226776 2518043 2218952 2593444 2841213 2492910 2345087 2925322
14533B925322j9101J30237R3662K30173m4292j38954R19613M85844P66425J397980
$$ 2925322 2906221 3036458 3130120 3360293 3316001 3177047 4096660 4582504 5348929 6746909
14523F746909L812928O363575J1836159J7747211j0706474A5753081G566369l708208
$$ 6746909 10559837 16923412 28759571 46506782 35800308 15753081 7566369 3858161
14515C858161j171950n05956L6092J95899k83228m11122J16081J53730Q3997m1143
$$ 3858161 2686211 2180255 2216347 2412246 2129018 1717896 1833977 1987707 2071704 2030561
14505B030561o103L53430j10823K3663m31525O70344l40583M5876l02587P44303
$$ 2030561 2024458 2377888 2267065 2290728 1859203 2529547 2188964 2234840 1932253 2676556
14495B676556J19226k62329K92668J39997j84259k74441J83966R860J39078k19997
$$ 2676556 2795782 2533453 2826121 2966118 2781859 2507418 2691384 2701244 2840322 2620325
14485B620325J92168K41061K63523m56915K51655l33369r1519J94352Q7280j36436
$$ 2620325 2812493 3053554 3317077 2860162 3111817 2778448 2686929 2881281 2968561 2832125
14475B832125L24829J10829k51885J42263Q3140L66554k72307J21285J39331k74369
$$ 2832125 3156954 3267783 3015898 3158161 3241301 3607855 3335548 3456833 3596164 3321795
14465C321795j56997L72785N8881k25136K06793j62512j0696L84446J9159j0825
$$ 3321795 3164798 3537583 3596464 3371328 3578121 3415609 3404913 3789359 3808518 3797693
14455C797693k00987J43012J82523L5696J68297o5521J2541O2118J59800k95237
$$ 3797693 3596706 3739718 3922241 3957937 4126234 4060713 4073254 4135372 4295172 3999935
14445C999935L68866l0867q5125O05063l6130k04347n72112N70745O09866m68266
$$ 3999935 4368801 4337934 4252809 4857872 4821742 4617395 4045283 4616028 5225894 4757628
14435D757628j57525L83041k18862K12844M4081K48313k11171j11969N14238j32733
$$ 4757628 4600103 4983144 4764282 4977126 5021207 5269520 5058349 4946380 5460618 5327885
14425E327885L28334m5436j99975K88953L17628m66063N25027K48629l12740m29627
$$ 5327885 5656219 5610783 5410808 5699761 6017389 5551326 6076353 6324982 6012242 5582615
14415E582615N47398M054O6359L97547j50440K96208n20551O85119K8064j55978
$$ 5582615 6130013 6134067 6200426 6597973 6447533 6743741 6223190 6908309 6936373 6780395
14405F780395K85423K2548J20935P3559K7219K27598q84m8092M59180n29036N76030
$$ 6780395 7065818 7088366 7209301 7282860 7310079 7537677 7536793 7488701 7947881 7418845 7994875
14394G994875L9179J03479J81920n9346M22980j93892N72567m27533K20130M73585
$$ 7994875 8034054 8137533 8319453 8260107 8683087 8489195 9061762 8634229 8854359 9327944
14384I327944O9049R0012l2336L70637R3417L07521L17160k29561k7023L48251
$$ 9327944 9396993 9487005 9454669 9825306 9918723 10226244 10543404 10313843 10286820 10635071
14374A0635071L6757J49381K89710L67371J32126j30599O03005k26445N69561
$$ 10635071 10671828 10821209 11110919 11478290 11610416 11479817 12082822 11856377 12425938
14365A2425938L03722J54296j14646M78890M836N09898j5903N27745M344J5104
$$ 12425938 12729660 12883956 12769310 13248200 13253036 13762934 13747031 14274776 14279120 14294224
14355A4294224N73366P7509N85847n5307L93902M85604R7485L26168J88275M74485
$$ 14294224 14867590 14945099 15530946 15475639 15869541 16355145 16452630 16778798 16967073 17441558
14345A7441558M40760M27634J76027N02347L11628M59385P36452J55131M89179
$$ 17441558 17882318 18309952 18485979 18988326 19299954 19759339 20495791 20650922 21140101
14336B1140101N12435L89581M06876N82442O30943M14904M61574R84266M11842
$$ 21140101 21652536 22042117 22448993 23031435 23662378 24077282 24538856 25523122 25934964
14327B5934964P29820K85836Q88943N41773J161244O75125M35205R82367P76044
$$ 25934964 26664784 26950620 27839563 28381336 29542580 30217705 30652910 31635277 32411321
14318C2411321J128342N21048J145481P58310J192764J161715P06714J297029
$$ 32411321 33539663 34060711 35206192 35964502 37157266 38318981 39025695 40322724
14310D0322724J043057J616049Q99308J321270J047882J517659J682725K000909
$$ 40322724 41365781 42981830 43881138 45202408 46250290 47767949 49450674 51451583
14302E1451583J107708K096030J365438K004714K257615K061510K321369K301854
$$ 51451583 52559291 54655321 56020759 58025473 60283088 62344598 64665967 66967821
14294F6967821K375329K517659K594583K762376L171707K903114L522810L786172
$$ 66967821 69343150 71860809 74455392 77217768 80389475 83292589 86815399 90601571
14286I0601571L558105L571008M405308M547591M463189M899048N369412N470771
$$ 90601571 94159676 97730684 102135992 106683583 111146772 116045820 121415232 126886003
14278A26886003O301436O075583O618503P106927P529939P493399Q193791Q647110
$$ 126886003 133187439 139263022 145881525 152988452 160518391 168011790 176205581 184852691
14270A84852691Q961891R619996J0954959J0842547J1441226J1996950J2757674
$$ 184852691 193814582 203434578 214389537 225232084 236673310 248670260 261427934
14263B61427934J3435543J3999968J4473171J4997830J5383172J5668709J5360487
$$ 261427934 274863477 288863445 303336616 318334446 333717618 349386327 364746814
14256C64746814J5937195J5677231J4912636J3989536J3756244J2362871J0493320
$$ 364746814 380684009 396361240 411273876 425263412 439019656 451382527 461875847
14249D61875847Q747810M524228j499924j548008k934862K163599j919223p273552
$$ 461875847 470623657 475147885 473647961 472099953 469165091 471328690 469409467 462135915
14241D62135915o695537q692202j1090408j2471388j3772996j4424823j4125773
$$ 462135915 455440378 446748176 435657768 423186380 409413384 394988561 380862788
14234C80862788j5639611j6277865j6057335j5966690j5353468j4513970j3923720
$$ 380862788 365223177 348945312 332887977 316921287 301567819 287053849 273130129
14227B73130129j3504853j3100294j2330917j1965101j0954025j0781766r956479
$$ 273130129 259625276 246524982 234194065 222228964 211274939 200493173 190536694
14220A90536694q940514q941986p586454q047785p485015o972749o527440o014073
$$ 190536694 181596180 172654194 165067740 157019955 149534940 142562191 136034751 130020678
14212A30020678m986781n585944n562561m626428m790543m078941l730788l503890
$$ 130020678 125033897 119447953 113885392 109258964 104468421 100389480 96658692 93154802
14204I3154802l662950l610235l525239l061335k874527k877015k590986k615528
$$ 93154802 89491852 85881617 82356378 79295043 76420516 73543501 70952515 68336987
14196F8336987k300173k271713j625673k543335j833084j664528k359603j456114
$$ 68336987 66036814 63765101 62139428 59596093 57763009 56098481 53738878 52282764
14188E2282764j279572j717281j372590j504508j311712j433923r44014n54540
$$ 52282764 51003192 49285911 47913321 46408813 45097101 43663178 42719164 42164624
14180D2164624j609714j149231j567652r03922o78012j107432p54764j196027
$$ 42164624 40554910 39405679 37838027 36934105 36256093 35148661 34393897 33197870
14172C3197870o68963p13079q90505r77020j92873j083566p40188l71924r40812
$$ 33197870 32528907 31815828 30925323 29948303 29755430 28671864 27931676 27559752 26618940
14163B6618940k82520o19318o05899p94190l99043n05100m78581p5398r79902
$$ 26618940 26336420 25717102 25111203 24317013 23917970 23412870 22934289 22858891 21878989
14154B1878989l44768n60813k42497n15379n68214l22892j00242q28680j74086
$$ 21878989 21534221 20973408 20730911 20215532 19647318 19324426 19224184 18395504 18221418
14145A8221418m21332m08360k03786m57260k36404j70827m63053k44926j62413
$$ 18221418 17800086 17391726 17187940 16730680 16494276 16323449 15860396 15615470 15453057
14136A5453057k03186m18594K9006m73740k85379j70446n84770p4340N0656l72660
$$ 15453057 15249871 14831277 14860283 14386543 14101164 13930718 13345948 13271608 13322264 12949604
14126A2949604l78127K83168o21109j89776J24158k57082m46766q4044k34102
$$ 12949604 12571477 12854645 12233536 12043760 12167918 11910836 11464070 11380026 11145924
14117A1145924j58834J3295l71677j07732j36151r6880k85081k06585Q4634m67352
$$ 11145924 10987090 11000385 10628708 10520976 10384825 10287945 10002864 9796279 9880913 9413561
14107I413561J59473k93583n3238j79375p5317J95863m64878j84376q4972k3266
$$ 9413561 9573034 9279451 9226213 9046838 8971521 9167384 8702506 8518130 8433158 8409892
14097H409892r2705k0585n3464j84494K1269j77901m84026L28828k06812j78748
$$ 8409892 8317187 8296602 8243138 8058644 8079913 7902012 7417986 7746814 7540002 7361254
14087G361254j14762o145N2586k51634j77773k10756K2448J06614q8536j84317
$$ 7361254 7246492 7240347 7292933 7041299 6863526 6652770 6675218 6781832 6693296 6508979
14077F508979j71069O229L34023j94633k22511k12575j10929L9079N0610k59594
$$ 6508979 6337910 6344139 6678162 6483529 6261018 6048443 5937514 5976593 6027203 5767609
14067E767609R9058m94408K69928j17533K78144k39638j12026j12279j80372J64040
$$ 5767609 5866667 5372259 5642187 5524654 5802798 5563160 5451134 5338855 5158483 5322523
14057E322523p4573j91585J4071j85949j728k57602K48315n08541L37586l6956
$$ 5322523 5247950 5056365 5070436 4884487 4882759 4625157 4873472 4364931 4702517 4665561
14047D665561O6299J56585l00768k0639k7673J81268l40589L24100j46766l43297
$$ 4665561 4731860 4888445 4587677 4567038 4539365 4720633 4380044 4704144 4557378 4214081
14037D214081K11193k0114j55329J64922j73324J30992l42547R2388k70669K95692
$$ 4214081 4425274 4405160 4249831 4414753 4241429 4372421 4029874 4122262 3851593 4147285
14027D147285j66982o6266j39498O1085N48k39051J15248n347k22714j57665L19243
$$ 4147285 3980303 3914037 3774539 3835624 3836172 3597121 3712369 3707022 3484308 3326643 3645886
14016C645886j95882R0309k72796K45505o5766k88930j57193J15689m0258L33140
$$ 3645886 3450004 3540313 3267517 3513022 3447256 3158326 3001133 3116822 3076564 3409704
14006C409704k27089r4574n0970K19900j59901j19150p7815L24386k62473l5812
$$ 3409704 3182615 3088041 3037071 3256971 3097070 2977920 2900105 3224491 2962018 2926206
13996B926206J8016J03545l34231K4858j68771L60374k01100r9352j83183N4123
$$ 2926206 2944222 3047767 2713536 2738394 2569623 2929997 2728897 2629545 2446362 2500485
13986B500485N1774p7839J43298l2725l02055L41184j53547J68359m23201M0779
$$ 2500485 2552259 2474420 2617718 2584993 2282938 2624122 2470575 2638934 2215733 2256512
13976B256512K7218J39890k00580j43440K74587j30405q104q0340K7319J13236
$$ 2256512 2283730 2423620 2223040 2079600 2354187 2223782 2215678 2135338 2162657 2275893
13966B275893J43266p2881J418716J571698N077167J0647076J8223654K939191
$$ 2275893 2419159 2346278 3764994 5336692 10413859 21060935 39284589 42223780
13958D2223780A9260768q084164l707627j979025j124872k57434n23570j92743
$$ 42223780 19260768 11176604 7468977 5489952 4365080 4107646 3584076 3391333
13950C391333J24415q34589j55020L73670m16438j0259K06521P9343j64888K1883
$$ 3391333 3515748 2681159 2526139 2899809 2483371 2473112 2679633 2758976 2594088 2615971
13940B615971k19148r8619j36133J21633j02682j31352K3788p7244N8262J99793
$$ 2615971 2396823 2298204 2162071 2283704 2181022 2049670 2073458 1996214 2054476 2254269
13930B254269k75019o9523J3669k36120R7060j63617O25727r4636l2800k6495
$$ 2254269 1979250 1909727 1923396 1687276 1784336 1620719 2246446 2151810 2119010 2092515
13920B092515l16207N75805k38395M8348k92206j5419l26615L18982K36456M6640
$$ 2092515 1776308 2352113 2113718 2162066 1869860 1854441 1527826 1846808 2083264 2129904
13910B129904l55055j8428K59750l8826l78737Q4903l9315J9382r2240K12110
$$ 2129904 1774849 1756421 2016171 1977345 1598608 1683511 1644196 1663578 1571338 1783448
13900A783448J45121m16186R8886j33875N96222q40328L28530O9891J6391l31972
$$ 1783448 1928569 1512383 1611269 1477394 2073616 1233288 1561818 1631709 1648100 1316128
13890A316128J19015J06170j41022K41578l7613j96752J80149j85018K77056J19780
$$ 1316128 1435143 1541313 1400291 1641869 1604256 1407504 1587653 1402635 1679691 1799471
13880A799471k74489k80660p8681M94774j81372q389j90182l801K1676n4655q2772
$$ 1799471 1524982 1244322 1165641 1660415 1479043 1470654 1280472 1276671 1298347 1243692 1160920
13869A160920J77822k3962J24176k50621K92578l27103J07848R2811j22590L69241
$$ 1160920 1338742 1314780 1438956 1188335 1480913 1153810 1261658 1354469 1231879 1601120
13859A601120k48886o2627J08537l23260K5941L21557r3807l9463Q7751j88993
$$ 1601120 1352234 1289607 1398144 1074884 1100825 1422382 1328575 1289112 1376863 1187870
13849A187870L6651j3755j21444K47430J14719l0039k06898k6173L08861l53168
$$ 1187870 1224521 1210766 1089322 1336752 1451471 1421432 1214534 1188361 1497222 1144054
13839A144054R8596p450m74158J44640o8744K77833j63906L25162l69911K88086
$$ 1144054 1242650 1235200 761042 905682 836938 1114771 950865 1276027 906116 1194202
13829A194202j97307Q6717K05900j94813J01424k71589N18563m72745D70214N06229
$$ 1194202 996895 1083612 1289512 1094699 1196123 924534 1443097 970352 470214 976443
13819I76443K85006m46796J47342J12097j11731J60330p4995j33686m3906j8692
$$ 976443 1261449 814653 961995 1074092 962361 1122691 1047696 914010 870104 851412
13809H51412K4870J255M9228j13266M44204j94416O6207R1454l95295M39568m83241
$$ 851412 876282 877537 926765 813499 1257703 1063287 1129494 1220948 825653 1265221 781980
13798G81980P7839L06574k47710k21006N28219M9911l36661Q0707j20603K31828
$$ 781980 859819 1166393 918683 697677 1225896 1275807 939146 1019853 899250 1131078
13788A131078n50045N60598Q2692n54319M75882N1148j77484k51101J56125l16215
$$ 1131078 581033 1141631 1224323 670004 1145886 1197034 1019550 768449 924574 608359
13778F08359L28633l55925O99544l47751j52019n5768L57297l59329K89334k42749
$$ 608359 936992 581067 1280611 932860 780841 725073 1082370 723041 1012375 769626
13768G69626K82156k56839k74726J41706K98323k55126K18199j48747M4266K28925
$$ 769626 1051782 794943 520217 661923 960246 705120 923319 774572 818838 1047763
13758A047763j38386l54449j58557M05145k25576p1649L20802J75237k33758O0261
$$ 1047763 909377 554928 396371 801516 575940 504291 825093 1000330 766572 826833
13748H26833j54651J30096j57370J74024l15537N21458k61984K05116m44993K32263
$$ 826833 672182 802278 644908 818932 503395 1024853 762869 967985 522992 755255
13738G55255q48J58460j13041j28666K02065q5K5066k04606O2565q6676l6807
$$ 755255 754407 912867 799826 671160 873225 873140 898206 693600 756165 669489 632682
13727F32682J88994j29709l4458p4105N4738Q4198k28315K09280k13704K46181
$$ 632682 821676 691967 657509 583404 638142 722340 494025 703305 489601 735782
13717G35782j03609M8449K98784p6688m3770p8999l52608K61386k22994O5578
$$ 735782 632173 680622 979406 902718 858948 779949 427341 688727 465733 531311
13707E31311M36350k06933j53970n9411m2110J35510p8677J44406j09715J88216
$$ 531311 967661 760728 606758 547347 505237 640747 562070 706476 596761 784977
13697G84977r2720j827j73195n3382J41692J57162j23140j25374K4162P7209j93195
$$ 784977 692257 690430 517235 463853 605545 762707 639567 514193 538355 615564 422369
13686D22369J34885L4344k85056M59643R8931l09563J0172K87619j62897j08262
$$ 422369 557254 591598 306542 766185 865116 555553 565725 853344 690447 582185
13676E82185n1785m4334O4787L92795C68889J24328R9239m2414n1264M14384k35972
$$ 582185 530400 486066 550853 943648 368889 493217 592456 550042 498778 913162 677190
13665F77190B93675o919J79572n6907A79468K26293L71717k8778k64651J95478
$$ 677190 293675 286756 466328 409421 179468 405761 777478 748700 484049 679527
13655F79527j68535p0465K91933l40004n8874J90274K9251j05328K29185B97487
$$ 679527 510992 440527 732460 392456 333582 523856 553107 447779 676964 297487
13644F16997k06023p1295o7546L33179J93783j30799B51281J84190p8025j1567
$$ 616997 410974 339679 272133 605312 799095 668296 251281 435471 357446 345879
13634C45879J93988B22817K32826K00298O9660B59538J04457O5453j58652j32161
$$ 345879 539867 222817 455643 655941 725601 259538 363995 429448 270796 138635
13624A38635J72306J74418L34877l86450N8622j91416J30056C9914L87870J21000
$$ 138635 310941 485359 820236 433786 492408 300992 431048 39914 427784 548784
13614E48784J8416k56303P5067j12766J55900O1714n2883j12881K06328Q4529
$$ 548784 567200 310897 385964 273198 429098 490812 437929 325048 531376 615905
13604F15905L3183k93733j8905J95839J82833k55009J90588l13456K29540B10896
$$ 615905 649088 355355 336450 532289 715122 460113 650701 337245 566785 210896
13593C78535K3694J36958O2268j57200R9022j61722J68790n7775k05421O0225
$$ 378535 402229 539187 601455 444255 543277 381555 550345 492570 287149 347374
13583C47374J25732r9019j03906L48768A55681K96459J17291j13269k18729J19922
$$ 347374 473106 374087 270181 618949 155681 452140 569431 456162 237433 357355
13573C57355j52676K64039B19233K73489J8187q1298O637n5727J5735q2385J08646
$$ 357355 204679 468718 219233 492722 510909 429611 436248 380521 396256 313871 422517
13562D22517N5649j32333l872J16973L0351L988A45277J86755r7414M01234B99049
$$ 422517 478166 345833 341961 458934 489285 493273 145277 332032 234618 635852 299049
13550C78272J83360j92607K8728j72201H0133K40566K21707l852B28692l8214
$$ 378272 561632 369025 397753 225552 80133 320699 542406 538554 228692 190478
13540A90478J16651J52471j17363j47143a38310C11727J17568r7183n8261k892
$$ 190478 307129 459600 342237 195094 -138310 311727 429295 332112 273851 270959
13530B70959J95620j90080o2689n9008M3897L2317O6375O1655A77479K28327J38665
$$ 270959 466579 276499 213810 154802 198699 231016 297391 359046 177479 405806 544471
13519E44471k58891j20415K84842K44446j65718B1239L53475J15304B25807N6799
$$ 544471 285580 165165 450007 694453 528735 21239 374714 490018 225807 282606
13509B82606J96770A73389K41029j05942p4905E9053O60504k58161L2880E7939
$$ 282606 479376 173389 414418 308476 233571 59053 719557 461396 494276 57939
13498F88941a71735C04209K84203I813M45934B7817K7368Q6673L00128j83895
$$ 688941 -171735 304209 588412 9813 455747 27817 55185 141858 441986 258091
13488B58091D0302L92293K669A03730K08376e8771E15812J1517A28024O3631J78465
$$ 258091 40302 432595 435264 103730 312106 -58771 515812 527329 128024 191655 370120
13477C70120j28247a09448C63049o0369P6334J3060I6771K32667K4749J70382
$$ 370120 241873 -109448 363049 302680 379014 392074 96771 329438 354187 524569
13467E24569j39948K7612r1623P8032b388B16789n1668K25452J53706B72068J13302
$$ 524569 384621 412233 320610 398642 -2388 216789 165121 390573 544279 272068 385370
13456C85370n1729K48225A86627j0460K25222Q8619j75835L5030A6859J78698
$$ 385370 333641 581866 186627 176167 401389 490008 314173 349203 16859 195557
13446A95557K48634A27385l7077A401K8262J99958L4801G4645L02895K28919B02088
$$ 195557 444191 127385 90308 1401 29663 229621 264422 74645 377540 606459 202088
13434A00065K42056d1969a0988H2496L5365L2312m5500b5328E17099k55874p852
$$ 100065 342121 -41969 -10988 82496 117861 150173 104673 -25328 517099 261225 253373
13423B53373j4395K06711j31840M5472j62691J53234Q2533j92437o9190L64829
$$ 253373 238978 445689 313849 359321 196630 349864 432397 239960 170770 535599
13413E35599A16687M93746A11661J76085m4938C2995M59233k12983J60441A88873
$$ 535599 116687 610433 111661 287746 242808 32995 492228 279245 439686 188873
13402B05884K820K42475O176I9447J63907j1633j19333J31086J4434H1433J91369
$$ 205884 208704 451179 457355 99447 263354 251721 132388 263474 277908 81433 272802
13391B72802l8719i865B6613K52570K64277j52354a1159A2037K34975K44752k37722
$$ 272802 234083 -9865 26613 279183 543460 391106 -11159 12037 247012 491764 254042
13380B54042d6646C24728m7339J77782A95941J59289A73542a24261B82876J37434
$$ 254042 -46646 324728 277389 455171 195941 355230 173542 -124261 282876 420310
13370D20310E3767J53362G8135J81528K71811J37611I2833J16921d2396B82376
$$ 420310 53767 207129 78135 259663 531474 669085 92833 209754 -42396 282376
13359A23495e1643D36115A13129K16051K9656A5225P6956K5376Q9475J93802A21372
$$ 123495 -51643 436115 113129 329180 358836 15225 92181 117557 207032 400834 121372
13347E58936B60384K75491A97974m2061b19599b1459A85167C4218J89646n3656
$$ 558936 260384 535875 197974 155913 -219599 -21459 185167 34218 223864 170208
13337A70208a91342H2019R2163A8466L9420J9162J59642K39847b06481D29963
$$ 170208 -191342 82019 174182 18466 57886 77048 236690 476537 -206481 429963
13326A18058A1078K40377J64500j30627I7912L02889A97136E8211J68411N727
$$ 118058 11078 251455 415955 285328 97912 400801 197136 58211 226622 232349
13316B32349J4996n329j03605O8439M23540k42520j42661r8072K1959N7707I4524
$$ 232349 247345 242016 138411 206850 630390 387870 245209 147137 169096 226803 94524
13304c18947H3666J69359J48767k4574j80950O0818q1812J75377J0602A77991
$$ -318947 83666 253025 401792 377218 196268 257086 175274 350651 361253 177991
13293a04658H0813K03301K813A40550Q4912F7531P1210L7737A5329c996B05710
$$ -104658 80813 284114 286927 140550 225462 67531 138741 176478 15329 -3996 205710
13281F9360e8205D52298J61736A21892K4960b2680I2858J95796j20390N101Q2674
$$ 69360 -58205 452298 614034 121892 146852 -22680 92858 288654 168264 173365 256039
13270B56039J04203j03783L3377j34713a18719A47545R9390K87500B4132K76065
$$ 256039 360242 256459 289836 155123 -118719 147545 246935 534435 24132 300197
13260C00197A09145J90006N2731J29496d5183B36404c1126A93270R4827j2952
$$ 300197 109145 299151 351882 481378 -45183 236404 -31126 193270 288097 275145
13250B75145J30900d6848D05209l8858c2858D2415O2545c2404A94471k5408b65107
$$ 275145 406045 -46848 405209 366351 -32858 42415 104960 -32404 194471 169063 -265107
13238d7023I1223L315a17326M0159K0742B51722R2418J19154d4909O663C50379
$$ -47023 91223 94538 -117326 -77167 -56425 251722 344140 463294 -44909 -38246 350379
13226C54028n0624A14301K30360A65521g5199C72293d9811N727C1784b47559C40112
$$ 354028 303404 114301 344661 165521 -75199 372293 -49811 -44084 31784 -247559 340112
13214B14565G6848N01687e7835A84632j63a23693a0670A48723J3726J36781j24892
$$ 214565 76848 578535 -57835 184632 184469 -123693 -10670 148723 162449 299230 174338
13203A74338K7324o720a15040C57188e0430k18998A18492D3746a5241B84302b941
$$ 174338 201662 194942 -115040 357188 -50430 -269428 118492 43746 -15241 284302 -2941
13191F2743K13356a75830E8392M22044a7521A54174D9033K31778j9038L943c394
$$ 62743 276099 -175830 58392 480436 -17521 154174 49033 280811 261773 265716 -3394
13179I2801D5415J16845O938b03202B1733a62780B56913o0650Q3605d5222C45379
$$ 92801 45415 162260 169198 -203202 21733 -162780 256913 196263 279868 -45222 345379
13167C46613B9551Q946N51288H9180h8295A43749E4747K27599j17932a26505O2677
$$ 346613 29551 38497 589785 89180 -88295 143749 54747 282346 164414 -126505 -63828
13156f3828A61017J99649j45374o6065E0263a30417H7108a33785E30555A1077
$$ -63828 161017 360666 215292 149227 50263 -130417 87108 -133785 530555 11077
13145B66948b3765A17505g9779A32071e8848B13076e8376c609j30681k12664B18188
$$ 266948 -23765 117505 -79779 132071 -58848 213076 -58376 -3609 -134290 -346954 218188
13133A00214d6741B85122L3863b8708p8429N2484I6896J61554L164l8302o879
$$ 100214 -46741 285122 318985 -28708 -107137 -54653 96896 258450 261614 223312 216433
13122B16433K46236E6571J96191j03278Q3714a22148A44560Q4248J1580i0810
$$ 216433 462669 56571 252762 149484 233198 -122148 144560 228808 240388 -90810
13111A79141J11228m7907b13406A63388E5153K3478a6156k12909i0279A921Q4325
$$ 179141 290369 242462 -213406 163388 55153 78631 -16156 -229065 -90279 1921 86246
13100H6246j7296P3804A270L2745d309j09211B01870D2705J19905p3714j8118
$$ 86246 68950 142754 1270 34015 -4309 -113520 201870 42705 162610 88896 70778
13089G0778J64249R1715J6664F4800J20077R2088g5533j639k0094m252k96669
$$ 70778 235027 326742 343406 64800 184877 276965 -75533 -77172 -97266 -101518 -398187
13078c98187a11064A67161b90489d6916b1581j20346F0933J67622C5065a33665
$$ -398187 -111064 167161 -290489 -46916 -21581 -141927 60933 228555 35065 -133665
13067A48612F2525b5109j0132j13046d4614Q375j4906b2559B26669D1091b04698
$$ 148612 62525 -25109 -35241 -148287 -44614 -36239 -51145 -22559 226669 41091 -204698
13055b00743B46605J21298A9471M1198g668A86447n0835J25687M2702K5703l7002
$$ -200743 246605 367903 19471 60669 -7668 186447 135612 261299 304001 329704 292702
13044B92702f4485B18900E2325e6808A77458a28326C88054r3815P8736F6297c32179
$$ 292702 -64485 218900 52325 -56808 177458 -128326 388054 294239 372975 66297 -332179
13032B62764H2876J06024M6696g2972K537I8222J22058Q8883J7559j25947D8909
$$ 262764 82876 188900 235596 -72972 -70435 98222 220280 309163 326722 200775 48909
13020D65782j00416a66507P8613E9791J29910b9962j23771k1837M1017A11756
$$ 465782 365366 -166507 -87894 59791 189701 -29962 -153733 -175570 -134553 111756
13009C42895m546I4270g2975C83822G0644L81438j68056j31612a77628l6260A15614
$$ 342895 338349 94270 -72975 383822 70644 452082 284026 152414 -177628 -213888 115614
12997B66696J34772j40102j8504L25755k62136j17222J03343r4397J12853M3416
$$ 266696 401468 261366 242862 568617 306481 189259 292602 198205 311058 354474
12987C54474M1881A26697J52588F4953a20280I6364K9835J41482D6774a65613
$$ 354474 396355 126697 279285 64953 -120280 96364 126199 267681 46774 -165613
12976C59089a47985B23855m4771J37875E001M73970d3200C66859H2509Q6745J48677
$$ 359089 -147985 223855 179084 316959 5001 478971 -43200 366859 82509 169254 317931
12965C17931m0385j04040C6134c33742H0685K85593g8569B3508J26803K16769
$$ 317931 277546 173506 36134 -333742 80685 366278 -78569 23508 150311 367080
12955C67080H0951K56987C1602L16498A23295c42927A33060n9268a36456e853
$$ 367080 80951 337938 31602 348100 123295 -342927 133060 73792 -136456 -5853
12944a74011l0079M2374A16043b25765L3588N1007E8189a38948N9646C33578b0284
$$ -174011 -204090 -161716 116043 -225765 -192177 -141170 58189 -138948 -79302 333578 -20284
12932E660L59392a08569L0147C66353a39760K0120B75977c42216a7094o9890C47885
$$ 5660 365052 -108569 -78422 366353 -139760 -119640 275977 -342216 -17094 -86984 347885
12920g5897j16961F2607J32361f3120G9996o570J99622q7003a34586C4982a49968
$$ -75897 -192858 62607 194968 -63120 79996 73426 273048 186045 -134586 34982 -149968
12908e2432G5857K19669a27434j29080G495i7493B56531A9075N0712a15229A75955
$$ -52432 75857 295526 -127434 -256514 7495 -97493 256531 19075 69787 -115229 175955
12896f6309o1573B11930E317J10238J14833I4661B0952i8725F769J20918a39066
$$ -66309 -127882 211930 5317 115555 230388 94661 20952 -98725 6769 127687 -139066
12884B36912b95825e365B67539I5757N3041E5080J23549N7887g2297k8692C66531
$$ 236912 -295825 -5365 267539 95757 148798 55080 178629 236516 -72297 -100989 366531
12872B68132L0708e2825A28512c5424o8989A11417J17453D5616a68406N4331K8299
$$ 268132 298840 -52825 128512 -35424 -104413 111417 228870 45616 -168406 -114075 -85776
12861h5776F8673b50118R8138B56142b57254a22527A92743q0570c25063f5029
$$ -85776 68673 -250118 -151980 256142 -257254 -122527 192743 112173 -325063 -65029
12850B79978D7201P6868D1656J9272j7614L7345i9446d9498k06524a378j08126
$$ 279978 47201 124069 41656 60928 43314 80659 -99446 -49498 -256022 -1378 -109504
12839a09504D79718b01108A51180D2319b37303l8839A14332K44124A32226P7709
$$ -109504 479718 -201108 151180 42319 -237303 -276142 114332 358456 132226 209935
12829B09935J42081j33493R4485C1330c03176G8008a21257b3106A8887J78905
$$ 209935 352016 218523 313008 31330 -303176 78008 -121257 -23106 18887 197792
12819A97792o5422N1182D1589E738a79106D8975c2459o4980C34291j64181a45612
$$ 197792 132370 183552 41589 5738 -179106 48975 -32459 -97439 334291 170110 -145612
12807D9320a08678B28090F0867J37695E0555A5949J86649k6137a69132m0348g4577
$$ 49320 -108678 228090 60867 198562 50555 15949 202598 176461 -169132 -209480 -74577
12795F471c04148d7667C47521A68375b20005A27526N1741H0103L2216n1631k240
$$ 6471 -304148 -47667 347521 168375 -220005 127526 179267 80103 112319 60688 58448
12784E8448a35494k8795B7161d8619B2469J86930d0976j88344A87065A8447c3338
$$ 58448 -135494 -164289 27161 -48619 22469 209399 -40976 -229320 187065 18447 -33338
12772i4418J8312A33520d8122k61981A98580G0797L9636a73016A48629J36368
$$ -94418 -76106 133520 -48122 -310103 198580 70797 110433 -173016 148629 284997
12762B84997k6646a62500B14297G8472a18492A14289j6207a38895e3263j38128
$$ 284997 258351 -162500 214297 78472 -118492 114289 98082 -138895 -53263 -191391
12752a91391H514c10274B953b28393D01069f3980B0083c26911J60903M6846B19396
$$ -191391 8514 -310274 2953 -228393 401069 -63980 20083 -326911 -166008 -119162 219396
12740A2458e7716e401m6500A22344J7157a2920A8130a09103A62168G489O183e3459
$$ 12458 -57716 -5401 -51901 122344 139501 -12920 18130 -109103 162168 7489 13672 -53459
12727a58151B17008b43178Q6237A56178p4401P030k7220P9513B3373a62878j3190
$$ -158151 217008 -243178 -156941 156178 81777 88807 61587 141100 23373 -162878 -176068
12716a76068M1618G9915L5190a20133C58938A7818P0868L90334A37778a38119
$$ -176068 -134450 79915 115105 -120133 358938 17818 88686 479020 137778 -138119
12705B22020C4891d76888e4088j26691a9032A25205f084B88766f5136m2408j28955
$$ 222020 34891 -476888 -54088 -180779 -19032 125205 -6084 288766 -65136 -107544 -236499
12694b36499A57179m9199P5934B3681K0668J46312J15040b2416A06970K88726
$$ -236499 157179 107980 183914 23681 44349 190661 305701 -22416 106970 395696
12684C95696k1818a07629J1975E65163D8472L01051a29806B66914j06509o086
$$ 395696 373878 -107629 -95654 565163 48472 349523 -129806 266914 160405 154319
12674A54319J10972A02179a40957A14127L53775A73367a22019j85061B1489J02250
$$ 154319 265291 102179 -140957 114127 467902 173367 -122019 -307080 21489 123739
12664A23739j8112h3491A44509Q7851a52265A73571O8786J28145i9929l1260e0782
$$ 123739 105627 -83491 144509 232360 -152265 173571 242357 370502 -99929 -131189 -50782
12652B65764D5551d7191B21203j4548q1289c65047F9734B9329J31631h2547o575
$$ 265764 45551 -47191 221203 206655 125366 -365047 69734 29329 160960 -82547 -89122
12641h9122E5686j5044J68586b23703L8443o2320B63936o0158p2947m0760m3335
$$ -89122 55686 40642 209228 -223703 -185260 -247580 263936 203778 130831 90071 46736
12630D6736c3288A04598K50029A08594c30074B7761h0848j49936B01625a09975
$$ 46736 -33288 104598 354627 108594 -330074 27761 -80848 -230784 201625 -109975
12619f6237b1446D24809b08038K8272a8757j19475E5511a39235b2212A25748b13774
$$ -66237 -21446 424809 -208038 -179766 -18757 -138232 55511 -139235 -22212 125748 -213774
12607C3131J66466a4143o2801f0D58226a67049E01926A2473L615K30415m4339
$$ 33131 199597 -14143 -76944 -60 458226 -167049 501926 12473 16088 246503 202164
12596B02164K61331H7436P1393R2896I6936A5273L004d8584A24146K8393J4900
$$ 202164 463495 87436 158829 251725 96936 15273 18277 -48584 124146 152539 167439
12585A67439A313L19823n4497L175C8972J21270C6797K9524C1409M2684g8760
$$ 167439 1313 321136 266639 269814 38972 160242 36797 66321 31409 74093 -78760
12573a10287A48494a54223a268A87520F4628k1382e7751A65473a9674F1376B3411
$$ -110287 148494 -154223 -1268 187520 64628 43246 -57751 165473 -19674 61376 23411
12561A61127Q4256b89475E2956J347L12811A10736J14902F6420R6616n1833g9796
$$ 161127 245383 -289475 52956 54303 367114 110736 225638 66420 163036 111203 -79796
12549A33446b12981A95985a44798C54690o2278I0171l7688K78124r3864D1798
$$ 133446 -212981 195985 -144798 354690 292412 90171 52483 330607 236743 41798
12538A19549J6717J45393a05376a8864D6335d3376q9840d8759a5446p822A55597
$$ 119549 136266 281659 -105376 -18864 46335 -43376 -133216 -48759 -15446 -23268 155597
12526C04711A9061g3214C82314a52295m879o6413D4956m590f6490C8686q000c65370
$$ 304711 19061 -73214 382314 -152295 -157174 -223587 44956 40366 -66490 38686 30686 -365370
12513g2690r1430N8921B8242J07461J29911A29360K54710A57835b9424B21307
$$ -72690 -164120 -105199 28242 135703 265614 129360 384070 157835 -29424 221307
12502A18769b78754f0868o5305d9841k3382p5988p484C44601h9437I2812B247
$$ 118769 -278754 -60868 -126173 -49841 -73223 -149211 -156695 344601 -89437 92812 2247
12490C59061a64714I2776b42041k7074a33682B11027k7815F7771K35491a42365
$$ 359061 -164714 92776 -242041 -269115 -133682 211027 183212 67771 303262 -142365
12479b10746h3321A59559J9159J31780a9434k01365A52416L014d8953A13984c52576
$$ -210746 -83321 159559 178718 310498 -19434 -220799 152416 155430 -48953 113984 -352576
12467C939f3988C7497K8728e062B30616G4147a60519K4559c2597A50504a89962
$$ 3939 -63988 37497 66225 -5062 230616 74147 -160519 -135960 -32597 150504 -189962
12455g4050a7669D8223M0901a8907E9968g5604B62239i7434B61585E1983P0681
$$ -74050 -17669 48223 89124 -18907 59968 -75604 262239 -97434 261585 51983 122664
12444A22664b8539k01619G617O9924K14611g411B2550b01089E3666e5981k57817
$$ 122664 -28539 -230158 7617 77541 292152 -7411 22550 -201089 53666 -55981 -313798
12433c13798D2314a38012K7073B1182J59367m5039b68807B39642a92795j0659
$$ -313798 42314 -138012 -110939 21182 180549 135510 -268807 239642 -192795 -203454
12423b03454A13582b35589Q5081N6094B50838g162A08044f6956A24974J26938
$$ -203454 113582 -235589 -150508 -94414 250838 -7162 108044 -66956 124974 251912
12413B51912i7408A68258P6640c19980A44745P0709i2604A7365f0810J0190j50199
$$ 251912 -97408 168258 244898 -319980 144745 215454 -92604 17365 -60810 -50620 -200819
12402b00819A39702P8066c65170l056f0211j69647d5966E21173A54082Q1050J09339
$$ -200819 139702 217768 -365170 -368226 -60211 -229858 -45966 521173 154082 235132 344471
12391C44471a51958e3400B98307b72846a00313j15717j49219R0893a16648A2124
$$ 344471 -151958 -53400 298307 -272846 -100313 -216030 -365249 -274356 -116648 12124
12380d01525A35583L358m8335e6857B32480H2820g7601c8296B8601a28539A5290
$$ -401525 135583 138941 90606 -56857 232480 82820 -77601 -38296 28601 -128539 15290
12368b2529B06119f0774A63172b83660a22329H7173K66640g2367j3211H6036m2219
$$ -22529 206119 -60774 163172 -283660 -122329 87173 353813 -72367 -85578 86036 43817
12357D3817a31332A47468h186A46568i3055F3216Q4494J83c88815B92978a33898
$$ 43817 -131332 147468 -8186 146568 -93055 63216 147710 147893 -388815 292978 -133898
12345B1232c33105A26841J17803H6624K09807A12531f7030k9102J8289A29846
$$ 21232 -333105 126841 244644 86624 296431 112531 -67030 -96132 -77843 129846
12334A30059h7807B06671a68284J6367P2898k49941D63515d00491d6289m8744
$$ 130059 -87807 206671 -168284 -151917 -79019 -328960 463515 -400491 -46289 -95033
12324i5033G2179L39514a61573A60481r83c2174D0250M2871a1863B00717H2617
$$ -95033 72179 411693 -161573 160481 159498 -32174 40250 83121 -11863 200717 82617
12312b13084B10503f0023j23287A71973K4421h7996j13789A48474G510J88239
$$ -213084 210503 -60023 -183310 171973 196394 -87996 -201785 148474 7510 195749
12302A95749B8876c1173B97734A13063b39924A20761d5696A76844a59621A14917
$$ 195749 28876 -31173 297734 113063 -239924 120761 -45696 176844 -159621 114917
12291F562c9991A04120D3107a92896H127b00279A11442B615L3525a17363H5124
$$ 6562 -39991 104120 43107 -192896 8127 -200279 111442 2615 36140 -117363 85124
12279I8632k0007R2969E9089b19783b8060D52538H1624r006K4008a56135n8652
$$ 98632 78625 171594 59089 -219783 -28060 452538 81624 72618 96626 -156135 -214787
12268b14787p0861A18769K5490J26307i3737F6977J95525a27249K4606d0591P499
$$ -214787 -285648 118769 144259 270566 -93737 66977 262502 -127249 -102643 -40591 -33092
12257c3092D12758A04342B6038i0402H3245N6133J3240J45670o7071I8308a76820
$$ -33092 412758 104342 26038 -90402 83245 139378 152618 298288 231217 98308 -176820
12245i2480L2621r5396A53129J4527a9094A45921J84107J11311o1579R4421J3996
$$ -92480 -59859 -155255 153129 167656 -19094 145921 330028 441339 379760 474181 488177
12234D88177j61421H9641a12668A00577a18966K4980E64606A80310l0829J3347
$$ 488177 326756 89641 -112668 100577 -118966 -93986 564606 180310 149481 162828
12224A62828J6619K961p1531b26043B6137J56634g0595A12528J89163a46250j5595
$$ 162828 179447 182408 110877 -226043 26137 182771 -70595 112528 301691 -146250 -161845
12213a61845l6662H640J47816K37435F3230j9909M78128A54316J75622q2013A14898
$$ -161845 -198507 8640 156456 393891 63230 43321 521449 154316 329938 247925 114898
12201A05541O5525N9900J9718p3495q3510b3185A71369q1120K42198E5267N9269
$$ 105541 171066 230966 250684 177189 93679 -23185 171369 90249 332447 55267 114536
12190A14536J80636j21012o7978R9595f2947q2262G9612O3587c1287B34771r9555
$$ 114536 295172 174160 106182 205777 -62947 -145209 79612 143199 -31287 234771 135216
12179A35216i890B65416j1855o9512J5410M1114J72196A14126J46296i6167C64952
$$ 135216 -9890 265416 253561 184049 199459 240573 412769 114126 260422 -96167 364952
12167b47906J3392A84676J58101a12468C17431b48039E1930a9188C978e4887A87567
$$ -247906 -234514 184676 342777 -112468 317431 -248039 51930 -19188 3978 -54887 187567
12155C08503q642j47408o2260J661K35608d4496n0193B38464I6665g6949A6257
$$ 308503 299861 152453 90193 91854 327462 -44496 -94689 238464 96665 -76949 16257
12143a95970B62213f5745F0225J08731J09577g5292D8912e56579C07855m9499
$$ -195970 262213 -65745 60225 168956 278533 -75292 48912 -556579 307855 258356
12133B58356A25374a79505B930K97221K0806h0472A79189J24884J37921A96700
$$ 258356 125374 -179505 2930 300151 320957 -80472 179189 304073 441994 196700
12122B41258C0405a54706B38986h0852A87885p9855f3961B75363h4470g919j03325
$$ 241258 30405 -154706 238986 -80852 187885 108030 -63961 275363 -84470 -7919 -111244
12111a11244a5974r9289r3M2121J9275J4204l71773A17829E1389P6019K02112
$$ -111244 -15974 -115263 -115356 -73235 -53960 -39756 -411529 117829 51389 127408 329520
12100C29520F2012J62358o5568e3798o1264M0384K2542j71996B79523d038A58814
$$ 329520 62012 224370 158802 -53798 -115062 -74678 -52136 -224132 279523 -4038 158814
12088c79675c9705C52124a91285F5233a18712B00242E3461d6751A4537l230a02179
$$ -379675 -39705 352124 -191285 65233 -118712 200242 53461 -46751 14537 11307 -102179
12076b64150C75471A16940c17206F19878a02152C6297c679B85748k3709a02914
$$ -264150 375471 116940 -317206 619878 -102152 36297 -3679 285748 262039 -102914
12065A02027M5429a48160k41337g6268C56476b7512F9184c28610B18032O5066
$$ 102027 147456 -148160 -389497 -76268 356476 -27512 69184 -328610 218032 283098
12055B83098M24261P80226J285494G71324k34194r0752k10816p8508b280A50676
$$ 283098 707359 1487585 2773079 771324 537130 446378 235562 157054 -2280 150676
12044F651a33322A00924a1169j17065B3028K69945j29259C5263F773J92526j6287
$$ 6651 -133322 100924 -11169 -128234 23028 292973 163714 35263 6773 199299 183012
12033A83012M5427h9047j07880A89530r0982N6562O4046b9008B57120N8448c80458
$$ 183012 228439 -89047 -196927 189530 98548 155110 219156 -29008 257120 315568 -380458
12021B62597d6842j52018e9333I513a09298G9905c01173H678g8816a2458m87389
$$ 262597 -46842 -198860 -59333 9513 -109298 79905 -301173 8678 -78816 -12458 -499847
12010d99847A51349j6524b64192f9364a9379A37722M0923R8202f6794j02304K4360
$$ -499847 151349 134825 -264192 -69364 -19379 137722 178645 276847 -66794 -169098 -144738
11999a44738G4484a15454k3532k095c0227j25868k0935C96213A06841d3813p9837
$$ -144738 74484 -115454 -138986 -141081 -30227 -156095 -177030 396213 106841 -43813 -123650
11988a23650j55613a19842b7444C05233E1248d4574A80179b92048a33036D0649
$$ -123650 -279263 -119842 -27444 305233 51248 -44574 180179 -292048 -133036 40649
11977A37078k4421M4435c03421a15269F1947a46500A51519M5332b17792l7996
$$ 137078 112657 157092 -303421 -115269 61947 -146500 151519 196851 -217792 -255788
11967b55788G1016J34284i4603j25729H122d6912D879O9614J17042e5455j33374
$$ -255788 71016 205300 -94603 -220332 8122 -46912 4879 74493 191535 -55455 -188829
11956a88829D0714K67973g6539L1314a8531k5574C75805B4318K4438e4002B8037
$$ -188829 40714 308687 -76539 -45225 -18531 -44105 375805 24318 48756 -54002 28037
11944a07955F5341a12825D1015e9844K0815B06616k4802d3496p7731A24609C2100
$$ -107955 65341 -112825 41015 -59844 -39029 206616 181814 -43496 -121227 124609 32100
11932c61588e6832l2582l0193j08380j05513B89249j33129p831a06554j47024
$$ -361588 -56832 -89414 -119607 -227987 -333500 289249 156120 148289 -106554 -253578
11922b53578e7140A88471a3276A64059b62667d2920B37144a31496c3627G822K16883
$$ -253578 -57140 188471 -13276 164059 -262667 -42920 237144 -131496 -33627 7822 224705
11911B24705A8389b17476a3464m5324j28692P6189F7338L7449J34571p4147i1055
$$ 224705 18389 -217476 -13464 -58788 -187480 -111291 67338 104787 239358 165211 -91055
11899a12799B24758c266C10214b27273J08087l5973A86679a36623D7443b3637
$$ -112799 224758 -3266 310214 -227273 -119186 -155159 186679 -136623 47443 -23637
11888g3004l8964a0089B28846D8152B0922a89242J7020b1904j08727A02124l9426
$$ -73004 -111968 -10089 228846 48152 20922 -189242 -172222 -21904 -130631 102124 62698
11877F2698K42059c20734E4620a26005e1569A56114O814b2918l9819j24901L8364
$$ 62698 304757 -320734 54620 -126005 -51569 156114 162928 -22918 -62737 -187638 -149274
11866a49274M8317k1557r968B0038P6786c4420h507A32135c3000A99427L2604
$$ -149274 -100957 -122514 -132482 20038 96824 -34420 -8507 132135 -33000 199427 232031
11855B32031A09466a72713o9020F0702a18335b810j35909A16431c1598A10308
$$ 232031 109466 -172713 -241733 60702 -118335 -2810 -138719 116431 -31598 110308
11844d3010n1767I3005b0400F4000B0952a48274B09442G0349d81307c9027E8555
$$ -43010 -94777 93005 -20400 64000 20952 -148274 209442 70349 -481307 -39027 58555
11832a10081H8710e1948A72444a40376a9289H8707l2450K69159B1200j723a2645
$$ -110081 88710 -51948 172444 -140376 -19289 88707 56257 325416 21200 19477 -12645
11820c01806D4176J41718F7001J66729D0304a76639a4458j22257k1101D9486P1526
$$ -301806 44176 185894 67001 233730 40304 -176639 -14458 -136715 -157816 49486 121012
11809A21012b31268B70877d84297A6244a08678A55365Q0443A11238n0566e8010
$$ 121012 -231268 270877 -484297 16244 -108678 155365 235808 111238 60672 -58010
11798B0112a07044B30344c67929J58091i8603J459o4880j68793B62053b34788
$$ 20112 -107044 230344 -367929 -209838 -98603 -97144 -162024 -330817 262053 -234788
11787A22149a11417a3054j09911A83638B2856L7093K99560f5323A9448Q9421C5295
$$ 122149 -111417 -13054 -122965 183638 22856 59949 359509 -65323 19448 108869 35295
11775a90942c4157p7803B2628J55150o1975j4341h0219A83540a14771C09987I9668
$$ -190942 -34157 -111960 22628 177778 115803 101462 -80219 183540 -114771 309987 99668
11763c76869F1716J29253b16940k07073B24924q3844a67849E4394M1899e6918
$$ -376869 61716 190969 -216940 -424013 224924 141080 -167849 54394 96293 -56918
11752a81647b8132H2619i7492N198J6652k49371B050h5052k84834D4674a8815
$$ -181647 -28132 82619 -97492 -92294 -75642 -325013 2050 -85052 -369886 44674 -18815
11740B76990c83111A97977K716a00907a0371p035A74530p9594c9049k9494n055
$$ 276990 -383111 197977 200693 -100907 -10371 -17406 174530 94936 -39049 -68543 -73598
11729g3598B6149e6845k19415e864j35034C640O1674K5076m1948J71378q8994
$$ -73598 26149 -56845 -276260 -5864 -140898 3640 65314 90390 48442 219820 130826
11718A30826a8131B1038L26641B6104N6366f0116k68920a12639G480J66188G3396
$$ 130826 -18131 21038 347679 26104 82470 -60116 -329036 -112639 7480 173668 73396
11706A8362K1298a81725K5232H144L4009c81441B61117b6510e671o198A73662
$$ 18362 39660 -181725 -156493 8144 42153 -381441 261117 -26510 -5671 -11869 173662
11694c42061A32845k9021N2442N9979L106J50871A09731A5797a13966A65733K25800
$$ -342061 132845 103824 156266 216245 219351 370222 109731 15797 -113966 165733 391533
11683C91533A09142k8944J08551a63134B5559a62060B69337j06497b5292p0907
$$ 391533 109142 80198 188749 -163134 25559 -162060 269337 162840 -25292 -96199
11673i6199B4116M2694j8677P75g2310B46540e0529j89325P3566C23171D3499
$$ -96199 24116 66810 48133 48908 -72310 246540 -50529 -239854 -166288 323171 43499
11661A34129h2575C2396i4972C8755a05895B7884P515A4864J91794b04034A73676
$$ 134129 -82575 32396 -94972 38755 -105895 27884 35399 14864 206658 -204034 173676
11649E1047R5424J12022b1015A0808K59957a97514N5070A99324b09240a2555B40831
$$ 51047 146471 258493 -21015 10808 270765 -197514 -142444 199324 -209240 -12555 240831
11637A95575a3553k65466G7049E018K16606A03486A7978i8938L7625I3680g4652
$$ 195575 -13553 -279019 77049 5018 221624 103486 17978 -98938 -61313 93680 -74652
11625A12852h4785A71507a9898j15887C0758J44568b60521B0107P7437M0849F3898
$$ 112852 -84785 171507 -19898 -135785 30758 175326 -260521 20107 97544 138393 63898
11613c72496C06597c30802F5146J6334k1670i4560C89176j86490a46681G1735
$$ -372496 306597 -330802 65146 81480 59810 -94560 389176 202686 -146681 71735
11602C67916g1535p3629A02191L68306A34306J24048B8333d6276A99041J37992
$$ 367916 -71535 -145164 102191 470497 134306 258354 28333 -46276 199041 337033
11592C37033a06736j62262A84247F8263J43736e2110j20575g3357m5634A29919
$$ 337033 -106736 -268998 184247 68263 211999 -52110 -172685 -73357 -118991 129919
11581A95335d0011a4882D7855M7635L56613k10133N9853a2777I9246f716k25259
$$ 195335 -40011 -14882 47855 95490 452103 241970 301823 -12777 99246 -6716 -231975
11570b31975B65473l9971b75208O3281b7727n4161G6375P4446J9684P1177a31750
$$ -231975 265473 225502 -275208 -211927 -27727 -81888 76375 150821 170505 241682 -131750
11558B31496k1313B5153b7765A66633o8582J81899H142c161E3097o56b53498G5633
$$ 231496 210183 25153 -27765 166633 98051 279950 8142 -3161 53097 52441 -253498 75633
11545a14147B30742i0630c6544R482B62755a89826B41523a97960B22989a12554
$$ -114147 230742 -90630 -36544 -27062 262755 -189826 241523 -197960 222989 -112554
11534B26576K3819e9547C40912D9048J32014G4702L07314F2547L7548J24977a6087
$$ 226576 250395 -59547 340912 49048 181062 74702 382016 62547 100095 225072 -16087
11522e2467j32219j90401a54020B6720a66865m3159F0253R28p196J70008a59144
$$ -52467 -184686 -375087 -154020 26720 -166865 -210024 60253 61181 53985 223993 -159144
11510A44420N0999K4633K19053c0993C50131i7634I7810K1877D2608h2245A76056
$$ 144420 195419 220052 439105 -30993 350131 -97634 97810 119687 42608 -82245 176056
11498C02267d9490C10527l3301n5752e4113o4906a8877q4532E0282a28146A10262
$$ 302267 -49490 310527 277226 221474 -54113 -119019 -18877 -103409 50282 -128146 110262
11486g9746k05771I1468c3559J1739B8353c8804g363C89496C4695J53648m2786
$$ -79746 -285517 91468 -33559 -21820 28353 -38804 -7363 389496 34695 188343 145557
11475A45557j9969J05985M2498c25829P2751B64842e4494K249m6363D11463C535
$$ 145557 125588 231573 274071 -325829 -253078 264842 -54494 -52245 -98608 411463 3535
11463A6323f3738r2257l1865B27303r7867Q8533J77132A79509J47755c2184A43849
$$ 16323 -63738 -155995 -187860 227303 129436 217969 395101 179509 327264 -32184 143849
11451b28060E22796C9302a9039j21709b8351l5316A85747b66311B6933e3261E31001
$$ -228060 522796 39302 -19039 -140748 -28351 -63667 185747 -266311 26933 -53261 531001
11439C33311C6744J18476p0701J73607J59451A50017J91118j58110H1109h7841
$$ 333311 36744 155220 84519 258126 417577 150017 341135 183025 81109 -87841
11428B73029B6710e4798B34707B0435O5556a48712A46721J46731a56464a5608
$$ 273029 26710 -54798 234707 20435 85991 -148712 146721 293452 -156464 -15608
11417C52582e2328A20250O8125J38613A44551O6971a02825p6535q2007J26038
$$ 352582 -52328 120250 188375 326988 144551 211522 -102825 -179360 -261367 -135329
11407a35329A64962J3040c41419b5113A81179p9951c5827B04100E8403h9195m4677
$$ -135329 164962 178002 -341419 -25113 181179 101228 -35827 204100 58403 -89195 -133872
11396a33872k87867A7927h2989A2091K04892c32389B59604b8486B6072J11496
$$ -133872 -421739 17927 -82989 12091 216983 -332389 259604 -28486 26072 137568
11386A37568J94954A56690e0661p1579d4798k54066c8535B9808K01986b0989A51108
$$ 137568 332522 156690 -50661 -122240 -44798 -298864 -38535 29808 231794 -20989 151108
11374C7730c3553k62170Q6684H3687a00538A5143i7603A93008R1434h0387q7121
$$ 37730 -33553 -295723 -209039 83687 -100538 15143 -97603 193008 284442 -80387 -167508
11363a67508A8912J37881d6678j20249H8602K62426B1121a02200A51843o1536
$$ -167508 18912 156793 -46678 -166927 88602 351028 21121 -102200 151843 90307
11353I0307k7380N2117b48235A07755D3547K93018b6484m470C75074j45973j3982
$$ 90307 62927 115044 -248235 107755 43547 336565 -26484 -30954 375074 229101 215119
11342B15119d2102j03099j38682A60838a73453D92867G4010b82402B03341C0270
$$ 215119 -42102 -145201 -283883 160838 -173453 492867 74010 -282402 203341 30270
11331c5965C30750F9056J12489c71761b8929B22811K02987g9737I1022K77067
$$ -35965 330750 69056 181545 -371761 -28929 222811 425798 -79737 91022 368089
11321C68089D1791a256A26203b4809I2600B3703L8993K8117a06088D89773E4723
$$ 368089 41791 -1256 126203 -24809 92600 23703 62696 90813 -106088 489773 54723
11309b13885F2847b27281B61347k5722n6658H2984N2436c6721F988d85962K29249
$$ -213885 62847 -227281 261347 235625 178967 82984 135420 -36721 6988 -485962 -256713
11298b56713A16406d0780j4382n8655A4292K31593a44127D5114h5968k6801I0809
$$ -256713 116406 -40780 -55162 -113817 14292 245885 -144127 45114 -85968 -112769 90809
11286A2035a33879B08894M1761P2889b03133c2983j57281B50475r5669e6165D8210
$$ 12035 -133879 208894 250655 323544 -203133 -32983 -190264 250475 154806 -56165 48210
11274a51639m8782a00180d9165o9858C41653b52024b0099j26910p4635e1387G2519
$$ -151639 -200421 -100180 -49165 -119023 341653 -252024 -20099 -147009 -221644 -51387 72519
11262c7898l8991G0357a71694j52282a600C5770b22923R7991j6662c3913k37020
$$ -37898 -76889 70357 -171694 -323976 -1600 35770 -222923 -124932 -141594 -33913 -270933
11251b70933B37926c20133Q9140A32613J93368D7903e9481A13823e7552j874p719
$$ -270933 237926 -320133 -230993 132613 325981 47903 -59481 113823 -57552 -59426 -67145
11240f7145J0743B442K60648C7927B633a93633o944l7047a9732B3185b56141k772
$$ -67145 -56402 2442 263090 37927 2633 -193633 -200577 -237624 -19732 23185 -256141 -258913
11228b58913C4277a69505A99814b00727k25980h8381d3563j05203p8379D5552
$$ -258913 34277 -169505 199814 -200727 -426707 -88381 -43563 -148766 -227145 45552
11217a84301o98A59698A9737J5897f2606J614O401A5711a3838k8785A32926a78110
$$ -184301 -184999 159698 19737 35634 -62606 -60992 -54591 15711 -13838 -42623 132926 -178110
11204G0934A7087f5329j82473B73453c9954m6799j0976B919R3480l4649c00074
$$ 70934 17087 -65329 -247802 273453 -39954 -86753 -97729 2919 96399 61750 -300074
11192E3511c86043B34772h9783k70820J55697D0991d6138l08959B60228a71759
$$ 53511 -386043 234772 -89783 -360603 -204906 40991 -46138 -355097 260228 -171759
11181A01566b56786A09488a40831e8475A52483a29858d1598k50489O5544d0216
$$ 101566 -256786 109488 -140831 -58475 152483 -129858 -41598 -292087 -226543 -40216
11170A3986Q9838c13264L9620N7614n7268A93561M0545c30189j2476Q0293L2713
$$ 13986 103824 -313264 -273644 -216030 -273298 193561 234106 -330189 -342665 -262372 -229659
11159b29659A87395b09461I7857R3759q8862l7844a24927m840E3718P4234F1105
$$ -229659 187395 -209461 97857 191616 102754 64910 -124927 -129767 53718 127952 61105
11147b16349f0158k2087B7560Q0231k4730B8145K4977R2405b5291B25513N6000
$$ -216349 -60158 -82245 27560 107791 83061 28145 53122 145527 -25291 225513 281513
11136B81513a32171d7072B46309n8303a35547A01316J97272d2607n599n2139A12119
$$ 281513 -132171 -47072 246309 188006 -135547 101316 298588 -42607 -48206 -100345 112119
11124H2991c75611a47230C9213f426A71995g6949A08688e8061A18061h0707A06571
$$ 82991 -375611 -147230 39213 -6426 171995 -76949 108688 -58061 118061 -80707 106571
11112A25678C113i6465k06115e7354A17097B5101J88834J00355a46864n6453I1570
$$ 125678 3113 -96465 -302580 -57354 117097 25101 213935 314290 -146864 -203317 91570
11100A24337a90065L5948k22250a34956A05597L2684K88582L6124A98980O2631
$$ 124337 -190065 -154117 -376367 -134956 105597 138281 426863 462987 198980 261611
11090B61611F4109K88889G1008J4589J69669c789A42195A6479L0324J87731K1458
$$ 261611 64109 352998 71008 85597 255266 -3789 142195 16479 46803 234534 255992
11079B55992h6282Q559C40871J8265f2376r7391A63100b23323B8429J44116J88608
$$ 255992 -86282 -77723 340871 359136 -62376 -159767 163100 -223323 28429 172545 361153
11068C61153c75229B27459o5714L8541C0796K12829O1266A18186o898J042C674
$$ 361153 -375229 227459 161745 200286 30796 243625 304891 118186 111288 112330 3674
11056A22602P3462J75714a2573C83773K19074A34076J94856k8064C8128M8069
$$ 122602 196064 371778 -12573 383773 602847 134076 328932 300868 38128 86197
11046H6197n911K82535A03980J07571D6889J23182M8128J94313j98452L44020
$$ 86197 80286 362821 103980 211551 46889 170071 218199 412512 214060 558080
11036E58080j35174J25554B66183J63227J58001N2029k8818R9805l10560L6124
$$ 558080 422906 548460 266183 429410 587411 639440 610622 710427 399867 435991
11026D35991L00270n4080j87770J09413j02147J86800J7997j75527J18833j40532
$$ 435991 736261 682181 494411 603824 501677 688477 706474 530947 649780 509248
11016E09248L59607k02455J1369j31926J69350j36941M6273k18948R6675L5134
$$ 509248 868855 666400 677769 545843 715193 578252 624525 405577 502252 537386
11006E37386P6741k06236J0706K06225j12548J12358J9238J16715k84604R8863
$$ 537386 614127 407891 418597 624822 512274 624632 643870 760585 475981 574844
10996E74844J75251B87053M68683o2519j51446j97774m0734K31479K49792k30659
$$ 574844 750095 287053 755736 693217 541771 343997 303263 534742 784534 553875
10986E53875Q6359J9242q1458K23751C87474K89330m2032k46085M56064k50280
$$ 553875 640234 659476 578018 801769 387474 676804 634772 388687 844751 594471
10976E94471o6882j09374K13456C07377J77925J32632J87194L7102l95257Q4881
$$ 594471 527589 418215 631671 307377 485302 617934 805128 842230 446973 531854
10966E31854J76713J48435k30632J17161M7004L5278M0405j90678K70808K80953
$$ 531854 708567 857002 626370 743531 790535 825813 866218 675540 946348 1227301
10956A227301l27325J47144j86739M9697Q3981J60111K69773K42884J06646J99020
$$ 1227301 899976 1047120 860381 910078 994059 1154170 1423943 1666827 1773473 1972493
10946A972493L89374L19965l10938Q8984P6141J45177l60723n05825j07195j31954
$$ 1972493 2361867 2681832 2370894 2459878 2536019 2681196 2320473 1814648 1707453 1575499
10936A575499j85009K30345k29227J45713J93414k76929M25733k08787R9157l18717
$$ 1575499 1390490 1620835 1391608 1537321 1730735 1453806 1879539 1670752 1769909 1451192
10926A451192l0287k92677l8957j10622k60914J11530k12684n7341N2019F8090
$$ 1451192 1420905 1128228 1089271 978649 717735 829265 616581 559240 611259 68090
10915A35930F1057K40844r4969A9992K01132N712o1696N1864L8758h7008C0322
$$ 135930 61057 301901 206932 19992 221124 226836 165140 217004 255762 -87008 30322
10903B68565a44761j54945I8701c4871l16229B01485e296l20515a22220B33594
$$ 268565 -144761 -299706 98701 -34871 -351100 201485 -5296 -325811 -122220 233594
10892b63950B53609K7511c8020j10356A26212P2814P5564D3393Q7620b70000L9370
$$ -263950 253609 281120 -38020 -148376 126212 199026 274590 43393 131013 -270000 -230630
10881b30630F6499a05194c2582E3959K3605J3235J40229a08425r1531A6999J11402
$$ -230630 66499 -105194 -32582 53959 77564 90799 231028 -108425 -199956 16999 128401
10870A28401a21962o003J8705A85176D5217h4659B47086h597j92453F3744C1804
$$ 128401 -121962 -127965 -109260 185176 45217 -84659 247086 -8597 -201050 63744 31804
10858B24445m2081a71077A24678R8223j03815L8676d9968A7757e9772H5540g4853
$$ 224445 182364 -171077 124678 222901 119086 157762 -49968 17757 -59772 85540 -74853
10846F3475h6686J3299I1387c6294l85503D9821N6453i4587D71533H2815a50941
$$ 63475 -86686 -73387 91387 -36294 -421797 49821 106274 -94587 471533 82815 -150941
10834F861c22063h8079j03420A40701a47366b9725M035B03528O0630d21349B62454
$$ 6861 -322063 -88079 -191499 140701 -147366 -29725 -25690 203528 264158 -421349 262454
10822e421j37040M3126H4159J82201q9844b82285i3021J9048C0978e7748B54245
$$ -5421 -142461 -99335 84159 266360 176516 -282285 -93021 -73973 30978 -57748 254245
10810F1084b34804B42501i7180j15974f3507j24890g480A1317J87655F0877h6155
$$ 61084 -234804 242501 -97180 -213154 -63507 -188397 -7480 11317 198972 60877 -86155
10798b17309o9708J38142r5620h1890k8573a8656q8736j4186E5685a69068b7162
$$ -217309 -287017 -148875 -244495 -81890 -110463 -18656 -107392 -121578 55685 -169068 -27162
10786c17900J37B09277i7812M7688l1672B26191a0957j4775B40882H0470a54004
$$ -317900 -317763 209277 -97812 -50124 -81796 226191 -10957 -25732 240882 80470 -154004
10774f7287j452H6653g6581A92909l5570M1967c9611B7174b09467B40546j12434
$$ -67287 -68739 86653 -76581 192909 157339 199306 -39611 27174 -209467 240546 128112
10763A28112D419a29735R312e9420m1654A09497L7316D758N8608c41121a01636
$$ 128112 4419 -129735 -120423 -59420 -101074 109497 146813 4758 63366 -341121 -101636
10751a63199k89068c9088a0882A97890a12104j08637b573j9205l51073b4673o4539
$$ -163199 -452267 -39088 -10882 197890 -112104 -220741 -2573 -21778 -372851 -24673 -89212
10740h9212L8413k36119b2157A75804A1372b19863O7210m2975B3689a33058M2920
$$ -89212 -50799 -286918 -22157 175804 11372 -219863 -152653 -195628 23689 -133058 -90138
10729i0138k45530C08380b92269A59173d3644E7716b85177N8391A09638h6143
$$ -90138 -335668 308380 -292269 159173 -43644 57716 -285177 -226786 109638 -86143
10718a7229k6287m9071F4400a29990e0959r6866b4703B78882G1975a29309d811
$$ -17229 -43516 -92587 64400 -129990 -50959 -147825 -24703 278882 71975 -129309 -4811
10706b45870P1548e8932j70635B10699n6077k7097a2232l27182J69412h1836C63992
$$ -245870 -174322 -58932 -229567 210699 154622 127525 -12232 -339414 -170002 -81836 363992
10694a24539K1915A48726F1694a0495B29077i7476B37399d5757C3558J63488c20913
$$ -124539 -102624 148726 61694 -10495 229077 -97476 237399 -45757 33558 197046 -320913
10682C6686i9273B42942A04905O3005b25731L4117P9213l7872j07043B67213c48798
$$ 36686 -99273 242942 104905 167910 -225731 -191614 -112401 -150273 -257316 267213 -348798
10670a83979J6697l4026E8507K3220J30641a09984B84182a42861M6593B20665
$$ -183979 -167282 -201308 58507 81727 212368 -109984 284182 -142861 -96268 220665
10659d23984j09997a73299A82504i6675J7900B66648a38514J1260l4346I2744
$$ -423984 -533981 -173299 182504 -96675 -78775 266648 -138514 -127254 -161600 92744
10648C8044b83064L8578j22997A77465l1408O9877I102b31510F7808a1822D208
$$ 38044 -283064 -244486 -367483 177465 146057 215934 9102 -231510 67808 -11822 4208
10636A89993d52872G6484Q1342a2814A49940J49049c1556A4268h5499l5101b0244
$$ 189993 -452872 76484 157826 -12814 149940 298989 -31556 14268 -85499 -120600 -20244
10624b0578c380l10267d830A2617K39087b2151A64227C352c6959j06640F20117
$$ -20578 -3380 -313647 -4830 12617 251704 -22151 164227 3352 -36959 -143599 620117
10612c37663Q5672g7696j47964F7807H832d3446H340a68549m6774R971B28403
$$ -337663 -251991 -77696 -225660 67807 8832 -43446 8340 -168549 -215323 -205352 228403
10600A43083a72932f0894j01336b4279A50105b74201J10453A10827k3988a46923
$$ 143083 -172932 -60894 -162230 -24279 150105 -274201 -163748 110827 86839 -146923
10589i4433l54368J83239a27614d7774K193B02943F3976J4975b66224A92990K1757
$$ -94433 -448801 -265562 -127614 -47774 -45581 202943 63976 78951 -266224 192990 214747
10578B14747e7870p8516A21019a65188j74792J31184q4630a8247B8469L7408g6352
$$ 214747 -57870 -136386 121019 -165188 -339980 -208796 -293426 -18247 28469 65877 -76352
10566E3587a88635e2145j43390D6811N3294J89661h9205A38474A6338g0108H5851
$$ 53587 -188635 -52145 -195535 46811 100105 289766 -89205 138474 16338 -70108 85851
10554f0172i652A05245A8864b63046l11435d5704A2148b9397p3426b5819m498
$$ -60172 -9652 105245 18864 -263046 -574481 -45704 12148 -29397 -102823 -25819 -30317
10543c0317l9476B85991i2269j73557A74663A5960b55951A92572e33067a34881
$$ -30317 -69793 285991 -92269 -265826 174663 15960 -255951 192572 -533067 -134881
10532f7900B3922d4246G4751J77960e2084j86246C4992B00b3149j13702A24047
$$ -67900 23922 -44246 74751 252711 -52084 -238330 34992 200 -23149 -136851 124047
10520A41350g5728a1250j18197B94672a9346q3552a1262p2768k96442A96033q7547
$$ 141350 -75728 -11250 -129447 294672 -19346 -102898 -11262 -84030 -380472 196033 108486
10509A08486c84579a45625A25781h3692D6303K76409a60742a9562k07825P550
$$ 108486 -384579 -145625 125781 -83692 46303 322712 -160742 -19562 -227387 -219837
10499b19837A31379O543b21369b2377C24803C0680J9600b7194k03755A76721J7052
$$ -219837 131379 137922 -221369 -22377 324803 30680 50280 -27194 -230949 176721 193773
10488A93773b4628p1181J6982L7182I9964l5292K42832b0163B91300A25267d3789
$$ 193773 -24628 -95809 -78827 -41645 99964 64672 307504 -20163 291300 125267 -43789
10476c30304H2357M7306f0012k23610A44768f582A51432D9123b32876i1200B85875
$$ -330304 82357 129663 -60012 -283622 144768 -6582 151432 49123 -232876 -91200 285875
10464f5184p3968G971d7195C73309b9276A57058A1402J23343k155K73486f160
$$ -65184 -139152 7971 -47195 373309 -29276 157058 11402 134745 132590 406076 -6160
10452E13193j238K56417A36401O9663c598B53169a26927B58696b4983j24177L0500
$$ 513193 511955 768372 136401 206064 -3598 253169 -126927 258696 -24983 -149160 -118660
10441a18660F1142J38583F7930a45857N4314j39236P5554c562k83721e6414l2767
$$ -118660 61142 199725 67930 -145857 -91543 -230779 -155225 -3562 -287283 -56414 -89181
10430h9181k12063A6024J817b70223E9578c28176b7081B1653J63942K2232G8662
$$ -89181 -301244 16024 17841 -270223 59578 -328176 -27081 21653 185595 207827 78662
10418b72129b429C69151E2049a03036D0882j6014L3014a50538A4623J2265J55613
$$ -272129 -2429 369151 52049 -103036 40882 24868 57882 -150538 14623 26888 182501
10407A82501I489a9036m6162q9854G706O236b16210M7357e3746l3433c6337C8092
$$ 182501 9489 -19036 -65198 -155052 7706 13942 -216210 -168853 -53746 -87179 -36337 38092
10394b61385C46740D0277Q5333k8416R4913C5974a35045d9897k60769e3260A89351
$$ -261385 346740 40277 125610 97194 192107 35974 -135045 -49897 -310666 -53260 189351
10382a71667l2820E1241b30840a11847c5571l8127B7755i7581j9145A74282M0829
$$ -171667 -204487 51241 -230840 -111847 -35571 -73698 27755 -97581 -116726 174282 215111
10371B15111A01845l2195B4705J40592Q0310d8578B24427b1024j49064G1149J15205
$$ 215111 101845 69650 24705 165297 245607 -48578 224427 -21024 -170088 71149 186354
10360A86354n8556a66593r3513B69329e809B0418a28103C11374p5487g6181B06398
$$ 186354 127798 -166593 -260106 269329 -5809 20418 -128103 311374 235887 -76181 206398
10348A9322c36844A85871p8531b07004B19739M03319B53678i847B00445J75798
$$ 19322 -336844 185871 107340 -207004 219739 623058 253678 -9847 200445 376243
10338C76243L54829A42473M12605A10490R2954J49246j44366L6253C7358b582
$$ 376243 731072 142473 555078 110490 203444 352690 208324 244577 37358 -2582
10327A10362J78365A07710R4711R2021K02754J64250p385A83775K08731J58828
$$ 110362 288727 107710 202421 294442 497196 661446 654061 183775 392506 551334
10317E51334B42603J06660J07980a9907j09226B7254M31477j09637C3957J79828
$$ 551334 242603 349263 457243 -19907 -129133 27254 458731 349094 33957 213785
10307B13785J33173j14600b4011D9153J80224i27B6302c620j04404D07449c21499
$$ 213785 346958 232358 -24011 49153 229377 -927 26302 -3620 -108024 407449 -321499
10295B05908I0135J03129H4567a31642F7678L3781j195b331B0051J62589e4460
$$ 205908 90135 193264 84567 -131642 67678 101459 100264 -2331 20051 182640 -54460
10283A25113D3255g0664D0280b43303C54843G4935a6379o9131A65717F1459d2982
$$ 125113 43255 -70664 40280 -243303 354843 74935 -16379 -85510 165717 61459 -42982
10271D870g9901C20352A40212a66078g6386I8137c371q5468b5069a575k40328
$$ 4870 -79901 320352 140212 -166078 -76386 98137 -3371 -88839 -25069 -1575 -241903
10260b41903M3593i1556m09690G1562b49437B89796m9337d39943B64938h640A36612
$$ -241903 -198310 -91556 -501246 71562 -249437 289796 240459 -439943 264938 -8640 136612
10248a75598c6887j61367J5434A09983f3254j02496j82497a04331E0875A4902
$$ -175598 -36887 -198254 -182820 109983 -63254 -165750 -348247 -104331 50875 14902
10237c84704A77936a38379d0013a0787j6857C1045L46689K54213A0468L55331
$$ -384704 177936 -138379 -40013 -10787 -27644 31045 377734 631947 10468 365799
10227C65799H4223a1618d202A32691c72858A16060g6824A62384a87120o7880L1179
$$ 365799 84223 -11618 -4202 132691 -372858 116060 -76824 162384 -187120 -255000 -223821
10216b23821C6437b2877m5084C08217a88637G3515b4019r5863A17545a29488n6121
$$ -223821 36437 -22877 -67961 308217 -188637 73515 -24019 -119882 117545 -129488 -185609
10205a85609j31535R5230B40092b06687H6150J55143L8730h3648B07c43468I9810
$$ -185609 -317144 -221914 240092 -206687 86150 241293 280023 -83648 207 -343468 99810
10193B4686J26766G1771a13326N1054A38151D1739c5834j18841e0058P12q4158
$$ 24686 151452 71771 -113326 -62272 138151 41739 -35834 -154675 -50058 -49346 -133504
10182a33504E2170b4667f301j75697j55962B84722a70271H1566b07514R0866G410
$$ -133504 52170 -24667 -6301 -181998 -337960 284722 -170271 81566 -207514 -116648 7410
10170a95115J3134j53794b1879j68387B4749K62243a47632p7101J07206c8069
$$ -195115 -181981 -335775 -21879 -190266 24749 286992 -147632 -224733 -117527 -38069
10159e9599J3837B6048N1210d9079A3203a05964k9071n1699A35089h5461K1102
$$ -59599 -45762 26048 77258 -49079 13203 -105964 -135035 -186734 135089 -85461 -64359
10148f4359d111l12195b4407A26692f5721q993j04192r3642F6429b2160k26821
$$ -64359 -4111 -316306 -24407 126692 -65721 -74714 -178906 -272548 66429 -22160 -248981
10137b48981A37748b17733a06277C3817N5310j3781c3154A12726b42045O6555
$$ -248981 137748 -217733 -106277 33817 89127 75346 -33154 112726 -242045 -175490
10127a75490B18555h9871c8271p2591j37485m7192B8695h4108C7897a85601c5504
$$ -175490 218555 -89871 -38271 -110862 -248347 -295539 28695 -84108 37897 -185601 -35504
10115a29426j52303P5933H575K01065c54838R8461K7036P418e3540k50892J14327
$$ -129426 -281729 -205796 8575 209640 -354838 -256377 -229341 -221923 -53540 -304432 -190105
10104a90105e8462L029A99193p5619m6548i613B4403Q4534J72099a25501C2126
$$ -190105 -58462 -55433 199193 123574 77026 -9613 24403 108937 281036 -125501 32126
10092a02865j72961f5419a4416A45309a32158F2169A8151K5356e25805D73590
$$ -102865 -275826 -65419 -14416 145309 -132158 62169 18151 43507 -525805 473590
10081C46097a00807m0863j45260A50719k4354a35610A90238F9155b80427h1713
$$ 346097 -100807 -141670 -286930 150719 126365 -135610 190238 69155 -280427 -81713
10070g6497D2552b36642D11556C8622a34493k0808A94121b20683K9987B3047J41263
$$ -76497 42552 -236642 411556 38622 -134493 -155301 194121 -220683 -190696 23047 164310
10059A64310c2809g495A51705A7167J15595h2153c1433k06328L0449j63941J60615
$$ 164310 -32809 -7495 151705 17167 132762 -82153 -31433 -237761 -207312 -371253 -210638
10048b10638A52997c61621h4721m461E3986a26456A15980b07708K0961g9030j7495
$$ -210638 152997 -361621 -84721 -89182 53986 -126456 115980 -207708 -186747 -79030 -96525
10037i6525A12932A5182b36520J3208A9570b67774A0194K18126a38535C2557a6192
$$ -96525 112932 15182 -236520 -223312 19570 -267774 10194 228320 -138535 32557 -16192
10025b59179A60017a57251o6167B3703J256b23620j1519R5948A48448f1979C12282
$$ -259179 160017 -157251 -223418 23703 24959 -223620 -235139 -139191 148448 -61979 312282
10013B87254A22595a33782L327j5787a3914j64792j01459g9802H4886J00671a43715
$$ 287254 122595 -133782 -130455 -146242 -13914 -178706 -280165 -79802 84886 185557 -143715
10001A76355n5415B2344c0220C5634a73630M9488B6637J57862b08057h8631k67292
$$ 176355 120940 22344 -30220 35634 -173630 -124142 26637 184499 -208057 -88631 -355923
9990c55923J51814N9849O1212A11619M6315a42883D8388f8730n1326r511o2025
$$ -355923 -204109 -144260 -83048 111619 157934 -142883 48388 -68730 -120056 -129567 -191592
9979a91592A11884b56445c6036p3952j23077j38846L7013C06597b53083A12231
$$ -191592 111884 -256445 -36036 -109988 -233065 -371911 -334898 306597 -253083 112231
9968a09822d4667H0849c44111e0070B2955a764G0887b90807I936a02846B58322
$$ -109822 -44667 80849 -344111 -50070 22955 -1764 70887 -290807 9936 -102846 258322
9956b4195H2587M2087b64225j3916f2086k50565e5750r1850E6279a0398o3386
$$ -24195 82587 124674 -264225 -278141 -62086 -312651 -55750 -147600 56279 -10398 -73784
9945g3784G1812a74735A083P2213a78002j51538r533m283a17090j13868J02672
$$ -73784 71812 -174735 1083 73296 -178002 -329540 -339073 -343356 -117090 -230958 -128286
9934a28286k9031j71662A49669g9035C3855b07675g6201B25576D0600g2665A08090
$$ -128286 -157317 -328979 149669 -79035 33855 -207675 -76201 225576 40600 -72665 108090
9922a02735I3889b08584d5648J4631j72766B26086J41662g258k10313M8613f9607
$$ -102735 93889 -208584 -45648 -31017 -203783 226086 367748 -7258 -217571 -168958 -69607
9910A49238g9610A27738c69723i0660j41522A37911b64534j4668f0733H8677g950
$$ 149238 -79610 127738 -369723 -90660 -232182 137911 -264534 -279202 -60733 88677 -7950
9898A86463b41094L8258H9304D4284a88138m556R0265A65784E8009J8494f5616
$$ 186463 -241094 -202836 89304 44284 -188138 -192694 -102429 165784 58009 76503 -65616
9886a23950l3626a6920j20667D8348a41314I264J12122d9369k00651g095k57512
$$ -123950 -157576 -16920 -137587 48348 -141314 9264 121386 -49369 -250020 -7095 -264607
9875b64607R6667B50402C7087A5542a36869j49860A17665C2769b82285d9483l34862
$$ -264607 -167940 250402 37087 15542 -136869 -286729 117665 32769 -282285 -49483 -384345
9864c84345J82396P0954m4902e8104B28022d2400A89227b51512B93524a99923
$$ -384345 -201949 -130995 -175897 -58104 228022 -42400 189227 -251512 293524 -199923
9853b2456A11523L5696F6853j852b93299J02877O5063n9954n5027a7015A19579
$$ -22456 111523 147219 66853 65001 -293299 -190422 -125359 -185313 -240340 -17015 119579
9841b79188l1901J02080g8172o6122a0652H1860l8228b85902i1927j70719e5915
$$ -279188 -311089 -209009 -78172 -144294 -10652 81860 43632 -285902 -91927 -262646 -55915
9829h2780L458j5173k3795J1476A03051b19727a07276n1597j08643L5959E2687
$$ -82780 -79322 -94495 -118290 -106814 103051 -219727 -107276 -158873 -267516 -231557 52687
9817a45779e1165j55452R8683K2864F3091b03681b4199A41124g2542j65442K8060
$$ -145779 -51165 -206617 -107934 -85070 63091 -203681 -24199 141124 -72542 -237984 -209924
9806b09924C12550H574c1867l2879B39492b84816B89844c80149B2240a83075A9850
$$ -209924 312550 8574 -31867 -64746 239492 -284816 289844 -380149 22240 -183075 19850
9794a27081J6651j5779B9788c75986J49980J0599K8764A30599b4571k19618p21
$$ -127081 -110430 -126209 29788 -375986 -226006 -215407 -186643 130599 -24571 -244189 -244910
9783b44910P5647O4324l4098c9025J1569A64176b57709Q9069M024A50703a96017
$$ -244910 -169263 -104939 -139037 -39025 -27456 164176 -257709 -168640 -164616 150703 -196017
9771h4046k50377f1339j86001J11019l2282j58279E9420B9511J67004b69793J5578
$$ -84046 -334423 -61339 -247340 -136321 -168603 -326882 59420 29511 196515 -269793 -254215
9760b54215A18569b38568l8623h1116c2711j4148H8798a54582A67613d69075a3781
$$ -254215 118569 -238568 -277191 -81116 -32711 -46859 88798 -154582 167613 -469075 -13781
9748b13769b6019B01243h3508j58439O6007P0448D6794h2404q6993M1478K6963
$$ -213769 -26019 201243 -83508 -241947 -175940 -105492 46794 -82404 -169397 -127919 -100956
9737a00956j7936B36219b44749h2611A00957n0047a45964I4255a9156f672C10423
$$ -100956 -118892 236219 -244749 -82611 100957 50910 -145964 94255 -19156 -6672 310423
9725B08658a58003B3416d02726A60513b09242B1311a40398e4047m3241B8772a0877
$$ 208658 -158003 23416 -402726 160513 -209242 21311 -140398 -54047 -97288 28772 -10877
9713c7013m59197e1217m10742k8792a94704l1182g4862l2769A78244D4468b71911
$$ -37013 -496210 -51217 -461959 -490751 -194704 -225886 -74862 -107631 178244 44468 -271911
9701b3690j08033j03139b8748m0114A10757i4912o469M7624g037r0896M7985j9207
$$ -23690 -131723 -234862 -28748 -68862 110757 -94912 -101381 -53757 -7037 -97933 -49948 -69155
9689f9155a3022m6349H1480k7488c3021k64338G5297P6613K47915a43502C7834
$$ -69155 -13022 -59371 81480 53992 -33021 -297359 75297 151910 399825 -143502 37834
9677a88893E5123i5744b3020j27943P0978A66123R2184F7995b50291a9898C02904
$$ -188893 55123 -95744 -23020 -150963 -79985 166123 258307 67995 -250291 -19898 302904
9665b3101k69846e2699D6327a95297f904j69021A24024c68633A3350R4608a83738
$$ -23101 -292947 -52699 46327 -195297 -6904 -175925 124024 -368633 13350 107958 -183738
9653F3157a6380k47264J03125H7834c18016A8217J18562b26309R8833B21677a52260
$$ 63157 -16380 -263644 -160519 87834 -318016 18217 136779 -226309 -127476 221677 -152260
9641C5700K38857a53604o0798j09841B9484i448o2485c1472A26694c15399a35239
$$ 35700 274557 -153604 -214402 -324243 29484 -9448 -71933 -31472 126694 -315399 -135239
9629a89249A76433o3048f5890k70999n6919i2129B14362a11426a1316m5356q010
$$ -189249 176433 113385 -65890 -336889 -393808 -92129 214362 -111426 -11316 -56672 -64682
9618f4682m400F0568L37049a73157a0160j81062E334a46936H151b26891J482g5678
$$ -64682 -69082 60568 397617 -173157 -10160 -191222 5334 -146936 8151 -226891 -225409 -75678
9605A13241A72i580k32849a10747M8925F1837N2433g1209B9373n107J58182a41117
$$ 113241 172 -9580 -242429 -110747 -61822 61837 114270 -71209 29373 24266 182448 -141117
9592b4047o2380A4929L3721c178j44565d9907G8760C022f0243j62373H885b68082
$$ -24047 -86427 14929 48650 -3178 -147743 -49907 78760 3022 -60243 -222616 8885 -268082
9579A2756J6169j3969b36700c0763r0472k8828E832L6827J73548J11505I6537
$$ 12756 28925 14956 -236700 -30763 -121235 -150063 5832 42659 216207 327712 96537
9567e0747D3318J3107J13106Pe0322C8623b45261n4421A19496D6796e5700C12663
$$ -50747 43318 56425 169531 169538 -50322 38623 -245261 -299682 119496 46796 -55700 312663
9554f7206F5482c6221k5356o70r3601A97643G1586K5473d94686c4037k40403i2456
$$ -67206 65482 -36221 -61577 -62247 -155848 197643 71586 97059 -494686 -34037 -274440 -92456
9541C3542c98972a16649K3518d2483F5151f4569k43865a49862K0275k09917a33734
$$ 33542 -398972 -116649 -93131 -42483 65151 -64569 -308434 -149862 -129587 -339504 -133734
9529G9909c2781j21142j46765A51688A8988O2546D815c8105A24613b9381r5404
$$ 79909 -32781 -153923 -300688 151688 18988 81534 4815 -38105 124613 -29381 -124785
9518a24785d6711o7712C54658F5828f0076j9509l5866a0941j51841G1197K05656
$$ -124785 -46711 -114423 354658 65828 -60076 -79585 -115451 -10941 -162782 71197 276853
9507B76853H7975c5697C9853b31263f9292A9252a3425m074j47932b2180i61k99310
$$ 276853 87975 -35697 39853 -231263 -69292 19252 -13425 -17499 -165431 -22180 -961 -300271
9495c00271k9387a44503O9848B40895d72832D5394J33075a36890K5764D65228
$$ -300271 -329658 -144503 -74655 240895 -472832 45394 178469 -136890 -111126 465228
9484f9731k23417L6810q5852h0112k1640A3284L0412J4719a25958j39245D0486
$$ -69731 -293148 -256338 -342190 -80112 -101752 13284 43696 58415 -125958 -265203 40486
9472e5455q0817d2940H066b56595B80573b31555m6555h6109r2314J1388j87506
$$ -55455 -136272 -42940 8066 -256595 280573 -231555 -278110 -86109 -178423 -167035 -354541
9461c54541B68110a57338C2591a86438P4973K7431k7314j94699C5301d847B3292
$$ -354541 268110 -157338 32591 -186438 -111465 -84034 -111348 -306047 35301 -4847 23292
9449B8009Q3105a04713j39567B0850f6010Q601H979R2836a3867j80256A81775
$$ 28009 111114 -104713 -244280 20850 -66010 -57409 8979 101815 -13867 -194123 181775
9437a25911o1128e6056a4959o3225B03286d2131j14642C25945b56742B14589h4723
$$ -125911 -187039 -56056 -14959 -78184 203286 -42131 -156773 325945 -256742 214589 -84723
9425B57355e17974a28214n7594O6867J2410j2835e3017r5951A42637h2761j86706
$$ 257355 -517974 -128214 -185808 -118941 -106531 -119366 -53017 -148968 142637 -82761 -269467
9414b69467O3173h537j51021p0992M8401j36567q6946a89231e2228I1480c811
$$ -269467 -206294 -8537 -159558 -230550 -182149 -318716 -405662 -189231 -52228 91480 -3811
9402A41638b20805f9231F2131a44032A43386A2476K63280a20431H0502c530o3659
$$ 141638 -220805 -69231 62131 -144032 143386 12476 275756 -120431 80502 -3530 -67189
9391f7189K3484q7667p6091e6285G5181B0300c41894A06020A8367K30492G3851
$$ -67189 -43705 -131372 -207463 -56285 75181 20300 -341894 106020 18367 248859 73851
9379b48234M0682k59544a11408K4305A67472b90969C455J36761d3695A39697a09266
$$ -248234 -207552 -467096 -111408 -87103 167472 -290969 3455 140216 -43695 139697 -109266
9367a13359F7583L26376b675B44358D9a10894H7134J55a53846j40609R6349g4979
$$ -113359 67583 393959 -2675 244358 49 -110894 87134 87289 -153846 -294455 -198106 -74979
9354e1503o0610F3677a9062p3244j04994B9885a54262A99274b53322C4982Q20
$$ -51503 -112113 63677 -19062 -92306 -197300 29885 -154262 199274 -253322 34982 35802
9343C5802K60931b9706a3514k5047j08714G2192k755J65817J1978H9904J46146
$$ 35802 296733 -29706 -13514 -38561 -147275 72192 69437 235254 247232 89904 236050
9332B36050a91920k45819J94589j27794i3348K5353j51296B3471K574b03157k276
$$ 236050 -191920 -437739 -243150 -370944 -93348 -67995 -219291 23471 26045 -203157 -205433
9321b05433R2585b6342I7882a59017n8019D683a76563L2963H6447a31939d2204
$$ -205433 -112848 -26342 97882 -159017 -217036 4683 -176563 -143600 86447 -131939 -42204
9309D2011a63568l2382e1703r6197l7902A19281a62748l85351E5408d6104C0718
$$ 42011 -163568 -195950 -51703 -147900 -185802 119281 -162748 -548099 55408 -46104 30718
9297E1155c28011J55340j27272J44882N6849m3605L7611l2835j15279E405K18837
$$ 51155 -328011 -172671 -299943 -155061 -98212 -141817 -104206 -137041 -252320 5405 224242
9286B24242a81424K1644l9369m4712j60980A67762n1699b2121B04318f1314k2517
$$ 224242 -181424 -159780 -199149 -243861 -404841 167762 116063 -22121 204318 -61314 -83831
9275h3831H7836b74222J21166E9754e3017o1186j51573a07384I6302a89868M4721
$$ -83831 87836 -274222 -153056 59754 -53017 -114203 -265776 -107384 96302 -189868 -145147
9264a45147l2289A6109M8181h7212L6334A80250b70136A37199J21511i2710F5502
$$ -145147 -177436 16109 64290 -87212 -50878 180250 -270136 137199 258710 -92710 65502
9252c56021a67104J366F5733J04571b5330d22r2021A01501f1883j82936B413b81914
$$ -356021 -167104 -165738 65733 170304 -25330 -422 -92443 101501 -61883 -244819 2413 -281914
9239a97971R3228B9576e6010A44068F9125a17236k45935c6994C8499b57071A5182
$$ -197971 -104743 29576 -56010 144068 69125 -117236 -363171 -36994 38499 -257071 15182
9227a54499J5345B21744a42057B4981g9133j18473c7355C12695G5289a4879A9073
$$ -154499 -139154 221744 -142057 24981 -79133 -197606 -37355 312695 75289 -14879 19073
9215a62425D394J36188g658j20020C5155P1491a67983A18174h3911B66929a8796
$$ -162425 4394 140582 -7658 -127678 35155 106646 -167983 118174 -83911 266929 -18796
9203C0266a40515j49159B3112f4249j20573A53014K4165f0520I9475R0488G7985
$$ 30266 -140515 -289674 23112 -64249 -184822 153014 177179 -60520 99475 189963 77985
9191b45089A06451K4298F0510d14398K9176J58547A78335h5913M0312l10220J45869
$$ -245089 106451 130749 60510 -414398 -385222 -226675 178335 -85913 -45601 -355821 -209952
9180b09952i3372j44616a18530K0645a8609k41042d081D5735A8636K25371a28248
$$ -209952 -93372 -237988 -118530 -97885 -18609 -259651 -4081 45735 18636 244007 -128248
9168A73896b16692H990M5538i0039m9217j46980A05979m5093J23998e8785k13824
$$ 173896 -216692 8990 54528 -90039 -139256 -286236 105979 60886 184884 -58785 -272609
9157b72609B22163h8132B3524J6840h2262E7137b5913G825d29169B7551j78b76479
$$ -272609 222163 -88132 23524 40364 -82262 57137 -25913 7825 -429169 27551 27373 -276479
9144a64573j0436b1806m9678l4554J1348A0910c5138k1236m9381R498o0220m5100
$$ -164573 -175009 -21806 -71484 -106038 -94690 10910 -35138 -56374 -105755 -96257 -156477 -201577
9132b01577j65139a32285l2993e3441G910L51663a800G2054b44833G6805N2657
$$ -201577 -366716 -132285 -165278 -53441 7910 359573 -1800 72054 -244833 76805 129462
9121A29462f3395B2285O8074a14658I9255b53154K9461O8409A64985i4676c0631
$$ 129462 -63395 22285 90359 -114658 99255 -253154 -223693 -155284 164985 -94676 -30631
9109a61760A48176g7924k69203B82732j33910a03336l13838f9938l4266A33580
$$ -161760 148176 -77924 -347127 282732 148822 -103336 -417174 -69938 -104204 133580
9098c3427k65841I3085O9825J04N4105q6613a40719n625p6049Q014j26300a51930
$$ -33427 -299268 93085 162910 163014 217119 130506 -140719 -146344 -222393 -214379 -340679 -151930
9085B40349I552M7472c04179C5768c28161a16450o7968F5124a43520d5355j08881
$$ 240349 9552 57024 -304179 35768 -328161 -116450 -184418 65124 -143520 -45355 -154236
9074a54236e9981K3037k08727G2406a05532j62665i6073L644A83623b99931I9078
$$ -154236 -59981 -36944 -245671 72406 -105532 -268197 -96073 -92429 183623 -299931 99078
9062A3116a7318n4706K6732k17324J1642D1622b53627a01785k16119J40662O3873
$$ 13116 -17318 -72024 -45292 -262616 -250974 41622 -253627 -101785 -317904 -177242 -113369
9051a13369B54341j21684d4031n55270B79381A4482a55528B52338a94019i3150
$$ -113369 254341 132657 -44031 -599301 279381 14482 -155528 252338 -194019 -93150
9040g6785C960M06076I2539a70077f010k10083a07546A70988o093c39314a09366
$$ -76785 3960 410036 92539 -170077 -6010 -216093 -107546 170988 164895 -339314 -109366
9028E034K76311A0319J98710g7290D6049e266H8546h5519L9756j49678n7124A10900
$$ 5034 281345 10319 209029 -77290 46049 -5266 88546 -85519 -45763 -195441 -252565 110900
9015C66354c6300A2993a31712M1871l5494k3410j8399b1340j1176d422A00213
$$ 366354 -36300 12993 -131712 -89841 -125335 -148745 -167144 -21340 -32516 -4422 100213
9003g4372J860B90775j27140J79057d18638a49676e5665E9268B539b75797h1326
$$ -74372 -72512 290775 163635 342692 -418638 -149676 -55665 59268 2539 -275797 -81326
8991A03417a47111d6071B34112A16935a07434b3984l9705k03000A51501k5756
$$ 103417 -147111 -46071 234112 116935 -107434 -23984 -63689 -266689 151501 125745
8981A25745b06304j53318i5233l6162K5423n2444M8753H5944b07662R7829d5268
$$ 125745 -206304 -359622 -95233 -131395 -105972 -158416 -109663 85944 -207662 -109833 -45268
8969a03963B29839F5032k9674f2980n0576E141b97100G2572a81345e0576j57614
$$ -103963 229839 65032 35358 -62980 -113556 5141 -297100 72572 -181345 -50576 -208190
8958b08190E072c63306g22j72454B33421b44324M1518O2740r953L9795L3333A60992
$$ -208190 5072 -363306 -722 -173176 233421 -244324 -202806 -140066 -150019 -110224 -76891 160992
8945a72126o9641g6981A32806J09117a32333G4238B727J3018c25990D22011D3603
$$ -172126 -241767 -76981 132806 241923 -132333 74238 2727 15745 -325990 422011 43603
8933a37053D0251b10410R8676o0084B85204E290a21891B29049D3523h6493K228
$$ -137053 40251 -210410 -111734 -171818 285204 5290 -121891 229049 43523 -86493 -84265
8922h4265c0802A16863J40131b10210j33506E4548a73307I4993g7879L1916B52215
$$ -84265 -30802 116863 256994 -210210 -343716 54548 -173307 94993 -77879 -45963 252215
8910d6053q7455B274a98107A73770h5155A25033c7820A8978J41898k8514f6453
$$ -46053 -133508 2274 -198107 173770 -85155 125033 -37820 18978 160876 132362 -66453
8898g9312B9347f3483D05837J71879e2005H830Q1965a6142j85885r3286C4396
$$ -79312 29347 -63483 405837 577716 -52005 8830 90795 -16142 -202027 -295313 34396
8886a14480q2071k27814D1709j8777a8385r6075F7533e403k06871A88261b84644
$$ -114480 -196551 -424365 41709 22932 -18385 -114460 67533 -5403 -212274 188261 -284644
8874h3448A475a1800j78838h2094j33185A3157a19563C86260c15347R0515G8153
$$ -83448 1475 -11800 -190638 -82094 -215279 13157 -119563 386260 -315347 -224832 78153
8862C46817i184j85596E5379P6371K0933l7747J17911a96177f2726m7020k57876
$$ 346817 -9184 -194780 55379 131750 152683 114936 232847 -196177 -62726 -109746 -367622
8851c67622a16545k3717A85390L5817N2539a18297m438L9918m5053A29439h284
$$ -367622 -116545 -140262 185390 221207 273746 -118297 -122735 -82817 -127870 129439 -8284
8839a06010G3040b65638B7118c1945j85474A01625c2287H5800l5141a45852R553
$$ -106010 73040 -265638 27118 -31945 -217419 101625 -32287 85800 50659 -145852 -136299
$$ [...]
##END NTUPLES=NMR SPECTRUM
##END=
