##TITLE=AC1542_ROEFFECT0012_8215128_l67O6OVqZC
##JCAMPDX= 6.0         $$ Bruker NMR JCAMP-DX V2.0
##DATA TYPE= NMR SPECTRUM
##DATA CLASS= NTUPLES
##ORIGIN= BRUKER
##OWNER= Administrator
$$ 1.72 TOPSPIN		Version 2.1
$$ 2014-08-04 22:21:17.119 -0700  Administrator@X
$$ Compression mode = diff/dup
##.OBSERVE FREQUENCY= 400.02188249412
##.OBSERVE NUCLEUS= ^1H
##.ACQUISITION MODE= SIMULTANEOUS (DQD)
##.ACQUISITION SCHEME= undefined
##.AVERAGES= 64
##.DIGITISER RES= 22
##SPECTROMETER/DATA SYSTEM= spect
##.PULSE SEQUENCE= noesygpps1d.comp
##.SOLVENT NAME= COFFEE_meoh
##.SHIFT REFERENCE= INTERNAL, COFFEE_meoh, 1, 14.97756
##AUDIT TRAIL= $$ (NUMBER, WHEN, WHO, WHERE, PROCESS, VERSION, WHAT)
$$ ##TITLE= Audit trail, TOPSPIN		Version 2.1
$$ ##JCAMPDX= 5.01
$$ ##ORIGIN= Bruker BioSpin GmbH
$$ ##OWNER= Administrator
$$ $$ E:\/data/COFFEE/nmr/AC1542_ROEFFECT0012_8215128_l67O6OVqZC/22/pdata/1/auditp.txt
$$ ##AUDIT TRAIL=  $$ (NUMBER, WHEN, WHO, WHERE, PROCESS, VERSION, WHAT)
(   1,<2014-08-04 22:21:11.978 -0700>,<Administrator>,<X>,<go>,<TOPSPIN 2.1>,
      <created by zg
	started at 2014-08-04 22:09:41.669 -0700,
	POWCHK enabled, PULCHK disabled,
       configuration hash MD5:
       16 EA D6 F4 BB 67 03 14 9B FF E7 A0 43 5B 48 2E
       data hash MD5: 64K
       6D E0 DC F5 DE E8 37 46 B7 AE 80 8C E4 66 2F 95>)
(   2,<2014-08-04 22:21:15.056 -0700>,<Administrator>,<X>,<proc1d>,<TOPSPIN 2.1>,
      <Start of raw data processing
       efp LB = 0.3 FT_mod = 6 PKNL = 1 PHC0 = 0 PHC1 = 0 SI = 128K 
       data hash MD5: 128K
       CB 79 BF F2 9C 9D AA 8A 21 69 29 EE F0 CA B3 A1>)
(   3,<2014-08-04 22:21:16.025 -0700>,<Administrator>,<X>,<proc1d>,<TOPSPIN 2.1>,
      <pk PHC0 = -86.57227 PHC1 = 0 
       data hash MD5: 128K
       57 8F F5 26 06 34 6F 9E F9 33 24 D6 B3 94 88 13>)
(   4,<2014-08-04 22:21:16.494 -0700>,<Administrator>,<X>,<proc1d>,<TOPSPIN 2.1>,
      <abs ABSG = 1 
       data hash MD5: 128K
       4E 05 5D 7D 44 DF 47 FB 8F 19 3D 33 30 C4 91 A1>)
(   5,<2014-08-04 22:21:16.603 -0700>,<Administrator>,<X>,<proc1d>,<TOPSPIN 2.1>,
      <abs ABSG = 2 
       data hash MD5: 128K
       F1 C9 16 2C BC 5B E0 9A E9 C3 BD F3 AF 50 77 E6>)
(   6,<2014-08-04 22:21:16.713 -0700>,<Administrator>,<X>,<proc1d>,<TOPSPIN 2.1>,
      <abs ABSG = 3 
       data hash MD5: 128K
       C6 15 65 6F 55 BF 4B 57 6F 83 99 84 59 5B 80 3D>)
(   7,<2014-08-04 22:21:16.806 -0700>,<Administrator>,<X>,<proc1d>,<TOPSPIN 2.1>,
      <abs ABSG = 4 
       data hash MD5: 128K
       5D 65 94 BF 33 3A 5F 6F 12 AD 53 FC AE B6 EA 34>)
(   8,<2014-08-04 22:21:16.900 -0700>,<Administrator>,<X>,<proc1d>,<TOPSPIN 2.1>,
      <abs ABSG = 5 
       data hash MD5: 128K
       5D 8E 09 46 5E 71 AA 58 F1 67 CC 28 0C 88 B4 E3>)
$$ ##END=
$$ 
$$ $$ hash MD5
$$ $$ 14 BD E3 71 23 2C 84 DE CF C4 12 8F 2E 82 1E 30
##$RELAX= 
##$RELAX= 
##$RELAX= 
##$RELAX= 
##$RELAX= 
##$RELAX= 
##$RELAX= 
##$RELAX= 
$$ Bruker specific parameters
$$ --------------------------
##$DU= <E:\>
##$EXPNO= 22
$$ [...]
##$TP07= 0
##$TPNAME0= <>
##$TPNAME1= <>
##$TPNAME2= <>
##$TPNAME3= <>
##$TPNAME4= <>
##$TPNAME5= <>
##$TPNAME6= <>
##$TPNAME7= <>
##$TPOAL= (0..7)
0.5 0.5 0.5 0.5 0.5 0.5 0.5 0.5
##$TPOFFS= (0..7)
0 0 0 0 0 0 0 0
##$TUNHIN= 0
##$TUNHOUT= 0
##$TUNXOUT= 0
##$USERA1= <user>
##$USERA2= <user>
##$USERA3= <user>
##$USERA4= <user>
##$USERA5= <user>
##$V9= 5
##$VALIST= <valist>
##$VCLIST= <CCCCCCCCCCCCCCC>
##$VD= 0
##$VDLIST= <DDDDDDDDDDDDDDD>
##$VPLIST= <PPPPPPPPPPPPPPP>
##$VTLIST= <TTTTTTTTTTTTTTT>
##$WBST= 1024
##$WBSW= 4
##$XGAIN= (0..3)
0 0 0 0
##$XL= 0
##$YL= 0
##$YMAX_a= 9588763
##$YMIN_a= -10764459
##$ZGOPTNS= <>
##$ZL1= 120
##$ZL2= 120
##$ZL3= 120
##$ZL4= 120
##$ABSF1= 14.97756
##$ABSF2= -5.580622
##$ABSG= 5
##$ABSL= 3
##$ALPHA= 0
##$AQORDER= 0
##$ASSFAC= 0
##$ASSFACI= 0
##$ASSFACX= 0
##$ASSWID= 0
##$AUNMP= <proc_prof1d_extract.lims>
##$AXLEFT= 0
##$AXNAME= <>
##$AXNUC= <1H>
##$AXRIGHT= 0
##$AXTYPE= 0
##$AXUNIT= <>
##$AZFE= 0.1
##$AZFW= 0.1
##$BCFW= 0
##$BC_mod= 0
##$BYTORDP= 0
##$COROFFS= 0
##$CY= 15
##$DATMOD= 1
##$DC= 0
##$DFILT= <>
##$DTYPP= 0
##$F1P= 0
##$F2P= 0
##$FCOR= 0.5
##$FTSIZE= 131072
##$FT_mod= 6
##$GAMMA= 0
##$GB= 0
##$INTBC= 1
##$INTSCL= 1
##$ISEN= 128
##$LB= 0.3
##$LEV0= 0
##$LPBIN= 0
##$MAXI= 10000
##$MC2= 0
##$MEAN= 0
##$ME_mod= 0
##$MI= 0
##$NCOEF= 0
##$NC_proc= -1
##$NLEV= 6
##$NOISF1= 0
##$NOISF2= 0
##$NSP= 0
##$NTH_PI= 0
##$NZP= 0
##$OFFSET= 14.97756
##$PC= 1
##$PHC0= -86.57227
##$PHC1= 0
##$PH_mod= 1
##$PKNL= yes
##$PPARMOD= 0
##$PPDIAG= 0
##$PPIPTYP= 0
##$PPMPNUM= 2147483647
##$PPRESOL= 1
##$PSCAL= 4
##$PSIGN= 0
##$PYNMP= <proc.py>
##$REVERSE= no
##$SF= 400.020003012089
##$SI= 131072
##$SIGF1= 0
##$SIGF2= 0
##$SINO= 400
##$SIOLD= 131072
##$SPECTYP= <>
##$SREGLST= <1H.CDCl3>
##$SSB= 0
##$STSI= 131072
##$STSR= 0
##$SW_p= 8223.68421052631
##$SYMM= 0
##$S_DEV= 0
##$TDeff= 65536
##$TDoff= 0
##$TI= <>
##$TILT= no
##$TM1= 0
##$TM2= 0
##$TOPLEV= 0
##$USERP1= <user>
##$USERP2= <user>
##$USERP3= <user>
##$USERP4= <user>
##$USERP5= <user>
##$WDW= 1
##$XDIM= 131072
##$YMAX_p= 160058965
##$YMIN_p= -365492381
##$CURPLOT= <Network HP LaserJet P1505>
##$CURPRIN= <$Network HP LaserJet P1505>
##$DFORMAT= <normdp>
##$LAYOUT= <+/1D_H.xwp>
##$LFORMAT= <normlp>
##$PFORMAT= <normpl>
##$SURQMSG= 1
$$ End of Bruker specific parameters
$$ ---------------------------------
##NTUPLES= NMR SPECTRUM
##VAR_NAME=  FREQUENCY,     SPECTRUM/REAL,   SPECTRUM/IMAG
##SYMBOL=    X,             R,               I
##VAR_TYPE=  INDEPENDENT,   DEPENDENT,       DEPENDENT
##VAR_FORM=  AFFN,          ASDF,            ASDF
##VAR_DIM=   131072,        131072,          131072
##UNITS=     HZ,            ARBITRARY UNITS, ARBITRARY UNITS
##FACTOR=    0.0627417313425164, 1,          1
##FIRST=     8223.62146879497, -203,         -19703
##LAST=      0,             1030,            -19480
##MIN=       0,             -365492381,      0
##MAX=       8223.62146879497, 160058965,    0
$$ Real data points
##PAGE= N=1
##DATA TABLE= (X++(R..R)), XYDATA
$$ [...]
$$ plain form
62972 332559 335530 338782 342058 345398 349089 353368 358281 363799 369944 376763 384219 392216 400698 409733
62958 409733 419542 430444 442685 456255 470944 486640 503576 522187 542743 565134 588986 613909
62946 613909 639671 666215 693561 721656 750318 779318 808441 837425 865935 893771 921053
62935 921053 948035 974694 1000667 1025638 1049627 1072858 1095399 1116970 1136937 1154448 1168727
62924 1168727 1179291 1185791 1187620 1183956 1174375 1159204 1139084 1114381 1085368 1052799 1017909 981784
62912 981784 945105 908626 873524 840976 811534 785135 761684 741404 724632 711502 701943 695859
62900 695859 693106 693267 695669 699824 705812 714004 724391 736418 749555 763756 779101 795233 811498
62887 811498 827575 843570 859460 874776 888966 901837 913452 923756 932450 939082 943131 944056
$$ packed form
62972C32559K971L252L276L340L691M279M913N518O145O819P456P997Q482R035
62958D09733R809J0902J2241J3570J4689J5696J6936J8611K0556K2391K3852K4923
62946F13909K5762K6544K7346K8095K8662K9000K9123K8984K8510K7836K7282
62935I21053K6982K6659K5973K4971K3989K3231K2541K1571J9967J7511J4279
62924A168727J0564O500J829l664r581j5171k0120k4703k9013l2569l4890l6125
62912I81784l6679l6479l5102l2548k9442k6399k3451k0280j6772j3130r559o084
62900F95859k753J61K402M155N988Q192J0387J2027J3137J4201J5345J6132J6265
62887H11498J6077J5995J5890J5316J4190J2871J1615J0304Q694O632M049R25
$$ plain form
62875 944056 941397 934826 924150 909417 891048 869687 845866 819951 792440 764060 735460 707002
62863 707002 678992 651910 626191 601939 579085 557710 537972 519748 502601 486159 470360
62852 470360 455319 441127 427873 415711 404785 395040 386139 377583 368977 360310 351965 344358 337568
62839 337568 331384 325714 320774 316787 313580 310672 307761 304989 302644 300757 299156 297804 296851 296315 295929
62824 295929 295437 294836 294208 293495 292659 291891 291371 290858 289814 287987 285652 283266 281067 279036 277020 274845
62808 274845 272483 270179 268241 266693 265313 264034 263025 262319 261643 260771 259811 258977 258303 257768 257468 257415 257352
62791 257352 257008 256455 255983 255744 255704 255857 256211 256632 256923 257050 257094 257071 257011 257121 257628 258403 258985 259050 258679 258128
62771 258128 257491 256693 255765 254986 254731 255077 255544 255368 254237 252681 251605 251462 251999 252716 253375 254040 254847 255816
$$ packed form
62875I44056k659o571j0676j4733j8369k1361k3821k5915k7511k8380k8600k8458
62863G07002k8010k7082k5719k4252k2854k1375j9738j8224j7147j6442j5799
62852D70360j5041j4192j3254j2162j0926r745q901q556q606q667q345p607o790
62839C37568o184n670m940l987l207k908k911k772k345j887j601j352r53n36l86
62824B95929m92o01o28p13q36p68n20n13j044j827k335k386k199k031k016k175
62808B74845k362k304j938j548j380j279j009p06o76q72r60q34o74n35l00n3o3
62791B57352l44n53m72k39m0J53L54M21K91J27M4k3o0J10N07P75N82O5l71n51
62771B58128o37p98r28p79k55L46M67j76j131j556j076j43N37P17O59O65Q07R69
$$ plain form
62753 255816 256819 257684 258374 258984 259492 259645 259245 258474 257693 256985 256155 255178 254339 253829 253432 252820 251991 251199
62735 251199 250574 250009 249412 248899 248664 248727 248902 248960 248842 248672 248578 248571 248628 248822 249260 249919 250677 251540 252720 254410
62715 254410 256522 258707 260627 262241 263823 265679 267833 270053 272208 274454 276961 279552 281869 283894
62701 283894 286096 288972 292567 296547 300614 304783 309379 314852 321525 329406 338270 347979 358648 370505
62687 370505 383683 398237 414303 432114 451956 474121 498843 526141 555818 587726 621968
62676 621968 658713 697871 739072 781910 825986 870643 914892 957714 998326 1036040 1069966
62665 1069966 1098962 1121878 1137784 1146085 1146578 1139413 1124872 1103249 1075077 1041395 1003600 962946
62653 962946 920354 876684 832934 789968 748176 707648 668629 631641 597154 565310 535968
$$ packed form
62753B55816J003Q65O90O10N08J53m00p71p81p08q30r77q39n10l97o12q29p92
62735B51199o25n65n97n13k35O3J75N8j18j70r4pN7J94M38O59P58Q63J180J690
62715B54410K112K185J920J614J582J856K154K220K155K246K507K591K317K025
62701B83894K202K876L595L980M067M169M596N473O673P881Q864R709J0669J1857
62687C70505J3178J4554J6066J7811J9842K2165K4722K7298K9677L1908L4242
62676F21968L6745L9158M1201M2838M4076M4657M4249M2822M0612L7714L3926
62665A069966K8996K2916J5906Q301M93p165j4541k1623k8172l3682l7795m0654
62653I62946m2592m3670m3750m2966m1792m0528l9019l6988l4487l1844k9342
$$ plain form
62642 535968 508905 483936 460939 439827 420502 402899 387124 373448 362004 352453 344061 336156
62630 336156 328545 321523 315530 310688 306669 303019 299651 296834 294716 293129 291985 291551 292041 293200 294649
62615 294649 296471 298979 302077 305395 309072 313786 319848 326847 334454 343092 353395 365421 378804
62602 378804 393400 409335 426665 445465 466111 488996 514002 540681 568897 598863 630486
62591 630486 663068 695741 727896 759031 788436 815193 838381 857204 871085 879692 882812 880202
62579 880202 871739 857684 838669 815431 788716 759337 728098 695602 662345 629020 596523 565569
62567 565569 536435 509097 483501 459687 437785 417911 399952 383521 368266 354223 341652
62556 341652 330558 320575 311310 302604 294406 286674 279506 273189 267927 263609 259897 256457 253108 249880
$$ packed form
62642E35968k7063k4969k2997k1112j9325j7603j5775j3676j1444r551q392p905
62630C36156p611p022n993m842m019l650l368k817k118j587j144m34M90J159J449
62615B94649J822K508L098L318L677M714O062O999P607Q638J0303J2026J3383
62602C78804J4596J5935J7330J8800K0646K2885K5006K6679K8216K9966L1623
62591F30486L2582L2673L2155L1135K9405K6757K3188J8823J3881Q607L120k610
62579H80202q463j4055j9015k3238k6715k9379l1239l2496l3257l3325l2497l0954
62567E65569k9134k7338k5596k3814k1902j9874j7959j6431j5255j4043j2571
62556C41652j1094r983r265q706q198p732p168o317n262m318l712l440l349l228
$$ plain form
62542 249880 247023 244808 243206 241872 240495 239072 237738 236479 235132 233636 232142 230814 229617 228374
62528 228374 227037 225850 225106 224771 224461 223893 223211 222785 222783 223086 223527 224055 224709 225570 226742 228231 229895 231611
62510 231611 233403 235289 237175 239090 241432 244682 248905 253781 259186 265460 273046 281992 291925 302415
62496 302415 313394 325306 338797 354151 371075 389160 408336 428678 449898 471365 492536
62485 492536 513074 532573 550526 566519 580098 590454 596716 598655 596741 591369 582486 570147
62473 570147 555015 537985 519653 500455 480971 461675 442573 423507 404741 386898 370383
62462 370383 355159 341097 328236 316707 306612 297987 290682 284268 278313 272767 267955 264167 261348
62449 261348 259171 257228 255210 253083 251139 249726 248865 248249 247611 246961 246390 245807 245005 243969 242976 242332
$$ packed form
62542B49880k857k215j602j334j377j423j334j259j347j496j494j328j197j243
62528B28374j337j187p44l35l10n68o82m26kL03M41N28O54Q61J172J489J664J716
62510B31611J792J886J886J915K342L250M223M876N405O274P586Q946R933J0490
62496C02415J0979J1912J3491J5354J6924J8085J9176K0342K1220K1467K1171
62485D92536K0538J9499J7953J5993J3579J0356O262J939j914n372q883j2339
62473E70147j5132j7030j8332j9198j9484j9296j9102j9066j8766j7843j6515
62462C70383j5224j4062j2861j1529j0095q625p305o414n955n546m812l788k819
62449B61348k177j943k018k127j944j413q61o16o38o50n71n83q02j036r93o44
$$ plain form
62433 242332 242098 242162 242509 243322 244752 246708 248986 251541 254520 258084 262284 267088 272476 278541 285583
62418 285583 293975 303783 314615 326049 338164 351438 366203 382432 400010 418895 438937 459832
62406 459832 481359 503405 525574 547032 566945 584909 600812 614455 625556 634108 640562 645663
62394 645663 650095 654166 657767 660754 663434 666534 670678 676003 682340 689569 697708 706792 716647 726540
62380 726540 734964 740118 740921 737558 730974 721900 710327 695625 677041 654354 628334 600470 572154
62367 572154 544175 516906 490611 465418 441357 418693 398021 379794 363952 350190 338356
62356 338356 328353 319935 312895 307219 302792 299192 296142 293945 293038 293276 294078 295198 296874 299246 302078
62341 302078 305136 308470 312172 316130 320120 323899 327145 329536 330977 331507 330986 329101 325808 321496 316625
$$ packed form
62433B42332k34O4L47Q13J430J956K278K555K979L564M200M804N388O065P042
62418B85583Q392R808J0832J1434J2115J3274J4765J6229J7578J8885K0042K0895
62406D59832K1527K2046K2169K1458J9913J7964J5903J3643J1101Q552O454N101
62394F45663M432M071L601K987K680L100M144N325O337P229Q139R084R855R893
62380G26540Q424N154Q03l363o584r074j1573j4702j8584k2687k6020k7864k8316
62367E72154k7979k7269k6295k5193k4061k2664k0672j8227j5842j3762j1834
62356C38356j0003q418p040n676m427l600l050k197r07K38Q02J120J676K372K832
62341C02078L058L334L702L958L990L779L246K391J441N30n21j885l293m312m871
$$ plain form
62326 316625 311408 305923 300346 294915 289791 285054 280710 276605 272478 268217 263987 260058 256568 253498
62312 253498 250814 248548 246725 245220 243725 242013 240273 239020 238540 238553 238628 238724 239090 239779 240610 241565 242846
62295 242846 244460 246066 247370 248429 249492 250749 252366 254521 257215 260202 263269 266474 269951 273668
62281 273668 277507 281453 285469 289264 292493 295238 298093 301604 305714 309868 313684 317345 321341 325974
62267 325974 331263 337212 343944 351606 360343 370417 382136 395563 410506 426862 444729 464058
62255 464058 484456 505552 527282 549456 571246 591523 609623 625444 638843 649399 656857 661464
62243 661464 663744 664205 663287 661242 657882 652714 645558 636817 627052 616519 605331 593814 582433 571451
62229 571451 560886 550694 540786 530925 520849 510488 499953 489276 478307 466869 454874 442281
$$ packed form
62326C16625n217n485n577n431n124m737m344m105m127m261m230l929l490l070
62312B53498k684k266j823j505j495j712j740j253m80J3P5R6L66O89Q31R55J281
62295B42846J614J606J304J059J063J257J617K155K694K987L067L205L477L717
62281B73668L839L946M016L795L229K745K855L511M110M154L816L661L996M633
62267C25974N289N949O732P662Q737J0074J1719J3427J4943J6356J7867J9329
62255D64058K0398K1096K1730K2174K1790K0277J8100J5821J3399J0556P458M607
62243F61464K280M61r18k045l360n168p156q741r765j0533j1188j1517j1381j0982
62229E71451j0565j0192r908r861j0076j0361j0535j0677j0969j1438j1995j2593
$$ plain form
62217 442281 429077 415402 401660 388367 375877 364267 353484 343521 334393 326046 318482 311923
62205 311923 306631 302519 299133 296124 293536 291545 290136 289210 288803 288931 289385 289968 290759 291918 293297 294601
62189 294601 295799 297053 298331 299423 300319 301173 301907 302256 302287 302447 302975 303703 304554 305853 307872 310438 313260
62172 313260 316355 319866 323740 327961 332854 338769 345606 353044 361183 370583 381645 394299 408345
62159 408345 423849 441058 460078 480773 502874 526077 550042 574320 598296 621217 642294
62148 642294 660784 676026 687575 695308 699328 699775 696875 691119 683058 672771 659795 643787 625059
62135 625059 604312 582099 558910 535599 513266 492604 473597 455949 439587 424686 411411
62124 411411 399781 389678 380917 373348 366899 361472 356838 352787 349347 346673 344685 343000 341310 339676
$$ packed form
62217D42281j3204j3675j3742j3293j2490j1610j0783r963r128q347p564o559
62205C11923n292m112l386l009k588j991j409r26m07J28M54N83P91J159J379J304
62189B94601J198J254J278J092Q96Q54P34L49L1J60N28P28Q51J299K019K566K822
62172C13260L095L511L874M221M893N915O837P438Q139R400J1062J2654J4046
62159D08345J5504J7209J9020K0695K2101K3203K3965K4278K3976K2921K1077
62148F42294J8490J5242J1549P733M020M47k900n756q061j0287j2976j6008j8728
62135F25059k0747k2213k3189k3311k2333k0662j9007j7648j6362j4901j3275
62124D11411j1630j0103q761p569o449n427m634m051l440k674j988j685j690j634
$$ plain form
62110 339676 338344 337402 336790 336545 336835 337686 338887 340222 341705 343491 345617 347957 350403 352954 355604
62095 355604 358270 360894 363516 366140 368617 370811 372872 375137 377766 380567 383287 385949 388827 392120
62081 392120 395759 399490 403084 406433 409498 412259 414789 417370 420443 424368 429245 435008 441622 449199
62067 449199 457977 468241 480120 493408 507648 522469 537656 552818 567188 579978 590745 599213
62055 599213 604935 607584 607457 605270 601387 595648 587990 578785 568380 556752 543929 530407 516813
62042 516813 503397 490215 477604 466043 455660 446240 437726 430325 424091 418722 413904 409540 405510
62029 405510 401480 397210 392917 389065 385804 382847 379971 377476 375937 375574 376057 376991 378376 380456 383264
62014 383264 386564 390145 393891 397499 400403 402121 402530 401713 399759 396867 393473 390057 386859 383859 380888
$$ packed form
62110C39676j332r42o12k45K90Q51J201J335J483J786K126K340K446K551K650
62095C55604K666K624K622K624K477K194K061K265K629K801K720K662K878L293
62081C92120L639L731L594L349L065K761K530K581L073L925M877N763O614P577
62067D49199Q778J0264J1879J3288J4240J4821J5187J5162J4370J2790J0767Q468
62055E99213N722K649j27k187l883n739p658r205j0405j1628j2823j3522j3594
62042E16813j3416j3182j2611j1561j0383r420q514p401o234n369m818m364m030
62029D05510m030m270m293l852l261k957k876k495j539l63M83R34J385K080K808
62014C83264L300L581L746L608K904J718M09q17j954k892l394l416l198l000k971
$$ plain form
61999 380888 377608 373579 368615 363079 357670 352896 348870 345541 342910 341033 339959 339715 340234 341283 342569
61984 342569 343970 345596 347637 350215 353369 357087 361321 366038 371252 377005 383345 390373 398275 407206
61970 407206 417082 427583 438391 449415 460732 472333 484025 495644 507266 519027 530674 541454
61958 541454 550513 557331 561722 563690 563471 561543 558243 553451 546854 538488 528704 517681 505350 491826
61944 491826 477513 462712 447451 431877 416495 401795 387905 374800 362559 351195 340491
61933 340491 330237 320452 311166 302252 293702 285804 278782 272486 266725 261640 257376 253612 249859 246089
61919 246089 242655 239645 236719 233567 230179 226693 223309 220350 218042 216248 214743 213697 213485 213997 214603
61904 214603 214919 215211 215895 217034 218491 220196 221998 223581 224853 226154 227778 229463 230697 231340 231615
$$ packed form
61999C80888l280m029m964n536n409m774m026l329k631j877j074k44N19J049J286
61984C42569J401J626K041K578L154L718M234M717N214N753O340P028P902Q931
61970D07206R876J0501J0808J1024J1317J1601J1692J1619J1622J1761J1647J0780
61958E41454R059O818M391J968k19j928l300m792o597q366r784j1023j2331j3524
61944D91826j4313j4801j5261j5574j5382j4700j3890j3105j2241j1364j0704
61933C40491j0254r785r286q914q550p898p022o296n761n085m264l764l753l770
61919B46089l434l010k926l152l388l486l384k959k308j794j505j046k12N12O06
61904B14603L16K92O84J139J457J705J802J583J272J301J624J685J234O43K75
$$ plain form
61889 231615 231605 231160 230273 229198 228091 226819 225262 223582 222017 220539 218914 217040 215049 213096 211187
61874 211187 209292 207514 206034 204953 204272 203953 203863 203681 203101 202187 201378 200954 200660 200025 198967 197866 197074
61857 197074 196590 196281 196191 196501 197285 198459 199883 201450 203097 204838 206824 209339 212659 216853 221656 226616
61841 226616 231480 236425 241834 247872 254339 260925 267481 273990 280376 286411 291844 296631 301026 305400
61827 305400 309900 314261 317954 320544 321910 322242 321862 321010 319776 318248 316657 315312 314383 313900 313939 314676
61811 314676 316225 318561 321649 325481 329928 334755 339866 345293 350835 355966 360306 363937 366961 369025
61797 369025 369651 368921 367430 365563 363219 360279 357020 353894 351126 348629 346150 343444 340466 337380 334234
61782 334234 330685 326276 321016 315391 309822 304368 299024 293990 289469 285460 281918 278915 276477 274453
$$ packed form
61889B31615j0m45q87j075j107j272j557j680j565j478j625j874j991j953j909
61874B11187j895j778j480j081o81l19r0j82n80r14q09m24k94o35j058j101p92
61857A97074m84l09r0L10P84J174J424J567J647J741J986K515L320M194M803M960
61841B26616M864M945N409O038O467O586O556O509O386O035N433M787M395M374
61827C05400M500M361L693K590J366L32l80q52j234j528j591j345r29m83L9P37
61811C14676J549K336L088L832M447M827N111N427N542N131M340L631L024K064
61797C69025O26p30j491j867k344k940l259l126k768k497k479k706k978l086l146
61782C34234l549m409n260n625n569n454n344n034m521m009l542l003k438k024
$$ plain form
61768 274453 272749 271538 271038 271170 271627 272259 273249 274936 277520 280957 285083 289859 295490 302211 309984
61753 309984 318516 327573 337142 347262 357862 368845 380162 391702 403193 414292 424702 434165
61741 434165 442472 449533 455280 459461 461696 461889 460475 458186 455584 452885 450096 447254 444629 442758
61727 442758 442180 443092 445327 448619 452703 457151 461396 465054 468011 470037 470535 468937 465255 459989 453562
61712 453562 446098 437673 428523 418930 409075 399086 389094 379214 369570 360391 351980 344546 338109 332555
61698 332555 327662 323136 318769 314683 311265 308723 306766 304871 302832 300931 299517 298610 297940 297237 296335
61683 296335 295137 293722 292466 291793 291728 291856 291827 291720 291790 292071 292395 292700 293103 293752 294815 296486 298776 301347
61665 301347 303782 306042 308450 311247 314389 317797 321557 325771 330357 335060 339526 343356 346210 347896
$$ packed form
61768B74453j704j211n00J32M57O32R90J687K584L437M126M776N631O721P773
61753C09984Q532R057R569J0120J0600J0983J1317J1540J1491J1099J0410R463
61741D34165Q307P061N747M181K235J93j414k289k602k699k789k842k625j871
61727D42758n78R12K235L292M084M448M245L658K957K026M98j598l682n266o427
61712D53562p464q425r150r593r855r989r992r880r644r179q411p434o437n554
61698C32555m893m526m367m086l418k542j957j895k039j901j414r07o70p03r02
61683B96335j198j415j256o73o5J28k9j07P0K81L24L05M03O49J063J671K290K571
61665C01347K435K260K408K797L142L408L760M214M586M703M466L830K854J686
$$ plain form
61651 347896 348288 347235 344734 341115 336783 331819 326146 320078 314319 309244 304576 299986 295683 292080
61637 292080 289149 286500 283992 281878 280357 279286 278388 277527 276691 275884 275112 274389 273698 273053 272575 272405 272499
61620 272499 272615 272536 272231 271815 271427 271143 270929 270671 270304 269879 269463 268954 268124 266845 265203 263325 261188 258714
61602 258714 256033 253499 251332 249341 247172 244819 242704 241156 240005 238801 237324 235661 233879 231887
61588 231887 229644 227308 225109 223191 221597 220285 219124 218022 217045 216286 215634 214828 213776 212666 211713
61573 211713 210945 210325 209888 209659 209525 209319 208959 208437 207768 206998 206230 205572 205092 204829 204795 204963 205293 205745 206210
61554 206210 206508 206544 206362 206007 205497 205075 205255 206284 207713 208879 209753 210893 212559 214320 215679 216655 217542
61537 217542 218429 219224 219886 220334 220279 219414 217745 215612 213455 211615 210171 208894 207494 205972 204558 203346
$$ packed form
61651C47896L92j053k501l619m332m964n673o068n759n075m668m590m303l603
61637B92080k931k649k508k114j521j071q98q61q36q07p72p23o91o45m78j70R4
61620B72499J16p9l05m16l88k84k14k58l67m25m16n09q30j279j642j878k137k474
61602B58714k681k534k167j991k169k353k115j548j151j204j477j663j782j992
61588B31887k243k336k199j918j594j312j161j102r77p59o52q06j052j110r53
61573B11713p68o20m37k29j34k06l60n22o69p70p68o58m80k63l4J68L30M52M65
61554B06210K98L6j82l55n10m22J80J029J429J166Q74J140J666J761J359R76Q87
61537B17542Q87P95O62M48n5q65j669k133k157j840j444j277j400j522j414j212
$$ plain form
61521 203346 202297 201576 201491 201928 202270 202083 201557 201062 200602 200032 199414 198828 198093 197030 195781 194532 193148
61504 193148 191436 189536 187655 185637 183247 180729 178620 177100 175924 174921 174109 173343 172337 171102 170009
61489 170009 169340 169054 168999 169015 168823 168167 167194 166390 166060 166080 166187 166216 166079 165785 165530 165500 165513 165160 164354 163476 162917
61468 162917 162746 162861 163150 163446 163606 163772 164258 165071 165799 166138 166269 166572 167183 168000 168897 169769 170517 171136 171688
61449 171688 172118 172299 172346 172632 173321 174129 174740 175247 175924 176741 177395 177774 178120 178726 179632 180668 181630 182368 182801
61430 182801 182910 182743 182455 182302 182495 182937 183239 183077 182513 181880 181385 180940 180363 179682 179149 178943 178921 178822 178688
61411 178688 178932 179852 181228 182537 183469 184035 184280 184185 183881 183696 183858 184331 185000 185879 187020 188342 189669
61394 189669 190874 192003 193267 194896 196873 198840 200396 201396 201862 201726 200986 200016 199340 199014 198597 197829
$$ packed form
61521B03346j049p21q5M37L42j87n26m95m60n70o18n86p35j063j249j249j384
61504A93148j712j900j881k018k390k518k109j520j176j003q12p66j006j235j093
61489A70009o69k86n5J6j92o56r73q04l30K0J07K9j37k94k55l0J3l53q06q78n59
61468A62917j71J15K89K96J60J66M86Q13P28L39J31L03O11Q17Q97Q72P48O19N52
61449A71688M30J81M7K86O89Q08O11N07O77Q17O54L79L46O06R06J036R62P38M33
61430A82801J09j67k88j53J93M42L02j62n64o33m95m45n77o81n33k06k2r9j34
61411A78688K44R20J376J309R32N66K45r5l04j85J62M73O69Q79J141J322J327
61394A89669J205J129J264J629J977J967J556J000M66j36p40r70o76l26m17p68
$$ plain form
61378 197829 196983 196345 195705 194679 193335 192153 191471 191221 191157 191077 190867 190522 190119 189675 189095 188402 187869 187728
61360 187728 187849 187926 187943 188177 188737 189369 189793 190082 190570 191470 192652 193763 194542 195057 195619 196445 197454 198494
61342 198494 199648 201148 202984 204841 206461 207912 209396 210939 212423 213814 215149 216344 217267 218045 219074
61327 219074 220560 222190 223469 224313 225071 225961 226783 227322 227752 228422 229356 230240 230836 231182 231388 231521 231705 232084
61309 232084 232571 232841 232748 232572 232661 232928 232957 232597 232277 232607 233742 235226 236422 237010 237095 236902 236540 236015 235340
61290 235340 234499 233414 232074 230666 229430 228416 227495 226652 226062 225861 225925 226008 226018 226102 226471 227190 228130 229113
61272 229113 230128 231359 232947 234760 236476 237872 238953 239854 240682 241450 242054 242357 242409 242560 243213 244473
61256 244473 246137 248012 250074 252322 254640 256885 259010 261096 263283 265685 268224 270582 272439 273729
$$ packed form
61378A97829q46o38o40j026j344j182o82k50o4q0k10l45m03m44n80o93n33j41
61360A87728J21P7J7K34N60O32M24K89M88R00J182J111P79N15N62Q26J009J040
61342A98494J154J500J836J857J620J451J484J543J484J391J335J195R23P78J029
61327B19074J486J630J279Q44P58Q90Q22N39M30O70R34Q84N96L46K06J33J84L79
61309B32084M87K70r3j76Q9K67K9l60l20L30J135J484J196N88Q5j93l62n25o75
61290B35340q41j085j340j408j236j014r21q43n90k01O4Q3J0Q4L69P19R40R83
61272B29113J015J231J588J813J716J396J081R01Q28P68O04L03N2J51O53J260
61256B44473J664J875K062K248K318K245K125K086K187K402K539K358J857J290
$$ plain form
61242 273729 274531 274820 274581 274139 274047 274502 275142 275560 275823 276283 277002 277626 277753 277304 276529 275807 275397 275323 275447
61223 275447 275622 275746 275741 275645 275718 276264 277335 278735 280364 282348 284805 287711 291102 295159 299943 305232 310769
61206 310769 316555 322726 329291 336087 342819 349021 354182 358133 361105 363249 364312 364081 362931 361543
61192 361543 360118 358270 355685 352506 348996 345166 340919 336326 331564 326784 322222 318255 315064 312334
61178 312334 309535 306571 303939 302162 301188 300502 299751 299110 298963 299393 300135 300958 301879 302978 304267 305847
61162 305847 307999 310884 314223 317508 320473 323167 325532 327231 328032 328162 328067 327868 327246 325907 323983 321916
61146 321916 319999 318202 316409 314694 313272 312306 311871 312091 313069 314648 316364 317800 318888 319772 320470 320890
61130 320890 321176 321843 323410 325966 329137 332452 335628 338593 341416 344328 347674 351618 355883 359964 363690
$$ packed form
61242B73729Q02K89k39m42r2M55O40M18K63M60P19O24J27m49p75p22m10p4J24
61223B75447J75J24nr6P3N46J071J400J629J984K457K906L391M057M784N289N537
61206C10769N786O171O565O796O732O202N161L951K972K144J063k31j150j388
61192C61543j425j848k585l179l510l830m247m593m762m780m562l967l191k730
61178C12334k799k964k632j777r74o86p51o41j47M30P42Q23R21J099J289J580
61162C05847K152K885L339L285K965K694K365J699Q01J30r5j99o22j339j924k067
61146C21916j917j797j793j715j422r66m35K20R78J579J716J436J088Q84O98M20
61130C20890K86O67J567K556L171L315L176K965K823K912L346L944M265M081L726
$$ plain form
61115 363690 367447 371689 376316 380709 384331 387115 389326 391294 393351 395761 398548 401552 404799 408633
61101 408633 413345 418785 424586 430644 437136 444114 451374 458772 466350 473974 481041 486802 490946 493718
61087 493718 495518 496549 496853 496460 495373 493477 490586 486580 481499 475543 469034 462281 455362 448105 440379
61072 440379 432394 424576 417166 410079 403137 396263 389409 382517 375695 369304 363691 358906 354768 351093
61058 351093 347786 344841 342439 340923 340497 341066 342464 344664 347491 350378 352752 354610 356342 358021 359270
61043 359270 359912 360286 360749 361226 361504 361734 362387 363882 366482 370370 375546 381708 388512 395942 404299 413825
61027 413825 424352 435347 446308 457283 468978 482130 496741 512135 527827 543993 560927
61016 560927 578378 595746 612707 629345 645784 662036 678106 693908 709085 723222 736224
$$ packed form
61115C63690L757M242M627M393L622K784K211J968K057K410K787L004L247L834
61101D08633M712N440N801O058O492O978P260P398P578P624P067N761M144K772
61087D93718J800J031L04l93j087j896k891m006n081n956o509o753o919p257p726
61072D40379p985p818p410p087o942o874o854o892o822o391n613m785m138l675
61058C51093l307k945k402j516m26N69J398K200K827K887K374J858J732J679J249
61043C59270O42L74M63M77K78K30O53J495K600L888N176O162O804P430Q357R526
61027D13825J0527J0995J0961J0975J1695J3152J4611J5394J5692J6166J6934
61016E60927J7451J7368J6961J6638J6439J6252J6070J5802J5177J4137J3002
$$ plain form
61005 736224 748258 759267 768803 776377 781765 784940 785898 784698 781524 776622 770239 762620 753992 744508
60991 744508 734269 723374 711863 699704 686974 673946 660880 647782 634618 621697 609564
60980 609564 598459 588116 578152 568430 558936 549610 540507 531945 524171 516980 509891 502725 495787 489470
60966 489470 483886 478971 474737 471190 468129 465231 462393 459845 457882 456611 456004 456039 456694 457909 459712
60951 459712 462307 465870 470284 475226 480522 486232 492384 498823 505426 512321 519727 527662 535933 544366
60937 544366 552943 561764 570993 580810 591271 602187 613229 624267 635580 647682 660977 675605
60925 675605 691614 709176 728522 749678 772375 796292 821395 848089 877174 909697 946750
60914 946750 989290 1038172 1094366 1159091 1233809 1320328 1421003 1538749 1676842 1838919 2029124
$$ packed form
61005G36224J2034J1009R536P574N388L175R58j200l174m902o383p619q628r484
60991G44508j0239j0895j1511j2159j2730j3028j3066j3098j3164j2921j2133
60980F09564j1105j0343r964r722r494r326r103q562p774p191p089p166o938o317
60966D89470n584m915m234l547l061k898k838k548j963j271o07L5O55J215J803
60951D59712K595L563M414M942N296N710O152O439O603O895P406P935Q271Q433
60937E44366Q577Q821R229R817J0461J0916J1042J1038J1313J2102J3295J4628
60925F75605J6009J7562J9346K1156K2697K3917K5103K6694K9085L2523L7053
60914I46750M2540M8882N6194O4725P4718Q6519J00675J17746J38093J62077J90205
$$ plain form
60903 2029124 2252006 2512393 2816113 3171309 3588617 4079220 4651820 5310166 6052075
60894 6052075 6871342 7762473 8722003 9736397 10758301 11694144 12428631 12880593 13048494
60885 13048494 13007542 12864756 12713493 12615083 12595812 12636072 12657484 12538047 12165899 11499222
60875 11499222 10586266 9533297 8451249 7419883 6481717 5652268 4931101 4309492 3776251
60866 3776251 3321208 2935402 2609948 2336100 2106112 1913198 1750810 1612710 1493706
60857 1493706 1389936 1298565 1217609 1145775 1081966 1024957 973780 928059 887476 851126 817883
60846 817883 787161 758755 732090 706257 680776 655807 631577 608114 585607 564501 545028
60835 545028 526997 510184 494609 480259 466881 454235 442391 431633 422139 413800 406215 398946
$$ packed form
60903B029124K22882K60387L03720L55196M17308M90603N72600O58346P41909
60894F052075Q19267Q91131R59530J014394J021904R35843P34487M51962J67901
60885A3048494m0952j42786j51263r8410j9271M0260K1412j19437l72148o66677
60875A1499222r12956j052969j082048j031366r38166q29449p21167o21609n33241
60866C776251m55043l85806l25454k73848k29988j92914j62388j38100j19004
60857A493706j03770r1371q0956p1834o3809n7009n1177m5721m0583l6350l3243
60846H17883l0722k8406k6665k5833k5481k4969k4230k3463k2507k1106j9473
60835E45028j8031j6813j5575j4350j3378j2646j1844j0758r494q339p585p269
$$ plain form
60823 398946 391894 385384 379739 374875 370508 366512 362828 359206 355455 351821 348727 346184 343823 341460
60809 341460 339212 337070 334831 332455 330084 327616 324702 321316 317918 314868 311964 308779 305192 301420
60795 301420 297716 294187 290754 287190 283343 279393 275750 272703 270320 268603 267475 266651 265851 265111 264629
60780 264629 264380 264232 264403 265273 266702 267947 268484 268506 268438 268347 268061 267584 267074 266638 266351 266346 266664 267189 267843 268696
60760 268696 269785 271029 272450 274257 276528 278975 281125 282642 283405 283433 282818 281657 280039 278249 276848
60745 276848 276254 276247 276167 275609 274553 272878 270249 266661 262671 258802 254995 250923 246560 242220 238166 234453
60729 234453 231009 227756 224757 222270 220450 218996 217393 215550 213886 212693 211803 211018 210430 210022 209390
60714 209390 208243 206902 205912 205339 204805 204077 203264 202522 201897 201448 201268 201384 201762 202371 203136 203900 204565 205143
$$ packed form
60823C98946p052o510n645m864m367l996l684l622l751l634l094k543k361k363
60809C41460k248k142k239k376k371k468k914l386l398l050k904l185l587l772
60795C01420l704l529l433l564l847l950l643l047k383j717j128q24q00p40m82
60780B64629k49j48J71Q70J429J245N37K2o8r1k86m77n10m36k87nL18N25O54Q53
60760B68696J089J244J421J807K271K447K150J517P63K8o15j161j618j790j401
60745B76848n94pq0n58j056j675k629l588l990l869l807m072m363m340m054l713
60729B34453l444l253k999k487j820j454j603j843j664j193q90p85n88m08o32
60714B09390j147j341r90n73n34p28q13p42o25m49j80J16L78O09P65P64O65N78
$$ plain form
60696 205143 205609 205869 206014 206384 207178 208122 208695 208651 208198 207766 207653 207783 207761 207302 206596 206073 205803 205396 204541
60677 204541 203329 201959 200479 198992 197771 196946 196287 195505 194513 193282 191765 190192 189112 188841 189134 189598
60661 189598 190183 190965 191817 192614 193521 194675 195799 196556 197075 197732 198501 198987 199076 199149 199610 200489 201562 202546
60643 202546 203175 203352 203337 203579 204200 204756 204578 203361 201445 199557 198205 197335 196616 195972 195575 195383 195054 194491
60625 194491 194092 194257 194901 195697 196553 197543 198612 199622 200546 201337 201774 201702 201282 200762 200179 199478 198742 197992
60607 197992 196993 195548 193843 192203 190689 189229 187978 187153 186608 185951 185074 184235 183623 183110 182420 181367
60591 181367 179978 178558 177551 177169 177263 177661 178408 179470 180539 181400 182273 183412 184652 185739 186885 188507
60575 188507 190574 192709 194844 197178 199496 201122 201736 201783 201833 201859 201418 200329 198915 197638 196627 195575
$$ packed form
60696B05143M66K60J45L70P94R44N73m4m53m32j13J30k2m59p06n23k70m07q55
60677B04541j212j370j480j487j221q25o59p82r92j231j517j573j080k71K93M64
60661A89598N85P82Q52P97R07J154J124P57N19O57P69M86Q9P3M61Q79J073R84
60643B02546O29J77j5K42O21N56j78j217j916j888j352q70p19o44l97j92l29n63
60625A94491l99J65O44P96Q56R90J069J010R24P91M37p2m20n20n83p01p36p50
60607A97992r99j445j705j640j514j460j251q25n45o57q77q39o12n13o90j053
60591A81367j389j420j007l82R4L98P47J062J069Q61Q73J139J240J087J146J622
60575A88507K067K135K135K334K318J626O14M7N0K6m41j089j414j277j011j052
$$ plain form
60559 195575 194152 192491 191154 190522 190406 190439 190584 190977 191504 191930 192302 192846 193561 194267 194981 195825 196619 196949
60541 196949 196688 196084 195324 194368 193235 192105 191074 190129 189350 188833 188378 187626 186575 185645 185134 184929 184831 184856
60523 184856 185144 185773 186726 187814 188663 189047 189199 189485 189850 189949 189830 189999 190692 191513 192005 192189 192316 192373 192109
60504 192109 191345 190125 188746 187753 187656 188436 189510 190332 190878 191418 192048 192651 193189 193817 194723 195925 197251
60487 197251 198523 199781 201221 202829 204266 205249 205894 206436 206840 207009 207223 207910 209023 210091 210868 211541
60471 211541 212311 213185 214262 215791 217837 220259 223100 226569 230559 234586 238409 242288 246418 250522 254221
60456 254221 257467 260313 262579 264056 264818 265057 264815 264083 263010 261828 260756 260089 260164 261063 262554 264451
60440 264451 266767 269447 272339 275673 280172 286338 293871 302143 310992 320696 331270 342232 353026
$$ packed form
60559A95575j423j661j337o32j16L3J45L93N27M26L72N44P15P06P14Q44P94L30
60541A96949k61o04p60r56j133j130j031r45p79n17m55p52j051r30n11k05r8K5
60523A84856K88O29R53J088Q49L84J52K86L65R9j19J69O93Q21M92J84J27N7k64
60504A92109p64j220j379r93r7P80J074Q22N46N40O30O03N38O28R06J202J326
60487A97251J272J258J440J608J437R83O45N42M04J69K14O87J113J068P77O73
60471B11541P70Q74J077J529K046K422K841L469L990M027L823L879M130M104L699
60456B54221L246K846K266J477P62K39k42p32j073j182j072o67P5Q99J491J897
60440B64451K316K680K892L334M499O166P533Q272Q849R704J0574J0962J0794
$$ plain form
60427 353026 363395 373244 382357 390307 396554 400606 402184 401255 398002 392856 386518 379683 372738 365866
60413 365866 359413 353814 349144 345057 341315 338094 335690 334239 333892 334897 337264 340633 344766 349906
60399 349906 356444 364490 374084 385534 399168 414874 432233 451011 471194 492594 514736 537120
60387 537120 559311 580700 600448 617808 632445 644411 653840 660650 664504 665031 661996 655186 644249
60374 644249 628927 609449 586461 560603 532523 503378 474831 448214 423870 401541 381141
60363 381141 362881 346834 332764 320339 309272 299342 290464 282689 275967 269991 264392 259048 254114
60350 254114 249848 246425 243756 241393 238862 236190 233890 232307 231260 230429 229748 229183 228439 227260 225853
60335 225853 224654 223804 223109 222421 221757 221142 220575 220097 219708 219325 218952 218742 218683 218464 217914 217382 217368 217883 218515
$$ packed form
60427C53026J0369R849R113P950O247M052J578r29l253n146o338o835o945o872
60413C65866o453n599m670m087l742l221k404j451l47J005K367L369M133N140
60399C49906O538Q046R594J1450J3634J5706J7359J8778K0183K1400K2142K2384
60387E37120K2191K1389J9748J7360J4637J1966R429O810L854N27l035o810j0937
60374F44249j5322j9478k2988k5858k8080k9145k8547k6617k4344k2329k0400
60363C81141j8260j6047j4070j2425j1067r930q878p775o722n976n599n344m934
60350B54114m266l423k669k363k531k672k300j583j047q31o81n65p44j179j407
60335B25853j199q50o95o88o64o15n67m78l89l83l73k10n9k19n50n32j4N15O32
$$ plain form
60316 218515 219018 219537 220270 221193 222134 222901 223370 223652 224123 225040 226206 227185 227787 228104 228181 227945 227503 227237 227567
60297 227567 228726 230706 233237 235849 238167 240131 241833 243266 244469 245770 247570 249852 252177 254191
60283 254191 255982 257879 260052 262341 264355 265741 266450 266766 267082 267716 268928 270827 273102 275067 276263
60268 276263 276919 277603 278562 279660 280806 282096 283511 284792 285727 286405 287162 288395 290329 292822 295473 298142
60252 298142 301221 305185 309983 315137 320315 325457 330405 334763 338232 340711 342024 341886 340286 337640
60238 337640 334371 330564 326211 321582 317105 312972 309080 305335 301773 298393 295071 291762 288697 286182
60224 286182 284196 282338 280285 278227 276673 275913 275836 276258 277158 278562 280416 282765 285821 289669 294030
60209 294030 298478 302774 306876 310725 314179 317048 319114 320252 320680 320895 321247 321744 322356 323205 324247 325058
$$ packed form
60316B18515N03N19P33R23R41P67M69K82M71R17J166R79O02L17P7k36m42k66L30
60297B27567J159J980K531K612K318J964J702J433J203J301J800K282K325K014
60283B54191J791J897K173K289K014J386P09L16L16O34J212J899K275J965J196
60268B76263O56O84R59J098J146J290J415J281R35O78P57J233J934K493K651K669
60252B98142L079L964M798N154N178N142M948M358L469K479J313j38j600k646
60238C37640l269l807m353m629m477m133l892l745l562l380l322l309l065k515
60224B86182j986j858k053k058j554p60p7M22R00J404J854K349L056L848M361
60209B94030M448M296M102L849L454K869K066J138M28K15L52M97O12Q49J042Q11
$$ plain form
60193 325058 325209 324644 323394 321198 317796 313455 308723 303794 298488 292833 287261 282172 277676 273776 270456
60178 270456 267525 264669 261755 258864 256011 253153 250503 248484 247218 246336 245452 244561 243850 243293 242665 241843
60162 241843 240916 240023 239203 238419 237713 237319 237517 238350 239540 240780 241966 243012 243705 243987 244232 244881 245830
60145 245830 246531 246693 246563 246476 246457 246393 246307 246280 246291 246283 246268 246269 246323 246600 247388 248827 250782 253000 255328 257737 260255
60124 260255 262928 265736 268540 271221 273862 276657 279688 282927 286436 290341 294562 298789 302787 306577
60110 306577 310252 313738 316827 319356 321382 323209 325218 327525 329840 331802 333391 334853 336272 337414
60096 337414 338016 338035 337581 336785 335750 334500 332971 331133 329109 327040 324928 322753 320688 318992 317750
60081 317750 316907 316493 316549 316849 317020 316971 316969 317219 317635 318090 318613 319175 319492 319287 318625 317850 317202 316622 315898 314917
$$ packed form
60193C25058J51n65j250k196l402m341m732m929n306n655n572n089m496l900l320
60178B70456k931k856k914k891k853k858k650k019j266q82q84q91p11n57o28q22
60162B41843r27q93q20p84p06l94J98Q33J190J240J186J046O93K82K45O49R49
60145B45830P01J62j30q7j9o4q6k7J1qj5JN4K77P88J439J955K218K328K409K518
60124B60255K673K808K804K681K641K795L031L239L509L905M221M227L998L790
60110C06577L675L486L089K529K026J827K009K307K315J962J589J462J419J142
60096C37414O02J9m54p96j035j250j529j838k024k069k112k175k065j696j242
60081C17750q43m14N6L00J71m9kK50M16M55N23N62L17k05o62p75o48n80p24r81
$$ plain form
60061 314917 313796 312774 311984 311356 310745 310101 309464 308892 308493 308434 308785 309421 310143 310851 311539 312318 313505 315440
60043 315440 317978 320385 322031 323065 324128 325585 327359 329375 331712 334308 336912 339433 342014 344726
60029 344726 347413 349902 352073 353713 354613 354844 354683 354228 353380 352226 351121 350304 349707 349232 348913 348690 348342
60012 348342 347760 347103 346545 346068 345622 345275 345105 345111 345312 345735 346277 346763 347219 347892 348943 350279 351741 353268
59994 353268 354883 356715 358990 361679 364169 365630 365809 365206 364361 363321 361890 360085 358080 355967 353753
59979 353753 351466 349096 346590 344010 341496 338962 336025 332386 328141 323623 319115 314775 310668 306759
59965 306759 302998 299516 296572 294287 292547 291123 289730 288077 286126 284289 283020 282234 281491 280744 280477
59950 280477 280994 281992 283022 283969 284870 285640 286244 286855 287573 288227 288661 288979 289298 289495 289442 289226 288896 288193 286828
$$ packed form
60061C14917j121j022p90o28o11o44o37n72l99n9L51O36P22P08O88P79J187J935
60043C15440K538K407J646J034J063J457J774K016K337K596K604K521K581K712
60029C44726K687K489K171J640R00K31j61m55q48j154j105q17n97m75l19k23l48
60012C48342n82o57n58m77m46l47j70OK01M23N42M86M56O73J051J336J462J527
59994C53268J615J832K275K689K490J461J79o03q45j040j431j805k005k113k214
59979C53753k287k370k506k580k514k534k937l639m245m518m508m340m107l909
59965C06759l761l482k944k285j740j424j393j653j951j837j269p86p43p47k67
59950B80477N17R98J030R47R01P70O04O11P18O54M34L18L19J97n3k16l30p03j365
$$ plain form
59931 286828 284878 282710 280675 278987 277727 276755 275755 274524 273065 271384 269424 267274 265116 262860
59917 262860 260200 257199 254470 252485 251047 249708 248381 247215 246201 245289 244664 244496 244556 244447 244093 243653
59901 243653 243129 242404 241610 241064 240880 240884 240924 241000 241122 241284 241582 242196 243243 244732 246532 248327 249775 250832
59883 250832 251784 252816 253828 254766 255810 256940 257632 257410 256521 255689 255325 255287 255328 255349 255305 255189 255130 255241 255411
59864 255411 255558 256024 257361 259690 262528 265307 267790 269970 271807 273205 274091 274471 274491 274362 274077 273283
59848 273283 271648 269387 267176 265553 264522 263755 262945 261961 260861 259871 259246 259118 259467 260235 261340 262632
59832 262632 263965 265341 266936 268943 271387 274063 276663 279015 281144 283047 284502 285296 285585 285728 285804
59817 285804 285613 285257 285301 286187 287776 289710 291929 294530 297435 300511 303810 307340 310737 313516 315537
$$ packed form
59931B86828j950k168k035j688j260r72j000j231j459j681j960k150k158k256
59917B62860k660l001k729j985j438j339j327j166j014r12o25j68O0j09l54m40
59901B43653n24p25p94n46j84MM0P6J22J62K98O14J047J489J800J795J448J057
59883B50832R52J032J012R38J044J130O92k22q89q32l64l8M1K1m4j16n9J11J70
59864B55411J47M66J337K329K838K779K483K180J837J398Q86L80K0j29k85p94
59848B73283j635k261k211j623j031p67q10r84j100r90o25j28L49P68J105J292
59832B62632J333J376J595K007K444K676K600K352K129J903J455P94K89J43P6
59817B85804j91l56M4Q86J589J934K219K601K905L076L299L530L397K779K021
$$ plain form
59802 315537 316924 317638 317500 316582 315247 313742 312008 309953 307734 305711 304201 303274 302742 302407 302326 302662
59786 302662 303301 303904 304438 305348 307037 309449 312360 315687 319235 322526 325309 327944 330805 333583 335699
59771 335699 337218 338771 340618 342378 343727 344793 345688 346157 345959 345261 344403 343477 342368 341040 339631 338340
59755 338340 337297 336447 335576 334596 333798 333648 334309 335556 337146 339118 341723 345230 349784 355280 361283 367204
59739 367204 372551 376942 379990 381422 381366 380428 379472 379272 380167 381835 383447 384171 383512 381262 377433 372409
59723 372409 366891 361421 356096 350843 345734 340823 336038 331525 327818 325228 323293 321260 318939 316686
59709 316686 314759 313160 311982 311320 310895 310301 309663 309553 310169 311032 311611 311801 311713 311403 311021 310823 310827 310746 310432
59690 310432 310139 310132 310259 310037 309039 307175 304817 302658 301192 300280 299439 298535 297844 297463 297071 296381 295475 294545
$$ packed form
59802C15537J387P14j38r18j335j505j734k055k219k023j510r27n32l35q1L36
59786C02662O39O03N34R10J689K412K911L327L548L291K783K635K861K778K116
59771C35699J519J553J847J760J349J066Q95M69j98o98q58r26j109j328j409j291
59755C38340j043q50q71r80p98j50O61J247J590J972K605L507M554N496O003N921
59739C67204N347M391L048J432n6r38r56k00Q95J668J612P24o59k250l829n024
59723C72409n518n470n325n253n109m911m785m513l707k590j935k033k321k253
59709C16686j927j599j178o62m25n94o38j10O16Q63N79J90q8l10l82j98Mq1l14
59690C10432k93pJ27k22r98j864k358k159j466r12q41r04o91l81l92o90r06r30
$$ plain form
59672 294545 293670 293051 293121 294117 295703 297229 298333 299173 300236 301992 304601 307856 311528 315730 320745 326454
59656 326454 332229 337496 342218 346766 351518 356643 362063 367461 372495 377062 381302 385368 389372 393491
59642 393491 397828 402109 405832 408789 411210 413281 414818 415574 415636 415310 414781 414064 413175 412151 410933 409400
59626 409400 407540 405558 403775 402392 401311 400253 399061 397799 396537 395237 393950 392922 392306 391979 391882
59611 391882 392312 393525 395234 396894 398446 400357 402937 405997 409252 412735 416685 421231 426254 431395
59597 431395 436233 440627 444812 448999 453017 456570 459635 462271 464242 465259 465489 465367 464993 464209 463159
59582 463159 462205 461271 459840 457675 455001 451878 447992 443304 438370 433695 429163 424401 419393 414513 410192
59567 410192 406746 404215 402284 400649 399542 399488 400500 402011 403729 405969 408891 411997 414813 417530 420483
$$ packed form
59672B94545q75o19P0R96J586J526J104Q40J063J756K609L255L672M202N015N709
59656C26454N775N267M722M548M752N125N420N398N034M567M240M066M004M119
59642C93491M337M281L723K957K421K071J537P56O2l26n29p17q89j024j218j533
59626D09400j860j982j783j383j081j058j192j262j262j300j287j028o16l27r7
59611C91882M30J213J709J660J552J911K580L060L255L483L950M546N023N141
59597D31395M838M394M185M187M018L553L065K636J971J017K30j22l74p84j050
59582D63159r54r34j431k165k674l123l886m688m934m675m532m762n008m880m321
59567D10192l446k531j931j635j107n4J012J511J718K240K922L106K816K717K953
$$ plain form
59552 420483 423357 425467 426574 426926 426605 425321 422796 419026 414188 408504 402158 395168 387527 379596 372135
59537 372135 365688 360140 355122 350619 346859 343764 340884 337855 334641 331327 327852 323998 319550 314497
59523 314497 309116 303768 298658 293875 289615 286084 283199 280676 278458 276711 275368 274038 272499 270934
59509 270934 269515 268169 266939 266201 266204 266671 267149 267546 268058 268799 269746 270849 271967 272899 273675 274587 275759
59492 275759 276947 277919 278707 279291 279386 278872 278128 277618 277349 277056 276683 276353 276046 275668 275273 274870 274185 272924
59474 272924 271241 269657 268525 267773 267092 266263 265301 264422 263769 263234 262693 262346 262456 262762 262667 262106 261717 261930
59456 261930 262387 262611 262774 263330 264308 265404 266512 267686 268874 270077 271563 273519 275764 278217 281332
59441 281332 285602 290888 296714 303022 310168 318343 327400 336985 346248 353662 357861 358711 357213 354509
$$ packed form
59552D20483K874K110J107L52l21j284k525l770m838n684o346o990p641p931p461
59537C72135o447n548n018m503l760l095k880l029l214l314l475l854m448n053
59523C14497n381n348n110m783m260l531k885k523k218j747j343j330j539j565
59509B70934j419j346j230p38LM67M78L97N12P41R47J103J118R32P76R12J172
59492B75759J188R72P88N84R5n14p44n10k69k93l73l30l07l78l95m03o85j261
59474B72924j683j584j132p52o81q29r62q79o53n35n41l47J10L06r5n61l89K13
59456B61930M57K24J63N56R78J096J108J174J188J203J486J956K245K453L115
59441B81332M270N286N826O308P146Q175R057R585R263P414M199Q50j498k704
$$ plain form
59427 354509 351474 348987 347744 347596 347676 347382 346803 346110 345040 343206 340557 337288 333574 329549 325337 321009
59411 321009 316671 312567 308855 305348 301759 298174 294976 292331 290112 288278 286940 286008 285212 284506 284120
59396 284120 284124 284321 284653 285312 286320 287369 288274 289239 290467 291787 292928 293953 295113 296414 297570 298357
59380 298357 298842 299255 299774 300456 301317 302399 303673 304907 305773 306191 306420 306726 307061 307254 307366 307673 308382 309523
59362 309523 311030 312724 314359 315921 317814 320491 323980 327946 332093 336256 340216 343738 346789 349476
59348 349476 351804 353685 355114 356073 356373 355865 354764 353450 351986 350132 347802 345207 342594 340137 338135
59333 338135 336966 336779 337405 338583 340122 341921 344105 347068 351077 355860 360878 366016 371689 378288 385821
59318 385821 394102 402937 412039 421070 429912 438685 447484 456291 465137 473916 481881 487648 490059 489065
$$ packed form
59427C54509l035k487j243j48Q0k94n79o93j070j834k649l269l714m025m212m328
59411C21009m338m104l712l507l589l585l198k645k219j834j338r32p96p06l86
59396B84120MJ97L32O59J008J049R05R65J228J320J141J025J160J301J156P87
59380B98357M85M13N19O82Q61J082J274J234Q66M18K29L06L35J93J12L07P09J141
59362C09523J507J694J635J562J893K677L489L966M147M163L960L522L051K687
59348C49476K328J881J429R59L00n08j101j314j464j854k330k595k613k457k002
59333C38135j169j87O26J178J539J799K184K963M009M783N018N138N673O599P533
59318C85821Q281Q835R102R031Q842Q773Q799Q807Q846Q779P965N767K411r94
$$ plain form
59304 489065 485751 481619 477823 474793 472383 470463 469359 469537 470765 471728 470613 466119 458087 447479
59290 447479 435860 424642 414541 405581 397540 390340 384118 379105 375401 372769 370708 368845 367240
59277 367240 366148 365597 365366 365331 365585 366202 367066 367972 368804 369633 370699 372259 374373 376871 379577 382470 385599
59260 385599 389053 393042 397774 403090 408526 413906 419618 426066 433102 440301 447551 455040 462797 470628
59246 470628 478410 486128 493678 500846 507354 512772 516617 518799 519723 519645 518208 515019 510340 504708 498110
59231 498110 490176 481094 471715 462698 454055 445610 437383 429395 421503 413616 405782 398055 390548 383608
59217 383608 377583 372406 367715 363319 359205 355190 351019 346797 342913 339558 336727 334632 333590 333474
59203 333474 333760 334217 335157 336967 339793 343683 348551 353972 359588 365751 373164 381614 389548 395155 397502
$$ packed form
59304D89065l314m132l796l030k410j920j104J78J228R63j115m494q032j0608
59290D47479j1619j1218j0101q960q041p200o222n013l704k632k061j863j605
59277C67240j092n51k31l5K54O17Q64R06Q32Q29J066J560K114K498K706K893L129
59260C85599L454L989M732N316N436N380N712O448P036P199P250P489P757P831
59246D70628P782P718P550P168O508N418L845K182R24p8j437l189m679n632o598
59231D98110p934r082r379r017q643q445q227p988p892p887p834p727p507o940
59217C83608o025n177m691m396m114m015m171m222l884l355k831k095j042j16
59203C33474K86M57R40J810K826L890M868N421N616O163P413Q450P934N607K347
$$ plain form
59188 397502 396585 392931 387537 381756 376702 372834 370180 368646 368015 368057 368921 371115 374834 379580 384656
59173 384656 389764 395007 400606 406808 413756 421160 428350 434835 440643 446021 451017 455467 459094 461546
59159 461546 462661 462803 462593 462187 461139 459022 455876 451953 447470 442765 438268 434043 429756 425285 421027
59144 421027 417361 414182 411239 408546 406191 404015 401830 399698 397696 395621 393189 390369 387317 384148
59130 384148 380925 377684 374276 370418 366084 361668 357606 354021 350815 347928 345396 343349 341972 341218
59116 341218 340601 339598 338265 337108 336300 335529 334662 334057 333998 334245 334406 334382 334251 334050 333859 333722 333360 332370
59098 332370 330878 329544 328746 328268 327963 328123 328842 329618 330024 330279 330718 331165 331353 331548 332180 333152 334080 334940
59080 334940 335902 336721 336875 336240 335192 334095 333073 332193 331484 330833 330142 329536 329172 329013 328989 329182 329577 329849
$$ packed form
59188C97502r17l654n394n781n054l868k654j534o31M2Q64K194L719M746N076
59173C84656N108N243N599O202O948P404P190O485N808N378M996M450L627K452
59159D61546J115J42k10m06j048k117l146l923m483m705m497m225m287m471m258
59144D21027l666l179k943k693k355k176k185k132k002k075k432k820l052l169
59130C84148l223l241l408l858m334m416m062l585l206k887k532k047j377p54
59116C41218o17j003j333j157q08p71q67o05n9K47J61k4j31k01j91j37l62r90
59098C32370j492j334p98m78l05J60P19P76M06K55M39M47J88J95O32R72R28Q60
59080C34940R62Q19J54o35j048j097j022q80p09o51o91o06l64j59k4J93L95K72
$$ plain form
59062 329849 329710 329272 328758 328087 327033 325616 323964 321970 319422 316373 313087 309754 306443 303192 299936
59047 299936 296566 293240 290308 287768 285149 282248 279570 277658 276336 275063 273695 272378 271010 269419
59033 269419 267926 267122 267105 267430 267783 268218 268757 269287 269940 271155 273215 275968 279094 282421 285953 289814
59017 289814 294181 299117 304511 310257 316358 322763 329276 335833 342602 349544 356119 361723 366241 369881
59003 369881 372693 374583 375588 375768 374990 373146 370427 367084 363131 358643 354145 350253 347106 344485 342354
58988 342354 340793 339545 338125 336396 334663 333187 331970 330963 330089 329049 327475 325320 322830 320165
58974 320165 317332 314479 311906 309786 308087 306726 305591 304469 303214 301918 300692 299394 297832 296090
58960 296090 294371 292650 290800 288932 287279 285844 284476 283184 282060 281019 279953 279061 278634 278619 278701 278802
$$ packed form
59062C29849j39m38n14o71j054j417j652j994k548l049l286l333l311l251l256
59047B99936l370l326k932k540k619k901k678j912j322j273j368j317j368j591
59033B69419j493q04j7L25L53M35N39N30O53J215K060K753L126L327L532L861
59017B89814M367M936N394N746O101O405O513O557O769O942O575N604M518L640
59003C69881K812J890J005J80p78j844k719l343l953m488m498l892l147k621k131
58988C42354j561j248j420j729j733j476j217j007q74j040j574k155k490k665
58974C20165k833k853k573k120j699j361j135j122j255j296j226j298j562j742
58960B96090j719j721j850j868j653j435j368j292j124j041j066q92m27j5Q2J01
$$ plain form
58944 278802 279100 279612 280090 280379 280579 280874 281381 282130 282951 283543 283864 284339 285404 287048 289061 291527 294678
58927 294678 298475 302721 307466 312875 318787 324807 330699 336325 341355 345460 348649 350963 352014 351381
58913 351381 349421 347086 344917 342699 340184 337652 335551 334014 332860 331853 330882 330161 330186 331186 332668
58898 332668 333940 335015 336529 338782 341321 343596 345480 347028 348151 348813 349251 349779 350582 351743 353226
58883 353226 354736 355917 356830 358002 359961 362891 366710 371177 375911 380652 385565 391056 397238 403880
58869 403880 410816 418014 425230 431980 438002 443449 448502 453088 457055 460349 462898 464595 465475 465634 464854
58854 464854 462644 458808 453734 447964 441666 434669 426892 418558 410061 401736 393758 386255 379465 373662
58840 373662 368877 364908 361721 359621 358786 358876 359371 360108 361175 362418 363461 364132 364514 364645 364425 363803 362769
$$ packed form
58944B78802K98N12M78K89K00K95N07P49Q21N92L21M75J065J644K013K466L151
58927B94678L797M246M745N409N912O020N892N626N030M105L189K314J051o33
58913C51381j960k335k169k218k515k532k101j537j154j007r71p21K5J000J482
58898C32668J272J075J514K253K539K275J884J548J123O62M38N28Q03J161J483
58883C53226J510J181R13J172J959K930L819M467M734M741M913N491O182O642
58869D03880O936P198P216O750O022N447N053M586L967L294K549J697Q80J59p80
58854D64854k210l836n074n770o298o997p777q334q497q325p978p503o790n803
58840C73662m785l969l187k100q35R0M95P37J067J243J043O71L82J31k20o22j034
$$ plain form
58823 362769 361292 359484 357676 356055 354419 352580 350796 349416 348324 347201 346149 345557 345497 345810 346685
58808 346685 348585 351576 355220 359179 363433 367917 372490 377380 383181 390219 398255 406843 415638 424326
58794 424326 432704 440941 449372 457981 466417 474574 482789 491399 500424 509692 518915 527592 535166 541314
58780 541314 545834 548418 548987 548170 546936 545661 543918 541193 537437 532964 528251 523839 520025 516604 513233
58765 513233 509954 506968 504099 500965 497545 494001 490086 485356 479940 474434 469053 463546 457965 452748
58751 452748 447923 442968 437658 432349 427162 421518 414852 407268 399254 391192 383384 376064 369183 362574
58737 362574 356440 351174 346687 342513 338652 335599 333399 331492 329725 328711 328783 329344 329763 330220 331109 332235
58721 332235 333221 334232 335672 337548 339652 341979 344438 346515 347798 348543 349234 349823 349909 349401 348504 347304
$$ packed form
58823C62769j477j808j808j621j636j839j784j380j092j123j052n92o0L13Q75
58808C46685J900K991L644L959M254M484M573M890N801P038Q036Q588Q795Q688
58794D24326Q378Q237Q431Q609Q436Q157Q215Q610R025R268R223Q677P574O148
58780E41314M520K584N69q17j234j275j743k725l756m473m713m412l814l421l371
58765E13233l279k986k869l134l420l544l915m730n416n506n381n507n581n217
58751D52748m825m955n310n309n187n644o666p584q014q062p808p320o881o609
58737C62574o134n266m487m174l861l053k200j907j767j014P2N61M19M57Q89J126
58721C32235R86J011J440J876K104K327K459K077J283P45O91N89Q6n08q97j200
$$ plain form
58705 347304 345826 344320 343021 341716 340009 337858 335537 333146 330525 327575 324354 320955 317545 314453
58691 314453 312028 310423 309614 309516 310003 311001 312641 315107 318251 321638 324991 328323 331634 334849 338132
58676 338132 341829 345939 350035 353796 357207 360094 361899 362143 360734 357700 353073 347290 341203 335378
58662 335378 329716 324059 318760 314375 311119 308890 307474 306475 305387 304029 302668 301525 300459 299294
58648 299294 298092 296995 296132 295778 296150 296949 297620 298245 299591 302043 305034 307873 310593 313632 317134 320945
58632 320945 324882 328675 332014 334942 337804 340646 343098 345059 346877 348639 349868 350349 350671 351530 352986
58617 352986 354736 356590 358290 359464 360234 361330 363108 364898 365798 365599 364503 362494 359522 355816 351408
58602 351408 345815 338755 330743 322424 313806 304741 295720 287503 280312 273982 268561 264080 260030 255763
$$ packed form
58705C47304j478j506j299j305j707k151k321k391k621k950l221l399l410l092
58691C14453k425j605q09r8M87R98J640K466L144L387L353L332L311L215L283
58676C38132L697M110M096L761L411K887J805K44j409l034m627n783o087n825
58662C35378n662n657n299m385l256k229j416r99j088j358j361j143j066j165
58648B99294j202j097q63l54L72P99O71O25J346K452K991K839K720L039L502L811
58632C20945L937L793L339K928K862K842K452J961J818J762J229M81L22Q59J456
58617C52986J750J854J700J174P70J096J778J790R00j99j096k009k972l706m408
58602C51408n593p060q012q319q618r065r021q217p191o330n421m481m050m267
$$ plain form
58588 255763 251285 247135 243663 240842 238534 236500 234421 232309 230614 229578 228940 228627 229147 230714 232524
58573 232524 233666 234347 235551 237818 241047 245127 249989 255274 260643 266267 272390 278624 284289 289167
58559 289167 293244 295963 296492 294691 291165 286501 281005 275078 269195 263543 258176 253397 249530 246438
58545 246438 243754 241419 239555 238036 236706 235802 235619 235950 236312 236510 236480 235923 234689 233241 232119 231184
58529 231184 229994 228668 227727 227286 227030 226847 226870 227020 227143 227458 228312 229608 230991 232408 233959 235438 236633
58512 236633 237848 239505 241382 242890 243943 244921 245950 246829 247568 248380 249235 249981 250752 251709 252561 252920 252999
58495 252999 253399 254379 255829 257687 259848 261963 263987 266609 270436 275071 279679 284201 289177 294680 300248
58480 300248 305704 311179 316449 321112 325318 329546 333714 337330 340404 343434 346578 349766 353561 358972
$$ packed form
58588B55763m478m150l472k821k308k034k079k112j695j036o38l13N20J567J810
58573B32524J142O81J204K267L229M080M862N285N369N624O123O234N665M878
58559B89167M077K719N29j801l526m664n496n927n883n652n367m779l867l092
58545B46438k684k335j864j519j330r04j83L31L62J98l0n57j234j448j122r35
58529B31184j190j326r41m41k56j83K3J50J23L15Q54J296J383J417J551J479J195
58512B36633J215J657J877J508J053R78J029Q79P39Q12Q55P46P71R57Q52L59P9
58495B52999M00R80J450J858K161K115K024K622L827M635M608M522M976N503N568
58480C00248N456N475N270M663M206M228M168L616L074L030L144L188L795N411
$$ plain form
58466 358972 366292 374901 384315 394618 405776 417286 428676 439671 449744 458170 464602 469036 471302
58453 471302 471274 469548 467114 464320 460896 456940 453086 449609 446141 442384 438345 433802 428254 421552 413918
58438 413918 405330 395644 385358 375464 366376 357769 349515 342008 335415 329440 324030 319544 315990 312820
58424 312820 309703 306817 304188 301511 298850 296767 295433 294275 292820 291285 290007 288868 287624 286308
58410 286308 284998 283587 282022 280416 278836 277326 276204 275852 276187 276731 277142 277268 276897 276057 275388 275549
58394 275549 276344 277096 277749 278821 280494 282587 285350 289277 294099 298892 303376 308221 313871 319956 326049
58379 326049 332177 338285 343976 349047 353612 357450 359901 360618 359818 357670 354136 349565 344755 340280 336357
58364 336357 333331 331512 330513 329670 329156 329807 331735 334070 336284 338825 342137 345937 349800 353591 356951
$$ packed form
58466C58972P320Q609R414J0303J1158J1510J1390J0995J0073Q426O432M434K266
58453D71302k8j726k434k794l424l956l854l477l468l757m039m543n548o702p634
58438D13918q588r686j0286r894r088q607q254p507o593n975n410m486l554l170
58424C12820l117k886k629k677k661k083j334j158j455j535j278j139j244j316
58410B86308j310j411j565j606j580j510j122l52L35N44M11J26l71q40o69J61
58394B75549P95P52O53J072J673K093K763L927M822M793M484M845N650O085O093
58379C26049O128O108N691N071M565L838K451P17q00k148l534m571m810m475l923
58364C36357l026j819r99q43n14O51J928K335K214K541L312L800L863L791L360
$$ plain form
58349 356951 359120 359698 358926 356965 353584 348860 343496 338186 333239 328966 325739 323469 321696 320288 319432
58334 319432 318942 318374 317811 317692 317893 317945 318178 319568 322276 325370 328176 330850 333372 335082 335624 335412 334788
58317 334788 333601 331878 329947 327692 324651 321115 318060 315726 313309 310379 307457 304865 302214 299503
58303 299503 297593 296983 297100 297343 297840 298703 299521 300170 301203 302937 304980 307022 309142 311043 312079 312425
58287 312425 313106 314409 315443 315770 316258 317709 319780 321932 324302 326975 329477 331739 334527 338185 341928
58272 341928 345053 347880 350848 353722 356382 359380 362996 366729 370352 374448 379189 383667 387178 390168
58258 390168 393201 395983 398145 399935 401398 401902 401253 400282 399634 398993 398173 397876 398584 399758 400949 402678
58242 402678 405490 409151 413415 418509 424231 429720 434810 440378 446653 452533 457296 461597 465900 469390
$$ packed form
58349C56951K169N78p72j961l381m724n364n310m947m273l227k270j773j408q56
58334C19432m90n68n63j19K01N2K33J390K708L094K806K674K522J710N42k12o24
58317C34788j187j723j931k255l041l536l055k334k417k930k922k592k651k711
58303B99503j910o10J17K43M97Q63Q18O49J033J734K043K042K120J901J036L46
58287C12425O81J303J034L27M88J451K071K152K370K673K502K262K788L658L743
58272C41928L125K827K968K874K660K998L616L733L623M096M741M478L511K990
58258C90168L033K782K162J790J463N04o49r71o48o41q20k97P08J174J191J729
58242D02678K812L661M264N094N722N489N090N568O275N880M763M301M303L490
$$ plain form
58228 469390 471477 472986 474752 476319 477141 477830 479018 480219 480916 481682 483114 484849 486631 489123 492624
58213 492624 496246 499421 502960 507551 512549 517348 522543 528521 534382 539506 544841 551280 558168 564704
58199 564704 571415 578826 586083 592364 598349 604841 611250 616873 622398 628707 635490 642351 649914 658479
58185 658479 667095 675330 684396 695116 706477 717646 729593 743040 756715 769506 782534 797119
58173 797119 812455 827351 842495 858887 875726 892074 908908 927307 946251 964500 982963
58162 982963 1002929 1023612 1043840 1064407 1086282 1108239 1128852 1149183 1170878 1193306 1215300
58151 1215300 1237969 1262982 1289721 1317007 1345909 1377931 1412107 1446862 1483047 1522117 1563159
58140 1563159 1604891 1648780 1696919 1748616 1802341 1859089 1920355 1984885 2051112 2120784 2196376
$$ packed form
58228D69390K087J509J766J567Q22O89J188J201O97P66J432J735J782K492L501
58213D92624L622L175L539M591M998M799N195N978N861N124N335O439O888O536
58199E64704O711P411P257O281N985O492O409N623N525O309O783O861P563Q565
58185F58479Q616Q235R066J0720J1361J1169J1947J3447J3675J2791J3028J4585
58173G97119J5336J4896J5144J6392J6839J6348J6834J8399J8944J8249J8463
58162I82963J9966K0683K0228K0567K1875K1957K0613K0331K1695K2428K1994
58151A215300K2669K5013K6739K7286K8902L2022L4176L4755L6185L9070M1042
58140A563159M1732M3889M8139N1697N3725N6748O1266O4530O6227O9672P5592
$$ plain form
58129 2196376 2277042 2361080 2450190 2547100 2651185 2760825 2877899 3005350 3142692 3288722
58119 3288722 3446315 3619459 3808024 4010817 4231286 4474479 4741126 5030945 5349241
58110 5349241 5703771 6097952 6534348 7022436 7575810 8204991 8921563 9747226 10711199
58101 10711199 11843289 13180372 14776790 16696089 18992209 21707301 24884582 28574227
58093 28574227 32836468 37759843 43474290 50119781 57784022 66470547 76128191 86718909
58085 86718909 98277662 110876368 124368807 137946161 149870083 157850606 160058965
58078 160058965 156092108 147127200 135190896 122182664 109316202 97120499 85725194
58071 85725194 75140655 65410939 56631403 48882484 42169345 36424997 31550030 27435279
$$ packed form
58129B196376Q0666Q4038Q9110R6910J04085J09640J17074J27451J37342J46030
58119C288722J57593J73144J88565K02793K20469K43193K66647K89819L18296
58110E349241L54530L94181M36396M88088N53374O29181P16572Q25663R63973
58101A0711199J132090J337083J596418J919299K296120K715092L177281L689645
58093B8574227M262241M923375N714447O645491P664241Q686525R657644J0590718
58085H6718909J1558753J2598706J3492439J3577354J1923922P980523K208359
58078A60058965l966857q964908j1936304j3008232j2866462j2195703j1395305
58071H5725194j0584539r729716q779536p748919o713139n744348m874967m114751
$$ plain form
58063 27435279 23965319 21030495 18543091 16434502 14641357 13105461 11783385 10644018
58055 10644018 9657481 8794919 8036422 7369249 6778833 6249114 5770173 5337668 4945408
58046 4945408 4585396 4254314 3953179 3680700 3432639 3206999 3004093 2821756 2655639
58037 2655639 2503931 2367087 2243361 2129214 2023595 1927318 1838593 1753540 1670920 1592390
58027 1592390 1518426 1447857 1381075 1319769 1263541 1210276 1159702 1113227 1070587 1029984 991332
58016 991332 956081 923995 893214 863367 835605 809697 784103 758840 735368 713667 692183
58005 692183 670661 650322 631255 612255 593310 575681 559428 543230 526791 511154 496603
57994 496603 482498 469159 457712 448075 439160 430977 424442 419232 414009 408671 404217 400474 396143
$$ packed form
58063B7435279l469960k934824k487404k108589j793145j535896j322076j139367
58055A0644018r86537q62562p58497o67173n90416n29719m78941m32505l92260
58046D945408l60012l31082l01135k72479k48061k25640k02906j82337j66117
58037B655639j51708j36844j23726j14147j05619r6277q8725q5053q2620p8530
58027A592390p3964p0569o6782o1306n6228n3265n0574m6475m2640m0603l8652
58016I91332l5251l2086l0781k9847k7762k5908k5594k5263k3472k1701k1484
58005F92183k1522k0339j9067j9000j8945j7629j6253j6198j6439j5637j4551
57994D96603j4105j3339j1447r637q915q183o535n210n223n338m454l743m331
$$ plain form
57981 396143 391084 386324 381777 376175 369404 362751 356605 349965 342494 335017 327752 320004 311970 304900
57967 304900 299079 293490 287856 283174 279737 276417 272492 268582 265238 262126 259101 256641 254642 252154
57953 252154 248801 245231 241803 238092 234086 230581 227908 225410 222591 219713 216954 214049 211027 208264
57939 208264 205602 202447 198891 195688 193013 190274 187263 184383 181735 179101 176827 175490 174655 173245
57925 173245 171206 169488 168311 166851 164854 163116 161979 160751 159042 157402 156182 154938 153475 152303
57911 152303 151589 150764 149646 148866 148649 148286 147369 146582 146575 146986 147180 147192 147342 147575 147751 147976 148216 148151 147743 147417
57891 147417 147463 147796 148390 149226 149759 149246 147772 146194 144937 143685 142319 141190 140265 139011 137410 136170
57875 136170 135610 135230 134739 134599 135115 135824 136208 136289 136200 135896 135537 135396 135127 133983 132020 130216 129079 128057
$$ packed form
57981C96143n059m760m547n602o771o653o146o640p471p477p265p748q034p070
57967C04900n821n589n634m682l437l320l925l910l344l112l025k460j999k488
57953B52154l353l570l428l711m006l505k673k498k819k878k759k905l022k763
57939B08264k662l155l556l203k675k739l011k880k648k634k274j337q35j410
57925A73245k039j718j177j460j997j738j137j228j709j640j220j244j463j172
57911A52303p14q25j118p80k17l63r17p87pM11J94J2J50K33J76K25K40o5m08l26
57891A47417M6L33N94Q36N33n13j474j578j257j252j366j129r25j254j601j240
57875A36170n60l80m91j40N16P09L84Q1q9l04l59j41k69j144j963j804j137j022
$$ plain form
57857 128057 126641 125107 123703 122105 120206 118588 117619 116856 115876 114939 114298 113652 112872 112506 112961 113900 115025
57840 115025 116709 119230 122064 124658 127266 130260 133198 135359 136820 138235 139847 141314 142234 142327 141421
57825 141421 139725 137814 135952 133784 131040 128068 125272 122525 119620 116814 114405 112234 110117 108354
57811 108354 107260 106569 105855 105194 104925 105044 105298 105559 105667 105308 104487 103760 103508 103353 102778 101929 101289 100925
57793 100925 100634 100458 100453 100247 99495 98569 98170 98361 98592 98577 98584 98869 99349 99827 100150 100154 99851 99672 100139 101293 102781
57772 102781 104434 106419 108798 111259 113379 114973 116162 117236 118443 119793 121156 122584 124363 126639
57758 126639 129157 131509 133432 134828 135730 136367 136987 137499 137565 137111 136416 135587 134399 132829 131288 130006
57742 130006 128646 126907 125110 123766 122833 121885 120792 119804 119104 118672 118510 118691 119259 120293 121891 123905
$$ packed form
57857A28057j416j534j404j598j899j618r69p63r80r37o41o46p80l66M55R39J125
57840A15025J684K521K834K594K608K994K938K161J461J415J612J467R20R3r06
57825A41421j696j911j862k168k744k972k796k747k905k806k409k171k117j763
57811A08354j094o91p14o61k69J19K54K61J08l59q21p27k52j55n75q49o40l64
57793A00925k91j76nk06p52r26l99J91K31j5PK85M80M78L23Ml03j79M67J154J488
57772A02781J653J985K379K461K120J594J189J074J207J350J363J428J779K276
57758A26639K518K352J923J396R02O37O20N12O6m54o95q29j188j570j541j282
57742A30006j360j739j797j344r33r48j093r88p00m32j62J81N68J034J598K014
$$ plain form
57726 123905 125947 127844 129816 131927 133721 134786 135392 136123 137106 138027 138741 139416 140149 140843 141442 141948 142238
57709 142238 142116 141473 140206 138107 135085 131362 127247 122891 118486 114408 110836 107462 103964 100543 97615
57694 97615 95165 92854 90557 88374 86212 83889 81628 79968 79136 78860 78802 78802 78712 78446 78301 78766 79871
57677 79871 81027 81700 81991 82365 83055 83913 84672 85171 85366 85257 84792 83882 82537 80972 79438 78028 76691
57660 76691 75403 74201 73141 72368 72113 72486 73338 74481 75884 77455 78797 79494 79593 79547 79719 80217 81185
57643 81185 82860 85235 87906 90444 92761 95017 97309 99585 101736 103633 105148 106241 107032 107712 108375
57628 108375 108939 109227 109130 108666 107893 106799 105399 103892 102613 101745 101189 100712 100112 99227 97983 96487 94978
57611 94978 93597 92329 91199 90303 89595 88846 87951 87099 86491 86084 85715 85347 85025 84811 84871 85423 86411 87441
$$ packed form
57726A23905K042J897J972K111J794J065O06P31R83R21P14O75P33O94N99N06K90
57709A42238j22o43j267k099l022l723m115m356m405m078l572l374l498l421k928
57694I7615k450k311k297k183k162k323k261j660q32k76n8%r0k66j45M65J105
57677G9871J156O73K91L74O90Q58P59M99J95j09m65r10j345j565j534j410j337
57660G6691j288j202j060p73k55L73Q52J143J403J571J342O97R9m6J72M98R68
57643H1185J675K375K671K538K317K256K292K276K151J897J515J093P91O80O63
57628A08375N64K88r7m64p73j094j400j507j279q68n56m77o00q85j244j496j509
57611I4978j381j268j130q96p08p49q95q52o08m07l69l68l22k14O0N52R88J030
$$ plain form
57593 87441 88250 89043 90102 91256 92059 92368 92420 92435 92460 92599 93100 94082 95347 96552 97548 98558 100078 102504
57575 102504 105860 110008 115142 121840 130553 141336 154203 169391 186981 206562 227604 249892
57563 249892 273169 296400 317631 334319 343599 342834 331002 309837 283161 254825 227328 201999
57551 201999 179573 160235 143610 129226 116854 106295 97183 89264 82595 77196 72697 68597 64734
57538 64734 61286 58423 56174 54543 53476 52733 51941 50885 49689 48674 48046 47695 47327 46795 46195 45586
57522 45586 44768 43557 42134 40864 39794 38677 37484 36551 36030 35510 34451 32811 31031 29501 28258
57507 28258 27148 26071 25048 24172 23495 22922 22248 21347 20303 19327 18612 18273 18304 18499 18517 18092 17224 16135
57489 16135 15076 14182 13444 12813 12295 11834 11124 9766 7801 5863 4567 3827 3105 2177 1248 333 -978
$$ packed form
57593H7441Q09P93J059J154Q03L09N2J5K5J39N01R82J265J205R96J010J520K426
57575A02504L356M148N134O698Q713J0783J2867J5188J7590J9581K1042K2288
57563B49892K3277K3231K1231J6688R280p65j1832k1165k6676k8336k7497k5329
57551B01999k2426j9338j6625j4384j2372j0559r112p919o669n399m499m100l863
57538F4734l448k863k249j631j067p43p92j056j196j015o28l51l68n32o00o09
57522D5586q18j211j423j270j070j117j193r33n21n20j059j640j780j530j243
57507B8258j110j077j023q76o77n73o74r01j044r76p15l39L1J95J8m25q68j089
57489A6135j059q94p38o31n18m61p10j358j965j938j296p40p22r28r29C33i78
$$ plain form
57471 -2964 -5319 -7569 -9595 -11516 -13290 -14760 -15953 -17098 -18340 -19642 -20896 -21996 -22883 -23595 -24200
57456 -24200 -24680 -25016 -25385 -26038 -26891 -27547 -27819 -27930 -28049 -27953 -27432 -26717 -26179 -25854 -25594 -25445 -25475 -25456 -25129 -24662
57436 -24662 -24400 -24289 -24054 -23881 -24345 -25596 -27125 -28459 -29614 -30684 -31435 -31654 -31575 -31604 -31825 -32027 -32084 -32034 -31922
57417 -31922 -31771 -31676 -31776 -32151 -32747 -33288 -33344 -32714 -31780 -31175 -31049 -30970 -30616 -30198 -30010 -29979 -29956 -30134 -30759 -31671 -32504
57396 -32504 -33211 -34036 -35053 -36134 -37302 -38753 -40523 -42430 -44336 -46189 -47825 -49069 -50067 -51207 -52610
57381 -52610 -53975 -55027 -55874 -56728 -57516 -58000 -58166 -58281 -58593 -59101 -59650 -60140 -60586 -61033 -61505 -62044 -62747 -63677
57363 -63677 -64736 -65747 -66633 -67449 -68238 -69016 -69905 -71048 -72359 -73570 -74616 -75709 -76884 -77804 -78247 -78520
57347 -78520 -79035 -79640 -79830 -79537 -79312 -79681 -80584 -81529 -82053 -82010 -81617 -81281 -81233 -81346 -81439 -81567 -81858 -82218 -82542 -83054
$$ packed form
57471b964k355k250k026j921j774j470j193j145j242j302j254j100q87p12o05
57456b4200m80l36l69o53q53o56k72j11j19R6N21P15N38L25K60J49l0J9L27M67
57436b4662K62J11K35J73m64j251j529j334j155j070p51k19P9k9k21k02n7N0J12
57417c1922J51R5j00l75n96n41n6O30R34O05J26P9L54M18J88L1K3j78o25r12q33
57396c2504p07q25j017j081j168j451j770j907j906j853j636j244r98j140j403
57381e2610j365j052q47q54p88m84j66j15l12n08n49m90m46m47m72n39p03r30
57363f3677j059j011q86q16p89p78q89j143j311j211j046j093j175r20m43k73
57347g8520n15o05j90K93K25l69r03r45n24M3L93L36M8j13r3j28k91l60l24n12
$$ plain form
57327 -83054 -84059 -85436 -86761 -87971 -89448 -91410 -93598 -95669 -97489 -98940 -99856 -100403 -101178 -102636 -104599
57312 -104599 -106561 -108251 -109687 -110859 -111667 -112109 -112333 -112503 -112707 -112993 -113446 -114195 -115297 -116563 -117663 -118542
57296 -118542 -119555 -120952 -122400 -123360 -123842 -124378 -125288 -126382 -127433 -128455 -129407 -130106 -130631 -131426 -132708 -134057
57280 -134057 -134906 -135255 -135641 -136488 -137647 -138502 -138531 -137879 -137366 -137663 -138575 -139409 -139947 -140572 -141472 -142284 -142693 -142865 -143044
57261 -143044 -143205 -143350 -143715 -144373 -145036 -145561 -146239 -147285 -148435 -149395 -150343 -151626 -153264 -155131 -157315 -159879
57245 -159879 -162512 -164840 -166877 -168863 -170802 -172505 -173926 -175172 -176342 -177569 -179013 -180605 -182095 -183500
57231 -183500 -185183 -187227 -189200 -190874 -192743 -195351 -198434 -201257 -203574 -205773 -208234 -211007 -213969 -216894
57217 -216894 -219496 -221719 -223875 -226197 -228525 -230719 -233102 -236028 -239249 -242196 -244723 -247171 -249824 -252704
$$ packed form
57327h3054j005j377j325j210j477j962k188k071j820j451r16n47p75j458j963
57312a04599j962j690j436j172q08m42k24j70k04k86m53p49j102j266j100q79
57296a18542j013j397j448r60m82n36r10j094j051j022r52o99n25p95j282j349
57280a34057q49l49l86q47j159q55k9O52N13k97r12q34n38o25r00q12m09j72j79
57261a43044j61j45l65o58o63n25o78j046j150r60r48j283j638j867k184k564
57245a59879k633k328k037j986j939j703j421j246j170j227j444j592j490j405
57231a83500j683k044j973j674j869k608l083k823k317k199k461k773k962k925
57217b16894k602k223k156k322k328k194k383k926l221k947k527k448k653k880
$$ plain form
57203 -252704 -255733 -258707 -261253 -263207 -264916 -266839 -269043 -271387 -273917 -276632 -279145 -281107 -282798 -284779
57189 -284779 -287090 -289270 -291086 -292740 -294403 -296008 -297544 -299143 -300846 -302572 -304310 -306122 -308035 -310137
57175 -310137 -312606 -315425 -318267 -320903 -323506 -326335 -329393 -332636 -336196 -340114 -344180 -348305 -352658 -357131
57161 -357131 -361176 -364565 -367811 -371358 -374892 -378016 -381045 -384474 -388119 -391506 -394722 -398125 -401556 -404606
57147 -404606 -407424 -410479 -413776 -417032 -420375 -424123 -428112 -431972 -435828 -439915 -443806 -446855 -449220 -451613
57133 -451613 -454164 -456415 -458303 -460259 -462356 -464207 -465752 -467390 -469333 -471453 -473691 -475977 -477912 -479260
57119 -479260 -480585 -482607 -485127 -487343 -489056 -490744 -492669 -494751 -497097 -499674 -501682 -502297 -501939 -501809 -502176
57104 -502176 -502089 -500731 -498137 -494757 -491340 -489129 -488996 -490299 -491608 -492555 -494017 -496649 -500518 -506131 -514541
$$ packed form
57203b52704l029k974k546j954j709j923k204k344k530k715k513j962j691j981
57189b84779k311k180j816j654j663j605j536j599j703j726j738j812j913k102
57175c10137k469k819k842k636k603k829l058l243l560l918m066m125m353m473
57161c57131m045l389l246l547l534l124l029l429l645l387l216l403l431l050
57147d04606k818l055l297l256l343l748l989l860l856m087l891l049k365k393
57133d51613k551k251j888j956k097j851j545j638j943k120k238k286j935j348
57119d79260j325k022k520k216j713j688j925k082k346k577k008o15L58J30l67
57104e02176Q7J358K594L380L417K211J33j303j309r47j462k632l869n613q410
$$ plain form
57089 -514541 -526215 -540875 -558507 -579328 -602644 -626934 -651248 -675439 -699111 -721694 -743738
57078 -743738 -766692 -791125 -816360 -842076 -868876 -897013 -925948 -955565 -986441 -1018483 -1050629
57067 -1050629 -1082409 -1114597 -1147874 -1182003 -1216765 -1252444 -1288939 -1325569 -1362252 -1399795 -1438767
57056 -1438767 -1479209 -1521591 -1566699 -1614365 -1663785 -1715263 -1770119 -1828645 -1889889 -1953783 -2021653
57045 -2021653 -2094116 -2170324 -2249929 -2333999 -2423224 -2517002 -2615070 -2718380 -2827563 -2942262 -3062760
57034 -3062760 -3190605 -3326874 -3471488 -3624966 -3789038 -3964780 -4152018 -4351316 -4564622
57025 -4564622 -4793249 -5037246 -5297453 -5575989 -5873992 -6191412 -6530011 -6894117 -7287504
57016 -7287504 -7712409 -8172859 -8675970 -9228193 -9833000 -10494131 -11218939 -12017372 -12900958
$$ packed form
57089e14541j1674j4660j7632k0821k3316k4290k4314k4191k3672k2583k2044
57078g43738k2954k4433k5235k5716k6800k8137k8935k9617l0876l2042l2146
57067a050629l1780l2188l3277l4129l4762l5679l6495l6630l6683l7543l8972
57056a438767m0442m2382m5108m7666m9420n1478n4856n8526o1244o3894o7870
57045b021653p2463p6208p9605q4070q9225r3778r8068j03310j09183j14699j20498
57034c062760j27845j36269j44614j53478j64072j75742j87238j99298k13306
57025d564622k28627k43997k60207k78536k98003l17420l38599l64106l93387
57016g287504m24905m60450n03111n52223o04807o61131p24808p98433q83586
$$ plain form
57007 -12900958 -13885090 -14990223 -16239971 -17661964 -19293533 -21185400 -23401058 -26019841
56999 -26019841 -29146296 -32916103 -37493122 -43064603 -49835887 -58012032 -67763159 -79193329
56991 -79193329 -92330516 -107130439 -123479171 -141193708 -160025188 -179665541 -199770068
56984 -199770068 -220016490 -240184603 -260190078 -280017098 -299561422 -318438841 -335824978
56977 -335824978 -350430787 -360739099 -365492381 -364170865 -357123410 -345277468 -329703239
56970 -329703239 -311354033 -291042890 -269496164 -247361636 -225189386 -203434882 -182475557
56963 -182475557 -162615328 -144084052 -127044690 -111598060 -97777977 -85551977 -74837925
56956 -74837925 -65523335 -57475373 -50549161 -44601452 -39500727 -35126969 -31370121 -28134388
$$ packed form
57007a2900958r84132j105133j249748j421993j631569j891867k215658k618783
56999b6019841l126455l769807m577019n571481o771284q176145r751127j1430170
56991g9193329j3137187j4799923j6348732j7714537j8831480j9640353k0104527
56984a99770068k0246422k0168113k0005475j9827020j9544324j8877419j7386137
56977c35824978j4605809j0308312m753282J321516P047455J1845942J5574229
56970c29703239J8349206K0311143K1546726K2134528K2172250K1754504K0959325
56963a82475557J9860229J8531276J7039362J5446630J3820083J2226000J0714052
56956g4837925R314590Q047962O926212N947709N100725M373758L756848L235733
$$ plain form
56948 -28134388 -25340935 -22922998 -20821180 -18985352 -17376516 -15962557 -14713931 -13605176
56940 -13605176 -12616996 -11733563 -10939746 -10222783 -9573862 -8985474 -8449226 -7958059 -7508153
56931 -7508153 -7096494 -6718613 -6370492 -6050352 -5756468 -5485270 -5233604 -5000946 -4787486
56922 -4787486 -4591898 -4412815 -4250129 -4102043 -3962212 -3822590 -3678845 -3531778 -3384770
56913 -3384770 -3241657 -3105808 -2978813 -2859972 -2748063 -2642981 -2544801 -2452451 -2364645 -2281220
56903 -2281220 -2202336 -2127267 -2055191 -1986272 -1920758 -1857912 -1796998 -1738508 -1683208 -1630765 -1580482
56892 -1580482 -1532607 -1487774 -1445801 -1406114 -1368735 -1333854 -1301058 -1269933 -1240776 -1213762 -1188065
56881 -1188065 -1162724 -1137777 -1113682 -1090301 -1067313 -1044994 -1023735 -1003334 -983522 -964497 -946161
$$ packed form
56948b8134388K793453K417937K101818J835828J608836J413959J248626J108755
56940a3605176R88180Q83433P93817P16963O48921N88388N36248M91167M49906
56931g508153M11659L77881L48121L20140K93884K71198K51666K32658K13460
56922d787486J95588J79083J62686J48086J39831J39622J43745J47067J47008
56913c384770J43113J35849J26995J18841J11909J05082R8180R2350Q7806Q3425
56903b281220P8884P5069P2076O8919O5514O2846O0914N8490N5300N2443N0283
56892a580482M7875M4833M1973L9687L7379L4881L2796L1125K9157K7014K5697
56881a188065K5341K4947K4095K3381K2988K2319K1259K0401J9812J9025J8336
$$ plain form
56870 -946161 -927584 -908098 -888281 -869039 -850405 -832033 -814146 -797042 -780312 -763465 -746763
56859 -746763 -730602 -714655 -698508 -682474 -666862 -651080 -634500 -617745 -602154 -588383 -576354
56848 -576354 -566053 -557386 -549642 -542036 -534525 -527317 -519989 -511901 -503111 -494058 -484709 -474817 -464635 -454520
56834 -454520 -444193 -433174 -421654 -410079 -398197 -385340 -371431 -357066 -342941 -329955 -319427
56823 -319427 -312284 -308169 -306013 -305183 -305368 -305816 -305647 -304752 -303544 -302020 -299871 -297281 -294770 -292347 -289613
56808 -289613 -286570 -283573 -280593 -277279 -273660 -270049 -266350 -262187 -257676 -253361 -249465 -245814 -242409 -239339
56794 -239339 -236273 -232748 -228891 -225126 -221288 -216752 -211426 -205819 -200123 -193982 -187271 -180367 -173596 -167112
56780 -167112 -161456 -157522 -155670 -155360 -155833 -156683 -157669 -158492 -158953 -158905 -157972 -155751 -152324 -148135 -143355 -137815
$$ packed form
56870i46161J8577J9486J9817J9242J8634J8372J7887J7104J6730J6847J6702
56859g46763J6161J5947J6147J6034J5612J5782J6580J6755J5591J3771J2029
56848e76354J0301Q667P744P606P511P208P328Q088Q790R053R349R892J0182J0115
56834d54520J0327J1019J1520J1575J1882J2857J3909J4365J4125J2986J0528
56823c19427P143M115K156Q30j85m48J69Q95J208J524K149K590K511K423K734
56808b89613L043K997K980L314L619L611L699M163M511M315L896L651L405L070
56794b39339L066L525L857L765L838M536N326N607N696O141O711O904O771O484
56780a67112N656L934J852L10m73q50r86q23m61M8R33K221L427M189M780N540
$$ plain form
56764 -137815 -131585 -125037 -118294 -111093 -103286 -94931 -85818 -75478 -63922 -52021 -41047 -32245 -26768
56751 -26768 -25342 -27602 -32098 -37254 -42131 -46300 -49530 -51808 -53260 -53764 -52872 -50297 -46204 -40831 -34134
56736 -34134 -25932 -16185 -4960 7692 21737 37076 53512 70414 86325 99099 106675 107849 102642
56723 102642 92339 79091 65034 51527 39202 28496 19757 12956 7736 3848 1309 186 570
56710 570 2761 7098 13498 21462 30595 40842 52130 63983 75432 85035 91043 92043 87731 79066
56696 79066 67739 55610 44276 34588 26395 19097 12553 7251 3619 1552 653 627 1388 3044 5824
56681 5824 9763 14478 19554 25100 31498 38501 44926 49352 50862 49180 44592 38009 30725 23739 17343
56666 17343 11403 5861 843 -3471 -6941 -9511 -11303 -12546 -13438 -14150 -14888 -15739 -16509 -16951 -17117 -17225 -17261
$$ packed form
56764a37815O230O548O743P201P807Q355R113J0340J1556J1901J0974Q802N477
56751b6768J426k260m496n156m877m169l230k278j452n04Q92K575M093N373O697
56736c4134Q202R747d960G692J4045J5339J6436J6902J5911J2774P576J174n207
56723A02642j0303j3248j4057j3507j2325j0706q739o801n220C848A309A86L84
56710E70K191M337O400P964R133J0247J1288J1853J1449R603O008J000m312q665
56696G9066j1327j2129j1334r688q193p298o544n302C619A552F53k6P61J656K780
56681E824L939M715N076N546O398P003O425M426J510j682m588o583p284o986o396
56666A7343n940n542H43c471l470k570j792j243q92p12p38q51p70m42j66j08l6
$$ plain form
56649 -17261 -17005 -16461 -15919 -15571 -15342 -15147 -15021 -14942 -14802 -14613 -14509 -14513 -14484 -14327 -14006 -13425 -12555 -11615 -10888 -10387
56629 -10387 -9950 -9552 -9205 -8722 -8010 -7445 -7422 -7644 -7419 -6667 -5946 -5419 -4521 -2936 -1225 -50 727 1656 2858
56610 2858 4028 5039 6077 7318 8782 10386 11895 13033 13857 14763 15881 16761 16964 16661 16319 16017
56594 16017 15543 14980 14756 15122 15906 16814 17689 18439 18928 19043 18767 18198 17592 17275 17414 17904 18518 19081 19467
56575 19467 19598 19550 19473 19394 19228 19067 19192 19692 20301 20745 21029 21246 21351 21270 21079 20940 21053 21693 23003 24584
56555 24584 25689 26038 26135 26561 27252 27771 27965 28010 28024 28012 28019 28041 27960 27873 28256 29433 31033 32364 33169 33704 34195
56534 34195 34623 34967 35208 35118 34425 33232 32000 31066 30435 30010 29788 29796 30035 30477 30960 31191 31038 30738 30572
56515 30572 30480 30245 29945 29843 29910 29769 29129 28064 26915 26150 26170 26935 27858 28386 28605 28966 29571 30117 30474
$$ packed form
56649a7261K56N44N42L48K29J95J26P9J40J89J04mK9J57L21N81Q70R40P27N01
56629a0387M37L98L47M83P12N65K3k22K25P52P21N27Q98J585a225e0G27R29J202
56610B858J170J011J038J241J464J604J509J138Q24R06J118Q80K03l03l42l02
56594A6017m74n63k24L66P84R08Q75P50M89J15k76n69o06l17J39M90O14N63L86
56575A9467J31m8p7p9j66j61J25N00O09M44K84K17J05q1j91j39J13O40J310J581
56555B4584J105L49R7M26O91N19J94M5J4j2PK2q1q7L83J177J600J331Q05N35M91
56534C4195M28L44K41r0o93j193j232r34o31m25k22QK39M42M83K31j53l00j66
56515C0572r2k35l00j02O7j41o40j065j149p65K0P65R23N28K19L61O05N46L57
$$ plain form
56496 30474 30850 31378 31967 32610 33410 34253 34859 35225 35615 36050 36231 36106 36073 36422 36982 37525 38173 39120 40262
56477 40262 41386 42459 43478 44263 44636 44685 44680 44871 45459 46501 47723 48697 49378 50164 51307 52585 53747
56460 53747 54956 56472 58268 60264 62660 65596 68658 71159 72835 73959 74853 75632 76349 77065 77762 78431
56444 78431 79179 80037 80748 81035 80965 80788 80509 79928 79079 78279 77757 77470 77273 76977 76276 74970 73290 71723
56426 71723 70453 69265 68076 67158 66698 66435 65985 65294 64558 63899 63336 62943 62734 62521 62119 61629 61313 61173
56408 61173 60936 60463 59963 59657 59441 59038 58392 57729 57254 56950 56691 56407 56065 55669 55341 55321 55708 56300 56778
56389 56778 56996 56963 56657 56078 55456 55150 55247 55425 55293 54754 54022 53461 53419 54009 54917 55612 55874 55951 56146 56415
56369 56415 56542 56512 56496 56603 56815 57096 57386 57565 57598 57642 57890 58392 59113 60042 61085 61987 62529 62762 62905 63132
$$ packed form
56496C0474L76N28N89O43Q00Q43O06L66L90M35J81j25l3L49N60N43O48R47J142
56477D0262J124J073J019P85L73M9nJ91N88J042J222R74O81P86J143J278J162
56460E3747J209J516J796J996K396K936L062K501J676J124Q94P79P17P16O97O69
56444G8431P48Q58P11K87p0j77k79n81q49q00n22k87j97k96p01j306j680j567
56426G1723j270j188j189r18m60k63m50o91p36o59n63l93k09k13m02m90l16j40
56408F1173k37m73n00l06k16m03o46o63m75l04k59k84l42l96l28k0L87N92M78
56389E6778K18l3l06n79o22l06R7J78j32n39p32n61m2N90R08O95K62P7J95K69
56369E6415J27l0j6J07K12K81K90J79L3M4K48N02P21R29J043R02N42K33J43K27
$$ plain form
56349 63132 63558 64248 65072 65671 65797 65608 65482 65623 66017 66585 67191 67633 67839 67975 68181 68383 68544 68848 69300
56330 69300 69384 68568 67085 65779 65151 64940 64663 64176 63617 63135 62868 62941 63342 63934 64662 65531 66396 67029 67441
56311 67441 67906 68587 69358 70098 70890 71849 72911 73940 74882 75729 76428 76885 77028 76826 76372 75889 75513 75148
56293 75148 74700 74366 74451 74947 75503 75821 75862 75741 75642 75811 76362 77106 77735 78154 78425 78538 78503 78507 78670 78779 78624
56272 78624 78464 78718 79264 79591 79615 79816 80479 81351 82180 83058 84036 84903 85593 86350 87229 87863 88027 88053 88344 88844
56252 88844 89296 89728 90279 90811 91035 90911 90646 90458 90554 91122 92108 93168 94029 94743 95417 95935 96157 96177 96188 96260
56232 96260 96411 96741 97349 98253 99468 100911 102237 103072 103501 103996 104758 105527 106121 106745 107564 108415 109178 110018
56214 110018 111027 112022 113006 114373 116300 118307 119795 120737 121458 122090 122636 123304 124379 125943 127988 130543
$$ packed form
56349F3132M26O90Q24N99J26j89j26J41L94N68O06M42K06J36K06K02J61L04M52
56330F9300Q4q16j483j306o28k11k77m87n59m82k67P3M01N92P28Q69Q65O33M12
56311F7441M65O81P71P40P92R59J062J029R42Q47O99M57J43k02m54m83l76l65
56293G5148m48l34Q5M96N56L18M1j21r9J69N51P44O29M19K71J13l5MJ63J09j55
56272G8624j60K54N46L27K4K01O63Q72Q29Q78R78Q67O90P57Q79O34J64K6K91N00
56252H8844M52M32N51N32K24j24k65j88R6N68R86J060Q61P14O74N18K22K0J1P2
56232I6260J51L30O08R04J215J443J326Q35M29M95P62P69N94O24Q19Q51P63Q40
56214A10018J009R95R84J367J927K007J488R42P21O32N46O68J075J564K045K555
$$ plain form
56198 130543 133421 136187 138736 141584 145199 149299 153236 156824 160385 164185 168204 172348 176548 180778
56184 180778 185183 189973 195000 199749 204008 208204 212818 217845 223123 228798 235054 241739 248685 256045
56170 256045 263952 272221 280825 290299 301190 313474 326976 341957 358747 377217 397301 419715
56158 419715 445478 474912 507752 544046 584261 628666 677264 730259 788020 850581 917688
56147 917688 989211 1064981 1144253 1225778 1308275 1390404 1470440 1546538 1617198 1680999 1736089
56136 1736089 1780518 1812970 1832735 1839222 1832216 1812472 1781405 1740157 1689525 1630767 1565822 1496642
56124 1496642 1424728 1351360 1277775 1205026 1133959 1065320 999629 937105 877952 822501 770784
56113 770784 722365 677022 635157 597030 561989 529123 498327 470043 444317 420854 399699
$$ packed form
56198A30543K878K766K549K848L615M100L937L588L561L800M019M144M200M230
56184A80778M405M790N027M749M259M196M614N027N278N675O256O685O946P360
56170B56045P907Q269Q604R474J0891J2284J3502J4981J6790J8470K0084K2414
56158D19715K5763K9434L2840L6294M0215M4405M8598N2995N7761O2561O7107
56147I17688P1523P5770P9272Q1525Q2497Q2129Q0036P6098P0660O3801N5090
56136A736089M4429L2452J9765O487p006j9744l1067m1248n0632n8758o4945o9180
56124A496642p1914p3368p3585p2749p1067o8639o5691o2524n9153n5451n1717
56113G70784m8419m5343m1865l8127l5041l2866l0796k8284k5726k3463k1155
$$ plain form
56102 399699 380983 364183 348470 333716 320368 308460 297547 287555 278845 271361 264463 257692
56090 257692 251111 244882 239125 234142 230153 226845 223735 220857 218456 216278 213894 211556 209917 209018
56076 209018 208339 207698 207258 206793 205891 204850 204446 204800 205346 205887 206761 207977 209138 210289 211934 214066 216160
56059 216160 218216 220890 224401 228201 231919 235799 240024 244472 249315 255114 262112 270180 279493 290460
56045 290460 302963 316594 331681 349182 369496 392335 417782 446374 477962 511557 546451
56034 546451 582368 618236 651966 681941 707881 729985 748292 763301 776169 787667 797509 804893
56022 804893 808973 808761 803677 794553 783205 770732 756988 741681 724795 705738 683304 656995
56010 656995 627471 595557 561950 528146 496322 467718 442126 419289 399685 383483 369927
$$ packed form
56102C99699j8716j6800j5713j4754j3348j1908j0913r992q710p484o898o771
56090B57692o581o229n757m983l989l308l110k878k401k178k384k338j639q99
56076B09018o79o41m40m65r02j041m04L54N46N41Q74J216J161J151J645K132K094
56059B16160K056K674L511L800L718L880M225M448M843N799O998Q068R313J0967
56045B90460J2503J3631J5087J7501K0314K2839K5447K8592L1588L3595L4894
56034E46451L5917L5868L3730K9975K5940K2104J8307J5009J2868J1498R842P384
56022H04893M080k12n084r124j1348j2473j3744j5307j6886j9057k2434k6309
56010F56995k9524l1914l3607l3804l1824k8604k5592k2837j9604j6202j3556
$$ plain form
55999 369927 358314 348586 340567 333652 327699 323173 319990 317327 314907 313349 312849 312695 312515 312793 313728
55984 313728 314762 315718 317183 319346 321662 324049 327152 331035 334946 338749 343163 348183 352823 356921
55970 356921 361622 367471 373592 379369 385310 391540 397092 401514 405598 409785 413427 416388 419643 423456
55956 423456 426696 428915 431334 434813 438578 442021 445969 451000 456214 460886 465670 471049 476288 481159
55942 481159 486957 494559 503096 511757 521142 531639 542311 552703 563885 576360 588829 600390
55930 600390 612048 624651 637342 649535 662355 676488 690644 703800 716975 731127 745422
55919 745422 759314 774154 790905 808432 825848 844282 864449 884955 905062 926613 950997
55908 950997 976700 1002237 1028914 1058210 1089018 1120149 1152993 1188887 1226410 1264165 1303733
$$ packed form
55999C69927j1613r728q019o915n953m526l183k663k420j558n00j54j80K78R35
55984C13728J034R56J465K163K316K387L103L883L911L803M414N020M640M098
55970C56921M701N849O121N777N941O230N552M422M084M187L642K961L255L813
55956D23456L240K219K419L479L765L443L948N031N214M672M784N379N239M871
55942D81159N798P602Q537Q661R385J0497J0672J0392J1182J2475J2469J1561
55930F00390J1658J2603J2691J2193J2820J4133J4156J3156J3175J4152J4295
55919G45422J3892J4840J6751J7527J7416J8434K0167K0506K0107K1551K4384
55908I50997K5703K5537K6677K9296L0808L1131L2844L5894L7523L7755L9568
$$ plain form
55897 1303733 1346927 1392712 1439819 1489704 1543767 1600409 1658156 1718852 1784379 1853210 1923914
55886 1923914 1999008 2081450 2170307 2263917 2364217 2473725 2591495 2716512 2851817 3000701
55876 3000701 3162334 3335996 3525846 3736381 3967204 4218049 4494932 4805313 5151647
55867 5151647 5536556 5970176 6465624 7032352 7682330 8438630 9330683 10387600 11646041
55858 11646041 13157580 14974867 17133691 19659835 22589662 25975899 29887374 34424436
55850 34424436 39724251 45913903 53036566 61025731 69751888 79093326 88970981 99287548
55842 99287548 109711652 119376417 126796168 130302901 128862317 122661484 112978642 101490058
55834 101490058 89607486 78231749 67831707 58588797 50505628 43501418 37482682
$$ packed form
55897A303733M3194M5785M7107M9885N4063N6642N7747O0696O5527O8831P0704
55886A923914P5094Q2442Q8857R3610J00300J09508J17770J25017J35305J48884
55876C000701J61633J73662J89850K10535K30823K50845K76883L10381L46334
55867E151647L84909M33620M95448N66728O49978P56300Q92053J056917J258441
55858A1646041J511539J817287K158824K526144K929827L386237L911475M537062
55850C4424436N299815O189652P122663P989165Q726157R341438R877655J0316567
55842I9287548J0424104R664765P419751L506733j440584o200833r682842j1488584
55834A01490058j1882572j1375737j0400042r242910q083169p004210o018736
$$ plain form
55827 37482682 32356757 28017189 24350834 21258440 18654634 16456359 14587979 12993642
55819 12993642 11631975 10462631 9448212 8563713 7792393 7115273 6513427 5976310 5498281
55810 5498281 5069711 4679568 4323594 4001868 3710679 3444027 3200544 2981748 2785293
55801 2785293 2606327 2443523 2297643 2165920 2043748 1930368 1827467 1733697 1645792 1563588
55791 1563588 1488867 1420581 1356041 1295501 1240904 1191311 1143997 1098936 1057959 1020646 985203
55780 985203 952235 923486 897913 873010 849010 827757 808317 787656 765031 741989 718717
55769 718717 694074 668703 644567 621748 598926 576558 556371 538214 520530 503461 488400
55758 488400 474923 461252 447412 435003 424152 413563 403264 394477 387016 379469 371771 365017
$$ packed form
55827C7482682n125925m339568l666355l092394k603806k198275j868380j594337
55819A2993642j361667j169344j014419q84499p71320o77120o01846n37117m78029
55810E498281m28570l90143l55974l21726k91189k66652k43483k18796j96455
55801B785293j78966j62804j45880j31723j22172j13380j02901r3770q7905q2204
55791A563588p4721o8286o4540o0540n4597m9593m7314m5061m0977l7313l5443
55780I85203l2968k8749k5573k4903k4000k1253j9440k0661k2625k3042k3272
55769G18717k4643k5371k4136k2819k2822k2368k0187j8157j7684j7069j5061
55758D88400j3477j3671j3840j2409j0851j0589j0299q787p461p547p698o754
$$ plain form
55746 365017 359075 352887 346755 341738 337116 331088 323768 316938 311013 304777 297989 291726 286167 280419
55732 280419 274566 269650 265600 261330 256884 253352 250724 247940 245034 243124 242281 241380 240056 238891 237763
55717 237763 235979 233924 232641 231891 230568 228862 228014 228120 228211 228398 229814 232378 234725 236430 238325 240464
55701 240464 241771 241941 241796 241513 240311 238080 235560 232708 228662 223498 218319 213447 208262 202991 198804
55686 198804 195880 193163 190349 188401 187669 187119 185860 183966 181458 178040 174204 171144 169182 167634 166395
55671 166395 166183 166890 167261 166584 165355 163908 161823 159041 156190 153465 150429 147204 144553 142512 140285
55656 140285 137727 135580 134048 132500 130854 129809 129345 128433 126656 124747 123125 121235 118782 116329 114192
55641 114192 111974 109629 107772 106490 105056 103234 101660 100564 99354 97916 97058 97145 97448 97371 97175 97021
$$ packed form
55746C65017n942o188o132n017m622o028p320o830n925o236o788o263n559n748
55732B80419n853m916m050m270m446l532k628k784k906j910q43r01j324j165j128
55717B37763j784k055j283p50j323j706q48J06R1J87J416K564K347J705J895K139
55701B40464J307J70j45k83j202k231k520k852m046n164n179m872n185n271m187
55686A98804k924k717k814j948p32n50j259j894k508l418l836l060j962j548j239
55671A66395k12P07L71o77j229j447k085k782k851k725l036l225k651k041k227
55656A40285k558k147j532j548j646j045m64r12j777j909j622j890k453k453k137
55641A14192k218k345j857j282j434j822j574j096j210j438q58Q7L03p7j96j54
$$ plain form
55625 97021 96481 95497 94763 94607 94545 94348 94451 94831 94663 93632 92503 91820 91137 90090 89125 88529 87778 86561
55607 86561 85510 85199 85301 85331 85449 85899 86451 86987 87890 89253 90423 90838 90692 90380 89974 89648 89771 90178
55589 90178 90161 89626 89444 90165 91191 91775 92105 92851 94275 96290 98769 101339 103414 104812 105866 106688 106985
55572 106985 106811 106758 107116 107477 107485 107318 107211 107139 107195 107587 108134 108454 108702 109373 110324 110888 110995 111198 111537 111455 110982
55551 110982 110780 110716 109651 107109 104023 101287 98665 95710 92698 89954 87171 84084 81031 78309 75781
55536 75781 73574 72273 71890 71550 70789 70251 70502 71095 71415 71555 71665 71362 70497 69718 69486 69323 68729 68045
55518 68045 67622 66949 65499 63773 62635 62155 61870 61640 61438 60844 59604 58262 57521 57297 57058 56728 56627
55501 56627 56881 57398 58044 58433 58020 56858 55787 55403 55376 55154 54752 54421 54173 54105 54524 55267 55587 55243 54990
$$ packed form
55625I7021n40r84p34j56o2j97J03L80j68j031j129o83o83j047r65n96p51j217
55607H6561j051l11J02L0J18M50N52N36R03J363J170M15j46l12m06l26J23M07
55589I0178j7n35j82P21J026N84L30P46J424K015K479K570K075J398J054Q22K97
55572A06985j74n3L58L61Qj67j07p2N6L92N47L20K48O71R51N64J07K03L39q2m73
55551A10982k02o4j065k542l086k736k622k955l012k744k783l087l053k722k528
55536G5781k207j301l83l40p61n38K51N93L20J40J10l03q65p79k32j63n94o84
55518F8045m23o73j450j726j138m80k85k30k02n94j240j342p41k24k39l30j01
55501E6627K54N17O46L89m13j162j071l84k7k22m02l31k48o8M19P43L20l44k53
$$ plain form
55482 54990 55450 56227 56718 57067 57595 58078 58327 58820 59948 61208 61950 62391 63106 64065 64962 65955 67231 68309
55464 68309 68636 68532 68734 69374 70090 70760 71383 71569 70965 69937 69145 68687 68238 67712 67207 66626 65942 65501 65508
55445 65508 65584 65388 65239 65538 66067 66460 66897 67635 68343 68615 68674 68844 68796 68138 67265 66752 66270 65043 63126
55426 63126 61307 59932 58715 57553 56645 55849 54738 53369 52278 51698 51340 50946 50472 49769 48661 47315
55410 47315 46111 45187 44546 44372 44773 45391 45772 45944 46148 46257 45993 45517 45210 45037 44671 44111 43654 43444 43477
55391 43477 43884 44633 45177 44971 44233 43702 43738 44124 44566 44917 45027 44828 44490 44179 43864 43609 43698 44136 44422 44234
55371 44234 43926 43875 43842 43496 43110 43068 43093 42652 41849 41246 41112 41410 42174 43270 44102 44265 44169 44372 44656 44456
55351 44456 43884 43510 43401 43195 42914 42900 43086 43117 43039 43164 43377 43347 43229 43422 43766 43764 43453 43271 43175 42754 42162
$$ packed form
55482E4990M60P77M91L49N28M83K49M93J128J260P42M41P15R59Q97R93J276J078
55464F8309L27j04K02O40P16O70O23J86o04j028p92m58m49n26n05n81o84m41P
55445F5508P6j96j49K99N29L93M37P38P08K72N9J70m8o58q73n13m82j227j917
55426F3126j819j375j217j162r08p96j111j369j091n80l58l94m74p03j108j346
55410D7315j204r24o41j74M01O18L81J72K04J09k64m76l07j73l66n60m57k10L3
55391D3477M07P49N44k06p38n31L6L86M42L51J10j99l38l11l15k55Q9M38K86j88
55371D4234l08n1l3l46l86m2K5m41q03o03j34K98P64J096Q32J63r6K03K84k00
55351D4456n72l74j09k06k81j4J86L1p8J25K13l0j18J93L44kl11j82r6m21n92
$$ plain form
55330 42162 42082 42710 43531 44142 44546 44603 44014 43017 42386 42573 43381 44548 46010 47509 48616 49306 49978 50800
55312 50800 51535 52075 52600 53154 53562 53818 54060 54158 53823 53112 52330 51505 50473 49412 48680 48174 47463 46552 45889
55293 45889 45609 45331 44765 44036 43427 43250 43790 44845 45516 45113 44131 43624 43815 44093 44189 44438 44883 45121 45116 45264
55273 45264 45450 44942 43528 41973 41024 40667 40628 40854 41138 40988 40300 39605 39294 39142 38883 38702 38792 38974 39102
55254 39102 39329 39646 39678 39312 39067 39396 40039 40453 40532 40545 40637 40747 40811 40786 40623 40400 40305 40414 40657 40965 41211
55233 41211 41132 40690 40402 40801 41585 41881 41404 40789 40659 40935 41239 41463 41667 41818 41905 41979 42009 41973 42083 42490 42832
55212 42832 42597 41908 41370 41166 40930 40589 40565 40938 41150 40852 40412 40230 40163 39989 39893 40039 40151 39974 39779 39942
55192 39942 40343 40574 40533 40482 40711 41329 42214 42986 43282 43150 42968 42961 43103 43424 43968 44441 44404 43908 43421 43086 42606
$$ packed form
55330D2162q0O28Q21O11M04N7n89r97o31J87Q08J167J462J499J107O90O72Q22
55312E0800P35N40N25N54M08K56K42R8l35p11p82q25j032j061p32n06p11r11o63
55293D5889k80k78n66p29o09j77N40J055O71m03r82n07J91K78R6K49M45K38nJ48
55273D5264J86n08j414j555r49l57l9K26K84j50o88o95l11j52k59j81R0J82J28
55254C9102K27L17L2l66k45L29O43M14P9J3R2J10O4k5j63k23r5J09K43L08K46
55233D1211p9m42k88L99P84K96m77o15j30K76L04K24K04J51Q7P4L0l6J10M07L42
55212D2832k35o89n38k04k36l41k4L73K12k98m40j82o7j74r6J46J12j77j95J63
55192C9942M01K31m1n1K29O18Q85P72K96j32j82pJ42L21N44M73l7m96m87l35m80
$$ plain form
55171 42606 41930 41411 41102 40570 39683 38970 38857 39126 39474 40022 40864 41635 41987 42111 42328 42544 42500 42259 42056
55152 42056 41947 41925 42116 42552 43028 43356 43527 43445 42954 42264 41907 41988 41972 41479 40833 40474 40328 40119 39920 39894 39853
55131 39853 39519 39018 38733 38854 39339 40072 40797 41159 41102 40976 41081 41345 41612 41887 42126 42171 42102 42242 42633 42919
55111 42919 42973 43153 43626 43998 43910 43557 43210 42735 42012 41391 41223 41273 41126 40832 40716 40820 40993 41278 41751 42208
55091 42208 42414 42455 42502 42507 42450 42628 43245 44004 44447 44506 44366 44086 43753 43679 43994 44298 44193 43906 43911 44141 44100 43657
55069 43657 43190 42985 42950 42945 43030 43290 43697 44154 44571 44873 45101 45384 45764 46187 46681 47284 47735 47607 46918 46249
55049 46249 46009 45955 45690 45231 44799 44414 44060 43916 44065 44259 44291 44321 44522 44733 44832 45044 45508 45913 46008 46125 46640
55028 46640 47232 47291 46859 46576 46784 47210 47464 47372 46859 45989 45167 44893 45262 45922 46489 46775 46741 46533 46441 46576
$$ packed form
55171D2606o76n19l09n32q87p13j13K69L48N48Q42P71L52J24K17K16m4k41k03
55152D2056j09k2J91M36M76L28J71q2m91o90l57Q1j6m93o46l59j46k09j99k6m1
55131C9853l34n01k85J21M85P33P25L62n7j26J05K64K67K75K39M5o9J40L91K86
55111D2919N4J80M73L72q8l53l47m75p23o21j68N0j47k94j16J04J73K85M73M57
55091D2208K06M1M7Nn7J78O17P59M43N9j40k80l33p4L15L04j05k87NK30m1m43
55069D3657m67k05l5nQ5K60M07M57M17L02K28K83L80M23M94O03M51j28o89o69
55049D6249k40n4k65m59m32l85l54j44J49J94L2L0K01K11R9K12M64M05R5J17N15
55028D6640N92N9m32k83K08M26K54r2n13q70q22k74L69O60N67K86l4k08r2J35
$$ plain form
55008 46576 46682 46537 46332 46383 46657 46895 47039 47221 47493 47864 48442 49171 49636 49481 48906 48467 48479 48870 49446 49980
54988 49980 50220 50155 50164 50659 51646 52820 53839 54352 54074 53170 52292 51915 51897 51941 52099 52489 52877 53053 53261 53777
54968 53777 54333 54472 54242 54028 53887 53609 53265 53129 53194 53231 53221 53252 53128 52607 51889 51348 50917 50264 49492 49087
54948 49087 49199 49492 49704 49832 49802 49471 49017 48794 48795 48665 48332 48122 48182 48215 47939 47437 46947 46656 46713 47146 47679
54927 47679 47954 47956 47970 48166 48500 48934 49396 49624 49416 49000 48787 48814 48832 48800 48841 48816 48487 48095 48207 48885 49527 49690
54905 49690 49591 49617 49761 49843 49907 50141 50598 51167 51688 51989 51983 51802 51667 51619 51545 51401 51166 50713 49999 49363 49265 49714
54883 49714 50240 50440 50295 50004 49809 49957 50483 51039 51215 51058 50962 51111 51356 51594 51916 52340 52756 53178 53729
54864 53729 54358 54824 55029 55106 55209 55468 56100 57217 58549 59624 60241 60531 60627 60583 60527 60562 60544 60264 59779 59296
$$ packed form
55008D6576J06j45k05N1K74K38J44J82K72L71N78P29M65j55n75m39J2L91N76N34
54988D9980K40o5RM95R87J174J019N13k78r04q78l77j8M4J58L90L88J76K08N16
54968E3777N56J39k30k14j41k78l44j36O5L7j0L1j24n21p18n41m31o53p72m05
54948D9087J12K93K12J28l0l31m54k23Jj30l33k10O0L3k76n02m90k91N7M33N33
54927D7679K75KJ4J96L34M34M62K28k08m16k13K7J8l2M1k5l29l92J12O78O42J63
54905D9690r9K6J44Q2O4K34M57N69N21L01oj81j35m8p4j44k35m53p14o36r8M49
54883D9714N26K00j45k91j95J48N26N56J76j57r6J49K45K38L22M24M16M22N51
54864E3729O29M66K05P7J03K59O32J117J332J075O17K90R6m4n6L5j8k80m85m83
$$ plain form
54844 59296 58843 58372 58056 58128 58523 59081 59927 61205 62570 63519 64157 65066 66459 68007 69576 71545 74225
54827 74225 77439 80878 84440 88059 91561 94867 97998 100722 102535 103075 102336 100470 97730 94574 91419
54812 91419 88227 84708 80919 77296 74095 71251 68780 66816 65212 63632 62153 61251 61090 61315 61640
54797 61640 62109 62656 62980 63085 63397 64124 64985 65837 67004 68684 70560 72409 74625 77668 81302 84858
54781 84858 87951 90620 92989 95138 97107 98702 99500 99315 98423 97106 95260 92727 89707 86516 83211
54766 83211 79819 76668 74102 72029 70095 68206 66539 65151 63914 62819 62019 61544 61179 60691 60044 59394
54750 59394 58936 58710 58519 58126 57537 56993 56658 56481 56374 56310 56185 55814 55176 54467 53815 53167 52537 52125 52063 52209
54730 52209 52328 52358 52394 52511 52696 52829 52713 52283 51766 51498 51542 51651 51602 51385 51159 51178 51701 52710 53796 54555
$$ packed form
54844E9296m53m71l16P2L95N58Q46J278J365R49O38R09J393J548J569J969K680
54827G4225L214L439L562L619L502L306L131K724J813N40p39j866k740l156l155
54812I1419l192l519l789l623l201k844k471j964j604j580j479r02j61K25L25
54797F1640M69N47L24J05L12P27Q61Q52J167J680J876J849K216L043L634L556
54781H4858L093K669K369K149J969J595P98j85q92j317j846k533l020l191l305
54766H3211l392l151k566k073j934j889j667j388j237j095q00m75l65m88o47o50
54750E9394m58k26j91l93n89n44l35j77j07o4j25l71o38p09o52o48o30m12o2J46
54730E2209J19L0L6J17J85J33j16m30n17k68M4J09m9k17k26J9N23J009J086P59
$$ plain form
54710 54555 54998 55320 55407 55020 54341 53871 53779 53834 53988 54528 55513 56529 57179 57463 57547 57509 57504 57782 58377 59038 59564
54689 59564 59945 60154 60156 60156 60462 61043 61629 62240 63186 64490 65858 67265 69009 71103 73217 75427 78297 81925
54671 81925 85565 88629 91493 94808 98468 101779 104268 105804 106227 105422 103634 101300 98663 95786 92760
54656 92760 89635 86390 83216 80580 78777 77633 76809 76082 75206 73974 72612 71680 71284 70870 70112 69476
54640 69476 69467 69812 69933 69873 70143 70956 72171 73729 75615 77536 79242 81036 83477 86633 90076 93489 96803
54623 96803 99758 101838 102723 102489 101313 99276 96552 93520 90594 87957 85424 82589 79265 75854 73046
54608 73046 71094 69721 68754 68363 68459 68398 67688 66630 65796 65214 64527 63672 62902 62334 61903 61663 61679 61745 61559
54589 61559 61093 60545 60059 59732 59650 59668 59424 58852 58370 58241 58133 57708 57247 57192 57369 57254 56766 56244 55816 55383
$$ packed form
54710E4555M43L22Q7l87o79m70r2N5J54N40R85J016O50K84Q4l8nK78N95O61N26
54689E9564L81K09K%L06N81N86O11R46J304J368J407J744K094K114K210K870L628
54671H1925L640L064K864L315L660L311K489J536M23q05j788k334k637k877l026
54656I2760l125l245l174k636j803j144q24p27q76j232j362r32l96m14p58o36
54640F9476rL45J21o0K70Q13J215J558J886J921J706J794K441L156L443L413L314
54623I6803K955K080Q85k34j176k037k724l032k926k637k533k835l324l411k808
54608G3046j952j373r67l91R6o1p10j058q34n82o87q55p70n68m31k40J6O6j86
54589F1559m66n48m86l27q2J8k44n72m82j29j08m25m61n5J77j15m88n22m28m33
$$ plain form
54569 55383 55066 55081 55213 54981 54304 53585 53136 52961 53034 53344 53705 53907 54035 54264 54440 54304 53983 53841 53908 53919
54549 53919 53861 53995 54371 54744 55007 55293 55678 56120 56634 57158 57363 57018 56451 56188 56264 56326 56336 56568 56981 57176
54529 57176 57057 56934 56883 56543 55760 54960 54642 54854 55376 56039 56678 57068 57152 57139 57213 57322 57309 57101 56733 56387 56366
54508 56366 56797 57418 57883 58150 58326 58311 58018 57790 58115 58920 59597 59744 59465 58935 58187 57394 56887 56741 56705 56649
54488 56649 56679 56757 56639 56382 56444 57071 57914 58490 58757 58972 59240 59436 59445 59292 59079 58854 58503 57863 57075 56656 56957
54467 56957 57636 57997 57806 57450 57371 57685 58275 58868 59030 58521 57706 57252 57422 57973 58673 59476 60232 60755 61221
54448 61221 61990 62946 63549 63652 63762 64310 65120 65830 66335 66595 66423 65814 65151 64777 64610 64406 64063 63552 62839
54429 62839 62120 61760 61807 61848 61603 61306 61273 61392 61353 61096 60754 60388 60065 60011 60383 61015 61590 61934 62001 61781 61395
$$ packed form
54569E5383l17J5J32k32o77p19m49j75P3L10L61K02J28K29J76j36l21j42O7J1
54549E3919n8J34L76L73K63K86L85M42N14N24K05l45n67k63P6O2J0K32M13J95
54529E7176j19j23n1l40p83q00l18K12N22O63O39L90Q4j3P4J09j3k08l68l46k1
54508E6366M31O21M65K67J76j5k93k28L25Q05O77J47k79n30p48p93n07j46l6n6
54488E6649L0P8j18k57O2O27Q43N76K67K15K68J96Rj53k13k25l51o40p88m19L01
54467E6957O79L61j91l56p9L14N90N93J62n09q15m54J70N51P00Q03P56N23M66
54448F1221P69R56O03J03J10N48Q10P10N05K60j72o09o63l74j67k04l43n11p13
54429F2839p19l60M7M1k45k97l3J19l9k57l42l66l23n4L72O32N75L44O7k20l86
$$ plain form
54408 61395 61121 61128 61330 61598 61916 62217 62313 62165 61993 61973 62061 62216 62559 63105 63636 64027 64448 64976 65283 65018 64368
54387 64368 63924 64042 64554 65075 65410 65668 66076 66710 67371 67786 67867 67678 67241 66611 66101 66113 66662 67347 67859 68281
54367 68281 68813 69461 70112 70688 71129 71414 71658 72010 72407 72654 72717 72640 72256 71368 70241 69453 69147 68876 68337
54348 68337 67787 67487 67193 66567 65745 65135 64878 64820 64804 64728 64497 64190 64080 64298 64624 64818 64898 64926 64797 64465 64152
54327 64152 64099 64276 64551 64912 65334 65685 65947 66274 66643 66790 66718 66890 67572 68321 68543 68320 68227 68519 68946 69279
54307 69279 69574 69931 70348 70840 71425 71990 72380 72600 72769 72944 73192 73638 74236 74606 74432 73937 73658 73823 74216
54288 74216 74592 74912 75120 75025 74553 73964 73718 74113 75051 76085 76814 77270 77846 78792 79917 80904 81695 82445 83258
54269 83258 84180 85302 86667 88162 89639 91022 92185 92919 93191 93246 93243 92964 92131 90850 89489 88214 86918
$$ packed form
54408F1395k74PK02K68L18L01R6j48j72k0Q8J55L43N46N31L91M21N28L07k65o50
54387F4368m44J18N12N21L35K58M08O34O61M15Q1j89m37o30n10J2N49O85N12M22
54367F8281N32O48O51N76M41K85K44L52L97K47O3p7l84q88j127p88l06k71n39
54348F8337n50l00k94o26q22o10k57n8j6p6k31l07j10K18L26J94Q0K8j29l32l13
54327F4152n3J77K75L61M22L51K62L27L69J47p2J72O82P49K22k23r3K92M27L33
54307F9279K95L57M17M92N85N65L90K20J69J75K48M46N98L70j74m95k79J65L93
54288G4216L76L20K08r5m72n89k46L95R38J034P29M56N76R46J125R87P91P50Q13
54269H3258R22J122J365J495J477J383J163P34K72N5lk79q33j281j361j275j296
$$ plain form
54252 86918 85538 84174 82946 81928 81167 80546 79699 78341 76683 75300 74527 74145 73733 73175 72766 72860 73458
54235 73458 74137 74378 74018 73365 72907 72931 73339 73727 73699 73262 72857 72838 73045 73117 73095 73310 73704 73784 73371 72949 72997
54214 72997 73330 73407 73005 72329 71700 71405 71638 72286 72921 73174 72983 72414 71546 70706 70409 70756 71186 71119 70585 69957
54194 69957 69379 68829 68442 68376 68518 68702 69025 69577 70104 70331 70430 70731 71132 71252 71085 71038 71340 71804 72175 72355
54174 72355 72293 71981 71576 71260 71015 70762 70654 70916 71509 72188 72868 73626 74430 75173 75879 76626 77340 77920 78460
54155 78460 79040 79504 79758 80121 80921 81876 82346 82151 81672 81196 80666 80154 80003 80305 80607 80394 79633 78651 77726
54136 77726 76952 76319 75804 75463 75442 75732 76004 75902 75491 75190 75292 75754 76421 77151 77784 78243 78596 78816 78613
54117 78613 77811 76763 75984 75510 75039 74609 74539 74723 74627 74133 73762 73805 73791 73229 72434 72116 72447 72997 73382 73562
$$ packed form
54252H6918j380j364j228j018p61o21q47j358j658j383p73l82m12n58m09R4N98
54235G3458O79K41l60o53m58K4M08L88k8m37m05j9K07P2k2K15L94Q0m13m22M8
54214G2997L33P7m02o76o29k95K33O48O35K53j91n69q68q40k97L47M30o7n34o28
54194F9957n78n50l87o6J42J84L23N52N27K27R9L01M01J20j67m7L02M64L71J80
54174G2355o2l12m05l16k45k53j08K62N93O79O80P58Q04P43P06P47P14N80N40
54155G8460N80M64K54L63Q00R55M70j95m79m76n30n12j51L02L02k13p61r82r25
54136G7726p74o33n15l41k1K90K72j02m11l01J02M62O67P30O33M59L53K20k03
54117G8613q02j048p79m74m71m30p0J84r6m94l71M3j4n62p95l18L31N50L85J80
$$ plain form
54097 73562 73581 73445 73267 73256 73480 73820 74155 74456 74701 74832 74796 74570 74203 73895 73970 74652 75836 77104 77962 78151
54077 78151 77801 77310 76963 76718 76436 76223 76320 76693 76962 76839 76480 76293 76516 77010 77377 77232 76493 75477 74677
54058 74677 74382 74511 74736 74762 74596 74624 75254 76348 77216 77366 77079 76954 77083 77017 76510 75861 75460 75353 75376 75447
54038 75447 75543 75618 75671 75797 76114 76724 77717 79016 80271 81145 81749 82547 83806 85347 86888 88351 89795 91273
54020 91273 92837 94488 96063 97389 98602 100068 101878 103640 104889 105487 105533 105099 104186 102830 101059 98881
54004 98881 96421 93939 91607 89344 87015 84764 83051 82317 82570 83289 83808 83858 83632 83306 82727 81754 80653
53987 80653 79885 79587 79544 79597 79758 79990 80221 80529 80991 81349 81243 80797 80621 81123 82109 83141 83980 84544 84767
53968 84767 84691 84516 84413 84414 84508 84639 84583 84113 83361 82788 82695 82960 83273 83391 83152 82549 81877 81555 81709 82194 82996
$$ packed form
54097G3562J9j36j78j1K24L40L35L01K45J31l6k26l67l08P5O82J184J268Q58J89
54077G8151l50m91l47k45k82k13R7L73K69j23l59j87K23M94L67j45p39j016q00
54058G4677k95J29K25K6j66K8O30J094Q68J50k87j25J29o6n07o49m01j07K3P1
54038G5447R6P5N3J26L17O10R93J299J255Q74O04P98J259J541J541J463J444J478
54020I1273J564J651J575J326J213J466J810J762J249N98M6m34r13j356j771k178
54004I8881k460k482k332k263k329k251j713p34K53P19N19N0k26l26n79r73j101
53987H0653p68k98m3N3J61K32K31L08M62L58j06m46j76N02R86J032Q39N64K23
53968H4767p6j75j03JR4J31n6m70p52n73r3K65L13J18k39o03o72l22J54M85Q02
$$ plain form
53947 82996 84309 86126 88120 90018 91801 93479 95015 96602 98602 101024 103395 105354 107071 108863
53933 108863 110751 112641 114648 116904 119288 121616 123913 126248 128482 130464 132284 134092 135769 137061
53919 137061 137942 138640 139379 140204 140950 141301 141038 140340 139672 139226 138720 137806 136453 134762 132743 130507 128430
53902 128430 126812 125497 124058 122263 120190 118048 116067 114422 113102 111952 110956 110254 109807 109358 108900
53887 108900 108822 109330 110026 110419 110600 111068 112096 113688 115927 118869 122185 125399 128491 131830 135403 138485
53871 138485 140216 140265 138800 136108 132458 128210 123875 120000 116936 114652 112775 110974 109295 108054 107424
53856 107424 107216 107080 106799 106409 106102 106017 106168 106558 107296 108444 109776 110913 111736 112451 113213 113971 114796 116033
53838 116033 117861 119959 121928 123845 126085 128689 131268 133516 135508 137438 139302 140965 142395 143740
$$ packed form
53947H2996J313J817J994J898J783J678J536J587K000K422K371J959J717J792
53933A08863J888J890K007K256K384K328K297K335K234J982J820J808J677J292
53919A37061Q81O98P39Q25P46L51k63o98o68m46n06r14j353j691k019k236k077
53902A28430j618j315j439j795k073k142j981j645j320j150r96p02m47m49m58
53887A08900p8N08O96L93J81M68J028J592K239K942L316L214L092L339L573L082
53871A38485J731M9j465k692l650m248m335l875l064k284j877j801j679j241o30
53856A07424k08j36k81l90l07q5J51L90P38J148J332J137Q23P15P62P58Q25J237
53838A16033J828K098J969J917K240K604K579K248J992J930J864J663J430J345
$$ plain form
53824 143740 145173 146720 148242 149665 151180 153060 155266 157429 159292 160997 162830 164907 167231 169825
53810 169825 172627 175459 178278 181246 184355 187229 189524 191323 192845 193994 194508 194440 194092 193543 192598 191238
53794 191238 189752 188377 187065 185659 184076 182247 180023 177298 174107 170613 167034 163564 160220 156829
53780 156829 153244 149564 146061 143002 140570 138809 137484 136151 134518 132624 130553 128214 125585 123011
53766 123011 120942 119478 118381 117426 116518 115574 114546 113452 112220 110669 108859 107259 106222 105471 104516
53751 104516 103432 102721 102452 102095 101356 100709 100796 101624 102620 103257 103393 103161 102795 102515 102396 102335 102178 101830 101276
53732 101276 100617 100135 100169 100792 101679 102357 102558 102381 102194 102384 103038 103871 104526 104908 105139 105310 105465 105752 106306
53713 106306 106967 107359 107343 107246 107492 108195 109172 110248 111369 112542 113804 115265 117091 119385 122039 124733
$$ packed form
53824A43740J433J547J522J423J515J880K206K163J863J705J833K077K324K594
53810A69825K802K832K819K968L109K874K295J799J522J149N14o8l48n49r45j360
53794A91238j486j375j312j406j583j829k224k725l191l494l579l470l344l391
53780A56829l585l680l503l059k432j761j325j333j633j894k071k339k629k574
53766A23011k069j464j097r55r08r44j028j094j232j551j810j600j037p51r55
53751A04516j084p11k69l57p39o47Q7Q28R96O37J36k32l66k80j19o1j57l48n54
53732A01276o59m82L4O23Q87O78K01j77j87J90O54Q33O55L82K31J71J55K87N54
53713A06306O61L92j6r7K46P03R77J076J121J173J262J461J826K294K654K694
$$ plain form
53697 124733 127163 129340 131616 134302 137295 140205 142790 145128 147341 149288 150596 150976 150506 149620 148806
53682 148806 148259 147824 147306 146758 146370 146148 145815 145062 143834 142368 140917 139418 137473 134773 131540 128395
53666 128395 125801 123799 122282 121256 120684 120271 119631 118570 117113 115439 113883 112797 112171 111525 110404
53651 110404 108887 107464 106495 105988 105759 105617 105430 105165 104872 104561 104213 103932 103874 103957 103874 103574 103395 103558 103792
53632 103792 103779 103644 103667 103759 103654 103431 103409 103617 103829 104034 104405 104831 104954 104742 104606 104849 105379 106076 107076 108505
53612 108505 110178 111801 113263 114621 115945 117270 118601 119890 121101 122291 123495 124619 125593 126596
53598 126596 127885 129469 131096 132530 133633 134318 134672 135071 135863 136946 137896 138431 138530 138262 137831 137701 138267
53581 138267 139368 140452 141215 141787 142336 142872 143426 144028 144466 144412 143868 143185 142666 142439 142622 143197 143763 143861 143590
$$ packed form
53697A24733K430K177K276K686K993K910K585K338K213J947J308L80m70q86q14
53682A48806n47m35n18n48l88k22l33p53j228j466j451j499j945k700l233l145
53666A28395k594k002j517j026n72m13o40j061j457j674j556j086o26o46j121
53651A10404j517j423r69n07k29j42j87k65k93l11l48k81n8Q3q3l00j79J63K34
53632A03792j3j35K3R2j05k23k2K08K12K05L71M26J23k12j36K43N30O97J000J429
53612A08505J673J623J462J358J324J325J331J289J211J190J204J124R74J003
53598A26596J289J584J627J434J103O85L54L99P92J083R50N35R9k68m31j30N66
53581A38267J101J084P63N72N49N36N54O02M38n4n44o83n19k27J83N75N66R8k71
$$ plain form
53562 143590 143440 143494 143342 142866 142489 142447 142391 142053 141796 142093 142823 143483 143840 144028 144207 144481 144936 145503 145931 146110
53542 146110 146238 146491 146807 147137 147626 148330 149057 149725 150555 151697 152935 154071 155252 156636 158030 159188
53526 159188 160209 161291 162358 163293 164300 165577 166791 167357 167199 166872 166960 167649 168792 170080 171198 172113
53510 172113 173176 174672 176391 177902 179129 180316 181489 182358 182804 183129 183716 184650 185738 186737 187496 188041
53494 188041 188574 189310 190289 191391 192443 193264 193779 194144 194611 195114 195250 194828 194208 193822 193591 193129 192358 191551
53476 191551 190883 190315 189830 189422 188869 187918 186722 185758 185212 184748 183946 182750 181409 180234 179472 179138 178938
53459 178938 178552 178034 177676 177499 177243 176905 176885 177358 177891 177991 177791 177846 178380 179087 179609 179869 179959 179983 180126 180593
53439 180593 181351 182092 182607 183075 183810 184860 185997 187102 188290 189678 191212 192849 194731 197036 199762
$$ packed form
53562A43590j50N4j52m76l77m2n6l38k57K97P30O60L57J88J79K74M55N67M28J79
53542A46110J28K53L16L30M89P04P27O68Q30J142J238J136J181J384J394J158
53526A59188J021J082J067R35J007J277J214N66j58l27Q8O89J143J288J118R15
53510A72113J063J496J719J511J227J187J173Q69M46L25N87R34J088R99P59N45
53494A88041N33P36R79J102J052Q21N15L65M67N03J36m22o20l86k31m62p71q07
53476A91551o68n68m85m08n53r51j196r64n46m64q02j196j341j175p62l34k00
53459A78938l86n18l58j77k56l38k0M73N33J00k00N5N34P07N22K60R0K4J43M67
53439A80593P58P41N15M68P35J050J137J105J188J388J534J637J882K305K726
$$ plain form
53424 199762 202812 206194 209945 213942 218009 222179 226662 231565 236833 242480 248627 255273 262225 269327
53410 269327 276559 283871 291138 298367 305717 313269 321020 329176 338069 347588 357037 365868 374341 383135
53396 383135 392509 402194 411951 421785 431646 441318 450703 459917 469047 478015 486791 495526 504375 513293
53382 513293 522067 530496 538552 546432 554379 562387 570191 577675 585075 592560 599800 606304 612124 617839
53368 617839 623818 629812 635346 640155 644077 646845 648269 648517 647979 646902 645216 642616 638739 633438 627036
53353 627036 620247 613677 607435 601294 595092 588860 582607 576190 569389 562039 554080 545598 536868 528313
53339 528313 520315 512990 506138 499443 492828 486583 481127 476615 472875 469719 467208 465510 464545 463938 463369
53324 463369 462900 462860 463469 464664 466289 468336 470885 473914 477298 481006 485182 489995 495473 501533 508080
$$ packed form
53424A99762L050L382L751L997M067M170M483M903N268N647O147O646O952P102
53410B69327P232P312P267P229P350P552P751Q156Q893R519R449Q831Q473Q794
53396C83135R374R685R757R834R861R672R385R214R130Q968Q776Q735Q849Q918
53382E13293Q774Q429Q056P880P947Q008P804P484P400P485P240O504N820N715
53368F17839N979N994N534M809L922K768J424K48n38j077j686k600l877n301o402
53353F27036o789o570o242o141o202o232o253o417o801p350p959q482q730q555
53339E28313p998p325o852o695o615o245n456m512l740l156k511j698r65o07n69
53324D63369m69m0O09J195J625K047K549L029L384L708M176M813N478O060O547
$$ plain form
53309 508080 515025 522274 529760 537526 545779 554839 564904 575824 587162 598651 610559 623459 637665
53296 637665 653003 669126 685893 703407 721841 741223 761339 781865 802727 824282 846902
53285 846902 870404 894134 917641 941005 964454 987987 1011474 1034785 1057612 1079453 1100072
53274 1100072 1119713 1138625 1156565 1173053 1187943 1201409 1213493 1224013 1232856 1239982 1245161 1247985
53262 1247985 1248250 1246106 1241781 1235339 1226698 1215707 1202224 1186348 1168593 1149630 1129789 1108996
53250 1108996 1087266 1065056 1042995 1021397 1000215 979380 959028 939391 920565 902441 884805
53239 884805 867408 849988 832372 814653 797181 780212 763660 747375 731597 716873 703457
53228 703457 691063 679299 668114 657733 648395 640309 633586 627958 622732 617278 611457 605444 599334
$$ packed form
53309E08080O945P249P486P766Q253R060J0065J0920J1338J1489J1908J2900J4206
53296F37665J5338J6123J6767J7514J8434J9382K0116K0526K0862K1555K2620
53285H46902K3502K3730K3507K3364K3449K3533K3487K3311K2827K1841K0619
53274A100072J9641J8912J7940J6488J4890J3466J2084J0520Q843P126N179K824
53262A247985K65k144m325o442q641j0991j3483j5876j7755j8963j9841k0793
53250A108996k1730k2210k2061k1598k1182k0835k0352j9637j8826j8124j7636
53239H84805j7397j7420j7616j7719j7472j6969j6552j6285j5778j4724j3416
53228G03457j2394j1764j1185j0381r338q086o723n628n226n454n821o013o110
$$ plain form
53215 599334 593119 586874 580684 574510 568353 562389 556739 551291 546017 541285 537484 534459 531718 529154
53201 529154 527163 526035 525578 525483 525787 526804 528781 531710 535385 539564 544167 549279 554950 561091 567747
53186 567747 575289 584044 593802 603953 614076 624129 634109 643863 653316 662586 671724 680473 688429
53173 688429 695335 701209 706261 710690 714438 717165 718547 718534 717203 714505 710366 704957 698604 691480 683576
53158 683576 674914 665602 655728 645437 634985 624438 613423 601526 588948 576431 564451 552795
53146 552795 541026 529072 517229 505793 494879 484446 474381 464547 454784 444874 434633 424193
53134 424193 413990 404292 394896 385535 376412 368001 360440 353511 347087 341176 335609 330129 324818 319996
53120 319996 315682 311592 307718 304374 301518 298527 294908 290777 286410 281746 276631 271196 265611 259760
$$ packed form
53215E99334o215o245o190o174o157n964n650n448n274m732l801l025k741k564
53201E29154j991j128m57r5L04J017J977K929L675M179M603N112N671O141O656
53186E67747P542Q755R758J0151J0123J0053R980R754R453R270R138Q749P956
53173F88429O906N874N052M429L748K727J382j3j331k698m139n409o353p124p904
53158F83576q662r312r874j0291j0452j0547j1015j1897j2578j2517j1980j1656
53146E52795j1769j1954j1843j1436j0914j0433j0065r834r763r910j0241j0440
53134D24193j0203r698r396r361r123q411p561o929o424n911n567n480n311m822
53120C19996m314m090l874l344k856k991l619m131m367m664n115n435n585n851
$$ plain form
53106 259760 253523 247142 240989 235166 229624 224501 219974 215899 211931 207952 204143 200674 197490 194365
53092 194365 190994 187129 182783 178251 173830 169638 165745 162251 159098 156052 153074 150489 148532 146907
53078 146907 145085 142945 140835 139087 137732 136622 135598 134509 133296 132074 130996 130024 128941 127603
53064 127603 126099 124666 123504 122621 121836 121007 120268 119871 119769 119588 119090 118498 118173 118156 118217 118230 118259 118334 118364 118243
53044 118243 117963 117596 117227 116853 116354 115692 115143 115085 115464 115716 115430 114870 114643 114981 115639 116360 117123 117907 118517
53025 118517 118777 118809 119015 119778 121139 122711 123964 124673 125027 125276 125393 125174 124606 123979 123694 123985 124767 125610
53007 125610 125952 125477 124391 123298 122778 122945 123347 123372 122860 122254 122022 122085 122013 121646 121180 120682 119961 119029 118276
52988 118276 117947 117736 117176 116236 115293 114663 114328 113996 113325 112225 111084 110489 110625 111152 111719 112293 112853 113147
$$ packed form
53106B59760o237o381o153n823n542n123m527m075l968l979l809l469l184l125
53092A94365l371l865m346m532m421m192l893l494l153l046k978k585j957j625
53078A46907j822k140k110j748j355j110j024j089j213j222j078r72j083j338
53064A27603j504j433j162q83p85q29p39l97j02j81m98n92l25j7O1J3K9P5L0j21
53044A18243k80l67l69l74m99o62n49n8L79K52k86n60k27L38O58P21P63P84O10
53025A18517K60L2K06P63J361J572J253P09L54K49J17k19n68o27k85K91P82Q43
53007A25610L42m75j086j093n20J67M02K5n12o06k32O3p2l67m66m98p21r32p53
52988A18276l29k11n60r40r43o30l35l32o71j100j141n95J36N27N67N74N60K94
$$ plain form
52970 113147 113096 113076 113451 114014 114267 114095 113806 113587 113281 112680 111763 110650 109587 108936 108939 109517 110403 111408 112386
52951 112386 113130 113527 113720 113905 114068 114126 114169 114333 114542 114648 114696 114821 115026 115318 115862 116710 117538 118037 118418 119086
52931 119086 119902 120247 119848 119088 118422 117930 117572 117443 117567 117688 117575 117341 117277 117497 117897 118340 118750 119131 119553
52912 119553 120037 120458 120689 120844 121199 121817 122442 122819 122956 123016 123092 123172 123183 123036 122713 122362 122163 122092 121979 121755
52892 121755 121522 121347 121219 121192 121373 121695 121918 121957 122007 122294 122860 123697 124853 126231 127439 128096 128247 128317 128656
52873 128656 129257 129904 130430 130788 131003 131160 131430 131964 132694 133307 133511 133324 133027 132871 132892 132962 132869 132420 131662 131014
52853 131014 130890 131135 131112 130498 129683 129151 128792 128198 127400 126860 126788 126906 126968 127104 127491 127957 128125 127874 127468 127296
52833 127296 127481 127759 127753 127442 127241 127537 128242 128965 129447 129658 129589 129253 128816 128481 128231 127944 127738 127904 128484 129118
$$ packed form
52970A13147n1k0L75N63K53j72k89k19l06o01r17j113j063o51LN78Q86J005R78
52951A12386P44L97J93J85J63N8M3J64K09J06M8J25K05K92N44Q48Q28M99L81O68
52931A19086Q16L45l99p60o66m92l58j29J24J21j13k34o4K20M00M43M10L81M22
52912A19553M84M21K31J55L55O18O25L77J37O0P6Q0J1j47l23l51j99p1j13k24
52892A21755k33j75j28k7J81L22K23L9N0K87N66Q37J156J378J208O57J51P0L39
52873A28656O01O47N26L58K15J57K70N34P30O13K04j87k97j56K1P0r3m49p58o48
52853A31014j24K45k3o14q15n32l59n94p98n40p2J18O2J36L87M66J68k51m06j72
52833A27296J85K78ol11k01K96P05P23M82K11o9l36m37l35k50k87k06J66N80O34
$$ plain form
52813 129118 129426 129328 128987 128598 128312 128191 128148 128030 127736 127209 126410 125463 124657 124151 123806 123529 123585 124237 125222 126017
52793 126017 126534 127096 127733 128036 127855 127664 127970 128674 129274 129429 129066 128274 127324 126641 126466 126648 126945 127375 128078
52774 128078 128955 129681 130042 130132 130273 130796 131803 133073 134291 135377 136417 137281 137567 137063 136030 134906 133886
52757 133886 132931 131986 130993 129845 128545 127284 126200 125139 123829 122209 120469 118833 117445 116383 115633
52742 115633 115080 114625 114278 114092 114053 114110 114214 114306 114306 114200 114062 113994 114109 114542 115330 116232 116825 116888 116594 116307 116314 116721
52720 116721 117462 118332 119145 119909 120751 121672 122542 123336 124183 125095 125862 126281 126328 126026 125319 124154 122567 120625
52702 120625 118458 116385 114808 113887 113466 113331 113372 113462 113433 113242 112945 112492 111805 111129 110970 111483 112201 112584 112586
52683 112586 112515 112591 112876 113412 114116 114712 115013 115118 115137 114889 114191 113311 112784 112783 112943 112806 112245 111442 110645 109997
$$ packed form
52813A29118L08r8l41l89k86j21m3j18k94n27p99r47q06n06l45k77N6O52R85P95
52793A26017N17N62O37L03j81j91L06P04O00J55l63p92r50o83j75J82K97M30P03
52774A28078Q77P26L61R0J41N23J007J270J218J086J040Q64K86n04j033j124j020
52757A33886r55r45r93j148j300j261j084j061j310j620j740j636j388j062p50
52742A15633n53m55l47j86l9N7J04R2%j06j38o8J15M33P88R02N93O3k94k87PM07
52720A16721P41Q70Q13P64Q42R21Q70P94Q47R12P67M19M7l02p07j165j587j942
52702A20625k167k073j577r21m21j35M1R0k9j91k97m53o87o76j59N13P18L83K
52683A12586p1P6K85N36P04N96L01J05J9k48o98q80n27jJ60j37n61q03p97o48
$$ plain form
52663 109997 109498 109087 108813 108848 109293 110025 110823 111564 112211 112750 113274 114022 115205 116807 118575 120148 121215
52646 121215 121713 121925 122245 122769 123311 123782 124280 124761 124971 124897 124930 125318 125766 125887 125809 125956 126419 126974 127570 128381
52626 128381 129337 129995 130004 129469 128756 128100 127485 126785 125994 125361 125200 125480 125738 125588 125176 124931 124963 124979 124755 124424
52606 124424 124274 124413 124703 124900 124887 124811 124925 125254 125531 125599 125646 125904 126273 126497 126534 126517 126476 126390 126353 126382 126150 125271
52584 125271 123837 122400 121435 121039 121124 121531 122004 122302 122428 122480 122348 121817 120995 120265 119763 119226 118492 117884 117894
52565 117894 118663 119932 121336 122595 123571 124262 124716 124931 124930 124949 125376 126430 127976 129688 131248 132389 132933
52548 132933 132890 132460 131901 131427 131170 131085 130944 130572 130102 129861 130027 130543 131256 131931 132205 131825 131024 130431 130507 131222
52528 131222 132272 133399 134418 135140 135387 135020 133954 132283 130411 128880 128021 127831 128139 128671 129026 128871
$$ packed form
52663A09997m99m11k74L5M45P32P98P41O47N39N24P48J183J602J768J573J067
52646A21215M98K12L20N24N42M71M98M81K10p4L3L88M48J21p8J47M63N55N96Q11
52626A28381R56O58Rn35p13o56o15p00p91o33j61K80K58j50m12k45L2J6k24l31
52606A24424j50J39K90J97j3p6J14L29K77O8M7K58L69K24L7j7m1q6l7K9k32q79
52584A25271j434j437r65l96Q5M07M73K98J26N2j32n31q22p30n02n37p34o08J0
52565A17894P69J269J404J259R76O91M54K15jJ9M27J054J546J712J560J141N44
52548A32933m3m30n59m74k57q5j41l72m70k41J66N16P13O75K74l80q01n93P6P15
52528A31222J050J127J019P22K47l67j066j671j872j531q59j90L08N32L55j55
$$ plain form
52512 128871 128285 127707 127474 127539 127734 128048 128557 129186 129702 129905 129808 129653 129721 130030 130286 130253 130065 129982 129974 129840 129662
52491 129662 129801 130411 131222 131872 132156 131959 131306 130612 130514 131211 132217 132954 133364 133780 134381 135016 135397 135270 134555
52472 134555 133495 132569 132082 131916 131750 131401 130869 130207 129490 128788 128113 127514 127203 127356 127745 127887 127670 127464
52454 127464 127466 127318 126676 125826 125322 125240 125240 125192 125296 125591 125792 125709 125489 125322 125155 124842 124400 123979 123720 123679 123828
52433 123828 124067 124298 124526 124842 125357 126171 127275 128410 129150 129289 129060 128831 128721 128698 128905 129570 130633 131711
52415 131711 132542 133228 134018 135011 136145 137326 138460 139423 140115 140493 140578 140472 140309 140133 139844 139334 138596 137642
52397 137642 136429 135003 133590 132384 131355 130472 129961 130053 130532 130830 130627 130100 129572 129196 129046 129134 129231 128962
52379 128962 128349 128015 128506 129589 130516 130944 131247 131916 132965 134077 135068 135973 136787 137420 137913 138501 139317 140201
$$ packed form
52512A28871n86n78k33O5J95L14N09O29N16K03r7j55O8L09K56l3j88q3qj34j78
52491A29662J39O10Q11O50K84j97o53o94r8O97J006P37M10M16O01O35L81j27p15
52472A34555j060r26m87j66j66l49n32o62p17p02o75n99l11J53L89J42k17k06
52454A27464Kj48o42q50n04q2%m8J04K95K01q3k20j67j67l13m42m21k59m1J49
52433A23828K39K31K28L16N15Q14J104J135P40J39k29k29j10k3K07O65J063J078
52415A31711Q31O86P90R93J134J181J134R63O92L78Q5j06j63j76k89n10p38r54
52397A37642j213j426j413j206j029q83n11R2M79K98k03n27n28l76j50Q8R7k69
52379A28962o13l34M91J083R27M28L03O69J049J112R91R05Q14O33M93N88Q16Q84
$$ plain form
52361 140201 140932 141540 142158 142646 142616 141931 140876 139741 138436 136798 135076 133801 133211 133083 133107 133151 133105 132779
52343 132779 132090 131198 130332 129625 129143 128901 128728 128336 127669 127060 126880 127118 127452 127619 127592 127437 127191 126885 126628
52324 126628 126588 126881 127404 127833 127944 127958 128375 129395 130690 131837 132779 133715 134777 136006 137434 138961 140311
52307 140311 141418 142733 144794 147581 150672 153957 157693 161719 165123 166969 167122 166065 164181 161563
52293 161563 158418 155226 152431 150160 148279 146633 145183 144025 143279 142925 142790 142725 142687 142644 142534 142444 142629
52276 142629 143224 144017 144765 145565 146728 148288 149918 151298 152382 153301 154230 155317 156538 157585 158132 158287
52260 158287 158525 159092 159692 159933 159851 159832 160133 160676 161287 161945 162769 163795 164811 165458 165615 165619 165905 166511 167163
52241 167163 167872 169055 170890 172890 174447 175597 176893 178653 180684 182692 184625 186577 188660 191028
$$ packed form
52361A40201P31O08O18M88l0o85j055j135j305j638j722j275n90j28K4M4m6l26
52343A32779o89q92q66p07m82k42j73l92o67o09j80K38L34J67k7j55k46l06k57
52324A26628m0K93N23M29J11J4M17J020J295J147R42R36J062J229J428J527J350
52307A40311J107J315K061K787L091L285L736M026L404J846J53j057j884k618
52293A61563l145l192k795k271j881j646j450j158p46l54j35o5l8m3j10r0J85
52276A42629N95P93P48Q00J163J560J630J380J084R19R29J087J221J047N47J55
52260A58287K38N67O00K41q2j9L01N43O11O58Q24J026J016O47J57MK86O06O52
52241A67163P09J183J835K000J557J150J296J760K031K008J933J952K083K368
$$ plain form
52227 191028 193788 196808 199872 203072 206819 211332 216364 221524 226676 231796 236670 241054 245107 249372
52213 249372 254256 259693 265423 271442 278050 285503 293771 302640 311928 321502 331190 340831 350402 359999
52199 359999 369668 379324 388856 398203 407327 416190 424793 433054 440643 447146 452548 457306 461797 465868
52185 465868 469187 471840 474239 476523 478371 479435 479637 479071 477949 476687 475719 475062 474338 473351 472324 471448
52169 471448 470554 469517 468630 468223 468093 467791 467373 467416 468225 469488 470897 472784 475817 480208 485489 491053
52153 491053 496668 502499 508800 515697 523116 530765 538235 545247 551804 558028 563838 568915 573059 576451
52139 576451 579431 582108 584313 585901 586927 587503 587631 587219 586155 584342 581770 578576 574924 570848 566349
52124 566349 561641 557061 552684 548259 543605 538840 534073 529151 523984 518900 514349 510321 506419 502496
$$ packed form
52227A91028K760L020L064L200L747M513N032N160N152N120M874M384M053M265
52213B49372M884N437N730O019O608P453Q268Q869R288R574R688R641R571R597
52199C59999R669R656R532R347R124Q863Q603Q261P589O503N402M758M491M071
52185D65868L319K653K399K284J848J064K02n66j122j262r68o57p24r87j027q76
52169D71448q94j037q87m07j30l02m18M3Q09J263J409J887L033M391N281N564
52153D91053N615N831O301O897P419P649P470P012O557O224N810N077M144L392
52139E76451K980K677K205J588J026N76J28m12j064j813k572l194l652m076m499
52124E66349m708m580m377m425m654m765m767m922n167n084m551m028l902l923
$$ plain form
52110 502496 498936 496195 494313 492955 491765 490576 489477 488790 488841 489657 490983 492599 494456 496496 498549
52095 498549 500550 502612 504741 506676 508223 509538 510783 511668 511709 510879 509623 508204 506448 504253 501956
52080 501956 499911 497995 495865 493513 491224 489125 487103 485162 483470 482016 480542 478911 477333 476081
52066 476081 475187 474484 473809 473076 472350 471913 472057 472718 473507 474161 474785 475525 476248 476742 477008 477165 477217 477140 477069 477178
52046 477178 477443 477741 478082 478538 479039 479398 479494 479279 478748 478069 477566 477361 477185 476844 476695 477310 478802 480831
52028 480831 483206 486037 489323 492864 496702 501263 506848 513266 520073 526903 533479 539614 545451 551434
52014 551434 557903 564901 572477 580867 590110 599682 608829 617193 625012 632796 640927 649452 658126 666706
52000 666706 675191 683647 691857 699426 706168 712112 717078 720717 723071 724669 725878 726545 726537 726192 725821 725135
$$ packed form
52110E02496l560k741j882j358j190j189j099o87N1Q16J326J616J857K040K053
52095D98549K001K062K129J935J547J315J245Q85M1q30j256j419j756k195k297
52080E01956k045j916k130k352k289k099k022j941j692j454j474j631j578j252
52066D76081q94p03o75p33p26m37J44O61P89O54O24P40P23M94K66J57N2p7p1J09
52046D77178K65K98L41M56N01L59R6k15n31o79n03k05j76l41j49O15J492K029
52028D80831K375K831L286L541L838M561N585O418O807O830O576O135N837N983
52014E51434O469O998P576Q390R243R572R147Q364P819P784Q131Q525Q674Q580
52000F66706Q485Q456Q210P569O742N944M966L639K354J598J209O67ql45l71o86
$$ plain form
51984 725135 723634 721354 718737 715922 712635 708731 704379 699717 694720 689433 684030 678598 673152 667855
51970 667855 662979 658640 654833 651671 649349 647886 647190 647357 648598 650857 653781 657125 660925 665258 670074
51955 670074 675277 680717 686050 690909 695276 699448 703569 707431 710815 713740 716299 718526 720563 722683
51941 722683 724976 727199 729023 730258 730733 730235 728760 726623 724097 721093 717371 712888 707755 701966 695447
51926 695447 688298 680756 672930 664778 656376 648011 639943 632161 624464 616741 609122 601859 595096 588757
51912 588757 582646 576607 570550 564351 557833 550895 543590 536063 528457 520879 513441 506298 499642 493577
51898 493577 487939 482269 476095 469218 461694 453563 444768 435350 425573 415759 406049 396408 386830 377441
51884 377441 368351 359413 350225 340529 330598 321100 312544 304977 298318 292711 288361 285155 282728 280868
$$ packed form
51984G25135j501k280k617k815l287l904m352m662m997n287n403n432n446n297
51970F67855m876m339l807l162k322j463o96J67J241K259K924L344L800M333M816
51955F70074N203N440N333M859M367M172M121L862L384K925K559K227K037K120
51941G22683K293K223J824J235M75m98j475k137k526l004l722m483n133n789o519
51926F95447p149p542p826q152q402q365q068p782p697p723p619p263o763o339
51912E88757o111o039o057o199o518o938p305p527p606p578p438p143o656o065
51898D93577n638n670o174o877p524q131q795r418r777r814r710r641r578r389
51884C77441r090q938r188r696r931r498q556p567o659n607m350l206k427j860
$$ plain form
51870 280868 279611 278965 278794 278998 279575 280403 281147 281475 281276 280607 279537 278066 276168 273956 271906 270773
51854 270773 271041 272455 274375 276597 279612 283988 289800 296753 304677 313679 324008 335846 349144 363471
51840 363471 378092 392207 404982 415373 422225 424793 423119 417854 409921 400406 390424 380707 371307
51827 371307 361876 352201 342295 332116 321537 310690 300163 290687 282610 275759 269764 264452 259861
51814 259861 255925 252340 248917 245909 243758 242494 241677 240954 240387 240067 239667 238644 236749 234112 230947
51799 230947 227431 223797 220267 216864 213500 210247 207325 204803 202526 200430 198730 197683 197329 197587 198477
51784 198477 200089 202378 205180 208404 212039 215953 219863 223581 227169 230677 233812 236067 237202 237474
51770 237474 237333 237036 236614 236070 235494 235038 234869 235084 235576 236082 236453 236759 237031 237006 236334 234917 232886 230339
$$ packed form
51870B80868j257o46j71K04N77Q28P44L28j99o69j070j471j898k212k050j133
51854B70773K68J414J920K222L015M376N812O953P924R002J0329J1838J3298J4327
51840C63471J4621J4115J2775J0391O852K568j674n265p933r515r982r717r400
51827C71307r431r675r906j0179j0579j0847j0527r476q077o851n995n312m591
51814B59861l936l585l423l008k151j264q17p23n67l20m00j023j895k637l165
51799B30947l516l634l530l403l364l253k922k522k277k096j700j047l54K58Q90
51784A98477J612K289K802L224L635L914L910L718L588L508L135K255J135K72
51770B37474j41k97m22n44n76m56j69K15M92N06L71L06K72k5o72j417k031k547
$$ plain form
51752 230339 227342 224111 220878 217566 213906 209928 206076 202701 199704 196817 194033 191551 189487 187825
51738 187825 186570 185761 185387 185384 185669 186127 186668 187332 188217 189238 190119 190688 191030 191298 191540 191819 192242 192706 192866
51719 192866 192620 192418 192787 193629 194338 194564 194537 194576 194619 194391 193817 193077 192392 191918 191783 192060 192664 193397 194107 194782
51699 194782 195488 196243 196990 197645 198158 198557 198928 199352 199824 200232 200495 200712 201119 201780 202417 202619 202249 201542 200912
51680 200912 200719 201154 202113 203199 204073 204836 205931 207599 209598 211489 213037 214217 215022 215390 215258 214608
51664 214608 213517 212195 210798 209211 207178 204688 202076 199650 197449 195462 193834 192635 191635 190538
51650 190538 189363 188385 187791 187519 187379 187166 186765 186312 186134 186416 187016 187719 188507 189398 190199 190745 191261 192209
51632 192209 193782 195739 197714 199415 200588 201104 201207 201442 202220 203560 205287 207270 209362 211212 212346
$$ packed form
51752B30339k997l231l233l312l660l978l852l375k997k887k784k482k064j662
51738A87825j255q09l74lK85M58N41O64Q85J021Q81N69L42K68K42K79M23M64J60
51719A92866k46k02L69Q42P09K26k7L9M3k28n74p40o85m74j35K77O04P33P10O75
51699A94782P06P55P47O55N13L99L71M24M72M08K63K17M07O61O37K02l70p07o30
51680B00912j93M35R59J086Q74P63J095J668J999J891J548J180Q05L68j32o50
51664B14608j091j322j397j587k033k490k612k426k201j987j628j199j000j097
51650A90538j175r78n94k72j40k13m01m53j78K82O00P03P88Q91Q01N46N16R48
51632A92209J573J957J975J701J173N16J03K35P78J340J727J983K092J850J134
$$ plain form
51617 212346 212442 211579 210262 209168 208753 209008 209617 210290 210899 211347 211490 211264 210862 210685 211004 211615 211879 211278
51599 211278 209941 208499 207438 206806 206545 206736 207356 208059 208512 208702 208619 207875 206100 203625 201341 199779 198683
51582 198683 197523 196111 194587 193131 191930 191189 190956 190998 190998 190832 190599 190468 190592 191068 191948 193288 195214
51565 195214 197820 201043 204706 208633 212614 216281 219171 220969 221582 221087 219790 218281 217175 216694 216637
51550 216637 216809 217302 218341 219995 222112 224349 226211 227176 226881 225170 222038 217715 212795 207993 203672
51535 203672 199707 195876 192237 189053 186524 184685 183452 182677 182224 181997 181875 181678 181348 181042 180849 180480
51519 180480 179509 177964 176375 175212 174492 173989 173490 172754 171549 169998 168650 168015 168194 169053 170479 172218
51503 172218 173765 174792 175594 176845 178941 181792 185096 188586 192109 195737 199787 204443 209325 213577
$$ packed form
51617B12346R6q63j317j094m15K55O09O73O09M48J43k26m02j77L19O11K64o01
51599B11278j337j442j061o32k61J91O20P03M53J90q3p44j775k475k284j562j096
51582A98683j160j412j524j456j201p41k33M2%j66k33j31J24M76Q80J340J926
51565A95214K606L223L663L927L981L667K890J798O13m95j297j509j106m81n7
51550B16637J72M93J039J654K117K237J862R65k95j711l132m323m920m802m321
51535B03672l965l831l639l184k529j839j233p75m53k27j22j97l30l06j93l69
51519A80480r71j545j589j163p20n03m99p36j205j551j348o35J79Q59J426J739
51503A72218J547J027Q02J251K096K851L304L490L523L628M050M656M882M252
$$ plain form
51489 213577 216429 217578 217161 215598 213475 211342 209549 208347 208072 209078 211498 215172 219799 225021 230439
51474 230439 235742 240875 245923 250878 255633 260132 264337 268067 271135 273685 276216 279233 283068 288050
51460 288050 294600 302991 313136 324702 337265 350243 362876 374480 384705 393402 400364 405300
51448 405300 408026 408551 406984 403457 398014 390543 380947 369562 357265 344894 332635 320224 307727
51435 307727 295778 284923 275084 265891 257254 249326 242110 235474 229516 224513 220429 216794 213179 209590
51421 209590 206286 203443 201168 199571 198564 197751 196768 195667 194766 194173 193640 192873 191833 190738 189882 189402
51405 189402 189166 188976 188931 189386 190376 191322 191615 191331 191039 191039 191161 191241 191350 191463 191391 191168 191139 191423 191657 191479 190968
51384 190968 190314 189359 187825 185842 183876 182258 181049 180220 179635 178946 177874 176554 175359 174381 173453 172609
$$ packed form
51489B13577K852J149m17j563k123k133j793j202k75J006K420L674M627N222N418
51474B30439N303N133N048M955M755M499M205L730L068K550K531L017L835M982
51460B88050O550Q391J0145J1566J2563J2978J2633J1604J0225Q697O962M936
51448D05300K726N25j567l527n443p471r596j1385j2297j2371j2259j2411j2497
51435C07727j1949j0855r839r193q637p928p216o636n958n003m084l635l615l589
51421B09590l304k843k275j597j007q13r83j101r01n93n33p67j040j095q56m80
51405A89402k36j90m5M55R90R46K93k84k92%J22Q0J09J13p2k23k9K84K34j78n11
51384A90968o54r55j534j983j966j618j209q29n85o89j072j320j195r78r28q44
$$ plain form
51368 172609 172159 172186 172281 171984 171249 170355 169536 168879 168432 168212 168172 168303 168695 169422 170437 171688 173279 175374
51350 175374 177973 180933 184225 188036 192523 197539 202724 207868 213029 218191 222897 226409 228307 228805
51336 228805 228486 227889 227379 227149 227037 226457 224772 221840 218034 213754 209119 204170 199166 194519 190520 187230
51320 187230 184579 182487 180897 179708 178683 177534 176214 175070 174550 174749 175398 176282 177418 178772 180065
51305 180065 181087 182005 183131 184473 185776 186995 188457 190519 193234 196381 199642 202728 205530 208266
51291 208266 211341 214903 218645 222195 225638 229541 234481 240716 248240 257003 266992 278269 290976 305175
51277 305175 320591 336621 352764 369005 385614 402426 418364 431737 441078 445814 446287 443254
51265 443254 437387 429094 418645 406300 392347 377089 360898 344198 327443 311076 295550 281281
$$ packed form
51368A72609m50K7R5k97p35q94q19o57m47k20m0J31L92P27J015J251J591K095
51350A75374K599K960L292L811M487N016N185N144N161N162M706L512J898M98
51336B28805l19n97n10k30j12n80j685k932l806m280m635m949n004m647l999l290
51320A87230k651k092j590j189j025j149j320j144n20J99O49Q84J136J354J293
51305A80065J022R18J126J342J303J219J462K062K715L147L261L086K802K736
51291B08266L075L562L742L550L443L903M940O235P524Q763R989J1277J2707J4199
51277C05175J5416J6030J6143J6241J6609J6812J5938J3373R341M736M73l033
51265D43254n867q293j0449j2345j3953j5258j6191j6700j6755j6367j5526j4269
$$ plain form
51253 281281 268493 257137 247015 238010 230174 223606 218317 214186 210979 208343 205795 202867 199375
51240 199375 195598 192105 189285 187095 185264 183656 182276 181050 179856 178783 178061 177623 176999 175836 174345
51225 174345 172991 171936 171005 170101 169318 168719 168313 168256 168758 169701 170642 171348 172104 173340 175069 176883 178343
51208 178343 179246 179599 179533 179231 178854 178472 178070 177560 176826 175858 174851 174056 173550 173262 173139 173116 172942 172369 171565
51189 171565 171122 171468 172477 173774 175168 176628 178076 179499 181130 183221 185683 188161 190387 192231 193491
51174 193491 193943 193635 192900 192024 191085 190172 189550 189452 189791 190200 190352 190223 190111 190386 191111 191901 192200 191778 190883
51155 190883 189935 189102 188250 187227 186095 185064 184258 183657 183259 183160 183382 183733 184004 184209 184447 184592 184397 183912
51137 183912 183479 183192 182654 181516 180001 178673 177832 177407 177268 177355 177565 177790 178056 178413 178736 178821 178659 178444
$$ packed form
51253B81281j2788j1356j0122r005p836o568n289m131l207k636k548k928l492
51240A99375l777l493k820k190j831j608j380j226j194j073p22m38o24j163j491
51225A74345j354j055r31r04p83n99m06n7N02R43R41P06P56J236J729J814J460
51208A78343R03L53o6l02l77l82m02n10p34r68j007p95n06k88j23k3j74n73q04
51189A71565m43L46J009J297J394J460J448J423J631K091K462K478K226J844J260
51174A93491M52l08p35q76r39r13o22r8L39M09J52j29j12K75P25P90K99m22q95
51155A90883r48q33q52j023j132j031q06o01l98r9K22L51K71K05K38J45j95m85
51137A83912m33k87n38j138j515j328q41m25j39Q7K10K25K66L57L23Q5j62k15
$$ plain form
51119 178444 178339 178414 178770 179483 180465 181531 182589 183595 184432 185029 185567 186315 187321 188488 189874 191573 193377
51102 193377 194884 195977 196830 197416 197446 196920 196354 196143 196069 195709 195144 194869 195159 195828 196561 197175 197564 197622 197342
51083 197342 196881 196495 196414 196697 197138 197367 197152 196556 195775 194937 194129 193465 192966 192463 191796 191030 190350 189825 189392
51064 189392 189020 188736 188578 188623 188974 189531 189878 189637 188904 188156 187724 187574 187587 187744 187962 188003 187728 187327 187124 187212
51044 187212 187416 187525 187437 187155 186773 186467 186384 186547 186940 187619 188578 189541 190085 190046 189699 189493 189681 190279 191216 192385
51024 192385 193600 194707 195720 196723 197649 198282 198550 198658 198872 199262 199736 200233 200767 201309 201744 201977 202009 201896
51006 201896 201676 201348 200944 200629 200671 201225 202150 203169 204169 205225 206337 207330 208113 208810 209504 210066 210435 210902
50988 210902 211815 213073 214233 215091 215865 216759 217613 218135 218253 218126 217959 217960 218316 219096 220186 221416 222652 223826
$$ packed form
51119A78444j05P5L56P13R82J066J058J006Q37N97N38P48J006J167J386J699J804
51102A93377J507J093Q53N86L0n26n66k11p4l60n65k75K90O69P33O14L89N8k80
51083A97342m61l86q1K83M41K29k15n96p81q38q08o64m99n03o67p66o80n25m33
51064A89392l72k84j58M5L51N57L47k41p33p48m32j50J3J57K18M1k75m01k03Q8
51044A87212K04J09q8k82l82l06q3J63L93O79R59R63N44l9l47k06J88N98R37J169
51024A92385J215J107J013J003R26O33K68J08K14L90M74M97N34N42M35K33L2j13
51006B01896k20l28m04l15M2N54R25J019J000J056J112R93P83O97O94N62L69M67
50988B10902R13J258J160Q58P74Q94Q54N22J18j27j67JL56P80J090J230J236J174
$$ plain form
50970 223826 225019 226594 229005 232293 235939 239408 242780 246641 251413 256958 262877 269011 275541 282648
50956 282648 290191 297745 304881 311295 316661 320511 322512 322866 322304 321603 321171 321014 320871 320246 318590 315750
50940 315750 312234 308802 305768 302812 299523 295981 292714 290185 288474 287442 287020 287099 287209 286551 284618
50925 284618 281719 278778 276596 275443 275287 276119 277961 280726 284190 288027 291871 295470 298874 302316 305829
50910 305829 309113 311862 314037 315699 316803 317336 317529 317640 317616 317159 316138 314752 313336 312180 311517 311499
50894 311499 312093 313150 314582 316413 318669 321361 324628 328718 333745 339489 345546 351675 358033 365114
50880 365114 373391 382943 393388 404172 414903 425455 435957 446809 458585 471714 486276 502244
50868 502244 519901 539807 562344 587444 614746 643860 674429 706163 738884 772392 806175
$$ packed form
50970B23826J193J575K411L288L646L469L372L861M772N545N919O134O530P107
50956B82648P543P554P136O414N366L850K001L54n62p01m32j57j43o25j656k840
50940C15750l516l432l034k956l289l542l267k529j711j032m22P9J10o58j933
50925B84618k899k941k182j153j56Q32J842K765L464L837L844L599L404L442L513
50910C05829L284K749K175J662J104N33J93J11k4m57j021j386j416j156o63j8
50894C11499N94J057J432J831K256K692L267M090N027N744O057O129O358P081
50880C65114Q277R552J0445J0784J0731J0552J0502J0852J1776J3129J4562J5968
50868E02244J7657J9906K2537K5100K7302K9114L0569L1734L2721L3508L3783
$$ plain form
50857 806175 839364 871121 900932 928492 953441 975424 994294 1010071 1022760 1032408 1039317 1043922
50845 1043922 1046366 1046418 1044009 1039817 1035085 1030824 1027173 1023515 1019064 1013346 1006242 997778 987958 976822
50831 976822 964607 951697 938243 923883 907972 890185 870732 849926 827723 803938 778820
50820 778820 753130 727568 702371 677568 653446 630522 609128 589236 570730 553648 538103
50809 538103 523999 510975 498667 487002 476190 466381 457445 449151 441509 434738 428910 423850 419444
50796 419444 415826 413071 410853 408678 406431 404520 403396 403058 403082 403067 403001 403219 404031 405448 407313 409631
50780 409631 412596 416288 420561 425324 430681 436631 442847 449049 455468 462624 470689 479401 488580 498390
50766 498390 509032 520493 532765 546029 560488 576247 593562 612969 634933 659550 686846
$$ packed form
50857H06175L3189L1757K9811K7560K4949K1983J8870J5777J2689R648O909M605
50845A043922K444N2k409m192m732m261l651l658m451n718p104q464r820j1136
50831I76822j2215j2910j3454j4360j5911j7787j9453k0806k2203k3785k5118
50820G78820k5690k5562k5197k4803k4122k2924k1394j9892j8506j7082j5545
50809E38103j4104j3024j2308j1665j0812r809q936q294p642o771n828n060m406
50796D19444l618k755k218k175k247j911j124l38K4j5o6K18Q12J417J865K318
50780D09631K965L692M273M763N357N950O216O202O419P156Q065Q712R179R810
50766D98390J0642J1461J2272J3264J4459J5759J7315J9407K1964K4617K7296
$$ plain form
50755 686846 717212 751247 789197 830837 875959 924770 977760 1035301 1097328 1163286 1232338
50744 1232338 1303743 1377020 1451617 1526485 1600178 1671317 1738753 1801203 1857023 1904515 1942479
50733 1942479 1970476 1988752 1997943 1998736 1991726 1977739 1958302 1935497 1911192 1886548 1862416 1839936
50721 1839936 1820331 1804165 1791054 1780086 1770211 1760175 1748467 1733604 1714463 1690263 1660472
50710 1660472 1624912 1583836 1537701 1486923 1431958 1373596 1312983 1251413 1190194 1130661 1074037
50699 1074037 1021101 972095 927009 885935 849105 816675 788546 764390 743784 726357 711867
50688 711867 700189 691161 684425 679405 675492 672272 669508 666926 664146 660955 657563 654328 651189 647600
50674 647600 643153 638091 632985 628033 622917 617255 610927 603973 596485 588730 581141 573941 566907 559658
$$ packed form
50755F86846L0366L4035L7950M1640M5122M8811N2990N7541O2027O5958O9052
50744A232338P1405P3277P4597P4868P3693P1139O7436O2450N5820M7492L7964
50733A942479K7997J8276R191P93p010j3987j9437k2805k4305k4644k4132k2480
50721A839936j9605j6166j3111j0968r875j0036j1708j4863j9141k4200k9791
50710A660472l5560m1076m6135n0778n4965n8362o0613o1570o1219n9533n6624
50699A074037n2936m9006m5086m1074l6830l2430k8129k4156k0606j7427j4490
50688G11867j1678r028o736n020l913l220k764k582k780l191l392l235l139l589
50674F47600m447n062n106m952n116n662o328o954p488p755p589p200p034p249
$$ plain form
50660 559658 552173 544916 538472 533148 528913 525620 523284 522150 522464 524227 527283 531677 537747 545763
50646 545763 555593 566901 579572 593728 609364 626189 643958 662839 683328 705890 730731 757849
50634 757849 787147 818516 851881 887229 924486 963324 1003087 1042956 1082204 1120385 1157267
50623 1157267 1192585 1225760 1255885 1282060 1303735 1320610 1332201 1337727 1336592 1328961 1315708 1297963
50611 1297963 1276897 1253817 1230119 1206993 1185383 1166247 1150497 1138423 1129430 1122537 1117034 1112438
50599 1112438 1108074 1103022 1096385 1087347 1075063 1058851 1038559 1014480 986941 956283 923270 889154
50587 889154 855195 822271 791007 761972 735588 712040 691413 673774 659056 647090 637907 631778
50575 631778 628809 628670 630908 635368 642063 650740 660811 671699 683094 694822 706580 717821 727949
$$ packed form
50660E59658p485p257o444n324m235l293k336j134L14J763L056M394O070Q016
50646E45763R830J1308J2671J4156J5636J6825J7769J8881K0489K2562K4841K7118
50634G57849K9298L1369L3365L5348L7257L8838L9763L9869L9248L8181L6882
50623A157267L5318L3175L0125K6175K1675J6875J1591N526j135p631j3253j7745
50611A297963k1066k3080k3698k3126k1610j9136j5750j2074q993o893n503m596
50599A112438m364n052o637r038j2284j6212k0292k4079k7539l0658l3013l4116
50587H89154l3959l2924l1264k9035k6384k3548k0627j7639j4718j1966r183o129
50575F31778k969j39K238M460O695Q677J0071J0888J1395J1728J1758J1241J0128
$$ plain form
50562 727949 736698 744324 751308 757845 763796 769142 774232 779472 784928 790410 795779 801042 806258 811540
50548 811540 817089 823138 829911 837644 846526 856572 867722 880112 894037 909555 926376 944227
50536 944227 963071 982800 1002989 1023155 1043040 1062424 1080944 1098429 1115155 1131405 1146978
50525 1146978 1161565 1175466 1189339 1203026 1214874 1222334 1223172 1216419 1202816 1184670 1164975 1146229
50513 1146229 1129780 1116019 1104880 1096153 1089601 1084964 1081857 1079741 1078084 1076489 1074500 1071381 1066306
50500 1066306 1058692 1048112 1034055 1016128 994498 969813 942625 913191 881885 849506 817010
50489 817010 785179 754602 725743 698809 673736 650436 628999 609574 592195 576807 563337
50478 563337 551685 541800 533759 527623 523213 520202 518486 518254 519687 522737 527254 533064 539913 547539
$$ packed form
50562G27949Q749P626O984O537N951N346N090N240N456N482N369N263N216N282
50548H11540N549O049O773P733Q882J0046J1150J2390J3925J5518J6821J7851
50536I44227J8844J9729K0189K0166J9885J9384J8520J7485J6726J6250J5573
50525A146978J4587J3901J3873J3687J1848P460Q38o753j3603j8146j9695j8746
50513A146229j6449j3761j1139q727o552m637l107k116j657j595j989l119n075
50500A066306p614j0580j4057j7927k1630k4685k7188k9434l1306l2379l2496
50489H17010l1831l0577k8859k6934k5073k3300k1437j9425j7379j5388j3470
50478E63337j1652r885q041o136m410l011j716k32J433L050M517N810O849P626
$$ plain form
50464 547539 555923 565243 575517 586465 597806 609438 621263 633110 645028 657418 670651 684657
50452 684657 699023 713381 727577 741623 755614 769548 783107 795763 807266 817881 828102
$$ packed form
50464E47539Q384R320J0274J0948J1341J1632J1825J1847J1918J2390J3233J4006
50452F84657J4366J4358J4196J4046J3991J3934J3559J2656J1503J0615J0221
$$ [...]
##END NTUPLES=NMR SPECTRUM
##END=
