##TITLE=AC1543_ROEFFECT0012_8215216_BSwHfQL54B
##JCAMPDX= 6.0         $$ Bruker NMR JCAMP-DX V2.0
##DATA TYPE= NMR SPECTRUM
##DATA CLASS= NTUPLES
##ORIGIN= BRUKER
##OWNER= Administrator
$$ 1.72 TOPSPIN		Version 2.1
$$ 2013-10-11 20:18:12.422 -0700  Administrator@X
$$ Compression mode = diff/dup
##.OBSERVE FREQUENCY= 400.02188249412
##.OBSERVE NUCLEUS= ^1H
##.ACQUISITION MODE= SIMULTANEOUS (DQD)
##.ACQUISITION SCHEME= undefined
##.AVERAGES= 8
##.DIGITISER RES= 22
##SPECTROMETER/DATA SYSTEM= spect
##.PULSE SEQUENCE= zg30
##.SOLVENT NAME= COFFEE_meoh
##.SHIFT REFERENCE= INTERNAL, COFFEE_meoh, 1, 14.98509
##AUDIT TRAIL= $$ (NUMBER, WHEN, WHO, WHERE, PROCESS, VERSION, WHAT)
$$ ##TITLE= Audit trail, TOPSPIN		Version 2.1
$$ ##JCAMPDX= 5.01
$$ ##ORIGIN= Bruker BioSpin GmbH
$$ ##OWNER= Administrator
$$ $$ E:\/data/COFFEE/nmr/AC1543_ROEFFECT0012_8215216_BSwHfQL54B/10/pdata/1/auditp.txt
$$ ##AUDIT TRAIL=  $$ (NUMBER, WHEN, WHO, WHERE, PROCESS, VERSION, WHAT)
(   1,<2013-10-11 20:18:05.678 -0700>,<Administrator>,<X>,<go>,<TOPSPIN 2.1>,
      <created by zg
	started at 2013-10-11 20:16:58.834 -0700,
	POWCHK enabled, PULCHK disabled,
       configuration hash MD5:
       C8 4E 4E 5D D3 5C D8 9E 9F 52 82 E0 59 8A DE 15
       data hash MD5: 64K
       26 E2 60 FA 1F FA C2 3F BB 48 94 7A AB A5 DF 05>)
(   2,<2013-10-11 20:18:08.648 -0700>,<Administrator>,<X>,<proc1d>,<TOPSPIN 2.1>,
      <Start of raw data processing
       efp LB = 0 FT_mod = 6 PKNL = 1 PHC0 = 0 PHC1 = 0 SI = 32K 
       data hash MD5: 32K
       87 58 6D 4A 7D 98 F7 E2 7F E6 D3 39 57 D1 10 B3>)
(   3,<2013-10-11 20:18:08.942 -0700>,<Administrator>,<X>,<proc1d>,<TOPSPIN 2.1>,
      <pk PHC0 = 92.79053 PHC1 = 0 
       data hash MD5: 32K
       3D 45 DF DA 6B 79 7D 5C B4 A9 AB AA A0 94 A6 79>)
(   4,<2013-10-11 20:18:09.035 -0700>,<Administrator>,<X>,<proc1d>,<TOPSPIN 2.1>,
      <abs ABSG = 1 
       data hash MD5: 32K
       23 61 07 46 81 2B F1 9D 5D DA 18 54 83 D7 9A B4>)
(   5,<2013-10-11 20:18:09.112 -0700>,<Administrator>,<X>,<proc1d>,<TOPSPIN 2.1>,
      <abs ABSG = 2 
       data hash MD5: 32K
       BF 0A C0 B3 7E 52 0C D4 AF 0E 46 5B 28 74 7A 26>)
(   6,<2013-10-11 20:18:09.174 -0700>,<Administrator>,<X>,<proc1d>,<TOPSPIN 2.1>,
      <abs ABSG = 3 
       data hash MD5: 32K
       B9 D2 C1 EC F1 22 66 61 CA 1A 10 F4 C5 DA 52 94>)
(   7,<2013-10-11 20:18:09.220 -0700>,<Administrator>,<X>,<proc1d>,<TOPSPIN 2.1>,
      <abs ABSG = 4 
       data hash MD5: 32K
       BE 6F F9 1A C1 28 09 C1 D3 3A 30 50 0E 0D 61 12>)
(   8,<2013-10-11 20:18:09.313 -0700>,<Administrator>,<X>,<proc1d>,<TOPSPIN 2.1>,
      <abs ABSG = 5 
       data hash MD5: 32K
       1E D2 3A 5F 2C 76 77 E9 31 3C 7C 13 B7 CE 3A 14>)
$$ ##END=
$$ 
$$ $$ hash MD5
$$ $$ F8 B4 9A D6 E7 99 32 D4 DE 0B 00 C0 98 F6 1D 97
##$RELAX= 
##$RELAX= 
##$RELAX= 
##$RELAX= 
##$RELAX= 
##$RELAX= 
##$RELAX= 
$$ Bruker specific parameters
$$ --------------------------
##$DU= <E:\>
##$EXPNO= 10
$$ [...]
150 150 150 150 150 150 150 150
##$TP07= 0
##$TPNAME0= <>
##$TPNAME1= <>
##$TPNAME2= <>
##$TPNAME3= <>
##$TPNAME4= <>
##$TPNAME5= <>
##$TPNAME6= <>
##$TPNAME7= <>
##$TPOAL= (0..7)
0.5 0.5 0.5 0.5 0.5 0.5 0.5 0.5
##$TPOFFS= (0..7)
0 0 0 0 0 0 0 0
##$TUNHIN= 0
##$TUNHOUT= 0
##$TUNXOUT= 0
##$USERA1= <user>
##$USERA2= <user>
##$USERA3= <user>
##$USERA4= <user>
##$USERA5= <user>
##$V9= 5
##$VALIST= <valist>
##$VCLIST= <CCCCCCCCCCCCCCC>
##$VD= 0
##$VDLIST= <DDDDDDDDDDDDDDD>
##$VPLIST= <PPPPPPPPPPPPPPP>
##$VTLIST= <TTTTTTTTTTTTTTT>
##$WBST= 1024
##$WBSW= 4
##$XGAIN= (0..3)
0 0 0 0
##$XL= 0
##$YL= 0
##$YMAX_a= 566096
##$YMIN_a= -483458
##$ZGOPTNS= <>
##$ZL1= 120
##$ZL2= 120
##$ZL3= 120
##$ZL4= 120
##$ABSF1= 14.98509
##$ABSF2= -5.573092
##$ABSG= 5
##$ABSL= 3
##$ALPHA= 0
##$AQORDER= 0
##$ASSFAC= 0
##$ASSFACI= 0
##$ASSFACX= 0
##$ASSWID= 0
##$AUNMP= <proc_prof1d_extract_pilot.lims>
##$AXLEFT= 0
##$AXNAME= <>
##$AXNUC= <1H>
##$AXRIGHT= 0
##$AXTYPE= 0
##$AXUNIT= <>
##$AZFE= 0.1
##$AZFW= 0.1
##$BCFW= 0
##$BC_mod= 0
##$BYTORDP= 0
##$COROFFS= 0
##$CY= 15
##$DATMOD= 1
##$DC= 0
##$DFILT= <>
##$DTYPP= 0
##$F1P= 0
##$F2P= 0
##$FCOR= 0.5
##$FTSIZE= 32768
##$FT_mod= 6
##$GAMMA= 0
##$GB= 0
##$INTBC= 1
##$INTSCL= 1
##$ISEN= 128
##$LB= 0
##$LEV0= 0
##$LPBIN= 0
##$MAXI= 10000
##$MC2= 0
##$MEAN= 0
##$ME_mod= 0
##$MI= 0
##$NCOEF= 0
##$NC_proc= -8
##$NLEV= 6
##$NOISF1= 0
##$NOISF2= 0
##$NSP= 0
##$NTH_PI= 0
##$NZP= 0
##$OFFSET= 14.98509
##$PC= 1
##$PHC0= 92.79053
##$PHC1= 0
##$PH_mod= 1
##$PKNL= yes
##$PPARMOD= 0
##$PPDIAG= 0
##$PPIPTYP= 0
##$PPMPNUM= 2147483647
##$PPRESOL= 1
##$PSCAL= 4
##$PSIGN= 0
##$PYNMP= <proc.py>
##$REVERSE= no
##$SF= 400.02
##$SI= 32768
##$SIGF1= 0
##$SIGF2= 0
##$SINO= 400
##$SIOLD= 32768
##$SPECTYP= <>
##$SREGLST= <1H.CDCl3>
##$SSB= 0
##$STSI= 32768
##$STSR= 0
##$SW_p= 8223.68421052631
##$SYMM= 0
##$S_DEV= 0
##$TDeff= 65536
##$TDoff= 0
##$TI= <>
##$TILT= no
##$TM1= 0
##$TM2= 0
##$TOPLEV= 0
##$USERP1= <user>
##$USERP2= <user>
##$USERP3= <user>
##$USERP4= <user>
##$USERP5= <user>
##$WDW= 1
##$XDIM= 32768
##$YMAX_p= 433108667
##$YMIN_p= -800599
##$CURPLOT= <Network HP LaserJet P1505>
##$CURPRIN= <$Network HP LaserJet P1505>
##$DFORMAT= <normdp>
##$LAYOUT= <+/1D_H.xwp>
##$LFORMAT= <normlp>
##$PFORMAT= <normpl>
##$SURQMSG= 1
$$ End of Bruker specific parameters
$$ ---------------------------------
##NTUPLES= NMR SPECTRUM
##VAR_NAME=  FREQUENCY,     SPECTRUM/REAL,   SPECTRUM/IMAG
##SYMBOL=    X,             R,               I
##VAR_TYPE=  INDEPENDENT,   DEPENDENT,       DEPENDENT
##VAR_FORM=  AFFN,          ASDF,            ASDF
##VAR_DIM=   32768,         32768,           32768
##UNITS=     HZ,            ARBITRARY UNITS, ARBITRARY UNITS
##FACTOR=    0.250966925370066, 1,           1
##FIRST=     8223.43324360094, -107251,      -201156
##LAST=      0,             -49835,          -131133
##MIN=       0,             -800599,         0
##MAX=       8223.43324360094, 433108667,    0
$$ Real data points
##PAGE= N=1
##DATA TABLE= (X++(R..R)), XYDATA
$$ [...]
19576e7949l31699a24563D1201a44709m866J8013k7496j0545A89221a92847j59
19565a93006d2994C8313a56999A03642K7852J6059P5632A04689a4541l03018E7835
19553D5600d06950E5714J1583f6121c2651n3201A53781K502b18595K5524k17372
19542d10443g8120c2511A87847b51172R2797K97k9563G4739b33909B2824a8540
19530B39526H180a38172j17256f8192A32588a12359A7507i2552j40267i8915L3609
19519f5306B23695d62001A84744a46489p9069A06333i7988C2131a09377k02066
19509c11443g251B24973b4502j89355C40941a62586j8686I186a7396r7544A7247
19497B09585E7383J38628A2086a80448d2370J9229B38213d28543a44585G8074
$$ y = [-57949, -389648, -124563, 41201, -144709, -149575, -131562, -159058, -169603, 189221, -192847, -193006, -42994, 38313, -156999, 103642, 131494, 147553, 223185, 104689, -14541, -317559, 57835, 45600, -406950, 55714, 67297, -66121, -32651, -85852, 153781, 156283, -218595, -193071, -410443, -78120, -32511, 187847, -251172, -158375, -158078, -187641, 74739, -233909, 22824, -18540, 239526, 8180, -138172, -255428, -68192, 132588, -112359, 17507, -92552, -232819, -98915, -65306, 223695, -462001, 184744, -146489, -225558, 106333, -97988, 32131, -109377, -311443, -7251, 224973, -24502, -213857, 340941, -162586, -181272, 9186, -17396, -114940, 17247, 209585, 57383, 196011, 12086, -180448, -42370, -23141, 238213, -428543, -144585, 78074]
19486E8226N1635i9055j24609h7518D869a94296Q4528B0076b01424a4179A22036
19474c01755K2778A70755m2715b85482J18396B21378i2103k371L9390m841k4504
19463h4429b2269a275r4399B4137d21735h0881j41652g5185C50264E8342a71434
19451I9121a17806m1818j41218L0855P6617H3784e556G7247K88465B7346c92920
19439f8103B589b1007B22161I4740i0791j08190A07521D5977b61248A10220a59368
19427C66358r4833b69844B05336C1338a47719G0267J5752b51358b7038l81803
19417d08841E7572b99706o1147C3694b77885a33164k89940a07690A71917K1175
19407A93092c7538j3218o2689Q57c2511l14713B23783a79192A19652c3263l19732
$$ y = [58226, 109861, -99055, -223664, -87518, 4869, -194296, -109768, 20076, -201424, -14179, 122036, -301755, -278977, 170755, 128040, -285482, -167086, 221378, -92103, -94474, -55084, -59925, -84429, -22269, -1275, -95674, 24137, -421735, -80881, -222533, -75185, 350264, 58342, -171434, 99121, -117806, -159624, -300842, -269987, -193370, 83784, -5556, 77247, 365712, 27346, -392920, -68103, 2589, -21007, 222161, 94740, -90791, -198981, 107521, 45977, -261248, 110220, -159368, 366358, 271525, -269844, 205336, 31338, -147719, 70267, 86019, -251358, -27038, -408841, 57572, -299706, -360853, 33694, -277885, -133164, -423104, -107690, 171917, 193092, -37538, -50756, -113445, -112588, -32511, -347224, 223783, -179192, 119652, -33263, -352995]
19396c52995o2287g5568m0088M2659a7941k5026a7558k68787b1503D17296G1290
19384A45217a76174P4540J6016A29291a71923c7526r9032B21790c37484h6432
19373d22313B27137b11730R6168I7862K7288A4543J56248h2181H2143a85263C81231
19361e48304a1707F9923a05259A04061F429R8968l4188a43215B04536g7567n0651
19350a28218A7675b79607A39859a71205l9298O6467B42574n9608c551j27345q0754
19339b11650A7982a40679H3971j7205a07271j07939b3739B03636k9446b30515
19328C52903a37128M6216j8354D9072a08033E8963M0519f6461B38232b19937N5053
19317a64884A49561a59249q2685J09978k08461D3128D258L5449J38528b75047
$$ y = [-352995, -415282, -75568, -115656, -72997, -17941, -42967, -17558, -286345, -21503, 417296, 71290, 145217, -176174, -101634, -85618, 129291, -171923, -37526, -136558, 221790, -337484, -86432, -422313, 227137, -211730, -115562, 97862, 125150, 14543, 170791, -82181, 82143, -185263, 381231, -548304, -11707, 69923, -105259, 104061, 6429, 105397, 71209, -143215, 204536, -77567, -128218, 17675, -279607, 139859, -171205, -210503, -144036, 242574, 182966, -3551, -130896, -211650, 17982, -140679, 83971, 66766, -107271, -215210, -23739, 203636, 174190, -230515, 352903, -137128, -90912, -109266, 49072, -108033, 58963, 99482, -66461, 238232, -219937, -164884, 149561, -159249, -241934, -131956, -340417, 43128, 4258, 39707, 178235, -275047]
19306H6205e7619B02434b26162M187b6804k7744p2588k27636a26997N7428a1732
19294b8619j9914J7627l3002k10525R5652C7998a4526o9909Q104B99492a27967
19282I2408f5189j46446n0301k5398C9036i3725b156k25693b0206j51276h567
19270d49332g7450g946r3894F3327a22399M2369B16628j01046e11178i4255A10033
19258A01255a66595C9955a15346G2929c26559R1526Lo6635r1322a46243A80565
19246G7809J29022g8924k66400d7821B10809a57663M5891L0794k8541b4846H2469
19234a57127A6228a79229Q2099n5173P3069L7186R279G4959I632a87950l1341
19223b19291D0405M1180b34794i6333b31H8317K21710h2217a729j87799j35087
$$ y = [86205, -57619, 202434, -226162, -221975, -26804, -54548, -127136, -354772, -126997, -69569, -11732, -28619, -48533, -30906, -63908, -274433, -178781, 37998, -14526, -84435, -76331, 299492, -127967, 92408, -65189, -211635, -261936, -287334, 39036, -93725, -2156, -227849, -20206, -171482, -8567, -449332, -77450, -7946, -101840, 63327, -122399, -80030, 216628, 115582, -511178, -94255, 110033, 101255, -166595, 39955, -115346, 72929, -326559, -235033, -235030, -301665, -392987, -146243, 180565, 77809, 206831, -78924, -345324, -47821, 210809, -157663, -111772, -80978, -109519, -24846, 82469, -157127, 16228, -179229, -97130, -152303, -79234, -42048, -32769, 74959, 9632, -187950, -219291, 40405, 81585, -234794, -96333, -231, 88317, 310027, -82217, -1729, -189528, -324615]
19212c24615I5044m4277h7426A21633b7828A27705b13288e7692C57581c52594
19201G6079A8196a154k44584a8468k19890h6661D9563L3952J41570b41053L0883
19190b10170M0633j09994c1922A07059b90281A60595a86465B04267f2088j3366
19180g5454l09874A25128a10668D75864b45603A85564d4239k40566e1439A40324
19169a19226l90936a2124k51334j691g0000E7111b33784k0237K6000d8284Q869
19158c9415C5490f3332A49747C7496i6721k19977a53006B1672J07741L35089a20905
19146a73924f7755o7274j71295a07477j34035A3213e7323A39351a8754j34322
19136a53076J0324I2291r453P9791b00686A08643b48839C24284q3489G0873L8983
$$ y = [-324615, 95044, 50767, -87426, 121633, -27828, 127705, -213288, -57692, 357581, -352594, 76079, 18196, -1154, -245738, -18468, -238358, -86661, 49563, 83515, 225085, -241053, -210170, -169537, -279531, -31922, 107059, -290281, 160595, -186465, 204267, -62088, -75454, -385328, 125128, -110668, 475864, -245603, 185564, -44239, -284805, -51439, 140324, -119226, -510162, -12124, -263458, -265149, -70000, 57111, -233784, -254021, -228021, -48284, -39415, 35490, -63332, 149747, 37496, -96721, -316698, -153006, 21672, 129413, 464502, -120905, -173924, -67755, -135029, -306324, -107477, -241512, 13213, -57323, 139351, -18754, -153076, -142752, 92291, 82838, 162629, -200686, 108643, -248839, 324284, 240795, 70873, 109856]
19125A09856e42866I77K79036a30633f4004j06160O2292j14588d7627r4311k75570
19114d17508a40068j25897A8603a27847M2377c0814p043q216F9611a67439k56392
19103d23831g6971A97182b25930p674j49491B9383R1354a13766j17583d2807k52711
19092b95518d8715J2101j5325E4405h00599b3853B4308c9576o2904A6922c6668
19080a23673d3180A10741J11396e4552j85535A39388k3205a57176A23055J9621
19070A42676A2599O3067a24486q8701a3981A94777a37139B8120f4385r3340A59533
19058c0830m9251G3086h5968J7127D5683b00227I9030c00730F3682k607J38556
19047A99631a35025k89246B32653q8471a31704l4237B9698a76575e0771j45071
$$ y = [109856, -542866, 977, 280013, -130633, -64004, -170164, -107872, -222460, -47627, -141938, -417508, -140068, -265965, 18603, -127847, -85470, -30814, -37857, -46073, 69611, -167439, -423831, -76971, 197182, -225930, -233604, -383095, 29383, 120737, -113766, -231349, -42807, -295518, -48715, -36614, -51939, 54405, -800599, -23853, 24308, -39576, -102480, 16922, -36668, -123673, -43180, 110741, 222137, -54552, -240087, 139388, 116183, -157176, 123055, 142676, 12599, 75666, -124486, -213187, -13981, 194777, -137139, 28120, -64385, -157725, 159533, -30830, -80081, 73086, -85968, -68841, 45683, -200227, 99030, -300730, 63682, 61075, 199631, -135025, -424271, 232653, 144182, -131704, -165941, 29698, -176575, -50771, -195842]
19037a95842Q5927j67122J13885f8106B0329a74310a1498B81381I4231b28596
19026A42064a63184C6559K1558H603b5243l3662C21621R4696e7463p8655j2495
19015a48613n2466B7347M6524b24948g0055j58199H3085J24363I3502K51473h9076
19003b8146B3859h4663F0256a05231A5326g7092F6551b05214P478e8803D09584
18991g3840k34500A0040a3182A49041d9194B84823f5483A30157b9645q3541c7007
18979a17982j14129B19578J4155a17313n8467C9694f6522K1473B71805I301K49848
18968B59149f6661B19572k242b4749r7776d9833I3644A922P5490B9379a25271
18956c7879A7046a711k0832q4610j80339j9261Q7572A14143O0353b10594k5156
$$ y = [-195842, -109915, -277037, -163152, -68106, 20329, -174310, -11498, 281381, 94231, -228596, 142064, -163184, 36559, 58117, 8603, -25243, -58905, 321621, 416317, -57463, -136118, -148613, -201079, 27347, 73871, -224948, -70055, -228254, 83085, 207448, 93502, 344975, -89076, -28146, 23859, -84663, 60256, -105231, 15326, -77092, 66551, -205214, -197736, -58803, 409584, -73840, -308340, 10040, -13182, 149041, -49194, 284823, -65483, 130157, -29645, -113186, -37007, -117982, -232111, 219578, 233733, -117313, -175780, 39694, -66522, -45049, 271805, 9301, 259149, -66661, 219572, 217330, -24749, -122525, -49833, 93644, 1922, 77412, 29379, -125271, -37879, 17046, -1711, -22543, -107153, -287492, -306753, -219181, 114143, 174496, -210594, -235750]
18945b35750a4551k05764P2988N1906j55638n3200J30014A58049a60208n7826
18935b18034G627L10250a93096A05201a70007A19577b31612A79486c17760f3634
18924A26845f0122a5212o660A19333a75045A62725b42273A22742F0078k8871J71598
18913B02805d6895l55705d2255n0509k39307e9505A5491J4141L60351a00844B56878
18901b03532E0511a93535r2168H652c67319H4449L234a31194B05934A2361J55610
18890A67971b03287j25401d5739B02173a21997A65174q328i3500p7742b2520k89066
18879c11586g0271C65678a12772D63832B4075L8113a70226k1912q6991e5876j66832
18868b22708A95695a73986C2M678R0364d06992Q8392H7317g6849C57156c68272
$$ y = [-235750, -14551, -220315, -147327, -95421, -251059, -304259, -174245, 158049, -160208, -218034, 7627, 317877, -193096, 105201, -170007, 119577, -231612, 179486, -317760, -63634, 126845, -60122, -15212, -21872, 119333, -175045, 162725, -242273, 122742, 60078, 31207, 202805, -46895, -402600, -42255, -92764, -332071, -59505, 15491, 29632, 389983, -100844, 256878, -203532, 50511, -193535, -285703, 8652, -367319, 84449, 87683, -131194, 205934, 12361, 167971, -203287, -328688, -45739, 202173, -121997, 165174, 156846, -93500, -171242, -22520, -311586, -70271, 365678, -112772, 463832, 24075, 62188, -170226, -192138, -279129, -55876, -222708, 195695, -173986, 32, 4710, 95074, -406992, -318600, 87317, -76849, 357156, -368272]
18856A5340g1671D8382b72758e8338j50238I1066O0065b02038B39914j0447A08760
18844a81671A6572i2162a6592k52277B0119h7540I0303J23944b3859m5619H7478
18832a70798g5162j41030j24964f5817j30700A68477b9925B37879d37478P9828
18822c57650f8532A06745K48134a69484F8411J36355L4443P1921B0897J55558
18812A76455J93111j36575J47887j45115l9626o0792a33546C39506I4680A7991
18801D5651a11600j49374R1837g5163r6248m7182e6643o5997A90709b66194A02136
18789H5936a95053g1003A30255D6658N9553f6756A22632n6215h3097H5061C5794
18777A92433h1399A38592a79044j20054B31579h7438h753k53920h6623B41475
$$ y = [15340, -71671, 48382, -272758, -58338, -208576, 91066, 151131, -202038, 239914, 229467, 108760, -181671, 16572, -92162, -16592, -268869, 20119, -87540, 90303, 214247, -23859, -69478, 87478, -170798, -75162, -216192, -341156, -65817, -196517, 168477, -29925, 237879, -437478, -357650, -68532, 106745, 354879, -169484, 68411, 204766, 239209, 311130, 20897, 176455, 369566, 232991, 380878, 235763, 196137, 135345, -133546, 339506, 94680, 17991, 45651, -111600, -260974, -169137, -75163, -171411, -218593, -56643, -122640, 190709, -266194, 102136, 85936, -195053, -71003, 130255, 46658, 106211, -66756, 122632, 66417, -83097, 85061, 35794, 192433, -81399, 138592, -179044, -299098, 231579, -87438, -8753, -262673, -86623, 241475]
18766A16389b62028D6304L0952g1167N348j44189c7748j62391l3982D4087e0728
18754c17632A99656c89846D1736L6783a27607d2444A47631d0311Q056j72931G4740
18742D4335c3758C2715b39273J7886G7362J09028g797j26796l8744C36152d2374
18730g6635j6976A24711E2090a4978A02853K52539a00505p2872f840k34519A16524
18718b49042A12740i7393J4130m9973M2213j19868B18501A02591b86620d2482
18707b11903B06735A1941a9005A66c78595A83342a79458L5993N2881C1424e0124
18695A72261i2729H5853e2369d405C8580b70322N0250l5649k8585l2270C6201
18683A88123n960q9972i0610A35500m7369J03726B3172d524M02k60046g3183A48033
$$ y = [116389, -262028, 46304, 77256, -71167, -65819, -210008, -37748, -200139, -234121, 44087, -50728, -317632, 199656, -389846, 41736, 78519, -127607, -42444, 147631, -40311, -32255, -205186, 74740, 44335, -33758, 32715, -239273, -221387, 77362, 186390, -7797, -134593, -173337, 336152, -42374, -76635, -93611, 124711, 52090, -14978, 102853, 355392, -100505, -173377, -6840, -241359, 116524, -249042, 112740, -97393, -83263, -133236, -91023, -210891, 218501, 102591, -286620, -42482, -211903, 206735, 11941, -19005, 166, -378595, 183342, -179458, -143465, -90584, 31424, -50124, 172261, -92729, 85853, -52369, -4405, 38580, -270322, -220072, -255721, -284306, -316576, 36201, 188123, 182163, 92191, -90610, 135500, 88131, 191857, 23172, -4524, -4122, -264168, -73183, 148033]
18670a75848C538b23286P4517A1620a71935f459j13313A55252c9190P415l55068
18659c86843B4978L1430a18038D957J12349J50031d2229j6432j95164A2362a11697
18647i9352q9351j06701B00961f1995k8827m7030q9791M8029j4555n135B40782
18635A67265l1777J6198M2795b21139A16806a68238A6702J83239f4789I5690c8582
18623F9505a13550l4481E4631d28727l7737E5984c90185B4998E6c8124j6922k41552
18611b96598Q1044R4002p8863r2777c8998q2279n8477b1669j782m14882H463b59861
18598d39620A86482B8644b67829D1527A9727a34031d3595I4753f4060j73740J08531
18587a29269A1661J62761G2241a31266B64386a53076n4814R7391G29J37265A0272
$$ y = [-175848, 3538, -223286, -148769, 11620, -171935, -6459, -119772, 155252, -39190, -31775, -386843, 24978, 56408, -118038, 4957, 117306, 267337, -42229, -58661, -253825, 12362, -111697, -99352, -188703, -295404, 200961, -61995, -90822, -137852, -227643, -179614, -194169, -199304, 240782, 167265, 135488, 151686, 194481, -221139, 116806, -168238, 16702, 199941, -64789, 95690, -38582, 69505, -113550, -148031, 54631, -428727, -466464, 55984, -390185, 24998, 56, -38124, -55046, -296598, -215554, -121552, -200415, -293192, -38998, -121277, -179754, -21669, -23451, -438333, 8463, -259861, -439620, 186482, 28644, -267829, 41527, 19727, -134031, -43595, 94753, -64060, -237800, -129269, 11661, 174422, 72241, -131266, 264386, -153076, -207890, -110499, 729, 137994, 10272]
18575A05933l8310j1850a46744o8144K1804b1689n870I1934a74583A0115d21290
18563a17738B11073D3200K82778G2649a90445A68917n522e5867A4629Q6793b15592
18551f7170j10837h6509L6872r1830G5939a31938j42701A76837c02085b0339k67808
18540b88147H4192c49031H1430c60033i5792q4628l1847o4934A89491H2990d4849
18528b53120g5562r2649A19151b5082k710D1785c30403J16687A2409c74923a86962
18516B47042h0126L2379j20744A8352b06663A16241K1946F5207b27820I7385a33907
18504a48298A8939g6363C6288i5857j16730A22777N8502c19842B14874i4090C2727
18492G1001c36317a30841m01A4679i4892l2514c8185g158q9448p4853C52947A8867
$$ y = [105933, 67623, 55773, -146744, -214888, -193084, -21689, -27559, 91934, -174583, 10115, -421290, -117738, 211073, 43200, 325978, 72649, -190445, 168917, 163395, -55867, 14629, 101422, -215592, -67170, -178007, -86509, -49637, -141467, 75939, -131938, -274639, 176837, -302085, -20339, -288147, 84192, -349031, 81430, -360033, -95792, -180420, -212267, -277201, 189491, 82990, -44849, -253120, -75562, -168211, 119151, -25082, -27792, 41785, -330403, -213716, 12409, -374923, -186962, 247042, -80126, -47747, -168491, 18352, -206663, 116241, 138187, 65207, -227820, 97385, -133907, -148298, 18939, -76363, 36288, -95857, -212587, 122777, 181279, -319842, 214874, -94090, 32727, 71001, -336317, -130841, -131242, 14679, -94892, -127406, -38185, -7158, -96606, -171459, 352947, 18867]
18479a11363H4503A7059a79209c5529A03588O3840b85568K0074A27098J6331d7007
18467a14106o8161B61467a0421j45787j49213J02776A36964L8394a07805d799
18456c05528a04242e173F5651M0255f488n6591A3589J97451J38387a85293C02531
18444b33347Q9919L2889A82326J81750H947b70430C9368c2161A06494a30476R646
18433a20830j11162g0176p7013a4587j81989O0974q8334M1261B22719a19838l2456
18422a52294K3444M9721k18256J41856B11761M3829G3725K52614c29025I0411
18411G9705N9387L0306F3007c6216n5024D9769a2253j23636A44326a28733F2077
18399B22872h2455D8957J7006f1825p1787M2869C4167a35380D4929M8547a53833
$$ y = [-111363, 84503, 17059, -179209, -35529, 103588, 167428, -285568, -265494, 127098, 143429, -47007, -114106, -182267, 261467, -10421, -156208, -305421, -202645, 136964, 175358, -107805, -4799, -305528, -104242, -5173, 65651, 105906, -6488, -63079, 13589, 211040, 349427, -185293, 302531, -233347, -143428, -110539, 182326, 364076, 8947, -270430, 39368, -32161, 106494, -130476, -120830, -231992, -70176, -147189, -14587, -196576, -135602, -223936, -182675, 222719, -119838, -152294, -128850, -79129, -297385, -155529, 211761, 255590, 73725, 326339, -329025, 90411, 79705, 139092, 169398, 63007, -36216, -91240, 49769, -12253, -135889, 144326, -128733, 62077, 222872, -82455, 48957, 65963, -61825, -133612, -90743, 34167, -135380, 44929, 93476, -153833]
18387d58695A23847b95105A60407G922a64824k18712B09659i00j46414c8055d927
18375b709D2073f2887B11348i3052C4660a13538E0194N2652C7617J65859q4965
18364A18511a68260A09193J08112k5365d1110m56842B98055b8321B1282b10158
18353I3388C9914d0334A18285a19804j05026A53678e9807m6281r5008A86303D7876
18341A37969g1313A94774B4620j043f8520q5698C8776Q4179h9423c9826j19282
18330a59108A09662d40343I1366h2835J4110j91483a07731m5473A9005J22834
18320A41839e0170A002h8150K5161m5281A21892a33231b3976A69276k7255c06615
18308i9487k6912e217F5572d01290e2016B07411J34846E5938a20130L0028b5423
$$ y = [-458695, 123847, -295105, 160407, 7922, -164824, -383536, 209659, -900, -147314, -38055, -4927, -2709, 42073, -62887, 211348, -93052, 34660, -113538, 50194, 102846, 37617, 203476, 118511, -168260, 109193, 217305, 191940, -41110, -497952, 298055, -28321, 21282, -210158, 93388, 39914, -40334, 118285, -119804, -224830, 153678, -59807, -106088, -201096, 186303, 47876, 137969, -71313, 194774, 24620, 23577, -68520, -154218, 38776, 122955, -89423, -39826, -159108, 109662, -440343, 91366, -82835, -68725, -260208, -107731, -153204, 19005, 141839, -50170, 1002, -88150, -62989, -108270, 121892, -133231, -23976, 169276, 142021, -306615, -99487, -126399, -5217, 65572, -401290, -52016, 207411, 342257, 55938, -120130, -90102, -25423]
18296e6361E9075K16743C2734a35882p363b5796j30964f5539b4348A57583m4230
18285A13353b06849a3090A17141a53215M3166A82532C7455b11083g3141q8395
18275a61536q9350J05846O1735a3555k99779D6805a34028A37678f9372D97d7139
18263g5174l4838l93368J37493A87601E1752b43367j34949D7169j6918g2688A8016
18251b91716N4139o3809J4243A37837a90191l3719B9882b71364Q3136B4185a39587
18239c82336a27755A41401d14885G143b94101o0380g1378D22561d29141i9202
18228I945L3640R4595h7932A26044m8713R9079A4367a02833c2115I2287b24278
18216A53649a56839P6156q8097A56658n7566f1870A06962C8915K725a35928o8730
$$ y = [-56361, 59075, 275818, 32734, -135882, -143245, -25796, -156760, -65539, -24348, 157583, 113353, -206849, -13090, 117141, -153215, -110049, 182532, 37455, -211083, -73141, -161536, -250886, -145040, -83305, -13555, -313334, 46805, -134028, 137678, -69372, 497, -47139, -75174, -110012, -503380, -365887, 187601, 51752, -243367, -378316, 47169, 30251, -72688, 18016, -291716, -237577, -301386, -287143, 137837, -190191, -223910, 29882, -271364, -188228, 24185, -139587, -382336, -127755, 141401, -414885, 7143, -294101, -354481, -71378, 422561, -429141, -99202, 9945, 43585, 138180, -87932, 126044, 77331, 176410, 14367, -102833, -32115, 92287, -224278, 153649, -156839, -80683, -168780, 156658, 99092, -61870, 106962, 38915, 41640, -135928, -204658]
18205b04658B25067c6594j88445e5515J6560j95155A46002e0050l23543F8362
18194f50n1776c614H8254J7353J2730a34564A18759e2614A4620a10836C15409
18182c51554B8526b3179m35322g0076A81992a49416J4515A65209a01841o920C5127
18170A730b40657N8121h3349a1039A27946a34465N8759k85963b7633B4427c59511
18158B18902H5931k2469c17709P4218g0725o3091B40805O5068f5532E7293a21531
18146A82216b95797b3051C0836c37891h3774o4801c1176G4183b0692F9082O9895
18135A38977o5712a77357A90468q9096L63482a07301j23127R7082Q882E8657c36294
18123d4125B57524j0131E2452a02753D0839a61495k17428h5509k8897F7699K93439
$$ y = [-204658, 225067, -36594, -225039, -55515, -38955, -234110, 146002, -50050, -373593, 68362, -650, -52426, -3614, 88254, 105607, 118337, -134564, 118759, -52614, 14620, -110836, 315409, -351554, 28526, -23179, -458501, -70076, 181992, -149416, -134901, 165209, -101841, -108761, 35127, 1730, -240657, -182536, -83349, -11039, 127946, -134465, -75706, -361669, -27633, 24427, -359511, 218902, 85931, 63462, -317709, -243491, -70725, -133816, 240805, 305873, -65532, 57293, -121531, 182216, -295797, -23051, 30836, -337891, -83774, -148575, -31176, 74183, -20692, 69082, 138977, 73265, -177357, 190468, 101372, 464854, -107301, -230428, -133346, -124464, 58657, -336294, -44125, 257524, 247393, 52452, -102753, 40839, -161495, -378923, -85509, -114406, 67699, 361138]
18112C61138a01824n8691j19683a28661I129R447J77156a74617k80393b12831
18101e9733g773I2504a11445M3724p1596L7301A31231A6332P5596d4762r8629
18090a43391A13996c28044A7198a79356F3742a1604j81268j20211B77427p2572
18080B04855f4246A0340N7683P8006e7584o6577C0858d52372A68533B7228a32270
18068B44835A19316b14936h1800G0653e0811A44719c3193l10355g7980n8044l0313
18057a66337h0040C44093q7876b26112n7743I456h3842B07547a03191B44875b65799
18045A37959K47958A73627a49609q22C5768b7495j31839b1856o3974o3022A43923
18033E8914J13701B7610c27009a6179A93390a32752E481a58296I7077m4698b28235
$$ y = [361138, -101824, -160515, -280198, -128661, 9129, 18576, 195732, -174617, -455010, -212831, -59733, -7773, 92504, -111445, -67721, -139317, -102016, 131231, 16332, 91928, -44762, -143391, 113996, -328044, 17198, -179356, 63742, -11604, -192872, -313083, 277427, 204855, -64246, 10340, 68023, 146029, -57584, -124161, 30858, -452372, 168533, 27228, -132270, 244835, 119316, -214936, -81800, 70653, -50811, 144719, -33193, -343548, -77980, -136024, -166337, -80040, 344093, 256217, -226112, -283855, 9456, -83842, 207547, -103191, 244875, -265799, 137959, 385917, 173627, -149609, -150431, 35768, -27495, -159334, -21856, -85830, -148852, 143923, 58914, 172615, 27610, -327009, -16179, 193390, -132752, 5481, -158296, 97077, 52379, -228235]
18021C58301A2805a1682B77455o1363K3038b094D4342P1377b40097B32338d15607
18009C4547K37933b61288F0989b17505N6296H8690b95275d0091B95227A0689O1010
17998G1699h3826D6204f4251j18865F8013a73118e1595j45066E2909d8634A4495
17986B80670g1360A37676C4561F463a87589i606o4995b4567A21863a20870B62274
17974B7282Q1449a38203N6652a1696n5790j1866m5236A14640e9603A05686o255
17963I9431d30804G0422a09777l9877B08334c60421G3175b40371G4153a4220E2139
17951i8372E0663a6240k77579d7896b0125G7431a01487M8387B5292a3475j47985
17940a61460A15348m6113c24736B03983r7326J30382m977b22263c983C61314b54337
$$ y = [358301, 12805, -11682, 277455, 216092, 239130, -2094, 44342, 115719, -240097, 232338, -415607, 34547, 272480, -261288, 60989, -217505, -161209, 88690, -295275, -40091, 295227, 10689, 71699, -83826, 46204, -64251, -183116, 68013, -173118, -51595, -196661, 52909, -48634, 14495, 280670, -71360, 137676, 34561, 6463, -187589, -9606, -74601, -24567, 121863, -120870, 262274, 27282, 108731, -138203, -81551, -11696, -67486, -79352, -124588, 114640, -59603, 105686, 99431, -430804, 70422, -109777, -149654, 208334, -360421, 73175, -240371, 74153, -14220, 52139, -98372, 50663, -16240, -293819, -47896, -20125, 77431, -101487, -53100, 25292, -13475, -161460, 115348, 69235, -324736, 203983, 106657, 237039, 232062, -222263, -3983, 361314, -254337]
17928H3542b21469D02348A1068J02257b66858f9825m9892H0485h0287j8670A7565
17916b51124N9115A50141a26176N0435A50622l7765n0615K3725a94548j6107N910
17905b04745c5747D4206a42437j20851f2392G0823K00481g4692p1926b0615A36482
17893d5813F431K55460a48092O2813A04440e8365E3912a15266c8518A73748a82656
17881b10075f0082B27267b42929H2099a1067l69436i250m7827I1484J38160j03728
17870A25916O261J39192a48966c7196A8202a02325m0463A76170b70241o1067R3283
17859b38025R9243j34543d1866E1740a6251A0004b54318K9617C4223R1585a42200
17847H6328k9394J25655D8473g9001Q402g060B41809a88816d1114A22581C2444
$$ y = [83542, -221469, 402348, 11068, 113325, -266858, -69825, -119717, 80485, -80287, -98957, 17565, -251124, -192009, 150141, -126176, -75741, 150622, 112857, 62242, 85967, -194548, -210655, -204745, -35747, 44206, -142437, -263288, -62392, 70823, 271304, -74692, -146618, -20615, 136482, -45813, 6431, 261891, -148092, -85279, 104440, -58365, 53912, -115266, -38518, 173748, -182656, -210075, -60082, 227267, -242929, 82099, -11067, -380503, -9250, -57077, 91484, 229644, 125916, 132177, 271369, -148966, -37196, 18202, -102325, -142788, 176170, -270241, -331308, -238025, -138782, -273325, -41866, 51740, -16251, 10004, -254318, -224701, 34223, 125808, -142200, 86328, 56934, 182589, 48473, -79001, -70599, -7060, 241809, -188816, -41114, 122581, 32444]
17835a16325A6884c12177A20833d377D5117b86722D2829J61826d0268B28299A00000
17823A10309O3163C0794M7022J88891A06134C8956a85798A14203a17732I6039
17812B21038n1599f8641B31981j10639e4551B0246K41203a57540B38018j15161
17802A22857M5732c1628B2318i1331G7578B1613a39651a7020D35030f2187A22550
17790b5929D503i781e83l915n3392k19815c4695l1652C15584a1274C45696o1998
17778B83698d1134A53229g9405B12374G1023b88138G216J29282b15678H0981a48285
17766B16628D0599d85364a00291a046l700l01345B82978h9154C8125J95843d88332
17754E1183A2924a14652C2508J0477f8696j1574A85919O5096a77913A59013i4122
$$ y = [-116325, 16884, -312177, 120833, -4377, 45117, -286722, 42829, 204655, -40268, 228299, 100000, 110309, 173472, 30794, 77816, 266707, 106134, 38956, -185798, 114203, -117732, 96039, 221038, 169439, -68641, 231981, 121342, -54551, 20246, 261449, -157540, 238018, 122857, 168589, -31628, 22318, -91331, 77578, 21613, -139651, -17020, 435030, -62187, 122550, -25929, 4503, -9781, -583, -4498, -57890, -277705, -34695, -66347, 315584, -11274, 345696, 283698, -41134, 153229, -79405, 212374, 71023, -288138, 7216, 136498, -215678, 80981, -148285, 216628, 40599, -485364, -100291, -1046, -4746, -306091, 282978, -89154, 38125, 233968, -488332, 51183, 12924, -114652, 32508, 42985, -68696, -80270, 185919, 251015, -177913, 159013, -94122]
17742a02768B25254G9791b22185b8290B84872j30316j3687a27105n7830B83096
17731A73483B4820a05583E8139J61794p7207J9400b3266B14245b28913c121k51557
17720b54678B80937c886r309A53847a34640E4375h1920A94489O2624j3210a64526
17708a4755j23267k53122B6477b45735c6059r7916k29072h7078A467a21581B96551
17696d67887f0074I602a23612k28597N2461d4885E8713L18882j03519I619K3864
17685C3483a57690B28782E0828c28335B83115a7671D8046k1521b02843P399E8724
17673f4A34424L7453c5855r3691J8370B21814a88069C6060K12409a26483C5450
17661i4852A82080J04000a83678j65205J6167b9047F9610N0611a41761k06573
$$ y = [-102768, 225254, 79791, -222185, -28290, 284872, 154556, 140869, -127105, -184935, 283096, 173483, 24820, -105583, 58139, 219933, 142726, 162126, -23266, 214245, -228913, -3121, -254678, 280937, -3886, -13195, 153847, -134640, 54375, -81920, 194489, 257113, 243903, -164526, -14755, -138022, -391144, 26477, -245735, -36059, -133975, -363047, -87078, 1467, -121581, 296551, -467887, -60074, 9602, -123612, -352209, -299748, -44885, 58713, 377595, 274076, 9619, 33483, -157690, 228782, 50828, -328335, 283115, -17671, 48046, 26525, -202843, -195444, 58724, -64, 134424, 171877, -35855, -129546, -111176, 221814, -188069, 36060, 248469, -126483, 35450, -94852, 182080, 286080, -183678, -348883, -332716, -29047, 69610, 120221, -141761, -348334]
17651c48334A48783J59065A35873a71395g992j41211F603a51023F3376a86003
17640g5215r2838G0232a92438A89188m3619K395M2673b01857A41562a73811g1314
17628g3007A13084a9697G2867b17409C1710b1599j07534j45106h0442D1026J49787
17617A90813a36578A72443b39134A54799h8592j44104j5061K8216A59706K4706
17607A84412p8512Q0567K7676d5419G662a92727C42023a16641p6892D1591b05706
17595a43874n2542B48499K389A04637Q556b4971k8562D4556i3093J6673A9016
17583B60820J0132a41724A7331b88784f1641B86792D9734M91924c8736A21889
17572G8165e3654n2866l9224C07884L070a59310A6337F886L05197E3205J62652
$$ y = [-348334, 148783, 307848, 135873, -171395, -7992, -149203, 6603, -151023, 63376, -186003, -75215, -168053, 70232, -192438, 189188, 145569, 147964, 190637, -201857, 141562, -173811, -71314, -73007, 113084, -19697, 72867, -217409, 31710, -21599, -129133, -274239, -80442, 41026, 190813, -136578, 172443, -239134, 154799, -88592, -232696, -247757, -219541, 159706, 184412, 105900, 186467, 214143, -45419, 7662, -192727, 342023, -116641, -193533, 41591, -205706, -143874, -196416, 248499, 250888, 104637, 113193, -24971, -53533, 44556, -93093, -76420, 19016, 260820, 270952, -141724, 17331, -288784, -61641, 286792, 49734, 541658, -38736, 121889, 78165, -53654, -106520, -145744, 307884, 310954, -159310, 16337, 6886, 312083, 53205, 215857]
17561B15857h5610L4469j45848b8172j31628A6159d3633l2047j73773I3156a32138
17549A24794M5321g0841D47243a16026K4477b1568B93815K18685A7549c57787
17538B09623M8288e3611A4056k789J17371A8452J76776a9239B657a40033E7280
17526b5713C75691C4733J82415J41362J3237E4902a2022j37500C03007q3645b3879
17514A78462p2594c305k9425k83281D00750j37850D0291b3236j54995B28136J6494
17503B44630G5662J38949J304j829H6462L2145c6989J986A14655C4800a78257
17491B23056H2932o117J22268D6045J9549J05145a48136C68600b5936I4506l0449
17480F4057J66776d5313m8262A33225E0535M3613J46515j9507C0883F234J00178
$$ y = [215857, -85610, -51141, -196989, -28172, -159800, 16159, -43633, -75680, -249453, 93156, -132138, 124794, 170115, -70841, 447243, -116026, -91549, -21568, 293815, 512500, 17549, -357787, 209623, 257911, -53611, 14056, 11267, 128638, 18452, 195228, -19239, 2657, -140033, 57280, -25713, 375691, 34733, 217148, 358510, 371747, 54902, -12022, -149522, 303007, 219362, -23879, 178462, 105868, -3305, -32730, -316011, 400750, 262900, 40291, -23236, -178231, 228136, 244630, 75662, 214611, 215915, 214086, 86462, 118607, -36989, -35003, 114655, 34800, -178257, 223056, 82932, 76815, 199083, 46045, 65594, 170739, -148136, 368600, -25936, 94506, 64057, 230833, -45313, -93575, 133225, 50535, 94148, 240663, 221156, 30883, 6234, 106412]
17469A06412K23260E0663a44019n7202A20976k1905K37340D2985K20150c9280
17458E6390J15729J0259a63748g3345A86842h5867d1915H3530K12799H6605J45368
17447B31973K80813B03033h2384m7680A50187K46403g0979D40877A48370F1730
17436G8082J07959n2088N4732O8655h4572A06377b7561B61922C7357J31956K75050
17425D44363j08092J7204C746N52703h40m4725G4589J73799m591F1473L49615
17414D11088B2782K16088q7732P6502a28794c6932j51535H4314J0789b68186A73476
17402a98922A38358a5943A92458i0088n5312B28331I8715L9011J93711A54061
17391C62758j6798j65176Q0668E9598J28797n8112J04960G7745J46839d3192B0226
$$ y = [106412, 329672, 50663, -144019, -201221, 120976, 99071, 336411, 42985, 263135, -39280, 56390, 172119, 182378, -163748, -73345, 186842, -85867, -41915, 83530, 296329, 86605, 231973, 512786, 203033, -82384, -130064, 150187, 396590, -70979, 440877, 148370, 61730, 78082, 186041, 133953, 188685, 257340, -84572, 106377, -27561, 261922, 37357, 169313, 444363, 336271, 353475, 3746, 556449, -840, -45565, 74589, 248388, 243797, 61473, 411088, 22782, 238870, 151138, 227640, -128794, -36932, -188467, 84314, 95103, -268186, 173476, -198922, 138358, -15943, 192458, -90088, -145400, 228331, 98715, 137726, 331437, 154061, 362758, 345960, 180784, 261452, 59598, 188395, 130283, 235243, 77745, 224584, -43192, 20226]
17379A90224a03299A78513J76881A1569J78989I3512O7163n8357L08851E8276
17368a19601A46811h0024C42390a41684B01295e1629A99198c48900H381J43979
17358A52360K46114j24242e3863A99185a24602B58616p2804M8351f1395j9012
17348h0407H2216L35013a65193C03584A2325J58202J20555G2714K12078b5688
17337E1732f7844b7147k16586A77557k2870a19248B64636J80457r1219r7151J90795
17326D47518C2443O6746M6108c024B11599N400r9823A0207J42636J53871J68167
17315D74881k09436h0537a7864B86533b947D60803G4184c1275B05633J13880I0502
17303A39677j9406J12191F213J69480J93388A26216b2532D51002A95621D5844
$$ y = [190224, -103299, 178513, 355394, 11569, 190558, 93512, 160675, 102318, 411169, 58276, -119601, 146811, -80024, 342390, -141684, 201295, -51629, 199198, -348900, 8381, 152360, 398474, 274232, -53863, 199185, -124602, 258616, 185812, 234163, -61395, -80407, 82216, 417229, -165193, 303584, 12325, 170527, 291082, 72714, 284792, -25688, 51732, -67844, -27147, -243733, 177557, 154687, -119248, 264636, 445093, 353874, 256723, 447518, 32443, 99189, 145297, -3024, 211599, 216999, 117176, 10207, 152843, 306714, 474881, 265445, -80537, -17864, 286533, -2947, 460803, 74184, -31275, 205633, 319513, 90502, 139677, 120271, 232462, 6213, 175693, 369081, 126216, -22532, 451002, 195621, 45844]
17292F8491P1064d62351b660E32132F7596a16395A75109J28813B8446M9768a88877
17280A81353H9512h3107d289A53293B2790M00831A43476K9196P332K13705j86821
17269B06888p6943J4753C3952R5318k4718B8294c26711H9271A0198P1388l5003
17258D6583J90635d7439C59394j41177K40373e4462k33284B91429m7891j1664
17248B31874a68871B38632O5150b18451B8739K1404P4385j9930c8526j45015c9005
17236B865J53K44481J0887a79006B00344a53984D40924A10594a50134D5683a2629
17224C44477A20335L2792c55711A90039A2925J53862o0042Q8359o2302K59476
17214C92278p6537A21243E5928J13962i8973K6437A39099J42726j22749a4546
$$ y = [68491, 139555, -462351, -2660, 532132, 67596, -116395, 175109, 303922, 28446, 78214, -188877, 181353, 89512, -83107, -4289, 153293, 22790, 423621, 143476, 172672, 180004, 393709, 206888, 129945, 144698, 33952, 129270, 104552, 28294, -326711, 89271, 10198, 81586, 46583, 237218, -47439, 359394, 218217, 458590, -54462, -287746, 291429, 243538, 231874, -168871, 238632, 303782, -218451, 28739, 50143, 124528, 104598, -38526, -183541, -39005, 2865, 3018, 247499, 258386, -179006, 200344, -153984, 440924, 110594, -150134, 45683, -12629, 344477, 120335, 153127, -355711, 190039, 12925, 166787, 106745, 195104, 132802, 392278, 315741, 121243, 55928, 169890, -98973, -72536, 139099, 281825, 159076, -14546]
17203B64620o1647K6453J75561K00533A76265J27282a56419D30690j36128j16417
17193A78145P3498N864l1018K53641J16038B88438j41699O5042R4933J06392a189
17181D92711A09179a27699A63639c8583D9975J35302O8932h4348A49632O1955
17171B11587J5931J26210j56854I3301J53977Q581n3250O993h3141B97735j01927
17160A95808J37084A5656L45857A41804l3664N6949K64092B06787K75197a5684
17149B51693j13348J12279J18519o3598K24227r4461H3558K29050A07144R1759
17139A98903B1422L70621K1006j45873J23890p8973n5797J7737K40994A50575
17128B05777K64293a07608C31008L5782E0158L23566A29207B5920L70337j03882
$$ y = [264620, 202973, 229426, 404987, 605520, 176265, 303547, -156419, 430690, 294562, 178145, 251643, 257507, 226489, 480130, 596168, 288438, 146739, 211781, 306714, 413106, -1189, 492711, 109179, -127699, 163639, -38583, 49975, 185277, 254209, -84348, 149632, 211587, 227518, 353728, 196874, 93301, 247278, 255859, 202609, 209602, -83141, 297735, 195808, 332892, 15656, 361513, 141804, 108140, 165089, 429181, 206787, 481984, -15684, 251693, 138345, 250624, 369143, 305545, 529772, 435311, 83558, 312608, 107144, 198903, 21422, 392043, 413049, 267176, 391066, 312093, 256296, 274033, 515027, 150575, 205777, 470070, -107608, 331008, 366790, 50158, 373724, 129207, 25920, 396257, 292375]
17118B92375o2124J5855R1905J80221k49829J31763j23873p38c460B75747J14170
17107C89917k4704J46738Q9129p4730B25121Q5948J02J47397a4271D45234A82250
17095A43634K08128A14962L06025l4238q5607R5872N9461A80169J23511D6994
17084B38724K23911g745G1909M40425l2743B15400l0370P6622A08508M74046j15405
17073D67149J54245B27636k5017K19157P6088J26740j56820q2097j02792M426
17063B87321J0709K06754A87190K94030m414J18433J7253j01988n6785k141N1698
17052E03276l8952o7120j49661L39267r9242G3999L04793J86891A67311j1473
17042A55838J62408J13594J03993R618j63642J38727j81622J28614J05475J18371
$$ y = [292375, 230251, 246106, 338011, 518232, 268403, 400166, 276293, 275555, -3460, 275747, 389917, 365213, 511951, 601080, 526350, 225121, 311069, 311171, 458568, -14271, 445234, 182250, 143634, 351762, 114962, 420987, 386749, 301142, 397014, 456475, 180169, 303680, 46994, 238724, 462635, -7745, 71909, 512334, 479591, 215400, 185030, 261652, 108508, 582554, 467149, 621394, 227636, 202619, 421776, 497864, 624604, 467784, 385687, 282895, 287321, 298030, 504784, 187190, 481220, 476806, 595239, 612492, 510504, 453719, 451578, 503276, 464324, 397204, 247543, 586810, 487568, 73999, 378792, 565683, 167311, 155838, 318246, 431840, 535833, 545451, 381809, 520536, 338914, 467528, 573003, 691374]
17032F91374k92191j44304l8027L34649j30182J36734j66548A77008F4466K16406
17022B80872n053J45133J69441n8838J14623k23987L85191l29848R8370K65450
17012H41354l46896K2183p6368B19281L20178P5560k5638k32796O2797L352J90643
17001F13377j37214K61710j22864L72289l49765q9790n2522J00631p3364M47548
16991I70036j61595j93753K68984C29754N12665l70648J18553B72207N41862J17061
16981I31130k71274j58241L31379o3403Q8521j50192l28343N05501j4174m14840
16971D56064O06621D97718J38812L34925j16232j12554K29186m51614L3393J58730
16961G12364K4057l15918K42102j26842J07609K33644k66240P3831R1007j68957
$$ y = [691374, 399183, 254879, 216852, 551501, 421319, 558053, 391505, 177008, 64466, 280872, 275819, 420952, 590393, 531555, 646178, 422191, 807382, 477534, 575904, 841354, 494458, 516641, 440273, 219281, 539459, 615019, 589381, 356585, 419382, 422734, 613377, 476163, 737873, 615009, 987298, 637533, 547743, 495221, 595852, 522488, 970036, 808441, 614688, 883672, 329754, 842419, 471771, 590324, 272207, 814069, 931130, 659856, 501615, 832994, 769591, 858112, 707920, 379577, 885078, 870904, 456064, 1062685, 497718, 636530, 971455, 855223, 742669, 971855, 520241, 553634, 712364, 736421, 420503, 662605, 535763, 643372, 877016, 610776, 684607, 775614, 606657]
16951F06657N11409k1617j11921k17705Q542K78057j49204j89427j21925J80912
16941G73778J59180M365k20381J06865R7170J91873j72294Q1080D94266N87878
16931A082144k99757M73985k58759k35950O2444J76036J56448N1164Q1787l03902
16921I85640M04696l64581K9048J72874j97929k0888N082J29260R3268k53634
16911I82836N7562O7858j40611L89639p0432j7708l5621q8137K65437r3857j42839
16900A174127O6641p222L53414l65087J34672j18602M10652k21573K12638l58736
16890A280924K95576k23356K08634p3344j41866K34522j04167L53484k77458M91029
16880B043978p59880M10837K14630j97396K17163j21702k11806M29436j29031
$$ y = [606657, 1118066, 1096449, 984528, 766823, 775365, 1053422, 904218, 714791, 592866, 773778, 932958, 937323, 716942, 823807, 920977, 1112850, 940556, 1021636, 494266, 1082144, 782387, 1256372, 997613, 761663, 824107, 1000143, 1156591, 1207755, 1289542, 985640, 1390336, 1025755, 1054803, 1227677, 1029748, 1008860, 1013942, 1143202, 1236470, 982836, 1040398, 1108256, 967645, 1357284, 1286852, 1269144, 1233523, 1145386, 1410823, 1316966, 1174127, 1240768, 1233546, 1586960, 1221873, 1356545, 1237943, 1648595, 1427022, 1639660, 1280924, 1576500, 1353144, 1561778, 1488434, 1346568, 1581090, 1476923, 1830407, 1552949, 2043978, 1284098, 1694935, 1909565, 1712169, 1929332, 1807630, 1595824, 2025260, 1896229]
16871A896229k9977K45121j05871k73957J77159J39500J47134j25746l98086N83532
16861B255038j1362J7350J11278l03502K92549q9318N6574L27130l21095K3778
16851B358420K68693J41613l2434j11170n9868J25349J0260J63413k49866M55448
16841C069858j03512R6236L43240k53969J31752k05768M21317j78823p1737q5994
16831C162600J25188L95414j62957J74139o3167L36611n4144o934L76160k03729
16821D079181K13436k21003L88489K07743k03603n9160J91463K64204R8345L6892
16811D995987l4746M0513J28305L89986k24578J49384J14111K55134M00781j47652
16801F067225K73603J44728J51847K66970r0342L57406p7305L61153j7414O23761
$$ y = [1896229, 1866252, 2111373, 2005502, 1731545, 1908704, 2048204, 2195338, 2069592, 1671506, 2255038, 2243676, 2261026, 2372304, 2068802, 2361351, 2272033, 2328607, 2655737, 2334642, 2358420, 2627113, 2768726, 2736292, 2625122, 2565254, 2690603, 2700863, 2864276, 2614410, 3069858, 2966346, 3062582, 3405822, 3151853, 3283605, 3077837, 3499154, 3320331, 3248594, 3162600, 3287788, 3683202, 3520245, 3694384, 3631217, 3967828, 3913684, 3906750, 4282910, 4079181, 4292617, 4071614, 4460103, 4667846, 4464243, 4405083, 4596546, 4860750, 4959095, 4995987, 4961241, 5001754, 5130059, 5520045, 5295467, 5444851, 5558962, 5814096, 6214877, 6067225, 6340828, 6485556, 6637403, 6904373, 6814031, 7171437, 7094132, 7455285, 7437871, 8061632]
16791H061632j1680L51553K3489r8701M13026J38642N96801p1610O67270J46632
16781A0217054k1482N59829K75151K87025L69018L05675N80739K67172N80650
16772A3420831P98654p0743L93231Q89358M37683O41687M20827O15434P33514
16763A8280476Q07695O88494O78516R06280R95757O78258J373544J002321R28034
16754B6339375J429458J187959J542188J207765J721536J567530J942210J909980
16746C8848001K206902K073504K942504K095130K656387L498734L198088L638955
16738F1158205L816985L764947M300677M920780M898426N569813O042633N862474
16730A00334940O912925P015640P058628P689831P566938P471050Q020549P206809
$$ y = [8061632, 8049952, 8401505, 8424994, 8326293, 8739319, 8877961, 9474762, 9403152, 10070422, 10217054, 10195572, 10755401, 11030552, 11317577, 11686595, 11992270, 12573009, 12840181, 13420831, 14219485, 14148742, 14541973, 15431331, 15869014, 16510701, 16931528, 17546962, 18280476, 19088171, 19776665, 20455181, 21361461, 22357218, 23035476, 24409020, 25411341, 26339375, 27768833, 28956792, 30498980, 31706745, 33428281, 34995811, 36938021, 38848001, 41054903, 43128407, 46070911, 48166041, 50822428, 54321162, 57519250, 61158205, 64975190, 68740137, 73040814, 77961594, 82860020, 88429833, 94472466, 100334940, 107247865, 114263505, 121322133, 129011964, 136578902, 144049952, 152070501, 159277310]
16722A59277310P128619O181539N279349M090643K980219J809758n51850j179673
16714A85015914l046069m342189n127212o393070p147748p387242p648440q039405
16706A35884539p833000p318276p585735p600596o288177o167082o178555n503433
16698H1409685n047985m586785m507426m214225l832574l433260l391626k852086
16690D9543718k676200k820874k397794k290728k309593j420449j684695k019006
16682C1924379j481480j468418j335944j350369j320207p69871j016893j122326
16674B2058871q07426q19240j364994m80130o95783q52007o23785l90354o21772
16665A5403380q22687l55287j65685j086852j40598k90282o47831n7846l59899
$$ y = [159277310, 166405929, 172587468, 177866817, 181957460, 184937679, 186747437, 186195587, 185015914, 181969845, 177627656, 172500444, 166107374, 158959626, 151572384, 143923944, 135884539, 128051539, 120733263, 113147528, 105546932, 99258755, 93091673, 86913118, 81409685, 76361700, 71774915, 67267489, 63053264, 59220690, 55787430, 52395804, 49543718, 46867518, 44046644, 41648850, 39358122, 37048529, 35628080, 33943385, 31924379, 30442899, 28974481, 27638537, 26288168, 24967961, 24198090, 23181197, 22058871, 21251445, 20432205, 19067211, 18587081, 17891298, 17039291, 16415506, 16025152, 15403380, 14580693, 14225406, 14059721, 12972869, 12832271, 12541989, 11894158, 11836312, 11476413]
16656A1476413n15456m57258r3805p37383K25697m92720n40132k3498m30882j79149
16646H231827k49777m16142J8630J89003k83020l88491k65558k01316J65k87673
16636F347648o2837l66922j67990r6073L5999j95827k00728j36082L0625m31719
16626D756094J86390m83017L13376l10639N2204j25571j01441l46860l7754j18879
16616C783903j51713J03578l91798J04803J90945M4009j69913J46217j21552k35925
16606C302554J57256r2710P4923q01769K00565j47630l7724q8320M9155N7451
16596B673751K6445n4335p2014K50402m08376J23914J53096n70764N20263k49151
16586B393231k08339P1065K1821l2272j62077l3538O8301j67591J18136j67985
$$ y = [11476413, 10960957, 10503699, 10409894, 9672511, 9898208, 9405488, 8865356, 8841858, 8410976, 8231827, 7982050, 7565908, 7584538, 7773541, 7490521, 7102030, 6836472, 6635156, 6635321, 6347648, 6284811, 5917889, 5749899, 5653826, 5689825, 5493998, 5293270, 5157188, 5187813, 4756094, 4942484, 4459467, 4772843, 4462204, 4514408, 4388837, 4287396, 3940536, 3902782, 3783903, 3632190, 3735768, 3343970, 3448773, 3639718, 3683727, 3513814, 3660031, 3538479, 3302554, 3459810, 3367100, 3442023, 2640254, 2840819, 2693189, 2655465, 2567145, 2616300, 2673751, 2700196, 2645861, 2573847, 2824249, 2415873, 2539787, 2692883, 2122119, 2642382, 2393231, 2184892, 2255957, 2277778, 2245506, 2083429, 2049891, 2118192, 1950601, 2068737, 1900752]
16576A900752o4475j68862k3869K80520l45544J57798m6633j36397M64036n14074
16566A503252j38842J76059l9115j91732Q4373J2934M1491K78212k9071J896l40953
16555A358504k71622Q1320J95673K99101k80202R2356k52994K6733l9738o8386
16545A140745K60476Q4486J4987k64818k31015R8511l3079j28962J96165J81468
16535A318964l14219k97545M73743J81869m34403R7350k65585L73262m7802l44213
16525G41421K48088p1312L3675j84282K71065j35037N2163J24910q6459M9102
16515A043334l07905K55202J6180k08814p072K12619k19972j8368K15431k27328
16505G53307n9258L82546l47046k50591J67385j44077L95834j49328j17203j53799
$$ y = [1900752, 1836277, 1667415, 1643546, 1924066, 1578522, 1736320, 1689687, 1553290, 2017326, 1503252, 1364410, 1540469, 1501354, 1309622, 1393995, 1406929, 1448420, 1726632, 1697561, 1699457, 1358504, 1086882, 1168202, 1363875, 1662976, 1382774, 1475130, 1222136, 1248869, 1209131, 1140745, 1401221, 1485707, 1500694, 1235876, 1004861, 1103372, 1070293, 941331, 1137496, 1318964, 1004745, 707200, 1180943, 1362812, 928409, 1025759, 760174, 1133436, 1085634, 741421, 989509, 918197, 951872, 767590, 1038655, 903618, 955781, 1080691, 994232, 1043334, 735429, 990631, 1006811, 797997, 790925, 1003544, 783572, 765204, 980635, 753307, 694049, 1076595, 729549, 478958, 646343, 502266, 898100, 748772, 631569, 477770]
16495D77770j15807P5535K76648o9175M55910l84822o4136j03033J29529J99291
16485H77710B68374K80638J3867J08804p5289K3349j74969m4J90820J99688l28389
16474E06849j94199K90680R6087k16639K08608k32111k17706L64533p6792J47817
16464F77127L2729H6084M71316q6121J1536j32932Q0745j05967J55704K85047
16454G65412l48140J56636j97583m2391A47726K76629j0310J34008k05628L4955
16444C77380p2878L3890r7480O32534D35013F5305L97108k6149J36909j23916
16434D49257J39760j76704j27032J76918j53825J38226N6672j50526p0458n0616
16424B31672J60284P4294G0868d4363B62153K98325B59156o5968L67968A53059
$$ y = [477770, 361963, 437498, 714146, 644971, 1100881, 716059, 651923, 548890, 678419, 877710, 268374, 549012, 562879, 671683, 596394, 619743, 444774, 444730, 635550, 835238, 506849, 312650, 603330, 699417, 482778, 691386, 459275, 241569, 606102, 529310, 677127, 709856, 86084, 557400, 471279, 482815, 349883, 430628, 324661, 480365, 765412, 417272, 573908, 376325, 333934, 147726, 424355, 414045, 548053, 342425, 377380, 304502, 338392, 240912, 873446, 435013, 65305, 462413, 436264, 573173, 449257, 589017, 412313, 285281, 462199, 308374, 446600, 503272, 352746, 282288, 231672, 391956, 466250, 70868, -44363, 262153, 560478, 259156, 193188, 561156, 153059]
16413D25886B09782L0382k5487j9299K77172p0095p4045O0436P0034A69013o8537
16402A00476O5379J52993N4534A44167J38757J63984e6858C38158J54301B28132
16391B17389O0797A5979M34197j08708l3445j13298K6525M500I3107J51828K5277
16380B70212n6560K4761L0306C749K74988L30845A62932c04250C37290l7353J82367
16369D82304o0769j74144o634J13319g1311o1674c9588H6422K55602j01245K04574
16358D45353a74675B34352j15261L77832F0301j8499J53404M742L0023J24329
16348C54300p4282K41570A20361n8999J22724g648B15635G7337K08899b19390
16337A59878a2199B20475a74154C52776j51994q8381l3167o700c8224A85989L513
$$ y = [425886, 209782, 240164, 214677, 195378, 472550, 402455, 328410, 388846, 458880, 169013, 100476, 165855, 318848, 373382, 144167, 282924, 446908, -56858, 338158, 492459, 228132, 217389, 278186, 15979, 450176, 341468, 308023, 194725, 221250, 225750, 93107, 244935, 270212, 213652, 238413, 268719, 3749, 278737, 609582, 162932, -304250, 337290, 299937, 482304, 421535, 247391, 240757, 354076, -71311, -132985, -39588, 86422, 342024, 240779, 445353, -174675, 234352, 119091, 496923, 60301, 41802, 195206, 199948, 229971, 354300, 280018, 521588, 120361, 61362, 184086, -7648, 215635, 77337, 286236, -219390, 159878, -12199, 220475, -174154, 352776, 200782, 112401, 79234, 72534, -38224, 185989, 189502]
16326A89502G7066A4829Q5091J01880P5031J72479A03406a11832a7188C53988
16315B1393J50211a20000A85391J8901C1834L7456P7022K18392L846j7161j29294
16304B22095r7634R0900k2452J0448N8488e6070l3018i724C21680q2857r2828
16293A45995e8399C1820J66701a59850C84649F2919J30356K59206A38780n0070
16283H8710N2098L24851A02166k8346J48972N1092A20534a9629j14833F3210P694
16272G0904K549J47582b95726c7000a3561j11531D17463J42328B05481p0713J55938
16261B90706e1502A16331d5085j00213A07932j6059L15367b13488c0305j88603
16251b18908R4745j2898A45975Q9974m2782F6856B4835g5599D46666J986c13318
$$ y = [189502, 77066, 14829, 99920, 201800, 276831, 449310, 103406, -111832, -17188, 353988, 21393, 171604, -120000, 185391, 204292, 31834, 69290, 146312, 364704, 368550, 351389, 222095, 124461, 215361, 192909, 203357, 261845, -56070, -89088, -9724, 321680, 238823, 145995, -58399, 31820, 198521, -159850, 384649, 62919, 193275, 452481, 138780, 88710, 140808, 465659, 102166, 73820, 222792, 273884, 120534, -19629, -134462, 63210, 70904, 73453, 221035, -295726, -37000, -13561, -125092, 417463, 559791, 205481, 134768, 290706, -51502, 116331, -45085, -145298, 107932, 91873, 407240, -213488, -30305, -218908, -124163, -137061, 145975, 235949, 193167, 66856, 24835, -75599, 446666, 448652, -313318]
16239c00187B21921b82685G0432a67313A09450P5817b22435d9334k30350Q0555
16229a99129D0261J57563a11642r9365F1326J07697h7027B3107a03083A03506
16218b95190A6558J39477j7835F3019k2550i4530k7528H2049J11720O1353hE0618
16205A39956L8406d4302A42557j2221K32338D4524J04794D0408J12526b4827I5855
16193d5817C55018a25314A74083O8163A6213K9387K33806c32309b9646m3371A04632
16181D05613G4147a99121F47126b69783B77176a52217p9005b7058E8605a09489
16170a28735e6458A41303e4632A39329n109a21474E8604M8846H616L3339j1937
16159C0018h4830A2709b56005j60481A01250M3598d8549G1628a87519g3202A20800
$$ y = [-300187, 221921, -282685, 70432, -167313, 109450, 185267, -222435, -49334, -279684, -199129, 40261, 197824, -111642, -211007, 61326, 169023, -87027, 23107, -103083, 103506, -295190, 16558, 156035, 138200, 63019, 40469, -94530, -122058, 82049, 193769, 255122, -8, 50618, 139956, 178362, -44302, 142557, 130336, 362674, 44524, 149318, 40408, 152934, -24827, 95855, -45817, 355018, -125314, 174083, 242246, 16213, 45600, 279406, -332309, -29646, -73017, 104632, 405613, 74147, -199121, 647126, -269783, 277176, -152217, -231222, -27058, 58605, -109489, -128735, -56458, 141303, -54632, 139329, 134220, -121474, 58604, 107450, 8616, 41955, 30018, -84830, 12709, -256005, -416486, 101250, 144848, -48549, 71628, -187519, -73202, 120800]
16147a48420M4601K5392a0548F9814j0841k4431g9734L6949C9053a91825O3453
16136a28372B46796i5983B7675e4243k19940a02765M3414b0195D56088C5743c12730
16124C6294N2842J08063d68586a56567Ed2029E1168i0425L293B91372a03961A51207
16111B2035K9549P9743D8498J8361f4049C5142b63941B76744f9508H8423N1176
16100A39599o5613B9669J87332C8940Q6944b96671A22439N2104c4590k1965E3828
16088A08716b69227H575a2562F5641J17761a60866F1737L70240a79363o8804i2504
16076a60673j30474C54937b54008J13289j09884k9040a00038A86097j2079J61495
16066C35513C2072O0670a06772N1821J1708A62475d1319I7638D1096j5499K8645
$$ y = [-148420, -103819, -78427, -10548, 69814, 58973, 34542, -79734, -42785, 39053, -191825, -128372, 246796, -95983, 27675, -54243, -274183, -102765, -59351, -20195, 456088, 35743, -312730, 36294, 89136, 197199, -468586, -156567, 5, -42029, 51168, -90425, -87132, 291372, -103961, 151207, 22035, 51584, 131327, 48498, 66859, -64049, 35142, -263941, 276744, -69508, 88423, 139599, 73986, 29669, 217001, 38940, 125884, -296671, 122439, 174543, -34590, -56555, 53828, 108716, -269227, 8575, -12562, 65641, 183402, -160866, 61737, 431977, -179363, -248167, -92504, -160673, -291147, 354937, -254008, -140719, -250603, -279643, -100038, 186097, 174018, 335513, 32072, 92742, -106772, -54951, -43243, 162475, -41319, 97638, 41096, 25597, 54242]
16055E4242c49796C34113A65346a61882l78279B31561o6985a68202N7471A30813
16044b53463B1276J16953R1869A344b93713G17b17783D7215d57258J50089A73162
16032a37699m7282o6606h9809a4636j67516k6896L209A98704a03153a5792C9941
16020a60552A24209a78518A88322I1797D1102c7915J1602B58850g723r7954G1663
16008A81623p7504K7188N8121f6338j47639E2757J58800b92660I2026d2688k2793
15997f5481r6210P6305K4838n9095N1690H7220b0145B888J5487J09811a29456
15985I3421k6684L0893K88242A88725j2660j384D4533J17707o8814J58790c36951
15973C29892A04941L3178d09375h50B3161R8275J56377A32042D7767C955J25418
$$ y = [54242, -349796, 334113, 165346, -161882, -540161, 231561, 164576, -168202, -110731, 130813, -253463, 21276, 138229, 230098, 1344, -293713, 717, -217783, 47215, -457258, -307169, 173162, -137699, -184981, -251587, -89809, -14636, -182152, -209048, -205839, 198704, -103153, -15792, 39941, -160552, 124209, -178518, 188322, 91797, 41102, -37915, -26313, 258850, -7723, -105677, 71663, 181623, 104119, 131307, 189428, -66338, -213977, 52757, 211557, -292660, 92026, -42688, -65481, -161691, -85386, -60548, -119643, -67953, 87220, -20145, 2888, 18375, 128186, -129456, 93421, 66737, 97630, 385872, 188725, 176065, 174681, 44533, 162240, 93426, 252216, -336951, 329892, 104941, 138119, -409375, -850, 23161, 121436, 277813, 132042, 47767, 3955, 129373]
15962A29373e571A12003d20259A33611a09854C1769K6163E174K2228a05475A2961
15950d52202g0000B5823K73094j2206F3872g1015C7467h3361L4884k51318A33205
15938H7309f8984j03863A09416a37935A46015a94426a3348A00968C7378i9937
15927a63254C9862J53609n7112a12153A20231c23499J44961j8563c2386B3237
15916d6130H4156d1477L299C0215b2177A50574a93205j20782a12922J1990I1131
15904G3177i6626A40604a36708M708A1776d7217b1927I1026f8272b8328A0244
15892B30053b38369A49273B0484J9651d23192a16435p6045k3773A63853J63006
15882C26859G577J60494J3342A6068e5054G5434k2113j0570b63358f5776p8263
$$ y = [129373, -5571, 112003, -420259, 133611, -109854, 31769, 57932, 5174, 27402, -105475, 12961, -452202, -70000, 25823, 298917, 286711, 63872, -71015, 37467, -83361, -48477, -299795, 133205, 87309, -68984, -172847, 109416, -137935, 146015, -194426, -13348, 100968, 37378, -99937, -163254, 39862, 193471, 136359, -112153, 120231, -323499, -178538, -197101, -32386, 23237, -46130, 84156, -41477, -38178, 30215, -22177, 150574, -193205, -313987, -112922, -100932, 91131, 73177, -96626, 140604, -136708, -132000, 11776, -47217, -21927, 91026, -68272, -28328, 10244, 230053, -238369, 149273, 20484, 40135, -423192, -116435, -192480, -216253, 163853, 326859, 7577, 168071, 181413, 16068, -55054, 75434, 53321, 42751, -263358, -65776, -144039]
15871a44039j16686A30662c28581k3132a30173r3466h6633E2677d7323j32343
15861a79666A91177E5434B3129e1038k28708a17768j63251J18408J3926o8026
15851b16711B14443f4606I7430f103k26327A00864a07425k0644n2892r9225A78284
15839h7235j3049j05371R599B64735D7349K14358f993C9819a66037A6032a01405
15827a13297j580A66578c19955a4353I8326c55270a59403f329j486E6037A2697
15815b73436K5802F9598b49550J17580e2207J733j60428A14217a84262g7947o685
15804h4632A01377J41466a5496j22550E0619a72556g2396B85391k2761I3519a06962
15792b20968b9542l22954a36598n1944N2975B32092b8793A17955C1463i0672k34436
$$ y = [-144039, -260725, 130662, -328581, -351713, -130173, -223639, -86633, 52677, -47323, -179666, 191177, 55434, 23129, -51038, -279746, -117768, -281019, -162611, -148685, -216711, 214443, -64606, 97430, -6103, -232430, 100864, -107425, -128069, -180961, -280186, 178284, -87235, -100284, -205655, -196056, 264735, 47349, 261707, -6993, 39819, -166037, 16032, -101405, -113297, -114877, 166578, -319955, -14353, 98326, -355270, -159403, -6329, -7815, 56037, 12697, -273436, -247634, 69598, -249550, -131970, -52207, -50474, -210902, 114217, -184262, -77947, -84632, 101377, 242843, -15496, -138046, 50619, -172556, -72396, 285391, 262630, 93519, -106962, -220968, -29542, -352496, -136598, -188542, -135567, 232092, -28793, 117955, 31463, -90672, -325108]
15781c25108J1696J07682F2794b62693a7191j5034I0c17337A61115a11314B14568
15769a13499c8996l0109B26926N1021a06034j8262K3459j88574C10005a74391
15758a79569A61103B0344B125M7198b73896b4456A06014C0676b6679q2134q9437
15747a98250O4940A51249f151B8612Q3590J2103Q3259b36868i6648H6263P0404
15736A56667L0994c29222A72443m5241E3355g8933j12868o972R1303b1912j42060
15725a63972g4204m2576k35443Q115d874I6175N4278b27170q3977A17444a82259
15713c832l99757C4695J62990f4283B61399a7224n2895G4185l1097D594a26452
15701B4384J85078f1265A08947B3017b2523j8218D2891A5653a85241C22100j49342
$$ y = [-325108, -313412, -205730, 62794, -262693, -17191, -32225, 90, -317337, 161115, -111314, 214568, -113499, -38996, -69105, 226926, 277947, -106034, -124296, -100837, -289411, 310005, -174391, -179569, 161103, 20344, 2125, 49323, -273896, -24456, 106014, 30676, -26679, -108813, -198250, -133310, 151249, -6151, 28612, 112202, 124305, 207564, -236868, -96648, 86263, 156667, 187661, -329222, 172443, 127202, 53355, -78933, -191801, -198773, -107470, -21912, -163972, -74204, -116780, -352223, -344108, -4874, 96175, 150453, -227170, -311147, 117444, -182259, -3832, -403589, 34695, 197685, -64283, 261399, -17224, -70119, 74185, 43088, 4594, -126452, 24384, 209462, -61265, 108947, 23017, -22523, -40741, 42891, 15653, -185241, 322100, 172758]
15690A72758K28825a71226A05882a28107b0086p4338J9647o9767H128c23344B55475
15678A09699a20629K1220A24386b54633D00702j34252J134e8878B19968a11481
15667e5623A07488h7292C29559a0884k13562g3175D3612B1406K2179Q6374F3646
15655B68472i7738l7198I0458c4941A91442b45203L6932A83407C5561b3463E8351
15643a03806m04301a6532n582n6552f70k24752c4604j33238A03306J193b51434
15631b04246B5481h3393k99226J67412a04219A06897c7405C95391d4945M453B3365
15619B11317r9539a62194m1992H9370a07765d6377b47A753L70163C0597O75L6762
15607F8034P971c12105e1152K2161A25652f3005B5153b28757k9443A87063j3905
$$ y = [172758, 401583, -171226, 105882, -128107, -20086, -94424, -74777, -144544, 8128, -323344, 255475, 109699, -120629, -99409, 124386, -254633, 400702, 266450, 267584, -58878, 219968, -111481, -55623, 107488, -87292, 329559, -10884, -224446, -73175, 43612, 21406, 43585, 129959, 63646, 268472, -97738, -134936, 90458, -34941, 191442, -245203, -208271, 183407, 35561, -23463, 58351, -103806, -508107, -16532, -22114, -78666, -670, -225422, -34604, -167842, 103306, 104499, -251434, -204246, 25481, -83393, -382619, -215207, -104219, 106897, -37405, 395391, -44945, -40492, 23365, 211317, 111778, -162194, -204186, 89370, -107765, -46377, -247, 1753, 371916, 30597, 31272, 68034, 76005, -312105, -51152, -28991, 125652, -63005, 25153, -228757, -258200, 187063, 173158]
15596A73158a09810d4231H6906b60701A98327H1436e8659B9154a16910A37808
15585f5217k38701G9616K9492D508a058k14409g9243F97248I5213c91420A5791
15573a2726I9872J302K0167b5365A76008a4125D5448M1311K84140b37513A68036
15561h9867D25330b33184j0457B61452a02784A37653j0396a52465m4707m843P7964
15550a24051n7665B87272j25267B9231d7596c060A13981N9990c53024Q0316A15331
15538b1611n7512j40606B14261d7548l4367p6189g7260n3370A63331B59b83488
15526G9639M4084h9873H0482B8673J30133D9206a64263F4072a26751j14070a8483
15514A73405a62483I9262E874K31286a5521B9550a7088L139F3755b81987c2795
$$ y = [173158, -109810, -44231, 86906, -260701, 198327, 81436, -58659, 29154, -116910, 137808, -65217, -303918, 79616, 109108, 4508, -1058, -215467, -79243, 697248, 95213, -391420, 15791, -12726, 99872, 101174, 121341, -25365, 176008, -14125, 45448, 86759, 370899, -237513, 168036, -89867, 425330, -233184, -243641, 261452, -102784, 137653, 127257, -152465, -197172, -202015, -124051, -181716, 287272, 162005, 29231, -47596, -3060, 113981, 173971, -353024, -272708, 115331, -21611, -79123, -219729, 214261, -47548, -81915, -158104, -77260, -130630, 163331, 259, -283488, 79639, 123723, -89873, 80482, 28673, 158806, 49206, -164263, 64072, -126751, -240821, -18483, 173405, -162483, 99262, 5874, 237160, -15521, 29550, -17088, -13949, 63755, -281987, -32795]
15502d0150D63896a63947j3266B69271b2769G741K6129b81452R0495L9692B3722
15490e09028B3948b3140D4206a38428E4903a66093B11294b48289C0329L8113O398
15479G4840C6344a31809B5669a2181k87122B25200r2643b6546E8878J1950a67625
15467b40263g5375D4348c33993A75198J8515F4430a06135p200L9256J1923C47700
15455a106C6121b04725K8797h0005n363H9339J79455h0643a5461j32378j17479
15444b65318f0352A34000o5888a12487G3989h1574l806m2688k6528H9931h1549
15432H2991M1109B0415P6009g2682r4081C60150j44836E0220a41957f5834k00682
15421b66516C9572c96335c7661A39195a72822C6104b8374A56404K8624g2727C0938
$$ y = [-40150, 463896, -163947, -177213, 269271, -22769, 7741, 33870, -281452, -190957, -151265, 23722, -509028, 23948, -23140, 44206, -138428, 54903, -166093, 211294, -248289, 30329, 68442, 74840, 36344, -131809, 25669, -12181, -299303, 225200, 132557, -26546, 58878, 70828, -167625, -240263, -75375, 44348, -333993, 175198, 193713, 64430, -106135, -113335, -74079, -62156, 347700, -1106, 36121, -204725, -175928, -80005, -85368, 89339, 268794, -80643, -15461, -147839, -265318, -60352, 134000, 68112, -112487, 73989, -81574, -85380, -128068, -154596, 89931, -81549, 82991, 124100, 20415, 96424, -72682, -166763, 360150, 215314, 50220, -141957, -65834, -266516, 39572, -396335, -37661, 139195, -172822, 36104, -28374, 156404, 185028, -72727, 30938]
15409A45930b8689p5031b9550H8178j3978b19878k5057A78431a02906L8614l50549
15398d14841A05967b47951a12694B10207b65906a06709F7361M197b551A16367
15387i4501c008C3034C913J61456J70987r2390a4411l3636J0610j82429h3523
15375B138b00998j45665A99370I6829J02823B3540a57395A58681d06876P4715
15365c32161I4711K20062a03430A82538f813k7647l28893Q2997C6988J18484a67174
15353i4674D35374A07727C2466D197J14015J1827a56128j91525I4389e1187K0961
15342c0226l6071L1583F032J89583m40g4768a1366j12831r6859B10222c69731
15330D5102J12607i410E0845j9587R9940P9197F7989K667J36768Q9682h1598a3500
$$ y = [145930, -28689, -103720, -29550, 88178, 74200, -219878, -244935, 178431, -102906, -64292, -414841, 105967, -247951, -112694, 210207, -265906, -106709, 67361, 71558, -2551, 116367, -94501, -3008, 33034, 3913, 165369, 336356, 243966, -14411, -48047, -37437, -219866, -83523, 2138, -200998, -346663, 199370, 96829, 199652, 23540, -157395, 158681, -406876, -332161, 94711, 314773, -103430, 182538, -6813, -34460, -363353, -280356, 36988, 155472, -167174, -94674, 435374, 107727, 32466, 4197, 118212, 130039, -156128, -347653, 94389, -51187, -30226, -66297, -34714, 6032, 195615, 195175, -74768, -11366, -124197, -221056, 210222, -369731, 45102, 157709, -9410, 50845, 31258, 131198, 210395, 67989, 70656, 207424, 297106, -81598, -13500]
15317A03784b4456n8082A03062J47423C0551J97002g8750r3059k48122l2775b25079
15305G7729J94450D1897J98825m1621E5966K14034J48809b76748e959B28216B6134
15293A43492a76318K9795B92080c26338e3668C65350i7278M4180l03911J23639
15283b33370E7437P8458b72570I09e2431B28538A04286P5948R6125j0693A06306
15271I4217R559j7216N1978L4091b50872A86176a2963A63468J14639o8121K48956
15260D58942q1264F5272P5510e1386A13124k9666i3568L7472A42476b4469B41054
15248C03614N11387P52581n05407K65379j84368D15390I5795K80875c91251J92798
15238a98453A52890K54772j10370G1381g2953A16130J01684I7837e903G3385a85790
$$ y = [103784, -24456, -82538, 103062, 250485, 30551, 227553, -78750, -171809, -419931, -452706, -225079, 77729, 272179, 41897, 240722, 199101, 55966, 270000, 418809, -276748, -5959, 228216, 26134, 143492, -176318, -146523, 292080, -326338, -53668, 365350, -97278, -53098, -357009, -233370, 57437, 135895, -272570, 909, -52431, 228538, 104286, 180234, 276359, 265666, 106306, 94217, 103776, 86560, 138538, 172629, -250872, 186176, -12963, 163468, 278107, 209986, 458942, 377678, 65272, 140782, -51386, 113124, 83458, -93568, -56096, 142476, -24469, 241054, 303614, 815001, 1567582, 1062175, 1327554, 1143186, 415390, 95795, 376670, -391251, -198453, 152890, 407662, 297292, 71381, -72953, 116130, 217814, 97837, -5903, 73385, -185790]
15226a01257A90980a10228H1671L383J71102L6724m9477i0779l3790p2097F3020
15214b14953c4644I3675a90281C60493c51595A56997a03293M4641A22155a19460
15203b788C48663A30369B490J02348R9069l6023C9381J81572d9732G7445a37310
15191A39076E3128a96915D8966a05011D6883g8524J4502r3880A02242D7177b05973
15179f0473K0803B31109B8407e31458A82616d2605I2042a71709j1799C2839j359
15168C1480J24173f4117a7466j49894C20001a03653k1132N0259B77498b9594k0327
15157d9921G3252a21810C85640E3547f8878A44023o7707a20772C09480b6055j7045
15146d3100A08806M9623n2908m2549k8222b01164A55989B0061Q51M5852h5234
$$ y = [-101257, 190980, -110228, 81671, 85054, 256156, 292880, 243403, -90779, -124569, -196666, 63020, -214953, -34644, 93675, -190281, 360493, -351595, 156997, -103293, -58652, 122155, -119460, -2788, 348663, 130369, 2490, 104838, 203907, 167884, 39381, 220953, -49732, 77445, -137310, 139076, 53128, -196915, 48966, -105011, 46883, -78524, -64022, -157902, 102242, 47177, -205973, -60473, -39670, 231109, 28407, -531458, 182616, -42605, 92042, -171709, -183508, 32839, 31480, 155653, -64117, -17466, -167360, 320001, -103653, -124785, -74526, 277498, -29594, -49921, 73252, -121810, 385640, 53547, -68878, 144023, 76316, -120772, 309480, -26055, -43100, 108806, 158429, 105521, 62972, 34750, -201164, 155989, 20061, 20912, 66764, -85234]
15134H5474a83169A69626b44269B93400j17546b78535A10268a14847B76552m143
15124B72409c9821k70206A476J04674m0337h3012H5367d4883H2721k4489g158
15112B90625G0265J64481G2389L0856g0649k6650j5018k65161C12963a00805C72700
15100A18822d0277A15320J63038p9000b53323B78119F0045R8222K04817b62992
15089A16304J54173a26449A02582J2572K06842G11d5626A17717E2087J44235D4441
15077C56178f9919J9570A81174K38181j58109p7376F819K71768i83k6692B11365
15065a07132A89548J72074j47883C8916a86165A38875J20252k1656A12989K45290
15055C58279g8214B47676B7325L50754a36725A37791R7516a23890C11130j08579
$$ y = [85474, -183169, 169626, -244269, 293400, 175854, -278535, 110268, -114847, 276552, 272409, -39821, -310027, 1476, 106150, 65813, -83012, 85367, -44883, 82721, 58232, -7158, 290625, 70265, 234746, 72389, 103245, -70649, -97299, -112317, -377478, 312963, -100805, 372700, 118822, -40277, 115320, 278358, 199358, -253323, 278119, 60045, 158267, 363084, -262992, 116304, 270477, -126449, 102582, 115154, 321996, 711, -45626, 117717, 52087, 196322, 44441, 356178, -69919, -50349, 181174, 419355, 261246, 183870, 6819, 278587, -983, -27675, 211365, -107132, 189548, 361622, 213739, 38916, -186165, 138875, 259127, 237471, 112989, 358279, -78214, 247676, 27325, 378079, -136725, 137791, 235307, -123890, 311130, 202551]
15045B02551i5612D85267B0061J19445J23244J7871j29895D8093O2545E2582Q7707
15034A40289L6465b7265C23637j54937Q3805q6656n060B8352a27305A45180N3604
15023A98784Q3396L56344D5487L29029j13302L04462b5617C34234J885A06958
15012A92240G3573P6267b3756D96271j33929A23748J13898I0937k5147J92262
15002B58052C3025g523D33820C59K69083A19149e2561b5888j28604B99430O13
14991C00043j0214a7556A24586J270K14144L9265j08140A29524k9005N2622J30382
14980B83523m5567J37069A57034Q6580F5496a7236D90891A98448L05958k36162
14970B68244p7503A7913c8792C18058P6536A32084K22758q1093K25848A55090
$$ y = [202551, -95612, 485267, 20061, 139506, 262750, 280621, 150726, 48093, 110638, 52582, 140289, 176754, -27265, 323637, 168700, 252505, 165849, 160789, 28352, -127305, 145180, 198784, 282180, 638524, 45487, 374516, 261214, 565676, -25617, 334234, 336119, 106958, 192240, 73573, 149840, -23756, 496271, 362342, 123748, 237646, 90937, 65790, 258052, 33025, -7523, 433820, 359, 269442, 119149, -52561, -25888, -154492, 299430, 300043, 289829, -17556, 124586, 125856, 340000, 379265, 271125, 129524, 100519, 153141, 283523, 237956, 375025, 157034, 243614, 65496, -17236, 490891, 198448, 504406, 268244, 190741, 17913, -38792, 318058, 394594, 132084, 354842, 273749, 499597, 155090]
14959D50303j85801k5834L7623L3669j40929J70606D0120J99618E6527a21650
14948C62407H9937K57952K4309g546A42153m8575J00247H9684J13450a81376B07823
14936A63365J98975M7282B00991B5675N46832B29246o6078c4234D73411B01501
14925g107A36977j1586F0789j1836J37151E7466J1928J67926F1560L22430J44165
14914E28155j94966f8208D34202A20330O3383P1278q5278K65697A38653b7154
14903C89961k2093j5731d0088D91154k19992j16397Q2951p9389J75281M5366A18057
14891D60846B21632l47H5641K98431j62210J83580j78374J63568J72479j04653
14881D58462A61098O2361J40236p6299J03763G7325M06596A43922b0925A29671
$$ y = [450303, 264502, 238668, 276291, 309960, 169031, 339637, 40120, 239738, 56527, -121650, 362407, 89937, 347889, 372198, -7546, 142153, 93578, 193825, 89684, 203134, -181376, 207823, 163365, 362340, 409622, 200991, 25675, 572507, 229246, 163168, -34234, 473411, 201501, -7107, 136977, 125391, 60789, 48953, 186104, 57466, 69394, 237320, 61560, 383990, 528155, 333189, -68208, 434202, 120330, 183713, 254991, 169713, 435410, 138653, -27154, 389961, 367868, 352137, -40088, 491154, 271162, 154765, 237716, 158327, 333608, 378974, 118057, 460846, 221632, 221285, 85641, 384072, 221862, 405442, 227068, 390636, 563115, 458462, 161098, 223459, 363695, 287396, 391159, 77325, 483921, 143922, -20925, 129671]
14870D78139j60422O3587K59279j36227B20308J10669m8113A39894L50917B01360
14859B91865K11069B08575m0673P4089O3435J15124p5072j30176K85856B21204
14848A86672L86706j58032A94079K30961N1113k37403J74910A57708M33133A20441
14837C60556M91304j48759C41586K73209r9167k8482j27073A63369K55798q7497
14827C31670L67305B90682j10123L43976J04938A85477N3655M23865B40273J83229
14817D23502j35310D7123a79672D20987J90649j61723J09797j98094l8750L8915
14807C61781A51782O09688A73651Q1J92588j50919P2250k9678j4937N56525k35327
14796E64234j94298J91830k75784R9624A67180M88503B45704K34212j56602O2117
$$ y = [478139, 317717, 381304, 640583, 504356, 220308, 330977, 282864, 139894, 490811, 201360, 291865, 502934, 208575, 167902, 241991, 305426, 420550, 345478, 215302, 501158, 221204, 186672, 573378, 415346, 194079, 425040, 476153, 238750, 413660, 157708, 590841, 120441, 360556, 851860, 703101, 341586, 614795, 515628, 487146, 360073, 163369, 419167, 331670, 698975, 290682, 180559, 524535, 629473, 185477, 239132, 662997, 240273, 423502, 288192, 47123, -179672, 420987, 611636, 449913, 559710, 361616, 322866, 361781, 151782, 761470, 173651, 173732, 366320, 215401, 287651, 257973, 243036, 799561, 564234, 369936, 561766, 285982, 385606, 167180, 655683, 245704, 479916, 323314, 385431]
14786C85431J63547q446A35000Q3621g277E62996B28449L2049K73504n3993L7877
14775E17886j07596M23286k68303Q009n4023p9772L1660R500p2127L48711l47834
14764D09397O4518j14127M04361k58158j17245N3186O6552k06830O2347L8639
14754D02640j26083P5727J91728M22011k93245k38055J85854K19881j97772n0929
14744E91757J15019q5205K16556C51497K76308j26917J27280j62448L42979k64925
14734E43774L61071m01495L9390L144r3998j28774M33637B91590J59453L24479
14724G75522p510C46918L13872l6585K30438k01180j26692P6393J47579k55473
14714D95270N6012J93460J79459k25797k80349L05017O9955K18840m35277P7332
$$ y = [385431, 548978, 540532, 135000, 218621, -7277, 562996, 228449, 260498, 534002, 480009, 517886, 410290, 833576, 565273, 573282, 519259, 439487, 471147, 480647, 408520, 757231, 409397, 473915, 359788, 764149, 505991, 388746, 441932, 508484, 301654, 364001, 402640, 276557, 352284, 544012, 966023, 672778, 434723, 620577, 840458, 642686, 591757, 706776, 621571, 838127, 351497, 627805, 500888, 628168, 465720, 808699, 543774, 904845, 503350, 542740, 545884, 451886, 323112, 756749, 291590, 451043, 775522, 768012, 346918, 660790, 624205, 854643, 653463, 526771, 603164, 750743, 495270, 551282, 744742, 924201, 698404, 418055, 723072, 793027, 1011867, 576590, 653922]
14704F53922K3333r8605K00186J26296J05495l32059q7853L72084l23913K08435
14694H47321l27468M8051M87894j98487l40847L55464K7750l32125J35992K94253
14684I97798l49143j28656K90762K12826m54264k11706N86592r526j78962j26718
14674F29003k72640N82852j16074j77685J43024N49601o40206Q0864M2036J67163
14664I87938l34914M23129j89404o179j05980J49106D61524M20095N3048j32333
14654H02334K28220p8384J06504l60446N21587Q4231o21439K45580J62288k54656
14644H35819p9273J46621K2647K18979J7163j85400J82746j71421J83810j1377
14634A160314k93032k8543N08559n99087K66397R5766j9131L8509r3769J85022
$$ y = [653922, 677255, 578650, 778836, 905132, 1010627, 678568, 590715, 962799, 638886, 847321, 519853, 567904, 1055798, 857311, 516464, 871928, 899678, 567553, 703545, 997798, 648655, 519999, 810761, 1023587, 569323, 357617, 944209, 934683, 755721, 629003, 356363, 939215, 823141, 645456, 788480, 1338081, 697875, 778739, 820775, 987938, 653024, 1076153, 886749, 880570, 774590, 923696, 461524, 881619, 934667, 802334, 1030554, 952170, 1058674, 698228, 1219815, 1304046, 682607, 928187, 1090475, 835819, 756546, 903167, 925814, 1144793, 1161956, 976556, 1159302, 987881, 1171691, 1160314, 867282, 838739, 1347298, 748211, 1014608, 1110374, 1091243, 1129752, 1035983, 1221005]
14624A221005m5206j94544O2682L01083k17557l2572J03874K57864m53424j40589
14614H62616L80995l9297r4315m66794N29218O3706k67983J57673L00297l16123
14604A109993L0090L30195j04481l1844Q6400j22663K37323P2397k8222q4411
14594A494777k50948R1926J71205m6109k6339Q7808k87949L57044M6490q6442
14584A551463J87812l904k33487N51832o5892j24970k92466Q4840R8938p5100
14574A679066K65374k98066J93961N2827j62533J32746j09690R6154k4375J21224
14564A946688J24281k53937L45143j456P7302K87868m7401K27465l60995M09957
14554B754915K40551K06286Q4976N82229Q69654J730021M128634Q423940J5987102
$$ y = [1221005, 1175799, 981255, 1043937, 1345020, 1127463, 1094891, 1198765, 1456629, 1003205, 862616, 1243611, 1204314, 1109999, 643205, 1172423, 1236129, 968146, 1125819, 1426116, 1109993, 1140083, 1470278, 1365797, 1333953, 1420353, 1297690, 1535013, 1607410, 1579188, 1494777, 1243829, 1335755, 1506960, 1460851, 1434512, 1522320, 1234371, 1591415, 1637905, 1551463, 1739275, 1735371, 1501884, 2053716, 1987824, 1862854, 1570388, 1655228, 1754166, 1679066, 1944440, 1646374, 1840335, 1893162, 1730629, 1863375, 1753685, 1849839, 1825464, 1946688, 2070969, 1817032, 2162175, 2160719, 2238021, 2525889, 2478488, 2705953, 2344958, 2754915, 2995466, 3201752, 3286728, 3868957, 4738611, 6468632, 10597266, 19021206, 35008308]
14545C5008308P411445A9136005I443634C720414j026775r08933m79089O20741
14537A926358m48373L54314m48280M32027j22645L94723j78687j63159K97520
14528B043798P1737p446j42470m10332L31331J07896k8393K9477K97253m61424
14518A831427L61220j41320J85397l98798K54149K88314m69443J58060K4591J33563
14508B227160J72552O7271j92670J64280k7954J02812k48136J18343J62800K9642
14498B576100K59842j97064J64593k24077q4861M83712p4643J33020n33619M32224
14488B935227l5653L9314O0973J17947K4187j93357k0067J20458j58270j32011
14478B758748M08353k44779L52155o9031K70477k11944K40991J93758k3881k07966
$$ y = [35008308, 42419753, 19136005, 9443634, 3720414, 2693639, 1784706, 1305617, 1926358, 1477985, 1832299, 1384019, 1816046, 1693401, 2088124, 1909437, 1746278, 2043798, 2115535, 2108089, 1965619, 1555287, 1886618, 1994514, 1966121, 1995598, 2292851, 1831427, 2192647, 2051327, 2236724, 1837926, 2092075, 2380389, 1910946, 2069006, 2093597, 2227160, 2399712, 2466983, 2274313, 2438593, 2410639, 2513451, 2265315, 2383658, 2546458, 2576100, 2835942, 2638878, 2803471, 2579394, 2494533, 2978245, 2903602, 3036622, 2503003, 2935227, 2899574, 2938888, 2999861, 3117808, 3141995, 2948638, 2928571, 3049029, 2890759, 2758748, 3167101, 2922322, 3274477, 3205446, 3475923, 3263979, 3504970, 3698728, 3674847, 3466881]
14468C466881J27975m6431L64972l65403R2862J1694J71233L22301l98930P78902
14458D526056p58428K42300K35246j28904J6750j31121O86819n43059q1791L82033
14448D445901P0023r3081l4613L04744J51003j56463K96214P0471L7466J15841
14438E207506L2649J97352m45333L92274K2933K48660J80330O6550n8214k13564
14428E631143J68499K86775k79530K50216K45499j74712K57520q6339P14715n95421
14418F418365J70764K59428K50936K9418K7530N0900K18884l00312N95593J02404
14408G823910O0336L23731k09422K56671j85924K88943m8111K99852M63612k75342
14398H798256N82382L1502k0570j56136M56968M38257o2926J20401N99339k21652
$$ y = [3466881, 3594856, 3548425, 3913397, 3547994, 3640856, 3652550, 3823783, 4146084, 3747154, 4526056, 3767628, 4009928, 4245174, 4116270, 4133020, 4001899, 4688718, 4145659, 4063868, 4445901, 4515924, 4422843, 4388230, 4692974, 4843977, 4687514, 4983728, 5054199, 5091665, 5207506, 5240155, 5437507, 4992174, 5384448, 5407381, 5656041, 5836371, 5902921, 5844707, 5631143, 5799642, 6086417, 5806887, 6057103, 6302602, 6127890, 6385410, 6299071, 7013786, 6418365, 6589129, 6848557, 7099493, 7128911, 7156441, 7207341, 7426225, 7125913, 7721506, 7823910, 7884246, 8207977, 7998555, 8255226, 8069302, 8358245, 8310134, 8609986, 9073598, 8798256, 9380638, 9412140, 9391570, 9235434, 9692402, 10130659, 10067733, 10188134, 10787473, 10565821]
14388A0565821J93464J96420J31860L47311K93757J02010N10442j6037K09058
14379A2534106L82843J20560r5708M16687K67517K41153Q0498N62670Q6060L77723
14369A4974109M32235J84631M73479J59998N32116M09855q0858O73756K43345
14360A8002666N37712L82165N33973M34348M47389M29862L15064O24074N90578
14351B2297831L38782R56354M55613L78844M02823J000650M84922N24299J039427
14342B7879545N67397J219951M33336O87414Q97053Q42047R66887P78222J215299
14333C5487151J078891J271467J181416J185795J734071R79952J090680J650147
14325D5659570J881502J145463J854127J858673J655356K259058J809373K570080
$$ y = [10565821, 10759285, 10955705, 11087565, 11434876, 11728633, 11830643, 12341085, 12325048, 12534106, 12916949, 13037509, 12941801, 13358488, 13626005, 13867158, 13947656, 14510326, 14596386, 14974109, 15406344, 15590975, 16064454, 16224452, 16756568, 17166423, 17085565, 17759321, 18002666, 18540378, 18922543, 19456516, 19890864, 20338253, 20768115, 21083179, 21707253, 22297831, 22636613, 23592967, 24048580, 24427424, 24830247, 25830897, 26315819, 26840118, 27879545, 28446942, 29666893, 30100229, 30787643, 31684696, 32526743, 33493630, 34271852, 35487151, 36566042, 37837509, 39018925, 40204720, 41938791, 42918743, 44009423, 45659570, 47541072, 48686535, 50540662, 52399335, 54054691, 56313749, 58123122, 60693202]
14317F0693202K047571K303523K867421K319886K639482L262441L191645L273956
14309H2599127L927812L943877L404413M394635M438426M617152N674082N321317
14301A18320841N626603O086755O643510O877868P446641P749038Q670866Q419506
14293A75841628R285063J0151091J0514932J1139929J1963136J2086473J3270965
14286B54253217J3546044J4104705J4467900J4962021J5095842J5227192J4520439
14279C56177360J4843871J3627435J2714675J1666057R980854Q004182M993823
14272D32008257J100410j154199k110571j354353j525993m421649q023422j0374183
14264D04144297j1908987j3640069j4605243j5105694j5389988j5430891j5019980
$$ y = [60693202, 62740773, 65044296, 67911717, 70231603, 72871085, 76133526, 79325171, 82599127, 86526939, 90470816, 93875229, 98269864, 102708290, 107325442, 112999524, 118320841, 123947444, 130034199, 136677709, 143555577, 151002218, 158751256, 167422122, 175841628, 185126691, 195277782, 205792714, 216932643, 228895779, 240982252, 254253217, 267799261, 281903966, 296371866, 311333887, 326429729, 341656921, 356177360, 371021231, 384648666, 397363341, 409029398, 419010252, 427014434, 432008257, 433108667, 431954468, 429843897, 428489544, 426963551, 422541902, 414518480, 404144297, 392235310, 378595241, 363989998, 348884304, 333494316, 318063425, 303043445]
14257C03043445j4909059j4858161j3669371j2554493j2889676j1985456j1753937
14250B10423292j1235672j0069709r631227r108360q715084p866842p277012p114769
14242A39404617p279538n761160o290191n570575m902454m427015n042349m490722
14234I5640613m294241l742665l609999k682648l439618l185938k857851k904113
14226F8923540k658983k579583k147462k386300k056185j737205j880456j904969
14218E1572397j769254j710532j576950j284966j224734j432694j436078j282277
14210C9854912j104859j112354r72912n90317j098247j614993l83271j493564
14202C1484395q74225n30460n87344j051933n95381r01281o17076q82716j84565
$$ y = [303043445, 288134386, 273276225, 259606854, 247052361, 234162685, 222177229, 210423292, 199187620, 189117911, 179486684, 170378324, 161663240, 153796398, 146519386, 139404617, 132125079, 126363919, 120073728, 114503153, 109600699, 105173684, 100131335, 95640613, 91346372, 87603707, 83993708, 81311060, 77871442, 74685504, 71827653, 68923540, 66264557, 63684974, 61537512, 59151212, 57095027, 55357822, 53477366, 51572397, 49803143, 48092611, 46515661, 45230695, 44005961, 42573267, 41137189, 39854912, 38750053, 37637699, 36664787, 36074470, 34976223, 33361230, 32977959, 31484395, 30610170, 30079710, 29492366, 28440433, 27845052, 26943771, 26326695, 25443979, 25259414]
14193B5259414o67085o35840p51827m74569m44911o84455o81666m34188k80253
14184B0204620n28492l08391p56858k44495r3122l79051m94990n24291l78174
14175A6496756l62739m55562j00273l55223k75797k35573l25879l43267r6354
14166A3946089l56376j73514m05340m89051K24806j52176m46771k10960j03588
14157A1833119m14777j6164m7661j50692m38299j84204j66753k52623k68205o4241
14147I829500J24693m12732K04016n32291R895k60738l18550j74957K13047k64402
14137H417481j95700k11919Q0017J07827j64245N9225l03610j60230l5009k70814
14127G323023o5309j22521P8889l04844j99095k1069K27414J37256n66536j11412
$$ y = [25259414, 24592329, 23956489, 23204662, 22730093, 22285182, 21600727, 20919061, 20484873, 20204620, 19676128, 19367737, 18610879, 18366384, 18273262, 17894211, 17399221, 16874930, 16496756, 16134017, 15678455, 15578182, 15222959, 14947162, 14711589, 14385710, 14042443, 13946089, 13589713, 13416199, 13010859, 12521808, 12746614, 12594438, 12147667, 11936707, 11833119, 11418342, 11402178, 11354517, 11203825, 10765526, 10581322, 10414569, 10161946, 9893741, 9829500, 9954193, 9541461, 9745477, 9213186, 9223081, 8962343, 8643793, 8468836, 8681883, 8417481, 8221781, 8009862, 8089879, 8197706, 8033461, 8092686, 7789076, 7628846, 7593837, 7323023, 7257714, 7135193, 7214082, 6909238, 6710143, 6689074, 6916488, 7053744, 6487208, 6375796]
14117F375796j70716J35002n6777k1214k1291j97992j66959K27291o25916N06157
14107E983381l46582l29007K18315l44439P6360M1817K30446j63953n08043K33210
14097E091505k23213m6102o9662m7327q5087j57437M71416l24892L07673m30042
14087D486832j38729K94617j23181k88026m3250j90939L75605l1336j23964J39546
14077D357175j43681k99091K84510j94716m9917J55413k74866Q3165j4802o6188
14067C837002N5746j63600k22254J19164j93588K95829l48819O5108K81640m68401
14057C257827K42670r0800K40302j92218r6959j28107K56356j01146l50836j8709
14047C018380J3164j1499m50116J69562J50507R5410m6427j69948K19804n14195
$$ y = [6375796, 6205080, 6340082, 6283305, 6262091, 6240800, 6042808, 5875849, 6103140, 5477224, 5983381, 5636799, 5307792, 5526107, 5181668, 5258028, 5299845, 5530291, 5366338, 4858295, 5091505, 4868292, 4822190, 4752528, 4705201, 4620114, 4462677, 4934093, 4609201, 4916874, 4486832, 4348103, 4642720, 4519539, 4231513, 4188263, 3997324, 4372929, 4341593, 4217629, 4357175, 4213494, 3914403, 4198913, 4004197, 3954280, 4109693, 3834827, 3917992, 3903190, 3837002, 3892748, 3729148, 3506894, 3626058, 3432470, 3728299, 3379480, 3444588, 3726228, 3257827, 3500497, 3409697, 3649999, 3457781, 3360822, 3232715, 3489071, 3387925, 3037089, 3018380, 3031544, 3020045, 2569929, 2739491, 2889998, 2985408, 2938981, 2769033, 2988837, 2474642]
14037B474642N20478j00437j90281P2773q5720R2576K5252l14909L9664o0306
14027B473732J07459m08890M56934k04566l9581J82275l24260o6362K25852Q3024
14017B485617q3112l53873N34075m38956j33315k43621K97291n66k24279J68699
14007B007960J7216J79549l84386M80154n42603k8663J7010J94956o113m03989
13997A531091L41257j95964L07663l90785K72912j20186J08318M54027P51607
13988C059940K937573P410932J5791940J3767260j9542990A0820784m144142j920446
13980D756196j013028k47624n51957o9135k17792k6648j70330n51642M27505k81545
13970B054000J32254J53090m91197L64352m83380J68313j09425K30800l51086
$$ y = [2474642, 2995120, 2894683, 2704402, 2777175, 2691455, 2784031, 2809283, 2494374, 2534038, 2473732, 2581191, 2172301, 2629235, 2424669, 2385088, 2567363, 2243103, 2176741, 2402593, 2485617, 2402505, 2048632, 2582707, 2143751, 2010436, 1766815, 2064106, 2063540, 1839261, 2007960, 2025176, 2204725, 1820339, 2300493, 1757890, 1729227, 1746237, 1941193, 1935080, 1531091, 1872348, 1676384, 1984047, 1593262, 1866174, 1745988, 1854306, 2308333, 3059940, 5997513, 13408445, 29200385, 42967645, 23424655, 10820784, 6676642, 4756196, 3743168, 3495544, 2943587, 2874452, 2656660, 2630012, 2459682, 1908040, 2335545, 2054000, 2186254, 2339344, 1848147, 2212499, 1729119, 1897432, 1788007, 2018807, 1667721]
13961A667721K82895k82785M15012o68760M9392L81645k56667J87040k9959K38930
13951A984464k93707K9560j07649O5376J22440l04333j3374M53343n20992K21919
13941A637047k54937R9169K81550k03882q1318J5902q4563j278J72907l8485k09173
13930A332939j1909L8999R6296p3516K27602m94809M84703k24375n5730J61811
13920A482011m19488J46516J08062j35121J1846m33071N19705J41313j69293K30850
13910A483330l17222k77252M35926l07184O5526j72479N01079k23105k7643l06068
13900H54908M73323N5592F32559L62562M12794m42470L5710j00532K27198O5695
13890A193516q197J16217j86696K29312m61327L10448l28030J81159j27412k35030
$$ y = [1667721, 1950616, 1667831, 2082843, 1414083, 1463475, 1845120, 1588453, 1775493, 1745534, 1984464, 1690757, 1720317, 1612668, 1678044, 1800484, 1496151, 1482777, 1936120, 1415128, 1637047, 1382110, 1481279, 1762829, 1558947, 1477629, 1493531, 1408968, 1407690, 1580597, 1542112, 1332939, 1321030, 1360029, 1456325, 1382809, 1610411, 1115602, 1600305, 1375930, 1320200, 1482011, 1062523, 1209039, 1317101, 1181980, 1193826, 760755, 1280460, 1421773, 1252480, 1483330, 1166108, 888856, 1324782, 1017598, 1083124, 910645, 1411724, 1188619, 1160976, 854908, 1328231, 1383823, 632559, 995121, 1407915, 965445, 1001155, 900623, 1127821, 1193516, 1185319, 1301536, 1114840, 1344152, 882825, 1193273, 865243, 1046402, 918990, 683960]
13880F83960J95838K80489k66514o012J94427k54655k9812J26449J63992j5353
13870A072809j44661K16217k30869R288l2399K15230k22647p0034K98518j25750
13860I85702p2397p2081J73905l00055J23022B25397P97241k29772J43865q9515
13850H47216R8689l42679q030Q604L43767j5014n8824m148J54868l61141J92956
13839H56264q2059J71316m58441N45459m19829L60481j87169K1680j75j97528
13829F09999K80832j57015K48948D79465J09790J68575J4494L17450J0476k62566
13819H37684n9583C35629O81808m74097L83542J38645l16221l58488K07569K11641
13809H10028M1607l36571L01883J07143m14556j04703N46035j71509K21039m24459
$$ y = [683960, 879798, 1160287, 893773, 887761, 1082188, 827533, 797721, 924170, 1088162, 1072809, 928148, 1144365, 913496, 922784, 890385, 1105615, 882968, 812934, 1111452, 985702, 913305, 841224, 1015129, 715074, 838096, 225397, 1022638, 792866, 936731, 847216, 945905, 603226, 595196, 603800, 947567, 932553, 873729, 869581, 1024449, 663308, 856264, 774205, 945521, 487080, 1032539, 612710, 973191, 786022, 807702, 807527, 609999, 890831, 733816, 982764, 479465, 589255, 757830, 772324, 1089774, 1100250, 837684, 778101, 335629, 1017437, 543340, 926882, 1065527, 749306, 390818, 598387, 810028, 851635, 515064, 816947, 924090, 509534, 404831, 950866, 779357, 1000396, 575937]
13799E75937m0371L70315K6827o9974J06705L9831m05491K44331l59748K28572
13789G16934J07446K4577O2964D55081p2745L92433j36326J0140J67167k2518
13779G93232M0406l16832J94939j39066r3179N5895K4625J67786j04402k13951
13769D09453K59522J2910J0223J56122m01468J67329k90616j4241L3961N19766
13759H62961k06034L4407j80727j6213J72561L5518J2276j43609j23016j31733
13749C16391O13325k89862B24351L35829j23626J53612k41025L27178j55785k10053
13739C10481K69596j17005J84767j4930k6487j8851j69751K26720K2444n0469
13729F16515j74952P4212n2930k27330K69145j85568J87164K10189j54191n8138
$$ y = [575937, 535566, 905881, 932708, 862734, 969439, 1009270, 603779, 848110, 488362, 716934, 824380, 848957, 911921, 455081, 382336, 774769, 638443, 648583, 815750, 793232, 833638, 516806, 711745, 572679, 479500, 535395, 560020, 727806, 623404, 409453, 668975, 681885, 692108, 848230, 446762, 614091, 323475, 309234, 343195, 862961, 656927, 691334, 510607, 494394, 666955, 702473, 714749, 571140, 448124, 316391, 929716, 639854, 224351, 560180, 436554, 590166, 349141, 676319, 520534, 310481, 580077, 463072, 647839, 632909, 606422, 587571, 417820, 644540, 666984, 616515, 441563, 515775, 462845, 235515, 504660, 319092, 506256, 716445, 562254, 504116]
13719E04116j89072K36019P7583n1163P4738B85684I4381M93007B62906K8891
13709B91797K49163m8660j00565J61500A48267K76538J74035M1712C16897J06598
13699D23495J3237j58899K58525k15336N5632J68093j61697L04035k1497A36927
13688B19379k5698D7055J79160K57255j69798K18569l9984j14319K04782j45348
13678D37372A83057R4477M38497j31188P2480M3564j41974n1256j6009n862l1944
13667D53842o868j13464A05211J91476M30878B41121r3486M68147L0013C14791
13656H50076j99539k96386O4032A43689M98950j87733j90983K90353a914E95137
13645B4377K41639e6327F52454o9495k52220l7857N3683k6211A58164L12239n8687
$$ y = [504116, 315044, 551063, 628646, 577483, 652221, 285684, 94381, 587388, 262906, 291797, 540960, 492300, 391735, 553235, 148267, 424805, 598840, 640552, 316897, 423495, 436732, 277833, 536358, 321022, 376654, 544747, 383050, 687085, 665588, 136927, 219379, 193681, 47055, 226215, 483470, 313672, 532241, 492257, 377938, 582720, 437372, 183057, 277534, 716031, 584843, 657323, 700887, 558913, 507657, 491648, 485786, 453842, 446974, 333510, 105211, 296687, 727565, 241121, 147635, 615782, 645795, 314791, 850076, 650537, 354151, 418183, 143689, 642639, 454906, 263923, 554276, -1914, 595137, 24377, 266016, -56327, 652454, 582959, 330739, 292882, 346565, 320354, 158164, 470403, 411716]
13634D11716A21085K13534P7187J98429A79310K17374K50204B84965o0705L29875
13624E54135K015B49831J73801J3274j63713j299P1819P1186j12458K54629i8794
13612B22928R9478A35247J70676L5003A52399J97176J3836j42895j1831F7971
13601D71640A52137L21319n0283m0702H8561K46869m0615N8979O3272r2590K8595
13590C53071J8914j58307A7134L96670o7288n0664A31798J81896J8589G8881M9190
13579A28071J74749r9381j8398O7544k7578j838j02702J17182L4018K32611a29162
13567C57011b7450b391C51779a479C74161A85340J30609r0562K7832j24281Q4467
13556B13405D6733L8990J52162M0456j28867J71534o3811K83870j64494C3046
$$ y = [411716, 121085, 334619, 411806, 610235, 179310, 396684, 646888, 284965, 224260, 554135, 556150, 249831, 423632, 436906, 273193, 271894, 343713, 414899, 302441, 557070, -98794, 222928, 322406, 135247, 305923, 340926, 152399, 349575, 363411, 220516, 208685, 67971, 471640, 152137, 473456, 423173, 382471, 88561, 335430, 294815, 353794, 417066, 324476, 353071, 371985, 213678, 17134, 413804, 346516, 295852, 131798, 313694, 332283, 78881, 128071, 302820, 203439, 185041, 252585, 225007, 223169, 120467, 237649, 271667, 504278, -129162, 357011, -27450, -2391, 351779, -1479, 374161, 185340, 315949, 225387, 253219, 128938, 213405, 46733, 85723, 237885, 278341, 149474, 321008, 257197, 541067, 376573, 33046]
13545d4282o2611C06988L55169C09040j45082L519J54766D0075K82377l4112K00647
13534D88987B08213F0788M15081j47130J37160g0892A49171L67072A84397J7513
13524B01910L1462d5394R204A65522J31151k7751n443a30918B24348K16233c4113
13512D59853G2918K32082P8837j71276L01491a00779C00494a3699C54475j49486
13502B04989J62560p5115h2766B63900b1259H4962K43432M7377H3569C884J19829
13491A23713L92706k27538J08769A81399J05304o6663K77809A87655k9726O7648
13481B25577n6578B3378J82518Q6528A3879N6618J86273J85919j44356K4223O235
13470C28791k6096o5955r8646n4101m1078J16626G2885L9534K28648B547g4764
$$ y = [-44282, -106893, 306988, 662157, 309040, 163958, 167477, 322243, 40075, 322452, 288340, 488987, 208213, 60788, 475869, 328739, 465899, -70892, 149171, 516243, 184397, 201910, 233372, -45394, -36190, 165522, 296673, 268922, 263479, -130918, 224348, 440581, -34113, 459853, 72918, 305000, 383837, 212561, 514052, -100779, 300494, -13699, 354475, 204989, 367549, 292434, -82766, 263900, -21259, 84962, 328394, 375771, 83569, 3884, 123713, 516419, 288881, 397650, 181399, 286703, 220040, 497849, 187655, 157929, 225577, 168999, 23378, 205896, 292424, 13879, 70497, 256770, 442689, 298333, 322556, 328791, 302695, 236740, 138094, 83993, 42915, 159541, 72885, 112419, 341067, 2547, -74764]
13458A17114b4545F5666M2070g882m4598B39631O0385j42010l5407K42111e0724
13446D00382L2290h3533B46797r9489d650B03657B2799J90612L4372o4218K92721
13435D76286R5767k68318A42939m2125M10137p9887j80030P3478J14592j11883
13425C27221j06153L62779A89865J0705g7743B86365d249B90400Q3532j46960
13415B26972K37091J42998A12144K03009l2782j05143n4454K17206K58430c5260
13404D1934P1800J53826j21387M115A6410J03986a64426A48743k8878L51959A29196
13392A94851O5044A11623q772l6496b83151D07621j35342c23753a29168B89286
13381b24645E3081e9084E7769a731G1220N36429a00703B69988j20999E0080K87909
$$ y = [117114, -24545, 65666, 107736, -7882, -52480, 239631, 300016, 158006, 122599, 364710, -50724, 400382, 432672, -83533, 246797, 147308, -4650, 203657, 22799, 213411, 247783, 183565, 476286, 572053, 303735, 142939, 100814, 510951, 431064, 251034, 324512, 439104, 327221, 221068, 583847, 189865, 200570, -77743, 286365, -4249, 290400, 373932, 226972, 464063, 607061, 112144, 315153, 282371, 177228, 122774, 339980, 598410, -35260, 41934, 113734, 267560, 146173, 150288, 16410, 120396, -164426, 148743, 119865, 471824, 129196, 194851, 259895, 111623, 102851, 66355, -283151, 407621, 272279, -323753, -129168, 289286, -224645, 53081, -59084, 57769, -1731, 71220, 607649, -100703, 269988, 148989, 50080, 337989]
13370C37989h4624G48L6373a20271B45337J09437F8569K21409j7413N0147j47744
13359A74968O4156D5046J67550O8989A8225K79313A18029N9271J17269L88419
13349F82988k94200A17969L29889d6348N389p8373A98827J51999A02275K27830
13339C30105J6542l3199a89879A7737K49592K6707j07253H8129J30451J19596
13329C38176q1183E8858L03540g8694B06566a8322B24278n9032K44798j0609F8113
13317A37269P8283K51536j42710O0238a93784M1007A9879M054L45814A25801Q9807
13306B15608Q4539A45470k3094A8157J81694o4919L94087b52840B56328K4121
13296B80449n5739E3297R0743J35797N6992d3646B68074J26902a71895B55680
$$ y = [337989, -84624, 748, 37121, -120271, 245337, 354774, 68569, 289978, 272565, 322712, 174968, 239124, 45046, 212596, 281585, 18225, 297538, 118029, 177300, 294569, 682988, 388788, 117969, 447858, -46348, -40959, -119332, 198827, 350826, 102275, 330105, 346647, 313448, -189879, 17737, 267329, 294036, 186783, 88129, 218580, 338176, 256993, 58858, 362398, -78694, 206566, -18322, 224278, 165246, 410044, 399435, 68113, 137269, 215552, 467088, 324378, 384616, -193784, -152777, 19879, 23933, 369747, 125801, 215608, 300147, 145470, 122376, 18157, 199851, 134932, 529019, -252840, 256328, 280449, 224710, 53297, 144040, 279837, 336829, -43646, 268074, 394976, -171895, 255680]
13285B87548J14715A68174P9745J0252a14679A3255L3159K57916C679h7874E381
13273C09166L9770p1287q0796e770C98931A92176H6911b1103B88605j39821n1921
13262I6863i0759A3418K62806a48012F8330J55719o4313j3701J13468A484L61294
13251C62778a3222F4350B5645K32615A26709L69032G7053O2193i1713a1651o0437
13240g2088D4429O2849d07176B5603b09452C86902b2191A47216d1577A05998a31953
13228A22433b99281I863K63412q8563a15832B19323e0052o701E3397a81735f5095
13216A06958J07856a44202A60061L34681j42081F1870b23891A23760a11584B39197
13205C0526d07764i961I3806K51679P6955A27258P4872a5002A74000K7000b37116
$$ y = [287548, 402263, 168174, 247919, 258171, -114679, 13255, 46414, 304330, 3679, -87874, 5381, 309166, 348936, 277649, 196853, -5770, 398931, 192176, 86911, -21103, 288605, 148784, 96863, -90759, 13418, 276224, -148012, 68330, 224049, 159736, 146035, 259503, 1484, 362778, -13222, 64350, 25645, 258260, 126709, 495741, 77053, 139246, -91713, -11651, -72088, 44429, 107278, -407176, 25603, -209452, 386902, -22191, 147216, -41577, 105998, -131953, 122433, -299281, 9863, 273275, 184712, -115832, 219323, -50052, -56753, 53397, -181735, -65095, 106958, 214814, -144202, 160061, 494742, 352661, 61870, -223891, 123760, -111584, 239197, 30526, -407764, -9961, 93806, 345485, 422440, 127258, 202130, -15002, 174000, 201000, -237116]
13193f3583B86147A14970J4815M6471J17543b14465A59739O5164I4867L57292
13183D52159B08333o3959b62850j66142C1075a75822B36350e1929H8454a67317
13172C252d789G8723a78855D91931b78217b2763j43474j0326k2483n964j9683
13161b24693A42856C0857J18336o5131J10274a02542C8701K37688i9021A37208
13150b7231j38001B29735G7079A781O5846a17867b8983E9388J18466m8563K15156
13139C44447j41754b77609g4172D11941e5880n0479C07276F0535f0861A15880
13128A8827K2496i0250a3887q3814o9854e16C37150b00328A44770a81622C41182
13116c0446k446m49795A7712J42642C5647c17600e4973E4203e1031E03950A60240
$$ y = [-63583, 286147, 114970, 129785, 176256, 293799, -214465, 159739, 224903, 94867, 452159, 208333, 144374, -262850, -428992, 31075, -175822, 236350, -51929, 88454, -167317, 3252, -4789, 78723, -178855, 491931, -278217, -22763, -166237, -176563, -199046, -205010, -224693, 142856, 30857, 149193, 84062, 194336, -102542, 38701, 276389, -99021, 137208, -27231, -165232, 229735, 77079, 1781, 67627, -117867, -28983, 59388, 177854, 129291, 344447, 202693, -277609, -74172, 411941, -55880, -106359, 307276, 60535, -60861, 115880, 18827, 41323, -90250, -13887, -97701, -167555, -516, 337150, -200328, 144770, -181622, 341182, -30446, -32892, -482687, 17712, 160354, 35647, -317600, -54973, 54203, -51031, 503950, 160240]
13104A62422k7818d5234D088M7636R9800J4972o0448q292k9243c8438n2346A11917
13091h2388B29911I3321Q197K4495J75851A47564b86333b2719B31473h3158o8313
13080a51471c1180B0577K34708C3950L39506d6326C19315p1646j14244k121c16186
13068A32595J01562d6291r617F9764A5937R9311k9187O2441K05258J5772A42803
13056A61195e4967A35136a01858A42492b15729k55883A80220q2294a74373C43198
13045a59620B42718H6313a19487D03829B01753J42911a81739O9109i839A9738
13034C22357c09945A15988J8357A0468g3992F6887c9293F7295b9629B72697j25053
13023A47644f7482j6591C50955A31154J13188a80242A61118m4455J3873a3688
$$ y = [162422, 134604, -45234, 4088, 51724, 151524, 166496, 106048, 97756, 68513, -38438, -90784, 111917, -82388, 229911, 93321, 101518, 126013, 301864, 147564, -286333, -22719, 231473, -83158, -151471, -31180, 20577, 255285, 33950, 373456, -46326, 319315, 247669, 133425, 131304, -316186, 132595, 234157, -46291, -55908, 69764, 15937, 115248, 86061, 148502, 353760, 369532, 142803, 161195, -54967, 135136, -101858, 142492, -215729, -471612, 180220, 97926, -174373, 343198, -159620, 242718, 86313, -119487, 403829, 201753, 344664, -181739, -112630, -9839, 19738, 322357, -309945, 115988, 134345, 10468, -73992, 66887, -39293, 67295, -29629, 272697, 147644, -67482, -84073, 350955, 131154, 244342, -180242, 161118, 116663, 130536, -13688]
13012c5496I0000f3186a9406j92861B38509D3345e8142k5188k17482J30133A3156
13000c70A91826a14448H7748K9661M8371J50489Q3351e6895j62420A85852N0883
12989B36735q7540a48339m6713J5438o2787c2924B64673K88729a92985I6233K6213
12978A22446L3451o3840a18967A20560m298d9437A27399b09789c8562E6500P1964
12967A28464b28411C97855H3814C0607P8745K49449a22783c109j28437r5320A15334
12955c77664B71892j183b94167A5755K0186g3610K6961K127A22927J11076a02145
12943g1891L3508n0892A72472K20687G9802b7123A41665F1658J58492a29182B60713
12931i9857A07950b37436A86842a807G2395A3972P6363C8348g603A02848O9891
$$ y = [-35496, 90000, -63186, -19406, -212267, 238509, 43345, -58142, -83330, -300812, -170679, 13156, -370, 191826, -114448, 87748, 117409, 165780, 316269, 399620, -56895, -219315, 185852, 236735, 149195, -148339, -195052, -179614, -242401, -32924, 264673, 553402, -192985, 96233, 122446, 155897, 92057, -118967, 120560, 116262, -49437, 127399, -209789, -38562, 56500, 128464, -228411, 397855, 83814, 30607, 109352, 358801, -122783, -3109, -131546, -226866, 115334, -377664, 271892, 270709, -294167, 15755, 35941, -73610, -46649, -44522, 122927, 234003, -102145, -71891, -38383, -89275, 172472, 393159, 79802, -27123, 141665, 61658, 220150, -129182, 260713, -99857, 107950, -237436, 186842, -1807, 72395, 13972, 90335, 38348, -7603, 102848, 172739]
12920A72739r824P341i8765j1603A55516k943k7829b16812B2576O0238a9413I7921
12907E2270J31821a339p7681G3876b66767E37231A2347J52628a79557Q8773K6799
12896f3985m3509I3719g2580B03597l8549D3773H286L8199g8053b9631A2755a76511
12883i8968j44049C9471J58851I0207K54533F3991R937L3125J86757j17006B4780
12871B5563J3777a60423L3611C8556P6526a79813D47351a42071E4620a8693l8140
12860e6833G7926k6558J39d7712k19686o0919A99658b2920m13600F5699P0929
12849A36628K25741F391b09390R2274B75515I5776b78727G6045c4442B91213A24113
12837h1535A11791i2445A9732J0858J35925e296A71247a3763k10591A96934b44091
$$ y = [172739, 162915, 170256, -98765, -110368, 155516, 152573, 124744, -216812, 22576, 82814, -19413, 97921, 52270, 184091, -1339, -79020, 73876, -266767, 537231, 12347, 164975, -179557, -90784, -63985, -107494, 93719, -72580, 203597, 165048, 43773, 8286, 46485, -78053, -29631, 12755, -176511, -98968, -243017, 39471, 198322, 90207, 344740, 63991, 73928, 107053, 293810, 176804, 24780, 25563, 39340, -160423, -126812, 38556, 115082, -179813, 447351, -142071, 54620, -18693, -56833, 77926, 51368, 51507, -47712, -267398, -328317, 199658, -22920, -436520, 65699, 136628, 362369, 6391, -209390, -117116, 275515, 95776, -278727, 76045, -34442, 291213, 124113, -81535, 111791, -92445, 19732, 30590, 166515, -5296, 171247, -13763, -224354, 196934, -244091]
12825I7538h8790m7869G3503e5389F6502a49646A70185d2209j10643K2766l4347
12814a64433c4919A63082f4344a6904C32438b6742q3741L0806j34849A62622l0636
12803A31986l629a40522B19615c25102f0693b2077A56647g2882A63761b45589
12792f8102a5172A7874O8849M9857R8182c8198j54954q0125A47829f21547b05689
12780a05220C47539a78364G4924K00414A02096j3692L77303E0658J12147o8109
12770I4696a57642A6843K26936a37540D32528a905G3629f2329J3085H5265e0104
12758B36508a34659D3833n258d8392n7649N28H638L44494A35716i6377F3919N3457
12746A17376L33042a18317B25186b28915a526k9235A17811E7590c79256a39191
$$ y = [97538, -88790, -136659, 73503, -55389, 66502, -149646, 170185, -42209, -152852, -130086, -164433, -34919, 163082, -64344, -16904, 332438, -26742, -110483, -79677, -214526, 162622, 131986, 128357, -140522, 219615, -325102, -60693, -22077, 156647, -72882, 163761, -245589, -68102, -15172, 17874, 86723, 136580, 234762, -38198, -193152, -273277, 147829, -621547, -205689, -105220, 347539, -178364, 74924, 275338, 102096, 88404, 465707, 50658, 162805, 94696, -157642, 16843, 243779, -137540, 432528, -1905, 73629, -62329, -49244, 85265, -50104, 236508, -134659, 43833, 38575, -48392, -106041, -105513, 8638, 353132, 135716, -96377, 63919, 117376, 450418, -118317, 225186, -228915, -1526, -30761, 117811, 57590, -379256, -139191]
12735E9477a35613O6855E5188b23988A51070a73205P9175c0723C3254c62128D2288
12723a94316A89106a14818H1353J47592P7677c7072k74199C886b18904J06542
12713a12362j58784A95368J64225j77423d7415C15181b2195l8393E56181B1251
12702B75893K07854B5584P088L5490d72o6590a7298j06652D16039a45744A1240
12690D45345b50054O0509B98514M4124j21338n9713P9369J9760b32037A00440
12679H7169a7316G4061J7524K83806J05733B38381Q720J43290m4600J44122F4834
12667a81519B24666A4108K83273b31905H5407e7567B10711A00720j8214B5852
12656A35137d082A35971m3669J00915K49929f8223C7300L1437f7451F3091a19197
$$ y = [59477, -135613, -68758, 55188, -223988, 151070, -173205, -94030, -30723, 33254, -362128, 42288, -194316, 189106, -114818, 81353, 228945, 306622, -37072, -311271, 3886, -218904, -112362, -271146, 195368, 359593, 182170, -47415, 315181, -22195, -60588, 556181, 21251, 275893, 483747, 25584, 32672, 68162, -472, -67062, -17298, -123950, 416039, -145744, 11240, 445345, -250054, -189545, 298514, 342638, 221300, 161587, 240956, 260716, -232037, 100440, 87169, -17316, 74061, 91585, 375391, 481124, 238381, 247101, 390391, 345791, 489913, 64834, -181519, 224666, 14108, 297381, -231905, 85407, -57567, 210711, 100720, 82506, 25852, 135137, -4082, 135971, 92302, 193217, 443146, -68223, 37300, 68737, -67451, 63091, -119197]
12644B06580a91469B58056J46016c46792A12573O6685e3255j20279E7758a31641
12633E10496A59804d7946B70150j27046J72563f7526B80632C5247R9900b0760
12622C64797j20914k2100K28617C0997P7777a09239L1157I983K29800h4309I8749
12610A41667a3439H3288J03285b79331b2840A66383a21060c6028A90465b4172
12599A21196J9328j4372P4978f4568k4755B43487A267J23346l7953a40046A07964
12587A12072c26202a60974B47840j12166A4962P439j1040a279o8957A72777K78530
12576D51307b4413j11892A30659b31839A02765K30537b29192A79841l6072b3279
12565a04836F5079K93209j59400b18876R0332B24484a19549C86636a0129j79710
$$ y = [206580, -191469, 258056, 404072, -346792, 112573, 179258, -53255, -173534, 57758, -131641, 510496, 159804, -47946, 270150, 143104, 315667, -67526, 280632, 35247, 135147, -20760, 364797, 243883, 221783, 450400, 30997, 108774, -109239, -78082, 9983, 239783, -84309, 98749, 141667, -13439, 83288, 186573, -279331, -22840, 166383, -121060, -36028, 190465, -24172, 121196, 140524, 126152, 201130, -64568, -89323, 243487, 1267, 124613, 86660, -140046, 107964, 112072, -326202, -160974, 247840, 135674, 14962, 22401, 11361, -1279, -70236, 172777, 451307, -24413, -136305, 130659, -231839, 102765, 333302, -229192, 179841, 143769, -23279, -104836, 65079, 358288, 198888, -218876, -128544, 224484, -119549, 386636, -10129, -189839]
12555a89839l9180B58767g8996A12226J19088d4791B47640i1243A96349g4804
12544i9541K4766A62548e869n3439j94167a3364A9156i8038B71934B3197a76055
12532B09190I1110L8513EL26713a97377J3556B7106M30550a32160A52296h3554
12520a59738A04868d2855j84887J11005B90758a65168H5784b84264e088F7707
12509b0613j11561D5012L2703N3654b85056a23863C10296h4412B25954F6991c38832
12497a18585j78677i2853a3557j71874O8947B41325d52250a91974d5793n5976
12487a01769A19821h9056k05395D16548A15958a34587f5438j52835e0155j28051
12477a78206C11940p3578a70527D44138c11725B65945a46347A44706m5659G551
$$ y = [-189839, -229019, 258767, -78996, 112226, 231314, -44791, 247640, -91243, 196349, -74804, -99541, -74775, 162548, -5869, -59308, -253475, -13364, 19156, -98038, 271934, 23197, -176055, 209190, 91110, 129623, 5, 326718, -197377, -183821, 27106, 457656, -132160, 152296, -83554, -159738, 104868, -42855, -227742, -116737, 290758, -165168, 85784, -284264, -5088, 67707, -20613, -132174, 45012, 77715, 131369, -285056, -123863, 310296, -84412, 225954, 66991, -338832, -118585, -297262, -92853, -13557, -185431, -116484, 241325, -452250, -191974, -45793, -101769, 119821, -89056, -294451, 416548, 115958, -134587, -65438, -218273, -50155, -178206, 311940, 238362, -170527, 444138, -311725, 265945, -146347, 144706, 99047, 7551]
12466A53841J01719a13127n885o7780q2158h8505A91678a9297C93457a40383C1755
12454F7747a46566n9319B10101h1506A07540m0707J2614F678L5076a18327A88125
12442d5018B20813a52239L7766I8134J44572D1083e4339I5071i6881B06306h4641
12430c195n38k47098A23227P2032a01124m2351j21687J21604L3866G8490f8048
12418I4806i2959C8470M0359b03955R5696d0621A36688E7383B1609j0660g3514
12406b13861b8702C63140I9940c06577F9151b90780D5070J98069f5085D7794f2284
12394F761f7117l5981A65086m715m9443J51444F1917L74433A55060c649k03717
12383b07366b0639C9500a99167f6791l4115C9116A7420K09743a02994j50694J04779
$$ y = [153841, 255560, -113127, -119012, -186792, -268950, -88505, 191678, -19297, 393457, -140383, 31755, 67747, -146566, -205885, 210101, -81506, 107540, 66833, 79447, 6678, 41754, -118327, 188125, -45018, 220813, -152239, -114473, 98134, 242706, 41083, -54339, 95071, -96881, 206306, -84641, -3195, -3733, -250831, 123227, 195259, -101124, -143475, -265162, -143558, -109692, 78490, -68048, 94806, -92959, 38470, 78829, -203955, -108259, -40621, 136688, 57383, 21609, 10949, -73514, -213861, -28702, 363140, 99940, -306577, 69151, -290780, 45070, 243139, -65085, 47794, -62284, 6761, -67117, -103098, 165086, 160371, 110928, 262372, 61917, 436350, 155060, -3649, -207366, -20639, 39500, -199167, -66791, -100906, 39116, 17420, 227163, -102994, -253688, -148909]
12372a48909I2533J847M6297J08599f575l16182c7843B75858b69697C37298B2084
12360a55368E3900a15154j39343n5730d3680I7278a57560C74977f6837A10453
12349c0929A31915P8026K03e1486b4580n8936k99043E3001O5848Q4895A00773
12337i3175K4975D16358h8101j27471r8399F7416L71603A1942J30257h7835B7843
12325A67335N7382k2929h3775C2549f1961j37459A09730N8329i3438L6795G6700
12313A48675O8968a33400C24670A09265i8481L4384I3723h5376F288h7388k55302
12302c42690A3855a52265j4830A3651O7324L77597d3422q8491F5057A8133a96124
12290a1623l8396B46466b43207C09494Q7518j11304D3943L90954B9065O2546k8736
$$ y = [-148909, 92533, 94380, 140677, 249276, -6575, -322757, -37843, 275858, -269697, 337298, 22084, -155368, 53900, -115154, -254497, -310227, -43680, 97278, -157560, 374977, -66837, 110453, -30929, 131915, 209941, 210144, -51486, -24580, -83516, -382559, 53001, 118849, 203744, 100773, -93175, -68200, 416358, -88101, -215572, -313971, 67416, 439019, 11942, 142199, -87835, 27843, 167335, 224717, 201788, -83775, 32549, -61961, -199420, 109730, 168059, -93438, -56643, 76700, 148675, 217643, -133400, 324670, 109265, -98481, -64097, 93723, -85376, 6288, -87388, -342690, 13855, -152265, -167095, 13651, 80975, 458572, -43422, -131913, 65057, 18133, -196124, -11623, -50019, 246466, -243207, 309494, 397012, 285708, 43943, 434897, 29065, 91611, 62875]
12279F2875K24968f3399A08070e2732C85886M5967A73439a9641A85630E2852R8921
12268A51773D3792G783M5198d3638G6241C4008c3093j40703H4845h0267D25360
12256a50400j9270A25503J58629a0964D3120g1438C81904g6779C2449Q142i516
12244A52490A6582h8020C25954B0294J35808n2397i5753A68398L14157B13410
12233f2144A26669A4832L38237a71578h4495A23653L17745H7043N4985F3032K56448
12222C19480O0303M4354k5398E9061M54397j94893C8978e4969B57002J34876P716
12211C99594a55818b1620B04442q8393k3123k6679M5320J21698a20151a5182B71083
12199C0491a13514B50245J14267j70979e9627C8558Q3055D6017g0561C51306b6643
$$ y = [62875, 287843, -63399, 108070, -52732, 385886, 431853, 173439, -19641, 185630, 52852, 151773, 43792, 7783, 52981, -43638, 76241, 34008, -33093, -173796, 84845, -80267, 425360, -150400, -169670, 125503, 284132, -10964, 43120, -71438, 381904, -76779, 32449, 40591, -9516, 152490, 16582, -88020, 325954, 20294, 156102, 103705, -95753, 168398, 482555, 213410, -62144, 126669, 14832, 353069, -171578, -84495, 123653, 441398, 87043, 142028, 63032, 319480, 379783, 424137, 398739, 59061, 513458, 318565, 38978, -54969, 257002, 391878, 399594, -155818, -21620, 204442, 116049, 92926, 66247, 111567, 233265, -120151, -15182, 271083, 30491, -113514, 250245, 364512, 193533, -59627, 38558, 121613, 46017, -70561, 351306, -26643]
12187A14560C3875K20707N2949M1395f512B41873a35645c4073p4241n2960l1406
12176a92680M7052C17810a19085A61600a1376A8060L45783F0115i2458l06503
12166c98961a37795I6173M1149a11260C6840l795a16136p0995r7535D22450B9199
12154a62924D2847e8006A75642i6764j11080M689C91706A65327K0970h8993A60580
12142D3633b81837Q5397I2297J02831h5669l8877C29214a22123l05475A12665
12131a5285B4980a96613A20060K18928c1621r954A10740O9279b1275j14252e3064
12119b20637i1262K0219A8841K10284D5611e9366e668B76325E3951d1012A03364
12107D36120l2185a10799C4982e8324a4829L928G490b68646L3378E7392c4201
$$ y = [114560, 33875, 254582, 307531, 348926, -6512, 241873, -135645, -34073, -108314, -161274, -192680, -145628, 317810, -119085, 161600, -11376, 18060, 363843, 60115, -92458, -398961, -137795, 96173, 137322, -111260, 36840, 33045, -116136, -187131, -284666, 422450, 29199, -162924, 42847, -58006, 175642, -96764, -207844, -203155, 391706, 165327, 186297, -88993, 160580, 43633, -281837, -196440, 92297, 195128, -85669, -124546, 329214, -122123, -427598, 112665, -15285, 24980, -196613, 120060, 338988, -31621, -41575, 110740, 180019, -21275, -135527, -53064, -220637, -91262, -71043, 18841, 229125, 45611, -59366, -5668, 276325, 53951, -41012, 103364, 436120, 403935, -110799, 34982, -58324, -14829, -10901, 7490, -268646, -235268, 57392, -34201]
12095A7287R0101b30539M3569B9184c1408f993k39092D2593a71618E8443b2263
12083b69002a23976O017a8619k0177p688k3947A92806c7146A3361O32743P70122
12072A416226j24844B88948b98790F8885J37236h753m1056q1949C640h9623M2999
12061d6624J6236j23267a7563A99124a75043A17282J34614n8266L3964J00378
12051C27972c6770I0005e30914F6061a20361N8822J9222j87250f7681E0992K29072
12040B80064A11328C7187a31440F0873c71620C25256j37364g3758C0867c98581
12029c2222A35013F6919K11401A21042l7772b07612A3110J83016b7263k24375
12019b51638E8552a04533k1031M1779K0145D7951b8427B91498a91862P0432I1230
$$ y = [17287, 107388, -230539, -186970, 29184, -31408, -6993, -246085, 42593, -171618, 58443, -22263, -269002, -123976, -117959, -18619, -38796, -46484, -70431, 192806, -37146, 13361, 646104, 1416226, 1291382, 288948, -298790, 68885, 206121, -8753, -49809, -131758, 3640, -89623, -46624, -30388, -153655, -17563, 199124, -175043, 117282, 251896, 193630, 227594, 327972, -36770, 90005, -530914, 66061, -120361, -61539, -42317, -229567, -67681, 50992, 280064, 111328, 37187, -131440, 60873, -371620, 325256, 187892, -73758, 30867, -398581, -32222, 135013, 66919, 278320, 121042, 83270, -207612, 13110, 196126, -27263, -251638, 58552, -104533, -125564, -83785, -63640, 47951, -28427, 291498, -191862, -121430, 91230]
12007I3512m3487J32088a13698L5649B14935a8277A13408f0269J9489A40108a70661
11995E0745N4531f3948k32738B45191a92838A57480n2225c68660A79586D4890
11984b24389O4252j63062A57109l8820n5650J13502F2666c9925k1504A56077G3155
11972H2323b5319A58379o1109B2921D859i8747j67025A27938b10709E0943b06258
11960c57598J78215A55180N0354a46607f3968F1250L3578J07243a77598f677q8567
11949i5244l2602m0016B83711A06775j4691D738a9120B63257G7717m319a05038
11937E8156A6324c2606E9512K59995e6794F4692J07583b54575J17863I2971a04229
11925G5150J42131h0006L870l476C4144P7502a53586k7598D146d2474C9377h2652
$$ y = [93512, 50025, 182113, -113698, -78049, 214935, -18277, 113408, -60269, -40780, 140108, -170661, 50745, 105276, -63948, -296686, 245191, -192838, 157480, 105255, -368660, 179586, 44890, -224389, -160137, -323199, 157109, 118289, 62639, 176141, 62666, -39925, -61429, 156077, 73155, 82323, -25319, 158379, 97270, 22921, 4859, -98747, -265772, 127938, -210709, 50943, -206258, -357598, -179383, 155180, 205534, -146607, -63968, 61250, 94828, 202071, -177598, -6677, -95244, -127846, -167862, 283711, 106775, 92084, 4738, -19120, 263257, 77717, 73398, -105038, 58156, 16324, -32606, 59512, 319507, -56794, 64692, 172275, -254575, -136712, 92971, -104229, 75150, 217281, -80006, -76136, -79612, 34144, 111646, -153586, -181184, 4146, -42474, 39377, -82652]
11912C26246B6691O2034R0101O2606a48543j29402B43964a19691A72970L4177
11902B07147e8264E7973K39413a29919k13875a60595c7637D6812J86976b74510
11891B76653a63903n2947A38883h1851o6690j67990C50611D3653d42388h9620
11880A62398a23706M5281I7533a41864k821f7910j54982N4057G6707J26581h4727
11868b03694A31971b1627k07656a09518K2620q3929p2738a12067c584r6407j14191
11857b14182h694A93407G9197d8712j94966A16758J00353a28886B074b06823c8120
11845c16886J11371D2568A1336K3601J91510b57821F2066a73029B09954q4542
11835A25412Q1265f5309C9195h0618o9445j95390h1076B4490b45479A08882N6203
$$ y = [326246, 26691, 88725, 178826, 241432, -148543, -277945, 243964, -119691, 172970, 207147, -58264, 57973, 297386, -129919, -343794, -160595, -37637, 46812, 233788, -274510, 276653, -163903, -216850, 138883, -81851, -148541, -316531, 350611, 43653, -442388, -89620, 162398, -123706, -78425, 97533, -141864, -144685, -67910, -222892, -168835, 76707, 203288, -84727, -203694, 131971, -21627, -229283, -109518, -86898, -170827, -243565, -112067, -3584, -99991, -214182, -8694, 193407, 79197, -48712, -243678, 116758, 217111, -128886, 2074, -206823, -38120, -316886, -205515, 42568, 11336, 34937, 226447, -257821, 62066, -173029, 209954, 125412, 206677, -65309, 39195, -80618, -150063, -345453, -81076, 24490, -245479, 108882, 165085]
11824A65085b08714P8798B7261b20053A66536e024D6414b38843A34958o763K10854
11813C39049c42134B81645q5485h3575E7077J90729H9807a65304k9348F1720a21220
11801a6678k71552J07417g7895B90424d25801a57979J7624G546a76414F970K55457
11790B62427a35710c7893j17327C21231k9866D1334J4307J0020J2773I069L88685
11779C97754A3362J92882B25P0635j0768d2209F425a5330k17997M5216n0555B31025
11766c8725A26293C2588b97300G9683P2265f8991k9009B3925J2327a73834h0713
11754C37940b9335A38022h5420F0680h0785H2693O5216h3349C2123a3910A48597
11742a9161m8949p6868K7880C9036a1028H8817a30766E7002J2266d1475E7322
$$ y = [165085, -208714, -129916, 27261, -220053, 166536, -5024, 46414, -238843, 134958, 128195, 339049, -342134, 281645, 196160, -83575, 57077, 247806, 89807, -165304, -194652, 61720, -121220, -16678, -288230, -180813, -77895, 290424, -425801, -157979, -140355, 7546, -176414, 6970, 262427, -135710, -37893, -155220, 321231, 291365, 41334, 55641, 65661, 78434, 9069, 397754, 13362, 206244, 225, 70860, 60092, -42209, 6425, -15330, -233327, -188111, -238666, 231025, -38725, 126293, 32588, -297300, 79683, 151948, -68991, -98000, 23925, 36252, -173834, -80713, 337940, -29335, 138022, -85420, 60680, -80785, 82693, 147909, -83349, 32123, -13910, 148597, -19161, -68110, -144978, -117098, 39036, -11028, 88817, -130766, 57002, 69268, -41475, 57322]
11730c17568I2180a12665B1019b25071E7727a55397F2995A8501b08431K0125f2153
11718A22548E8021A8924P4569a23705E5069L9745A9871P7140l1239c39492b5926
11706b68111A4880c4924G8827d0629A26387O6504m2882g4412C05801b03096B78827
11694A50684I167J48153b0680A98450a40524O8994j39575k8052r8570f6917J4226
11683e2691j9098k69494A434J7742c73908a43869j5052B1352K0677j6525C374
11671d4388A783J76928a69134d9568A33681A4324P5266l9751a27244N4226A19863
11659A09004d21932B14202m0844N2387m5028a51053A75864N6703r917c05430A8895
11647a43234B50988b5925H7079J2377h9526E9121J98420Q4439a14270R72A63482
$$ y = [-317568, 92180, -112665, 21019, -225071, 57727, -155397, 62995, 18501, -208431, -188306, -62153, 122548, 58021, 18924, 93493, -123705, 55069, 94814, 19871, 97011, 65772, -339492, -25926, -268111, 14880, -34924, 78827, -40629, 126387, 192891, 150009, -74412, 305801, -203096, 278827, 150684, 9167, 157320, -20680, 198450, -140524, -71530, -211105, -239157, -337727, -66917, -52691, -71789, -341283, 1434, 19176, -373908, -143869, -158921, 21352, 42029, 25504, 3374, -44388, 1783, 178711, -169134, -49568, 133681, 14324, 89590, 49839, -127244, -73018, 119863, 109004, -421932, 214202, 173358, 225745, 180717, -151053, 175864, 232567, 222650, -305430, 18895, -143234, 250988, -25925, 87079, 99456, -89526, 59121, 257541, 341980, -114270, -113298, 163482]
11635f5889p4284o6864B5900a69504L4228A42888D8263a22817b3688B40885m5397
11624A95488J6991d5627A71534a48753A97168g1968J0176A78656i4673m3326B44909
11612D4387a97943h6152L1707B69705b769q1576F7666f7136A10545D7042N2124
11601I9166e1238B53271p9457l9705Q8780q1267a28883h420C57324D2165J30625
11590A72790q5693J80408p2227C9963J18807Q9364N1798a08243A75320o5260C1790
11578a63626L3791B46475e7616b6114B47538J90794a7615C1195J58224B763J80846
11567A83609J84175D5478J12376p3834J15766b46961A93828l9821J93046E5689
11556a3016A30593Q0747C611P8067M06756a95687A83621h5149a6424F5522K26484
$$ y = [-65889, -140173, -207037, 25900, -169504, -135276, 142888, 48263, -122817, -23688, 240885, 195488, 212479, -45627, 171534, -148753, 197168, -71968, -61792, 178656, -94673, -137999, 244909, 44387, -197943, -86152, -54445, 269705, -2769, -84345, 67666, -67136, 110545, 47042, 99166, -51238, 253271, 173814, 134109, 222889, 141622, -128883, -8420, 357324, 42165, 172790, 87097, 267505, 195278, 39963, 158770, 248134, 299932, -108243, 175320, 110060, 31790, -163626, -129835, 246475, -57616, -26114, 247538, 438332, -17615, 31195, 189419, 2763, 183609, 367784, 45478, 157854, 84020, 199786, -246961, 193828, 154007, 347053, 55689, -13016, 130593, 211340, 3611, 81678, 488434, -195687, 183621, -85149, -16424, 65522, 292006]
11545B92006A38475a92095A39848a56185A78715Q2999O3745c41599j0192a20318
11534C478L39679b8284n868r1084k28324B14090d3411B82105J32903A24087j5021
11523A09066J50963j15667R8510c5727A25563n4391a2183C27211o1474J54961
11513D20698j43957g678D43926a03086L9732I1669d8195D99859A25527h9264A09493
11501D25592b72467C2562K77035f3802A72076b31570C9208b81758E3262K15816
11491B69078A00420J13760i0292B04654H0411e2183l7993a7109m3366C49009J21899
11480D70908a97541A22099K32986I1280M5401J28886P7190p2173K0152d1774A20099
11468B30549B7110K46932a53083h566C99143E5836O5425K43365b22757B9345K56924
$$ y = [292006, 138475, -192095, 139848, -156185, 178715, 261714, 325459, -341599, -351791, -120318, 3478, 343157, -28284, -34152, -125236, -353560, 214090, -43411, 282105, 415008, 124087, 109066, 260029, 144362, 242872, -35727, 125563, 71172, -12183, 327211, 265737, 420698, 276741, -7678, 443926, -103086, -63354, 91669, -48195, 499859, 125527, -89264, 109493, 425592, -272467, 32562, 309597, -63802, 172076, -231570, 39208, -281758, 53262, 269078, 100420, 214180, -90292, 204654, 80411, -52183, -90176, -17109, -60475, 349009, 470908, -197541, 122099, 355085, 91280, 136681, 265567, 342757, 270584, 290736, -41774, 120099, 230549, 27110, 274042, -153083, -8566, 399143, 55836, 121261, 364626, -222757, 29345, 286269]
11457B86269m8888F909P6733P2329d0497A64838P1132N719H5451a21295a9535
11445a6913q6349B1954R1915a48434P951D0962a13383a8656A48195a77893c133
11433I1911Q5130P2431d8132j86829B3L00919d0890B2487e5868j20480K576C12322
11420b09667B13564b26783j23457C3486e5149C57374a72540A00624b49928B79716
11409B33119a34105b7787A41537h0832d242C20490E6472a26861A36662b34257
11398g7171j04418E2081Q1596a16381L0234A06343a97089r5470m3786C6390M2069
11387G8459d23269c2381k4282J6395l9279j1469I9989J3841A8948b44275I6414
11375A40076l77l2403a10329k47903A95671H1181j2751k3635a1134B00917A9445
$$ y = [286269, 237381, 6909, 83642, 155971, -40497, 164838, 235970, 241689, 85451, -121295, -19535, -16913, -103262, 21954, 113869, -148434, -140483, 40962, -113383, -18656, 148195, -177893, -3133, 91911, 177041, 249472, -48132, -234961, 23, 300942, -40890, 22487, -55868, -176348, -173772, 312322, -209667, 213564, -226783, -350240, 33486, -55149, 357374, -172540, 100624, -249928, 279716, 233119, -134105, -27787, 141537, -80832, -4242, 320490, 56472, -126861, 136662, -234257, -77171, -181589, 52081, 133677, -116381, -86147, 106343, -197089, -292559, -336345, 36390, 78459, -423269, -32381, -56663, -40268, -79547, -91016, 99989, 113830, 18948, -244275, 96414, 140076, 139699, 107296, -110329, -358232, 195671, 81181, 68430, 44795, -11134, 200917, 19445]
11363a33472O6230r2785P8654J5064j67447c1343j89110c8900n0589A01112N1464
11352A52576a82465j8136g6927A24608b19087G5656O0001g7040o3959K4412A23361
11340a42404G8608a05889j53561f0224o4000F7038B6207B594K2231a50111A53270
11328A04741a42239p2452e216A02135a87032B02237a49522F9359L55066i80n3146
11317e4126E3459a09104A67282R3208c08507N7418R9279b7310j86010J8482e601
11305b6774E2222B4303a39624I1137d4094l9356I8944P0926D9239a51501P4928
11294g6573K4319j9962j85100C4929N7008h464B68467C951f9639m5698j51579
11283b66916B79549f838B11156c03248A27084a40703g0228B74535l3723d8108
$$ y = [-133472, -67242, -160027, -81373, -66309, -233756, -31343, -220453, -38900, -89489, 101112, 152576, -182465, -200601, -76927, 124608, -219087, 75656, 135657, -77040, -140999, -116587, 123361, -142404, 78608, -105889, -259450, -60224, -124224, 67038, 26207, 2594, 24825, -150111, 153270, 104741, -142239, -214691, -5216, 102135, -187032, 202237, -149522, 69359, 424425, -980, -54126, 53459, -109104, 167282, 260490, -308507, -251089, -151810, -27310, -213320, -194838, -5601, -26774, 52222, 24303, -139624, 91137, -44094, -83450, 98944, 169870, 49239, -151501, -76573, -52254, -72216, -257316, 34929, 91937, -8464, 268467, 3951, -69639, -115337, -266916, 279549, -6838, 211156, -303248, 127084, -140703, -70228, 274535, 240812, -48108]
11272b6201k6303j28265J3116m0200A54568F7197c53132m8113J31733B03038j0003
11261A93035e961j87358C13105Q87g9326k40298c1893H206J66833f0151j2554
11250g2705D4947b79503B53033a06136q3977g8881F5442M4264F718f3127n9566
11239a22693A04324a4352m74912a29033j27079C4980J84862c02694J50396H719
11228a39825b6748q9148E9389K02537A3939J03029e9925n7513F6808B3280i665
11216b05840j78106d5838J176k0759j81042R0308k7439D0762J34781c3005j27066
11205a60071D737R7116g3385k35167e0240k1189B24514a29840n695j56491H5590
11193B72933b08757D3623J75678F8537J60281h5528l18600O0718J40027A37301
$$ y = [-26201, -52504, -180769, -167653, -207853, 154568, 67197, -353132, -401245, -269512, 203038, 193035, -5961, -193319, 313105, 313992, -79326, -319624, -31893, 8206, 175039, -60151, -72705, 44947, -279503, 253033, -106136, -190113, -78881, 65442, 109706, 6718, -63127, -122693, 104324, -14352, -489264, -129033, -256112, 34980, 219842, -302694, -152298, 8719, -139825, -26748, -115896, 59389, 261926, 13939, 116968, -59925, -117438, 66808, 23280, -9665, -205840, -383946, -45838, -44662, -65421, -246463, -156155, -183594, 40762, 175543, -33005, -160071, 4737, 101853, -73385, -308552, -50240, -71429, 224514, -129840, -135535, -292026, 85590, 272933, -208757, 43623, 219301, 68537, 228818, -85528, -404128, -343410, -203383, 137301]
11182I2168a34193l6151c0882A08606J4005a80583a8478j43179K7549B70132j18540
11171A51592a72156J0527b5953A29084K6428n9293M1704m8803L20394A47458a67037
11159a81968A0786K12755b22922h2517q6420m8517F5003k302b25021K9588D63437
11147I5604K33565G2971b06512A41021A2259J32962C8629E242b79871C4996a59187
11135B123J35991B0096J07866J9137D6636b52800C29685a80094Q9314o2264C4363
11123B90259A17040a14750A07919e8415A28544Q7374o0198c6785k50651b3455
11112C26727g431A048K11438H6619C0202J09068J07931a62279A37272P0102a09311
11100C51223l0575J67646j64157D7639M3254f5292C7663G349J76208o8317K6832
$$ y = [92168, -134193, -170344, -30882, 108606, 122611, -180583, -18478, -161657, -134108, 270132, 151592, -172156, -161629, -25953, 129084, 155512, 96219, 137923, 89120, 409514, 147458, -167037, -181968, 10786, 223541, -222922, -82517, -168937, -217454, 65003, 62701, -225021, -195433, 463437, 95604, 329169, 72971, -206512, 141021, 12259, 145221, 38629, 5242, -279871, 34996, -159187, 2123, 138114, 20096, 127962, 147099, 46636, -252800, 329685, -180094, -90780, -153044, 34363, 290259, 117040, -114750, 107919, -58415, 128544, 215918, 155720, -36785, -287436, -23455, 326727, -7431, 1048, 212486, 86619, 30202, 139270, 247201, -162279, 137272, 207374, -109311, 351223, 320648, 488294, 324137, 47639, 90893, -65292, 37663, 7349, 183557, 115240, 142072]
11089A42072a25170A40057e8422A71594J70652A64522A2377N59177a19661B58476
11078C94425A90741C1529l050K56401n3439K63090o333A64651K14825A71305h8184
11066B14206Q2312N8974I1752O74128l36922j59674J97040J03439M291k7989j87972
11055C58093N80012m44770K9660J97924J56690L4968D38904J95808K7099K03648
11045H65459J6115k05179j83334R1322L18268k33087k11408A98739N96783n2712
11035G42810L294k74536n3000J92776L2112J76014k24597K52519k12335j07894
11025E27163j2148r023J49531C22454J06988L27046B76883L21269j6543K04067
11015G85676C42559J4561K61383r1155p4215L79580C92240J00460K79816J2001
$$ y = [142072, -125170, 140057, -58422, 171594, 342246, 164522, 12377, 571554, -119661, 258476, 394425, 190741, 31529, 28479, 284880, 231441, 494531, 488198, 164651, 379476, 171305, -88184, 214206, 296518, 355492, 91752, 765880, 428958, 269284, 466324, 569763, 574054, 546065, 358093, 938105, 493335, 522995, 720919, 877609, 912577, 438904, 634712, 661811, 865459, 881574, 676395, 493061, 584383, 902651, 669564, 458156, 198739, 795522, 742810, 746104, 471568, 418568, 611344, 643456, 819470, 594873, 847392, 635057, 527163, 515015, 505992, 655523, 322454, 429442, 756488, 276883, 598152, 581609, 785676, 342559, 357120, 618503, 527348, 453133, 832713, 392240, 492700, 772516, 784517]
11005G84517M9031j94015M29241D21440J25557n100B52554K9915L22209J75776
10995G80454n1483k00047m8862L23691J86436m30158L82064D22867M26160P8752
10985I27779k11807J09271J7361L91205k01256q2966L34732K7059J62184O4379
10975A537941L45978L48565k42158L60333J84073p6697k68294j66334J19395m20395
10965A722407j58655O5909l57875K31606J31216K43972l95551J41837p0509J6546
10955A570903K17946m54487l79890L2333N597L8105C09359L81101j98530k14762
10945B77168J94752j44012L19838l03951j26932g9941B38135a2384A83746q9558
10935I4188L06629A34217A1533J47920M01605B8369J39410h516j11805A5711b75
$$ y = [784517, 833548, 639533, 1068774, 421440, 546997, 541897, 252554, 282469, 604678, 780454, 728971, 528924, 480062, 803753, 990189, 560031, 942095, 422867, 849027, 927779, 715972, 825243, 842604, 1233809, 1032553, 949587, 1284319, 1311378, 1473562, 1537941, 1883919, 2232484, 1990326, 2350659, 2534732, 2458035, 2189741, 2023407, 2142802, 1722407, 1563752, 1629661, 1271786, 1503392, 1634608, 1878580, 1483029, 1624866, 1554357, 1570903, 1788849, 1334362, 954472, 986805, 992402, 1030507, 309359, 690460, 491930, 277168, 471920, 327908, 647746, 343795, 216863, -79941, 238135, -12384, 183746, 94188, 400817, 134217, 11533, 159453, 561058, 28369, 167779, -8516, -120321, 15711, -275]
10923b38778c5251E9444f1627a6721A83110a04825A31225J18148f2403k9648n4059
10912a46110A09565a55779B09924c1549H0172F599a37459M4715A13890g2565A27041
10900A29904e866j51749E2308e7152E8532a01799B29779H0811A7396M1126K12019
10889B70541A18339c75382A66250o4497a1726k3483G8890L3480d2924G9598Q4470
10878A64068E6280a71758n0025F826J81532f2765k2731n3252e8134k05830A72709
10866A96315b32469G402J02940a05380q8208B7746L8005a73581d885k6345G1357
10854F3137J28558p4789J34600M7057a66432H995i5515J5885b3686B9743b35299
10842c09077C48914A07660a91782l218B89620a55426A10006i2534p1941n8407
$$ y = [-238778, -35251, 59444, -61627, -16721, 183110, -104825, 131225, 249373, -62403, -92051, -146110, 109565, -155779, 209924, -31549, 80172, 6599, -137459, -92744, 113890, -72565, 127041, 129904, -5866, -157615, 52308, -57152, 58532, -101799, 229779, 80811, 17396, 58522, 270541, 118339, -375382, 166250, 101753, -11726, -35209, 78890, 112370, -42924, 79598, 164068, 56280, -171758, -221783, 6826, 188358, -62765, -85496, -138748, -58134, -263964, 172709, 196315, -232469, 7402, 110342, -105380, -193588, 27746, 65751, -173581, -4885, -31230, 71357, 63137, 191695, 116906, 251506, 298563, -166432, 8995, -95515, -79630, -23686, 29743, -235299, -309077, 348914, 107660, -191782, -195000, 289620, -155426, 110006, -92534, -164475, -222882]
10832b22882A8826J00676a13416G7653b2024A80275F6271b091F9203P4239J0742
10821A54184a07880A14046J13567E7354c6551F562K13323j09321J9118a2894o1770
10810g4664B16901o2628b61229G961J49194h6698J5462C1553K46694a46106j66322
10799c12428J9529A53627n1968h8547k6043A72920C1416a66005j8697n146A86242
10787A61869a68402K2318J9313A44527C8285b23269g9652j61418N1721N2569B1715
10775A08852M2416f1436F7996a69351l1322A77927a78251j35596D3424K74397
10765C17821G2019A4342K35541F2064Q1894a78389f2230J2511j87194c9393J1847
10754b7546B2102d64927C83553a38586A05615b08993a02486A36275J94543c1974
$$ y = [-222882, 18826, 119502, -113416, 77653, -22024, 180275, 66271, -2091, 69203, 143442, 154184, -107880, 114046, 227613, 57354, -36551, 6562, 219885, 110564, 129682, -12894, -74664, 216901, 154273, -261229, 7961, 157155, -86698, -71236, 31553, 278247, -146106, -312428, -292899, 153627, 101659, -88547, -114590, 172920, 31416, -166005, -184702, -189848, 186242, 161869, -168402, -146084, -126771, 144527, 38285, -223269, -79652, -241070, -189349, -136780, 21715, 108852, 151268, -61436, 67996, -169351, -200673, 177927, -178251, -313847, 43424, 317821, 72019, 14342, 249883, 62064, 143958, -178389, -62230, -49719, -236913, -39393, -27546, 22102, -464927, 383553, -138586, 105615, -208993, -102486, 136275, 330818, -31974]
10743B46914c09467a52675M2161C72664A2046N7987L865J47761C123e1196m1020
10732i2216H8569C7771g0148A16911a544l43777A80691c55540M3825A63567o1711
10721A01856a58597j70867O3522A57544k6249h5740p6804o274J6009J8659k15658
10710c49808a05833D97925D1213b32210b7984J1046A2383J00806i367C36745a25984
10698h2479n6225A67849J4419a36126J6115B45107b37370J01906f3480k38618
10688c02098A61559b7642k42964a27448G1698C3641c169n8697C91992B6326g759
10676B0095J11574A2205R15P0123l4362D920b30982c7325B65180B5182J83565
10665B08747a75547C28550e41l6448R753B8935O9890a97882L6356j84226A38497
$$ y = [246914, -309467, -152675, -110514, 372664, 12046, 70033, 73898, 221659, 3123, -51196, -92216, 88569, 37771, -70148, 116911, -1544, -345321, 180691, -355540, -311715, 163567, 101856, -158597, -329464, -265942, 157544, 131295, -85740, -162544, -168818, -152809, -134150, -349808, -105833, 497925, 41213, -232210, -27984, -16938, 12383, 113189, -9367, 336745, -125984, -82479, -138704, 167849, 182268, -136126, -120011, 245107, -237370, -135464, -63480, -302098, 161559, -27642, -270606, -127448, 71698, 33641, -3169, -61866, 391992, 26326, -7759, 20095, 131669, 12205, 13120, 83243, 48881, 4920, -230982, -37325, 265180, 25182, 208747, -175547, 328550, -541, -36989, -27236, 28935, 98825, -197882, -161526, -345752, 138497]
10653c02465A63075J07484b50813A82807a95324A46798k2331a6524l9888k32296
10643b88708A12028b54588a8677I1972i8969A00673a04987a1011p8704q7201E3460
10631c33213a18210A99138C0508a86522G655d6053j60444e0058A23606l2301J88064
10620B79369g7746l09810a41829k2779j2745B4537a59280J6260G1237Q5391d5024
10608g0439o5255B99079c09503J47917L3544B72351d0381j11208o9373F8131a0792
10596b41603F6419j6113a2506n6438j25511I0782b05594r5831G8885a38196B02520
10584a56137f5154m7516G7812F78J04582c6117l51799H145b2717m13894g735j23337
10572a31072l6717c2645B50693E6661K4213K14474d1194B70238a78417F9862e6189
$$ y = [-302465, 163075, 270559, -250813, 182807, -195324, 146798, 124467, -16524, -56412, -288708, 112028, -254588, -18677, 91972, -98969, 100673, -104987, -11011, -89715, -176916, 53460, -333213, -118210, 199138, 30508, -186522, 7655, -46053, -206497, -50058, 123606, 91305, 279369, -77746, -387556, -141829, -164608, -177353, 24537, -159280, -143020, 71237, 156628, -45024, -70439, -135694, 299079, -309503, -161586, -128042, 272351, -40381, -151589, -220962, 68131, -10792, -241603, 66419, 50306, -12506, -68944, -194455, 90782, -205594, -301425, 78885, -138196, 202520, -156137, -65154, -112670, 77812, 678, 105260, -36117, -387916, 8145, -22717, -436611, -7735, -131072, -167789, -32645, 250693, 56661, 80874, 295348, -41194, 270238, -178417, 69862, -56189]
10560G770K3015J2330c0804j70136H3494k3639K60454j31319b53652M1836d6957
10548a7336l30115A8772a97890g0269l20683j44266f8357B8216j3761c25203Q0275
10537b44928Q6072A91347B2060b73654a4864q6178L1916D5131a11475k85045J9710
10526c76810M0846C0740b06259r425D4446L2672a45478k32760E814J89792C1543
10514b94138F599J41572l098f0059l38450B36666A01362c03336J10006D6454i7393
10502a59045p3155A28973d2389A8634a33891A64019g6516o7511E0685a48874O1789
10491h7085q6500A89613N4151h0095A90979a85070F1696J3725L10640j59234N68149
10480G94976B78089m4198J20780A03767a95096C04080r4517k5538b10365H4320
$$ y = [7770, 30785, 43115, -30804, -200940, 83494, 59855, 320309, 188990, -253652, -211816, -46957, -17336, -347451, 18772, -197890, -70269, -390952, -535218, -68357, 28216, 14455, -325203, -244928, -158856, 191347, 22060, -273654, -14864, -101042, -69126, 45131, -111475, -396520, -376810, -335964, 30740, -206259, -215684, 44446, 77118, -145478, -378238, 5814, 195606, 31543, -294138, 6599, 148171, 145073, -60059, -398509, 236666, 101362, -303336, -193330, 46454, -97393, -159045, -232200, 128973, -42389, 18634, -133891, 164019, -76516, -144027, 50685, -148874, -87085, -173585, 189613, 243764, -80095, 190979, -185070, 61696, 75421, 386061, 226827, 794976, 278089, 233891, 354671, 103767, -195096, 304080, 209563, 184025, -210365, 84320]
10469A43268c10825A18423A4765J83429b35361b7055A5063K03154c20275J57604
10459a62671C16d9111h483C3991L23523p3603o7434d1992j08293P3289c2347J305
10447c1042j2761k18477n052g6799B21965O3162i8460A94911F6431a27461G3021
10435c02550B1458b96756i7711E5705K44500b06680E9583M5745a22382F0075d511
10423D6155K33854a92097p710h46l51291a42165M4328p9597E8791E964k291M7976
10411E1649L0360A7000K8293L8619L2023A0006g6482A2308J85771b43874A22477
10399F9236e02055K38597C2651a0279B32602K922K40545B37167b77989B74127
10388A32054n1350L48114H9503E599O4492K443a64101A84918a73926H9504K42943
$$ y = [143268, -310825, 118423, 14765, 198194, -235361, -27055, 15063, 218217, -320275, -162671, 316, -49111, -8483, 33991, 357514, 283911, 216477, -41992, -150285, -76996, -32347, -31042, -43803, -262280, -267332, -76799, 221965, 285127, -98460, 194911, 66431, -127461, 73021, -302550, 21458, -296756, -97711, 55705, 300205, -206680, 59583, 105328, -122382, 60075, -4511, 46155, 280009, -192097, -199807, -846, -352137, -142165, -97837, -177434, 58791, 5964, 3673, 51649, 82009, 17000, 45293, 83912, 115935, 10006, -76482, 12308, 198079, -243874, 122477, 69236, -502055, -263458, 32651, -10279, 232602, 235524, 476069, 237167, -277989, 274127, 132054, 80704, 428818, 89503, 5599, 70091, 72534, -164101, 184918, -173926, 89504, 332447]
10377C32447A10620m8462J98690q2477J38550j55241o0134L28517J3657A95486
10366C20285L16719k42819A55327J4764J65322p0688j10776D4081M10824F3187
10355A61995j4898E1947a7268E61855q9569p3729K8259j68915o6660K26068j14303
10344C03006A10345J88821Q2363j25570K48938B47628F21g307k1150A74271J97309
10333C71580j20780J21305a2225b444C00227c8458A2407L11128n5378J7068A40982
10321B2754N12318D3401E82c7156D31749A42454J41719e0854J9830A67253M8097
10310B15350a6997A4112L67c10352B42516f7621C031K8065c0548A56012l7751
10299A18261b3791l28998D8066a11682B70831d9265I1013C5366a30774N1837B13226
$$ y = [332447, 110620, 62158, 260848, 178371, 316921, 161680, 101546, 430063, 443720, 195486, 320285, 637004, 394185, 155327, 170091, 335413, 264725, 153949, 44081, 454905, 63187, 161995, 147097, 51947, -17268, 561855, 472286, 398557, 426816, 257901, 191241, 417309, 303006, 110345, 299166, 381529, 255959, 504897, 247628, 621, -7307, -28457, 174271, 371580, 250800, 372105, -12225, -2444, 300227, -38458, 12407, 323535, 268157, 285225, 140982, 22754, 535072, 43401, 582, -37156, 431749, 142454, 284173, -50854, -31024, 167253, 215350, -16997, 14112, 14479, -310352, 242516, -67621, 3031, 31096, -30548, 156012, 118261, -23791, -352789, 48066, -111682, 270831, -49265, 91013, 35366, -130774, -78937, 213226]
10287A61516b11017R7765A0234c95871b6153j42752A16528d42715i4702B19017
10276c1440k58654B0645K27048j11263C9891M421P4469b7165C32578B4306d9250
10264B52250A8727h5613A09197g6742C4116j6892K73822r5980J70909O2914a0213
10252c71746g4634n7531F7353d912C9661a47896n3258K077A72149A0413b37654
10240b84953B26523d9931j33357K3646J7848j08103L4448j72661a06174l9832
10230a46006N8021c0430E2106c3486a4459o8441o4906a9624I265c39208a49967
10218f6668J54B7196a49764C10181A38531a05825C7993g1041K1269j81229i9935
10206g4938J1963D6613e3514j43258E3669a65615c3757F5072k9130e872C1466
$$ y = [161516, -211017, -113252, 10234, -395871, -26153, -168905, 116528, -442715, -94702, 219017, -31440, -290094, 20645, 247693, 136430, 39891, 44312, 118781, -27165, 332578, 24306, -49250, 252250, 18727, -85613, 109197, -76742, 34116, 17224, 291046, 195066, 365975, 428889, -10213, -371746, -74634, -132165, 67353, -4912, 39661, -147896, -201154, -199077, 172149, 10413, -237654, -284953, 226523, -49931, -183288, -159642, -141794, -249897, -215449, -388110, -106174, -146006, -87985, -30430, 52106, -33486, -14459, -82900, -147806, -19624, 9265, -339208, -149967, -66668, -66514, 27196, -149764, 310181, 138531, -105825, 37993, -71041, -49772, -231001, -99935, -74938, -62975, 46613, -53514, -196772, 53669, -165615, -33757, 65072, 35942, -5872, 31466]
10194D2482a86173b7959A12133c6915j53977c1195k27392F2835i13l72890J68433
10183b05370e7458A38077a32903c2247A45549n4115G670a64557k5444O0174C26997
10171a09997j27455a6871C31608b29555f5832k74066h6050k57587c8468B52389
10160b29715i9539m038j1921H4030K9186a50891p0662J7143k33310K07528a10217
10148A95154E7933a74662h3678k83858m239o9886A73312d95889A81645j5486M323
10137A70482G673c08842J03891b9270r6431F6900O1661E6624B7584b40530J18390
10126a22140H8512a39836j74173B78056a79360h4808B2910b83655l2898K1567
10116b94986R8061C5614g3614I9028c96686d1497k0182n0499G7682a17452A91557
$$ y = [42482, -186173, -27959, 112133, -36915, -190892, -31195, -258587, 62835, -913, -373803, -205370, -57458, 138077, -132903, -32247, 145549, 91434, 7670, -164557, -190001, -129827, 326997, -109997, -237452, -16871, 331608, -229555, -65832, -339898, -86050, -343637, -38468, 252389, -229715, -99539, -103577, -115498, 84030, 113216, -150891, -221553, -204410, -437720, -230192, -110217, 195154, 57933, -174662, -83678, -367536, -371775, -441661, 173312, -495889, 181645, 166159, 170482, 7673, -308842, -204951, -29270, -125701, 66900, 128561, 56624, 27584, -240530, -122140, 88512, -139836, -314009, 278056, -179360, -84808, 22910, -283655, -316553, -294986, -196925, 35614, -73614, 99028, -396686, -41497, -61679, -112178, 77682, -117452, 191557]
10104C749b7087j47517b3335o043E6354b27979A74956B6155f7397A2380K19011
10093B31391b2101p7112k9918A61222b22387A80055A559a52911G0945J34032r7523
10082A07454b00125A7603f0832B30429Q7010o1395d77287B8875G215b18645O6673
10071a51972A72647o8101l0515B0990f6804j1228B80866C9356J28842A1251c55634
10059a8734E3063j4213a05495F3159e1046B69535B3124N0917c75317D6011J05836
10048A51847a2291j6377k64914d1324o7989b0428j4705k59195a4402A29947b47715
10036E3820b2670j14028b5233m47259c0303N540A4994a73151M8108l74303G1484
10024e6058j605j30926B2401a26460d5519A4825a2310A45146c96555a01371e371
$$ y = [3749, -27087, -174604, -23335, -29378, 56354, -227979, 174956, 26155, -67397, 12380, 231391, -22101, -99213, -129131, 161222, -222387, 180055, 1559, -152911, 70945, 204977, 107454, -200125, 17603, -60832, 230429, 317439, 256044, -477287, 28875, 7215, -218645, -151972, 172647, 104546, 74031, 20990, -66804, -78032, 280866, 39356, 168198, 11251, -355634, -18734, 53063, 38850, -105495, 63159, -51046, 269535, 23124, 74041, -375317, 46011, 151847, -12291, -28668, -293582, -41324, -109313, -20428, -35133, -294328, -14402, 129947, -247715, 53820, -22670, -136698, -25233, -472492, -30303, -24763, 14994, -173151, -125043, -499346, 71484, -56058, -57663, -188589, 22401, -126460, -45519, 14825, -12310, 145146, -396555, -101371, -5371]
10012h361k20964f9751n25065F0593a74250Q3505A87792a91782A06885A329a8901
10000a76618K5357B15975c7076A06610a59308A54528n821n612d8611A29555c5573
9988a90577Q273A29613J62512A1014a64436C75715b00004F9364C3515b2651c742
9976a27549B9854h8915c3607A40857b39457K9809m6297B3322b44695J12369A5699
9964C0737b24127R3172O0337B9220J85953e7598a6170k8138k31139I4352g7922
9952g5065F4623d58139g0292a0550A94489b37675O1877C8767g1639A76963f51476
9940B8525e2594C07011a52308n1092L4413P8942m4025c6963k01727f8058B37006
9928A32227A8258c25702H764L467a49936m2783d7058C60522d0565a5584j25409
$$ y = [-8361, -229325, -69751, -594816, 60593, -174250, -90745, 187792, -191782, 106885, 1329, -18901, -176618, -151261, 215975, -37076, 106610, -159308, 154528, 148707, 143095, -48611, 129555, -35573, -190577, -182304, 129613, 292125, 11014, -164436, 375715, -200004, 69364, 33515, -22651, -3742, -127549, 29854, -88915, -33607, 140857, -239457, -209648, -255945, 23322, -244695, -132326, 15699, 30737, -224127, -130955, -70618, 29220, 215173, -57598, -16170, -44308, -275447, 94352, -77922, -75065, 64623, -458139, -70292, -10550, 194489, -237675, -175798, 38767, -71639, 176963, -651476, 28525, -52594, 307011, -152308, -203400, -168987, -90045, -134070, -36963, -238690, -68058, 237006, 132227, 18258, -325702, 8764, 12231, -149936, -192719, -47058, 360522, -40565, -15584, -140993]
9917a40993j1208c5472k51982A13497m5356R5592c96356B14718a74079q2291D1510
9905f8146E2445b06450B9028c34419d5909C4313Q643b89591c5106r1270n8136
9894a84512N8631P979B98124c28346J54444k56079C03283I3554d777o5327k2627
9883i2731A37907d1600m1196l81758c6552j57157L0149F6991a73970m2850B27708
9871B7055J01358c6573B34879b04078c0593l7286k68827a6638m5949A4484L23980
9860C38464H8152a87415k6268K9479F6934a960k9800j33004p9772L5475H9105
9848A31418n3234B9015b04966N9379O7673j7575c7788D4996a3053j10895j39952
9837b63900L506A0811J2279b40377L9247L5253Q1332o7020A8000a53494f4008
$$ y = [-140993, -152201, -35472, -287454, 113497, 68141, 163733, -396356, 214718, -174079, -256370, 41510, -68146, 52445, -206450, 29028, -334419, -45909, 34313, 42956, -289591, -35106, -126376, -184512, -125881, -117902, 298124, -328346, -173902, -429981, 303283, 93554, -4777, -70104, -92731, 137907, -41600, -82796, -464554, -36552, -193709, -163560, 66991, -173970, -216820, 227708, 27055, 128413, -36573, 234879, -204078, -30593, -67879, -336706, -16638, -62587, 14484, 338464, 88152, -187415, -213683, -184204, 66934, -1960, -31760, -164764, -244536, -209061, 89105, 131418, 78184, 29015, -204966, -145587, -77914, -95489, -37788, 44996, -13053, -123948, -263900, -260394, 10811, 23090, -240377, -201130, -165877, -84545, -151565, 18000, -153494, -64008]
9825g7271B42261a06687C98603A11654g1401b8823F5626j1163J2443b68692m1490
9814c10182B68033a64363C3171O6932a31469A98498n1475b7280G2615j3425P031
9803F6221O8417k3718a2267m0086k54766j21005J8089A53075h9137N669A49257
9791b5617q9074n0128m627A22595a97212M5072D454a04677H6468d1203G4268a80224
9778F831e3231A98555O3285a50295B6897f4314A41220J82434a6679A2211Q5229
9767I7440b39m27046Q0950A31932b45708D9554d63330a80007A76474h5970a396
9755c68530A60816B3186J25746b72294j43452b6955j18623D8221j9924K05419
9745B33716a84360l86877d3409G925K50408I3757O8446f2106A27702b79867h5478
$$ y = [-77271, 242261, -106687, 398603, 111654, -71401, -28823, 65626, 54463, 66906, -268692, -310182, 268033, -164363, 33171, 100103, -131469, 198498, 147023, -27280, 72615, 59190, 66221, 134638, 110920, -12267, -52353, -307119, -428124, -410035, 153075, -89137, -83468, 149257, -25617, -114691, -164819, -169446, 122595, -197212, -152140, 4454, -104677, 86468, -41203, 74268, -180224, 6831, -53231, 198555, 261840, -150295, 26897, -64314, 141220, 323654, -16679, 12211, 97440, -239, -427285, -346335, 131932, -245708, 49554, -463330, -180007, 176474, -85970, -1396, -368530, 160816, 23186, 148932, -272294, -415746, -26955, -145578, 48221, 28297, 233716, -184360, -571237, -43409, 7925, 258333, 93757, 162203, -62106, 127702, -279867, -85478]
9733b174n5111k4319j27546q2889e5774H9560c63413d851j61307L9465B50849
9721e0870B73954b40644F4407a12787r6122g7338c8150C9704a73304H6233K6819
9710A13052j6404a63950g7222k95729a04772j42025o7111O7747a13441k4764K8451
9699a09754K500F9955c39l60149A14408J43417c96444a05383C29530c34906c5876
9687A31849g1067j16862A83889c26242A8334a38491H8408a4676r7955d5712n6038
9676a01750j20842N8586q1695b2673A01650L6684I382a1259j04181k02343K8295
9665b89488r4981f7098B927d5362B35354D8073c29726J38736j45995b7198E1572
9653h6717D6751L29447E4697a15158B70983d85946A01014e9222D587a13730B7112
$$ y = [-2174, -57285, -81604, -209150, -292039, -55774, 89560, -363413, -4851, -166158, -126693, 250849, -50870, 273954, -240644, 64407, -112787, -208909, -77338, -38150, 39704, -173304, 86233, 113052, 96648, -163950, -77222, -372951, -104772, -246797, -313908, -246161, -113441, -138205, -109754, -107254, 69955, -339, -360488, 114408, 257825, -396444, -105383, 329530, -334906, -35876, 131849, -71067, -187929, 183889, -326242, 18334, -138491, 88408, -14676, -112631, -45712, -101750, -222592, -164006, -245701, -22673, 101650, 138334, 9382, -11259, -115440, -317783, -289488, -384469, -67098, 2927, -45362, 235354, 48073, -329726, -190990, -336985, -27198, 51572, -86717, 46751, 376198, 54697, -115158, 270983, -485946, 101014, -59222, 4587, -113730, 27112]
9641i8884F0705a41408j24552J0615Q1270e2724B22455j4209a14984b2020n8812
9630h0832a4957A04287j1221j9463f9698B18357a60953k3870k07347A3388L7275
9619E0663a1565l7233k6487A43308c35082E8462h8836l7324D4648g8988k0726
9608i9714r3031A06259b42549j7642A01637k9889g679C51365G4187b65606A27938
9596a87429c465l28168A13278B7089a34475n0984A23773b74012P7866j83722A05165
9584i0599C1932a93234A55359a7408A54032A2799h3869k86816j36514J92459h348
9572b65207a9151F0614c16589B07841a12513H9008a60734j80307J23141Q1239
9562a36661A77565d016j27j78929A59118c09469H2384A496d2966k1324i743j25789
$$ y = [-98884, 60705, -141408, -265960, -255345, -174075, -52724, 222455, 208246, -114984, -22020, -80832, -14957, 104287, 93066, 73603, -69698, 218357, -160953, -184823, -392170, 13388, 50663, -11565, -48798, -75285, 143308, -335082, 58462, -88836, -126160, 44648, -78988, -99714, -192745, 106259, -242549, -260191, 101637, 71748, -7679, 351365, 74187, -265606, 127938, -187429, -3465, -331633, 113278, 27089, -134475, -185459, 123773, -274012, -196146, -379868, 105165, -90599, 31932, -193234, 155359, -17408, 154032, 12799, -83869, -370685, -507199, -314740, -8348, -265207, -19151, 60614, -316589, 207841, -112513, 89008, -160734, -341041, -217900, -136661, 177565, -4016, -4143, -183072, 159118, -309469, 82384, 1496, -42966, -64290, -9743, -135532]
9550a35532B5249c41994Q6667c249o6962q4760Q39G9788a18283A04330a94383
9538c0267m7506C4516c4908A35353b05363d2667p754k39004a20810p3678f6525
9526i7859B5625a24277q3734D7231a43917P1908L5685E2593a43495j40236a7160
9514B19438I7996c60683B62541a2099j2365l6245A00182a84214B32233C636h0901
9502b04583Q5261P121B57386D683b36688j11194C74855q4363a56413o2403F6356
9490b91803A239c24990N8678D3349J47685H6293c3537J2088l73130A61466J8806
9479A80272a35672j78575a7955c670q3813M612j4067P081L6997A86653h4941n7338
9467a42279B26364a61662o861F3817Q1956a15059C9955c4777m8779L7832j56542
$$ y = [-135532, 25249, -341994, -255327, -3249, -70211, -154971, -154132, 79788, -118283, 104330, -194383, -30267, -77773, 34516, -34908, 135353, -205363, -42667, -50421, -289425, -120810, -194488, -66525, -97859, 25625, -124277, -208011, 47231, -143917, -72009, -36324, 52593, -143495, -283731, -17160, 219438, 97996, -360683, 262541, -12099, -24464, -60709, 100182, -184214, 232233, 3636, -80901, -204583, -119322, -112201, 257386, 4683, -236688, -347882, 374855, 290492, -156413, -218816, 66356, -291803, 1239, -324990, -266312, 43349, 191034, 86293, -33537, -21449, -394579, 161466, 180272, -135672, -314247, -17955, -3670, -87483, -82871, -96938, -89857, -52860, 186653, -84941, -142279, 226364, -161662, -168523, 63817, 145773, -115059, 39955, -34777, -83556, -45724, -202266]
9456b02266R1716A26991E5790d59465a08323H7057d6788F929a34807N1570B8447
9444A61579f2127o8419b1817A467f9495a1078A67867h9307o0814d994l60920A9238
9431A0017b30179c7863r8515A9732J99716i6988k62376A89281E7890e36382a94264
9419E6366a77525g2678k5599j11218P6550e8538m47535a64064j7247j8649B18770
9407a48368B58740J33870A82053e0811r0750L3692B46979a78815M8427G1012c5005
9395B3503Q3832R0750c6155A06583c76006D9699j5641a86519B270K8705R463d7956
9382A87358I3589P988b9694k63715M4109C03349A33112J36589b64635B42997B5259
9370d1006k56086R4225f1554j32663h2509j74568f6044A83710E4509g6668J3553
$$ y = [-202266, -110550, 126991, 55790, -459465, -108323, 87057, -46788, 6929, -134807, -83237, 28447, 161579, -62127, -130546, -21817, 1467, -69495, -11078, 167867, -89307, -150121, -4994, -365914, 19238, 10017, -230179, -37863, -136378, 19732, 219448, -96988, -359364, 189281, 57890, -536382, -194264, 56366, -177525, -72678, -98277, -209495, -132945, -58538, -506073, -164064, -181311, -199960, 218770, -148368, 258740, 392610, 182053, -50811, -141561, -107869, 246979, -178815, -130388, 71012, -35005, 23503, 107335, 198085, -36155, 106583, -376006, 49699, 34058, -186519, 2270, 30975, 40438, -47956, 187358, 93589, 101577, -29694, -293409, -249300, 303349, 133112, 269701, -264635, 242997, 25259, -41006, -297092, -202867, -61554, -194217, -82509, -257077, -66044, 183710, 54509, -76668, -63115]
9359f3115j24072f4640B02867h3817b4664A457b44733A26724f2773L579a857C7858
9346E2907c34248A58657b44340i3689A65160G5509e8291l18502E1044A9263M8204
9335F7467b28437m3449A43204a55295l40522a49992B57868f4793A52355E3515
9324c27888h533n9196k76749A25110m1132P6372F8532k42Q9932a76551P9873c6121
9311A14327f7761K72A2807a52854e8572B38745A07399a37114A25765g535m0525
9300d8060J5823A69385a95062P1368j0506A14815d7499C2862P8738h2546k63233
9289c45779g6033j0937n1244k08508b2834B56998c039H911P9735l6683b15679
9277A95499P960K03098E8165a36835B71148A0460a91876B2900i7565C19598H4590
$$ y = [-63115, -187187, -64640, 202867, -83817, -24664, 1457, -244733, 126724, -62773, -59194, -1857, 37858, 52907, -334248, 158657, -244340, -93689, 165160, 75509, -58291, -376793, 51044, 19263, 67467, -228437, -271886, 143204, -155295, -495817, -149992, 257868, -64793, 152355, 53515, -327888, -8533, -67729, -344478, 125110, 83978, 160350, 68532, 68290, 158222, -176551, -96678, -36121, 114327, -67761, -67489, 12807, -152854, -58572, 238745, 107399, -137114, 125765, -7535, -48060, -32237, 169385, -195062, -123694, -134200, 114815, -47499, 32862, 111600, -82546, -345779, -76033, -86970, -138214, -346722, -22834, 256998, -3039, 8911, 88646, 51963, -215679, 195499, 203459, 406557, 58165, -136835, 271148, 10460, -191876, 22900, -97565, 319598, 84590]
9265e9076j24855r3150A04592D4377c2944j43711j33845A1596Q33b26183A83138
9253f6775F8992e2995j57924b1562A18167b10964J7268j44661J44278M6461p4784
9242b22402r508E5471b80776I5320J14166a62800A35807O8512c10378N8186R9870
9231a52322g4750n0342H362J5500a19639G0670b7972B38800r6671c4735o0317
9220i5052k54069N0471R8865Q8400A90721E0078J44564b02763C43859d1427p9474
9209a20901k0276A73604B1205a38578m845A4966e1954m7079D8740h5088j95550
9198b80638d7468B64701d6290j3977j80036M4367Q1897d3456j11868J7859D52
9186e1406A56835c669o8036B55161C2796b24120j41860a02484A7416d6895H6716
$$ y = [-59076, -183931, -277081, 104592, 44377, -32944, -176655, -310500, 11596, 12429, -226183, 183138, -66775, 68992, -52995, -210919, -21562, 118167, -210964, -193696, -338357, -194079, -147618, -222402, -231910, 55471, -280776, 95320, 209486, -162800, 135807, 204319, -310378, -252192, -152322, -74750, -125092, 8362, 23862, -119639, 70670, -27972, 238800, 142129, -34735, -95052, -349121, -298650, -199785, -111385, 190721, 50078, 194642, -202763, 343859, -41427, -120901, -141177, 173604, 21205, -138578, -143423, 14966, -51954, -99033, 48740, -85088, -280638, -47468, 264701, -46290, -60267, -240303, -195936, -114039, -43456, -155324, -137465, 452, -51406, 156835, -3669, -71705, 255161, 32796, -224120, -365980, -102484, 17416, -46895, 86716]
9174c53194a34573I4318i3855B07549a53541E0165B729J58374B7352b5582B12917
9162g38559A0752J47300A5333b73874a01429j3912c8031I027i980C1140e3374
9150I8385f2543o5097b5713j06311d6987A51222a9180C2416b60543K5847M0752
9139a93944R0253f824m18371B12447a67902k81306A19382j1961a68332O8534E7759
9127C90230d15089r800e7443n8077A29326F0116a51324p8454d8667A48421e9930
9115a41877J5104N7477A07068a373A87262f2473l7010J3417A49775n7434b6284
9103a93818n9948l9623b3822p8095n9837E8725J34621a45069A95752A5230L2711
9092D7941R3b09385L6637c0562C8368N1572K3337j2788i7219A51494d07989h6037
$$ y = [-353194, -134573, 94318, -93855, 207549, -153541, 50165, 2729, 161103, 27352, -25582, 212917, -738559, 10752, 158052, 15333, -273874, -101429, -115341, -38031, 9027, -9980, 31140, -53374, 98385, -62543, -127640, -25713, -132024, -46987, 151222, -19180, 32416, -260543, -234696, -193944, -103691, -6824, -425195, 212447, -167902, -449208, 119382, 107421, -168332, -99798, 57759, 390230, -415089, -424889, -57443, -115520, 129326, 60116, -151324, -229778, -48667, 148421, -59930, -141877, -126773, -69296, 107068, -1373, 187262, -62473, -99483, -86066, 149775, 92341, -26284, -193818, -253766, -293389, -23822, -101917, -161754, 58725, 193346, -145069, 195752, 15230, 47941, 48034, -209385, -172748, -30562, 38368, 89940, 113277, 100489, -97219, 151494, -407989, -86037]
9079C22468b5133E6422h4141A74308b3893m0524k2526A7328P69L0124K53881H8682
9066a7784r4207B00266a16417j00188j62257a08578J7195j22459g5435l6254j90648
9055c02337F5724b47145n6014A9343b1870k81368C0320a34651Q149H9817h6244
9043C2066c2622j10936d2222q7133e3403A12167g0737k26042H197d5445k02242
9032b47687A81597g5718g543j56150c9037J9033H8227C2506J10935a92547A15687
9020F9974a27389a2557n214B85603E554b5301r6880k21194B2194d8780A28036
9008A92411h3853o1764q2696P8312j46000c7151k20250a20792j18958C3388J24401
8997A57789c07205K0755F8646L7349m4813b84257J22915C37197b03040c236m16274
$$ y = [322468, -25133, 56422, -84141, 174308, -23893, -64417, -86943, 17328, 18097, 48221, 302102, 88682, -17784, -111991, 200266, -116417, -216605, -378862, -108578, -91383, -213842, -75435, -111689, -302337, 65724, -247145, -303159, 19343, -21870, -303238, 30320, -134651, -126502, 89817, -86244, 32066, -32622, -143558, -42222, -129355, -53403, 112167, -70737, -296779, 8197, -45445, -247687, 181597, -75718, -7543, -163693, -39037, -20004, 88227, 32506, 143441, -192547, 115687, 69974, -127389, -12557, -17771, 285603, 5554, -25301, -122181, -343375, 22194, -48780, 128036, 192411, -83853, -145617, -228313, -150001, -296001, -37151, -257401, -120792, -239750, 33388, 157789, -307205, -286450, 68646, 105995, 61182, -284257, -161342, 337197, -203040, -3236, -419510]
8986d19510M7321J84759C5575b01448b1544q0554l892c2165K22j28773D0079d50112
8973A0143e2944p9936N892f0600A59191g1943A6388K02029g0185l7371A60951
8961a00296M3577m6854K9833l49247a71516d2268j30634A70256b45079a16196
8950b59457A14306h8087A39319a58495J9152I0292c53072k6739G7005e6227K6773
8939b9454k5623H5558A0409J78480L37457k49768c4168C1059A2625h6196A8502
8927b40169C11674H6884L27602Q79667K948160P757853N92535B052773F05957
8917G27158j31769M4369B04704r7954h0F4736D811R5150k1432M66774A41254b0477
8904C37409c57794a13899l04089c7219k29808b0966j18122A33670b82790l5853
$$ y = [-419510, -372189, -187430, 35575, -201448, -21544, -102098, -105990, -32165, -31943, -160716, 40079, -450112, 10143, -52944, -132880, -126988, -60600, 159191, -71943, 16388, 218417, -70185, -107556, 160951, -100296, -56719, -103573, -73740, -422987, -171516, -42268, -172902, 170256, -245079, -116196, -259457, 114306, -88087, 139319, -158495, -139343, 90292, -353072, -379811, 77005, -56227, -29454, -55077, 85558, 10409, 188889, 526346, 276578, -34168, 31059, 12625, -86196, 18502, -240169, 311674, 86884, 414486, 1294153, 4242313, 12000166, 12592701, 2052773, 605957, 727158, 595389, 639758, 204704, 106750, -80, 64736, 4811, 99961, 78529, 545303, 141254, -20477, 337409, -357794, -113899, -417988, -37219, -267027, -20966, -139088, 133670, -282790, -318643]
8894c18643B72194F1531c37354h629j56489Q1196j21218A85542b7005B77110c29521
8882a15365j65809F1683K49227a32884D4944b49799Q6461L6707A4884a08188C5939
8870A98033a5587H3418f8711B8467d70558J61169A9393L06102b45823o106I0491
8858A14598a84892a5613l17408A37860K7775l4623o3682J1740b788G837a61519
8846c34216P5955C14918a64909H6066Q3565a69725F7623a51985A73375a1232A03630
$$ y = [-318643, 272194, 61531, -337354, -8629, -165118, -83922, -205140, 185542, -27005, 277110, -329521, -115365, -281174, 61683, 310910, -132884, 44944, -249799, -163338, -126631, 14884, -108188, 35939, 198033, -15587, 83418, -68711, 28467, -470558, -309389, 19393, 325495, -245823, -251929, 90491, 114598, -184892, -15613, -333021, 137860, 165635, 131012, 67330, 79070, -2788, 7837, -161519, -334216, -258261, 314918, -164909, 86066, 169631, -169725, 67623, -151985, 173375, -11232, 103630]
$$ [...]
##END NTUPLES=NMR SPECTRUM
##END=
