##TITLE=AC1543_ROEFFECT0012_8215216_BSwHfQL54B
##JCAMPDX= 6.0         $$ Bruker NMR JCAMP-DX V2.0
##DATA TYPE= NMR SPECTRUM
##DATA CLASS= NTUPLES
##ORIGIN= BRUKER
##OWNER= Administrator
$$ 1.72 TOPSPIN		Version 2.1
$$ 2013-10-11 20:31:09.385 -0700  Administrator@X
$$ Compression mode = diff/dup
##.OBSERVE FREQUENCY= 400.02188249412
##.OBSERVE NUCLEUS= ^1H
##.ACQUISITION MODE= SIMULTANEOUS (DQD)
##.ACQUISITION SCHEME= undefined
##.AVERAGES= 64
##.DIGITISER RES= 22
##SPECTROMETER/DATA SYSTEM= spect
##.PULSE SEQUENCE= noesygpps1d.comp
##.SOLVENT NAME= COFFEE_meoh
##.SHIFT REFERENCE= INTERNAL, COFFEE_meoh, 1, 14.96079
##AUDIT TRAIL= $$ (NUMBER, WHEN, WHO, WHERE, PROCESS, VERSION, WHAT)
$$ ##TITLE= Audit trail, TOPSPIN		Version 2.1
$$ ##JCAMPDX= 5.01
$$ ##ORIGIN= Bruker BioSpin GmbH
$$ ##OWNER= Administrator
$$ $$ E:\/data/COFFEE/nmr/AC1543_ROEFFECT0012_8215216_BSwHfQL54B/12/pdata/1/auditp.txt
$$ ##AUDIT TRAIL=  $$ (NUMBER, WHEN, WHO, WHERE, PROCESS, VERSION, WHAT)
(   1,<2013-10-11 20:31:04.490 -0700>,<Administrator>,<X>,<go>,<TOPSPIN 2.1>,
      <created by zg
	started at 2013-10-11 20:19:34.867 -0700,
	POWCHK enabled, PULCHK disabled,
       configuration hash MD5:
       C8 4E 4E 5D D3 5C D8 9E 9F 52 82 E0 59 8A DE 15
       data hash MD5: 64K
       AB E6 A6 FC B0 82 53 B3 DD 5C 30 29 48 62 EA F3>)
(   2,<2013-10-11 20:31:07.432 -0700>,<Administrator>,<X>,<proc1d>,<TOPSPIN 2.1>,
      <Start of raw data processing
       efp LB = 0.3 FT_mod = 6 PKNL = 1 PHC0 = 0 PHC1 = 0 SI = 128K 
       data hash MD5: 128K
       7C 08 93 9F 96 F9 13 1B 41 5E 8C B7 6F 99 A6 9F>)
(   3,<2013-10-11 20:31:08.385 -0700>,<Administrator>,<X>,<proc1d>,<TOPSPIN 2.1>,
      <pk PHC0 = -83.95752 PHC1 = 0 
       data hash MD5: 128K
       37 79 BA AE F7 FF D6 36 C8 05 67 74 0F A6 64 24>)
(   4,<2013-10-11 20:31:08.807 -0700>,<Administrator>,<X>,<proc1d>,<TOPSPIN 2.1>,
      <abs ABSG = 1 
       data hash MD5: 128K
       CF 46 10 84 1F A8 FB A8 D5 51 F0 E6 16 7E B0 9A>)
(   5,<2013-10-11 20:31:08.900 -0700>,<Administrator>,<X>,<proc1d>,<TOPSPIN 2.1>,
      <abs ABSG = 2 
       data hash MD5: 128K
       FF 9E 55 B1 AC 14 AA B7 55 0B 33 83 ED E8 28 04>)
(   6,<2013-10-11 20:31:09.010 -0700>,<Administrator>,<X>,<proc1d>,<TOPSPIN 2.1>,
      <abs ABSG = 3 
       data hash MD5: 128K
       84 DA 60 4E 20 4B 60 C6 3F B3 DA 7D A8 B1 3F C2>)
(   7,<2013-10-11 20:31:09.088 -0700>,<Administrator>,<X>,<proc1d>,<TOPSPIN 2.1>,
      <abs ABSG = 4 
       data hash MD5: 128K
       6D FD DB B9 9E 85 1D 78 98 38 E1 01 D4 67 35 64>)
(   8,<2013-10-11 20:31:09.166 -0700>,<Administrator>,<X>,<proc1d>,<TOPSPIN 2.1>,
      <abs ABSG = 5 
       data hash MD5: 128K
       EF A6 79 5B 67 36 C5 4D C9 16 7A 02 E8 5F 6D 50>)
$$ ##END=
$$ 
$$ $$ hash MD5
$$ $$ 84 49 56 C4 AF 84 5E 5F FC 11 73 80 A8 AC FA 2F
##$RELAX= 
##$RELAX= 
##$RELAX= 
##$RELAX= 
##$RELAX= 
##$RELAX= 
##$RELAX= 
##$RELAX= 
$$ Bruker specific parameters
$$ --------------------------
##$DU= <E:\>
##$EXPNO= 12
$$ [...]
##$TP07= 0
##$TPNAME0= <>
##$TPNAME1= <>
##$TPNAME2= <>
##$TPNAME3= <>
##$TPNAME4= <>
##$TPNAME5= <>
##$TPNAME6= <>
##$TPNAME7= <>
##$TPOAL= (0..7)
0.5 0.5 0.5 0.5 0.5 0.5 0.5 0.5
##$TPOFFS= (0..7)
0 0 0 0 0 0 0 0
##$TUNHIN= 0
##$TUNHOUT= 0
##$TUNXOUT= 0
##$USERA1= <user>
##$USERA2= <user>
##$USERA3= <user>
##$USERA4= <user>
##$USERA5= <user>
##$V9= 5
##$VALIST= <valist>
##$VCLIST= <CCCCCCCCCCCCCCC>
##$VD= 0
##$VDLIST= <DDDDDDDDDDDDDDD>
##$VPLIST= <PPPPPPPPPPPPPPP>
##$VTLIST= <TTTTTTTTTTTTTTT>
##$WBST= 1024
##$WBSW= 4
##$XGAIN= (0..3)
0 0 0 0
##$XL= 0
##$YL= 0
##$YMAX_a= 6282714
##$YMIN_a= -11746383
##$ZGOPTNS= <>
##$ZL1= 120
##$ZL2= 120
##$ZL3= 120
##$ZL4= 120
##$ABSF1= 14.96079
##$ABSF2= -5.597392
##$ABSG= 5
##$ABSL= 3
##$ALPHA= 0
##$AQORDER= 0
##$ASSFAC= 0
##$ASSFACI= 0
##$ASSFACX= 0
##$ASSWID= 0
##$AUNMP= <proc_prof1d_extract.lims>
##$AXLEFT= 0
##$AXNAME= <>
##$AXNUC= <1H>
##$AXRIGHT= 0
##$AXTYPE= 0
##$AXUNIT= <>
##$AZFE= 0.1
##$AZFW= 0.1
##$BCFW= 0
##$BC_mod= 0
##$BYTORDP= 0
##$COROFFS= 0
##$CY= 15
##$DATMOD= 1
##$DC= 0
##$DFILT= <>
##$DTYPP= 0
##$F1P= 0
##$F2P= 0
##$FCOR= 0.5
##$FTSIZE= 131072
##$FT_mod= 6
##$GAMMA= 0
##$GB= 0
##$INTBC= 1
##$INTSCL= 1
##$ISEN= 128
##$LB= 0.3
##$LEV0= 0
##$LPBIN= 0
##$MAXI= 10000
##$MC2= 0
##$MEAN= 0
##$ME_mod= 0
##$MI= 0
##$NCOEF= 0
##$NC_proc= -2
##$NLEV= 6
##$NOISF1= 0
##$NOISF2= 0
##$NSP= 0
##$NTH_PI= 0
##$NZP= 0
##$OFFSET= 14.96079
##$PC= 1
##$PHC0= -83.95752
##$PHC1= 0
##$PH_mod= 1
##$PKNL= yes
##$PPARMOD= 0
##$PPDIAG= 0
##$PPIPTYP= 0
##$PPMPNUM= 2147483647
##$PPRESOL= 1
##$PSCAL= 4
##$PSIGN= 0
##$PYNMP= <proc.py>
##$REVERSE= no
##$SF= 400.020009722023
##$SI= 131072
##$SIGF1= 0
##$SIGF2= 0
##$SINO= 400
##$SIOLD= 131072
##$SPECTYP= <>
##$SREGLST= <1H.CDCl3>
##$SSB= 0
##$STSI= 131072
##$STSR= 0
##$SW_p= 8223.68421052631
##$SYMM= 0
##$S_DEV= 0
##$TDeff= 65536
##$TDoff= 0
##$TI= <>
##$TILT= no
##$TM1= 0
##$TM2= 0
##$TOPLEV= 0
##$USERP1= <user>
##$USERP2= <user>
##$USERP3= <user>
##$USERP4= <user>
##$USERP5= <user>
##$WDW= 1
##$XDIM= 131072
##$YMAX_p= 436448484
##$YMIN_p= -11480
##$CURPLOT= <Network HP LaserJet P1505>
##$CURPRIN= <$Network HP LaserJet P1505>
##$DFORMAT= <normdp>
##$LAYOUT= <+/1D_H.xwp>
##$LFORMAT= <normlp>
##$PFORMAT= <normpl>
##$SURQMSG= 1
$$ End of Bruker specific parameters
$$ ---------------------------------
##NTUPLES= NMR SPECTRUM
##VAR_NAME=  FREQUENCY,     SPECTRUM/REAL,   SPECTRUM/IMAG
##SYMBOL=    X,             R,               I
##VAR_TYPE=  INDEPENDENT,   DEPENDENT,       DEPENDENT
##VAR_FORM=  AFFN,          ASDF,            ASDF
##VAR_DIM=   131072,        131072,          131072
##UNITS=     HZ,            ARBITRARY UNITS, ARBITRARY UNITS
##FACTOR=    0.0627417313425164, 1,          1
##FIRST=     8223.62146879497, 1126,         -55490
##LAST=      0,             1931,            -55928
##MIN=       0,             -11480,          0
##MAX=       8223.62146879497, 436448484,    0
$$ Real data points
##PAGE= N=1
##DATA TABLE= (X++(R..R)), XYDATA
$$ [...]
63918E099566k71617k86948k94951k97132k94772k88201k77157k61936k43826
63909B583026k24225k03705j82425j61135j41158j23374j07709r3786q1558p1054
63899A192897o1865n3353m5328l8243l2699k8827k6140k3887k1654j9688j8598
63888H22615j8690j9659k0864k1624k1347j9689j6972j4168j2151j0910r660p619
63876F29262m607j066K297M997P200R550J2380J5189J7197J8296J9098K0053K0949
63863G70795K1359K1237K0773J9939J8488J6382J3967J1683R628P479M848J769
63851I38347j298l999o494r094j1683j3832j5484j7103j9009k0931k2510k3841
63839G73069k5255k6678k7662k7943k7620k6851k5748k4632k3943k3604k2884
$$ y = [5099566, 4827949, 4541001, 4246050, 3948918, 3654146, 3365945, 3088788, 2826852, 2583026, 2358801, 2155096, 1972671, 1811536, 1670378, 1547004, 1439295, 1345509, 1263951, 1192897, 1131032, 1077679, 1032351, 994108, 961409, 932582, 906442, 882555, 860901, 841213, 822615, 803925, 784266, 763402, 741778, 720431, 700742, 683770, 669602, 657451, 646541, 636881, 629262, 624655, 623589, 625886, 630883, 638083, 647633, 660013, 675202, 692399, 710695, 729793, 749846, 770795, 792154, 813391, 834164, 854103, 872591, 888973, 902940, 914623, 924251, 931730, 936578, 938347, 937049, 933050, 926556, 917462, 905779, 891947, 876463, 859360, 840351, 819420, 796910, 773069, 747814, 721136, 693474, 665531, 637911, 611060, 585312, 560680, 536737, 513133, 490249]
63828D90249k1264j9269j7914j7341j6575j4910j2971j1840j1481j0859r581q451
63816C17793q092p872o946n720n284n729o060n708n114m629l852k571j440j076
63802B47700j133r30n08l86o67j095j620k263k672k535k192k144k171j746j168
63787B24470j297k163k769k482j748j117m61K59L57o52j985k343j539o13l99o16
63771B04902n33K1N87P30M83J97M4k15q19j502j664j096j90P00J592K352K355
63754B07944J274j15n68J58J045J037R8j012j497j017J12J002Q84o6q39p21L3
63737B07752Q23J517K266K880K957K594K407K752L259L355K908K259J819J815
63723B41363K234K825L310L710M315N117N505M858L353J882J052O66K26l83r44
$$ y = [490249, 468985, 449716, 431802, 414461, 397886, 382976, 370005, 358165, 346684, 335825, 326244, 317793, 309701, 301829, 294883, 289163, 283879, 278150, 272090, 266382, 261268, 256639, 252787, 250216, 248776, 247700, 246567, 245637, 245129, 244743, 244076, 242981, 241361, 239098, 236426, 233891, 231699, 229555, 227384, 225638, 224470, 223173, 221010, 218241, 215759, 214011, 212894, 212433, 212692, 213049, 212397, 210412, 208069, 206530, 205917, 205518, 204902, 204369, 204390, 204977, 205707, 206190, 206387, 206431, 206216, 205397, 203895, 202231, 201135, 200945, 201645, 203237, 205589, 207944, 209218, 209103, 208535, 208693, 209738, 210775, 210873, 209861, 208364, 207347, 207459, 208461, 209345, 209279, 208440, 207719, 207752, 208575, 210092, 212358, 215238, 218195, 220789, 223196, 225948, 229207, 232562, 235470, 237729, 239548, 241363, 243597, 246422, 249732, 253442, 257757, 262874, 268379, 273237, 276590, 278472, 279524, 280190, 280416, 280033, 279089]
63708B79089j373j739k003k021j816j608j538j536j470j274r89p40o08m06K12
63693B60180J254K191K576K657K960L451L668L628L879M435M409L174J336j4o52
63678B99132j141j714k049k049k084k181j743m30J134K071K311K456K749K771
63664B99233K133J044l9q72j420j642j653j864k609l602m168m026l584l343l289
63649B70299l087k590j918j159m06Q0N7l53p62r42r34p23j69P59J834K786L450
63632B66222L751L807L932M281M565M480M299M560N203N652N785O156P013P859
63618C37565Q365Q984J0167J1522J2466J3229J4463J6223J8091K0053K2447K5196
63606E18771K7824L0217L2626L4930L6615L7364L6979L4719K9688K2112J3519
$$ y = [279089, 277716, 275977, 273974, 271953, 270137, 268529, 266991, 265455, 263985, 262711, 261722, 260982, 260374, 259968, 260180, 261434, 263625, 266201, 268858, 271818, 275269, 278937, 282565, 286444, 290879, 295288, 298462, 299798, 299784, 299132, 297991, 296277, 294228, 292179, 290095, 287914, 286171, 285741, 286875, 288946, 291257, 293713, 296462, 299233, 301366, 302410, 302371, 301499, 300079, 298437, 296784, 294920, 292311, 288709, 284541, 280515, 276931, 273588, 270299, 267212, 264622, 262704, 261545, 261139, 261219, 261276, 260923, 260161, 259219, 258285, 257562, 257393, 258152, 259986, 262772, 266222, 269973, 273780, 277712, 281993, 286558, 291038, 295337, 299897, 305100, 310752, 316537, 322693, 329706, 337565, 345930, 354914, 365081, 376603, 389069, 402298, 416761, 432984, 451075, 471128, 493575, 518771, 546595, 576812, 609438, 644368, 680983, 718347, 755326, 790045, 819733, 841845, 855364]
63595H55364N395j567o762r282q973p138n486m793n126o766j0036j4484j9078
63582G61268k3180k6697k9376l0630l0219k8586k6378k3884k1112j8158j5279
63571D87769j2748j0613q613o450m219k327q58O78K645M640N895O172N926N772
63557D73669O093O918P847Q329Q423Q990J0703J3162J5562J7910K0833K4432K8338
63544F51209L2806L8631M5484N1211N3306N0552M2974L1311J7343L931o481j3264
63532I99013j6886j7401j4742j0210o305m650n000o556r359j3846j9724k5963
63520H48371l1541l5769l8260l9141l8966l8078l6228l3203k9454k5697k2221
63509D79813j9034j6390j4563j3340j2269j1267j0459r644q524p363o643o169
$$ y = [855364, 860759, 859192, 852430, 843148, 834175, 827037, 821551, 816758, 811632, 804866, 794830, 780346, 761268, 738088, 711391, 682015, 651385, 621166, 592580, 566202, 542318, 521206, 503048, 487769, 475021, 464408, 455795, 449345, 445126, 442799, 441941, 442619, 445264, 449904, 455799, 461971, 467897, 473669, 479762, 486680, 494527, 502856, 511279, 520269, 530972, 544134, 559696, 577606, 598439, 622871, 651209, 684015, 722646, 768130, 819341, 872647, 923199, 966173, 997484, 1014827, 1018758, 1012277, 999013, 982127, 964726, 949984, 939774, 933469, 928819, 923819, 917263, 907904, 894058, 874334, 848371, 816830, 781061, 742801, 703660, 664694, 626616, 590388, 557185, 527731, 502034, 479813, 460779, 444389, 429826, 416486, 404217, 392950, 382491, 372847, 364323, 356960, 350317, 344148]
63497C44148n288m053l295l305l256k418j234o12o82r07j006j109j261j320j185
63482C13217o92M16J959L070L120K562K306K459K482K298K399K788K750J885O47
63467C43666m25j345k204k776k989l220l602l609k867j919j484j400r87k45J12
63452C14706k25p28q42o30l15K59J406L055M738N963O528O623O769P404Q422R337
63436C72470R999J0899J2612J5273J8833K3434K8858L3720L5889L4143K9135K2569
63424F47834J5830R705M998K623K957N581R723J4703J9900K4832K9517L4300L9048
63411H61551M2862M4771M4370M1457L5660K7054J6859O858j747q414j2593j3873
63399A084815j2798j0808r185q607r674j2942j8119k4019k9677l4863l9195m1648
$$ y = [344148, 338860, 334807, 331512, 328207, 324951, 322533, 321299, 320687, 320005, 319098, 318092, 316983, 315722, 314402, 313217, 312525, 312941, 314900, 317970, 321090, 323652, 325958, 328417, 330899, 333197, 335596, 338384, 341134, 343019, 343666, 343241, 341896, 339692, 336916, 333927, 330707, 327105, 323496, 320629, 318710, 317226, 315826, 314839, 314594, 314706, 314481, 313753, 312911, 312281, 311966, 312225, 313631, 316686, 321424, 327387, 333915, 340538, 347307, 354711, 363133, 372470, 382469, 393368, 405980, 421253, 440086, 463520, 492378, 526098, 561987, 596130, 625265, 647834, 663664, 673369, 678367, 680990, 683947, 689528, 699251, 713954, 733854, 758686, 788203, 822503, 861551, 904413, 949184, 993554, 1035011, 1070671, 1097725, 1114584, 1121442, 1119695, 1111281, 1098688, 1084815, 1072017, 1061209, 1052024, 1043417, 1033743, 1020801, 1002682, 978663, 948986, 914123, 874928, 833280]
63387H33280m1656m0056l8077l5889l2934k9385k6283k4165k2408k0046j6762
63376E05619j2964r399o766n205l942j922J019L945N899O922P807R181J1008J2839
63362E24041J4336J5610J7103J9111K1562K4329K7533L1219L4912L7954M0216
63351H07926M2067M3526M3868M2206L8157L1809K3436J3683L915m095r089j1088
63339A066321j1262j0913j0560j0055r614j0314j3269j8387k4367k9810l4007
63328H83763l6728l7861l7585l6468l5013l3123l0344k6533k2097j7537j2943
63317E57531q154l448L5Q71j536o360j1850j6324j8888j9592j9124j8134j6678
63304D18349j4525j1982r949q837q040o861n548m737m266l396k070j133j140j737
$$ y = [833280, 791624, 751568, 713491, 677602, 644668, 615283, 589000, 564835, 542427, 522381, 505619, 492655, 483256, 476490, 471285, 467343, 465421, 466440, 470385, 476284, 483206, 491013, 500194, 511202, 524041, 538377, 553987, 571090, 590201, 611763, 636092, 663625, 694844, 729756, 767710, 807926, 849993, 893519, 937387, 979593, 1017750, 1049559, 1072995, 1086678, 1090593, 1086498, 1077409, 1066321, 1055059, 1044146, 1033586, 1023531, 1013917, 1003603, 990334, 971947, 947580, 917770, 883763, 847035, 809174, 771589, 735121, 700108, 666985, 636641, 610108, 588011, 570474, 557531, 549377, 545929, 545964, 546835, 545299, 538939, 527089, 510765, 491877, 472285, 453161, 435027, 418349, 403824, 391842, 381893, 373056, 365016, 358155, 352607, 347870, 343604, 340208, 338138, 337005, 335865, 334128]
63290C34128k376k941l409l483l087k679k726l086l345l408l456l499l272k477
63276B90884j090M35J289J054K43k34j77j38l70m48j01L36O73J303K401L307L367
63259C02734K881K563K494K345K243K625L416M140M669N242N778N945N889O198
63245C59162P050P931Q370Q543Q982J0109J1972J4070J5548J6144J6812J8724
63233E03417K1666K4184K5416K5952K6596K7183K7238K7081K7371K7916K7780
63222G91800K6600K5124K4332K4489K5265K6366K7723K9199L0375L0624K9380
63211A091277K6353K1658J5783R379K888l633j0292j6967k3313k9130l4351l8559
63199A011093m0908m0990l9410l7073l4132l0304k5926k1831j8131j4091r536
$$ y = [334128, 331752, 328811, 325402, 321919, 318832, 316153, 313427, 310341, 306996, 303588, 300132, 296633, 293361, 290884, 289794, 290229, 291518, 292572, 292815, 292581, 292404, 292266, 291896, 291448, 291347, 291683, 292356, 293659, 296060, 299367, 302734, 305615, 308178, 310672, 313017, 315260, 317885, 321301, 325441, 330110, 335352, 341130, 347075, 352964, 359162, 366212, 374143, 382513, 391056, 400038, 410147, 422119, 436189, 451737, 467881, 484693, 503417, 525083, 549267, 574683, 600635, 627231, 654414, 681652, 708733, 736104, 764020, 791800, 818400, 843524, 867856, 892345, 917610, 943976, 971699, 1000898, 1031273, 1061897, 1091277, 1117630, 1139288, 1155071, 1164450, 1167338, 1163705, 1153413, 1136446, 1113133, 1084003, 1049652, 1011093, 970185, 929195, 889785, 852712, 818580, 788276, 762350, 740519, 722388, 708297, 698761]
63188F98761n477k754p76J647M724P713J0203J2460J4622J6363J7483J8224J8841
63175H12034J9341J9674J9794J9483J8612J7689J7521J8135J8476J7451J4845
63164A013055J1057O432J293l802q481j3050j8071k3441k8306l1964l4384l5776
63152H34562l6026l4933l2769l0248k7903k5735k3521k1235j9063j7120j5394
63141E50615j3870j2518j1171r626p992o619n593m580l417k521k338k491k111
63128D65768r55L18J157J840K824L930M678N184O019P230Q090Q010P248O442N812
63113E33595N137M337L641L184K780K203J513R58O67N86O39P71Q57P30M19J64
63097E62181O6j31o44j176j150m59L38P00O80O42P04P16N81L45R6kK76Q93J515
$$ y = [698761, 693284, 690530, 689754, 691401, 696125, 703838, 714041, 726501, 741123, 757486, 774969, 793193, 812034, 831375, 851049, 870843, 890326, 908938, 926627, 944148, 962283, 980759, 998210, 1013055, 1024112, 1030544, 1031837, 1028035, 1019554, 1006504, 988433, 964992, 936686, 904722, 870338, 834562, 798536, 763603, 730834, 700586, 672683, 646948, 623427, 602192, 583129, 566009, 550615, 536745, 524227, 513056, 503430, 495438, 488819, 483226, 478646, 475229, 472708, 470370, 467879, 465768, 464813, 465131, 466288, 468128, 470952, 474882, 479560, 484744, 490763, 497993, 506083, 514093, 521341, 527783, 533595, 538732, 543069, 546710, 549894, 552674, 554877, 556390, 557348, 558015, 558601, 559240, 560011, 560868, 561598, 562017, 562181, 562247, 562116, 561472, 560296, 559146, 558687, 559025, 559725, 560405, 561047, 561751, 562467, 563048, 563393, 563489, 563487, 563763, 564656, 566171]
63078E66171K028K828M131N282N425M805M670N754P500R014J0114J1068J1936
63065F50726J2731J3696J4872J5770J6198J7026J9268K2606K5724K8120L0686
63054H67423L4279L8538M2615M6376N0245N4260N7963O1022O3441O5202O6168
63043A447532O6366O6058O5480O4719O3826O2883O2017O1524O1831O3023O4485
63032B149744O5270O4762O2798N9187N3504M5428L4967K2265P444r104k6432m3217
63020B486616n8283p0907q0834q8092r2777r4860r4215r0829q5056p7618o9332
63009A583813o0712n1813m2522l3041k3930j5564p761k19O824J2802J7656K1975
62997A407508K6087K9434L1336L2051L2555L3361L4070L4218L4021L3921L3871
$$ y = [566171, 568199, 571027, 575158, 580440, 585865, 590670, 595340, 601094, 608594, 617608, 627722, 638790, 650726, 663457, 677153, 692025, 707795, 723993, 741019, 760287, 782893, 808617, 836737, 867423, 901702, 940240, 982855, 1029231, 1079476, 1133736, 1191699, 1252721, 1316162, 1381364, 1447532, 1513898, 1579956, 1645436, 1710155, 1773981, 1836864, 1898881, 1960405, 2022236, 2085259, 2149744, 2215014, 2279776, 2342574, 2401761, 2455265, 2500693, 2535660, 2557925, 2565369, 2556265, 2529833, 2486616, 2428333, 2357426, 2276592, 2188500, 2095723, 2000863, 1906648, 1815819, 1730763, 1653145, 1583813, 1523101, 1471288, 1428766, 1395725, 1371795, 1356231, 1348470, 1348251, 1355075, 1367877, 1385533, 1407508, 1433595, 1463029, 1494365, 1526416, 1558971, 1592332, 1626402, 1660620, 1694641, 1728562, 1762433]
62986A762433L3447L2485L1061K8872K5126J9295J1653K922o392j6142k6151l6016
62974A862593m5233n3331n9873o4478o7041o7839o7315o5716o2990n9189n4893
62963A194695n0878m7259m3284l8451l3545k9950k7920k6304k4241k2345k1556
62952H28962k1485k0859j9372j8093j7853j8133j7888j6849j5530j4445j3782
62941F34673j3459j3132j2304j0907r546q889q895q894q262o778m698k799j995
62928E24115k425l081k814j652o17l37l78m8O62J172J022K46p66j591k154k768
62912E08586l647m391m352l583k967l170l817m084l826l610l760l902l635l197
62898D56645l114l377l382k702j627p73l77k04J1K85N29P01P19M82O9k32j98J76
$$ y = [1762433, 1795880, 1828365, 1859426, 1888298, 1913424, 1932719, 1944372, 1947294, 1940902, 1924760, 1898609, 1862593, 1817360, 1764029, 1704156, 1639678, 1572637, 1504798, 1437483, 1371767, 1308777, 1249588, 1194695, 1143817, 1096558, 1053274, 1014823, 981278, 951328, 923408, 897104, 872863, 850518, 828962, 807477, 786618, 767246, 749153, 731300, 713167, 695279, 678430, 662900, 648455, 634673, 621214, 608082, 595778, 584871, 575325, 566436, 557541, 548647, 540385, 533607, 528909, 526110, 524115, 521690, 518609, 515795, 514143, 513526, 513189, 512811, 512763, 513425, 514597, 515619, 515865, 515099, 513508, 511354, 508586, 504939, 500548, 496196, 492613, 489646, 486476, 482659, 478575, 474749, 471139, 467379, 463477, 459842, 456645, 453531, 450154, 446772, 444070, 442443, 441670, 441293, 441089, 441100, 441385, 441914, 442615, 443334, 443816, 443885, 443653, 443455, 443631]
62880D43631P86J464J857J626R54N29P03R95P78J58k82m05o53j256j894k202k140
62863D44649j782j192n85k56j17K24Q48J304J226P53J84l39n82j20J054K161K355
62846D49785J623O18j77o50p32m32k40p93j971k777k492j620j344k107l119l314
62830D30258k545j600j165j069p17J4P13J179J719K535L258L473L329L247L230
62815D45859K988K627K622L087L630M077M791N907O732O516N630N292O035P014
62801E12807P151O591O516P624R413J1012J2209J3257J4141J4659J5076J6033
62789F46489J7761J9875K2141K4914K8539L2845L7569M2893M9097N5975O3082
62778A041180P0304P7746Q5322R2935J00732J08430J14605J17492J16654J13136
$$ y = [443631, 444417, 445881, 447738, 449364, 450318, 450847, 451550, 452545, 453323, 453481, 453199, 452794, 452141, 450885, 448991, 446789, 444649, 442867, 441675, 441090, 440834, 440717, 440941, 441789, 443093, 444319, 445072, 445256, 444917, 444335, 444215, 445269, 447430, 449785, 451408, 452026, 451849, 451199, 450467, 450035, 449795, 449002, 447031, 444254, 441762, 440142, 438798, 436691, 433572, 430258, 427713, 426113, 424948, 423879, 423162, 423176, 423889, 425068, 426787, 429322, 432580, 436053, 439382, 442629, 445859, 448847, 451474, 454096, 457183, 460813, 464890, 469681, 475588, 482320, 488836, 494466, 499758, 505793, 512807, 519958, 526549, 533065, 540689, 550102, 561114, 573323, 586580, 600721, 615380, 630456, 646489, 664250, 684125, 706266, 731180, 759719, 792564, 830133, 873026, 922123, 978098, 1041180, 1111484, 1189230, 1274552, 1367487, 1468219, 1576649, 1691254, 1808746, 1925400, 2038536]
62768B038536J07763R9969Q8644P3512N5259L4859J3326q168k8574m7284o3957
62757B363885p8206q9746r8566j04627j07674j07712j05475j02043r8094r3774
62747A377968q8967q3389p6788o9509o2639n7001n2254m7534m2743l8503l4953
62736G23688l1467k7664k3901k0532j7421j4607j2650j1748j1069r617p416n255
62724E30341l615k491j932j985k190j909j187n41J02J496L795O009P274Q021R261
62709E50449J1122J2931J4517J6577J9591K3091K6413K9645L3354L7696M2320
62698H17706M7058N2154N7692O3192O8056P2187P5855P9084Q1408Q2210Q0964
62687A577566P7188P0518O1061M9422L6191K1561N715j0625k6364m0679n3171
$$ y = [2038536, 2146299, 2246268, 2334912, 2408424, 2463683, 2498542, 2511868, 2503700, 2475126, 2427842, 2363885, 2285679, 2195933, 2097367, 1992740, 1885066, 1777354, 1671879, 1569836, 1471742, 1377968, 1289001, 1205612, 1128824, 1059315, 996676, 939675, 887421, 839887, 797144, 758641, 723688, 692221, 664557, 640656, 620124, 602703, 588096, 575446, 563698, 552629, 543012, 535596, 530341, 526726, 524235, 522303, 520318, 518128, 516219, 515032, 514491, 514593, 516089, 519884, 525893, 533167, 541188, 550449, 561571, 574502, 589019, 605596, 625187, 648278, 674691, 704336, 737690, 775386, 817706, 864764, 916918, 974610, 1037802, 1105858, 1178045, 1253900, 1332984, 1414392, 1496602, 1577566, 1654754, 1725272, 1786333, 1835755, 1871946, 1893507, 1899222, 1888597, 1862233, 1821554, 1768383]
62676A768383o3467p1167p6345p9612q1432q1627p9908p6618p2453o7680o2170
62665I55904n6220n0764m6479m3043l9624l5828l1880k8161k4959k2521k0765
62654E55660j9001j6450j3309j0807r860r947r808q952p938p328o980o559o089
62641D22632n641m949l900l009k826l003k616j426j75N59J119J960K638K246O80
62626D04289j090k067k097j649j117o16j92P1K39N63J236K057K551K580K703L647
62610D11108N325O781P252P047P052P648Q525R448J0650J2349J4311J6155J7937
62597E41588K0153K3204K6950L0860L4635L8597M3257M8415N2981N5962N7354
62586I73956N7627N6618N3497M7850M0173L1188K1252J0658q6j0607k0833l0346
$$ y = [1768383, 1704916, 1633749, 1557404, 1477792, 1396360, 1314733, 1234825, 1158207, 1085754, 1018074, 955904, 899684, 848920, 802441, 759398, 719774, 683946, 652066, 623905, 598946, 576425, 555660, 536659, 520209, 506900, 496093, 486233, 476286, 466478, 457526, 449588, 442260, 435280, 428721, 422632, 416991, 412042, 408142, 405133, 402307, 399304, 396688, 395262, 395087, 395646, 396765, 398725, 401363, 403609, 404289, 403199, 401132, 399035, 397386, 396269, 395653, 395461, 395532, 395771, 396334, 397570, 399627, 402178, 404758, 407461, 411108, 416433, 423214, 430466, 437513, 444565, 452213, 460738, 470186, 480836, 493185, 507496, 523651, 541588, 561741, 584945, 611895, 642755, 677390, 715987, 759244, 807659, 860640, 916602, 973956, 1031583, 1088201, 1141698, 1189548, 1229721, 1260909, 1282161, 1292819, 1292733, 1282126, 1261293, 1230947]
62574A230947l8108m3355m6499m8581n0042n0605n0056m8536m6134m2945l9533
62563G26553l6645l4250l1574k8301k5141k2707k0524j7751j4553j1922j0265
62552D72920q940p341n796m943m705m391l641k783k194j755j107k16O52J335J857
62537D28952K155K040J572J151J009P61j49j546k398j791J01K229L741M689N653
62522D48169O927Q347R797J1581J4015J6827J9345K1363K3517K6550L0438L4510
62510F71386L8261M1680M4811M7396M9049M9495M8515M5915M1692L6132K9564
62499A143896K2186J4162N785k539j0306j6878k1701k4732k6323k6555k4928k1123
62487A010944j5846j0477n789j296M027J0582J7827K4846L1109L6652M1706M6201
$$ y = [1230947, 1192839, 1149484, 1102985, 1054404, 1004362, 953757, 903701, 855165, 809031, 766086, 726553, 689908, 655658, 624084, 595783, 570642, 547935, 527411, 509660, 495107, 483185, 472920, 463980, 456639, 450843, 445900, 441195, 436804, 433163, 430380, 428186, 426431, 425324, 425108, 425760, 427095, 428952, 431107, 433147, 434719, 435870, 436879, 437640, 437491, 435945, 433547, 431756, 431857, 434086, 437827, 442516, 448169, 455096, 463443, 473240, 484821, 498836, 515663, 535008, 556371, 579888, 606438, 636876, 671386, 709647, 751327, 796138, 843534, 892583, 942078, 990593, 1036508, 1078200, 1114332, 1143896, 1166082, 1180244, 1186029, 1183490, 1173184, 1156306, 1134605, 1109873, 1083550, 1056995, 1032067, 1010944, 995098, 984621, 978832, 977536, 981563, 992145, 1009972, 1034818, 1065927, 1102579, 1144285, 1190486]
62475A190486M9728N1727N1467M7981M0708L0617K0178J1446M257l278j2591k3594
62463A459132l5355m6771n6354o2556o5094o5345o4768o3459o0892n7287n3275
62452H27976m8676m2922l6583l1100k6830k2565j7478j2453q749o302m175k008
62440E68135q8J530K978M049M588N206O584Q212Q738P649N695L605J276j462m208
62425F22487o536q557j0467j2018j2907j3207j3115j2700j2163j1863j1671j0954
62413D86329r573q319p853p761p345o762o545o439n725m561l922m095m177l400
62399C99852k166j361j187j161r16m39J84R20J670K260K513K360J952J688J891
62384D08060K422K859L005L010L071L313L913M940O042O718O942P168P700Q433
$$ y = [1190486, 1240214, 1291941, 1343408, 1391389, 1432097, 1462714, 1482892, 1494338, 1498595, 1495317, 1482726, 1459132, 1423777, 1377006, 1320652, 1258096, 1193002, 1127657, 1062889, 999430, 938538, 881251, 827976, 779300, 736378, 699795, 668695, 641865, 619300, 601822, 589369, 580620, 574318, 570143, 568135, 568047, 569577, 572555, 576604, 581192, 586398, 592982, 601194, 609932, 617581, 623276, 626881, 628157, 626695, 622487, 615951, 607394, 596927, 584909, 572002, 558795, 545680, 532980, 520817, 508954, 497283, 486329, 476756, 468437, 460584, 452823, 445478, 438716, 432171, 425732, 420007, 415446, 411524, 407429, 403252, 399852, 397686, 396325, 395138, 393977, 393061, 392622, 392806, 393726, 395396, 397656, 400169, 402529, 404481, 406169, 408060, 410482, 413341, 416346, 419356, 422427, 425740, 429653, 434593, 440635, 447353, 454295, 461463, 469163, 477596]
62370D77596R275J0241J1033J1144J0731J0802J2141J4326J6324J7748J9192K1531
62358F42084K5232L0138L5553M0730M5565N0578N6016O1254O5325O7641O7795
62347A187911O5135N9153N0206L9439K8113J7308P821k48p573j4677k1268k7036
62335A384284l2622l8711m4400m7650m7620m5536m2918m0021l6529l2750k9186
62324I46341k5664k1889j8438j6257j5480j5589j6468j8323k0676k2443k3174
62313G31940k3374k3388k2932k1981k1251k1067k0517j8577j5655j3143j1578
62302E18477j0149q075n718m031l411l478l578l248k382j365p96q37r69o23J39
62287D69956Q65J406J953K475K613K280J949K076K579L084L491L952M460M806
$$ y = [477596, 486871, 497112, 508145, 519289, 530020, 540822, 552963, 567289, 583613, 601361, 620553, 642084, 667316, 697454, 733007, 773737, 819302, 869880, 925896, 987150, 1052475, 1120116, 1187911, 1253046, 1312199, 1362405, 1401844, 1429957, 1447265, 1455086, 1454838, 1447265, 1432588, 1411320, 1384284, 1351662, 1312951, 1268551, 1220901, 1173281, 1127745, 1084827, 1044806, 1008277, 975527, 946341, 920677, 898788, 880350, 864093, 848613, 833024, 816556, 798233, 777557, 755114, 731940, 708566, 685178, 662246, 640265, 619014, 597947, 577430, 558853, 543198, 530055, 518477, 508328, 500253, 494535, 490504, 487093, 483615, 480037, 476789, 474407, 473042, 472246, 471409, 470440, 469817, 469956, 470821, 472227, 474180, 476655, 479268, 481548, 483497, 485573, 488152, 491236, 494727, 498679, 503139, 507945]
62273E07945M905M865M789M754M979N756P045Q454R711J0982J2580J4511J6565
62260F17841J8759K1399K4716K8647L3123L8415M4882N2313N9747O6064P0779
62249A076685P4008P5719P5232P1666O4830N5572M5251L4904K4861J5052N487
62238A619267l712j2812k2541l3201m3842n2797n9267o3815o7081o8622o7559
62227A124018o3981n9040n3819m8770m4132m0192l6878l3701l0328k6899k3653
62216F62625k0713j8306j6645j5425j3988j2173j0509r268q055o638n534n099
62204E20272m720l655k256j408j089m19Q53J935K260K300K734L537M271M823N339
62189E34777N903O577P524Q646R435R527R222R121R432R863J0026R712Q923P922
$$ y = [507945, 512850, 517715, 522504, 527258, 532237, 537993, 545038, 553492, 563203, 574185, 586765, 601276, 617841, 636600, 657999, 682715, 711362, 744485, 782900, 827782, 880095, 939842, 1005906, 1076685, 1150693, 1226412, 1301644, 1373310, 1438140, 1493712, 1538963, 1573867, 1598728, 1613780, 1619267, 1615555, 1602743, 1580202, 1547001, 1503159, 1450362, 1391095, 1327280, 1260199, 1191577, 1124018, 1060037, 1000997, 947178, 898408, 854276, 814084, 777206, 743505, 713177, 686278, 662625, 641912, 623606, 606961, 591536, 577548, 565375, 554866, 545598, 537543, 530905, 525371, 520272, 515552, 511897, 509641, 508233, 507144, 506725, 507578, 509513, 511773, 514073, 516807, 520344, 524615, 529438, 534777, 540680, 547257, 554781, 563427, 572862, 582389, 591611, 600732, 610164, 620027, 630053, 639765, 648688, 656610]
62175F56610P084O504N916N239M947N593P131R074J1289J4214J8272K3323K8817
62162H04013L4282L9548M4590M9118N2355N3301N1342M6654L9901L1785K2891
62151A269780J3887N544j491p020j1477j5831k0937k6734l2186l6242l8741m0147
62139A058405m0585l9575l6809l2771k8328k3933j9503j5036j0977p864n722m138
62127G93164k850k071k110k861l824m458m333l161j054J335L372N109O976Q760
62113G91994R422Q135N192J562j957m818o407o214m394j888o0j83k676o480r634
62098G71594j1022j1300j1575j1672j0465p694m535k212r55l94k12k3O58J783
62084G01976K528K285J568J504K562M204N601O435P089Q309J0529J3297J5529
$$ y = [656610, 663694, 670198, 676114, 681353, 686300, 691893, 699024, 708098, 719387, 733601, 751873, 775196, 804013, 838295, 877843, 922433, 971551, 1023906, 1077207, 1128549, 1175203, 1215104, 1246889, 1269780, 1283667, 1289211, 1287720, 1280700, 1269223, 1253392, 1232455, 1205721, 1173535, 1137293, 1098552, 1058405, 1017820, 978245, 941436, 908665, 880337, 856404, 836901, 821865, 810888, 803024, 797302, 793164, 790314, 788243, 786133, 783272, 779448, 774990, 770657, 767496, 766442, 767777, 771149, 776258, 783234, 791994, 801416, 809551, 814743, 816305, 814348, 809530, 803123, 796909, 792515, 790627, 790567, 790384, 787708, 781228, 771594, 760572, 749272, 737697, 726025, 715560, 707866, 703331, 701119, 700164, 699770, 699558, 699535, 700193, 701976, 704504, 706789, 708357, 709861, 712423, 716627, 722228, 728663, 735752, 744061, 754590, 767887, 783416]
62071G83416J6450J6221J5524J4960J4924J5703J7236J9089K1034K3492K6973
62060I85022L1132L4836L7170L8080L7862L6331L2742K6657J8792J0803M043j356
62048A292114o100j0670j5184k0053k5927l2635l8858m3422m6447m8628m9816
62037I54374m9178m6596m3061l9535l6076l2397k8630k5183k2146j9310j6632
62026E95630j4361j2684j1444j0210q692p075n953n776o365p038p212o840o348
62013D85632o206o490o811o750o431o334o459o137m953l466k472j848q04Q10K222
61998D23503K824K873K889K951K946L015L269L389K932J852M29j094k495l459
61984D45824l904m230m928n911o636o776o499o053n381m285k861j685j439k240
$$ y = [783416, 799866, 816087, 831611, 846571, 861495, 877198, 894434, 913523, 934557, 958049, 985022, 1016154, 1050990, 1088160, 1126240, 1164102, 1200433, 1233175, 1259832, 1278624, 1289427, 1293470, 1292114, 1286014, 1275344, 1260160, 1240107, 1214180, 1181545, 1142687, 1099265, 1052818, 1004190, 954374, 905196, 858600, 815539, 776004, 739928, 707531, 678901, 653718, 631572, 612262, 595630, 581269, 568585, 557141, 546931, 538239, 531164, 525211, 519435, 513070, 506032, 498820, 491980, 485632, 479426, 472936, 466125, 459375, 452944, 446610, 440151, 434014, 429061, 425595, 423123, 421275, 420471, 421281, 423503, 426327, 429200, 432089, 435040, 437986, 441001, 444270, 447659, 450591, 452443, 452872, 451778, 449283, 445824, 441920, 437690, 432762, 426851, 420215, 413439, 406940, 400887, 395506, 391221, 388360, 386675, 385236, 382996]
61970C82996l262l355k228q16k75p81j596k027k005j755j418j058p39m40j14J29
61954C61256P2l36q88j311j376q60K54J519K346K680L083L934M889N458N874O834
61938C93428Q503J0182J1167J1514J1765J2144J2321J1908J0937R882R266R228
61926E22245R359R023P949O457N063L904K669J001j186l664n940p443p870p361
61912E34206o157m190j406J640L999N424O723Q659J0850J2306J2787J2914J2902
61899F10657J2002R591O345L648J961M12j845m292n560n157m196m108m970n519
61885F08969m830l429k539k610l062l293l407l931n194p110r253j0976j1768j1695
61871E25872j1342j1088j0625r399p478n702m909n041n145m273k427n06P45J587
$$ y = [382996, 379734, 376379, 374151, 373335, 373060, 372279, 370683, 368656, 366651, 364896, 363478, 362420, 361681, 361241, 361127, 361256, 361328, 360992, 360104, 358793, 357417, 356557, 356811, 358330, 360676, 363356, 366439, 370373, 375262, 380720, 386594, 393428, 401931, 412113, 423280, 434794, 446559, 458703, 471024, 482932, 493869, 503751, 513017, 522245, 531604, 540627, 548576, 555033, 560096, 564000, 566669, 567670, 566484, 562820, 556880, 549437, 541567, 534206, 528049, 523859, 522453, 524093, 528092, 533516, 540239, 548898, 559748, 572054, 584841, 597755, 610657, 622659, 632250, 638595, 642243, 644204, 644616, 642771, 638479, 632919, 627762, 623566, 619458, 614488, 608969, 604139, 600710, 598171, 595561, 592499, 589206, 585799, 581868, 576674, 569564, 560311, 549335, 537567, 525872, 514530, 503442, 492817, 483418, 475940, 470238, 465329, 460288, 455143, 450870, 448443, 447937, 448682, 450269]
61857D50269K882M927P018Q333Q924R555J0719J2200J3600J4998J6752J8790K0463
61844E99430K1201K1100K0599J9761J8247J5957J3218J0179O531K194k142n596
61832G40679p958r513j0233r938r001q107p064m724n12M516Q636J1028J1925J1725
61818G21459J0650R035P174M879J757k022n748r095j2388j5707j8252j9083j8304
61805F54355j6981j5970j5159j4054j2595j1185j0079r136q209p465p168p284
61793E19070p465p353o770n754m607l795l549l593l526l326l252l270l015k411
61779D57384j858j664j577j196n54m2J11o2l90n67j51R70K210K721K338J793J943
61762D61409K944M332N602O569P225P575P692P816Q150Q519Q404P456N879M149
$$ y = [450269, 453151, 458078, 465096, 473429, 482353, 491908, 502627, 514827, 528427, 543425, 560177, 578967, 599430, 620631, 641731, 662330, 682091, 700338, 716295, 729513, 739692, 746223, 748417, 746275, 740679, 732721, 723208, 712975, 703037, 694036, 685929, 678865, 674141, 673629, 678145, 686781, 697809, 709734, 721459, 732109, 741144, 748318, 753197, 754954, 752932, 747184, 738089, 725701, 709994, 691742, 672659, 654355, 637374, 621404, 606245, 592191, 579596, 568411, 558332, 549196, 540987, 533522, 526354, 519070, 511605, 504252, 497482, 491728, 487121, 483326, 479777, 476184, 472658, 469332, 466080, 462810, 459795, 457384, 455526, 453862, 452285, 451089, 450535, 450493, 450604, 450542, 450152, 449585, 449434, 450404, 452614, 455335, 457673, 459466, 461409, 464353, 468685, 474287, 480856, 488081, 495656, 503348, 511164, 519314, 527833, 536237, 543693, 549572, 553721]
61748E53721K470P54j001k606l988n215o218o773o988p379q231r081r141q107
61734D82217o414m789l724l263l093k895k598k203j516m17O55J008O92N73J158
61719D55391J841J848J454J557K282K796K510J827J468J522J476R09q4j005j424
61704D74368j410j484k055k918l490l465l072k817l109l949m788m890m152l357
61690D29412l282l726l897l565l293l544m099m467m455m173l809l535l345k948
61676C77274k116j175p90j146j714j927j741j408j105r64j098j319j160m24M72
61661C59659J022J193J214J069O44K19L44J079J756J810J556J795K653L246K758
61646C82017J560Q03J025J634J852J598J200P87M29M43R47J379J087K41m13n74
$$ y = [553721, 556191, 556945, 555944, 553338, 549350, 544135, 537917, 531144, 524156, 516777, 508546, 499465, 490324, 482217, 475803, 471014, 467290, 464027, 460934, 458039, 455441, 453238, 451722, 451305, 451960, 452968, 453660, 454233, 455391, 457232, 459080, 460534, 462091, 464373, 467169, 469679, 471506, 472974, 474496, 475972, 476881, 476797, 475792, 474368, 472958, 471474, 469419, 466501, 463011, 459546, 456474, 453657, 450548, 446599, 441811, 436921, 432769, 429412, 426130, 422404, 418507, 414942, 411649, 408105, 404006, 399539, 395084, 390911, 387102, 383567, 380222, 377274, 375158, 373983, 373193, 372047, 370333, 368406, 366665, 365257, 364152, 363188, 362090, 360771, 359611, 359187, 359659, 360681, 361874, 363088, 364157, 364801, 365020, 365364, 366443, 368199, 370009, 371565, 373360, 376013, 379259, 382017, 383577, 384380, 385405, 387039, 388891, 390489, 391689, 392476, 392905, 393348, 394295, 395674, 396761, 397002, 396589, 396015]
61630C96015n01k48L46Q85N71n96j578j757j822k635l797m191l566k779k583k886
61614C68878l204l255k924k217j450j143j534k361l222l944m503m860m984m904
61600C24373m574l855k765j648r42p93j007j346j725k136k509k748k798k588k045
61585B90894j349j022j435k264k778k699k373k018j392m89Qm29j252j445q01m8
61569B69108K12M3k39l69o2P08J294R74K8m16K04J246J869K005K069K207K253
61552B83134K034J512R53R52J725K468K123Q66o4j62k06o72p77J02J188J483J340
61535B97999J659K192J949Q96N3k3K47L97L80J36l92q47r15j070j904k873k810
61518B95074j706q10q47j194j190j057j030o61L14J224J324P82K10j21q8N78J656
$$ y = [396015, 395514, 395266, 395612, 396497, 397068, 396472, 394894, 393137, 391315, 388680, 384883, 380692, 377126, 374347, 371764, 368878, 365674, 362419, 359495, 357278, 355828, 354685, 353151, 350790, 347568, 343624, 339121, 334261, 329277, 324373, 319799, 315944, 313179, 311531, 310589, 309796, 308789, 307443, 305718, 303582, 301073, 298325, 295527, 292939, 290894, 289545, 288523, 287088, 284824, 282046, 279347, 276974, 274956, 273564, 273075, 273083, 272654, 271402, 269957, 269156, 269108, 269320, 269363, 269124, 268755, 268693, 269401, 270695, 271669, 271697, 271281, 271485, 272731, 274600, 276605, 278674, 280881, 283134, 285168, 286680, 287633, 288585, 290310, 292778, 294901, 295767, 295703, 295541, 295335, 294663, 293886, 293988, 295176, 296659, 297999, 299658, 301850, 303799, 304695, 304748, 304725, 304972, 305369, 305749, 305885, 305493, 304646, 303731, 302661, 300757, 297884, 295074, 293368, 292558, 291711, 290517, 289327, 288270, 287240, 286579, 286893, 288117, 289441, 290223, 290433, 290312, 290224, 290802, 292458]
61501B92458K190J623P40O49J286J709J514J129R02P30N75N79O38N23L73N60R71
61484C09149J044N72Mk10j04M6J05J71M95J314K405L020K685J903J545J664J520
61467C27328P28k93j132j760j986j318Q7J064O65o36j592j687j365j117r58p58
61451C15270m71K2Q19J688K230K347K247K039J646J175R27J074J550K162K538
61436C37263K141R02k56j48J264K753L262K864K137J276L03m03m61r5J81K89N14
61419C53786R12J206J206R64N64J58j4K3j52o81q95j24J118J487M19j225k319
61402C56433k592k403k026j589j328j386j560j583j423j159p78m00l47o67q56
61387C36336l84O05J473J826J830J801J832J826J740J694J870K314K864L325L621
$$ y = [292458, 294648, 296271, 297011, 297660, 298946, 300655, 302169, 303298, 304200, 304930, 305505, 306084, 306722, 307245, 307618, 308178, 309149, 310193, 310765, 310769, 310559, 310455, 310501, 310606, 310777, 311272, 312586, 314991, 318011, 320696, 322599, 324144, 325808, 327328, 328056, 327763, 326631, 324871, 322885, 321567, 321654, 322718, 323383, 322747, 321155, 319468, 318103, 316986, 316028, 315270, 314799, 314821, 315640, 317328, 319558, 321905, 324152, 326191, 327837, 329012, 329939, 331013, 332563, 334725, 337263, 339404, 340306, 340050, 339902, 341166, 343919, 347181, 350045, 352182, 353458, 353761, 353358, 352897, 352802, 352983, 353272, 353786, 354698, 355904, 357110, 358074, 358638, 358796, 358782, 358805, 358653, 357972, 357077, 356953, 358071, 359558, 359977, 358752, 356433, 353841, 351438, 349412, 347823, 346495, 345109, 343549, 341966, 340543, 339384, 338606, 338206, 337859, 337192, 336336, 335952, 336557, 338030, 339856, 341686, 343487, 345319, 347145, 348885, 350579, 352449, 354763, 357627, 360952, 364573]
61372C64573L751L688L539L571L813L766K933J596N67J85L2l01o61p39m81N8Q07
61355C90697J501J812J878K175K720L019L062L536M683N627N522M706M023L580
61341D38541K997K423K333K598K712K783L382M413N028M759M001L249K581K056
61327D83856J815J585P71n92j650j871j835k338l143l193j909J78K135L594M799
61312D82202N909O582O551O397P116Q846J0655J1956J3354J5352J6936J6606J4496
61299F22958J2186J0414Q274N019J409j394l238m588n560o235p191q777j0292
61286F12985j0862j0773j1012j1684j1913j1232j0152r160q041o536m975l776
61274E02869k849j890r15m3Q77J913K561K262J356R16J449K329K823L190M188
$$ y = [364573, 368324, 372012, 375551, 379122, 382935, 386701, 389634, 391230, 391797, 391982, 392014, 391713, 391052, 390313, 389832, 389890, 390697, 392198, 394010, 395888, 398063, 400783, 403802, 406864, 410400, 415083, 420710, 426232, 430938, 434961, 438541, 441538, 443961, 446294, 448892, 451604, 454387, 457769, 462182, 467210, 471969, 475970, 479219, 481800, 483856, 485671, 487256, 488027, 487435, 485785, 483914, 482079, 479741, 476598, 473405, 471496, 471674, 473809, 477403, 482202, 488111, 494693, 501244, 507641, 514757, 523603, 534258, 546214, 559568, 574920, 591856, 608462, 622958, 635144, 645558, 653832, 658851, 660260, 658866, 655628, 651040, 645480, 639245, 632054, 623277, 612985, 602123, 591350, 580338, 568654, 556741, 545509, 535357, 526197, 518156, 511620, 506645, 502869, 500020, 498130, 497215, 497172, 498049, 499962, 502523, 504785, 506141, 507057, 508506, 510835, 513658, 516848, 521036]
61259E21036N797P108P542P426P139O342M648K651J534J717K454K819K586K056
61245E82855J488R94O83N75M79J40n14j301j908k079j827j430j138r94r89j171
61229E73863j389j161j30J438K947M157N219O183O905P419P930Q438Q677Q509
61215F39005Q063P548P214P407Q131Q663Q061O189L869K058J225J422K337L231
61201G14423L392K870K370K425L185M826P364R985J1456J1589J1478J1882J2095
61188H09340J0989Q510N514K724M44j138k146l155m475n554n787n565n805o605
61174G97291p180p165p135p632q304q482q120p801p853p953p620p012o886p760
61160F90388r226j0376j0746j0586j0250r818r324q854q256p199n717m201k694
$$ y = [521036, 526833, 533941, 541483, 548909, 556048, 562390, 567038, 569689, 571223, 572940, 575394, 578213, 580799, 582855, 584343, 585337, 586020, 586595, 587074, 587214, 586700, 585399, 583491, 581412, 579585, 578155, 577017, 576023, 575034, 573863, 572474, 571313, 571183, 572621, 575568, 579725, 584944, 591127, 598032, 605451, 613381, 621819, 630496, 639005, 647068, 654616, 661830, 669237, 677368, 686031, 694092, 700281, 704150, 706208, 707433, 708855, 711192, 714423, 717815, 720685, 723055, 725480, 728665, 733491, 740855, 750840, 762296, 773885, 785363, 797245, 809340, 820329, 828839, 834353, 837077, 837521, 836383, 834237, 831082, 826607, 821053, 815266, 809701, 803896, 797291, 790111, 782946, 775811, 768179, 759875, 751393, 743273, 735472, 727619, 719666, 712046, 705034, 698148, 690388, 681162, 670786, 660040, 649454, 639204, 629386, 620062, 611208, 602952, 595753, 590036, 585835, 583141]
61147E83141q31J141J961O70k074m718o536p958r301j0030r521q005o401n334
61133E16204m525l206j129R10J903J930K086L074M441N547O585Q036R699J1032
61119E62587J2168J3703J5692J7630J9376K1241K3120K4391K4878K5163K5577
61108G85526K5583K4612K3052K1858K1389K1119K0319J8634J6067J2815R159N366
61096A005499J541k269n818q709j0816j2626j4809j7373j9526k0549k0697k0758
61084H53090k0987k0965k0516k0077j9902j9493j8377j6898j5698j4718j3441
61073F52018j1933j0892j0519j0025q574o338m217k787j891j135m21J56O81J385
61059E85508K330L364M423N620O885P846Q309Q596R094R752J0440J1467J3152
$$ y = [583141, 582310, 583451, 585412, 586082, 584008, 579290, 572754, 564796, 555495, 545465, 535944, 527939, 521538, 516204, 511679, 508473, 507344, 508254, 510157, 512087, 514173, 517247, 521688, 527235, 533820, 541856, 551555, 562587, 574755, 588458, 604150, 621780, 641156, 662397, 685517, 709908, 734786, 759949, 785526, 811109, 835721, 858773, 880631, 902020, 923139, 943458, 962092, 978159, 990974, 1000133, 1005499, 1007040, 1004771, 998953, 990244, 979428, 966802, 951993, 934620, 915094, 894545, 873848, 853090, 832103, 811138, 790622, 770545, 750643, 731150, 712773, 695875, 680177, 665459, 652018, 640085, 629193, 618674, 608649, 600075, 593737, 589520, 586733, 584842, 583707, 583286, 583442, 584123, 585508, 587838, 591202, 595625, 601245, 608130, 615976, 624285, 632881, 641975, 651727, 662167, 673634, 686786]
61046F86786J5059J6325J6787J7130J8036J9632K1676K3642K4839K5202K5786
61035I10900K7591L0014L1625L2323L3423L5529L7844L9908M2410M5500M7865
61024A314932M8478M7985M7407M6770M6213M7077N0476N5887O2520P0840Q1114
61013A919699R1593J00121J06903J14148J23923J38262J60366J93342K37994K93828
61003C480179L61621M43432N41791O62302Q16438J019157J284894J625913K040100
60994A2275827K474881K794127K809083K392279J595295O55313j32249n68355
60986B4296201o09958l26815J52236O45201R23406P90174K04142o69116j545448
60977B3860023k183545k489290k504557k330558k063796j772487j496164j251211
$$ y = [686786, 701845, 718170, 734957, 752087, 770123, 789755, 811431, 835073, 859912, 885114, 910900, 938491, 968505, 1000130, 1032453, 1065876, 1101405, 1139249, 1179157, 1221567, 1267067, 1314932, 1363410, 1411395, 1458802, 1505572, 1551785, 1598862, 1649338, 1705225, 1767745, 1838585, 1919699, 2011292, 2111413, 2218316, 2332464, 2456387, 2594649, 2755015, 2948357, 3186351, 3480179, 3841800, 4285232, 4827023, 5489325, 6305763, 7324920, 8609814, 10235727, 12275827, 14750708, 17544835, 20353918, 22746197, 24341492, 24996805, 24864556, 24296201, 23686243, 23359428, 23511664, 24156865, 25080271, 25870445, 26074587, 25405471, 23860023, 21676478, 19187188, 16682631, 14352073, 12288277, 10515790, 9019626, 7768415]
60969G768415j039744q59458p08108n82583m78662l93248l25067k72667k33135
60960B875743k03033j79338j59516j42040j26950j14791j04779r4956q4185p3038
60950A593117o2721n3973m7185m2723m0759m0982m2435m3589m3107m0983l8438
60939A096222l6312l4248l1864k9812k8809k8462k7979k7342k6766k5752k3890
60928G74986k1945k0838k0037j8334j5890j3967j2911j1923j0753j0084j0016
60917F08288r653q599p519o791n867m579l759l818l747k527p35K24Mm63l77J32
60901E50214N35O07M71L70M52O35O93N16K34L3n4j51m78j161j995k539k647k757
60883E42978l427m735o356p868q719q354o907n503n223n898o478o404o028n794
$$ y = [7768415, 6728671, 5869213, 5161105, 4578522, 4099860, 3706612, 3381545, 3108878, 2875743, 2672710, 2493372, 2333856, 2191816, 2064866, 1950075, 1845296, 1750340, 1666155, 1593117, 1530396, 1476423, 1429238, 1386515, 1345756, 1304774, 1262339, 1218750, 1175643, 1134660, 1096222, 1059910, 1025662, 993798, 963986, 935177, 906715, 878736, 851394, 824628, 798876, 774986, 753041, 732203, 712166, 693832, 677942, 663975, 651064, 639141, 628388, 618304, 608288, 598635, 590036, 582517, 575726, 569859, 565280, 561521, 557703, 553956, 551429, 550694, 550918, 550922, 550459, 550082, 550214, 550749, 551356, 551827, 552197, 552649, 553284, 553977, 554493, 554727, 554760, 554706, 554555, 554077, 552916, 550921, 548382, 545735, 542978, 539551, 534816, 528460, 520592, 511873, 503519, 496612, 491109, 485886, 479988, 473510, 467106, 461078, 455284]
60869D55284n679n452m933m032k999k492k836l334k902j327O37K308L579M454
60855D30276M812M661M075K898J122o04j455j344p35K39J622K751K631J361J76
60840D52486k05l77j121k312l438m318m836m678l899l111k672k253j662j382j709
60825D14513j954j277J14J226J477J058L62l60r55j410j856k283k461k382k403
60810D01409k673k862k779k794l189l524l208k389j721j533j756k318l079l542
60796C64042l346k816k494k220j423k69L34o5q58j365j722k367l100l217k471
60781C36643j391p39q61j509k019j711m45J159K244K484K173J687J182R00J274
60766C41071K416L672M200L898L454L495L978M427M387L646K364J086L19k0m02
$$ y = [455284, 449605, 444153, 439220, 435188, 432189, 429697, 426861, 423527, 420625, 419298, 419935, 422243, 425822, 430276, 435088, 439749, 443824, 446722, 447844, 447240, 445785, 444441, 443706, 443945, 445567, 448318, 450949, 452310, 452486, 452281, 451904, 450783, 448471, 445033, 440715, 435879, 431201, 427302, 424191, 421519, 419266, 417604, 416222, 414513, 412559, 411282, 411396, 412622, 414099, 415157, 415519, 415159, 414204, 412794, 410938, 408655, 406194, 403812, 401409, 398736, 395874, 393095, 390301, 387112, 383588, 380380, 377991, 376270, 374737, 372981, 370663, 367584, 364042, 360696, 357880, 355386, 353166, 351743, 351474, 351808, 351743, 350885, 349520, 347798, 345431, 342331, 339114, 336643, 335252, 334513, 333652, 332143, 330124, 328413, 327968, 329127, 331371, 333855, 336028, 337715, 338897, 339797, 341071, 343487, 347159, 351359, 355257, 358711, 362206, 366184, 370611, 374998, 378644, 381008, 382094, 382413, 382393, 381991]
60751C81991r00j047o54j98j62m19n78n70m65k01J27N8o75j751k819m007n401
60734C62329o444o506n731m760l920l253k923k900k598j654p70q87j795k461k561
60719C13166k634k764k281r53M29J048Q60K99j32Q5R70J561Q53o41j283m75P17
60702C08825J345J744K320K470J705Q57J055K066K660K308J607J289J583K323
60688C34157L065L180K439J395Q40J016J601K152K303J993J733K160L079L499
60674C64612K979K214J955K042K098K268K558K143L61k056l720m250m348m499
60660C64357m515m220l760l255k709k199j699r41L8O23N29N28J462K883L539L045
60644C53706K110J335O65M7l75p90j610k677l354l537l762m159m093l246k257
$$ y = [381991, 381091, 380044, 379390, 379192, 379030, 378611, 378033, 377463, 376998, 376797, 376924, 376982, 376307, 374556, 371737, 367730, 362329, 355885, 349379, 343648, 338888, 334968, 331715, 328792, 325892, 323294, 321640, 320870, 319983, 318188, 315727, 313166, 310532, 307768, 305487, 304534, 304963, 306011, 306871, 307170, 307038, 307123, 308093, 309654, 310507, 309866, 308583, 308108, 308825, 310170, 311914, 314234, 316704, 318409, 319266, 320321, 322387, 325047, 327355, 328962, 330251, 331834, 334157, 337222, 340402, 342841, 344236, 345076, 346092, 347693, 349845, 352148, 354141, 355874, 358034, 361113, 364612, 367591, 369805, 371760, 373802, 375900, 378168, 380726, 382869, 383230, 381174, 377454, 373204, 368856, 364357, 359842, 355622, 351862, 348607, 345898, 343699, 342000, 341059, 341097, 341720, 342249, 342777, 344239, 347122, 350661, 353706, 355816, 357151, 357816, 357863, 357488, 356698, 355088, 352411, 349057, 345520, 341758, 337599, 333506, 330260, 328003]
60629C28003j813j668j121j50N53N01O3L1P10J483J510P60P5L3K84K85J14O8n1
60610C29670m74q04o10l13m80o38J36J508K164J765J347J449J305N61L69J623
60594C38578L169L192J878J228K298L834M031K661R47q9n15r10j464j848j769
60579C55221j377r93o79k82K44Q42J566K423L061L133K983L468M949O901Q729
60564C90189J0403J2039J3327J3830J3411J2072R763O762L793J252j320m318o997
60551D74206q072p358o004m998m150k788q13J314L205M685N644O208O914Q238
60537D76231J0112J2188J4490J7323K0511K3200K4566K4298K2321J8550J3301
60526F77091P530K184k544o813j0302j2407j3132j3126j2801j2065j1071j0375
$$ y = [328003, 326190, 324522, 323401, 323251, 323804, 324305, 324368, 324399, 325109, 326592, 328102, 328862, 328937, 328970, 329254, 329539, 329653, 329721, 329670, 329196, 328392, 327782, 327469, 326989, 326351, 326487, 327995, 330159, 331924, 333271, 334720, 336025, 336586, 336955, 338578, 341747, 344939, 346817, 348045, 350343, 354177, 358208, 360869, 361816, 361727, 361212, 360302, 358838, 356990, 355221, 353844, 352851, 352172, 351890, 352134, 352976, 354542, 356965, 360026, 363159, 366142, 369610, 374559, 381460, 390189, 400592, 412631, 425958, 439788, 453199, 465271, 475034, 481796, 485589, 486841, 485521, 481203, 474206, 466134, 458776, 452772, 447774, 443624, 440836, 440023, 441337, 444542, 449227, 454871, 461079, 467993, 476231, 486343, 498531, 513021, 530344, 550855, 574055, 598621, 622919, 645240, 663790, 677091, 684621, 686805, 684261, 677448, 667146, 654739, 641607, 628481, 615680, 603615, 592544, 582169]
60514E82169j0034r249p468n238l401j995o93K61M67M79J402L443N787Q034J0782
60499E74746J4493J8711K2921K7436L2666L7991M2125M4499M5666M6287M6184
60488I53725M4510M0820L5804L0897K6958K3367J8674J2149M274m277j3535k3676
60476A149690l3990m3020m9660n3694n5365n4858n2376m8414m3703l8925l4538
60465F41147l0784k7688k5021k2317j9231j5971j3252j1561j0550r494q259p426
60453D39593p340p481p032n807m326l191k663k687k945k974k521j882j592j762
60439C85390j966j821j426j069p70l86p5k37r40j695j967j716j240p58m02l90
60423C68532p83j121p86J68J013J243J081R06O79K34k45m41l21k4M41J062J661
$$ y = [582169, 572135, 562886, 555418, 550180, 546779, 544784, 544091, 544352, 544819, 545298, 546700, 550143, 555930, 563964, 574746, 589239, 607950, 630871, 658307, 690973, 728964, 771089, 815588, 861254, 907541, 953725, 998235, 1039055, 1074859, 1105756, 1132714, 1156081, 1174755, 1186904, 1191178, 1186901, 1173366, 1149690, 1115700, 1072680, 1023020, 969326, 913961, 859103, 806727, 758313, 714610, 675685, 641147, 610363, 582675, 557654, 535337, 516106, 500135, 486883, 475322, 464772, 455278, 447019, 439593, 432253, 424772, 417740, 411933, 407607, 404416, 401753, 399066, 396121, 393147, 390626, 388744, 387152, 385390, 383424, 381603, 380177, 379108, 378338, 377952, 377877, 377640, 376700, 375005, 373038, 371322, 370082, 369324, 368922, 368532, 367749, 366628, 365842, 366010, 367023, 368266, 369347, 370253, 370932, 371166, 370921, 370480, 370159, 370135, 370576, 371638, 373299]
60406C73299K151K638K996K698J599M72K01O75J091J165J336J833K322K520K586
60391C99582K712K784K664K479K488K874L566M017L511K131J072J333K367K785
60377D36365K251J647J547J576J552J995L019L739L459K685K152J691Q32p3l11
60362D64126%J19q4O2R45K172L182L802M121M322M731N616O829Q038R294J0933
60346E28208J2793J3940J3493J1464Q598N466K039j776n505q285r734j0301j0583
60333E49817j0619j0167r384q619p799o594n273m617m842n196m981m382l977l895
60319D59472l918l858l504k639j534r20r52o86P73L067N186O945R039J1782J4639
60304D92892J7091J9217K1232K2968K4010K3972K2410J8847J3196O052j583q832
$$ y = [373299, 375450, 378088, 381084, 383782, 385381, 385853, 386054, 386729, 387820, 388985, 390321, 392154, 394476, 396996, 399582, 402294, 405078, 407742, 410221, 412709, 415583, 419149, 423166, 426677, 428808, 429880, 431213, 433580, 436365, 438616, 440263, 441810, 443386, 444938, 446933, 449952, 453691, 457150, 459835, 461987, 463678, 464510, 464437, 464126, 464126, 464245, 464161, 464223, 465168, 467340, 470522, 474324, 478445, 482767, 487498, 493114, 499943, 507981, 517275, 528208, 541001, 554941, 568434, 579898, 588496, 593962, 596001, 594225, 588720, 580435, 570701, 560400, 549817, 539198, 529031, 519647, 511028, 503229, 496635, 491362, 486745, 481903, 476707, 471726, 467344, 463367, 459472, 455554, 451696, 448192, 445553, 444019, 443099, 442147, 441461, 442234, 445301, 450487, 457432, 466471, 478253, 492892, 509983, 529200, 550432, 573400, 597410, 621382, 643792, 662639, 675835, 681887, 680304, 671472]
60292F71472j5225k0530k4353k6007k5111k2318j9005j6029j3145r980p025n077
60280D67667m092l294k280j382r43q41r01j229j957k937l810m182l799k842k019
60265D31159j972k568l088l145l000k979l014k931k741k471j910r42K8L11l38
60250D00399j339j799j391n87K9M72J080J791K173K183K287K627K609J739M09
60235D12682n53p48k68O45J525J741J273J069J904L153L537K865K181K170K368
60220D35544K198J887J979K498L148L870M724N531N993O052N905N772N824O154
60206D97079O646P031P223P380P569P576P156O434N837N694N890N940N543M983
60192E87981M733M648M014K580J060K12j39n61j015j122j151j812l105m206m596
$$ y = [671472, 656247, 635717, 611364, 585357, 560246, 537928, 518923, 502894, 489749, 479769, 472744, 467667, 463575, 460281, 458001, 456619, 455676, 454835, 453934, 452705, 450748, 447811, 444001, 439819, 436020, 433178, 431159, 429187, 426619, 423531, 420386, 417386, 414407, 411393, 408462, 405721, 403250, 401340, 400398, 400426, 400737, 400399, 399060, 397261, 395870, 395283, 395312, 395784, 396864, 398655, 400828, 403011, 405298, 407925, 410534, 412273, 412682, 412129, 411381, 411113, 411758, 413283, 415024, 416297, 417366, 419270, 422423, 425960, 428825, 431006, 433176, 435544, 437742, 439629, 441608, 444106, 447254, 451124, 455848, 461379, 467372, 473424, 479329, 485101, 490925, 497079, 503725, 510756, 517979, 525359, 532928, 540504, 547660, 554094, 559931, 565625, 571515, 577455, 582998, 587981, 592714, 597362, 601376, 603956, 605016, 605228, 605089, 604528, 603513, 602391, 601240, 599428, 596323, 592117, 587521]
60177E87521m602m665m762m810m942n142n080m598l890l051j983r22m53p31j255
60162E36635j660k137k808l265l172k812k542k214j552p46j61J83M30M88K76J02
60146E15045L63J001J642K068K241K106J678J145P13N81J173K828N072O641O813
60131E51110O289O308P166Q050Q049O844M679K226L29n65o75l51L78J431K255
60116F03523K314J863J636K043K953M056M939N107M528L885L800M016L889L320
60102F51872K572J555P2j418k269k734l626m836n277m500l400k859k605j929q42
60087F19776J42P64R83O52r3o07m35o5l26j274k210k622k638k665k994l745m796
60070E97847n798o501o954p249p337p328p605q240q662q340p510o710n935m920
$$ y = [587521, 582919, 578254, 573492, 568682, 563740, 558598, 553518, 548920, 545030, 541979, 539996, 539074, 538621, 537890, 536635, 534975, 532838, 530030, 526765, 523593, 520781, 518239, 516025, 514473, 513727, 513566, 513749, 514179, 514667, 514943, 515045, 515408, 516409, 518051, 520119, 522360, 524466, 526144, 527289, 528002, 528583, 529756, 532584, 537656, 544297, 551110, 557399, 563707, 570873, 578923, 586972, 593816, 598495, 600721, 601050, 600485, 599810, 599459, 599837, 601268, 603523, 605837, 607700, 609336, 611379, 614332, 618388, 623327, 628434, 632962, 636847, 640647, 644663, 648552, 651872, 654444, 655999, 656071, 654653, 652384, 649650, 646024, 641188, 635911, 631411, 628011, 625152, 622547, 620618, 619776, 619918, 620682, 621665, 622317, 622224, 621617, 621182, 621117, 620791, 619517, 617307, 614685, 612047, 609382, 606388, 602643, 597847, 592049, 585548, 578594, 571345, 564008, 556680, 549075, 540835, 532173, 523833, 516323, 509613, 503678, 498758]
60056D98758m033l992m683n034m369l208k441k203j963j290j52J232K454L106
60042D72182L223L329L790M346M561M507M556M735M671M216L707L485L452L169
60028E27929K309R44n25j702k467k924l103k953k673k769l529m600n384n702n837
60013D87014o041o321o627o887o874o394n644n062m704m123l005j652o58k63k71
59998D22488l76l83j42M10J074J459J282P02K82N61J558K760L612M017M268M579
59982D48151M847M857M496L752K705J543N00l48j098j814k434k864l058l056k948
59967D53231k809k578k086j376p59l58K04J322K745L830M314M404M193L530K588
59952D70395J839J303L45j380l218m150l762k385o51P35J218Q84M22K43no80j346
$$ y = [498758, 494725, 490733, 486050, 481016, 476647, 473439, 470998, 468795, 466832, 465542, 465390, 466622, 469076, 472182, 475405, 478734, 482524, 486870, 491431, 495938, 500494, 505229, 509900, 514116, 517823, 521308, 524760, 527929, 530238, 531182, 530657, 528955, 526488, 523564, 520461, 517508, 514835, 512066, 508537, 503937, 498553, 492851, 487014, 480973, 474652, 468025, 461138, 454264, 447870, 442226, 437164, 432460, 428337, 425332, 423680, 423022, 422759, 422488, 422112, 421729, 421587, 421997, 423071, 424530, 425812, 426514, 426796, 427357, 428915, 431675, 435287, 439304, 443572, 448151, 452998, 457855, 462351, 466103, 468808, 470351, 470851, 470503, 469405, 467591, 465157, 462293, 459235, 456179, 453231, 450422, 447844, 445758, 444382, 443623, 443265, 443469, 444791, 447536, 451366, 455680, 460084, 464277, 467807, 470395, 472234, 473537, 473882, 472502, 469284, 465134, 461372, 458987, 458336, 459071, 460289, 461173, 461595, 461838, 461833, 461153, 459807]
59935D59807j340q26n58p49q75n82j22K91R35K032L159L641L444L377M348O395
59919D82377Q571R815R926R509Q989Q191O961N718M956M566M158L773L750M052
59905E75312M217L941L296K448J577R09M91j8q98j870k429k567k703l045l378
59890E75283l394k824j499K25J386J349O55M32J111K324L751N234O235O151N298
59875F01717M716M872N223N166M656L745K370Q37k50p93j278j897k452l151m479
59860F19002n961o198m752k978k242k206j767q37j93j4L34J329K932M987P190
59845F08626Q939R758R739Q961O944L310j250n328p816q092n894j937J697K981
59831F30638J719p82l555o488r146j0444r949q587p510o854o113n208m567m360
$$ y = [459807, 458467, 457641, 457083, 456334, 455459, 454877, 454755, 455046, 455981, 458013, 461172, 464813, 468257, 471634, 475982, 482377, 490948, 500763, 510689, 520198, 529187, 537378, 544339, 550057, 555013, 559579, 563737, 567510, 571260, 575312, 579529, 583470, 586766, 589214, 590791, 591700, 592191, 592173, 591275, 589405, 586976, 584409, 581706, 578661, 575283, 571889, 569065, 567566, 567791, 569177, 570526, 571181, 571613, 572724, 575048, 578799, 584033, 590268, 596419, 601717, 606433, 611305, 616528, 621694, 626350, 630095, 632465, 633302, 633052, 632259, 630981, 629084, 626632, 623481, 619002, 613041, 606843, 602091, 599113, 596871, 594665, 592898, 592061, 591868, 591854, 592188, 593517, 596449, 601436, 608626, 617565, 627323, 637062, 646023, 652967, 656277, 655027, 649699, 641883, 633791, 627897, 625960, 627657, 630638, 632357, 631575, 628020, 621532, 612386, 601942, 591993, 583406, 575896, 569042, 562929, 557721, 553154, 548794]
59817E48794m159l428k176j072p68j145j446j343j345j800k056j338p6N40K33
59802E27415j22L3J64l13j058j377j182q90q43j171j849k488k493j826j236j295
59786E09469j555j218l98j21j066k691l815l765k897k117j982k263k371k047j430
59771D79733n79O81K277L656M349M503M572M634M442M039L921M437N339O085O451
59756E38540O660O986P551Q341R296J0203J0823J1176J1554J2045J2250J1733
59744F57158J0576R147P487N431L299J854J365J164N25m84j319j840k376l125
59730F88862l902m391m456m265m243m614m954m588l670l262l907m687m337k934
59716F30652j746j603k151k633k673k276j661j210j095q89L9J616L021L576L377
$$ y = [548794, 544635, 541207, 539031, 537959, 537191, 536046, 534600, 533257, 531912, 530112, 528056, 526718, 526642, 527182, 527415, 527293, 527326, 527490, 527177, 526119, 524742, 523560, 522670, 521827, 520656, 518807, 516319, 513826, 512000, 510764, 509469, 507914, 506696, 506298, 506177, 505111, 502420, 498605, 494840, 491943, 489826, 487844, 485581, 483210, 481163, 479733, 479154, 479835, 482112, 485768, 490117, 494620, 499192, 503826, 508268, 512307, 516228, 520665, 526004, 532089, 538540, 545200, 552186, 559737, 568078, 577374, 587577, 598400, 609576, 621130, 633175, 645425, 657158, 667734, 676881, 684368, 689799, 693098, 694952, 696317, 697481, 698006, 697522, 696203, 694363, 691987, 688862, 684960, 680569, 676113, 671848, 667605, 662991, 658037, 653449, 649779, 646517, 642610, 637923, 633586, 630652, 628906, 627303, 625152, 622519, 619846, 617570, 615909, 614699, 613604, 612715, 612754, 614370, 617391, 620967, 624344]
59701F24344L039L172L996N174O083O524O931P566Q006P893P682P869P904O898
59687G13081N104L596K564J233m97j632j699j486j648j718j316j271k538m660
59673G07113o336p049p290p562p918q219q194p472o149m928m203l453k121o07
59659F25612L85J043K066L497M744N593O313O916P211P474Q173Q951Q849P603
59645G04430N899M108J754j441m822p642r942j1960j3262j3205j1993j0591r678
59632F21655r107q365p179n735m517l907l758l575l269l405m376n616o141n828
59618E46877n533n898o532o692o316n925n733n424m797m165l817l510k825j827
59604D77883r94n13o1O31J382J796J677J032J2r58j302q69j85J88L16O09J035
$$ y = [624344, 627383, 630555, 634551, 639725, 645808, 652332, 659263, 666829, 674835, 682728, 690410, 698279, 706183, 713081, 718185, 721781, 724345, 725578, 725081, 723449, 721750, 720264, 718616, 716898, 715582, 714311, 711773, 707113, 700777, 693728, 686438, 678876, 670958, 662739, 654545, 647073, 640924, 635996, 631793, 628340, 626219, 625612, 625997, 627040, 629106, 632603, 637347, 642940, 649253, 656169, 663380, 670854, 679027, 687978, 696827, 704430, 710329, 714437, 716191, 714750, 709928, 702286, 692344, 680384, 667122, 653917, 641924, 631333, 621655, 612548, 604183, 597004, 591269, 586752, 582845, 579087, 575512, 572243, 568838, 564462, 558846, 552705, 546877, 541344, 535446, 528914, 522222, 515906, 509981, 504248, 498824, 494027, 489862, 486045, 482535, 479710, 477883, 476889, 476376, 476315, 476946, 478328, 480124, 481801, 482833, 482845, 481887, 480585, 479716, 479531, 479719, 480035, 480644, 481679]
59587D81679J104O49P7k59n70j204k017k461k167j335n90n67j432k632l317l209
59571D61749k845k793k832k350j363o54p73j367j698j517j096p26n11n01o35o54
59555D39434l90q5l7q7K05Q54J469J914K454L126L531L526L528L821M151M432
59539D71846N338P426J0210J2931J5947K0176K4925K7325K4616J6687O117l790
59527F39754j0724j3870j3627j1110p591m136j484J37J045J690K032J659N40p99
59513E83516j960l114m449n648o299o538o865p449q014q276q178p745p045o252
59499D95684n518m767l818k721j806j348j347j581j711j393n05O24J402J587J651
59484D74433K331L704M984N447N301N203N165M630L707L470M472N741O020N400
$$ y = [481679, 482783, 483432, 483509, 483250, 482680, 481476, 479459, 476998, 474831, 473496, 472906, 472339, 470907, 468275, 464958, 461749, 458904, 456111, 453279, 450929, 449566, 448912, 448139, 446772, 445074, 443557, 442461, 441735, 441224, 440723, 440088, 439434, 439044, 438959, 438922, 438835, 439040, 439894, 441363, 443277, 445731, 448857, 452388, 455914, 459442, 463263, 467414, 471846, 477184, 484610, 494820, 507751, 523698, 543874, 568799, 596124, 620740, 637427, 643544, 639754, 629030, 615160, 601533, 590423, 582832, 578696, 577212, 577349, 578394, 580084, 582116, 583775, 584315, 583516, 581556, 578442, 573993, 568345, 562046, 555508, 548643, 541194, 533180, 524904, 516726, 508981, 501936, 495684, 490166, 485399, 481581, 478860, 477054, 475706, 474359, 472778, 471067, 469674, 469169, 469793, 471195, 472782, 474433, 476764, 480468, 485452, 490899, 496200, 501403, 506568, 511198, 514905, 518375, 522847, 528588, 534608, 540008]
59470E40008M750M030K414Q0j554j738j378j544j967j819j195r09j192j395q04
59455E35787Q17L246N846P790Q719R036R234R193Q585P636P024P114P591P623
59441F35241O257L008j487n830r035j0981j1583j0440p924n767n455o444o968
59428E62592o323n341m754m188l035j357L86J967L437N021P028R433J1614J3053
59414E89533J4153J5744J7856J9986K2505K6455L1155L3035K8179J6169Q85j2359
59402H03296k0180k2200j9999j5473r689k651N753J4249J9573J8152R127m139
59390G75819j6180k3343k5620k4922k2587j8996j4691j0649p502n280l867l064
59378E99118k268q55R94K481L274L764M245M556M678M958N438N592N088M258L488
$$ y = [540008, 544758, 548788, 551202, 551282, 549728, 547990, 546612, 545068, 543101, 541282, 540087, 539178, 537986, 536591, 535787, 536604, 539850, 545696, 553486, 562205, 571241, 580475, 589668, 598253, 605889, 612913, 620027, 627618, 635241, 641498, 644506, 643019, 637189, 628154, 617173, 605590, 595150, 587226, 581459, 576004, 569560, 562592, 556269, 550928, 546174, 541986, 538951, 537594, 537980, 539947, 543384, 548405, 555433, 564866, 576480, 589533, 603686, 619430, 637286, 657272, 679777, 706232, 737387, 770422, 798601, 814770, 815655, 803296, 783116, 760916, 740917, 725444, 715755, 713104, 718857, 733106, 752679, 770831, 779958, 775819, 759639, 736296, 710676, 685754, 663167, 644171, 629480, 618831, 611329, 606049, 602182, 599118, 596850, 595995, 596989, 599470, 602744, 606508, 610753, 615309, 619987, 624945, 630383, 635975, 641063, 645321, 648809]
59363F48809K721J926J453J483J662J757K183L268M442M868M630M550N046N812
59349F94610O649P830R476J1180J2603J3982J5623J7179J7901J7613J6991J6706
59337H58343J6502J5464J3163J0230P577N350K900j97l562o487q702j0377j1613
59324H88591j2285j2364j2116j1804j1464j1055j0759j0823j1076j0978j0368
59313G63499r854j0104j0860j1176j0602r591q662p804o930o228n550m164j784
59300F60190O39K085L084N222R085J3508J6757J7484J4544P303l034j3220k0028
59287G13619k2495k1884j9955j7763j5614j3382j0852q111n633l697j997m9K188
59274E74375M397O354P978R192J0115J1222J2882J4733J5896J5859J4896J3582
$$ y = [648809, 651530, 653456, 654909, 656392, 658054, 659811, 661994, 665262, 669704, 674572, 679202, 683752, 688798, 694610, 701259, 709089, 718565, 729745, 742348, 756330, 771953, 789132, 807033, 824646, 841637, 858343, 874845, 890309, 903472, 913702, 921279, 926629, 929529, 929332, 925770, 919283, 910581, 900204, 888591, 876306, 863942, 851826, 840022, 828558, 817503, 806744, 795921, 784845, 773867, 763499, 753645, 743541, 732681, 721505, 710903, 701312, 692650, 684846, 677916, 671688, 666138, 661974, 660190, 660829, 662914, 665998, 671220, 680305, 693813, 710570, 728054, 742598, 749901, 746867, 733647, 713619, 691124, 669240, 649285, 631522, 615908, 602526, 591674, 583563, 577930, 574233, 572236, 572187, 574375, 578772, 585126, 593104, 602296, 612411, 623633, 636515, 651248, 667144, 683003, 697899, 711481]
59262G11481J2105J0229P727M732J660j132l485n364o824q090r371j0355j0265
59249F93048q809o856n650n421n291m578l558k830k417j855p96O45J957K521K164
59234F52274J491J317J740K249K657L288M072M240L370K095J251P97J37q81j964
59219F78133l086m487o056p199p405o743n754n071m954n083n018m819m861m948
59205F02649m339k962j874j941k613k764k257j804j628j248n46m0J11M84J446
59190E80674K511L054L238L687M544N265N302M783M453M951O068O845O618N833
59176F47826N497N879O187N607M247K920K271K299K500K398J986J804K356L470
59162F97247M364M469L855K926J898P99l06j331k419l931o067q474j0330j0968
$$ y = [711481, 723586, 733815, 741542, 746274, 747934, 746802, 743317, 737953, 731129, 723039, 713668, 703313, 693048, 684239, 677383, 671733, 666312, 661021, 656443, 652885, 650055, 647638, 645783, 644987, 645632, 647589, 650110, 652274, 653765, 655082, 656822, 659071, 661728, 665016, 669088, 673328, 676698, 678793, 680044, 680841, 680978, 680097, 678133, 675047, 670560, 664504, 657305, 649900, 643157, 637403, 632332, 627378, 622295, 617277, 612458, 607597, 602649, 598310, 595348, 593474, 591533, 588920, 586156, 583899, 582095, 580467, 579219, 578673, 578633, 578744, 579228, 580674, 583185, 586239, 589477, 593164, 597708, 602973, 608275, 613058, 617511, 622462, 628530, 635375, 641993, 647826, 653323, 659202, 665389, 670996, 675243, 678163, 680434, 682733, 685233, 687631, 689617, 691421, 693777, 697247, 701611, 706080, 709935, 712861, 714759, 715558, 715252, 713921, 711502, 707571, 701504, 693030, 682700, 671732]
59148F71732j0503r762r521r876j0322j0296r658q838q553r058r649r281p850
59135E48565o421n850n687m970l684k739k643k890k735j919n93R86K469L668M861
59120E20418O413P996Q782Q640Q542R329J0571J1137J0566R423Q497Q130Q206
59107F36650Q244P555N806L544J831J172J043O39k20j071j546j841k431l516m825
59092F51034n861o223n753m530k941j592r63r90j096p57j4N89M79n83k366m265
59076F14168n629o250o462o617o581o021n129m529m394m180l526k975l179l802
59062E44894m000l828m142n020n245m008k231j425j717k033j834j638j894k318
59048E03561k558k662k589k008r33N8O11J009J466J541Q19l10j025r37k08Q20
$$ y = [671732, 661229, 651467, 641946, 632070, 621748, 611452, 601794, 592956, 584403, 575345, 565696, 556415, 548565, 542144, 536294, 530607, 525637, 521953, 519214, 516571, 513681, 510946, 509027, 508434, 509420, 511889, 515557, 520418, 526831, 534827, 543609, 552249, 560791, 570120, 580691, 591828, 602394, 611817, 620314, 628444, 636650, 644894, 652449, 658255, 661799, 663630, 664802, 665845, 666484, 666264, 665193, 663647, 661806, 659375, 655859, 651034, 645173, 638950, 633197, 628667, 625726, 624134, 623171, 622181, 621085, 620328, 620314, 620903, 621382, 620799, 618433, 614168, 608539, 602289, 595827, 589210, 582629, 576608, 571479, 566950, 562556, 558376, 554850, 551875, 548696, 544894, 540894, 537066, 532924, 527904, 522659, 518651, 516420, 514995, 513278, 511245, 509411, 507773, 505879, 503561, 501003, 498341, 495752, 493744, 492811, 492869, 493480, 494489, 495955, 497496, 498315, 498005, 496980, 496043, 495835, 496655]
59032D96655J712K007J773J757K560L847M821N253N636O523Q127J0298J2466J3860
59018E77295J4216J4068J3939J3536J2217R936P144M038O50k531m772n981o690
59005F47065p154p104o492n684m726l107o56J844L516M369N044N708N786M738
58991F43147K856J119L16L03K63k36p28o20j80k07p96j107n25N64J504K359L624
58974F51656N348P073Q571J0101J1881J3670J4998J5633J5714J5554J5400J5233
58962H00832J4732J3586J1943J0386R294Q288O602M007J040j874n115r208j3617
58949H50896j6925j8296j8375j8300j8364j7958j6633j4709j2897j1638j0766
58938F76035r679p937n833m162l301k767j914p36K97R02J149J208J301J655K160
$$ y = [496655, 498367, 500374, 502147, 503904, 506464, 510311, 515132, 520385, 526021, 532544, 540671, 550969, 563435, 577295, 591511, 605579, 619518, 633054, 645271, 655207, 662351, 666389, 667039, 664508, 659736, 653755, 647065, 639911, 632807, 626315, 620631, 615905, 612798, 612142, 613986, 617502, 621871, 626915, 632623, 638409, 643147, 646003, 647122, 647438, 647741, 648004, 647768, 647040, 646420, 646240, 646033, 645237, 644130, 643605, 644169, 645673, 648032, 651656, 657004, 664077, 672648, 682749, 694630, 708300, 723298, 738931, 754645, 770199, 785599, 800832, 815564, 829150, 841093, 851479, 860773, 869061, 875663, 879670, 880710, 878836, 873721, 864513, 850896, 833971, 815675, 797300, 779000, 760636, 742678, 726045, 711336, 698439, 686801, 676035, 666356, 658419, 652586, 648424, 645123, 642356, 640442, 639706, 640003, 640905, 642054, 643262, 644563, 646218, 648378]
58923F48378K266J624O16j30m99q21j296j895k507k806k336j214l78m72q28l26
58907F37376J044K329L124L958N232O704Q187R855J1643J3179J4505J6010J7414
58894G50560J7685J6432J4560J3103J2181J1594J1660J2719J4407J6126J7753
58883I08780J9191J9753J8812J6752J4509J2335R766O653L481O47j927m311o294
58870A018147p735q747r400r516q953p864o632n735n542o023o672p078p489q528
58856I12233j0278j1999j2874j2803j2383j2226j2414j2480j1860j0477q906p900
58844G75633p744q127q563q845r065r389r843j0318j0702j0967j1049j0714r700
58831F50607q164o814o294o377o009m407k045k49K88K59P87K010L083L521L804
$$ y = [648378, 650644, 652268, 652884, 652754, 652255, 651434, 650138, 648243, 645736, 642930, 640594, 639380, 639002, 638530, 637702, 637376, 638420, 640749, 643873, 647831, 653063, 659767, 667954, 677809, 689452, 702631, 717136, 733146, 750560, 768245, 784677, 799237, 812340, 824521, 836115, 847775, 860494, 874901, 891027, 908780, 927971, 947724, 966536, 983288, 997797, 1010132, 1019898, 1026551, 1030032, 1030679, 1028752, 1024441, 1018147, 1010412, 1001665, 992265, 982749, 973796, 965932, 959300, 953565, 948023, 942000, 935328, 928250, 920761, 912233, 901955, 889956, 877082, 864279, 851896, 839670, 827256, 814776, 802916, 792439, 783533, 775633, 767889, 759762, 751199, 742354, 733289, 723900, 714057, 703739, 693037, 682070, 671021, 660307, 650607, 642443, 635629, 629335, 622958, 616949, 612542, 610497, 610248, 610536, 610795, 611582, 613592, 616675, 620196, 624000]
58816F24000M453N156N354N183N167N257M921M125L426L056K593J756R16M04j57
58801F75610j363l191n012o287o906p007o828o722o987p581q032p773o639n099
58787E90183l830k990k090p78N49J257J478K086L640N754P596Q716R279R705J0081
58772F40636R840Q135M834Q78k646n524q005r786j0237r594q932q807q599p625
58758E84568o158m920m104l385k543j616o71K09Q78J271J427J305Q15Q2n64q80
58742E65714o59L98K235M042M936N059N251N687N751N351N276N885O371N954M930
58727F32181L980L216K601K488K898L005K199J140Q60J332J875K512L732N162
58713F69181N708N186M793N529O865P401O381M235J883j76k189m602p301r620
$$ y = [624000, 628453, 633609, 638963, 644146, 649313, 654570, 659491, 663616, 667042, 670098, 672691, 674447, 675363, 675767, 675610, 674247, 671056, 666044, 659757, 652851, 645844, 639016, 632294, 625307, 617726, 609694, 601921, 595282, 590183, 586353, 583363, 581273, 580495, 581044, 582301, 583779, 585865, 589505, 595259, 602855, 611571, 620850, 630555, 640636, 650476, 658611, 663445, 664323, 661677, 656153, 648148, 638362, 628125, 618531, 609599, 600792, 592193, 584568, 578410, 573490, 569386, 566001, 563458, 561842, 561171, 561380, 562258, 563529, 564956, 566261, 567076, 567158, 566594, 565714, 565055, 565453, 567688, 571730, 576666, 581725, 586976, 592663, 598414, 603765, 609041, 614926, 621297, 627251, 632181, 636161, 639377, 641978, 644466, 647364, 650369, 652568, 653708, 654568, 655900, 657775, 660287, 664019, 669181, 674889, 680075, 684868, 690397, 697262, 704663, 711044, 715279, 717162, 716986, 714797, 710195, 702894, 693274]
58699F93274j1210j2496j4007j5660j7000j7793j7941j7283j5907j4329j2834
58688E26814j1079q906p048o234n987n264m047l326l503l780l463k934k903l325
58674D55015l517l080k231j366n30O20K305M070N098N325N811P495R901J1642
58660D96558J1967J1101R234O169K120j903m905o653p467p723p794p844p501o255
58646D79104m410l083k858l039k729k140k125k729l005k360j309o99o33n63j05
58631D47317O62J540K430L139L376L022K240J197J0r95j311q93l94l89n89l03
58615D60059N62J538K460L607M922N825N982N696N328M855M261L716L143K152
58601E14106Q48J21O30J864K644K326J173j14q77q90n55m41m30K15J788L652N083
$$ y = [693274, 682064, 669568, 655561, 639901, 622901, 605108, 587167, 569884, 553977, 539648, 526814, 515735, 506829, 499781, 493547, 487560, 482296, 478249, 474923, 471420, 467640, 464177, 461243, 458340, 455015, 451498, 448418, 446187, 444821, 444291, 444911, 447216, 451286, 456384, 461709, 467520, 475015, 484916, 496558, 508525, 519626, 528860, 535029, 537149, 535246, 530341, 523688, 516221, 508498, 500704, 492860, 485359, 479104, 474694, 471611, 468753, 465714, 462985, 460845, 458720, 455991, 452986, 450626, 449317, 448618, 447985, 447422, 447317, 447979, 449519, 451949, 455088, 458464, 461486, 463726, 464923, 464933, 463938, 462627, 461734, 461340, 460951, 460362, 460059, 460621, 462159, 464619, 468226, 473148, 478973, 484955, 490651, 495979, 500834, 505095, 508811, 511954, 514106, 514954, 515075, 515705, 517569, 520213, 522539, 523712, 523598, 522721, 521831, 521276, 520835, 520405, 520620, 522408, 526060, 531143]
58584E31143O034O745P299P893Q943J0360J1338J1320J0619R699Q546P286O573
58571F43798O576O409N489M767N625Q014J0727J3053J5143J7092J8783K0446K2345
58558G98267K3994K4615K4216K3298K1663J8498J3656P988K387k601o330q234
58546I41417q609q430q217p732o809n809n237n554p338j0866j5423j9668k2688
58533H09037k4223k4195k2752k0697j8935j7432j5430j2677r844p632o113n004
58521F24103m008k988k132j819j899j633q90p29j875l334l614k781k074j909j730
58506E90688j501j770k277k066j153n98p07o14kK90j76o46n72m22m60RJ351K651
58488E82025L023K901L202L972M755N588O764Q111R251J0218J1240J2304J3370
$$ y = [531143, 537177, 543922, 551221, 559114, 568057, 578417, 589755, 601075, 611694, 621393, 629939, 637225, 643798, 650374, 656783, 662272, 667039, 672664, 680678, 691405, 704458, 719601, 736693, 755476, 775922, 798267, 822261, 846876, 871092, 894390, 916053, 934551, 948207, 956195, 958582, 955981, 949651, 941417, 932808, 924378, 916161, 908429, 901620, 895811, 890574, 885020, 877682, 866816, 851393, 831725, 809037, 784814, 760619, 737867, 717170, 698235, 680803, 665373, 652696, 642852, 635220, 629107, 624103, 620095, 617107, 614975, 613156, 611257, 609624, 608734, 608005, 606130, 602796, 599182, 596401, 594327, 592418, 590688, 589187, 587417, 585140, 583074, 581921, 581323, 580616, 580002, 580000, 580290, 580114, 579468, 578896, 578474, 578014, 578023, 579374, 582025, 585048, 587949, 591151, 595123, 599878, 605466, 612230, 620341, 629592, 639810, 651050, 663354, 676724]
58475F76724J4601J5991J7111J7441J6555J3953R529M336j2l055n768q799j1297
58462G57310j2057j1027r093o962m829k644k17K536N189P159Q552J0072J1862
58449G55851J3196J3439J2491J0156O044O33m606q590j1389j3232j3710j2673
58437G47610j1042r846q985p611n439l006r75M08J314K158L235M516N903P505
58423G25745R211J0418J0808J0989J1429J1205Q986N047J015k225m975p184q213
58410G82256q313q670r485r659q941q620r343r834q858p060n673m640l199j467
58396F78494j44O73J448K414L473M389M658L924K724K000J746J224N08M17P64
58381G08712M58l03J94K582N394P467R395J1587J2948J2766J2106J1828J1093
$$ y = [676724, 691325, 707316, 724427, 741868, 758423, 772376, 781905, 786241, 786229, 783174, 777406, 768607, 757310, 745253, 734226, 725133, 718171, 713342, 710698, 710481, 713017, 718206, 725365, 733917, 743989, 755851, 769047, 782486, 794977, 805133, 811177, 811810, 807204, 798614, 787225, 773993, 760283, 747610, 736568, 726722, 717737, 710126, 704687, 701681, 700706, 701114, 702428, 704586, 707821, 712337, 718240, 725745, 734956, 745374, 756182, 767171, 778600, 789805, 798791, 803838, 804853, 802628, 797653, 790469, 782256, 773943, 765273, 755788, 746129, 737188, 728568, 719225, 709391, 700533, 693473, 687800, 683160, 679961, 678494, 678350, 679023, 680471, 682885, 686358, 690747, 695405, 699329, 702053, 704053, 705799, 707023, 707531, 707948, 708712, 709170, 708867, 709061, 711643, 717037, 724504, 733899, 745486, 758434, 771200, 783306, 795134, 806227]
58368H06227R310P881Q114R011R038Q705R307J0448J0891J0921J1611J2603J2670
58355I36737J1884J1236J0648R240P157N350L923K376J026N48N73L34L18J582
58341A002932L796N586O490P071P485P519P735Q967J0873J2384J3367J4467J5611
58328A124283J6088J5879J5558J5069J3894J2158J0426Q683O688M946M176M138
58316A251986M080L856L749L750M000N055O775P910Q011Q557J0738J3325J4441
58303A346233J4417J4951J6300J7281J7519J7691J7944J7798J7414J7433J7906
58292A532887J8579J9638K0987K1676K1379K1393K2664K4077K4381K4506K5926
58281A778093K7950K8824K8605K8718K9492L0315L1386L3111L4543L4666L4461
$$ y = [806227, 815537, 823418, 831532, 840543, 849581, 858286, 867593, 878041, 888932, 899853, 911464, 924067, 936737, 948621, 959857, 970505, 979745, 986902, 992252, 996175, 998551, 999577, 1000125, 1000698, 1001032, 1001350, 1002932, 1006728, 1012314, 1018804, 1025875, 1033360, 1040879, 1048614, 1057581, 1068454, 1080838, 1094205, 1108672, 1124283, 1140371, 1156250, 1171808, 1186877, 1200771, 1212929, 1223355, 1232038, 1238726, 1243672, 1247848, 1251986, 1256066, 1259922, 1263671, 1267421, 1271421, 1276476, 1283251, 1291161, 1299172, 1307729, 1318467, 1331792, 1346233, 1360650, 1375601, 1391901, 1409182, 1426701, 1444392, 1462336, 1480134, 1497548, 1514981, 1532887, 1551466, 1571104, 1592091, 1613767, 1635146, 1656539, 1679203, 1703280, 1727661, 1752167, 1778093, 1806043, 1834867, 1863472, 1892190, 1921682, 1951997, 1983383, 2016494, 2051037, 2085703, 2120164]
58270B120164L5580L7701L9359M0540M2204M4165M5650M7216M9799N2860N5536
58259B610774N8544O2645O6519O8602O9670P1085P1989P1159P0095P1086P3539
58248C365707P5535P7604Q1474Q6373R0269R3737R8841J05271J11370J17839J26458
58237D430478J36055J43975J50634J58536J67661J76117J84590J95694K09573
58228E953313K24415K40512K59376K79899K99983L21049L46123L74580M03727
58219H702977M34331M69306N08375N49676N95362O49672P12855P83067Q62674
58210A4268295R56217J063968J184624J322734J486424J680181J907793K180135
58202B6050371K512238K916323L407390M012543M765700N698223O846078Q262088
$$ y = [2120164, 2155744, 2193445, 2232804, 2273344, 2315548, 2359713, 2405363, 2452579, 2502378, 2555238, 2610774, 2669318, 2731963, 2798482, 2867084, 2936754, 3007839, 3079828, 3150987, 3221082, 3292168, 3365707, 3441242, 3518846, 3600320, 3686693, 3776962, 3870699, 3969540, 4074811, 4186181, 4304020, 4430478, 4566533, 4710508, 4861142, 5019678, 5187339, 5363456, 5548046, 5743740, 5953313, 6177728, 6418240, 6677616, 6957515, 7257498, 7578547, 7924670, 8299250, 8702977, 9137308, 9606614, 10114989, 10664665, 11260027, 11909699, 12622554, 13405621, 14268295, 15224512, 16288480, 17473104, 18795838, 20282262, 21962443, 23870236, 26050371, 28562609, 31478932, 34886322, 38898865, 43664565, 49362788, 56208866, 64470954]
58194F4470954J0014319J2187678J4905676J8339465K2672136K8033501L4371103
58187B04994832M1133129M6823474M8936905M4846844L3434877J6278423k733486
58180D33714998j9236005l0367178l5629501l6405202l4776246l2439319l0182771
58173B14678776k8005080k5617171k2891150j9965999j7084865j4431352j2096669
58166G4586490j0110095q455109p083485n945739n008204m241268l609659l083088
58158B7049843k643956k278104j968838j705138j485200j306061j157789j031789
58150A3472968r26503q40639p68030p03048o44748n92367n42572m94090m49626
58141G511345m10556l74622l40633l10447k84525k60793k39687k25089k17951
$$ y = [64470954, 74485273, 86672951, 101578627, 119918092, 142590228, 170623729, 204994832, 246127961, 292951435, 341888340, 386735184, 420170061, 436448484, 433714998, 414478993, 384111815, 348482314, 312077112, 277300866, 244861547, 214678776, 186673696, 161056525, 138165375, 118199376, 101114511, 86683159, 74586490, 64476395, 56021286, 48937801, 42992062, 37983858, 33742590, 30132931, 27049843, 24405887, 22127783, 20158945, 18453807, 16968607, 15662546, 14504757, 13472968, 12546465, 11705826, 10937796, 10234748, 9590000, 8997633, 8455061, 7960971, 7511345, 7100789, 6726167, 6385534, 6075087, 5790562, 5529769, 5290082, 5064993, 4847042]
58132D847042k13535k07186j98670j89061j77771j64982j53158j43724j35275
58123C263680j26738j19172j12959j06435r8939r2247q7435q3119p8151p3418
58113B285067o9619o5840o1573n7793n4958n2155m9156m7075m6185m5308m4013
58102A691392m3169m2804m1708l9809l8508l8153l7437l5889l4630l4061l3083
58091A272141l1197k9153k7092k4366k1544k0188k0102j9315j7389j6249j6926
58080A028620j8004j8182j8071j8382j8510j8005j7544j7447j7012j6107j5656
58069H35700j5862j5713j4845j4135j3847j3066j1519j0077r007p666o337o278
58057F97348p386q031p851q398j0209j1592j1405j0834j1064j1247j0193q361
$$ y = [4847042, 4633507, 4426321, 4227651, 4038590, 3860819, 3695837, 3542679, 3398955, 3263680, 3136942, 3017770, 2904811, 2798376, 2699437, 2607190, 2519755, 2436636, 2358485, 2285067, 2215448, 2149608, 2088035, 2030242, 1975284, 1923129, 1873973, 1826898, 1780713, 1735405, 1691392, 1648223, 1605419, 1563711, 1523902, 1485394, 1447241, 1409804, 1373915, 1339285, 1305224, 1272141, 1240944, 1211791, 1184699, 1160333, 1138789, 1118601, 1098499, 1079184, 1061795, 1045546, 1028620, 1010616, 992434, 974363, 955981, 937471, 919466, 901922, 884475, 867463, 851356, 835700, 819838, 804125, 789280, 775145, 761298, 748232, 736713, 726636, 717629, 709963, 703626, 697348, 689962, 681931, 674080, 665682, 655473, 643881, 632476, 621642, 610578, 599331, 589138, 580777]
58045E80777o801n610m642m318m625m623l982l617l985m221l843l670m199m612
58031E18029m474m814o368q163q998r048q990q840q607q756r039q267o256m601
58017D12808m474n017m957m478m206l801k853k083k250k851l036k889k765k312
58003C64836j311m39j85J15J099K226K824L272M172N199N855O340O648N806L185
57988D09642k36k957m547n267n159m573m601n765p025p114o142m939l780k875
57974C44662k957m132m960m121k294j112r36r47p64n54q6R03J711J464O52O40
57958C27169J693K601K291Q77q54k203k891l220l739m303l982k443q03l14p86
57943C09093j115q05p5R44K219L386M197N010O014O615O390O093O697P866Q407
$$ y = [580777, 573976, 568366, 563724, 559406, 554781, 550158, 546176, 542559, 538574, 534353, 530510, 526840, 522641, 518029, 513555, 508741, 502373, 494210, 485212, 476164, 467174, 458334, 449727, 440971, 431932, 423665, 417409, 412808, 408334, 403317, 398360, 393882, 389676, 385875, 383022, 380939, 378689, 375838, 372802, 369913, 367148, 364836, 363525, 363086, 362901, 363016, 364115, 366341, 369165, 372437, 376609, 381808, 387663, 394003, 400651, 406457, 409642, 409406, 406449, 401902, 396635, 391476, 386903, 382302, 376537, 369512, 362398, 356256, 351317, 347537, 344662, 341705, 337573, 332613, 328492, 326198, 325086, 324150, 323203, 322439, 321885, 321799, 322702, 324413, 325877, 326529, 327169, 328862, 331463, 333754, 334631, 333777, 331574, 328683, 325463, 321724, 317421, 313439, 310996, 310193, 309879, 309093, 307978, 307173, 307098, 308042, 310261, 313647, 317844, 322854, 328868, 335483, 341873, 347966, 354663, 362529, 370936]
57928C70936P772O204L918J246r38k141l193n063p071p722p018o500o885p151
57914C36394o368n044m010l123j899o56p6M7P07K367M228N032M311K700J092j60
57898C35542j115j661j661j443j532j765j370j86R08J092N25j54o76j012j059
57883C24433r12r56j258j380j199j224j688k071k040k116k771l602m043m182m129
57868B90862l440k014q06n83o62n6P95Q21M27J184L395N388N676M757M216M790
57852C14750N876O540O476O086N781N387M408K814J155k33j489k534k835k438
57838C49744k391l414m785n312m924m455m303m195l948l664l316k881k615k606
57824B96935k414j752j088q90q26m93l17p72j235p09O35J710K038J983J667P56
$$ y = [370936, 378708, 384912, 388830, 390076, 389138, 386997, 383804, 378741, 371670, 363948, 356930, 350430, 343545, 336394, 330026, 324982, 320972, 317849, 315950, 315294, 315218, 315265, 315972, 318339, 322567, 327599, 331910, 334610, 335702, 335542, 334427, 332766, 331105, 329662, 328130, 326365, 324995, 324809, 325717, 326809, 327334, 327180, 326504, 325492, 324433, 323521, 322565, 321307, 319927, 318728, 317504, 315816, 313745, 311705, 309589, 306818, 303216, 299173, 294991, 290862, 287422, 285408, 284602, 284019, 283357, 283301, 284096, 284917, 285344, 286528, 289923, 295311, 300987, 305744, 309960, 314750, 320626, 327166, 333642, 339728, 345509, 350896, 355304, 358118, 359273, 359040, 357551, 355017, 352182, 349744, 347353, 343939, 339154, 333842, 328918, 324463, 320160, 315965, 312017, 308353, 305037, 302156, 299541, 296935, 294521, 292769, 291681, 290791, 289965, 289472, 289155, 288383, 287148, 286439, 287074, 288784, 290822, 292805, 294472, 295228]
57808B95228p94k627m591o507p655p427o369n561n161m499l452k624k159j524
57794B34278n86J46M17N17N65M47M63J127K222K935L060L165L516L815M104M873
57778B65064O062O863O850O454O133N801N384N114M977M520L469J974K14j600
57764C27279k872l154k999l430m465n111m963m726m909n059m707m132l736l384
57750B69632k892k377j798q06N64J760K502L013L219K679J588R23J101J354J046
57735B81508O92R75J504J481J039J091K048L320M011L733K889K333K458K632K017
57720C13731Q73L11O18Q24J97p91j489k091k928l587l636l561m040m780m982m618
57704B80051m452m888n594o111o216n734m665l407k374j484m61M92Q11L58m11
$$ y = [295228, 294434, 291807, 287216, 280709, 273054, 265627, 259258, 253697, 248536, 244037, 240585, 237961, 235802, 234278, 233692, 233838, 234255, 234772, 235337, 235784, 236247, 237374, 239596, 242531, 245591, 248756, 252272, 256087, 260191, 265064, 271126, 277989, 284839, 291293, 297426, 303227, 308611, 313725, 318702, 323222, 326691, 328665, 328879, 327279, 324407, 321253, 318254, 314824, 310359, 305248, 300285, 295559, 290650, 285591, 280884, 276752, 273016, 269632, 266740, 264363, 262565, 261759, 262323, 264083, 266585, 269598, 272817, 275496, 277084, 278007, 279108, 280462, 281508, 282200, 283175, 284679, 286160, 287199, 288290, 290338, 293658, 297669, 301402, 304291, 306624, 309082, 311714, 313731, 314604, 314915, 315533, 316357, 316554, 315763, 314274, 312183, 309255, 305668, 302032, 298471, 294431, 289651, 284669, 280051, 275599, 270711, 265117, 259006, 252790, 247056, 242391, 238984, 236610, 235126, 234665, 235157, 235968, 236326, 235915]
57689B35915j040j445j722j895j891j602r63j04P55J581K584L820N074O346Q147
57674B53560J1016J4920J9443K4512L0646L8614M8951O1687P6003Q9449R7324
57663G66125R3524P3796L9585j322l8812o5714p9870q2727p7520o8327n8728n0187
57651D49823m2237l4507k7741k2538j8303j4237j0583q099o794n968n119m224
57639B49473l349k533j751p59O16J849K058J235M44L22K53m04j165j269j020j211
57623B42789j845k351k692l221l726l655l090k619k297j756j181j235j811j922
57609B09388j099j13O9n09j067j028m12L58P30L73m35j076j300j420j736k108
57593A98615k310k456k795l260l511l387l121l072l274l326k791j719o94k48l97
$$ y = [235915, 234875, 233430, 231708, 229813, 227922, 226320, 225357, 225253, 226008, 227589, 230173, 233993, 239067, 245413, 253560, 264576, 279496, 298939, 323451, 354097, 392711, 441662, 503349, 579352, 668801, 766125, 859649, 933445, 973030, 971708, 932896, 867182, 787312, 704585, 627065, 558738, 500010, 449823, 407586, 373079, 345338, 322800, 304497, 290260, 279677, 271578, 264784, 258816, 253697, 249473, 246124, 243591, 241840, 241081, 241697, 243546, 245604, 246839, 247283, 247605, 247858, 247454, 246289, 245020, 244000, 242789, 240944, 238593, 235901, 232680, 228954, 225299, 222209, 219590, 217293, 215537, 214356, 213121, 211310, 209388, 208289, 208176, 208245, 207736, 206669, 205641, 205229, 205587, 206317, 206690, 206255, 205179, 203879, 202459, 200723, 198615, 196305, 193849, 191054, 187794, 184283, 180896, 177775, 174703, 171429, 168103, 165312, 163593, 162899, 162651, 162254]
57578A62254p54r96j034r39q08p28p17p50q14r19j066j305j745k337k812k999
57562A41531l036k989k522j452l43O2j53k78j55k04k92M11K062L566L869L127
57546A43204K020P52o30j656k009k146k496k472j189J111L169M030L666K494J078
57531A48926R6j36p5l50q68j072q92p76r14j014q90o46l13K34Q93J287J167O47
57513A45304J29J57R71K015K261J422L99J08L69M57K51J17R2pj1K40K86l87j374
57494A52799j793j589j510j885k319k517k631k707k594k414k417k358j752p48
57480A23565K4L81O20P43N26K70M62P10N3j518k872l341l356l287k781j795j151
57463A07253j381j850j765j260p70j51P87J528J474Q51K88j44o64j043q18n5P73
$$ y = [162254, 161500, 160504, 159470, 158531, 157723, 156995, 156278, 155528, 154714, 153795, 152729, 151424, 149679, 147342, 144530, 141531, 138495, 135506, 132984, 131532, 131189, 131251, 131098, 130820, 130665, 130461, 130169, 130580, 132642, 136208, 140077, 143204, 145224, 145976, 145346, 143690, 141681, 139535, 137039, 134567, 133378, 134489, 137658, 141688, 145354, 147848, 148926, 149022, 148886, 148811, 148461, 147593, 146521, 145629, 144853, 143939, 142925, 142035, 141389, 141076, 141310, 142203, 143490, 144657, 145304, 145433, 145590, 146561, 148576, 150837, 152259, 152658, 152766, 153135, 153592, 153843, 153960, 154052, 154045, 154034, 154274, 154560, 154173, 152799, 151006, 149417, 147907, 146022, 143703, 141186, 138555, 135848, 133254, 130840, 128423, 126065, 124313, 123565, 123589, 123970, 124590, 125333, 125859, 126129, 126591, 127301, 127354, 125836, 122964, 119623, 116267, 112980, 110199, 108404, 107253, 105872, 104022, 102257, 100997, 100227, 100076, 100863, 102391, 103865, 104716, 105004, 104860, 104196, 103153, 102335, 102280, 103053]
57446A03053J376J590J093j12j234j428p67J00R43J860K475K167J123L44L69O54
57430A13606N32J90K73Q56J287R80R3o31o08P8Q71J325J300P27l69j529j982j423
57412A15576l89M47J007J463J610J172N05K45K72k46j603k972l418k999k423j995
57396A06252j434o18J06M49O18R47J338J377Q98K46j7M13J389K409L026L282L600
57379A24281M034L841K357K28q91k25J121J529P26l48j106j824k737l446l517
57364A24023k985k152j328q89r97j177p50J73P46O31M51O94R71Q22N87P59J077
57347A20656J006P12P74J181J421J332J205J081P03J29l04o18j133j711j799j301
57331A23334p68n21l42k27p03j857k810k803k271k084k139j583l37N78M01l78
$$ y = [103053, 104429, 106019, 107112, 107000, 105766, 104338, 103571, 103671, 104614, 106474, 108949, 111116, 112239, 112583, 112952, 113606, 114138, 114328, 114601, 115457, 116744, 117724, 117817, 117186, 116578, 116656, 117527, 118852, 120152, 120879, 120510, 118981, 116999, 115576, 115187, 115634, 116641, 118104, 119714, 120886, 121391, 121636, 121908, 121662, 120059, 117087, 113669, 110670, 108247, 106252, 104818, 104200, 104306, 104755, 105373, 106320, 107658, 109035, 109933, 110179, 110162, 110575, 111964, 114373, 117399, 120681, 124281, 128315, 132156, 134513, 134741, 133850, 133625, 134746, 136275, 137001, 136653, 135547, 133723, 130986, 127540, 124023, 121038, 118886, 117558, 116669, 115672, 114495, 113745, 113918, 114664, 115295, 115746, 116440, 117411, 118233, 118820, 119579, 120656, 121662, 122374, 123148, 124329, 125750, 127082, 128287, 129368, 130071, 130200, 129896, 129278, 128145, 126434, 124635, 123334, 122566, 122045, 121703, 121476, 120773, 118916, 116106, 113303, 111032, 108948, 106809, 105226, 104889, 105467, 105868, 105490]
57315A05490p73m77J07N66P27N08Rl31q3O47J275J308O57m19j474k047k044j878
57297A01768j958k198k301k325k437k285j329R4Q71O01J81M83J090J166R85J579
57281I3985L095M497N024N125N603O537P408P840P794P335O644O080O019O579
57267A79565P509Q216P985O536M491K915K268K018J385K23r08j380j014j65O33
57252B20277J121J440J697J707J387J212J688K541L005K916K875L250L649L753
57238B52518L935M518M931M415L342K995L914N084N119L885K574K289L007M019
57224C06545M969O023P175P973Q146Q050Q106Q160P864P508P767Q723R664J0046
57210D16719J0133J0527J1408J2470J3292J3661J3650J3557J3562J3550J3391
$$ y = [105490, 104717, 104240, 104347, 104913, 105640, 106148, 106157, 105826, 105743, 106390, 107665, 108973, 109630, 109211, 107737, 105690, 103646, 101768, 99810, 97612, 95311, 92986, 90549, 88264, 86935, 87029, 87900, 88501, 88682, 89165, 90255, 91421, 92406, 93985, 97080, 101577, 106601, 111726, 117329, 123866, 131274, 139114, 146908, 154243, 160887, 166967, 172986, 179565, 187074, 195290, 203275, 209811, 214302, 217217, 219485, 221503, 222888, 223111, 222203, 220823, 219809, 219644, 220277, 221398, 222838, 224535, 226242, 227629, 228841, 230529, 233070, 236075, 238991, 241866, 245116, 248765, 252518, 256453, 260971, 265902, 270317, 273659, 276654, 280568, 285652, 290771, 294656, 297230, 299519, 302526, 306545, 311514, 317537, 324712, 332685, 340831, 348881, 356987, 365147, 373011, 380519, 388286, 397009, 406673, 416719, 426852, 437379, 448787, 461257, 474549, 488210, 501860, 515417, 528979, 542529, 555920]
57199E55920J3206J3083J2821J2372J2244J2837J3684J4055J4162J4883J6353
57188G05620J7721J8417J8694J8751J8293J7391J6790J6812J6755J5937J4618
57177H95799J3295J1867J0159Q650P901P810Q032Q606R573J0536J1294J2299J3813
57164A029634J5240J5985J6372J6832J6995J6512J6100J6553J7236J6942J5879
57153A210280J5425J6100J7194J8317J9755K1163K1455K0574J9912K0361K1110
57142A421646K1149K0832K1032K1640K1925K1749K1408K0807J9668J8330J7480
57131A647666J7299J7513J8046J8987J9997K0411J9941J8861J7712J7136J7780
57120A851349J9751K2316K4584K6430K8346L0556L2848L5160L7800M1046M4950
$$ y = [555920, 569126, 582209, 595030, 607402, 619646, 632483, 646167, 660222, 674384, 689267, 705620, 723341, 741758, 760452, 779203, 797496, 814887, 831677, 848489, 865244, 881181, 895799, 909094, 920961, 931120, 939770, 947671, 955481, 963513, 972119, 981692, 992228, 1003522, 1015821, 1029634, 1044874, 1060859, 1077231, 1094063, 1111058, 1127570, 1143670, 1160223, 1177459, 1194401, 1210280, 1225705, 1241805, 1258999, 1277316, 1297071, 1318234, 1339689, 1360263, 1380175, 1400536, 1421646, 1442795, 1463627, 1484659, 1506299, 1528224, 1549973, 1571381, 1592188, 1611856, 1630186, 1647666, 1664965, 1682478, 1700524, 1719511, 1739508, 1759919, 1779860, 1798721, 1816433, 1833569, 1851349, 1871100, 1893416, 1918000, 1944430, 1972776, 2003332, 2036180, 2071340, 2109140, 2150186, 2195136]
57109B195136M9578N5030O1263O8363P6954Q7880J01401J17362J36298J60028
57099C109293J90853K30575K80536L42239M17500N08097O15196P38539Q75575
57090G308403J021457J170065J314766J448286J563078J652952J714075J743417
57082A8936499J736778J689829J600814J469587J292549J060818P67407M18067
57074B8972348L4549l53181p18172j042375j316010j534467j695687j798579j843053
57065A8705373j831695j771241j672022j545902j404497j258129j114977r80511
57057G126399q57738p47805o50385n64223m88143m21550l63768l13373k68879
57048B450535k29773j96169j67651j43178j22033j04151q9424p7351o7520n9753
$$ y = [2195136, 2244714, 2299744, 2361007, 2429370, 2506324, 2594204, 2695605, 2812967, 2949265, 3109293, 3300146, 3530721, 3811257, 4153496, 4570996, 5079093, 5694289, 6432828, 7308403, 8329860, 9499925, 10814691, 12262977, 13826055, 15479007, 17193082, 18936499, 20673277, 22363106, 23963920, 25433507, 26726056, 27786874, 28554281, 28972348, 29006897, 28653716, 27935544, 26893169, 25577159, 24042692, 22347005, 20548426, 18705373, 16873678, 15102437, 13430415, 11884513, 10480016, 9221887, 8106910, 7126399, 6268661, 5520856, 4870471, 4306248, 3818105, 3396555, 3032787, 2719414, 2450535, 2220762, 2024593, 1856942, 1713764, 1591731, 1487580, 1398156, 1320805, 1253285, 1193532]
57038A193532n3604m8287m3341l8893l5031l1402k7699k4000k0283j5906j0022
57027H45064k196P841K0840L7690N7658P6629Q7286Q2107N7897J8743k5226o2778
57015A201555q6782r6295r4879q7256p6958o6104n6241m8545m3192l9262l5692
57004D70349l2087k8395k4331j9792j5481j2398j0757r901r169q260o956n278
56992B87544l893l509l696l082j024J630L848N765Q119J0806J2696J2604J0003
56979C37811N083j183p207j1632j4238j5679j6380j6077j4601j2547j0786r459
56967B13105p925n771l442j576K8K216N381R092J2930J6946K0830K3237K2666
56954C07717J8795J2418M421m383j2636j8685k1781k2433k1449j9277j6374j3358
$$ y = [1193532, 1139928, 1091641, 1048300, 1009407, 974376, 942974, 915275, 891275, 870992, 855086, 845064, 842868, 850709, 871549, 909239, 966897, 1043526, 1130812, 1212919, 1270816, 1289559, 1264333, 1201555, 1114773, 1018478, 923599, 836343, 759385, 693281, 637040, 588495, 545303, 506041, 470349, 438262, 409867, 385536, 365744, 350263, 337865, 327108, 317207, 308038, 299778, 292822, 287544, 283651, 280142, 276446, 273364, 272340, 273970, 277818, 283583, 291702, 302508, 315204, 327808, 337811, 342894, 341711, 334504, 322872, 308634, 292955, 276575, 260498, 245897, 233350, 222564, 213105, 205180, 199409, 195967, 194391, 194419, 196635, 202016, 211108, 224038, 240984, 261814, 285051, 307717, 326512, 338930, 343351, 338968, 326332, 307647, 285866, 263433, 241984, 222707, 206333, 192975]
56942A92975j0461p405m203j399Q44L286O679J0810J5011J9138K3367K7290K9872
56929C05804L0069K7058K0208R774k348j3303k1128k5625k7533k7363k5463k2578
56917B27572j9672j7206j4888j2322r612p226n492m397l751l278k679j910j334
56904A23805j294j552j526j163r67j062q45M4J052J595K036L083M702O452Q536
56889A42896J1452J4829J7706J9936K2146K4033K3838K0011J2758L682n260j2171
56877B95856j5771j6403j5840j5382j4564j2287q590m587j065K143N619R738J4471
56864B23338J9528K4884L1193L9134M8022N5526N8987N6536M7168L1106J0895
56853F46317q940k4484l4441l9339l9791l6512l1088k5169j9159j2693o030J74
$$ y = [192975, 182514, 175109, 170906, 169507, 170351, 173637, 180316, 191126, 206137, 225275, 248642, 275932, 305804, 335873, 362931, 383139, 392913, 390565, 377262, 356134, 330509, 302976, 275613, 250150, 227572, 207900, 190694, 175806, 163484, 153872, 146646, 141154, 136757, 133006, 129728, 127049, 125139, 123805, 122511, 120959, 119433, 118270, 117303, 116241, 115396, 115440, 116492, 118087, 120123, 123206, 127908, 134360, 142896, 154348, 169177, 186883, 206819, 228965, 252998, 276836, 296847, 309605, 313287, 308027, 295856, 280085, 263682, 247842, 232460, 217896, 205609, 197019, 192432, 191367, 193510, 199129, 208867, 223338, 242866, 267750, 298943, 338077, 386099, 441625, 500612, 557148, 604316, 635422, 646317, 637377, 612893, 578452, 539113, 499322, 462810, 431722, 406553, 387394, 374701, 368671, 368845]
56841C68845O126J2774K0459K8868L8238M9362O2150P5105Q6181R2964R1876P9033
56829A011981N3353J8763j7320m7772o8481p8787q0468p6237o8534n9112m9233
56818E38153l9682l0615k1933j3775o304R57Q894J7855K7551L7874M8996O0151
56806F28122O8710P0918O3566M5533J8861j1145l7777n6091o4926o6198o2793
56795E96780n7027n0243m3025l5727k8913k3043j7863j2585o851j042M560J0343
56783C35364J6724K3432K9723L4771L7279L5232K6995J2940m190k0576l2978l9817
56771D54899m1486l9835l6852l3498k9761k5568k1359j7720j4812j2384j0243
56760A71381q466p160o176n272m471m019l905l719l166k488k078j920j676j246
$$ y = [368845, 374971, 387745, 408204, 437072, 475310, 524672, 586822, 661927, 748108, 841072, 932948, 1011981, 1065334, 1084097, 1066777, 1019005, 950524, 871737, 791269, 715032, 646498, 587386, 538153, 498471, 467856, 445923, 432148, 425844, 426801, 435695, 453550, 481101, 518975, 567971, 628122, 696832, 767750, 831316, 876849, 895710, 884565, 846788, 790697, 725771, 659573, 596780, 539753, 489510, 446485, 410758, 381845, 358802, 340939, 328354, 321503, 320461, 325021, 335364, 352088, 375520, 405243, 440014, 477293, 512525, 539520, 552460, 548270, 527694, 494716, 454899, 413413, 373578, 336726, 303228, 273467, 247899, 226540, 208820, 194008, 181624, 171381, 162915, 155755, 149579, 144307, 139836, 135817, 131912, 128193, 125027, 122539, 120461, 118541, 116865, 115619]
56746A15619q34o09n87p94j117j180p83l56m27p66o06J83Q29P29J56l40o59r16
56728A07542r81p06k91OK58N87Q11P05M69N40J005J477J493R22Q8l69lR32J661
56709A16146J633R66J28m30l51M30J399J809J582J403J669J879J437N59j39n83
56693A29537j098j609j595q24L12J193J371P99J4j73L70P97M48m0L84J464J848
56676A33198J099L77O72J372J367P79N55P97O66l3l18M82J542J600P13J51O36
56659A45655J447J479O47j83l09J59O72Q24N88K38J64M96Q60O66k39j337j943
56642A49884j795j150m98k75o12j126j131l34P46J215P69k8m04j51L31N86M94
56625A46521J90j45l48k80KJ42j91q64j319j233r09q50j099j243j011m94J35P82
$$ y = [115619, 114785, 114176, 113589, 112795, 111678, 110498, 109715, 109359, 108932, 108166, 107560, 107743, 108572, 109301, 109457, 109117, 108458, 107542, 106561, 105855, 105564, 105570, 105828, 106415, 107226, 107931, 108400, 108940, 109945, 111422, 112915, 113837, 113925, 113556, 113553, 114485, 116146, 117779, 118745, 118873, 118443, 118092, 118522, 119921, 121730, 123312, 124715, 126384, 128263, 129700, 130259, 130120, 129537, 128439, 126830, 125235, 124411, 124723, 125916, 127287, 128086, 128100, 127927, 128297, 129094, 129542, 129502, 129886, 131350, 133198, 134297, 134674, 135346, 136718, 138085, 138864, 139419, 140216, 140882, 140849, 140531, 141013, 142555, 144155, 144868, 145019, 145655, 147102, 148581, 149228, 149045, 148736, 148895, 149567, 150391, 150979, 151217, 151381, 151877, 152737, 153403, 153164, 151827, 149884, 148089, 146939, 146441, 146166, 145554, 144428, 143297, 142963, 143709, 144924, 145693, 145665, 145261, 145110, 145441, 146027, 146521, 146711, 146566, 146218, 145938, 145940, 146082, 145891, 145027, 143708, 142475, 141566, 140716, 139617, 138374, 137363, 136869, 137004, 137786]
56607A37786J219J081L55m33p45o55n76n61k53M07Q53N69j73n63k00N82J262J644
56589A41599J673J213L97pP15K199L096K499Q65n91j114p58N0Q63J290J170O64
56572A55823N9l98m01L47J614K605K845K865L483M647N610O151O934Q597J1000
56557B11781J3456J5100J4992J2533Q230L609K9k165l232l367k817k184k013k227
56543B61725k386k358k395k642k953l185l335l447l542l665l789l717l288k707
56529B18316k452k768l310l378k638j588j134j560k082j738o34J41j10q70j170
56514A93025p98l60l76p50j085j117q00k74P8j92j056j741j351Q4J396J406J81
56497A86270j118j622j546j540j697j648j264q24n29k95J7M28Q22R19M34m41r77
$$ y = [137786, 139005, 140086, 140441, 140008, 139263, 138608, 138032, 137471, 137218, 137625, 138478, 139047, 138874, 138311, 138111, 138693, 139955, 141599, 143272, 144485, 144882, 144875, 145590, 147789, 150885, 153384, 154249, 153658, 152544, 151786, 151836, 152699, 153989, 155159, 155823, 155882, 155484, 155083, 155430, 157044, 159649, 162494, 165359, 168842, 173489, 179099, 185250, 192184, 200781, 211781, 225237, 240337, 255329, 267862, 276092, 279701, 279730, 277565, 274333, 270966, 268149, 265965, 263952, 261725, 259339, 256981, 254586, 251944, 248991, 245806, 242471, 239024, 235482, 231817, 228028, 224311, 221023, 218316, 215864, 213096, 209786, 206408, 203770, 202182, 201048, 199488, 197406, 195668, 195034, 195175, 195065, 194195, 193025, 192227, 191867, 191491, 190741, 189656, 188539, 187739, 187465, 187543, 187351, 186295, 184554, 183203, 183287, 184683, 186089, 186270, 185152, 183530, 181984, 180444, 178747, 177099, 175835, 175011, 174482, 174187, 174204, 174632, 175454, 176373, 176807, 176366, 175389]
56480A75389p36j92k1j10J57Q13J258J245J123J059P52J81j31J15N46P63Q30Q08
56462A83849M24l41q86p06j07K35J29j12j46K08R34J656J789J226N03Q7j57m23
56444A88162l87L40J526K494K828K507J732R16N64P44Q91N42r3n91r11j110q88
56427A99266j30M97K20p21j298j042m77k15k35k51k19j53J55Q46J659K174K279
56410B02355K169J959J541Q34R3l06k06K85J069K061K821K678J526J74n92r46
56394B17515j415j719j089L87J674K198K343K337J720M24o11o20r8O9j56k75k84
56377B22400m36m76M0Q87J381J279Q67M23J61L70R41J144N81%L10J157J361O14
56359B33004j73j76N20J446K236K500K003J223J061J702K308K087J281P53R24
$$ y = [175389, 174653, 174461, 174440, 174330, 174487, 175300, 176558, 177803, 178926, 179985, 180737, 180918, 180787, 180902, 181448, 182211, 183041, 183849, 184273, 183932, 183046, 182340, 182233, 182468, 182597, 182485, 182339, 182547, 183481, 185137, 186926, 188152, 188655, 188742, 188585, 188162, 187775, 188115, 189641, 192135, 194963, 197470, 199202, 200118, 200682, 201426, 202317, 202859, 202766, 202175, 201264, 200154, 199266, 199136, 199633, 199853, 199132, 197834, 196792, 196315, 196100, 195865, 195614, 195395, 195242, 195397, 196243, 197902, 200076, 202355, 204524, 206483, 208024, 208858, 208951, 208645, 208439, 208724, 209793, 211854, 214675, 217353, 218879, 219053, 218461, 217515, 216100, 214381, 213292, 213679, 215353, 217551, 219894, 222231, 223951, 224375, 223764, 223144, 223046, 223115, 222959, 222684, 222400, 221964, 221488, 221528, 222415, 223796, 225075, 225942, 226365, 226526, 226896, 227837, 228981, 229562, 229562, 229872, 231029, 232390, 233004, 232831, 232655, 233175, 234621, 236857, 239357, 241360, 242583, 243644, 245346, 247654, 249741, 251022, 251775, 252699]
56344B52699J385J475J093Q44J242J888J891J172P49J316K224K426J941J572J680
56329B75597K019K464L093L696L959L989M023L836L177K478K287K276J723P96
56315C15413L09L12P1m94n76O4N22J88k47J52J232K156K614K975L566M297M943
56298C37497N432N918O566P104O766N163L102J922K031K706L308L994M992N996
56284D02497O650P084P616Q293R069R997J0976J1642J1850J1989J2550J3578J4724
56271E38515J5654J6331J6992J7905J9038K0137K1238K2765K4884K7153K9319
56260G69931L2005L5910M0660M5250M9496N4297O0546O8474P8063Q9245J01656
56249A425533J14793J28482J42608J56527J69438J81189J91872K00717K06366
$$ y = [252699, 254084, 255559, 256652, 257496, 258738, 260626, 262517, 263689, 264438, 265754, 267978, 270404, 272345, 273917, 275597, 277616, 280080, 283173, 286869, 290828, 294817, 298840, 302676, 305853, 308331, 310618, 312894, 314617, 315413, 315722, 316034, 316105, 315611, 315035, 315099, 315621, 315809, 315562, 315714, 316946, 319102, 321716, 324691, 328257, 332554, 337497, 342929, 348847, 355413, 362517, 369283, 374446, 377548, 379470, 381501, 384207, 387515, 391509, 396501, 402497, 409147, 416231, 423847, 432140, 441209, 451206, 462182, 473824, 485674, 497663, 510213, 523791, 538515, 554169, 570500, 587492, 605397, 624435, 644572, 665810, 688575, 713459, 740612, 769931, 801936, 837846, 878506, 923756, 973252, 1027549, 1088095, 1156569, 1234632, 1323877, 1425533, 1540326, 1668808, 1811416, 1967943, 2137381, 2318570, 2510442, 2711159, 2917525]
56240B917525K08177K06239J99979J87887J69132J44566J15683Q3399M8378J1893
56230D292858k4314n8626q9725j16578j38675j56014j68737j77009j81164j81643
56220C000373j78858j73515j66771j59434j51345j42159j32379j22757j13207
56211A659948j03378r3947q5982p9264p2679o6244o1082n7150n2695m6635m0115
56200I00777l4899l1408k9029k7238k5531k3288k0509j8001j6200j4568j2701
56189F47405j1103j0235r649q754p696o893o371o019n767n178l766k089j431j976
56175E60478k363j641n30o3j21j23j09k40j00N96J430K120L070M443N597O156
56159E78600O657P388P622O947O252O501P479Q617J0086J2030J3797J5077J6905
$$ y = [2917525, 3125702, 3331941, 3531920, 3719807, 3888939, 4033505, 4149188, 4232587, 4280965, 4292858, 4268544, 4209918, 4120193, 4003615, 3864940, 3708926, 3540189, 3363180, 3182016, 3000373, 2821515, 2648000, 2481229, 2321795, 2170450, 2028291, 1895912, 1773155, 1659948, 1556570, 1462623, 1376641, 1297377, 1224698, 1158454, 1097372, 1040222, 987527, 940892, 900777, 865878, 834470, 805441, 778203, 752672, 729384, 708875, 690874, 674674, 660106, 647405, 636302, 626067, 616418, 607664, 599968, 593075, 586704, 580685, 574918, 569740, 565974, 563885, 562454, 560478, 558115, 556474, 555944, 555881, 555760, 555637, 555528, 555288, 555188, 555784, 557214, 559334, 562404, 566847, 572444, 578600, 585257, 592645, 600267, 607214, 613466, 619967, 627446, 636063, 646149, 658179, 671976, 687053, 703958]
56146G03958K0252K4441K8223L1797L6643M3840N3354O4381P5457Q4811R1300
56135A258457R4366R2926Q5744P3839O1039N0926M4302M0433L8897L8562L6425
56124A915916K9918J9720Q721r33q223j2168j2931j3461j7578k6412l8308n1638
56112A792623o5499p7957q6133q8680q6610q1411p3915o5027n5944m7163l8547
56101A025737l0577k4280j9769j6112j2710r712p063m423k073p08k57J32R08J918
56087I01011L140M548N491N424M997N312O310P095P484Q004Q662Q987R084R383
56073I94932R663R556R601J0438J1459J1730J1770J2797J4614J5887J6300J6646
56061A145393J7034J6881J6627J7574J9739K1526K1868K1259K0542J9933J9432
$$ y = [703958, 724210, 748651, 776874, 808671, 845314, 889154, 942508, 1006889, 1082346, 1167157, 1258457, 1352823, 1445749, 1531493, 1605332, 1666371, 1717297, 1761599, 1802032, 1840929, 1879491, 1915916, 1945834, 1965554, 1974275, 1973342, 1965119, 1952951, 1940020, 1926559, 1908981, 1882569, 1844261, 1792623, 1727124, 1649167, 1563034, 1474354, 1387744, 1306333, 1232418, 1167391, 1111447, 1064284, 1025737, 995160, 970880, 951111, 934999, 922289, 912577, 905514, 901091, 899018, 898310, 898053, 898185, 899093, 901011, 904151, 908699, 914190, 919614, 924611, 929923, 936233, 943328, 950812, 958816, 967478, 976465, 985549, 994932, 1004595, 1014151, 1023752, 1034190, 1045649, 1057379, 1069149, 1081946, 1096560, 1112447, 1128747, 1145393, 1162427, 1179308, 1195935, 1213509, 1233248, 1254774, 1276642, 1297901, 1318443, 1338376, 1357808]
56050A357808J8961J8057J6533J5264J5189J5922J6531J7170J8530K0264K1552
56039A551781K2639K4189K5665K6187K6367K7360K8685K9077K9040L0284L2947
56028A854221L5512L7309L8935M0363M0915M0933M1505M2638M3680M5143M7966
56017B309120N1458N4182N6402N9321O2547O4867O6900P0239P4508P8085Q1175
56006C028804Q5132Q9393R2353R4683R8415J03271J07549J12122J19397J28607
55996D059726J36415J42299J48967J57249J65127J72387J81624J93654K06333
55987E563781K19025K34033K52532K73110K95254L20248L47799L75933M04792
55978H286507M36507M71181N07640N48003N96370O53073P15808P86181Q68909
$$ y = [1357808, 1376769, 1394826, 1411359, 1426623, 1441812, 1457734, 1474265, 1491435, 1509965, 1530229, 1551781, 1574420, 1598609, 1624274, 1650461, 1676828, 1704188, 1732873, 1761950, 1790990, 1821274, 1854221, 1889733, 1927042, 1965977, 2006340, 2047255, 2088188, 2129693, 2172331, 2216011, 2261154, 2309120, 2360578, 2414760, 2471162, 2530483, 2593030, 2657897, 2724797, 2795036, 2869544, 2947629, 3028804, 3113936, 3203329, 3295682, 3390365, 3488780, 3592051, 3699600, 3811722, 3931119, 4059726, 4196141, 4338440, 4487407, 4644656, 4809783, 4982170, 5163794, 5357448, 5563781, 5782806, 6016839, 6269371, 6542481, 6837735, 7157983, 7505782, 7881715, 8286507, 8723014, 9194195, 9701835, 10249838, 10846208, 11499281, 12215089, 13001270, 13870179]
55969A3870179R65082J073254J197111J344547J519353J722479J961860K252713
55961B5906578K609193L046484L591073M277663N136109O193981P492517R090226
55953F7343824J1059852J3504889J6577477K0454459K5275590L1040778L7362120
55946B22618989M3043246M5864265M3191439L3467485J7596119j051812j8220587
55939C86509144l0763659l7645120l9594003l8123038l4730021l0544651k6274192
55932A48834460k2282311j8719062j5632841j3021151j0844913r047137p572251
55925E1714794o367864n380997m565681l890533l332382k867904k476846k146874
55917B0685713j868976j632607j429558j257121j112633r89346q81292p87452
$$ y = [13870179, 14835261, 15908515, 17105626, 18450173, 19969526, 21692005, 23653865, 25906578, 28515771, 31562255, 35153328, 39430991, 44567100, 50761081, 58253598, 67343824, 78403676, 91908565, 108486042, 128940501, 154216091, 185256869, 222618989, 265662235, 311526500, 354717939, 388185424, 405781543, 404729731, 386509144, 355745485, 318100365, 278506362, 240383324, 205653303, 175108652, 148834460, 126552149, 107833087, 92200246, 79179095, 68334182, 59287045, 51714794, 45346930, 39965933, 35400252, 31509719, 28177337, 25309433, 22832587, 20685713, 18816737, 17184130, 15754572, 14497451, 13384818, 12395472, 11514180, 10726728]
55909A0726728p07424o37575n74965n20675m75659m37181m02590l72711l48358
55900F249590l27032l06102k86010k67678k49953k32108k15719k01591j87951
55891C975446j73911j61447j51668j42488j32324j22858j15494j08273r9126q9334
55881B678523q0819p2743o3949n6524n3763n6029o1070o6753p1223p2316o9611
55870A953723o5776o3595o2724o1184n8524n5507n2178m8406m5100m2915m0821
55859A356993l7797l4757l3053l2212l0948k9340k8232k7390k6007k4224k2764
55848A030269k1780k1321k1853k3112k3601k2558k1266k1087k1316k0496j8712
55837G93167j7090j5958j4969j4177j3654j2859j1620j0781j0758j0562r462q334
$$ y = [10726728, 10019304, 9381729, 8806764, 8286089, 7810430, 7373249, 6970659, 6597948, 6249590, 5922558, 5616456, 5330446, 5062768, 4812815, 4580707, 4364988, 4163397, 3975446, 3801535, 3640088, 3488420, 3345932, 3213608, 3090750, 2975256, 2866983, 2767857, 2678523, 2597704, 2524961, 2461012, 2404488, 2350725, 2294696, 2233626, 2166873, 2095650, 2023334, 1953723, 1887947, 1824352, 1761628, 1700444, 1641920, 1586413, 1534235, 1485829, 1440729, 1397814, 1356993, 1319196, 1284439, 1251386, 1219174, 1188226, 1158886, 1130654, 1103264, 1077257, 1053033, 1030269, 1008489, 987168, 965315, 942203, 918602, 896044, 874778, 853691, 832375, 811879, 793167, 776077, 760119, 745150, 730973, 717319, 704460, 692840, 682059, 671301, 660739, 651277, 642943]
55825F42943p990p557o224n242o240q518j0014j0277j0422j0734j0383r351q740
55812E31251r004r342q959p765n964l987k632k229j931q45O52J738K646M043N483
55797D93155N920N388M772M185L011J403K51l59j270k761m101m759m951m840m215
55782D90829l149k256k202l604p017j1964j6218j7370j5246j1809q613n465j617
55769C84299K954P798J2353J5354J4905J0035K107n841j1133j2944j2312j0925
55757C96650r680q311o389m258k659j810j479j664k548l913n253o387p423q243
55743C26633q532q296p765o932n657m141k774j639o53o6l01j329k621l668m261
55728B67998m452m558m959n570n850n637n401n368n044m153l357l260l353k812
$$ y = [642943, 634953, 627396, 621172, 615930, 609690, 601172, 591158, 580881, 570459, 559725, 549342, 539991, 531251, 522247, 512905, 503946, 496181, 490217, 486230, 483598, 481369, 479438, 478593, 479245, 480983, 483629, 487672, 493155, 499075, 504463, 509235, 513420, 516431, 517834, 518085, 517726, 516456, 513695, 509594, 504835, 499884, 495044, 490829, 487680, 485424, 483222, 479618, 472601, 460637, 444419, 427049, 411803, 399994, 391381, 385916, 384299, 387253, 395051, 407404, 422758, 437663, 447698, 449805, 443964, 432831, 419887, 407575, 396650, 386970, 378659, 372270, 368012, 365353, 363543, 362064, 360400, 357852, 353939, 348686, 342299, 334876, 326633, 318101, 309805, 302040, 295108, 289451, 285310, 282536, 280897, 280244, 280178, 279877, 278548, 275927, 272259, 267998, 263546, 258988, 254029, 248459, 242609, 236972, 231571, 226203, 221159, 217006, 213649, 210389, 207036, 204224]
55714B04224j791r55j98J030K534L699M783O509Q421Q865P010L878J043r16k378
55699B45758l864n585p289q328q318p670o970o103m717l255k624k815k798j902
55685A73520m32J075K326K994K918K726L284M396M944M505L743L068K085P66q7
55670B11831j95m58j420k164j656m33J39k91r36j167r66l68N31J192J078N00L23
55653B05540Q34J463J621J293P60J98l57q88j310j420j044m41k24o46j327j888
55637B02164k499l368m167m496m596m989n620n948n723n113m194k963j825j341
55623A45322j425j358p63j20m4n26j051j145o32K67Q62M24j003k461l034k721
55607A30592k162j785j631j689j980k276k250j912j630j552j396r38m46l45n87
$$ y = [204224, 202433, 201478, 201280, 202310, 204844, 208543, 213326, 219835, 228256, 237121, 244131, 248009, 249052, 248136, 245758, 241894, 236309, 229020, 220692, 212374, 204704, 197734, 191631, 186914, 183659, 181035, 178220, 175422, 173520, 173088, 174163, 176489, 179483, 182401, 185127, 188411, 192807, 197751, 202256, 205999, 209067, 211152, 211918, 211831, 211636, 211178, 209758, 207594, 205938, 205505, 205644, 205353, 204417, 203250, 202284, 201916, 202447, 203639, 204717, 205217, 205540, 206374, 207837, 209458, 210751, 211511, 211709, 211352, 210464, 209154, 207734, 206690, 206249, 206025, 205379, 204052, 202164, 199665, 196297, 192130, 187634, 183038, 178049, 172429, 166481, 160758, 155645, 151451, 148488, 146663, 145322, 143897, 142539, 141776, 141656, 141612, 141086, 140035, 138890, 138258, 138525, 139387, 139811, 138808, 136347, 133313, 130592, 128430, 126645, 125014, 123325, 121345, 119069, 116819, 114907, 113277, 111725, 110329, 109391, 108945, 108600, 108013]
55592A08013o97l93L7R9l56j006j347j093m24J58K51rj11K11O50P46N32N13R73
55573A06747J539J629J244J071J652K708L477L641L579L653L624L032J899P18
55559A40213j48p71j442k327l277l761l258k005j132j475k463k740j900r02o77
55544A11935j026j205r02k46N84J276J360Q04L53O87J582K256K376K204K006J746
55528A25790J279M81o43j697k074j714j392j785k596l075l072k943k777k388j875
55513I9519j564j457j352j358j629j759j213k84J32k59q52j186j456j818j917
55498H1547j462o96l0L88N04L22J11J92L06j82j247j988j771r68k18M20J053J343
55480G7624R16J47j77J68P28J083J219J181Q15M8p85j130q02l09l54r89j469j237
$$ y = [108013, 107316, 106923, 106960, 107059, 106703, 105697, 104350, 103257, 102833, 102991, 103242, 103233, 103122, 103333, 103983, 104729, 105261, 105774, 106747, 108286, 109915, 111159, 112230, 113882, 116590, 120067, 123708, 127287, 130940, 134564, 137596, 139495, 140213, 140065, 139294, 137852, 135525, 132248, 128487, 125229, 123224, 122092, 120617, 118154, 115414, 113514, 112612, 111935, 110909, 109704, 108802, 108556, 109140, 110416, 111776, 112580, 112933, 113620, 115202, 117458, 119834, 122038, 124044, 125790, 127069, 127550, 126907, 125210, 123136, 121422, 120030, 118245, 115649, 112574, 109502, 106559, 103782, 101394, 99519, 97955, 96498, 95146, 93788, 92159, 90400, 89187, 88903, 89035, 88776, 87924, 86738, 85282, 83464, 81547, 80085, 79389, 79359, 79747, 80251, 80573, 80684, 80876, 81182, 81000, 79753, 77765, 75994, 75026, 74808, 75228, 76281, 77624, 78540, 78687, 78510, 78678, 79406, 80489, 81708, 82889, 83704, 83752, 82967, 81837, 81035, 80726, 80372, 79383, 77914, 76677]
55462G6677o50l39j95L44J132J354P72J07o3rr5o5L15N86K25m57o78k40L57N84
55442G9662L01l06p98p36k14J22j25n74o70m25j75%J56J12k43n43l36K70P84Q88
55422G7150N03l13j098j026Q1J171J109K06j84N21J514J836J443Q35K64k62o63
55405H3087q30q07p22o66o20m64j28J30j29q25j225q92l76l94p03o05k39l87j032
55386G2173j209m67M78Q76Q69Q35O51K21l1J48K51j69o16l58L71O89M03J48L33
55367G5596O85Q73R06Q00M76Q1r5j69n58j172j316o53K26N99N68P20J115J155
55349G9837M28o99j436j361p12p9J89K27L22L95P4o95j371j352o31K59P73P35
55331G4903L82K43P77J821K517K148R30k26p10o33m19l82o76j215j538j189k89
$$ y = [76677, 76027, 75688, 75493, 75837, 76969, 78323, 79095, 79202, 79139, 79130, 79035, 78970, 79285, 79871, 80096, 79639, 78961, 78721, 79078, 79662, 79963, 79657, 78859, 78123, 77909, 78031, 77906, 77332, 76662, 76237, 76062, 76062, 76218, 76330, 76087, 75544, 75208, 75478, 76262, 77150, 77653, 77340, 76242, 75216, 75297, 76468, 77577, 77783, 77599, 78120, 79634, 81470, 82913, 83748, 84012, 83750, 83087, 82257, 81450, 80728, 80062, 79442, 78978, 78850, 78980, 78851, 78026, 76801, 75909, 75533, 75139, 74436, 73831, 73592, 73205, 72173, 70964, 70497, 70975, 71851, 72720, 73555, 74206, 74427, 74396, 74544, 74795, 74626, 74010, 73652, 74023, 74712, 75115, 75263, 75596, 76281, 77154, 78060, 78860, 79336, 79417, 79322, 79153, 78595, 77423, 76107, 75454, 75680, 76279, 76847, 77567, 78682, 79837, 80265, 79566, 78130, 76769, 76057, 75978, 76167, 76394, 76716, 77111, 77185, 76490, 75119, 73767, 73136, 73395, 74168, 74903, 75285, 75528, 76305, 78126, 80643, 82791, 83721, 83495, 82785, 82152, 81733, 81351, 80675, 79460, 77922, 76733, 76444]
55314G6444N24Q52Q26O62L81P6q9l17r88j784j713n33N94N48j71k30N96J286J217
55295G8181Q44O20K96l38q13o45j3N62Q60Q84O49L24J91K20Q6k11k65k3lm07o99
55274H0300n40m98j167k048k107j217k98r9m29o14k67M39R94J093J058J461K201
55257G8262K418J651N15j84n02q52j015n21L17O62L23j80n81j060j508j521j179
55240G5045j004r34l23Q12J463R82l9o99r07r34n98L71J553K197K088J481M98
55223H1052p55j640j421l14N17K85n65r92o12L9L00J52J12M58Q38P31J73k59j81
55204G7918K17M94M16l8p40j269j108k46O44R62Q66Q95J057Q06m7q61q16P7Q71
55185H0098O85k63q71m34M98R36Q11Q86J262Q80r34l078l668k217j11J065R81
$$ y = [76444, 76968, 77820, 78646, 79308, 79689, 79765, 79676, 79359, 78371, 76587, 74874, 74341, 74935, 75483, 75312, 75082, 75678, 76964, 78181, 79025, 79645, 79941, 79603, 78790, 78145, 78132, 78694, 79554, 80438, 81087, 81411, 81602, 81822, 81908, 81697, 81432, 81409, 81406, 80999, 80300, 79760, 79262, 78095, 76047, 73940, 72723, 72425, 72326, 71897, 71283, 71016, 71455, 72449, 73542, 74600, 76061, 78262, 80680, 82331, 82846, 82662, 82160, 81308, 80293, 79772, 80089, 80751, 81074, 80894, 80313, 79253, 77745, 76224, 75045, 74041, 73107, 72784, 73596, 75059, 76041, 76002, 75303, 74396, 73462, 72864, 73235, 74788, 76985, 79073, 80554, 81052, 80297, 78657, 77236, 76922, 77439, 77724, 77159, 76167, 75555, 75594, 75894, 76046, 76158, 76616, 77454, 78185, 78358, 78099, 77918, 78135, 78629, 79045, 79007, 78267, 76998, 75890, 75644, 76288, 77250, 78116, 79011, 80068, 80874, 80827, 79966, 79150, 79227, 80098, 80783, 80520, 79649, 79215, 79713, 80649, 81460, 82346, 83608, 84488, 83554, 80476, 76808, 74591, 74480, 75545, 76526]
55168G6526L07k47l56j5M51N77K86O9L53Q64R67M78r0j92J09K92M2m02n62l07
55148G9150N3K32L24N78R02R71P23M52L00L3m51o91j92P02R82J87r43j334q27
55129H1151k05l7j5M28J144J393Q33k3m64m07l14m57o41o73p25r61j066n72M00
55110G8789J126J149P90O24P25P70O09L68J29n9J6M68Q97P87L36K96Q32J175P51
55091I0578K1k71j57j20r4L89J246J806J782J570J435J079K96m24m15L43J193
55074A00257J461R36o2q94j013m03M47J026J181J043Q21O27L17m31j660k722k774
55057I8157j725l98L18K02m20j060j254p90l7K33l06j085j287p03J45O16M92Q2
55039I1180m1L92J027J301J125P92L31m57j212j056K26J615K000J404N74j61r26
$$ y = [76526, 76833, 76586, 76230, 76215, 76666, 77243, 77529, 77598, 77951, 78815, 79782, 80260, 80170, 79978, 80087, 80379, 80421, 80019, 79457, 79150, 79203, 79435, 79759, 80337, 81239, 82210, 82933, 83385, 83685, 83718, 83267, 82576, 82384, 83086, 84068, 84255, 83312, 81978, 81151, 80946, 80909, 80894, 81322, 82466, 83859, 84692, 84669, 84205, 83798, 83484, 83027, 82386, 81713, 80988, 80027, 78961, 78389, 78789, 79915, 81064, 81854, 82478, 83203, 83973, 84582, 84950, 85079, 85020, 85036, 85504, 86401, 87188, 87524, 87820, 88652, 89827, 90578, 90599, 90328, 90171, 90051, 89957, 90346, 91592, 93398, 95180, 96750, 98185, 99264, 99560, 99136, 98721, 99064, 100257, 101718, 102654, 102592, 101698, 100685, 100282, 100729, 101755, 102936, 103979, 104800, 105427, 105744, 105313, 103653, 100931, 98157, 96432, 96034, 96352, 96554, 96134, 95074, 93820, 93030, 92993, 93226, 92920, 91835, 90548, 89845, 89990, 90606, 91098, 91180, 91139, 91531, 92558, 93859, 94984, 95776, 96107, 95650, 94438, 93382, 93608, 95223, 97223, 98627, 99201, 99040, 98114]
55022I8114j540j569j027m13m0J60K28J20L8K43N25L93j09l77j23K57L64L22L60
55003I5926L32P0j72m0L49N58M18J69O8J39K21Q1l96r97j206p27M8L73l3o42p82
54982I3757m02m2r8l44k95J78P36R87P84K12m77q61n97J81Q69R95O61K67N1K7
54962I6589J98M84O14L57r7k75Q2P88J414J530R85J62j90K39P73M13r25k194k380
54943I8567j515m02L31O58P93Q03O14K69K2J31N46R35J046R40P43M55J51J75P09
54924A05971J350J479J114R37J409K273L086L922N167O840Q489R691J0337J0345
54910A72410R344O938L332n07l577n615o966p803p890p178o149n284m590l982
54896A32483l669l749l752l218k465k142k178j934j265o63k96K35J017J445J163
$$ y = [98114, 96574, 95005, 93978, 93565, 93525, 93685, 93913, 94033, 94071, 94314, 94839, 95232, 95123, 94746, 94623, 94880, 95244, 95566, 95926, 96258, 96328, 96156, 96116, 96465, 97023, 97441, 97610, 97678, 97817, 98038, 98119, 97723, 96726, 95520, 94793, 94841, 95214, 95181, 94539, 93757, 93355, 93313, 93215, 92871, 92576, 92754, 93490, 94477, 95261, 95473, 94996, 94135, 93538, 93719, 94588, 95583, 96244, 96511, 96562, 96589, 96787, 97271, 97885, 98242, 98145, 97870, 97952, 98740, 100154, 101684, 102669, 102831, 102641, 102880, 103653, 104066, 103141, 100947, 98567, 97052, 96650, 96981, 97639, 98432, 99235, 99849, 100118, 100140, 100271, 100817, 101752, 102798, 103738, 104481, 104936, 105087, 105262, 105971, 107321, 108800, 109914, 110851, 112260, 114533, 117619, 121541, 126708, 133548, 142037, 151728, 162065, 172410, 181754, 188692, 192024, 191517, 187940, 182325, 175359, 167556, 159666, 152488, 146339, 141055, 136465, 132483, 128814, 125065, 121313, 118095, 115630, 113488, 111310, 109376, 108111, 107448, 107152, 107387, 108404, 109849, 111012]
54881A11012O80O94J297K213L253M117M381M191M401N475O722P213O996O671O227
54866A75543N160L452J576l79k730n237p014p584p408p045o489n617m751m286
54852A27191m101l824l415l113k934k666k243j824j480j105p27o53j037j440j160
54837I5469j25P83O94j20n25L6Q96J190Q72L89j77r02j406j207o21m12o02m03
54819I3829M77J265J179L48o11j325j512p85O97J848J706O48q8M1M48M52J40K6
54801I8783L70J012J562J635J171O16N65J085J541J225L5j422k285k052r85R9
54785A02955N09K21k84m70J1J182K441K771J779M31J48J142K226K387J867J442
54769A20758J314J243J298J776K604L425M219N276O559P579P994P929P617P052
$$ y = [111012, 111692, 112386, 113683, 115896, 119149, 123266, 127647, 131838, 136239, 141714, 148436, 155649, 162645, 169316, 175543, 180703, 184155, 185731, 185352, 182622, 177385, 170371, 162787, 155379, 148334, 141845, 136228, 131477, 127191, 123090, 119266, 115851, 112738, 109804, 107138, 104895, 103071, 101591, 100486, 99759, 99106, 98069, 96629, 95469, 95344, 96127, 96821, 96701, 96176, 96212, 97108, 98298, 99170, 99559, 99382, 98480, 97074, 95867, 95246, 94834, 94232, 93829, 94306, 95571, 96750, 97098, 96487, 95162, 93650, 92865, 93562, 95410, 97116, 97764, 97676, 97717, 98165, 98617, 98757, 98783, 99153, 100165, 101727, 103362, 104533, 105149, 105714, 106799, 108340, 109565, 109600, 108178, 105893, 103841, 102856, 102955, 103464, 103685, 103401, 102931, 102942, 104124, 106565, 109336, 111115, 111546, 111694, 112836, 115062, 117449, 119316, 120758, 122072, 123315, 124613, 126389, 128993, 132418, 136637, 141913, 148472, 156051, 164045, 171974, 179591, 186643]
54755A86643O070M467J980j403m913p268p871p442p165p301p146o167m691l384
54741A34409k518k039j945k274k758k943k662k124j498p25J21O07M63J27L15J096
54725A15652J833K193K611L424M095L961L487L924N636P501Q292P955P077N763
54711A83404L764J352p92k515m233n938o934o826o122n450m733l705k735k469
54697A36068k805k953k507j901j664j755j892k024k151k016j410n98q7n8k91n34
54681A11422o66o08m06l57o87j041p15M32J598J864J207L85l1k19o67j425k004
54664A08082j893j110k73m8n18j092j164p20j70L08Q87J511J646Q99l08j017p01
54647A04319K62J077J220P26M0l00r9K71K31l26q48p35m1O41P90L52l35q05p06
$$ y = [186643, 192713, 197180, 199160, 197757, 192844, 185576, 177705, 170263, 163098, 155797, 148651, 142484, 137793, 134409, 131891, 129852, 127907, 125633, 122875, 119932, 117270, 115146, 113648, 112923, 113044, 113651, 114114, 114241, 114556, 115652, 117485, 119678, 122289, 125713, 129808, 133769, 137256, 141180, 146816, 154317, 162609, 170564, 177641, 183404, 187168, 188520, 187728, 185213, 180980, 175042, 168108, 161282, 155160, 149710, 144977, 141272, 138537, 136068, 133263, 130310, 127803, 125902, 124238, 122483, 120591, 118567, 116416, 114400, 112990, 112392, 112305, 112247, 111956, 111422, 110756, 110148, 109742, 109385, 108698, 107657, 106942, 107374, 108972, 110836, 112043, 112428, 112397, 112178, 111511, 110086, 108082, 106189, 105079, 104806, 104758, 104240, 103148, 101984, 101264, 101094, 101402, 102289, 103800, 105446, 106345, 106037, 105020, 104319, 104581, 105658, 106878, 107604, 107644, 107344, 107245, 107516, 107747, 107421, 106573, 105838, 105797, 106438, 107228, 107580, 107245, 106440, 105734]
54628A05734j43L07J08n85j028p04J07O80O33K09o3R3M38M45j25q29r41l01M56
54609A04491O47L13j1m8L0R8K98O95R90P99R5p98j504j800j593q31M79K021L019
54590A07390K706J205l43r23p39o15o21j17Q65J267N08n46q37n43m70n41q9O92
54572A08249Q14J15l96j59K3o63j658j800r75o4L90O33Q95R26N40K3k27j42J28
54553A06652N15J014J505J707J341M26n26q01j65Q35J444J510J471J632J747J375
54537A21682N19l00n62l14r7k05j85N21J512J542O7j806k466j673o78n69j067
54520A15921j201o02K34O64M70j80r19j264q76oM51k10j523k149j392q0N14L14
54502A08166L10R19J351Q60j57p93p40k68L76R58J091O97L29M13N84L14j80l60
$$ y = [105734, 105591, 105898, 106006, 105421, 104393, 103689, 103796, 104476, 105109, 105318, 105255, 105348, 105786, 106231, 106106, 105277, 104336, 104035, 104491, 105138, 105451, 105440, 105392, 105422, 105520, 105818, 106513, 107503, 108302, 108397, 107599, 106095, 104295, 102702, 101871, 102350, 104371, 107390, 110096, 111301, 110958, 110035, 109296, 108681, 108060, 107943, 108808, 110075, 110583, 110037, 109200, 108657, 108187, 107646, 107557, 108249, 109063, 109178, 108782, 108623, 108646, 107983, 106325, 104525, 103550, 103486, 103876, 104509, 105404, 106330, 106870, 106893, 106666, 106524, 106652, 107167, 108181, 109686, 111393, 112734, 113160, 112634, 111833, 111668, 112503, 113947, 115457, 116928, 118560, 120307, 121682, 122201, 121901, 121339, 121025, 120928, 120723, 120538, 121059, 122571, 124113, 124180, 122374, 119908, 118235, 117557, 116988, 115921, 114720, 114118, 114352, 115016, 115486, 115306, 114387, 113123, 112247, 112241, 112692, 112482, 110959, 108810, 107418, 107338, 107852, 108166, 108476, 109395, 110746, 111606, 111449, 110656, 109916, 109648, 110024, 110982, 112073, 112770, 113099, 113512, 114096, 114410, 114230, 113870]
54484A13870k84l16l02J08N59M58J05K65P25N56j28l6J226K299J981R25N29R97
54466A23537J473J467J218R97Q01O29M45J29j64n5L32K67m77j111j006o99r09
54449A26874j265r74k42M7k34m48m16n56q93r62p44o82o86j32R97J841J842J269
54431A24636M58n81j476j453m70M57N99L93M41N08L21M85J631L066L424K429J032
54414A35900o0r88j814j958j064K56J076J147P86J76o75j416j383l60J005J775
54398A32403J643J090P24P16Q97J138J383J477J266Q99P53R29J053P27K0o27r16
54381A45575r08p91o55n10l66k11m5nl64j151j813j598m99N21O14J95M40J677
54363A40106K897L156K755K626L004L419L607L664L437K620J510R46J211J569
$$ y = [113870, 113586, 113270, 112968, 113076, 113635, 114093, 114198, 114463, 115188, 115744, 115616, 115580, 116806, 119105, 121086, 122011, 122540, 123537, 125010, 126477, 127695, 128692, 129493, 130122, 130567, 130696, 130532, 130477, 130809, 131076, 130599, 129488, 128482, 127783, 126874, 125609, 124635, 124393, 124440, 124206, 123758, 123342, 122786, 121893, 120931, 120187, 119505, 118819, 118687, 119684, 121525, 123367, 124636, 125094, 124513, 123037, 121584, 121114, 121571, 122170, 122563, 123004, 123512, 123833, 124318, 125949, 129015, 132439, 134868, 135900, 135840, 134852, 133038, 131080, 130016, 130272, 131348, 132495, 133281, 133457, 132782, 131366, 129983, 129623, 130628, 132403, 134046, 135136, 135860, 136576, 137473, 138611, 139994, 141471, 142737, 143636, 144389, 145318, 146371, 147098, 147118, 146491, 145575, 144667, 143876, 143221, 142711, 142345, 142134, 142089, 142084, 141720, 140569, 138756, 137158, 136659, 137180, 137794, 137989, 138429, 140106, 143003, 146159, 148914, 151540, 154544, 157963, 161570, 165234, 168671, 171291, 172801, 173747, 174958, 176527]
54349A76527J169k1j428k610l406l766l719l444l115k795k543k397k198j752j299
54334A43203j394k106k659k245r81J58M02p1l36K95J386J662L88j607k734k385
54318A30976j356n83j40K51M84L66K32N87J332J835J613P00n39j554j814j194
54302A31196j46P61J270J303P66j57q34p46r3N63J002J328J439J071L23k92m13
54285A38341j42J74K57N9j72o3M19Q09O45L3n07o21k97K23N28K60m25r04q57p00
54265A37060q67j057p15J07Q92J407J733J776J362P12J87k15n26k89P98J991K199
54248A46555J500R37P94K90p98j439r10L3L42J37R1O8n22j497k030j854j415j031
54230A39251o29k76j78j15M01J323J957J809J059J92m69q28r95j219j499j432
$$ y = [176527, 177696, 177675, 176247, 173637, 170231, 166465, 162746, 159302, 156187, 153392, 150849, 148452, 146254, 144502, 143203, 141809, 139703, 137044, 134799, 133818, 133976, 134378, 134307, 133971, 134266, 135652, 137314, 137702, 136095, 133361, 130976, 129620, 129037, 128897, 129148, 129632, 129998, 130230, 130817, 132149, 133984, 135597, 136297, 135758, 134204, 132390, 131196, 131050, 131811, 133081, 134384, 135150, 134993, 134159, 133413, 133320, 133883, 134885, 136213, 137652, 138723, 139046, 138754, 138341, 138199, 138373, 138630, 138689, 138517, 138454, 138873, 139682, 140327, 140360, 139853, 139232, 138935, 139158, 139686, 139946, 139521, 138617, 137760, 137060, 136193, 135136, 134421, 134528, 135420, 136827, 138560, 140336, 141698, 142410, 142597, 142382, 141856, 141567, 142365, 144356, 146555, 148055, 148992, 149786, 150076, 149278, 147839, 146929, 146962, 147304, 147441, 147532, 147600, 147078, 145581, 143551, 141697, 140282, 139251, 138622, 138346, 138168, 138053, 138454, 139777, 141734, 143543, 144602, 144794, 144325, 143497, 142502, 141283, 139784, 138352]
54214A38352q46k78k50l85K4P08O51l02j069q53j48K36K90L44K56j88o14n83l59
54195A34986l70l45J76Q27Q46M30M92J113J270M65m04l83K26N13L17Q9q4m11o00
54176A39153l8J166K080K021J288O16L61L89L65M4m88q13o99n63r72j716j926
54159A40268j250l33J02Q2k1j91n55r08r99r25p74k45P19J292O18p95j461q04
54141A33820J93N06L43L90N53L07j46n7O51J178J013O11N65P10N03n0m08k98n8
54122A40326m6j48L0N76J154J375J176Q41P29R29J127R02K44k96j38O42J324J351
54104A52098Q92N13M29L78R4l89r55j624k266k382j544o5J134J506J433J601K035
54087A52888K198J957J876K399L213L821M355N196N977N650L765J174q59j868
$$ y = [138352, 137506, 137228, 136978, 136593, 136617, 137325, 137976, 137674, 136605, 135752, 135604, 135840, 136130, 136474, 136730, 136542, 135928, 135345, 134986, 134616, 134271, 134447, 135274, 136120, 136550, 137042, 138155, 139425, 139890, 139486, 139103, 139329, 139842, 140159, 140248, 140164, 139753, 139153, 139115, 140281, 142361, 144382, 145670, 146286, 146647, 147036, 147401, 147445, 146957, 146144, 145445, 144882, 143910, 142194, 140268, 139018, 138685, 138787, 138869, 138848, 138657, 138102, 137194, 136195, 135270, 134496, 134251, 134970, 136262, 136880, 136085, 134624, 133820, 134013, 134519, 134862, 135252, 135805, 136112, 135966, 135909, 136560, 137738, 138751, 139362, 139927, 140637, 141140, 141090, 140682, 140384, 140326, 140280, 140132, 140162, 140738, 141892, 143267, 144443, 145284, 146013, 146942, 148069, 148971, 149215, 148919, 148781, 149423, 150747, 152098, 152990, 153503, 153932, 154310, 154404, 154015, 153060, 151436, 149170, 146788, 145244, 145179, 146313, 147819, 149252, 150853, 152888, 155086, 157043, 158919, 161318, 164531, 168352, 172707, 177903, 183880, 189530, 193295, 194469, 193610, 191742]
54073A91742k274k546k701k532k037j547j474j821j987j396l47J77k25q19p76
54058A69437k69l6k42m64n31n41k17Q54K208K605J614L71K41J226K330L019L621
54041A85226M420N085N168M758M379M469N039N736O193O452O967Q072R396J0018
54027B71378R327P644N940M907M356L586K332J118M99K13n44j951l197l482k999
54012B99127k591k750l376m274n345o267o569o212n794n854o202o222n683m899
53998B27089m185l525k895k520k498k424j830r21m41p07j209j445j599k065k569
53983A96256k397j396k72K42Q2k81l72l9M14M10k72j039j082m27P2r2m51l88p0
53964A88898q4m22m09M17J656K354J851M45p97r76j38J029K126L197M059M203
$$ y = [191742, 189468, 186922, 184221, 181689, 179652, 178105, 176631, 174810, 172823, 171427, 171080, 171257, 171032, 170213, 169437, 169168, 169132, 168890, 168426, 167895, 167354, 167137, 167991, 170199, 172804, 174418, 174789, 175030, 176256, 178586, 181605, 185226, 189646, 194731, 199899, 204657, 209036, 213505, 218544, 224280, 230473, 236925, 243892, 251964, 261360, 271378, 280705, 288349, 294289, 299196, 303552, 307138, 309470, 310588, 311087, 311300, 310756, 308805, 305608, 302126, 299127, 296536, 293786, 290410, 286136, 280791, 274524, 267955, 261743, 255949, 250095, 243893, 237671, 231988, 227089, 222904, 219379, 216484, 213964, 211466, 209042, 207212, 206291, 205850, 205143, 203934, 202489, 200890, 198825, 196256, 193859, 192463, 192191, 192433, 192515, 192234, 191862, 191823, 192237, 192647, 192375, 191336, 190254, 189827, 189899, 189807, 189356, 188968, 188898, 188814, 188392, 187983, 188400, 190056, 192410, 194261, 194706, 193909, 192933, 192795, 193824, 195950, 199147, 203206, 207409]
53948B07409L636L209L592M522N443O460P981R851J1601J3291J5277J7072J7239
53935C26583J4715R841L994j468n717q392r453r056p530n417l355j700l87P19
53921C03377J557K125K656L260L680L847M257N246O256O597O663P465Q910R586
53907C75482Q588O712N315M644L864K345K90j641k835l020k510k077k257k860
53893C90040l345l574l865m465n247n999o747p734r010j0126j0325r279p596o351
53879B96377o026o169o073n477m546l538k752k502k824l279l359l048k861l274
53865B40649m141m668m161k852j802j720k163k240j868j695j906j891j325q16
53851B07401j014j572j594q75j97l65j275j980j647m95L36Q0p20r48m86k84q98
$$ y = [207409, 211045, 214254, 217846, 222368, 227811, 234271, 242252, 252103, 263704, 276995, 292272, 309344, 326583, 341298, 351139, 355133, 353665, 347948, 339556, 330103, 321047, 313517, 308100, 304745, 303045, 302658, 303377, 304934, 307059, 309715, 312975, 316655, 320502, 324759, 330005, 336261, 342858, 349521, 356986, 365896, 375482, 384070, 390782, 396097, 400741, 404605, 406950, 407240, 405599, 402764, 399744, 397234, 395157, 392900, 390040, 386695, 383121, 379256, 374791, 369544, 363545, 356798, 349064, 340054, 329928, 319603, 310324, 302728, 296377, 290351, 284182, 278109, 272632, 268086, 264548, 261796, 259294, 256470, 253191, 249832, 246784, 243923, 240649, 236508, 231840, 227679, 224827, 223025, 221305, 219142, 216902, 215034, 213339, 211433, 209542, 208217, 207401, 206387, 204815, 203221, 202346, 202149, 201784, 200509, 198529, 196882, 196387, 196723, 196803, 196083, 195135, 194649, 194365, 193467]
53834A93467j699j842j308o00rL36K80K6J51P81J266J126O80K78l45j180j242
53817A90166J29J913K519J945J554J880K077J623J204J441J933K126K210K515
53803B15235K793K782K850L470M556N753O912P735P602O360M863M070L933L762
53789B82676L366L168L311L356K902K081J298P94M65j7r10k086l180m047m797
53774B88380n366n470n166m946m960m707l905l187l309m057m575m510m143l630
53760B26449k882k177k064k554k997k972k714k469k079j462j030j120j375j147
53746A97407l46M84Q96R48Q83O75R0q35j580j619j104p53r11r73k01J149K058
53729A96268K045J640J405J177O33J21K95J162K059K445K300J837J313J117J556
$$ y = [193467, 191768, 189926, 188618, 188018, 188009, 188345, 188625, 188651, 188802, 189583, 190849, 191975, 192655, 192933, 192588, 191408, 190166, 190295, 192208, 194727, 196672, 198226, 200106, 202183, 203806, 205010, 206451, 208384, 210510, 212720, 215235, 218028, 220810, 223660, 227130, 231686, 237439, 244351, 252086, 259688, 266048, 270911, 274981, 278914, 282676, 286042, 289210, 292521, 295877, 298779, 300860, 302158, 302952, 303417, 303400, 302490, 300404, 297224, 293177, 288380, 283014, 277544, 272378, 267432, 262472, 257765, 253860, 250673, 247364, 243307, 238732, 234222, 230079, 226449, 223567, 221390, 219326, 216772, 213775, 210803, 208089, 205620, 203541, 202079, 201049, 199929, 198554, 197407, 197061, 197545, 198441, 199389, 200272, 200947, 201037, 200202, 198622, 197003, 195899, 195146, 194235, 193262, 193061, 194210, 196268, 198313, 199953, 201358, 202535, 203168, 203289, 203584, 204746, 206805, 209250, 211550, 213387, 214700, 215817, 217373]
53714B17373K357K770K431J834J712K154K622K669K359K027J914K020K126J922
53700B48290J371R15J126K052L150L913M284M351M014L299K701K666K861K467
53686B87460J325J95k73l90q05j466j746j428r95q59q84q19q56j308k025k413
53670B72713k102j328o09k28q1N0K18L08K10p5m70q77j094r09l11L43O05L67o8
53651B66662l78n56p63r29p19J8Q83J244R43N23O09J197J766J969J973K029K067
53634B78538J886J586J467J596J711J655J730K316L186L526K878J873J618K338
53620C07904L170L484L773M702N801O083N620N505O104O440N709M443L574L172
53606C75484K878K880L469M088L832K725J633J047Q45R59J422J702J070k12r89
$$ y = [217373, 219730, 222500, 224931, 226765, 228477, 230631, 233253, 235922, 238281, 240308, 242222, 244242, 246368, 248290, 249661, 250576, 251702, 253754, 256904, 260817, 265101, 269452, 273466, 276765, 279466, 282132, 284993, 287460, 288785, 288980, 288707, 288317, 287512, 286046, 284300, 282872, 281877, 281018, 280134, 279315, 278459, 277151, 275126, 272713, 270611, 269283, 268674, 268446, 268365, 268415, 268633, 268941, 269151, 269076, 268606, 267729, 266635, 265726, 265415, 265758, 266363, 266730, 266662, 266284, 265728, 264965, 264036, 263317, 263335, 264218, 265462, 266405, 266928, 267537, 268734, 270500, 272469, 274442, 276471, 278538, 280424, 282010, 283477, 285073, 286784, 288439, 290169, 292485, 295671, 299197, 302075, 303948, 305566, 307904, 311074, 314558, 318331, 323033, 328834, 334917, 340537, 346042, 352146, 358586, 364295, 368738, 372312, 375484, 378362, 381242, 384711, 388799, 392631, 395356, 396989, 398036, 398881, 399840, 401262, 402964, 404034, 403822, 402833]
53591D02833p62k85l70r25j551k262l044l397k997k257j700j251o64k14l52r92
53575C79810j713k326k797k925k641k288k139j964j564j308j512j647j000J22
53561C54108O96M23K6P6K92K45J05L02R17J709K364K555K085J288R10J352K223
53544C71676K807K719K037J127N87J036K570M449N580N430M449L675L873N010
53530D17025O456P692Q664R514J0210J0700J1167J1873J2785J3600J4044J3991
53518E47721J3532J3157J3599J5091J6929J8277J9190K0410K2210K4028K5242
53507G49386K5785K5907K5836K5816K6015K6189K5796K4651K3131K1724K0625
53496A020861J9880J9465J9140J8574J7816J7277J7163J7252J7344J7537J7930
$$ y = [402833, 402071, 401786, 401416, 400491, 398940, 396678, 393634, 390237, 387240, 384983, 383283, 382032, 381368, 381154, 380802, 379810, 378097, 375771, 372974, 370049, 367408, 365120, 362981, 361017, 359453, 358145, 356633, 354986, 353986, 354108, 354804, 355227, 355253, 355329, 355621, 355866, 355971, 356273, 357190, 358899, 361263, 363818, 365903, 367191, 368101, 369453, 371676, 374483, 377202, 379239, 380366, 380953, 381989, 384559, 389008, 394588, 400018, 404467, 408142, 412015, 417025, 423481, 431173, 439837, 449351, 459561, 470261, 481428, 493301, 506086, 519686, 533730, 547721, 561253, 574410, 588009, 603100, 620029, 638306, 657496, 677906, 700116, 724144, 749386, 775171, 801078, 826914, 852730, 878745, 904934, 930730, 955381, 978512, 1000236, 1020861, 1040741, 1060206, 1079346, 1097920, 1115736, 1133013, 1150176, 1167428, 1184772, 1202309, 1220239]
53485A220239J8345J8517J8326J7840J7448J7715J8681J9362J8622J6512J4076
53474A415683J1867R491O747M159K002k57l003n786q160j0393j2618j4166j4639
53461A380927j4836j5546j6141j5629j4628j4785j6428j8184j9121j9837k1037
53450A194755k2214k2491k1878k1045k0375j9825j9203j8160j6342j3938j1680
53439I87604r977q454o704m946l620k752k171j829j529p46P26K338L518M519N961
53424I61938P745R106R690J0042J0921J2548J4550J6389J7713J8566J9336K0421
53412A128965K1904K3636K5468K7262K8859L0284L1875L3921L6244L8339L9966
53401A466723M1391M3009M4945M7021M9029N0894N2578N3872N4543N4766N5242
$$ y = [1220239, 1238584, 1257101, 1275427, 1293267, 1310715, 1328430, 1347111, 1366473, 1385095, 1401607, 1415683, 1427550, 1437041, 1443788, 1447947, 1449949, 1449692, 1446689, 1440903, 1432743, 1422350, 1409732, 1395566, 1380927, 1366091, 1350545, 1334404, 1318775, 1304147, 1289362, 1272934, 1254750, 1235629, 1215792, 1194755, 1172541, 1150050, 1128172, 1107127, 1086752, 1066927, 1047724, 1029564, 1013222, 999284, 987604, 977627, 969173, 962469, 957523, 953903, 951151, 948980, 947151, 945622, 944876, 945602, 947940, 951458, 955977, 961938, 969683, 978789, 988479, 998521, 1009442, 1021990, 1036540, 1052929, 1070642, 1089208, 1108544, 1128965, 1150869, 1174505, 1199973, 1227235, 1256094, 1286378, 1318253, 1352174, 1388418, 1426757, 1466723, 1508114, 1551123, 1596068, 1643089, 1692118, 1743012, 1795590, 1849462, 1904005, 1958771, 2014013]
53390B014013N6490N8049N8812N8220N6708N4885N2833N0540M8388M6628M4746
53379B600312M1988L8333L4329L0139K5416K0121J4777R759M908O1m767r922j6259
53366B789195k4054l2256l9338m4728m8888n2143n4165n4743n4463n4243n4445
53355B275729n4686n4371n3107n0757m7470m3847m0842l9184l8847l9152l9452
53344A774014l9625l9878m0131l9804l8247l5427l2018k8871k6363k4343k2559
53333A406748k0851j8948j6376j3044r823q101q497j0333j2485j4428j6080j7056
53321A240726j6775j5317j3585j2395j1774j1295j0724r989q875p198n151l200
53309A114448j660n45K72R42J613K375L290M613O683R386J1998J3939J5504J7415
$$ y = [2014013, 2070503, 2128552, 2187364, 2245584, 2302292, 2357177, 2410010, 2460550, 2508938, 2555566, 2600312, 2642300, 2680633, 2714962, 2745101, 2770517, 2790638, 2805415, 2815174, 2820082, 2820143, 2815376, 2805454, 2789195, 2765141, 2732885, 2693547, 2648819, 2599931, 2547788, 2493623, 2438880, 2384417, 2330174, 2275729, 2221043, 2166672, 2113565, 2062808, 2015338, 1971491, 1930649, 1891465, 1852618, 1813466, 1774014, 1734389, 1694511, 1654380, 1614576, 1576329, 1540902, 1508884, 1480013, 1453650, 1429307, 1406748, 1385897, 1366949, 1350573, 1337529, 1327706, 1319605, 1311108, 1300775, 1288290, 1273862, 1257782, 1240726, 1223951, 1208634, 1195049, 1182654, 1170880, 1159585, 1148861, 1138872, 1129997, 1122799, 1117648, 1114448, 1112788, 1112243, 1112515, 1113457, 1115070, 1117445, 1120735, 1125348, 1132031, 1141417, 1153415, 1167354, 1182858, 1200273]
53295A200273J9809K2162K4143K5956K7691K8948K9362K9071K8386K7342K5912
53284A489055K4288K2604K0733J8583J6313J3929J1064P568L905M66l013o704
53272A618791r895j1859j3217j5350j8409k1082k2566k3590k5008k6421k7036
53261A404358k7022k7065k7197k7031k6826k7205k8058k8644k8717k8642k8416
53250A099535k7570k6211k5257k5176k5344k5027k4363k3846k3454k2877k2232
53239H28178k1839k1563k0882j9562j7811j5869j3893j2134j0819r761q501o915
53227F48629n461m749n000n992p288q515r538j0530j1741j3177j4540j5504j5940
53214E20654j5824j5049j3595j1855j0575j0165j0190r789q687p439o666o370
$$ y = [1200273, 1220082, 1242244, 1266387, 1292343, 1320034, 1348982, 1378344, 1407415, 1435801, 1463143, 1489055, 1513343, 1535947, 1556680, 1575263, 1591576, 1605505, 1616569, 1624137, 1628042, 1628508, 1625495, 1618791, 1608896, 1597037, 1583820, 1568470, 1550061, 1528979, 1506413, 1482823, 1457815, 1431394, 1404358, 1377336, 1350271, 1323074, 1296043, 1269217, 1242012, 1213954, 1185310, 1156593, 1127951, 1099535, 1071965, 1045754, 1020497, 995321, 969977, 944950, 920587, 896741, 873287, 850410, 828178, 806339, 784776, 763894, 744332, 726521, 710652, 696759, 684625, 673806, 664045, 655544, 648629, 643168, 638419, 633419, 627427, 620139, 611624, 602086, 591556, 579815, 566638, 552098, 536594, 520654, 504830, 489781, 476186, 464331, 453756, 443591, 433401, 423612, 414925, 407486, 400820, 394450]
53202C94450o295o495p117p827q064p831p645p708p627p131o566o358o417o258
53188B95111n575m468l381k893l243l924m043l271k171j480j425j834k436k817
53174B52150k626k106j979k386k481j600l52J32k96p75p87o96r02j162r64k20
53158B32950O97J209Q33m41j930k736k589j978j460j196j112j104r63m90J58N29
53142B20377M19O7k46m40m17oP03J328J680J848J709R04l64j044m41P26J132N42
53124B28477q1r8P6l3q1L40P53N14P7N68K053L215K992J801O40k48j119j740j617
53105B36489r44m08j56J67L69l19j888l118l048k183j603j495j255o31N0M87O19
53088B21133L06m76j247j374q09o4M54O17L18l77r01o58J24O02M66K92O26J186
$$ y = [394450, 388155, 381660, 374543, 366716, 358652, 350821, 343176, 335468, 327841, 320710, 314144, 307786, 301369, 295111, 289536, 285068, 281687, 278794, 275551, 271627, 267584, 264313, 262142, 260662, 259237, 257403, 254967, 252150, 249524, 247418, 245439, 243053, 240572, 238972, 238620, 238752, 238456, 237681, 236894, 236198, 235296, 234134, 233170, 232950, 233647, 234856, 235689, 235248, 233318, 230582, 227993, 226015, 224555, 223359, 222247, 221143, 220180, 219690, 219848, 220377, 220796, 220863, 220617, 220177, 219760, 219754, 220457, 221785, 223465, 225313, 227022, 227926, 227562, 226518, 226077, 226803, 227935, 228477, 228396, 228298, 228374, 228341, 228260, 228600, 229353, 229867, 229944, 230512, 232565, 235780, 238772, 240573, 241213, 240965, 239846, 238106, 236489, 235545, 235137, 234981, 235148, 235517, 235198, 233310, 230192, 227144, 224961, 223358, 221863, 220608, 219977, 220027, 220514, 221133, 221439, 220963, 219716, 218342, 217533, 217469, 217923, 218540, 218858, 218481, 217580, 216922, 217046, 217648, 218114, 218406, 219032, 220218]
53070B20218J257N25o53j611j867j499j071j001j125j094r96j104j293j195q61
53055B06630o94p34o39l49j34N9O37J544K104J942J501J334J383J300J015O87
53039B17586M42L94N27M82r4q53j017n43k86p58j383j423r83n64k17K20N67N69
53021B12666M31M44M66K87J14J49J00k25l01L68J288J581J291J181J416J416J032
53004B23704Q67J185J365Q61K5m14k65J34M41M66J52k70l69l3L04J59m11q54o92
52985B26355J1O70P09K41M1O03J390J501Q98M47P04J334J879K472L305L843L239
52968B49642J445n28j624j676j276r09n23O9O40P43M29L12O77R39M13o42j298
52951B46833j202r02q97r69p81o10r90j874k559k475j748r80o34p14r25r62n95
$$ y = [220218, 221475, 222000, 221347, 219736, 217869, 216370, 215299, 214298, 213173, 212079, 211083, 209979, 208686, 207491, 206630, 205936, 205202, 204563, 204214, 204080, 204139, 204776, 206320, 208424, 210366, 211867, 213201, 214584, 215884, 216899, 217586, 218028, 218422, 218949, 219431, 219337, 218484, 217467, 216924, 216638, 215880, 214497, 213074, 212091, 211527, 211310, 211530, 212097, 212666, 213097, 213541, 214007, 214294, 214408, 214557, 214657, 214432, 214131, 214499, 215787, 217368, 218659, 219840, 221256, 222672, 223704, 224571, 225756, 227121, 227982, 228007, 227593, 227328, 227462, 227903, 228369, 228521, 228251, 227882, 227849, 228153, 228312, 227901, 227047, 226355, 226366, 227036, 227745, 227986, 228027, 228630, 230020, 231521, 232419, 232866, 233570, 234904, 236783, 239255, 242560, 246403, 249642, 251087, 250559, 248935, 247259, 245983, 245074, 244551, 244620, 245260, 246003, 246432, 246744, 247421, 248360, 248773, 248131, 246833, 245631, 244729, 243832, 242863, 242082, 241472, 240482, 238608, 236049, 233574, 231826, 230846, 230212, 229498, 228573, 227611, 227016]
52934B27016K85J444K134J626Q3j402j939j676j242q09k40K38K38j15l48m00n59
52917B24334p29n27p3R5j3K27Q96J215P20k3l74m95p27q12m20Q1J61p5k37m14
52897B22810p64q63k60N74P87M00J66L34M42L03K16J50k06n55j96N96N39o91j620
52878B22162r87L94Q86M55M64J377K104J866J309J293J553J386R28Q22J075J063
52862B38150O09K61M36Q75J117J077R71R70J094J165P95k58j637k664l166l645
52846B36150m398m902m571l706l161l154l007k198j138o06p61j019q48l64q1j85
52830B02051k22L55J444K321K539K443K554K696K194R13m48j198j410j625k056
52815B12551k348k018j025Q6O12L73q8j22L26Q97J430J960K219J771P29k45q82
$$ y = [227016, 227301, 228745, 230879, 232505, 232588, 231186, 229247, 227571, 226329, 225520, 225280, 225518, 225756, 225641, 225293, 224893, 224334, 223605, 223078, 223005, 223100, 223087, 223314, 224210, 225425, 226145, 226122, 225748, 225253, 224526, 223714, 223294, 223375, 223536, 223461, 223224, 222810, 222046, 221183, 220923, 221497, 222284, 222684, 222850, 223184, 223626, 223929, 224145, 224295, 224089, 223534, 223338, 223934, 224473, 223782, 222162, 221175, 221569, 222455, 222910, 223374, 224751, 226855, 228721, 230030, 231323, 232876, 234262, 235190, 236012, 237087, 238150, 238759, 239020, 239456, 240331, 241448, 242525, 243496, 244466, 245560, 246725, 247520, 247262, 245625, 242961, 239795, 236150, 231752, 226850, 222279, 218573, 215412, 212258, 209251, 207053, 205915, 205309, 204548, 203529, 202681, 202317, 202236, 202051, 201829, 202184, 203628, 205949, 208488, 210931, 213485, 216181, 218375, 219288, 218840, 217642, 216232, 214607, 212551, 210203, 208185, 207160, 207246, 207858, 208231, 208143, 208021, 208347, 209244, 210674, 212634, 214853, 216624, 217353, 217108, 216226]
52798B16226j632k719l474l183k215j606j650j630r45J3L84r5q49j110p29k24
52782A94562q8j25K83J212J944J885J373J130J182R08J59l24O0Q07Q00k56j355
52765B04157j345l08N71M30l76r39r07n50q5M13N55m8r58j160m31K93L22K35Q49
52746B00718J811K146J793J648K155K732K657J879Q27J3j22M92J309J685J681
52731B23424J812K081J956J327Q43R82J422J614J470J122M85n09j582k317k468
52716B31662j952r04Q9K71m66j371j682j330o59M5M65K44n27j156j185r35q27
52699B19782n60L98J763K476J853L03j102j485p83J86M06l00j078j075l99K91
52683B20676P04R09P77J82m60n68l16m47j097j532j280q65r38j325j373r29l68
$$ y = [216226, 214594, 211875, 208401, 205218, 203003, 201397, 199747, 198117, 197172, 197185, 197569, 197474, 196625, 195515, 194786, 194562, 194474, 194349, 194632, 195844, 197788, 199673, 201046, 202176, 203358, 204266, 204425, 204101, 204161, 204968, 205768, 205512, 204157, 202812, 202504, 203075, 203505, 203129, 202190, 201283, 200733, 200648, 201061, 201616, 201568, 200610, 199450, 199019, 199312, 199634, 199869, 200718, 202529, 204675, 206468, 208116, 210271, 213003, 215660, 217539, 218366, 218379, 218257, 218749, 220058, 221743, 223424, 225236, 227317, 229273, 230600, 231443, 232425, 233847, 235461, 236931, 238053, 238538, 238029, 236447, 234130, 231662, 229710, 228806, 228895, 229166, 228700, 227329, 225647, 224317, 223658, 223703, 224168, 224412, 223885, 222729, 221544, 220609, 219782, 219222, 219620, 221383, 223859, 225712, 226015, 224913, 223428, 222645, 222831, 223237, 222937, 221859, 220784, 220385, 220676, 221380, 222289, 223066, 223248, 222788, 222220, 221904, 221457, 220360, 218828, 217548, 216683, 215745, 214420, 213047, 212118, 211750]
52666B11750R2N63J001J116Q77P09Q80R96N28k38k73R69K728L752L727L418L490
52649B36085L770L863L772L531K719R83j230l016l863l794l014j981j475j810
52635B34540k130j361J83J072P51K35M95J142J415J549K215L109L178K123P13
52620B49229l93j333k317k984k905k341k002k118k147j457j58R22J177R43J043
52605B33159J601J793R57m26j279j131l75M65J090J210O75j20m75k72o2j40j02
52588B36568L17N87J25o59q58l40J23J11J29O77J317J232L77m12m63R7P16J042
52570B40686R97O13P3k83k99k78o63j420j958j824j275r79j170j346r05M8P99
52553B30816Q98O47N52N54J90n95j299j585j629j533q86N41J985K276J109o98
$$ y = [211750, 211842, 212405, 213406, 214522, 215399, 216108, 216988, 217984, 218512, 218274, 218001, 218970, 221698, 225450, 229177, 232595, 236085, 239855, 243718, 247490, 251021, 253740, 254723, 253493, 250477, 246614, 242820, 239806, 237825, 236350, 234540, 232410, 231049, 231232, 232304, 233055, 233290, 233785, 234927, 236342, 237891, 240106, 243215, 246393, 248516, 249229, 248836, 247503, 245186, 242202, 239297, 236956, 234954, 232836, 230689, 229232, 229074, 229996, 231173, 232116, 233159, 234760, 236553, 237510, 237084, 235805, 234674, 234299, 234764, 235854, 237064, 237739, 237619, 237144, 236872, 236810, 236670, 236568, 236885, 237472, 237597, 236938, 236080, 235740, 235863, 235974, 236103, 236780, 238097, 239329, 239706, 239294, 238831, 238928, 239644, 240686, 241683, 242296, 242369, 242086, 241787, 241509, 240846, 239426, 237468, 235644, 234369, 233390, 232220, 230874, 229969, 230017, 230816, 231714, 232361, 232913, 233467, 233657, 233062, 231763, 230178, 228549, 227016, 226130, 226671, 228656, 230932, 232041, 231343]
52537B31343k165k799k423j140L29J011Q02O41J132J628J287N07M29J192J658
52522B33432J017j50p14l87K12M78M36M85Q92J566K193K548K626K514K279K098
52506B51525K298K978L662L710K990J873O50n98j629k133k371l084m378n206m586
52491B45701l007j895j818j886j191j06L02k01p35n25K00P49R95J376K043K499
52475B42501K242J438P37N63Q05J060J074R46R70J179J142N16k42j63J029K500
52459B58297L400L805M070L799K322k8k036l016l323l397l181k775k751l298l725
52444B48163l390k584j942j443p32LJ86k19o55p78p50p08m83J6N65R10R36N83
52426B37678j58j008j470j254n19L36J013J441J669J702J475J065Q26J015J271
$$ y = [231343, 229178, 226379, 223956, 222816, 223145, 224156, 224958, 225599, 226731, 228359, 229646, 230153, 230582, 231774, 233432, 234449, 234299, 233585, 233198, 233410, 233888, 234324, 234809, 235701, 237267, 239460, 242008, 244634, 247148, 249427, 251525, 253823, 256801, 260463, 264173, 267163, 269036, 269686, 269088, 267459, 265326, 262955, 259871, 255493, 250287, 245701, 242694, 240799, 238981, 237095, 235904, 235798, 236100, 235899, 235164, 234639, 234839, 235588, 236583, 237959, 240002, 242501, 244743, 246181, 246918, 247481, 248286, 249346, 250420, 251366, 252336, 253515, 254657, 255173, 254931, 254768, 255797, 258297, 261697, 265502, 269572, 273371, 275693, 275665, 273629, 270613, 267290, 263893, 260712, 257937, 255186, 251888, 248163, 244773, 242189, 240247, 238804, 238072, 238075, 238261, 238042, 237387, 236609, 235859, 235151, 234668, 234684, 235249, 236159, 237095, 237678, 237520, 236512, 235042, 233788, 233269, 233605, 234618, 236059, 237728, 239430, 240905, 241970, 242796, 243811, 245082]
52411B45082R96K96R9R60K273L133L596M499O255Q377J0062J0687R876P607M370
52396C18168R00k219m527n660n791n704n857n673m441k586j206n58L6P67R19J90
52380B76758n47l66N51J353J610J522J445J732K568L629M239M165L878L778L716
52365C10031L534L485L608L310K135O00l90o21n09k98O4M30N02L11J47J06J31
52348C26576L91J108K048K628K589K239K058K255K734L216L511L762M290N052
52334C64457N654O056O782Q047R180R513R428R864J1060J2545J4102J5908J7777
52321E00373J9154J9956K0648K1351K1624K1366K1112K1075K0658J9495J8368
52310G25180J8391J9595K0898K1361K0912J9974J8920J7993J7334J6889J6362
$$ y = [245082, 246078, 246374, 246473, 247433, 249706, 252839, 256435, 260934, 267189, 275566, 285628, 296315, 306191, 313798, 318168, 319068, 316849, 312322, 306662, 300871, 295167, 289310, 283637, 279196, 276610, 275404, 274846, 274882, 275649, 276568, 276758, 276211, 275845, 276396, 277749, 279359, 280881, 282326, 284058, 286626, 290255, 294494, 298659, 302537, 306315, 310031, 313565, 317050, 320658, 323968, 326103, 326703, 326313, 325692, 325183, 324885, 324949, 325379, 325881, 326192, 326339, 326445, 326576, 326967, 328075, 330123, 332751, 335340, 337579, 339637, 341892, 344626, 347842, 351353, 355115, 359405, 364457, 370111, 376167, 382949, 390996, 400176, 409689, 419117, 428981, 440041, 452586, 466688, 482596, 500373, 519527, 539483, 560131, 581482, 603106, 624472, 645584, 666659, 687317, 706812, 725180, 743571, 763166, 784064, 805425, 826337, 846311, 865231, 883224, 900558, 917447, 933809]
52299I33809J5431J3988J2266J0706R521Q364O580L971J085j391l408n464p822
52286I97636j0034j1356j1527j1010j0474j0120r648q782p626o343m771k637o4
52273H93244K406M303N555O419P347Q808J0905J3087J4573J5164J5383J5707J5985
52260A028886J5794J5136J4514J4375J4696J5042J5028J4649J4172J3709J3051
52249A189052J2031J0809R483P637M716Q67l052o396r197j1618j3415j4344j4757
52236A161816j5271j5935j6231j5889j5349j5181j5336j5238j4573j3641j2881
52225I96291j2313j1721j1144j0740j0197q906o975n442m962m663l142m26J858
52212I07518K501K112K188L254M568N350N672O011O353O176N254M133L476L135
$$ y = [933809, 949240, 963228, 975494, 986200, 995721, 1004085, 1010665, 1014636, 1015721, 1014330, 1010922, 1005458, 997636, 987602, 976246, 964719, 953709, 943235, 933115, 923467, 914685, 907059, 900716, 895945, 893308, 893244, 895650, 899953, 905508, 911927, 919274, 928082, 938987, 952074, 966647, 981811, 997194, 1012901, 1028886, 1044680, 1059816, 1074330, 1088705, 1103401, 1118443, 1133471, 1148120, 1162292, 1176001, 1189052, 1201083, 1211892, 1221375, 1229012, 1233728, 1234595, 1231543, 1225147, 1215950, 1204332, 1190917, 1176573, 1161816, 1146545, 1130610, 1114379, 1098490, 1083141, 1067960, 1052624, 1037386, 1022813, 1009172, 996291, 983978, 972257, 961113, 950373, 940176, 931270, 924295, 918853, 913891, 909228, 906086, 905660, 907518, 910019, 912131, 914319, 917573, 922141, 927491, 933163, 939174, 945527, 951703, 956957, 961090, 964566, 967701]
52198I67701K408J301Q32J625K812L144K714K654L311L863L900M144N064N811
52184A011284N311L778K265J115k61k299m674o763q185q947r397r925j0386j0103
52170I52813q779p067n814n028m133k957j817q18K78J450K329K775L107L596M149
52155I34084M476M300L406J905M19l44l05M1K69L63M54P04J297K168K812K799
52139I58848K381K115K005J620R73N71N88P69J329L001N824Q651J0516J1915J4020
52124A025126J7098K0415K3364K5915K8089K9792L1210L2669L3937L4245L3248
52113A335108L1521K9801K8192K6359K4163K1718J9026J6000J2812R831P238M960
52101A566729L069J905J571J468P29q55k580l661m210n117o990r524j1985j4134
$$ y = [967701, 970109, 971410, 972242, 973867, 976679, 979823, 982537, 985191, 988502, 992365, 996265, 1000409, 1005473, 1011284, 1016595, 1020373, 1022638, 1023753, 1023492, 1021193, 1016519, 1009756, 1001571, 992624, 983227, 973302, 962916, 952813, 944034, 936967, 931153, 926125, 921992, 919035, 917218, 916400, 916678, 918128, 920457, 923232, 926339, 929935, 934084, 938560, 942860, 946266, 948171, 948590, 948246, 947941, 947982, 948251, 948614, 949068, 949772, 951069, 953237, 956049, 958848, 961229, 963344, 965349, 966969, 967942, 968513, 969101, 969870, 971199, 974200, 980024, 988675, 999191, 1011106, 1025126, 1042224, 1062639, 1086003, 1111918, 1140007, 1169799, 1201009, 1233678, 1267615, 1301860, 1335108, 1366629, 1396430, 1424622, 1450981, 1475144, 1496862, 1515888, 1531888, 1544700, 1554531, 1561769, 1566729, 1569798, 1571703, 1573274, 1574742, 1575471, 1574616, 1572036, 1568375, 1564165, 1559048, 1552058, 1542534, 1530549, 1516415]
52087A516415j6328j8738k0862k2027k2167k1758k1019j9560j6974j3570j0193
52076A313219p387n025k737m09J826L915O000Q251J0662J2937J4716J5961J7023
52063A388952J8082J8702J8345J7284J6436J6143J5671J4268J2198J0275Q746
52052A555102P325O058N322M986M205K385k85l367o778j0449j3903j6725j9202
52039A514674k1924k4767k6808k7363k6697k5523k4154k2549k0989k0052j9777
$$ y = [1516415, 1500087, 1481349, 1460487, 1438460, 1416293, 1394535, 1373516, 1353956, 1336982, 1323412, 1313219, 1305832, 1300807, 1298070, 1297661, 1299487, 1303402, 1309402, 1317653, 1328315, 1341252, 1355968, 1371929, 1388952, 1407034, 1425736, 1444081, 1461365, 1477801, 1493944, 1509615, 1523883, 1536081, 1546356, 1555102, 1562427, 1568485, 1573807, 1578793, 1582998, 1585383, 1585098, 1581731, 1574953, 1564504, 1550601, 1533876, 1514674, 1492750, 1467983, 1441175, 1413812, 1387115, 1361592, 1337438, 1314889, 1293900, 1273848, 1254071]
$$ [...]
##END NTUPLES=NMR SPECTRUM
##END=
