##TITLE=AC1543_ROEFFECT0012_8215216_BSwHfQL54B
##JCAMPDX= 6.0         $$ Bruker NMR JCAMP-DX V2.0
##DATA TYPE= NMR SPECTRUM
##DATA CLASS= NTUPLES
##ORIGIN= BRUKER
##OWNER= Administrator
$$ 1.72 TOPSPIN		Version 2.1
$$ 2014-08-04 23:35:09.510 -0700  Administrator@X
$$ Compression mode = diff/dup
##.OBSERVE FREQUENCY= 400.02188249412
##.OBSERVE NUCLEUS= ^1H
##.ACQUISITION MODE= SIMULTANEOUS (DQD)
##.ACQUISITION SCHEME= undefined
##.AVERAGES= 64
##.DIGITISER RES= 22
##SPECTROMETER/DATA SYSTEM= spect
##.PULSE SEQUENCE= noesygpps1d.comp
##.SOLVENT NAME= COFFEE_meoh
##.SHIFT REFERENCE= INTERNAL, COFFEE_meoh, 1, 14.97763
##AUDIT TRAIL= $$ (NUMBER, WHEN, WHO, WHERE, PROCESS, VERSION, WHAT)
$$ ##TITLE= Audit trail, TOPSPIN		Version 2.1
$$ ##JCAMPDX= 5.01
$$ ##ORIGIN= Bruker BioSpin GmbH
$$ ##OWNER= Administrator
$$ $$ E:\/data/COFFEE/nmr/AC1543_ROEFFECT0012_8215216_BSwHfQL54B/22/pdata/1/auditp.txt
$$ ##AUDIT TRAIL=  $$ (NUMBER, WHEN, WHO, WHERE, PROCESS, VERSION, WHAT)
(   1,<2014-08-04 23:35:04.088 -0700>,<Administrator>,<X>,<go>,<TOPSPIN 2.1>,
      <created by zg
	started at 2014-08-04 23:23:32.761 -0700,
	POWCHK enabled, PULCHK disabled,
       configuration hash MD5:
       16 EA D6 F4 BB 67 03 14 9B FF E7 A0 43 5B 48 2E
       data hash MD5: 64K
       50 20 FA D6 6A CF 1C 2E DC 42 18 1D E1 C2 72 99>)
(   2,<2014-08-04 23:35:07.260 -0700>,<Administrator>,<X>,<proc1d>,<TOPSPIN 2.1>,
      <Start of raw data processing
       efp LB = 0.3 FT_mod = 6 PKNL = 1 PHC0 = 0 PHC1 = 0 SI = 128K 
       data hash MD5: 128K
       0D A6 46 0C 80 96 7F 9F F3 5E 3C 37 84 A5 9A D4>)
(   3,<2014-08-04 23:35:08.275 -0700>,<Administrator>,<X>,<proc1d>,<TOPSPIN 2.1>,
      <pk PHC0 = -85.64392 PHC1 = 0 
       data hash MD5: 128K
       A2 0F FD 57 55 C4 22 7D 67 6F 85 72 4A FB 8E D1>)
(   4,<2014-08-04 23:35:08.791 -0700>,<Administrator>,<X>,<proc1d>,<TOPSPIN 2.1>,
      <abs ABSG = 1 
       data hash MD5: 128K
       5F D9 D8 B2 69 0A A5 13 C1 E3 94 A2 1B F5 00 A3>)
(   5,<2014-08-04 23:35:08.916 -0700>,<Administrator>,<X>,<proc1d>,<TOPSPIN 2.1>,
      <abs ABSG = 2 
       data hash MD5: 128K
       78 2E FF 8D 10 78 AB 88 99 F6 20 65 77 ED 4C F1>)
(   6,<2014-08-04 23:35:09.041 -0700>,<Administrator>,<X>,<proc1d>,<TOPSPIN 2.1>,
      <abs ABSG = 3 
       data hash MD5: 128K
       FC 05 C7 E2 A1 0B 54 F0 4B A9 F2 16 00 B1 B1 85>)
(   7,<2014-08-04 23:35:09.166 -0700>,<Administrator>,<X>,<proc1d>,<TOPSPIN 2.1>,
      <abs ABSG = 4 
       data hash MD5: 128K
       48 B1 81 67 3D BB 56 56 07 12 0C 83 D4 ED F6 54>)
(   8,<2014-08-04 23:35:09.275 -0700>,<Administrator>,<X>,<proc1d>,<TOPSPIN 2.1>,
      <abs ABSG = 5 
       data hash MD5: 128K
       4D A0 94 E6 F6 05 54 C5 91 15 08 0C 97 49 B6 3E>)
$$ ##END=
$$ 
$$ $$ hash MD5
$$ $$ 1B 24 F0 C1 06 01 DA B5 85 CA 08 84 8D D9 F1 37
##$RELAX= 
##$RELAX= 
##$RELAX= 
##$RELAX= 
##$RELAX= 
##$RELAX= 
##$RELAX= 
##$RELAX= 
$$ Bruker specific parameters
$$ --------------------------
##$DU= <E:\>
##$EXPNO= 22
$$ [...]
##$TP07= 0
##$TPNAME0= <>
##$TPNAME1= <>
##$TPNAME2= <>
##$TPNAME3= <>
##$TPNAME4= <>
##$TPNAME5= <>
##$TPNAME6= <>
##$TPNAME7= <>
##$TPOAL= (0..7)
0.5 0.5 0.5 0.5 0.5 0.5 0.5 0.5
##$TPOFFS= (0..7)
0 0 0 0 0 0 0 0
##$TUNHIN= 0
##$TUNHOUT= 0
##$TUNXOUT= 0
##$USERA1= <user>
##$USERA2= <user>
##$USERA3= <user>
##$USERA4= <user>
##$USERA5= <user>
##$V9= 5
##$VALIST= <valist>
##$VCLIST= <CCCCCCCCCCCCCCC>
##$VD= 0
##$VDLIST= <DDDDDDDDDDDDDDD>
##$VPLIST= <PPPPPPPPPPPPPPP>
##$VTLIST= <TTTTTTTTTTTTTTT>
##$WBST= 1024
##$WBSW= 4
##$XGAIN= (0..3)
0 0 0 0
##$XL= 0
##$YL= 0
##$YMAX_a= 8317143
##$YMIN_a= -9495269
##$ZGOPTNS= <>
##$ZL1= 120
##$ZL2= 120
##$ZL3= 120
##$ZL4= 120
##$ABSF1= 14.97763
##$ABSF2= -5.580552
##$ABSG= 5
##$ABSL= 3
##$ALPHA= 0
##$AQORDER= 0
##$ASSFAC= 0
##$ASSFACI= 0
##$ASSFACX= 0
##$ASSWID= 0
##$AUNMP= <proc_prof1d_extract.lims>
##$AXLEFT= 0
##$AXNAME= <>
##$AXNUC= <1H>
##$AXRIGHT= 0
##$AXTYPE= 0
##$AXUNIT= <>
##$AZFE= 0.1
##$AZFW= 0.1
##$BCFW= 0
##$BC_mod= 0
##$BYTORDP= 0
##$COROFFS= 0
##$CY= 15
##$DATMOD= 1
##$DC= 0
##$DFILT= <>
##$DTYPP= 0
##$F1P= 0
##$F2P= 0
##$FCOR= 0.5
##$FTSIZE= 131072
##$FT_mod= 6
##$GAMMA= 0
##$GB= 0
##$INTBC= 1
##$INTSCL= 1
##$ISEN= 128
##$LB= 0.3
##$LEV0= 0
##$LPBIN= 0
##$MAXI= 10000
##$MC2= 0
##$MEAN= 0
##$ME_mod= 0
##$MI= 0
##$NCOEF= 0
##$NC_proc= -2
##$NLEV= 6
##$NOISF1= 0
##$NOISF2= 0
##$NSP= 0
##$NTH_PI= 0
##$NZP= 0
##$OFFSET= 14.97763
##$PC= 1
##$PHC0= -85.64392
##$PHC1= 0
##$PH_mod= 1
##$PKNL= yes
##$PPARMOD= 0
##$PPDIAG= 0
##$PPIPTYP= 0
##$PPMPNUM= 2147483647
##$PPRESOL= 1
##$PSCAL= 4
##$PSIGN= 0
##$PYNMP= <proc.py>
##$REVERSE= no
##$SF= 400.02000298464
##$SI= 131072
##$SIGF1= 0
##$SIGF2= 0
##$SINO= 400
##$SIOLD= 131072
##$SPECTYP= <>
##$SREGLST= <1H.CDCl3>
##$SSB= 0
##$STSI= 131072
##$STSR= 0
##$SW_p= 8223.68421052631
##$SYMM= 0
##$S_DEV= 0
##$TDeff= 65536
##$TDoff= 0
##$TI= <>
##$TILT= no
##$TM1= 0
##$TM2= 0
##$TOPLEV= 0
##$USERP1= <user>
##$USERP2= <user>
##$USERP3= <user>
##$USERP4= <user>
##$USERP5= <user>
##$WDW= 1
##$XDIM= 131072
##$YMAX_p= 321526906
##$YMIN_p= -514456660
##$CURPLOT= <Network HP LaserJet P1505>
##$CURPRIN= <$Network HP LaserJet P1505>
##$DFORMAT= <normdp>
##$LAYOUT= <+/1D_H.xwp>
##$LFORMAT= <normlp>
##$PFORMAT= <normpl>
##$SURQMSG= 1
$$ End of Bruker specific parameters
$$ ---------------------------------
##NTUPLES= NMR SPECTRUM
##VAR_NAME=  FREQUENCY,     SPECTRUM/REAL,   SPECTRUM/IMAG
##SYMBOL=    X,             R,               I
##VAR_TYPE=  INDEPENDENT,   DEPENDENT,       DEPENDENT
##VAR_FORM=  AFFN,          ASDF,            ASDF
##VAR_DIM=   131072,        131072,          131072
##UNITS=     HZ,            ARBITRARY UNITS, ARBITRARY UNITS
##FACTOR=    0.0627417313425164, 1,          1
##FIRST=     8223.62146879497, 2696,         -38353
##LAST=      0,             4441,            -38364
##MIN=       0,             -514456660,      0
##MAX=       8223.62146879497, 321526906,    0
$$ Real data points
##PAGE= N=1
##DATA TABLE= (X++(R..R)), XYDATA
$$ [...]
$$ plain form
62637 872109 836651 804092 774112 746866 722577 701205 682408 665841 651402 639087 628694
62626 628694 619857 612334 606079 601014 596879 593328 590088 587140 584813 583639 584002 585946 589386 594350
62612 594350 600882 608862 618192 629112 642113 657467 674923 693976 714459 736861 762023 790466
62600 790466 822104 856580 893731 933706 976972 1024396 1076881 1134360 1195429 1258495 1323067
62589 1323067 1389152 1455513 1519524 1578932 1632729 1679923 1718490 1746422 1763104 1768794 1763255 1745921
62577 1745921 1717122 1678228 1630650 1575568 1514617 1449980 1383543 1316531 1250096 1185605 1124061
62566 1124061 1065713 1010540 958819 910967 867139 827217 791003 758258 728680 701977 677895
62555 677895 656207 636789 619580 604290 590243 576759 563626 550977 538898 527462 517015
$$ packed form
62637H72109l5458l2559k9980k7246k4289k1372j8797j6567j4439j2315j0393
62626F28694q837p523o255n065m135l551l240k948k327j174L63J944L440M964
62612E94350O532P980R330J0920J3001J5354J7456J9053K0483K2402K5162K8443
62600G90466L1638L4476L7151L9975M3266M7424N2485N7479O1069O3066O4572
62589A323067O6085O6361O4011N9408N3797M7194L8567K7932J6682N690n539j7334
62577A745921k8799l8894m7578n5082o0951o4637o6437o7012o6435o4491o1544
62566A124061n8348n5173n1721m7852m3828l9922l6214l2745k9578k6703k4082
62555F77895k1688j9418j7209j5290j4047j3484j3133j2649j2079j1436j0447
$$ plain form
62544 517015 508004 500497 494172 488789 484366 480938 478435 476776 475716 474609 472689 469676 465911 461929
62530 461929 458164 454976 452527 450545 448549 446411 444438 442884 441720 440985 441043 442239 444467 447183 449757
62515 449757 451788 453305 454728 456477 458550 460688 462960 465984 470405 476293 483139 490442 498304 507465
62501 507465 518707 532172 547399 564097 582629 603544 626951 652705 680995 712236 746389
62490 746389 782883 821290 861633 903740 946690 989220 1030491 1070016 1106839 1139195 1165255
62479 1165255 1184071 1195567 1199622 1195619 1183164 1162982 1136696 1105765 1071080 1033519 994276 954410
62467 954410 914577 875490 838153 803237 770614 740032 711864 686642 664059 643123 623267
62456 623267 604767 588052 573152 559959 548573 539052 531033 523854 517082 510867 505739 501942 499040
$$ packed form
62544E17015r011p507o325n383m423l428k503j659j060j107j920l013l765l982
62530D61929l765l188k449j982j996k138j973j554j164p35N8J196K228K716K574
62515D49757K031J517J423J749K073K138K272L024M421N888O846P303P862R161
62501E07465J1242J3465J5227J6698J8532K0915K3407K5754K8290L1241L4153
62490G46389L6494L8407M0343M2107M2950M2530M1271L9525L6823L2356K6060
62479A165255J8816J1496M055m003j2455k0182k6286l0931l4685l7561l9243l9866
62467I54410l9833l9087l7337l4916l2623l0582k8168k5222k2583k0936j9856
62456F23267j8500j6715j4900j3193j1386r521q019p179o772o215n128l797k902
$$ plain form
62443 499040 496381 493915 492149 491220 490569 489778 489161 489015 488874 488129 487014 486245 486005 486083 486861 489285 493734
62426 493734 499590 506034 512754 519833 527578 536549 547211 559449 572938 588053 605824 626837 650714
62413 650714 676867 705235 736074 769458 805285 843438 883704 925739 969159 1013332 1057113
62402 1057113 1099109 1138251 1173759 1204737 1230403 1250768 1266562 1278417 1286689 1292102 1295973 1299533
62390 1299533 1303451 1308120 1313926 1321145 1330138 1341726 1356704 1374729 1394162 1413125 1430086 1443347
62378 1443347 1450913 1451538 1445380 1433172 1415133 1390957 1360264 1322607 1277746 1226721 1172328 1117771
62366 1117771 1064777 1013302 962806 913412 866041 821928 782054 746767 715940 689436 667129
62355 667129 648513 632812 619592 608802 600105 592861 587003 583190 581630 581522 582226 584263 588367 594179
$$ packed form
62443D99040k659k466j766r29o51p91o17j46j41p45j115p69k40P8P78K424M449
62426D93734N856O444O720P079P745Q971J0662J2238J3489J5115J7771K1013K3877
62413F50714K6153K8368L0839L3384L5827L8153M0266M2035M3420M4173M3781
62402A057113M1996L9142L5508L0978K5666K0365J5794J1855Q272N413L871L560
62390A299533L918M669N806P219Q993J1588J4978J8025J9433J8963J6961J3261
62378A443347P566O25o158j2208j8039k4176l0693l7657m4861n1025n4393n4557
62366A117771n2994n1475n0496m9394m7371m4113l9874l5287l0827k6504k2307
62355F67129j8616j5701j3220j0790q697p244n858l813j560j08P04K037M104N812
$$ plain form
62341 594179 600772 608019 616371 625490 634146 641463 647406 652046 655257 657245 658452 658620 656674 651909
62327 651909 644719 635932 626075 615666 605482 595945 586648 577030 567200 557596 548170 538541 528875 520031
62313 520031 512732 506902 501785 496501 490610 484578 479659 476867 475908 475486 474763 474173 474645 476446 479086
62298 479086 481978 484726 486992 488640 490057 491911 494527 497772 501519 505804 510548 515574 521010 527148
62284 527148 533709 539845 545241 550749 557480 565580 574312 582944 591011 598082 604043 609547 615540 622298
62270 622298 629414 636718 644680 653876 664578 676920 691010 706802 724287 743987 766862 793666
62258 793666 824611 859557 898070 939391 982785 1027896 1074231 1120399 1164449 1204938 1241064
62247 1241064 1271884 1296341 1314354 1327129 1335973 1341344 1343210 1341580 1336277 1326889 1313545 1297273
$$ packed form
62341E94179O593P247Q352R119Q656P317N943M640L211J988J207J68j946m765
62327F51909p190q787r857j0409j0184r537r297r618r830r604r426r629r666q844
62313E20031p299n830n117n284n891o032m919k792r59m22p23n90M72J801K640
62298D79086K892K748K266J648J417J854K616L245L747M285M744N026N436O138
62284E27148O561O136N396N508O731Q100Q732Q632Q067P071N961N504N993O758
62270F22298P116P304P962R196J0702J2342J4090J5792J7485J9700K2875K6804
62258G93666L0945L4946L8513M1321M3394M5111M6335M6168M4050M0489L6126
62247A241064L0820K4457J8013J2775Q844N371J866j630n303r388j3344j6272
$$ plain form
62235 1297273 1279173 1259669 1238981 1217764 1196727 1175978 1155231 1134363 1113351 1092037 1070382
62224 1070382 1048560 1026348 1002859 977444 950581 923360 896318 869267 842002 814686 787775
62213 787775 762081 738668 718099 699871 683045 667299 652970 640293 629160 619466 611094 603594
62201 603594 596493 590078 585381 583151 583072 584120 585409 586580 587641 588729 589987 591565 593559 595882 598277
62186 598277 600578 602863 605155 607118 608446 609470 610849 612553 613771 614112 614445 616125 619690 624675 630393
62171 630393 636541 643305 651174 660482 670939 681944 693617 707180 723968 744341 767858 794181
62159 794181 823374 855570 890766 928953 970229 1014764 1062533 1112714 1163325 1211951 1256954
62148 1256954 1297538 1332748 1361276 1382563 1397251 1406013 1408570 1404378 1393525 1376354 1352863 1323276
$$ packed form
62235A297273j8100j9504k0688k1217k1037k0749k0747k0868k1012k1314k1655
62224A070382k1822k2212k3489k5415k6863k7221k7042k7051k7265k7316k6911
62213G87775k5694k3413k0569j8228j6826j5746j4329j2677j1133r694q372p500
62201F03594p101o415m697k230p9J048J289J171J061J088J258J578J994K323K395
62186E98277K301K285K292J963J328J024J379J704J218L41L33J680L565M985N718
62171F30393O148O764P869R308J0457J1005J1673J3563J6788K0373K3517K6323
62159G94181K9193L2196L5196L8187M1276M4535M7769N0181N0611M8626M5003
62148A256954M0584L5210K8528K1287J4688Q762K557m192j0853j7171k3491k9587
$$ plain form
62136 1323276 1288660 1250217 1208444 1163781 1117669 1072079 1028296 986813 948048 912322 879519
62125 879519 849638 823339 801054 781944 764780 749627 737460 728211 720398 712870 705851 699957
62113 699957 695189 691342 688573 687037 686484 686587 687198 688052 688788 689520 690875 693167 695968 698737 701439 704362
62097 704362 707750 711786 716547 721698 726559 730651 733986 736848 739660 743020 747418 752799 758776 765194
62083 765194 772120 779382 786594 793642 800621 807339 813374 818609 823215 827277 831053 835526 841926 850598
62069 850598 861046 873200 887944 906220 928296 954038 983080 1014354 1046109 1076840 1105712
62058 1105712 1131889 1154188 1171881 1185212 1194591 1199721 1200131 1196174 1188860 1178807 1165804 1149358
62046 1149358 1129299 1105970 1080085 1052454 1023773 994759 966477 940185 916676 895961 877712
$$ packed form
62136A323276l4616l8443m1773m4663m6112m5590m3783m1483l8765l5726l2803
62125H79519k9881k6299k2285j9110j7164j5153j2167r249p813p528p019n894
62113F99957m768l847k769j536n53J03O11Q54P36P32J355K292K801K769K702K923
62097G04362L388M036M761N151M861M092L335K862K812L360M398N381N977O418
62083G65194O926P262P212P048O979O718O035N235M606M062L776M473O400Q672
62069H50598J0448J2154J4744J8276K2076K5742K9042L1274L1755L0731K8872
62058A105712K6177K2299J7693J3331R379N130M10l957p314j0053j3003j6446
62046A149358k0059k3329k5885k7631k8681k9014k8282k6292k3509k0715j8249
$$ plain form
62035 877712 861829 848421 837435 828389 820469 813014 805979 799681 793867 787485 779885 771866 764793
62022 764793 758891 753300 747779 743415 741340 741593 743637 747330 752854 760137 768729 777920 786680 793815
62008 793815 798459 800154 798537 793579 786335 778723 772075 766280 760590 754698 748565 741711 733363 723278
61994 723278 712139 701235 691871 684770 679810 676494 674668 674499 675836 678160 681202 685043 689508 694094
61980 694094 698710 703947 710418 718394 728175 740038 753546 767706 782222 797868 815201 833692
61968 833692 852730 872704 894320 917422 941296 965604 990187 1014344 1037137 1058187 1077383
61957 1077383 1093970 1106710 1114935 1118814 1118688 1114711 1107139 1096402 1082851 1066791 1048618 1028467
61945 1028467 1005844 980107 951322 920366 888319 856168 824850 795046 766909 740337 715394
$$ packed form
62035H77712j5883j3408j0986r046p920p455p035o298n814o382p600q019p073
62022G64793n902n591n521m364k075K53K044L693N524P283Q592R191Q760P135
62008G93815M644J695j617m958p244p612o648n795n690n892o133o854q348j0085
61994G23278j1139j0904r364p101m960l316j826j69J337K324L042L841M465M586
61980F94094M616N237O471P976R781J1863J3508J4160J4516J5646J7333J8491
61968H33692J9038J9974K1616K3102K3874K4308K4583K4157K2793K1050J9196
61957A077383J6587J2740Q225L879j26l977p572j0737j3551j6060j8173k0151
61945A028467k2623k5737k8785l0956l2047l2151l1318k9804k8137k6572k4943
$$ plain form
61934 715394 692126 670210 649285 629509 611359 594955 579984 566180 553452 541690 530895
61923 530895 521358 513185 505729 498045 489959 482159 475169 468692 462126 455327 448598 442265 436527 431610
61909 431610 427847 425576 424911 425533 426817 428323 430062 432191 434598 436963 439072 440865 442344 443673 445176
61894 445176 446961 448673 449952 451024 452525 454707 457058 458672 458866 457485 454824 451298 447196 442815
61880 442815 438737 435582 433342 431273 428639 425358 421811 418435 415658 413811 412703 411622 410117 408478
61866 408478 407191 406286 405596 405201 405059 404534 402950 400446 397795 395516 393733 392664 392618 393533 395147 397600
61850 397600 401276 405940 410652 414803 418872 423952 430768 439210 448506 457773 466721 475924 486216 497812
61836 497812 510272 523203 536552 550116 563175 574918 585144 594441 603677 613191 622334 629970
$$ packed form
61934G15394k3268k1916k0925j9776j8150j6404j4971j3804j2728j1762j0795
61923E30895r537q173p456p684q086p800o990o477o566o799o729o333n738m917
61909D31610l763k271o65O22J284J506J739K129K407K365K109J793J479J329J503
61894D45176J785J712J279J072J501K182K351J614J94j381k661l526m102m381
61880D42815m078l155k240k069k634l281l547l376k777j847j108j081j505j639
61866D08478j287r05o90l95j42n25j584k504k651k279j783j069m6R15J614K453
61850C97600L676M664M712M151M069N080O816Q442R296R267Q948R203J0292J1596
61836D97812J2460J2931J3349J3564J3059J1743J0226R297R236R514R143P636
$$ plain form
61824 629970 635698 640364 645021 649430 652071 651721 648735 644711 641121 638348 635858 633265 631275 631436 634733
61809 634733 640608 647679 655229 663615 673300 683978 694767 704874 713854 721496 727628 732025 734492
61796 734492 735128 734346 732397 729031 723917 717354 710211 703218 696608 690408 684689 679439 674465 669476 664046
61781 664046 657583 649682 640562 630809 620652 609888 598652 587804 578194 569786 561853 554038 546951
61768 546951 541687 538824 537951 538133 538806 540190 542867 547090 552603 558989 566044 573815 582465 592221 603417
61753 603417 616543 632079 650128 670231 691719 714210 737554 761363 785035 808302 831322
61742 831322 853890 874893 892908 907208 917913 925359 929645 930721 928643 923791 916994 909369 901903
61729 901903 895343 890513 888380 889524 893689 900059 907760 916000 924067 931504 938045 943165 945968 945727
$$ packed form
61824F29970N728M666M657M409K641l50k986m024l590k773k490k593j990J61L297
61809F34733N875P071P550Q386R685J0678J0789J0107Q980P642O132M397K467
61796G34492O36p82j949l366n114o563p143o993o610o200n719n250m974m989n430
61781F64046o463p901r120r753j0157j0764j1236j0848r610q408p933p815p087
61768E46951n264k863q73J82O73J384K677M223N513O386P055P771Q650R756J1196
61753F03417J3126J5536J8049K0103K1488K2491K3344K3809K3672K3267K3020
61742H31322K2568K1003J8015J4300J0705P446M286J076k078m852o797p625p466
61729I01903o560m830k133J144M165O370P701Q240Q067P437O541N120K803k41
$$ plain form
61715 945727 942209 935288 924787 911051 895137 877893 859208 838751 817102 795514 774798 755042
61703 755042 736239 718568 702168 687175 673872 662281 651840 642019 633109 625746 619820 614471
61691 614471 609099 603749 598630 593963 590230 587790 586197 584590 582816 581483 580825 580324 579580 578755 577904
61676 577904 576696 575217 574323 574664 575866 577178 578459 580050 582071 584413 587147 590471 594432 599078 604748
61661 604748 611867 620543 630526 641307 652043 661735 669881 676846 683234 688886 692705 693517 691043 686060
61647 686060 679633 672157 663281 652882 641817 631270 621540 611990 602274 592950 584695 577406 570500
61634 570500 563757 557508 552215 548197 545561 544040 542936 541513 539528 537334 535505 534403 533983 533913 533906 533875
61618 533875 533760 533411 532819 532230 531733 530934 529421 527446 525661 524238 522700 520624 517992 514837 511079 506895
$$ packed form
61715I45727l518o921j0501j3736j5914j7244j8685k0457k1649k1588k0716j9756
61703G55042j8803j7671j6400j4993j3303j1591j0441r821q910p363n926n349
61691F14471n372n350n119m667l733k440j593j607j774j333o58n01p44q25q51
61676E77904j208j479q94L41J202J312J281J591K021K342K734L324L961M646N670
61661F04748P119Q676R983J0781J0736R692Q146O965O388N652L819Q12k474m983
61647F86060o427p476q876j0399j1065j0547r730r550r716r324q255p289o906
61634E70500o743o249n293m018k636j521j104j423j985k194j829j102m20p0pl1
61618E33875j15l49n92n89m97p99j513j975j785j423j538k076k632l155l758m184
$$ plain form
61602 506895 502787 499095 495755 492615 489568 486292 482413 478117 474136 470875 467985 464987 461882 458880
61588 458880 455967 453077 450267 447452 444338 440966 437903 435475 433180 430293 426782 423185 419833 416728
61574 416728 414011 412018 410830 410128 409536 408828 407833 406459 404852 403378 402348 401865 401842 402062 402272 402396 402644
61557 402644 403318 404552 406240 408075 409531 409996 409145 407307 405429 404568 405189 406807 408445 409649 410964
61542 410964 413198 416376 419685 422384 424411 426169 428079 430320 432663 434470 435139 434546 432809 429806 425478
61527 425478 420536 416236 413235 411086 408988 406569 403877 401175 399029 397998 397869 397634 396596 395149 394091
61512 394091 393559 393002 391963 390431 388636 386795 384969 382942 380356 377083 373267 369018 364456 360079 356583
61497 356583 354036 351738 349126 346352 343670 340887 337923 335371 333851 333147 332586 331980 331541 331096 330184 328915
$$ packed form
61602E06895m108l692l340l140l047l276l879m296l981l261k890k998l105l002
61588D58880k913k890k810k815l114l372l063k428k295k887l511l597l352l105
61574D16728k717j993j188p02n92p08r95j374j607j474j030m83k3K20K10J24K48
61557D02644O74J234J688J835J456M65q51j838j878q61O21J618J638J204J315
61542D10964K234L178L309K699K027J758J910K241K343J807O69n93j737l003m328
61527D25478m942m300l001k149k098k419k692k702k146j031j29k35j038j447j058
61512C94091n32n57j039j532j795j841j826k027k586l273l816m249m562m377l496
61497C56583k547k298k612k774k682k783k964k552j520p04n61o06m39m45r12j269
$$ plain form
61481 328915 328029 327936 328230 328304 328000 327501 326933 326339 325784 325306 324914 324685 324687 324739 324507 323976 323645 324057 325229 326717
61461 326717 328183 329661 331136 332115 332063 331322 331150 332489 334946 337376 339209 340685 342054 343273 344498
61446 344498 346066 347714 348583 348418 348155 348811 350294 351895 353479 355419 357562 359052 359331 358861 358715 359693
61430 359693 361827 364458 366689 367937 368097 367233 365420 362989 360628 358897 357796 357023 356460 356158 356034 355844
61414 355844 355340 354379 353085 352071 352070 353099 354307 354980 355345 356004 356939 357603 357798 357898 358302 359133 360482 362505
61396 362505 365219 368462 372092 375946 379665 382862 385525 388082 391019 394464 397994 400754 402024 401879
61382 401879 401118 400345 399370 397696 395316 392743 390558 389152 388563 388152 386833 384225 381341 379561 379079 379016
61366 379016 378884 379149 380193 381499 382364 382936 383946 385591 387161 387777 387196 385824 384262 383035 382561 383042
$$ packed form
61481C28915q86r3K94P4l04m99n68n94n55m78l92k29KN2k32n31l31M12J172J488
61461C26717J466J478J475R79n2p41j72J339K457K430J833J476J369J219J225
61446C44498J568J648Q69j65k63O56J483J601J584J940K143J490K79m70j46R78
61430C59693K134K631K231J248J60q64j813k431k361j731j101p73n63l02j24j90
61414C55844n04r61j294j014jJ029J208O73L65O59R35O64J95J00M04Q31J349K023
61396C62505K714L243L630L854L719L197K663K557K937L445L530K760J270j45
61382D01879p61p73r75j674k380k573k185j406n89m11j319k608k884j780m82o3
61366C79016j32K65J044J306Q65N72J010J645J570O16n81j372j562j227m74M81
$$ plain form
61350 383042 384251 385672 386944 388045 388990 389721 390540 392232 395218 398787 401781 403951 406007 408486 411343
61335 411343 414620 418548 422661 425804 427607 429107 431268 433672 435446 436762 438417 440415 442058 443229
61321 443229 444594 446598 449092 451887 454834 457355 458792 459387 460200 461881 464035 465904 467076 467513 467510 467781
61305 467781 468920 470647 472132 473143 474199 475459 476264 476139 475613 475495 475824 476001 475625 474752 473620 472569
61289 472569 472003 471974 471866 470910 469027 466921 465268 464008 462530 460478 458279 456801 456531 457230 458440 460056
61273 460056 462180 464656 467101 469391 471775 474490 477459 480321 482536 483601 483560 483282 483855 485532 487555
61258 487555 489118 490256 491707 494115 497597 501975 507175 513188 519645 525673 530580 534629 538712 543132
61244 543132 547150 549986 551816 553397 555159 557127 559326 561619 563397 564149 564171 564131 564025 563237 561537 559346
$$ packed form
61350C83042J209J421J272J101R45P31Q19J692K986L569K994K170K056K479K857
61335D11343L277L928M113L143J803J500K161K404J774J316J655J998J643J171
61321D43229J365K004K494K795K947K521J437N95Q13J681K154J869J172M37lK71
61305D67781J139J727J485J011J056J260Q05j25n26j18L29J77l76q73j132j051
61289D72569n66k9j08r56j883k106j653j260j478k052k199j478k70O99J210J616
61273D60056K124K476K445K290K384K715K969K862K215J065m1k78N73J677K023
61258D87555J563J138J451K408L482M378N200O013O457O028M907M049M083M420
61244E43132M018K836J830J581J762J968K199K293J778P52K2m0j06p88j700k191
$$ plain form
61228 559346 556995 554463 551982 550160 549207 548668 548258 548459 549867 552307 554991 557344 559426 561766 565048
61213 565048 569762 575879 582876 590187 597666 605740 615214 626701 639935 653789 667248 680173 692759
61200 692759 704543 714582 722490 728611 733154 735874 736746 736291 734901 732393 728479 723196 716591 708547
61186 708547 699303 689718 680532 671684 662771 653856 645429 637806 631035 625290 620919 618023 616230 614894
61172 614894 613461 611747 609970 608462 607305 606415 605940 606326 607859 610448 613975 618639 624749 632260 640624
61157 640624 648913 656070 661332 664591 666272 666809 666412 665252 663476 660947 657296 652522 647353 642793 639467
61142 639467 637506 636859 637468 639193 641711 644518 647045 648881 649921 650302 650336 650562 651624 653772 656619 659687
61126 659687 663124 667494 672933 678852 684546 689835 695081 700844 707469 714823 722553 730802 740353 751518
$$ packed form
61228E59346k351k532k481j822r53n39m10K01J408K440K684K353K082K340L282
61213E65048M714O117O997P311P479Q074R474J1487J3234J3854J3459J2925J2586
61200F92759J1784J0039P908O121M543K720Q72m55j390k508l914n283o605q044
61186G08547r244r585r186q848q913q915q427p623o771n745m371k896j793j336
61172F14894j433j714j777j508j157q90m75L86J533K589L527M664O110P511Q364
61157F40624Q289P157N262L259J681N37l97j160j776k529l651m774n169m560l326
61142F39467j961o47O09J725K518K807K527J836J040L81L4K26J062K148K847L068
61126F59687L437M370N439N919N694N289N246N763O625P354P730Q249R551J1165
$$ plain form
61112 751518 763156 773458 781721 788723 795344 801538 806874 811421 815768 820671 826929 835059 844737 854970
61098 854970 865175 875769 887515 900690 915126 930475 946044 960760 973757 984724 993451 999500
61086 999500 1002793 1004106 1004393 1003791 1001741 997848 992063 984233 974130 962069 949003 935748 922289
61073 922289 908025 892527 876003 859168 842827 827542 813467 800314 787434 774263 760927
61062 760927 748334 737416 728379 720898 714768 709961 706227 703314 701592 701872 704421 708664 713975 720141
61048 720141 726829 733227 738598 742678 745217 745840 744961 744163 744832 746667 748431 749954 752601 757685 765216
61033 765216 774467 785077 797214 811081 826705 844044 862996 883390 905195 928609 953835 980895
61021 980895 1009739 1040347 1072498 1105605 1139074 1172844 1207317 1242666 1278383 1313593 1347664
$$ packed form
61112G51518J1638J0302Q263P002O621O194N336M547M347M903O258Q130R678J0233
61098H54970J0205J0594J1746J3175J4436J5349J5569J4716J2997J0967Q727O049
61086I99500L293J313K87o02k050l893n785p830j0103j2061j3066j3255j3459
61073I22289j4264j5498j6524j6835j6341j5285j4075j3153j2880j3171j3336
61062G60927j2593j0918r037p481o130m807l734k913j722K80K549M243N311O166
61048G20141O688O398N371M080K539O23q79p98O69J835J764J523K647N084P531
61033G65216R251J0610J2137J3867J5624J7339J8952K0394K1805K3414K5226K7060
61021I80895K8844L0608L2151L3107L3469L3770L4473L5349L5717L5210L4071
$$ plain form
61010 1347664 1380383 1411775 1441984 1471205 1499296 1525467 1548663 1568345 1584550 1597091 1605156
60999 1605156 1607924 1605265 1597612 1585638 1570393 1553211 1534753 1514387 1491128 1465111 1437631 1409869
60987 1409869 1382203 1354622 1327141 1299736 1272549 1246264 1221671 1198739 1176666 1154948 1133802
60976 1133802 1113447 1093736 1074803 1057361 1041833 1027712 1014266 1001491 989860 979470 969998
60965 969998 961290 953452 946375 939649 933098 927232 923007 921017 920842 921327 921743 922540 924707 928617 934053
60950 934053 941169 950551 962111 974690 987300 1000179 1014111 1029175 1044809 1060770 1077341 1094673
60938 1094673 1112595 1131141 1150708 1171432 1192759 1214042 1235424 1257804 1281834 1307217 1333291
60927 1333291 1360181 1389057 1421137 1456786 1495701 1537543 1582114 1629222 1678927 1731824 1788887
$$ packed form
61010A347664L2719L1392L0209K9221K8091K6171K3196J9682J6205J2541Q065
60999A605156K768k659p653j1974j5245j7182j8458k0366k3259k6017k7480k7762
60987A409869k7666k7581k7481k7405k7187k6285k4593k2932k2073k1718k1146
60976A133802k0355j9711j8933j7442j5528j4121j3446j2775j1631j0390r472
60965I69998q708p838p077o726o551n866m225j990j75M85M16P97K167L910N436
60950I34053P116R382J1560J2579J2610J2879J3932J5064J5634J5961J6571J7332
60938A094673J7922J8546J9567K0724K1327K1283K1382K2380K4030K5383K6074
60927A333291K6890K8876L2080L5649L8915M1842M4571M7108M9705N2897N7063
$$ plain form
60916 1788887 1851323 1920903 2000105 2091475 2196990 2318311 2457292 2615999 2796912 3003705
60906 3003705 3241488 3515994 3833295 4200607 4626137 5117470 5682116 6331814 7085935
60897 7085935 7970426 9016960 10265598 11761027 13530252 15550661 17734275 19938899
60889 19938899 21990229 23703081 24917274 25560638 25705465 25557738 25364491 25300878 25413926
60880 25413926 25637192 25830671 25811519 25390405 24435155 22936557 21021120 18892370 16745189
60871 16745189 14712834 12863680 11222068 9786853 8543363 7473093 6559315 5786283
60863 5786283 5136723 4592765 4138207 3758305 3438678 3166470 2932069 2728387 2549199
60854 2549199 2389485 2246446 2118537 2003861 1900704 1808796 1728335 1657883 1594555 1536005
$$ packed form
60916A788887O2436O9580P9202R1370J05515J21321J38981J58707J80913K06793
60906C003705K37783K74506L17301L67312M25530M91333N64646O49698P54121
60897G085935Q84491J046534J248638J495429J769225K020409K183614K204624
60889A9938899K051330J712852J214193O43364J44827j47727j93247o3613J13048
60880B5413926K23266J93479j9152m21114r55250j498598j915437k128750k147181
60871A6745189k032355j849154j641612j435215j243490j070270r13778p73032
60863E786283o49560n43958m54558l79902l19627k72208k34401k03682j79188
60854B549199j59714j43039j27909j14676j03157r1908q0461p0452o3328n8550
$$ plain form
60844 1536005 1480992 1428298 1376581 1325432 1275456 1227162 1180617 1136120 1094237 1055084 1018353
60833 1018353 984067 952558 923773 897261 872813 850463 830039 811285 794217 778756 764400
60822 764400 750847 738533 727830 718224 709046 700495 693065 686445 679973 673640 667679 661692 655351
60809 655351 649471 645122 642014 639008 635772 632549 628739 623419 617160 611532 606640 600834 593227 584869
60795 584869 576870 568937 560582 552388 545092 538411 531835 525805 521153 517838 515025 512116 509225 506934
60781 506934 505904 506397 507976 509980 512216 514637 516559 517078 516303 515209 514177 512683 510681 509174 508956
60766 508956 509730 510980 512792 515224 517652 519493 521015 522864 525267 528061 530994 533618 535499 536884
60752 536884 538508 540355 541284 540403 538239 536112 534891 534703 535165 535384 534310 531686 528190 524245 519269
$$ packed form
60844A536005n5013n2694n1717n1149m9976m8294m6545m4497m1883l9153l6731
60833A018353l4286l1509k8785k6512k4448k2350k0424j8754j7068j5461j4356
60822G64400j3553j2314j0703r606r178q551p430o620o472o333n961n987o341
60809F55351n880m349l108l006l236l223l810n320o259n628m892n806p607q358
60795E84869p999p933q355q194p296o681o576o030m652l315k813k909k891k291
60781E06934j030M93J579K004K236K421J922N19p75j094j032j494k002j507k18
60766E08956P74J250J812K432K428J841J522J849K403K794K933K624J881J385
60752E36884J624J847R29q81k164k127j221j88M62K19j074k624l496l945m976
$$ plain form
60737 519269 512599 504588 496149 487681 479027 470161 461370 452984 445344 438759 433134 427933 422842 418163
60723 418163 414295 411200 408682 406762 405406 404230 402804 400932 398455 395170 391279 387575 384921 383720
60709 383720 383897 384886 385617 385196 383895 382916 382934 383468 383932 384535 385743 387451 389301 391290 393538 395815 397787
60692 397787 399406 400718 401607 402037 402182 402061 401449 400395 399297 398197 396580 394237 391731 389582 387544
60677 387544 385214 382830 380872 379256 377524 375591 373839 372609 371942 371621 371219 370374 369214 368198 367465
60662 367465 366796 366329 366663 367969 369614 370982 372109 373126 373784 374043 374532 375826 377651 379318 380562 381573
60646 381573 382610 383974 385915 388189 390204 391869 393623 395265 395546 393634 390307 386978 384170 381677
60632 381677 379577 378101 376870 375289 373573 372518 372386 372712 373172 373924 375080 376423 377687 378758 379665
$$ packed form
60737E19269o670q011q439q468q654q866q791q386p640o585n625n201n091m679
60723D18163l868l095k518j920j356j176j426j872k477l285l891l704k654j201
60709C83720J77R89P31m21j301r79J8N34M64O03J208J708J850J989K248K277J972
60692C97787J619J312Q89M30J45j21o12j054j098j100j617k343k506k149k038
60677C87544k330k384j958j616j732j933j752j230o67l21m02q45j160j016p33
60662C67465o69m67L34J306J645J368J127J017O58K59M89J294J825J667J244J011
60646C81573J037J364J941K274K015J665J754J642K81j912l327l329k808k493
60632C81677k100j476j231j581j716j055j32L26M60P52J156J343J264J071R07
$$ plain form
60617 379665 380702 382295 384361 386114 386913 386963 386736 386132 384805 382891 380737 378263 375298 372307 369973
60602 369973 368228 366412 364278 362142 360123 357945 355509 353047 350702 348535 346894 346147 345979 345573 344649
60587 344649 343836 343864 344774 346057 347276 348393 349710 351478 353498 355275 356737 358490 361081 364381 368079
60572 368079 372331 377320 382496 386934 390277 392608 393585 392566 389710 386200 383057 380263 377317 374168
60558 374168 371221 368754 366722 365068 363959 363673 364256 365389 366695 368209 370276 372903 375517 377521 378807
60543 378807 379505 379599 379123 378314 377186 375278 372354 369079 366456 364761 363504 362271 361025 359678 358003
60528 358003 356092 354471 353664 353889 355097 356895 358527 359392 359680 360131 361086 362122 362672 362675 362479 362375 362464 362849
60510 362849 363718 365091 366553 367424 367406 366879 366336 365758 364937 364206 364164 364709 365065 364970 365023 365630 366426 367189 368461
$$ packed form
60617C79665J037J593K066J753P99N0k27o04j327j914k154k474k965k991k334
60602C69973j745j816k134k136k019k178k436k462k345k167j641p47j68m06r24
60587C44649q13K8R10J283J219J117J317J768K020J777J462J753K591L300L698
60572C68079M252M989N176M438L343K331R77j019k856l510l143k794k946l149
60558C74168k947k467k032j654j109k86N83J133J306J514K067K627K614K004J286
60543C78807O98R4m76q09j128j908k924l275k623j695j257j233j246j347j675
60528C58003j911j621q07K25J208J798J632Q65K88M51R55J036N50Lj96j04Q9L85
60510C62849Q69J373J462Q71j8n27n43n78q21p31m2N45L56r5N3O07P96P63J272
$$ plain form
60491 368461 370611 373056 375251 377787 381556 386239 390632 394199 397358 400351 402800 404461 405633 406714
60477 406714 407900 409333 410966 412297 412860 412991 413638 415404 418189 421645 425486 429497 433796 438930 445159
60462 445159 451888 458440 465143 472796 481178 489047 495713 501676 507412 512394 515836 517790 518901 519433
60448 519433 519056 517498 515098 512689 511047 510414 510650 511895 514766 519604 525856 532755 540437 549826 561459
60433 561459 575072 590388 607691 627340 649186 672696 697271 722115 745974 767260 784484
60422 784484 796653 803454 805068 801771 793896 782259 768191 752879 737030 721519 707849 697224
60410 697224 689340 682794 676666 671204 667080 664642 663958 665003 667707 672205 679108 689066 702138 718044
60396 718044 737082 760164 787853 819771 855151 893530 934741 978487 1024005 1069894 1114276
$$ packed form
60491C68461K150K445K195K536L769M683M393L567L159K993K449J661J172J081
60477D06714J186J433J633J331N63J31O47J766K785L456L841M011M299N134O229
60462D45159O729O552O703P653Q382P869O666N963N736M982L442J954J111N32
60448E19433l77j558k400k409j642o33K36J245K871M838O252O899P682R389J1633
60433E61459J3613J5316J7303J9649K1846K3510K4575K4844K3859K1286J7224
60422G84484J2169O801J614l297p875j1637j4068j5312j5849j5511j3670j0625
60410F97224p884o546o128n462m124k438o84J045K704M498O903R958J3072J5906
60396G18044J9038K3082K7689L1918L5380L8379M1211M3746M5518M5889M4382
$$ plain form
60385 1114276 1155440 1192470 1225153 1253447 1277262 1296532 1311090 1320464 1323933 1320589 1309223 1288599
60373 1288599 1258292 1219075 1172334 1119644 1063273 1006269 951089 898438 848188 800987 758059
60362 758059 719737 685365 654615 627830 604959 585148 567666 552412 539235 527471 516520
60351 516520 506278 496803 488138 480647 474811 470386 466325 461898 457443 453818 451444 450012 448748 446903
60337 446903 444408 441999 440225 438550 436118 433288 431421 431068 431319 431286 431255 431795 432519 432554 431824 431227 431661
60320 431661 433296 435613 437804 439257 439861 439858 439469 438946 438844 439714 441440 443361 445093 446783 448433 449539
60304 449539 449671 449005 448144 447737 448376 450368 453395 456708 459823 462781 465783 468950 472417 476167 479784
60289 479784 482854 485677 489060 493277 497682 501410 504066 505772 507038 508623 510998 513916 516940 520182
$$ packed form
60385A114276M1164L7030L2683K8294K3815J9270J4558R374L469l344j1366k0624
60373A288599l0307l9217m6741n2690n6371n7004n5180n2651n0250m7201m2928
60362G58059l8322l4372l0750k6785k2871j9811j7482j5254j3177j1764j0951
60351E16520j0242r475q665p491n836m425m061m427m455l625k374j432j264j845
60337D46903k495k409j774j675k432k830j867l53K51l3l1N40P24L5p30n97M34
60320D31661J635K317K191J453O04ll89n23j02Q70J726J921J732J690J650J106
60304D49539J32o66q61m07O39J992L027L313L115K958L002L167L467L750L617
60289D79784L070K823L383M217M405L728K656J706J266J585K375K918L024L242
$$ plain form
60275 520182 523883 527453 529884 531195 532621 535105 538382 541760 545031 548206 551077 553532 555808 558041
60261 558041 559962 561326 562269 563112 564248 566325 569981 575193 581405 588392 596422 605520 615247 625307
60247 625307 635660 645812 654774 662004 667670 671735 673516 672539 669178 664048 657403 649517 641013 632395
60233 632395 623742 615187 607147 599743 592619 585689 579520 574580 570544 566683 562526 558024 553630 550269
60219 550269 548552 547911 547309 546878 547885 550867 554918 559263 564460 571361 579889 589514 599952 610572
60205 610572 619952 627020 632053 635791 638255 639213 639097 638532 637615 636559 636397 637872 640016 640864 639336 635553
60189 635553 629749 621992 612801 602941 592548 581317 569572 558333 548266 539248 531056 523836 517751
60176 517751 512703 508494 504906 501605 498327 495055 491776 488303 484712 481608 479523 478276 477390 476766 476454
$$ packed form
60275E20182L701L570K431J311J426K484L277L378L271L175K871K455K276K233
60261E58041J921J364R43Q43J136K077L656N212O212O987Q030R098R727J0060
60247F25307J0353J0152Q962P230N666M065J781r77l361n130o645p886q504q618
60233F32395q653q555q040p404p124o930o169m940m036l861m157m502m394l361
60219E50269j717o41o02m31J007K982M051M345N197O901Q528R625J0438J0620
60205F10572R380P068N033L738K464R58j16n65r17j056j62J475K144Q48j528l783
60189F35553n804p757r191r860j0393j1231j1745j1239j0067r018q192p220o085
60176E17751n048m209l588l301l278l272l279l473l591l104k085j247q86o24l12
$$ plain form
60161 476454 476102 475254 473984 472722 471772 471451 472270 474281 476555 478113 479104 480318 481827 483008 483756 484637
60145 484637 485750 486353 485951 484992 484187 483746 483616 483830 484209 484213 483662 483311 484176 486379 489071 491489 493695 496111
60127 496111 498712 501160 503668 507134 512100 518015 524012 530108 536955 544592 552272 559566 566798 574157
60113 574157 581246 587945 594900 602583 610529 618088 625312 632429 639010 644462 649017 653442 657976 662157
60099 662157 665462 667575 668288 667756 666662 665590 664432 662822 660791 658428 655353 651291 646872 643027 639763
60084 639763 636316 632463 628894 626252 624552 623682 623781 624770 625976 626618 626503 626087 625988 626424 627031 627296 627165
60067 627165 626937 626412 624658 621079 616419 612212 609384 607823 607021 606615 606346 606012 605599 605279 605340 606155 607964
60050 607964 610478 613033 615335 617666 620148 622325 623905 625448 627793 631141 635107 639251 643114 646240
$$ packed form
60161D76454l52q48j270j262r50l21Q19K011K274J558R91J214J509J181P48Q81
60145D84637J113O03m02r59q05m41j30K14L79Mn51l51Q65K203K692K418K206K416
60127D96111K601K448K508L466M966N915N997O096O847P637P680P294P232P359
60113E74157P089O699O955P683P946P559P224P117O581N452M555M425M534M181
60099F62157L305K113P13n32j094j072j158j610k031k363l075m062m419l845l264
60084F39763l447l853l569k642j700q70R9R89J206O42j15m16r9M36O07K65j31
60067F27165k28n25j754l579m660m207k828j561q02m06k69l34m13l20O1Q15J809
60050F07964K514K555K302K331K482K177J580J543K345L348L966M144L863L126
$$ plain form
60036 646240 648835 651991 656595 662337 668402 674736 681778 689191 695771 700632 703756 705375 705554 704507
60022 704507 702750 700677 698363 695866 693349 690873 688394 686030 684056 682627 681670 681021 680528 680119 679876
60007 679876 679846 679794 679502 679310 679851 681143 682535 683731 685130 686901 688613 690266 692814 696882 701694 706073
59991 706073 709845 713370 716279 717759 717786 717082 716057 714581 712557 709897 706193 701218 695603 690319 685718
59976 685718 681624 677906 674184 669436 662887 655021 646867 638636 629902 620755 611754 603108 594921 587917
59962 587917 582714 578612 574354 569974 566603 564470 562495 560094 557982 556743 555845 554716 553817 553883 554843
59947 554843 556122 557514 559190 561214 563469 565753 567741 569186 570236 571162 571748 571444 570130 568219 565987
59932 565987 563350 560354 557331 554565 552232 550573 549529 548309 545893 541977 536944 531173 525015 519139
$$ packed form
60036F46240K595L156M604N742O065O334P042P413O580M861L124J619J79j047
60022G04507j757k073k314k497k517k476k479k364j974j429r57o49m93m09k43
60007F79876l0n2k92j92N41J292J392J196J399J771J712J653K548M068M812M379
59991G06073L772L525K909J480K7p04j025j476k024k660l704m975n615n284m601
59976F85718m094l718l722m748o549p866q154q231q734r147r001q646q187p004
59962E87917n203m102m258m380l371k133j975k401k112j239q98j129q99O6R60
59947E54843J279J392J676K024K255K284J988J445J050R26N86l04j314j911k232
59932E65987k637k996l023k766k333j659j044j220k416l916n033n771o158n876
$$ plain form
59918 519139 514088 509586 505039 500486 496278 492176 487843 484008 481860 481277 480889 480018 479288 479059 478613 477487
59902 477487 476394 476014 475800 474879 473486 472659 472940 474065 475627 477446 479438 481476 483296 484468 484750 484551
59886 484551 484663 485517 487026 489070 491559 494095 496141 497596 498688 499403 499652 499773 500078 500046 498900 496976
59870 496976 495480 494863 494508 494172 494574 496137 498257 500373 502798 505905 509409 513180 517934 524183 530997
59855 530997 536558 539679 540312 539033 536657 534075 531849 529950 528111 526164 523892 520934 517185 513143
59841 513143 509645 507351 506365 506088 505559 504403 503353 503477 505094 507903 511793 516719 522069 527133 532137
59826 532137 537858 544171 549948 554492 558092 561030 563053 564146 564832 565367 565444 565053 564874 565545 567315 570581
59810 570581 575781 582500 589607 596609 603905 611383 617884 622593 625965 628644 630360 630559 629286 626751
$$ packed form
59918E19139n051m502m547m553m208m102m333l835k148n83l88q71p30k29m46j126
59902D77487j093l80k14r21j393q27K81J125J562J819J992K038J820J172K82j99
59886D84551J12Q54J509K044K489K536K046J455J092P15K49J21L05l2j146j924
59870D96976j496o17l55l36M02J563K120K116K425L107L504L771M754O249O814
59855E30997N561L121O33j279k376k582k226j899j839j947k272k958l749m042
59841E13143l498k294r86k77n29j156j050J24J617K809L890M926N350N064N004
59826E32137N721O313N777M544L600K938K023J093O86N35P7l91j79O71J770L266
59810E70581N200O719P107P002P296P478O501M709L372K679J716J99j273k535
$$ plain form
59796 626751 622757 617297 611124 605176 599977 595984 593718 592987 592702 592144 591823 592633 594819 598240 602841
59781 602841 608221 613479 618225 623147 628926 635179 641107 646620 652077 657420 662344 666957 671540 675891
59767 675891 679526 682337 684525 686034 686428 685331 682850 679737 677047 675258 673761 671676 669013 666471
59753 666471 664324 662330 660597 659562 659163 659098 659921 662676 667406 673346 680745 690889 703718 716896
59739 716896 728069 736785 743528 748278 751109 753048 755129 757436 759955 763318 767607 771245 772220 769807
59725 769807 764298 756046 745776 734925 724341 713302 700948 688089 676464 666765 658565 651690
59713 651690 646384 642351 638703 634837 630663 626252 621940 618427 616130 614702 613694 613125 612980 612895 612941 613897
59697 613897 615981 618075 619001 618816 618119 616968 615346 613824 612749 611541 609756 607996 606745 605208 602502
$$ packed form
59796F26751l994n460o173n948n199l993k266p31k85n58l21Q10K186L421M601
59781F02841N380N258M746M922N779O253N928N513N457N343M924M613M583M351
59767F75891L635K811K188J509L94j097k481l113k690j789j497k085k663k542
59753F66471k147j994j733j035l99o5Q23K755M730N940P399J0144J2829J3178
59739G16896J1173Q716O743M750K831J939K081K307K519L363M289L638R75k413
59725G69807n509q252j0270j0851j0584j1039j2354j2859j1625r699q200o875
59713F51690n306m033l648l866m174m411m312l513k297j428j008n69j45q5M6R56
59697F13897K084K094R26j85o97j151j622j522j075j208j785j760j251j537k706
$$ plain form
59682 602502 599162 596246 593675 590786 587802 585375 583298 581040 579037 578076 577902 577815 578187 579914 582720
59667 582720 585490 588014 591052 594912 599324 604464 610764 617856 625053 632682 641609 651599 661554 671274
59653 671274 681587 692718 703832 714328 724406 734327 744118 753953 763676 772207 778638 783809 789519
59640 789519 796255 802998 809080 814701 819574 822654 823636 823418 822753 821607 820111 818880 818015 816862 815074
59625 815074 812956 810564 807522 803988 800711 797947 795286 792694 790548 788544 785820 782474 779762 778443
59611 778443 778068 778288 779672 782721 787107 792405 798601 805456 812291 818891 825757 833184 840986 849374 858871
59596 858871 868914 877820 884862 891303 898558 906266 913060 918377 922505 925414 926620 926034 924261 922105
59582 922105 920128 918428 916515 913598 909148 902909 894498 883695 871264 858879 847932 838805 831239
$$ packed form
59682F02502l340k916k571k889k984k427k077k258k003r61j74q7L72J727K806
59667E82720K770K524L038L860M412N140O300P092P197P629Q927R990R955R720
59653F71274J0313J1131J1114J0496J0078R921R791R835R723Q531O431N171N710
59640G89519O736O743O082N621M873L080R82k18o65j146j496j231q65j153j788
59625H15074k118k392l042l534l277k764k661k592k146k004k724l346k712j319
59611G78443l75K20J384L049M386N298O196O855O835O600O866P427P802Q388R497
59596H58871J0043Q906P042O441P255P708O794N317M128K909J206n86j773k156
59582I22105j977j700j913k917m450o239q411j0803j2431j2385j0947r127p566
$$ plain form
59569 831239 824699 818370 811661 805005 799469 795417 792328 790062 789353 790702 793651 797621 802650 808786
59555 808786 815508 822270 829017 835563 841099 844906 847115 848147 847757 845144 839801 831865 821814 810113
59541 810113 797008 782565 767115 751630 737234 724305 712544 701913 692973 686100 680826 676086
59529 676086 670732 663821 655026 645024 635047 625846 617245 608630 599556 590088 580968 573206 566986 561262
59515 561262 555008 548489 542600 537366 532117 526913 522751 520370 519756 520652 522489 523984 524004 523031 522689 523696
59499 523696 525336 526951 528671 530452 531715 532477 533697 535915 538433 540338 541483 542061 542205 542372 543158
59484 543158 544200 544314 543220 542140 542054 542319 541782 540355 538704 537087 535349 533516 531636 529504 527146
59469 527146 525115 523799 522866 521858 520803 519872 519008 518316 518238 518846 519539 519871 520089 520467 520730 520718 521008 522256
$$ packed form
59569H31239o540o329o709o656n536m052l089k266p09J349K949L970N029O136
59555H08786O722O762O747O546N536L807K209J032l90k613n343p936j0051j1701
59541H10113j3105j4443j5450j5485j4396j2929j1761j0631q940o873n274m740
59529F76086n354o911q795j0002r977r201q601q615r074r468r120p762o220n724
59515E61262o254o519n889n234n249n204m162k381o14Q96J837J495K0r73l42J007
59499E23696J640J615J720J781J263P62J220K218K518J905J145N78J44J67P86
59484E43158J042J14j094j080q6K65n37j427j651j617j738j833j880k132k358
59469E27146k031j316r33j008j055r31q64o92p8O08O93L32K18L78K63j2K90J248
$$ plain form
59451 522256 524302 526413 528112 529402 530558 531986 533974 536405 539119 542549 547455 554092 562405 573023
59437 573023 587049 604671 624845 646369 667982 687075 699944 704572 702539 697426 692008 687501
59425 687501 684359 682500 681183 679715 678160 676806 675416 673569 671215 668159 663494 656459 647608 638409
59411 638409 629809 621743 613877 606228 599071 592645 587035 582195 578126 574904 572316 569609 566187 562534
59397 562534 559879 558956 559604 561436 564101 566925 569241 571215 573512 576028 577939 579130 580553 582859 585737
59382 585737 588851 592300 595707 598037 598950 599332 599913 600425 600693 601468 603325 605708 607869 609828 611600 612405
59366 612405 611681 610167 609075 608818 609328 610904 613846 617842 622537 628141 634803 642043 649553 657812 667075
59351 667075 676431 684687 691648 697681 702626 705994 707773 708308 707809 706497 704663 702056 698039 692922 688242
$$ packed form
59451E22256K046K111J699J290J156J428J988K431K714L430M906O637Q313J0618
59437E73023J4026J7622K0174K1524K1613J9093J2869M628k033n113n418m507
59425F87501l142j859j317j468j555j354j390j847k354l056m665p035q851r199
59411F38409q600q066p866p649p157o426n610m840m069l222k588k707l422l653
59397E62534k655r23O48J832K665K824K316J974K297K516J911J191J423K306K878
59382E85737L114L449L407K330R13L82N81N12K68P75J857K383K161J959J772Q05
59366F12405p24j514j092k57N10J576K942L996M695N604O662P240P510Q259R263
59351F67075R356Q256O961O033M945L368J779N35m99j312j834k607m017n117m680
$$ plain form
59336 688242 684996 682502 679845 677403 675950 675261 674846 675253 677321 680786 684915 689963 696718 705096 714432
59321 714432 724757 736520 749457 763037 777715 794406 812917 832210 852098 873342 895996
59310 895996 918708 939645 957020 968770 973079 969841 960999 949350 937526 927786 921594 919088 919630
59297 919630 922807 927944 932590 932669 924960 909246 888008 864552 841503 820323 801517 785078 770791
59284 770791 758327 747481 738461 731587 726570 722616 719466 717656 717403 717911 718306 718589 719122 719874 720848
59269 720848 722542 725154 727951 730303 732850 736759 742303 748955 756373 764391 772513 780459 788820 798270
59255 798270 808409 818344 828062 838322 849516 861591 874783 889400 905080 921166 937581 954418
59243 954418 970901 985792 998609 1009417 1017548 1021667 1021270 1017262 1010884 1002822 993350 982522 970042
$$ packed form
59336F88242l246k494k657k442j453o89m15M07K068L465M129N048O755Q378R336
59321G14432J0325J1763J2937J3580J4678J6691J8511J9293J9888K1244K2654
59310H95996K2712K0937J7375J1750M309l238q842j1649j1824r740o192k506N42
59297I19630L177N137M646P9p709j5714k1238k3456k3049k1180j8806j6439j4287
59284G70791j2464j0846r020o874n017l954l150j810k53N08L95K83N33P52R74
59269G20848J694K612K797K352K547L909N544O652P418Q018Q122P946Q361R450
59255G98270J0139R935R718J0260J1194J2075J3192J4617J5680J6086J6415J6837
59243I54418J6483J4891J2817J0808Q131M119l97m008o378q062r472j0828j2480
$$ plain form
59230 970042 955576 939372 922210 904837 887770 871346 855426 839454 823372 808077 794312
59219 794312 781615 769107 756878 745638 735434 725637 715942 706471 697182 688160 680228 674257 670016
59206 670016 666584 663635 661409 659776 658506 658289 660213 664170 668966 674222 681129 691015 704030 719475
59192 719475 736447 753629 769053 780591 786619 786391 780396 770474 759111 748407 739685 733606 730146
59179 730146 728800 729376 732329 737894 745436 754266 764528 776446 789242 801755 813848 826231 839209
59166 839209 852417 865491 878033 889206 898349 905789 912168 917177 919872 919974 917926 913955 908120
59153 908120 901060 893637 885944 877607 868839 860174 851464 842306 833339 825871 820158 815159 810042 804840
59139 804840 799575 793954 788150 782884 778398 774143 769666 764947 759786 753747 746973 740276 734165 728333
$$ packed form
59230I70042j4466j6204j7162j7373j7067j6424j5920j5972j6082j5295j3765
59219G94312j2697j2508j2229j1240j0204r797r695r471r289r022p932n971m241
59206F70016l432k949k226j633j270k17J924L957M796N256O907R886J3015J5445
59192G19475J6972J7182J5424J1538O028k28n995r922j1363j0704q722o079l460
59179G30146j346N76K953N565P542Q830J0262J1918J2796J2513J2093J2383J2978
59166H39209J3208J3074J2542J1173R143P440O379N009K695J02k048l971n835
59153I08120p060p423p693q337q768q665q710r158q967p468n713m999n117n202
59139H04840n265n621n804n266m486m255m477m719n161o039o774o697o111n832
$$ plain form
59125 728333 722246 715641 708446 700791 693092 685693 678632 672182 667132 663856 661591 659434 657490 656130
59111 656130 654791 652752 650571 649357 648877 647852 646043 644577 644078 643783 642690 640512 637378 633693 630448
59096 630448 628592 627911 627438 626956 627165 628431 630459 633150 636660 640576 644085 646980 649454 651124 651461
59081 651461 651143 651608 653110 654424 654575 653678 652066 649878 647692 646275 645482 644531 643522 643415 644289 644924
59065 644924 644473 643409 642487 641816 641179 640326 638776 636349 633799 631797 629436 625116 618926 612586 606962
59050 606962 601331 595354 589956 585540 580952 575155 568698 562687 557376 552477 547887 543482 539070 535003
59036 535003 531877 529317 526211 522522 519625 518409 518281 518560 519540 521482 523864 526414 529798 534415 539523
59021 539523 544409 549604 556112 564175 573450 583773 595100 607225 619935 632925 645442 656846
$$ packed form
59125G28333o087o605p195p655p699p399p061o450n050l276k265k157j944j360
59111F56130j339k039k181j214m80j025j809j466m99k95j093k178l134l685l245
59096F30448j856o81m73m82K09J266K028K691L510L916L509K895K474J670L37
59081F51461l18M65J502J314J51q97j612k188k186j417p93r51j009j07Q74O35
59065F44924m51j064r22o71o37q53j550k427k550k002k361m320o190o340n624
59050F06962n631n977n398m416m588n797o457o011n311m899m590m405m412m067
59036E35003l126k560l106l689k897j216j28K79R80J942K382K550L384M617N108
59021E39523M886N195O508Q063R275J0323J1327J2125J2710J2990J2517J1404
$$ plain form
59009 656846 667596 678728 690202 700813 709902 717960 725288 731289 735474 737981 738671 736900 732637
58996 732637 726718 719653 711388 702553 694552 687935 681932 676063 670890 666706 662895 659204 656256 654122
58982 654122 651741 648439 644718 640871 636283 630929 626078 622513 619351 615615 611774 608665 606071 603421
58968 603421 600808 598301 595297 591566 587972 585164 582582 579655 576872 574618 572036 568234 563768 559784
58954 559784 556447 553241 550115 547379 545121 543471 542736 542579 541976 540674 539736 539913 540580 541114 542108 544158
58938 544158 546498 547987 548565 548710 548412 547845 548182 550447 554145 558177 562554 568250 575852 585213 595990
58923 595990 607788 620238 633404 647394 661172 672772 681253 687421 692069 694743 694908 692972 689243
58910 689243 683260 675342 667519 661599 657305 653502 650219 648186 647371 647376 648455 650800 653551 655864 658263
$$ packed form
59009F56846J0750J1132J1474J0611R089Q058P328O001M185K507O90j771m263
58996G32637n919p065q265q835q001o617o003n869n173m184l811l691k948k134
58982F54122k381l302l721l847m588n354m851l565l162l736l841l109k594k650
58968F03421k613k507l004l731l594k808k582k927k783k254k582l802m466l984
58954E59784l337l206l126k736k258j650p35j57o03j302r38J77O67N34R94K050
58938E44158K340J489N78J45k98n67L37K265L698M032M377N696P602R361J0777
58923E95990J1798J2450J3166J3990J3778J1600Q481O168M648K674J65j936l729
58910F89243n983p918p823n920m294l803l283k033q15NJ079K345K751K313K399
$$ plain form
58895 658263 661680 665760 669324 671970 674079 675801 677111 678368 679810 680985 681533 681905 682599 683447 684458
58880 684458 686499 690300 695658 702375 710894 721083 731591 741591 752101 764362 777923 791569
58868 791569 805132 819022 832890 846095 858723 870897 881896 891161 899298 906875 913187 917445
58856 917445 920100 921598 920850 916548 909089 899586 887902 873414 856951 840138 823315 805861 788170
58843 788170 771669 757124 744432 733785 725588 719479 714680 711046 708642 706846 705059 703797 703813 704726
58829 704726 705719 706879 708469 709593 709116 707379 705487 703397 700245 696199 692466 689650 687358 685131 682680
58814 682680 679707 676621 674887 675473 677565 679934 682686 686417 690702 695056 700501 708367 718280 729113
58800 729113 741183 755552 771678 787848 803620 819906 836827 853455 869643 886316 903849
$$ packed form
58895F58263L417M080L564K646K109J722J310J257J442J175N48L72O94Q48J011
58880F84458K041L801N358O717Q519J0189J0508J0000J0510J2261J3561J3646
58868G91569J3563J3890J3868J3205J2628J2174J0999R265Q137P577O312M258
58856I17445K655J498p48m302p459r503j1684j4488j6463j6813j6823j7454j7691
58843G88170j6501j4545j2692j0647q197o109m799l634k404j796j787j262J6R13
58829G04726R93J160J590J124m77j737j892k090l152m046l733k816k292k227k451
58814F82680k973l086j734N86K092K369K752L731M285M354N445P866R913J0833
58800G29113J2070J4369J6126J6170J5772J6286J6921J6628J6188J6673J7533
$$ plain form
58789 903849 921726 939808 958418 977219 995430 1013042 1030393 1046715 1060532 1071342 1079547 1085030
58777 1085030 1087322 1086973 1085169 1082055 1076861 1069553 1061006 1051795 1042168 1032983 1025220 1018733 1012681 1006828
58763 1006828 1001207 995127 987978 980424 973268 965798 956900 947080 937467 927511 915841 903002 891092
58750 891092 880802 870893 860489 849749 838286 825133 810543 795861 781415 766371 750867 736322
58738 736322 723313 711005 699052 688307 679272 671474 664706 659292 654888 650623 646691 644285 643770
58725 643770 644430 646059 649103 653101 656743 659764 663127 667109 670844 673929 676842 679543 681376 682603
58711 682603 684286 686347 687424 686970 685778 684158 681364 677299 673052 669182 665012 660135 655094 650074
58697 650074 644410 637938 631451 625379 619328 613330 608240 604565 602113 600967 601497 603311 605526 608104
$$ packed form
58789I03849J7877J8082J8610J8801J8211J7612J7351J6322J3817J0810Q205N483
58777A085030K292l49j804l114n194p308q547r211r627r185p763o487o052n853
58763A006828n621o080p149p554p156p470q898r820r613r956j1670j2839j1910
58750H91092j0290r909j0404j0740j1463j3153j4590j4682j4446j5044j5504j4545
58738G36322j3009j2308j1953j0745r035p798o768n414m404m265l932k406n15
58725F43770O60J629L044L998L642L021L363L982L735L085K913K701J833J227
58711F82603J683K061J077m54j192j620k794m065m247l870m170m877n041n020
58697F50074n664o472o487o072o051n998n090l675k452j146N30J814K215K578
$$ plain form
58683 608104 611565 615538 619269 623468 629726 637993 646528 654588 663229 673033 682902 691630 698912 704156
58669 704156 705985 703665 697831 689425 679197 668352 658112 648381 638244 627880 618467 610293 602775
58656 602775 596301 592007 589550 587114 583940 580841 577975 574316 569848 566154 564160 563242 563088 564392 567043
58641 567043 569774 572426 576553 582819 589696 595765 601521 607942 614946 622256 630240 638837 647004 654050
58627 654050 660262 665694 669809 672822 675818 679006 681423 682845 684257 686011 687396 688608 691198 695721
58613 695721 700733 704894 708356 711364 713279 713808 713526 712372 709193 703459 695823 686405 674289 659312
58599 659312 642671 625212 606909 588440 571254 555558 540326 525775 513560 503866 494798 485518
58587 485518 477490 471533 466153 460160 454600 450552 447150 443429 440224 438619 438179 438161 438872 440515 442306
$$ packed form
58683F08104L461L973L731M199O258Q267Q535Q060Q641R804R869Q728P282N244
58669G04156J829k320n834q406j0228j0845j0240r731j0137j0364r413q174p518
58656F02775o474m294k457k436l174l099k866l659m468l694j994r18j54J304K651
58641E67043K731K652M127O266O877O069N756O421P004P310P984Q597Q167P046
58627F54050O212N432M115L013K996L188K417J422J412J754J385J212K590M523
58613F95721N012M161L462L008J915N29k82j154l179n734p636r418j2116j4977
58599F59312j6641j7459j8303j8469j7186j5696j5232j4551j2215r694r068r280
58587D85518q028n957n380n993n560m048l402l721l205j605m40j8P11J643J791
$$ plain form
58572 442306 443944 446336 449838 453559 457430 462974 470910 480058 489822 501521 515688 530087 542115
58559 542115 551389 558376 562344 562449 559280 553713 545731 535690 525111 514834 504077 492717 482650
58546 482650 475363 469960 465108 461119 458452 456055 453003 450187 448634 447729 446716 446221 446513 446006 443417
58531 443417 439944 437433 435818 434179 432891 432748 433182 433222 433151 433567 433952 433729 433592 434291 435319 436230 437971
58514 437971 441441 445923 450300 454536 458714 462091 464390 466551 468954 470471 470585 470657 471720 472796 472932
58499 472932 473067 474284 475933 477171 478595 480678 482346 482900 483714 486284 490203 494731 500606 508555 517790
58484 517790 527703 539313 553153 567504 580567 592682 604612 615500 624483 632460 640281 646978
58472 646978 651841 656385 662249 668962 675972 684915 697513 712960 729707 748143 769191 791852 814511
$$ packed form
58572D42306J638K392L502L721L871N544P936R148R764J1699J4167J4399J2028
58559E42115R274O987L968J05l169n567p982j0041j0579j0277j0757j1360j0067
58546D82650p287n403m852l989k667k397l052k816j553r05j013m95K92n07k589
58531D43417l473k511j615j639j288j43M34M0p1M16L85k23j37O99J028R11J741
58514D37971L470M482M377M236M178L377K299K161K403J517J14P2J063J076J36
58499D72932J35J217J649J238J424K083J668N54Q14K570L919M528N875P949R235
58484E17790R913J1610J3840J4351J3063J2115J1930J0888Q983P977P821O697
58472F46978M863M544N864O713P010Q943J2598J5447J6747J8436K1048K2661K2659
$$ plain form
58459 814511 837019 859179 878774 893525 903630 910257 913152 911957 908134 903274 897144 889617 882572
58446 882572 877358 872242 864985 856136 847165 837186 824444 809409 793580 776765 758333 739542 721794
58433 721794 704160 685502 667457 652294 639401 626891 615150 605601 597487 589198 581528 576269
58421 576269 572728 568853 564729 561751 559393 556098 552389 549836 547795 544428 540167 537029 535172 533227
58407 533227 531293 530567 530679 530330 529835 530205 530553 529385 527606 527265 528138 528472 528272 528861 530100 531095 532798
58390 532798 536801 542284 547156 551495 556938 563564 570402 578146 588249 600143 612292 625081 639644
58377 639644 654818 668336 680006 690619 698843 702460 701726 698288 692043 682486 671928 663555 657185
58364 657185 650545 643821 639218 636920 635365 634820 636953 641457 646770 653398 662785 673624 683033 690683
$$ packed form
58459H14511K2508K2160J9595J4751J0105O627K895j195l823m860o130p527p045
58446H82572n214n116p257q849q971r979j2742j5035j5829j6815j8432j8791j7748
58433G21794j7634j8658j8045j5163j2893j2510j1741r549q114q289p670n259
58421E76269l541l875m124k978k358l295l709k553k041l367m261l138j857j945
58407E33227j934p26J12l49m95L70L48j168j779l41Q73L34k00N89J239R95J703
58390E32798M003N483M872M339N443O626O838P744J0103J1894J2149J2789J4563
58377F39644J5174J3518J1670J0613Q224L617p34l438o245r557j0558q373o370
58364F57185o640o724m603k298j555n45K133M504N313O628R387J0839R409P650
$$ plain form
58350 690683 697949 703809 705605 703239 698646 691815 681475 669167 658292 649450 640737 632243 625975
58337 625975 621652 616947 611841 608566 607297 606058 604849 605632 608201 610241 611679 614913 620554 626800
58323 626800 633010 639935 646439 650011 650628 650294 649011 645226 639879 635591 631970 626139 617975 610425 604570
58308 604570 598743 592602 587647 583576 578485 572891 569238 567448 565336 563288 563833 566594 568518 569248 571456
58293 571456 575610 579325 582187 586209 591123 594226 595432 597510 600842 602950 603752 606079 610323 613769
58279 613769 616022 619915 626108 631939 636573 642141 648806 653896 657055 661176 667118 672529 676924 682803
58265 682803 690621 697794 703816 711252 720580 729205 736608 745130 754511 761101 763765 765297 766875 766541
58251 766541 764314 763142 763505 762664 760583 760867 764446 768072 770524 774489 780826 786927 792380 800296 811358
$$ packed form
58350F90683P266N860J796k366m593o831j0340j2308j0875q842q713q494o268
58337F25975m323m705n106l275j269j239j209P83K569K040J438L234N641O246
58323F26800O210O925O504L572O17l34j283l785n347m288l621n831q164p550n855
58308F04570n827o141m955m071n091n594l653j790k112k048N45K761J924P30K208
58293E71456M154L715K862M022M914L103J206K078L332K108Q02K327M244L446
58279F13769K253L893O193N831M634N568O665N090L159M121N942N411M395N879
58265F82803P818P173O022P436R328Q625P403Q522R381O590K664J532J578l34
58251G66541k227j172L63q41k081K84L579L626K452L965O337O101N453P916J1062
$$ plain form
58236 811358 822395 832472 844322 858178 870433 880076 890117 900951 908885 913169 917769 924047
58224 924047 928410 929470 930733 933784 935643 935475 937065 941878 946416 949178 953447 960390 966373 970139
58210 970139 975721 985141 995108 1003964 1014809 1028484 1040626 1049218 1058185 1070106 1082210 1092866 1104923
58197 1104923 1119303 1132354 1142860 1154471 1168149 1179816 1188673 1199882 1215480 1230776 1243376
58186 1243376 1257459 1275203 1292553 1307647 1324914 1346433 1367795 1386874 1407954 1432752 1456509
58175 1456509 1477723 1502358 1533277 1564883 1593604 1624142 1659733 1695958 1730210 1767616 1811260
58164 1811260 1856067 1898599 1943206 1992146 2039625 2082295 2125635 2173215 2219921 2262648 2307075
58153 2307075 2356710 2406086 2452229 2501743 2558771 2617272 2673215 2732824 2800489 2870492 2939322
$$ packed form
58236H11358J1037J0077J1850J3856J2255R643J0041J0834P934M284M600O278
58224I24047M363J060J263L051J859j68J590M813M538K762M269O943N983L766
58210I70139N582R420R967Q856J0845J3675J2142Q592Q967J1921J2104J0656J2057
58197A104923J4380J3051J0506J1611J3678J1667Q857J1209J5598J5296J2600
58186A243376J4083J7744J7350J5094J7267K1519K1362J9079K1080K4798K3757
58175A456509K1214K4635L0919L1606K8721L0538L5591L6225L4252L7406M3644
58164A811260M4807M2532M4607M8940M7479M2670M3340M7580M6706M2727M4427
58153B307075M9635M9376M6143M9514N7028N8501N5943N9609O7665P0003O8830
$$ plain form
58142 2939322 3013910 3098627 3186659 3273587 3366646 3470895 3579636 3688624 3805856 3936630
58132 3936630 4073244 4210739 4358033 4521667 4693920 4869595 5058713 5269196 5493194
58123 5493194 5724638 5973736 6249417 6544714 6854990 7192757 7568289 7974329 8406973
58114 8406973 8882001 9412674 9992554 10619584 11314826 12096818 12961601 13911189 14977040
58105 14977040 16191668 17565214 19118207 20909948 23006848 25455285 28317219 31694429
58097 31694429 35676706 40301885 45609356 51694179 58667198 66620733 75705143 86202585
58089 86202585 98481583 112972602 130279691 151160946 176084950 204631629 235283737
58082 235283737 265624246 292508624 312263437 321526906 318734016 305089037 283970121
$$ packed form
58142B939322P4588Q4717Q8032Q6928R3059J04249J08741J08988J17232J30774
58132C936630J36614J37495J47294J63634J72253J75675J89118K10483K23998
58123E493194K31444K49098K75681K95297L10276L37767L75532M06040M32644
58114H406973M75028N30673N79880O27030O95242P81992Q64783R49588J065851
58105A4977040J214628J373546J552993J791741K096900K448437K861934L377210
58097C1694429L982277M625179N307471O084823O973019P953535R084410J0497442
58089H6202585J2278998J4491019J7307089K0881255K4924004K8546679L0652108
58082B35283737L0340509K6884378J9754813R263469k792890j3644979k1118916
$$ plain form
58075 283970121 259206022 233656645 208881442 185511464 163691865 143419517 124788517
58068 124788517 108026527 93311520 80620276 69781972 60598800 52864071 46339619
58061 46339619 40801737 36093939 32097827 28685988 25742908 23200340 21011241 19111419
58053 19111419 17438442 15962906 14667817 13517411 12475016 11531281 10686289 9921281
58045 9921281 9213714 8563099 7976677 7444506 6951720 6500763 6098992 5737373 5402359
58036 5402359 5096274 4825974 4583284 4355688 4144835 3955916 3779851 3604355 3432727
58027 3432727 3274356 3126227 2980559 2841438 2717066 2603666 2492819 2386954 2292482 2205266
58017 2205266 2117718 2033192 1959029 1892127 1825183 1760617 1704686 1654035 1601421 1548998 1503084
$$ packed form
58075B83970121k4764099k5549377k4775203k3369978k1819599k0272348j8631000
58068A24788517j6761990j4715007j2691244j0838304r183172p734729o524452
58061D6339619n537882m707798l996112l411839k943080k542568k189099j899822
58053A9111419j672977j475536j295089j150406j042395r43735q44992p65008
58045I921281p07567o50615n86422n32171m92786m50957m01771l61619l35014
58036E402359l06085k70300k42690k27596k10853j88919j76065j75496j71628
58027C432727j58371j48129j45668j39121j24372j13400j10847j05865r4472q7216
58017B205266q7548q4526p4163o6902o6944o4566n5931n0651n2614n2423m5914
$$ plain form
58006 1503084 1461246 1417098 1372697 1334006 1298953 1261793 1224562 1192754 1164205 1133479 1102916
57995 1102916 1078326 1057789 1035389 1012091 992616 975434 956049 936434 921226 908154 892009
57984 892009 874618 861208 850253 836452 820671 807531 796013 781602 765071 750380 736502
57973 736502 719917 702561 688802 677129 663024 647508 634688 623494 610044 595707 584653
57962 584653 575760 565040 553844 546605 542410 536674 529300 523479 518321 510376 500794 493404 487263 478593
57948 478593 468568 461666 457586 452141 445108 439949 436673 431988 425835 421056 417236 411347 403790 397642
57934 397642 392692 386348 379528 375486 373577 370204 365156 361148 357900 352646 345813 340464 336774 332558
57920 332558 328380 326556 326006 323652 320015 317914 316685 313412 308876 306429 305722 303443 299612 297288 296525
$$ packed form
58006A503084m1838m4148m4401l8691l5053l7160l7231l1808k8549l0726l0563
57995A102916k4590k0537k2400k3298j9475j7182j9385j9615j5208j3072j6145
57984H92009j7391j3410j0955j3801j5781j3140j1518j4411j6531j4691j3878
57973G36502j6585j7356j3759j1673j4105j5516j2820j1194j3450j4337j1054
57962E84653q893j0720j1196p239m195n736p374n821n158p945r582p390o141q670
57948D78593j0025o902m080n445p033n159l276m685o153m779l820n889p557o148
57934C97642m950o344o820m042j909l373n048m008l248n254o833n349l690m216
57920C32558m178j824n50k354l637k101j229l273m536k447p07k279l831k324p63
$$ plain form
57905 296525 294498 291382 290322 291577 292202 291547 291788 293066 293318 292861 293966 295876 295413 292599 290713 290699
57889 290699 290442 289512 289614 290261 288969 285986 284058 283297 281023 276893 273531 271815 270055 267980 267009 266475
57873 266475 264197 260975 259989 261566 262975 263385 264351 265310 263610 259530 256446 255277 253326 249362 245401
57858 245401 242583 239681 236615 235219 235405 234549 231708 228820 226961 225044 222863 221691 221264 219789 217477
57843 217477 216437 216738 216394 215560 216685 220046 223245 225814 230082 236556 242535 246489 249959 253915 256956
57828 256956 258353 259326 260056 258794 255139 250992 247164 242280 235990 230005 224955 219418 213133 207991 204798
57813 204798 202082 199046 196614 194707 191679 187506 184471 183648 183544 183101 183070 183573 183254 181737 180118 178384
57797 178384 175270 171261 168638 167903 167319 166477 166916 168506 168869 167415 166443 167136 167959 168246 169744 173040
$$ packed form
57905B96525k027l116j060J255O25o55K41J278K52m57J105J910m63k814j886j4
57889B90699k57r30J02O47j292k983j928p61k274m130l362j716j760k075r71n34
57873B66475k278l222r86J577J409M10R66R59j700m080l084j169j951l964l961
57858B45401k818k902l066j396J86q56k841k888j859j917k181j172m27j475k312
57843B17477j040L01l44q34J125L361L199K569M268O474N979L954L470L956L041
57828B56956J397R73P30j262l655m147l828m884o290n985n050n537o285n142l193
57813B04798k716l036k432j907l028m173l035q23j04m43l1N03l19j517j619j734
57797A78384l114m009k623p35n84q42M39J590L63j454r72O93Q23K87J498L296
$$ plain form
57781 173040 175861 176743 177287 179030 181019 182233 183631 185978 188243 189800 191777 194694 197293 199157 201973
57766 201973 206564 211143 214074 216102 218387 220612 222486 224913 228312 231840 235357 239828 244796 247969
57752 247969 248549 248452 249040 249280 248460 247870 248087 247186 243591 238551 233994 230029 226180 223023 220856 218665
57736 218665 216011 214127 213761 213787 213388 213653 215556 218167 220278 222092 224094 226006 227981 230969 234851
57721 234851 238142 240472 243166 246458 248557 248776 249060 250905 253128 254255 254789 255356 254898 252690 250146
57706 250146 248550 246730 242813 236726 229314 220752 211552 203465 197501 192450 186899 181231 176227 171355
57692 171355 166071 161204 157461 154116 150677 148244 147542 147227 145863 144118 143334 143388 143636 144563 146700 149094
57676 149094 150579 151514 152770 154125 155059 155988 157257 158034 157525 156282 155088 153673 151616 149286 146848
$$ packed form
57781A73040K821Q82N44J743J989J214J398K347K265J557J977K917K599J864K816
57766B01973M591M579K931K028K285K225J874K427L399L528L517M471M968L173
57752B47969N80r7N88K40q20n90K17r01l595n040m557l965l849l157k167k191
57736B18665k654j884l66K6l99K65J903K611K111J814K002J912J975K988L882
57721B34851L291K330K694L292K099K19K84J845K223J127N34N67m58k208k544
57706B50146j596j820l917o087p412q562r200q087n964n051n551n668n004m872
57692A71355n284m867l743l345l439k433p02l15j364j745p84N4K48R27K137K394
57676A49094J485R35J256J355R34R29J269P77n09j243j194j415k057k330k438
$$ plain form
57661 146848 143722 140069 137307 135996 134692 132162 129173 126892 125139 123620 123253 124649 126680 128078
57647 128078 129198 130839 132758 134776 137882 142647 147837 152177 156242 161075 166199 170538 174195 177846
57633 177846 181395 184484 187211 189198 189295 187444 185382 184274 183161 181121 179214 178623 178458 177332 175717
57618 175717 174767 173935 171760 168220 164544 161446 159002 157449 156657 155640 153843 152015 150744 149314 147142
57603 147142 144971 143384 141625 139302 137686 137707 138180 137803 137485 138783 141326 143693 145680 147762 149438
57588 149438 150097 150545 151744 153008 153291 153293 154372 156319 158118 160035 162989 166767 170880 176414 184901 195922
57572 195922 207821 220372 235014 253007 275197 303137 338502 381460 430723 484393 539124
57561 539124 589184 628105 651127 655356 639286 604406 556391 502453 447622 394716 346388 304723
$$ packed form
57661A46848l126l653k762j311j304k530k989k281j753j519l67J396K031J398
57647A28078J120J641J919K018L106M765N190M340M065M833N124M339L657L651
57633A77846L549L089K727J987R7j851k062j108j113k040j907n91j65j126j615
57618A75717r50q32k175l540l676l098k444j553p92j017j797j828j271j430k172
57603A47142k171j587j759k323j616K1M73l77l18J298K543K367J987K082J676
57588A49438O59M48J199J264K83KJ079J947J799J917K954L778M113N534Q487J1021
57572A95922J1899J2551J4642J7993K2190K7940L5365M2958M9263N3670N4731
57561E39124N0060L8921K3022M229j6070l4880m8015n3938n4831n2906m8328m1665
$$ plain form
57549 304723 269464 238999 212861 191377 173548 157585 143267 131631 122555 114676 107479 101395
57537 101395 95999 90213 84280 79491 75890 72179 68060 64667 62463 60559 58472 56819 55836 54836
57523 54836 53574 52706 52411 51810 50138 47490 44254 40925 38423 37339 36766 35139 32287 29509 27557
57508 27557 25856 23899 22086 20871 20061 19322 18629 18027 17535 17201 16747 15617 13988 13106 13657 14503 14143
57491 14143 12739 11422 10273 8543 6393 4787 3831 2692 1035 -865 -3295 -6988 -11904 -17323 -22922
57476 -22922 -28547 -33277 -36218 -38092 -40573 -44039 -47319 -49566 -51033 -52046 -52652 -53337 -54779 -56761 -58516
57461 -58516 -60162 -62632 -66143 -69854 -73048 -75587 -77279 -77988 -78300 -79040 -80171 -81165 -82193 -83803 -85700
57446 -85700 -87015 -87594 -87839 -87652 -86809 -86037 -86240 -86820 -86228 -84118 -81621 -79650 -78312 -77853 -78619 -80020 -80964
$$ packed form
57549C04723l5259l0465k6138k1484j7829j5963j4318j1636r076p879p197o084
57537A01395n396n786n933m789l601l711m119l393k204j904k087j653r83j000
57523E4836j262q68k95o01j672k648l236l329k502j084n73j627k852k778j952
57508B7557j701j957j813j215q10p39o93o02m92l34m54j130j629q82N51Q46l60
57491A4143j404j317j149j730k150j606r56j139A035h65k430l693m916n419n599
57476b2922n625m730k941j874k481l466l280k247j467j013o06o85j442j982j755
57461e8516j646k470l511l711l194k539j692p09l12p40j131r94j028j610j897
57446h5700j315n79k45J87Q43P72k03n80N92K110K497J971J338M59p66j401r44
$$ plain form
57429 -80964 -81468 -82595 -84741 -87227 -89530 -91664 -93435 -94667 -96011 -98181 -100460 -101435 -101143 -100928 -101213 -101083
57413 -101083 -100187 -99376 -99109 -98777 -97988 -97110 -96113 -94337 -91846 -89788 -88901 -88775 -88895 -89259 -89705 -89837 -89936 -90811
57395 -90811 -92463 -94047 -95289 -96716 -98337 -99479 -100280 -101922 -104895 -108279 -111290 -114379 -118214 -122622 -127014
57380 -127014 -130998 -134172 -136241 -137681 -139435 -141749 -144162 -146669 -149758 -153167 -155819 -157322 -158436 -159809
57366 -159809 -161276 -162602 -163822 -164611 -164526 -164096 -164581 -166362 -168673 -171027 -173664 -176363 -178261 -179278 -180442
57351 -180442 -182264 -184032 -185183 -186163 -187293 -187981 -187775 -187255 -187219 -187758 -188628 -189702 -190612 -190833 -190525 -190440 -190715 -190617
57333 -190617 -189805 -188909 -188549 -188699 -189226 -190083 -190775 -190737 -190540 -191561 -194161 -197307 -200261 -203384 -206905 -210248 -213148
57316 -213148 -216161 -219401 -222038 -223737 -225443 -227968 -230888 -233603 -236403 -239576 -242452 -244346 -245652 -247119
$$ packed form
57429h0964n04j127k146k486k303k134j771j232j344k170k279r75K92K15k85J30
57413a01083Q96Q11K67L32P89Q78R97J776K491K058Q87J26j20l64m46j32r9q75
57395i0811j652j584j242j427j621j142q01j642k973l384l011l089l835m408m392
57380a27014l984l174k069j440j754k314k413k507l089l409k652j503j114j373
57366a59809j467j326j220p89Q5M30m85j781k311k354k637k699j898j017j164
57351a80442j822j768j151r80j130o88K06N20L6n39q70j074r10k21L08Q5k75R8
57333a90617Q12Q96L60j50n27q57o92L8J97j021k600l146k954l123l521l343k900
57316b13148l013l240k637j699j706k525k920k715k800l173k876j894j306j467
$$ plain form
57302 -247119 -248748 -250268 -252025 -254439 -257118 -259335 -261018 -262580 -264125 -265399 -266201 -266481 -266410 -266672 -268091
57287 -268091 -270583 -273042 -274648 -275793 -277343 -279552 -282055 -284467 -286536 -288116 -289299 -290366 -291537 -293093
57273 -293093 -295573 -299275 -303689 -308034 -312162 -316191 -319602 -321753 -323082 -324610 -326309 -327230 -327315 -327740 -329214
57258 -329214 -331254 -333451 -336134 -339285 -342123 -344372 -346794 -349813 -352724 -354949 -357025 -359605 -362418 -365034
57244 -365034 -367764 -370951 -374093 -376442 -377993 -379265 -380574 -382055 -383870 -385976 -388193 -390753 -394171 -398380
57230 -398380 -402705 -406875 -411221 -415642 -419354 -422056 -424434 -427081 -429796 -432376 -435254 -438790 -442681 -446537
57216 -446537 -450361 -454119 -457551 -460760 -464250 -468112 -471935 -475736 -480106 -485160 -490200 -494698 -498761 -502398
57202 -502398 -505348 -507853 -510589 -513590 -516349 -519212 -523347 -528895 -534476 -539118 -543385 -547919 -552226 -555824
$$ packed form
57302b47119j629j520j757k414k679k217j683j562j545j274q02k80P1k62j419
57287b68091k492k459j606j145j550k209k503k412k069j580j183j067j171j556
57273b93093k480l702m414m345m128m029l411k151j329j528j699r21q5m25j474
57258c29214k040k197k683l151k838k249k422l019k911k225k076k580k813k616
57244c65034k730l187l142k349j551j272j309j481j815k106k217k560l418m209
57230c98380m325m170m346m421l712k702k378k647k715k580k878l536l891l856
57216d46537l824l758l432l209l490l862l823l801m370n054n040m498m063l637
57202e02398k950k505k736l001k759k863m135n548n581m642m267m534m307l598
$$ plain form
57188 -555824 -559349 -563386 -567165 -569584 -570864 -572104 -573768 -575543 -577205 -578711 -579817 -580513 -581614 -584200
57174 -584200 -588479 -593577 -598355 -602335 -606107 -610934 -617516 -625179 -632750 -640043 -647753 -656062 -664337 -672147
57160 -672147 -679580 -686536 -692808 -698959 -705935 -713572 -720630 -726541 -731973 -737460 -742777 -748048 -754054 -760832
57146 -760832 -767187 -772318 -776897 -781936 -787559 -793507 -799840 -806524 -813129 -819449 -825676 -831695 -837190 -842655
57132 -842655 -849178 -856880 -864706 -872097 -879595 -887385 -894600 -900736 -906524 -912755 -919322 -926006 -933046 -940318
57118 -940318 -947060 -953008 -958682 -964079 -968325 -971260 -974119 -977957 -982633 -988027 -995011 -1004217 -1014830 -1025361
57104 -1025361 -1034598 -1040987 -1041982 -1034903 -1018162 -991747 -957720 -920535 -885432 -855709 -832202 -815337
57092 -815337 -806178 -805093 -810984 -822479 -838634 -857988 -878457 -898898 -919591 -940629 -961175 -980782
$$ packed form
57188e55824l525m037l779k419j280j240j664j775j662j506j106o96j101k586
57174e84200m279n098m778l980l772m827o582p663p571p293p710q309q275p810
57160f72147p433o956o272o151o976p637p058n911n432n487n317n271o006o778
57146g60832o355n131m579n039n623n948o333o684o605o320o227o019n495n465
57132h42655o523p702p826p391p498p790p215o136n788o231o567o684p040p272
57118i40318o742n948n674n397m246k935k859l838m676n394o984r206j0613j0531
57104a025361r237o389r95P079J6741K6415L4027L7185L5103K9723K3507J6865
57092h15337R159J085n891j1495j6155j9354k0469k0441k0693k1038k0546j9607
$$ plain form
57080 -980782 -1000056 -1019440 -1038661 -1057840 -1077681 -1098183 -1118752 -1140138 -1164657 -1193857 -1227465
57069 -1227465 -1265017 -1306780 -1352490 -1401027 -1452108 -1506613 -1564538 -1624373 -1685296 -1748339 -1814633
57058 -1814633 -1884067 -1956211 -2030875 -2107260 -2184377 -2262871 -2344595 -2430072 -2518475 -2610380 -2708007
57047 -2708007 -2812076 -2921014 -3034149 -3153192 -3279603 -3413088 -3553888 -3704063 -3865189
57038 -3865189 -4036996 -4219429 -4413868 -4621227 -4841067 -5073520 -5319764 -5579862 -5852670
57029 -5852670 -6138622 -6439846 -6756922 -7088720 -7436333 -7803905 -8194619 -8609331 -9050199
57020 -9050199 -9522025 -10028848 -10573040 -11159068 -11794020 -12483052 -13228940 -14038234 -14923293
57011 -14923293 -15895900 -16963655 -18136324 -19432625 -20878871 -22505546 -24348789 -26452712
$$ packed form
57080i80782j9274j9384j9221j9179j9841k0502k0569k1386k4519k9200l3608
57069a227465l7552m1763m5710m8537n1081n4505n7925n9835o0923o3043o6294
57058a814633o9434p2144p4664p6385p7117p8494q1724q5477q8403r1905r7627
57047b708007j04069j08938j13135j19043j26411j33485j40800j50175j61126
57038c865189j71807j82433j94439k07359k19840k32453k46244k60098k72808
57029e852670k85952l01224l17076l31798l47613l67572l90714m14712m40868
57020i050199m71826n06823n44192n86028o34952o89032p45888q09294q85059
57011a4923293r72607j067755j172669j296301j446246j626675j843243k103923
$$ plain form
57003 -26452712 -28869641 -31664531 -34925108 -38768906 -43345176 -48841142 -55492446 -63581817
56995 -63581817 -73418637 -85310627 -99535528 -116310124 -135765170 -157944827 -182824009
56988 -182824009 -210309430 -240207438 -272174211 -305659097 -339841634 -373599700 -405580077
56981 -405580077 -434395854 -458896261 -478434366 -493048841 -503404699 -510349814 -514229388
56974 -514229388 -514456660 -509770786 -499039367 -481974290 -459273264 -432259082 -402413222
56967 -402413222 -371065266 -339252214 -307699523 -276904694 -247265434 -219155730 -192917427
56960 -192917427 -168821156 -147044548 -127662960 -110644629 -95865630 -83145017 -72273945
56953 -72273945 -63028008 -55180179 -48520748 -42867454 -38060552 -33959605 -30448340 -27433740
$$ packed form
57003b6452712k416929k794890l260577l843798m576270n495966o651304q089371
56995f3581817r836820j1891990j4224901j6774596j9455046k2179657k4879182
56988a82824009k7485421k9898008l1966773l3484886l4182537l3758066l1980377
56981d05580077k8815777k4500407j9538105j4614475j0355858o945115l879574
56974e14229388k27272M685874J0731419J7065077K2701026K7014182K9845860
56967d02413222L1347956L1813052L1552691L0794829K9639260K8109704K6238303
56960a92917427K4096271K1776608J9381588J7018331J4778999J2720613J0871072
56953g2273945R245937P847829O659431N653294M806902M100947L511265L014600
$$ plain form
56945 -27433740 -24835795 -22582851 -20617031 -18895316 -17381178 -16040073 -14844175 -13774470
56937 -13774470 -12814926 -11949283 -11164997 -10454570 -9810471 -9223141 -8685400 -8193933 -7744701
56928 -7744701 -7331311 -6949307 -6597563 -6273992 -5974161 -5695246 -5436764 -5196070 -4967733
56919 -4967733 -4749008 -4541535 -4345759 -4157798 -3973883 -3794160 -3620220 -3452453 -3291803
56910 -3291803 -3140828 -3000842 -2870566 -2748837 -2635858 -2530674 -2430644 -2334860 -2245124 -2162201
56900 -2162201 -2084033 -2009002 -1938054 -1872134 -1810264 -1751591 -1696715 -1645679 -1597151 -1550859 -1508292
56889 -1508292 -1469811 -1433532 -1398214 -1364671 -1333156 -1301975 -1270053 -1238360 -1207437 -1175920 -1143025
56878 -1143025 -1110267 -1079349 -1050367 -1023192 -998345 -975212 -951712 -927114 -903120 -880896 -859181
$$ packed form
56945b7433740K597945K252944J965820J721715J514138J341105J195898J069705
56937a3774470R59544Q65643P84286P10427O44099N87330N37741M91467M49232
56928g744701M13390L82004L51744L23571K99831K78915K58482K40694K28337
56919d967733K18725K07473J95776J87961J83915J79723J73940J67767J60650
56910c291803J50975J39986J30276J21729J12979J05184J00030R5784Q9736Q2923
56900b162201P8168P5031P0948O5920O1870N8673N4876N1036M8528M6292M2567
56889a508292L8481L6279L5318L3543L1515L1181L1922L1693L0923L1517L2895
56878a143025L2758L0918K8982K7175K4847K3133K3500K4598K3994K2224K1715
$$ plain form
56867 -859181 -836630 -813842 -791554 -769008 -745699 -722833 -701295 -679920 -657398 -634348 -611817
56856 -611817 -589162 -565097 -539773 -514426 -489948 -467053 -446895 -430347 -417347 -407482 -400268 -394440
56844 -394440 -388352 -381722 -375629 -370244 -363978 -355549 -345464 -334811 -323948 -312974 -302016 -290398 -276843
56831 -276843 -261012 -243556 -224437 -203009 -180160 -158495 -139840 -124383 -112802 -106958 -107360 -111824
56819 -111824 -117785 -124304 -130896 -136328 -139930 -142529 -144789 -145973 -145470 -144086 -142628 -140540 -137105 -132790
56805 -132790 -128354 -123792 -119079 -114726 -110737 -106281 -101204 -96478 -92357 -87594 -81465 -75095 -69730 -65078
56791 -65078 -60364 -55574 -50614 -44697 -37743 -31041 -25307 -19371 -11958 -3446 5318 14526 24271 33122
56777 33122 39282 42368 42902 41128 37605 34017 32006 31826 33021 35526 39165 43184 47419 52906 60280
$$ packed form
56867h59181K2551K2788K2288K2546K3309K2866K1538K1375K2522K3050K2531
56856f11817K2655K4065K5324K5347K4478K2895K0158J6548J3000R865P214N828
56844c94440O088O630O093N385O266Q429J0085J0653J0863J0974J0958J1618J3555
56831b76843J5831J7456J9119K1428K2849K1665J8655J5457J1581N844m02m464
56819a11824n961o519o592n432l602k599k260j184N03J384J458K088L435M315
56805a32790M436M562M713M353L989M456N077M726M121M763O129O370N365M652
56791f5078M714M790M960N917O954O702N734N936P413c446E318R208R745Q851
56777C3122O160L086N34j774l523l588k011j80J195K505L639M019M235N487P374
$$ plain form
56762 60280 68625 77191 87239 100777 118167 138161 159560 181449 202202 219433 230869 234927
56750 234927 231280 221655 209298 196803 184975 174137 165372 159639 156720 156065 157848 162331 169068
56737 169068 177654 188595 202686 220362 242302 269582 302268 338499 375477 410278 439128 457468
56725 457468 462331 454226 436020 410914 382097 352893 325676 301132 279447 261415 247595 237323
56713 237323 229636 224510 222453 223725 228724 238190 252236 270008 290930 315114 341656 367592 389267
56700 389267 403804 408867 402937 387216 365906 343121 320377 298025 277528 260630 247352 236561
56688 236561 227860 221512 217226 214405 213145 213866 216623 221671 229732 240589 252345 263231 273113 281974
56674 281974 288014 288901 284201 275229 263246 249241 234702 221011 208366 196473 185825 177167 170279
$$ packed form
56762F0280Q345Q566J0048J3538J7390J9994K1399K1889K0753J7231J1436M058
56750B34927l647r625j2357j2495j1828j0838q765n733k919o55J783M483O737
56737A69068Q586J0941J4091J7676K1940K7280L2686L6231L6978L4801K8850J8340
56725D57468M863q105j8206k5106k8817k9204k7217k4544k1685j8032j3820j0272
56713B37323p687n126k057J272M999R466J4046J7772K0922K4184K6542K5936K1675
56700C89267J4537N063n930j5721k1310k2785k2744k2352k0497j6898j3278j0791
56688B36561q701o348m286k821j260P21K757N048Q061J0857J1756J0886R882Q861
56674B81974O040Q87m700q972j1983j4005j4539j3691j2645j1893j0648q658o888
$$ plain form
56661 170279 164410 159303 154865 150561 146222 142700 140703 139788 139391 139708 140475 140195 138065 135542 134410
56646 134410 134329 133841 132762 131787 130685 128764 126444 124564 122799 120581 118898 119225 121059 122426 122559 122342
56630 122342 122420 122589 122911 123798 125084 126380 128085 130667 133388 135119 135973 136680 136987 136330 135536 136003 137547
56613 137547 138819 139539 140505 141746 142522 143006 144074 145512 146191 146040 146102 146677 147121 147460 148409 149724 150316
56596 150316 150139 150263 150953 151352 151276 151588 152523 153326 153864 154955 156661 157817 157836 157587 157922 158524 158653 157994
56578 157994 156501 154449 152768 152241 152306 151818 150903 150745 151574 152349 152544 152784 153529 154471 155489 156854 158247
56561 158247 158875 158825 159115 160233 161753 163432 165414 167352 168632 169471 170477 171240 170895 170025 170331 172304
56545 172304 174819 177154 179631 182054 183397 183572 183789 184562 184971 184527 184190 184736 185507 185529 184644 182930 180264
$$ packed form
56661A70279n869n107m438m304m339l522j997r15l97L17P67k80k130k523j132
56646A34410q1m88j079r75j102j921k320j880j765k218j683L27J834J367J33k17
56630A22342P8J69L22Q87J286J296J705K582K721J731Q54P07L07o57p94M67J544
56613A37547J272P20R66J241P76M84J068J438O79j51O2N75M44L39R49J315N92
56596A50316j77J24O90L99p6L12R35Q03N38J091J706J156J9k49L35O02J29o59
56578A57994j493k052j681n27O5m88r15j58Q29P75J95K40P45R42J018J365J393
56561A58247O28n0K90J118J520J679J982J938J280Q39J006P63l45q70L06J973
56545A72304K515K335K477K423J343J75K17P73M09m44l37N46P71K2q85j714k666
$$ plain form
56528 180264 177143 174770 173680 173253 172929 172732 172291 170764 168273 166108 164978 164325 163795 163958 164882 165398
56512 165398 164660 163353 162579 162525 162836 163328 163702 163466 162703 162056 161654 160973 159981 159366 159345 159400 159445 160053 161274
56493 161274 162460 163521 165020 166760 167671 167477 167115 167155 167264 167570 168893 171013 172351 172133 171445 171450 171952
56476 171952 172496 173408 174886 176308 177333 178520 180149 181612 182625 183802 185436 186973 188306 190151 192516
56461 192516 194300 195227 196718 199991 204673 210042 216094 222446 227708 231088 233349 235233 236332 236531 237060
56446 237060 238849 241119 242793 244035 245232 245790 245287 244626 244644 244698 243958 243029 242851 242893 241895 239676 236897
56429 236897 233744 230089 226401 223370 221102 219472 218586 218191 217460 216148 215093 214838 214778 214334 213830 213441
56413 213441 212569 211156 210247 210246 209995 208718 207453 207219 207120 205819 203724 202141 201241 200348 199397 198662 197857 196848
$$ packed form
56528A80264l121k373j090m27l24j97m41j527k491k165j130o53n30J63R24N16
56512A65398p38j307p74n4L11M92L74k36p63o47m02o81r92o15k1N5M5O08J221
56493A61274J186J061J499J740R11j94l62M0J09L06J323K120J338k18o88NN02
56476A71952N44R12J478J422J025J187J629J463J013J177J634J537J333J845K365
56461A92516J784R27J491L273M682N369O052O352N262L380K261J884J099J99N29
56446B37060J789K270J674J242J197N58n03o61J8N4p40r29j78M2r98k219k779
56429B36897l153l655l688l031k268j630q86l95p31j312j055k55o0m44n04l89
56413B13441q72j413r09jk51j277j265k34r9j301k095j583r00q93r51p35q05j009
$$ plain form
56395 196848 196369 196792 197150 196694 196336 197142 198422 198848 198464 198037 197406 196191 195234 195544 196513 196892 196866 197445
56377 197445 198409 198652 198117 197692 197517 197008 196233 195732 195267 194203 192821 191914 191383 190588 189645 189068 188564 187573
56359 187573 186588 186538 187241 187866 188516 189896 191762 193100 193652 193966 194261 194500 195187 196762 198530 199524 200058
56342 200058 201136 202750 204118 205214 206610 208114 208981 209268 209628 209978 209649 208622 207375 205844 203777
56327 203777 201809 200875 200839 200910 201029 201515 201834 201245 200346 200450 201558 202457 202743 203300 204709 206446 207811 208591
56309 208591 208777 208581 208586 209081 209531 209554 209821 211044 212685 213814 214564 215488 216152 215776 214714 213884 213306 212648
56291 212648 212539 213772 215700 217097 218157 219926 222212 223867 224894 226416 228579 230215 230712 230652 230522
56276 230522 230223 229929 230152 230887 231806 233103 234999 236769 237503 237496 237625 237861 237731 237626 238078 238363 237501 236171
$$ packed form
56395A96848m79M23L58m56l58Q06J280M26l84m27o31j215r57L10R69L79k6N79
56377A97445R64K43n35m25j75n09p75n01m65j064j382r07n31p95r43n77n04r91
56359A87573r85n0P03O25O50J380J866J338N52L14K95K39O87J575J768R94N34
56342B00058J078J614J368J096J396J504Q67K87L60L50l29j027j247j531k067
56327B03777j968r34l6P1J19M86L19n89q99J04J108Q99K86N57J409J737J365P80
56309B08591J86j96NM95M50K3K67J223J641J129P50R24O64l76j062q30n78o58
56291B12648j09J233J928J397J060J769K286J655J027J522K163J636M97o0j30
56276B30522k99k94K23P35R19J297J896J770P34pJ29K36j30j05M52K85q62j330
$$ plain form
56258 236171 235811 236327 236547 236516 237248 238465 238767 238115 238064 239323 240924 242076 243104 244284 245352 246374 247677
56241 247677 248847 249227 249323 250171 251487 252103 252083 252579 253683 254327 254426 255232 257309 259854 262222 264526 266607
56224 266607 268053 269346 271414 273955 275857 277247 279416 282650 285798 288077 289723 290929 291805 293252
56210 293252 296136 299653 302299 304296 307221 311461 316020 320627 325779 330799 334223 336395 339442 344385
56196 344385 350282 356358 362783 369105 374246 378492 383414 389429 395476 401330 408066 415906 423877 431903
56182 431903 440945 450719 459684 467780 476747 487143 497518 507315 518146 531190 545559 560246 575698
56169 575698 592519 610521 629905 651600 675796 701949 730658 763493 800546 840368 882848
56158 882848 929897 982811 1041368 1106077 1178691 1259695 1347849 1443186 1548005 1663866 1789945
$$ packed form
56258B36171l60N16K20l1P32J217L02o52n1J259J601J152J028J180J068J022J303
56241B47677J170L80R6Q48J316O16k0M96J104O44R9Q06K077K545K368K304K081
56224B66607J446J293K068K541J902J390K169L234L148K279J646J206Q76J447
56210B93252K884L517K646J997K925M240M559M607N152N020L424K172L047M943
56196C44385N897O076O425O322N141M246M922O015O047N854O736P840P971Q026
56182D31903R042R774Q965Q096Q967J0396J0375R797J0831J3044J4369J4687J5452
56169E75698J6821J8002J9384K1695K4196K6153K8709L2835L7053L9822M2480
56158H82848M7049N2914N8557O4709P2614Q1004Q8154R5337J04819J15861J26079
$$ plain form
56147 1789945 1925263 2069883 2222740 2380800 2541670 2704746 2868480 3028769 3181295
56138 3181295 3323209 3451294 3560779 3647430 3708985 3743663 3749706 3727572 3680267 3610413 3519298
56127 3519298 3409732 3286924 3154993 3015183 2869035 2720632 2573836 2429746 2288697
56118 2288697 2152488 2022781 1899472 1782461 1672953 1571410 1476423 1387217 1304978 1230087
56108 1230087 1160521 1094907 1034670 981134 932820 887823 846637 810254 777469 746498 717577
56097 717577 691771 668753 647764 629166 613160 598503 584251 571216 560125 550092 540388 531777
56085 531777 524586 517539 510110 503816 499510 495713 491361 487794 486000 484340 481223 477779 475639 474234
56071 474234 472527 471276 471285 471506 471178 471762 474531 478241 481463 485087 490248 495898 500840 506093 512891 520371
$$ packed form
56147A789945J35318J44620J52857J58060J60870J63076J63734J60289J52526
56138C181295J41914J28085J09485Q6651O1555L4678O043k2134m7305o9854r1115
56127C519298j09566j22808j31931j39810j46148j48403j46796j44090j41049
56118B288697j36209j29707j23309j17011j09508j01543r4987q9206q2239p4891
56108A230087o9566o5614o0237n3536m8314m4997m1186l6383l2785l0971k8921
56097G17577k5806k3018k0989j8598j6006j4657j4252j3035j1091j0033r704q611
56085E31777p191p047p429o294m306l797m352l567j794j660l117l444k140j405
56071D74234j707j251RK21l28N84K769L710L222L624N161N650M942N253O798P480
$$ plain form
56055 520371 527571 535590 545424 555867 565957 577307 591480 607286 623292 640871 662082 686617
56043 686617 713545 744101 780103 821605 868567 922675 984804 1052692 1123510 1196349 1269547
56032 1269547 1338269 1398014 1448664 1492396 1529903 1561462 1589121 1614418 1635836 1651292 1660961
56021 1660961 1665054 1661621 1649833 1632845 1614029 1592767 1567039 1537222 1503634 1463177 1412715 1353806
56009 1353806 1290421 1224336 1156521 1090546 1030290 976100 926949 884153 849102 819685 793092
55998 793092 770038 752239 738089 725058 714115 707365 703447 699634 696386 695534 696065 696021 696324 698398
55984 698398 700423 700447 700730 704203 709210 712681 715951 722152 730236 737153 743803 753248 764940 776188
55970 776188 787421 800497 813815 824689 834655 846719 859373 869105 876790 885568 894419 900104 903690
$$ packed form
56055E20371P200Q019R834J0443J0090J1350J4173J5806J6006J7579K1211K4535
56043F86617K6928L0556L6002M1502M6962N4108O2129O7888P0818P2839P3198
56032A269547O8722N9745N0650M3732L7507L1559K7659K5297K1418J5456R669
56021A660961M093l433j1788j6988j8816k1262k5728k9817l3588m0457n0462n8909
56009A353806o3385o6085o7815o5975o0256n4190m9151m2796l5051k9417k6593
55998G93092k3054j7799j4150j3031j0943o750l918l813l248q52N31m4L03K074
55984F98398K025K4K83L473N007L471L270O201Q084O917O650R445J1692J1248
55970G76188J1233J3076J3318J0874R966J2064J2654R732P685Q778Q851N685L586
$$ plain form
55957 903690 908820 915221 920224 924869 932022 940174 945830 950425 958123 968352 977480 986293 998559 1013495
55943 1013495 1026963 1039044 1053214 1069139 1083602 1097541 1114728 1134399 1152577 1169746 1189853
55932 1189853 1212718 1234936 1257192 1283028 1311502 1338797 1365819 1396309 1428880 1459184 1488412
55921 1488412 1521100 1556151 1589087 1621554 1658943 1699956 1738524 1775049 1815611 1860839 1905935
55910 1905935 1950968 2000523 2053758 2105667 2157745 2216380 2281135 2345889 2411075 2482998 2561375
55899 2561375 2639827 2718637 2804677 2898685 2995220 3095022 3204181 3321225 3438807 3558232
55889 3558232 3688124 3828866 3973402 4123372 4288462 4469293 4657637 4854412 5070259
55880 5070259 5307335 5558480 5825703 6120764 6446016 6794172 7168647 7583702 8043045
$$ packed form
55957I03690N130O401N003M645P153Q152N656M595P698J0229R128Q813J2266J4936
55943A013495J3468J2081J4170J5925J4463J3939J7187J9671J8178J7169K0107
55932A189853K2865K2218K2256K5836K8474K7295K7022L0490L2571L0304K9228
55921A488412L2688L5051L2936L2467L7389M1013L8568L6525M0562M5228M5096
55910A905935M5033M9555N3235N1909N2078N8635O4755O4754O5186P1923P8377
55899B561375P8452P8810Q6040R4008R6535R9802J09159J17044J17582J19425
55889C558232J29892J40742J44536J49970J65090J80831J88344J96775K15847
55880E070259K37076K51145K67223K95061L25252L48156L74475M15055M59343
$$ plain form
55871 8043045 8540198 9081825 9687535 10364929 11110284 11936626 12874745 13944515 15155305
55862 15155305 16539034 18152462 20044474 22256133 24855349 27928693 31529266 35673931
55854 35673931 40401066 45790131 51928983 58933340 67023923 76536886 87871062 101521977
55846 101521977 118141583 138306123 161952753 187966326 214296570 238336640 257157979
55839 257157979 267828339 268287411 258449131 240469624 217730782 193375829 169519132
55832 169519132 147319227 127325455 109692501 94330928 81076894 69772809 60228370
55825 60228370 52201089 45455745 39801744 35061724 31055949 27639525 24718026 22211601
55817 22211601 20036571 18131932 16468516 15017093 13733928 12586451 11564693 10656447
$$ packed form
55871H043045M97153N41627O05710O77394P45355Q26342R38119J069770J210790
55862A5155305J383729J613428J892012K211659K599216L073344L600573M144665
55854C5673931M727135N389065O138852P004357Q090583R512963J1334176J3650915
55846A01521977J6619606K0164540K3646630K6013573K6330244K4040070J8821339
55839B57157979J0670360M59072r838280j7979507k2738842k4354953k3856697
55832A69519132k2199905j9993772j7632954j5361573j3254034j1304085r544439
55825F0228370q027281o745344n654001m740020m005775l416424k921499k506425
55817B2211601k175030j904639j663416j451423j283165j147477j021758r08246
$$ plain form
55809 10656447 9835818 9085463 8406387 7796235 7239286 6726032 6261722 5847000 5469178
55800 5469178 5120237 4804967 4523847 4265430 4023016 3802183 3604799 3421675 3247917
55791 3247917 3089940 2950235 2819849 2692946 2574863 2468995 2369126 2271489 2181594 2102394
55781 2102394 2027810 1954499 1888385 1833158 1783204 1733975 1688635 1648551 1607620 1561958 1515486
55770 1515486 1470506 1422550 1369900 1318575 1272389 1227289 1180762 1137647 1101254 1067571 1033672
55759 1033672 1003224 978420 954905 929969 907535 889834 872350 852384 834571 822293 811272
55748 811272 797359 783306 772091 760564 745617 730145 717104 703721 687176 670318 656389
55737 656389 643493 629252 615604 604253 592681 579241 566910 557613 548256 536785 526651 520697
$$ packed form
55809A0656447q20629p50355o79076o10152n56949n13254m64310m14722l77822
55800E469178l48941l15270k81120k58417k42414k20833j97384j83124j73758
55791C247917j57977j39705j30386j26903j18083j05868r9869r7637q9895p9200
55781B102394p4584p3311o6114n5227m9954m9229m5340m0084m0931m5662m6472
55770A515486m4980m7956n2650n1325m6186m5100m6527m3115l6393l3683l3899
55759A033672l0448k4804k3515k4936k2434j7701j7484j9966j7813j2278j1021
55748H11272j3913j4053j1215j1527j4947j5472j3041j3383j6545j6858j3929
55737F56389j2896j4241j3648j1351j1572j3440j2331r297r357j1471j0134n954
$$ plain form
55725 520697 516094 510021 504994 503676 503488 501345 498904 498180 496609 491481 485053 480538 477060 473015 470193
55710 470193 470056 470067 468223 467268 469909 473827 475946 477734 481653 486037 488246 489499 491919 493880 492799
55695 492799 489601 486172 481234 472916 462639 452474 441410 428211 415185 405245 397791 391122 386177
55682 386177 384176 383231 381033 378335 376297 373080 366789 359334 353808 350371 347923 347179 348617 349993 349346
55667 349346 348072 347787 346770 342772 336731 330406 323184 314625 307290 303195 300141 295294 289839 286235
55653 286235 283462 279161 274241 271084 269092 266089 262457 259902 257639 253709 248745 244798 241647 237767
55639 237767 233666 230846 228649 225428 221744 219326 217979 216408 214838 214026 213112 211186 209524 209463 209753
55624 209753 208806 207773 208332 209202 208114 205641 203815 202437 200129 197618 196593 196401 195233 193535 193114
$$ packed form
55725E20697m603o073n027j318j88k143k441p24j571n128o428m515l478m045k822
55710D70193j37J1j844r55K641L918K119J788L919M384K209J253K420J961j081
55695D92799l198l429m938q318j0277j0165j1064j3199j3026r940p454o669m945
55682C86177k001r45k198k698k038l217o291p455n526l437k448p44J438J376o47
55667C49346j274k85j017l998o041o325p222q559p335m095l054m847n455l604
55653B86235k773m301m920l157j992l003l632k555k263l930m964l947l151l880
55639B37767m101k820k197l221l684k418j347j571j570q12r14j926j662o1K90
55624B09753r47j033N59Q70j088k473j826j378k308k511j025j92j168j698m21
$$ plain form
55609 193114 193787 193932 193464 193365 193275 192364 191557 192159 193334 193637 193758 194947 196120 195543 194083 193710 193962 193093
55591 193093 191647 191606 192875 193769 194235 195477 197183 198189 199203 201839 205544 208486 210874 214384 218852
55576 218852 222477 224903 227235 229386 230281 230348 231082 232310 232482 231452 230587 230460 230670 231420 233004 234393
55560 234393 234598 234702 236170 238100 238644 238191 238380 238822 237720 235068 232323 229449 225195 219862 214946 210391
55544 210391 204954 198925 193737 189263 184249 179028 174992 171763 167773 163392 160532 159309 158019 156262
55530 156262 155227 154915 154102 153157 153874 156127 157490 156714 155020 153558 152086 150611 149884 149671 148708 146796
55514 146796 144969 143444 141488 139383 138311 138169 137705 136866 136743 137220 137045 136320 136417 137230 136985 135159 133196
55497 133196 131922 130597 128943 127833 127436 126815 125872 125610 126064 126031 125308 125143 126025 127014 127645 128565 129835
$$ packed form
55609A93114O73J45m68r9r0r11q07O02J175L03J21J189J173n77j460l73K52q69
55591A93093j446m1J269Q94M66J242J706J006J014K636L705K942K388L510M468
55576B18852L625K426K332K151Q95O7P34J228J72j030q65j27K10P50J584J389
55560B34393K05J04J468J930N44m53J89M42j102k652k745k874m254n333m916m555
55544B10391n437o029n188m474n014n221m036l229l990m381k860j223j290j757
55530A56262j035l12q13r45P17K253J363p76j694j462j472j475p27k13r63j912
55514A46796j827j525j956k105j072j42m64q39j23M77j75p25R7Q13k45j826j963
55497A33196j274j325j654j110l97o21r43k62M54l3p23j65Q82R89O31R20J270
$$ plain form
55480 129835 130591 130759 131262 132244 132962 133616 135240 137544 138962 139177 139625 141162 143252 145636 148656 151634
55464 151634 153169 153482 154349 156275 157856 158354 158703 159378 159455 158461 157175 155955 154227 152211 151148 151236 151278
55447 151278 150930 151280 152657 153931 154596 155469 156657 156973 156164 155676 156285 156895 156571 155886 155394 154631 153548
55430 153548 153116 153538 153583 152542 151180 149961 148102 145236 142329 140060 137976 135956 134682 133853 131887
55415 131887 128422 125275 123786 122965 121461 119692 118714 118479 118472 118773 119257 118975 117418 115367 113641 112135
55399 112135 110820 110369 110972 111843 112621 113897 115625 116526 115966 115025 114804 115000 114964 114831 114773 114433 113891 113852 114227
55380 114227 113954 112852 112077 112072 111800 110794 110069 110027 109389 107477 105700 105313 105366 104461 103051 102334 102157 101730
55362 101730 101292 101414 101598 101167 100706 101131 102080 102637 102935 103642 104465 104552 103925 103321 102951 102513 102091 102126 102746
$$ packed form
55480A29835P56J68N03R82P18O54J624K304J418K15M48J537K090K384L020K978
55464A51634J535L13Q67J926J581M98L49O75P7r94j286j220j728k016j063Q8M2
55447A51278l48L50J377J274O65Q73J188L16q09m88O09O10l24o85m92p63j083
55430A53548m32M22M5j041j362j219j859k866k907k269k084k020j274q29j966
55415A31887l465l147j489q21j504j769r78k35pL01M84k82j557k051j726j506
55399A12135j315m51O03Q71P78J276J728R01n60r41k21J96l6j33n8l40n42l9L75
55380A14227k73j102p75nk72j006p25m2o38j912j777l87N3r05j410p17j77m27
55362A01730m38J22J84m31m61M25R49N57K98P07Q23Q7o27o04l70m38m22L5O20
$$ plain form
55343 102746 103760 104966 106000 106441 106440 106603 106926 106736 105997 105609 105996 106517 106763 107206 107965 108214 107556 106845
55325 106845 106898 107532 108539 110320 112752 114688 115453 115678 115893 115650 114908 114875 116385 118642 120606 122397 124315
55308 124315 125790 126436 126968 127854 128264 127516 126348 125546 124516 122557 120390 118999 118000 116565 114944 113647
55292 113647 112130 109872 107835 107237 107631 107724 107463 107682 108296 108483 108248 108294 108630 108697 108615 108960 109528 109547 108960
55273 108960 108391 108040 107657 107395 107651 108208 108396 107951 107035 105742 104319 103393 103256 103351 103181 103191 103981 105220
55255 105220 106186 106802 107298 107456 107053 106553 106500 106686 106712 106771 107121 107382 107162 106826 106886 107249 107742 108601 109640 109819
55235 109819 108589 106876 105747 104923 103706 102562 102472 103243 103730 103423 102852 102739 103556 105400 107507 108506 108032
55218 108032 107412 107860 108735 108637 107500 106414 105972 106006 106448 107278 107964 108048 107968 108319 108702 108308 107270 106509 106514 107078
$$ packed form
55343A02746J014J206J034M41jJ63L23j90p39l88L87N21K46M43P59K49o58p11
55325A06845N3O34J007J781K432J936P65K25K15k43p42l3J510K257J964J791J918
55308A24315J475O46N32Q86M10p48j168q02j030j959k167j391r99j435j621j297
55292A13647j517k258k037n98L94R3k61K19O14J87k35M6L36O7q2L45N68J9n87
55273A08960n69l51l83k62K56N57J88m45r16j293j423r26j37R5j70J0P90J239
55255A05220R66O16M96J58m03n00n3J86K6N9L50K61k20l36O0L63M93Q59J039J79
55235A09819j230j713j129q24j217j144r0P71M87l07n71j13Q17J844K107R99m74
55218A08032o20M48Q75r8j137j086m42L4M42Q30O86Q4q0L51L83l94j038p61NN64
$$ plain form
55198 107078 107839 108330 107949 106664 105300 104512 104078 103747 103904 104654 105216 105145 105241 106293 107874 109337 110898
55181 110898 112582 113275 112318 110996 110898 111664 111966 111827 112154 112657 112167 110649 109105 107769 106199 104917 105104
55164 105104 106613 107965 108416 108527 108614 108200 107265 106618 106572 106451 105757 104934 104709 105395 106862 108482 109354 109337
55146 109337 109530 110847 112588 113461 113444 113412 113385 112603 111045 109481 108198 106978 106134 106190 106683 106654 106162 105952
55128 105952 105820 104877 103407 102809 103471 104217 104159 103716 103434 103189 103000 103376 104324 105047 105131 105093 105342 105478 105048
55109 105048 104230 103413 102776 102480 102660 103131 103651 104413 105579 106608 106824 106470 106253 106139 105565 104647 104078 104025
55091 104025 104207 104785 105975 106993 106801 105848 105689 106789 108081 108771 109189 109633 109806 109818 110360 111400 111901
55074 111901 111375 110599 110330 110367 110442 110938 112105 113394 114226 114663 114884 114746 114354 114345 115058 115997 116506 116459 116068 115512
$$ packed form
55198A07078P61M91l81j285j364p88m34l31J57P50N62p1R6J052J581J463J561
55181A10898J684O93r57j322r8P66L02j39L27N03m90j518j544j336j570j282J87
55164A05104J509J352M51J11Q7m14r35o47m6j21o94q23k25O86J467J620Q72j7
55146A09337J93J317J741Q73j7l2k7p82j558j564j283j220q44N6M93k9m92k10
55128A05952j32r43j470n98O62P46n8m43k82k45j89L76R48P23Q4l8K49J36m30
55109A05048q18q17o37k96J80M71N20P62J166J029K16l54k17j14n74r18n69n3
55091A04025J82N78J190J018j92r53j59J100J292O90M18M44J73J2N42J040N01
55074A11901n26p76k69L7P5M96J167J289Q32M37K21j38l92rP13R39N09m7l91n56
$$ plain form
55054 115512 115020 114748 114416 113570 112295 111180 110623 110695 111461 112703 113556 113319 112546 112382 112927 113264 113089 113159
55036 113159 113851 114335 113673 112069 110643 110398 111442 112775 112952 111517 109591 108492 108223 108068 108042 108630 109560
55019 109560 110160 110666 111834 113353 114045 113593 112817 112235 111662 111210 111349 111849 111986 111864 112244 113062 113489 113518
55001 113518 114012 115068 115900 116533 117947 120191 121948 122476 122466 122495 122183 121456 121079 121236 121074 120425 120491 121971
54983 121971 123892 125221 126289 127591 128469 128174 127230 126583 126258 125866 125665 126119 127022 127887 128643 129323 129724
54966 129724 129920 130317 130737 130322 128866 127287 126236 125265 123971 122908 122589 122654 122740 123210 124182 124872 124736 124426
54948 124426 124737 125486 126185 126926 127785 128273 128190 128142 128438 128462 127935 127712 128359 128971 128559 127632 127182 126999 126319 125420
54928 125420 125165 125414 125208 124250 123116 122263 121771 121708 121882 121608 120650 119929 120391 121533 121994 121241 119830 118359
$$ packed form
55054A15512m92k72l32q46j275j115n57P2P66J242Q53k37p73j64N45L37j75P0
55036A13159O92M84o62j604j426k45J044J333J77j435j926j099k69j55k6N88R30
55019A09560O00N06J168J519O92m52p76n82n73m52J39N00J37j22L80Q18M27K9
55001A13518M94J056Q32O33J414K244J757N28j0K9l12p27l77J57j62o49O6J480
54983A21971J921J329J068J302Q78k95r44o47l25l92k01M54R03Q65P56O80M01
54966A29724J96L97M20m15j456j579j051r71j294j063l19O5Q6M70R72O90j36l10
54948A24426L11P49O99P41Q59M88q3m8K96K4n27k23O47O12m12r27m50j83o80q99
54928A25420k55K49k06r58j134q53m92o3J74k74r58p21M62J142M61p53j411j471
$$ plain form
54910 118359 117072 116203 115858 115771 115798 116269 117210 117854 117703 117524 118311 119728 120594 120556 120321 120471 120974 121697 122584
54891 122584 123440 124196 125164 126406 127244 127097 126443 126203 126558 127080 127599 128079 128063 127185 126005 125434 125467 125347 124778
54872 124778 124208 123977 123977 124132 124536 125204 126159 127626 129606 131492 132689 133335 133884 134346 134547 134800 135552 136617
54854 136617 137459 138033 138630 139122 139084 138572 138110 137984 138093 138352 138759 139184 139543 140005 140663 141287 141844 142857 144780
54835 144780 147370 150164 153116 156250 159205 161821 164764 168816 173859 179235 184782 190831 197437 204210
54821 204210 210591 215774 218805 219450 218543 216817 213828 208841 202264 195311 188615 182137 176139 171152 167095
54806 167095 163340 159698 156534 153995 151909 150401 149750 149602 149154 148262 147674 147999 149013 150136 151090 152029
54790 152029 153371 155507 158378 161515 164786 168766 173885 179661 185441 191465 198351 205734 212348 217405
$$ packed form
54910A18359j287q69l45q7K7M71R41O44j51j79P87J417Q66l8k35J50N03P23Q87
54891A22584Q56P56R68J242Q38j47o54k40L55N22N19M80j6q78j180n71L3j20n69
54872A24778n70k31%J55M04O68R55J467J980J886J197O46N49M62K01K53P52J065
54854A36617Q42N74N97M92l8n12m62j26J09K59M07M25L59M62O58O24N57J013J923
54835A44780K590K794K952L134K955K616K943M052N043N376N547O049O606O773
54821B04210O381N183L031O45r07j726k989m987o577o953o696o478n998m987m057
54806A67095l755l642l164k539k086j508o51j48m48q92n88L25J014J123R54R39
54790A52029J342K136K871L137L271L980N119N776N780O024O886P383O614N057
$$ plain form
54776 217405 221028 223280 223639 221765 218129 213574 208642 203572 198550 193726 189088 184404 179248 173292
54762 173292 166775 160480 155006 150337 146328 143161 140914 139148 137456 136071 135350 135004 134455 133749 133452
54747 133452 133717 134056 133969 133365 132423 131445 130758 130435 130248 130137 130468 131462 132624 133112 132494 130975 129214 128080
54729 128080 128104 128890 129482 129544 129642 130185 130792 130990 130750 129926 128086 125495 123461 122976 123672 124676 125720 126761
54711 126761 127445 127789 128498 129718 130333 129528 128196 127715 128152 128840 129860 131518 133091 133629 133567 134036 135001
54694 135001 135539 135590 135873 136368 136492 136569 137500 138982 139722 139542 139659 140616 141565 141988 142689 144488 147309 151054
54676 151054 156114 162276 168266 173173 177585 182717 189189 197012 205842 214670 222144 227844 232578 236840
54662 236840 239589 239239 235478 229588 223169 216877 210350 203221 196133 190356 186203 182536 178401 174419
$$ packed form
54776B17405L623K252L59j874l636m555m932n070n022m824m638m684n156n956
54762A73292o517o295n474m669m009l167k247j766j692j385p21l46n49p06k97
54747A33452K65L39q7o04r42r78o87l23j87j11L31R94J162M88o18j519j761j134
54729A28080K4P86N92O2R8N43O07J98k40q24j840k591k034m85O96J004J044J041
54711A26761O84L44P09J220O15q05j332m81M37O88J020J658J573N38o2M69R65
54694A35001N38N1K83M95J24P7R31J482P40j80J17R57R49M23P01J799K821L745
54676A51054N060O162N990M907M412N132O472P823Q830Q828P474N700M734M262
54662B36840K749l50l761n890o419o292o527p129p088n777m153l667m135l982
$$ plain form
54648 174419 171591 169446 166744 163641 161565 160988 160847 160347 159890 159856 159859 159713 159941 160827 162095 163940 167178
54631 167178 171815 176667 181078 185857 191730 197944 203333 207870 212152 216037 218766 219980 219776 218103
54617 218103 214829 210198 204689 198670 192481 186497 180771 175075 169585 165034 161933 160080 158993 158175
54603 158175 156811 154065 150148 146395 143799 142055 140416 138799 137559 136795 136486 136800 137711 138681 139163 139149
54587 139149 138939 138766 138853 139334 139912 140093 139920 139909 140120 140054 139634 139512 140048 140741 141044 140981 140612 139615 137914 136070
54567 136070 134623 133685 133438 134187 135458 135966 135097 133708 132874 132653 132683 133142 134217 135346 135884 136020 136199
54550 136199 136125 135244 133808 132609 131943 131603 131563 131873 132104 131734 130938 130316 129992 129680 129472 129811 130697 131586 132113
54531 132113 132385 132507 132365 131967 131544 131199 130813 130376 130079 130003 129936 129667 129256 128925 128760 128651 128571 128829 129828 131472
$$ packed form
54648A74419k828k145k702l103k076n77j41n00m57l4Lj46K28Q86J268J845L238
54631A67178M637M852M411M779N873O214N389M537M282L885K729J214k04j673
54617B18103l274m631n509o019o189n984n726n696n490m551l101j853j087q18
54603A58175j364k746l917l753k596j744j639j617j240p64l09L14R11R70M82j4
54587A39149k10j73Q7M81N78J81j73j1K11o6m20j22N36O93L03o3l69r97j701j844
54567A36070j447r38k47P49J271N08q69j389q34k21L0M59J075J129N38J36J79
54550A36199p4q81j436j199o66l40m0L10K31l70p96o22l24l12k08L39Q86Q89N27
54531A32113K72J22j42l98m23l45l86m37k97p6o7k69m11l31j65j09q0K58R99J644
$$ plain form
54511 131472 133086 134146 134798 135340 135523 134958 133969 133340 133276 133274 133032 132811 132872 133240 134061 135373 136457 136280 134866
54492 134866 133472 133075 133425 133790 133830 133404 132414 131309 130953 131468 131910 131596 130958 130592 130340 130076 130543 132433
54474 132433 135141 137365 138644 139461 140132 140416 140115 139373 138369 137238 136269 135804 136013 136910 138345 139812
54458 139812 140730 141201 142017 143528 144987 145479 145020 144291 143729 143455 143714 144723 146216 147642 148690 149379 149831
54441 149831 150254 150845 151434 151498 150779 149624 148607 148150 148537 149725 150995 151443 151064 150665 150524 149911 148323
54424 148323 146341 144774 143717 143015 142854 143159 143096 142014 140465 139564 139714 140543 141609 142516 142828 142545 142325
54407 142325 142676 143318 143837 144329 144853 144815 143728 142152 141139 141105 141845 143147 144619 145388 144842 143472 142311
54390 142311 141828 141923 142561 143628 144560 144908 145059 145680 146661 147247 147027 146230 145283 144620 144637 145297 146131 147018 148480
$$ packed form
54511A31472J614J060O52N42J83n65r89o29o4kk42k21O1L68Q21J312J084j77j414
54492A34866j394l97L50L65M0m26r90j105l56N15M42l14o38l66k52k64M67J890
54474A32433K708K224J279Q17O71K84l01p42j004j131r69m65K09Q97J435J467
54458A39812R18M71Q16J511J459M92m59p29n62k74K59J009J493J426J048O89M52
54441A49831M23N91N89O4p19j155j017m57L87J188J270M48l79l99j41o13j588
54424A48323j982j567j057p02j61L05o3j082j549r01J50Q29J066R07L12k83k20
54407A42325L51O42N19M92N24l8j087j576j013l4P40J302J472P69n46j370j161
54390A42311m83R5O38J067R32L48J51O21R81N86k20p97r47o63J7O60Q34Q87J462
$$ plain form
54371 148480 150691 152855 154259 155308 156653 157878 158043 157168 156218 155858 156067 156646 157220 157008 155558 153590
54355 153590 152319 152092 152395 152851 153401 153782 153698 153349 152975 152168 150467 148389 146948 146342 146025 145792 145896 146256
54337 146256 146530 146788 147211 147320 146560 145500 145348 146336 147630 148739 149855 150756 150679 149581 148500 148267 148759
54320 148759 149627 150787 151886 152312 152137 152178 152672 152813 152164 151714 152775 155364 158301 160517 161746 162267 162478
54303 162478 162655 162798 162750 162499 162204 161939 161700 161578 161638 161720 161733 162001 162931 164513 166503 168755 170843 171775 170963
54284 170963 169275 168267 168394 168785 168745 168546 168642 169046 169779 171152 173234 175641 178087 180671 183386 185895
54268 185895 187978 189773 191490 193330 195594 198297 200715 201995 202245 202336 202589 202362 201049 198830 196279
54253 196279 193854 191845 190182 188211 185291 181737 178532 176133 174229 172643 171595 171022 170509 170052 170010
$$ packed form
54371A48480K211K164J404J049J345J225J65q75r50l60K09N79N74k12j450j968
54355A53590j271k27L03M56N50L81q4l49l74q07j701k078j441o06l17k33J04L60
54337A46256K74K58M23J09p60j060j52R88J294J109J116R01p7j098j081k33M92
54320A48759Q68J160J099M26j75M1M94J41o49m50J061K589K937K216J229N21K11
54303A62478J77J43m8k51k95k65k39j22O0Q2J3K68R30J582J990K252K088R32q12
54284A70963j688j008J27L91m0j99R6M04P33J373K082K407K446K584K715K509
54268A85895K083J795J717J840K264K703K418J280K50R1K53k27j313k219k551
54253A96279k425k009j663j971k920l554l205k399j904j586j048n73n13m57m2
$$ plain form
54238 170010 170096 169383 167688 166081 165571 165981 166567 167014 167343 167472 167380 167246 167068 166622 166028 165798 166058 166318 166281
54219 166281 166221 166248 165857 164620 162783 160844 159122 157949 157609 157727 157446 156554 155771 155513 155180 154246 153268 153090
54201 153090 153609 154137 154545 155297 156557 157925 158941 159405 159377 159232 159512 160414 161673 163115 164888 166833 168176
54184 168176 168307 167552 166721 166263 166228 166572 166970 166695 165380 163761 163077 163735 164959 165742 165755 165309 164780 164291
54166 164291 163892 163891 164676 166093 167276 167580 167493 168102 169707 171584 173053 174075 174709 174806 174566 174612 175119 175507
54148 175507 175393 175193 175322 175459 175233 175000 175196 175353 174566 172756 170808 169634 169627 170831 172873 174726 175241
54131 175241 174183 172453 171155 170715 170938 171580 172591 173843 174914 175303 174928 174207 173560 173047 172655 172607 172966
54114 172966 173223 172819 171937 171175 170570 169684 168577 167819 167391 166473 164733 163000 162157 162023 161941 161898 162370 163445
$$ packed form
54238A70010Q6p13j695j607n10M10N86M47L29J29r2j34j78m46n94k30K60K60l7
54219A66281o0K7l91j237j837j939j722j173l40J18k81q92p83k58l33r34r78j78
54201A53090N19N28M08P52J260J368J016M64k8j45K80R02J259J442J773J945J343
54184A68176J31p55q31m58l5L44L98k75j315j619o84O58J224P83J3m46n29m89
54166A64291l99jP85J417J183L04q7O09J605J877J469J022O34R7k40M6N07L88
54148A75507j14k00J29J37k26k33J96J57p87j810j948j174pJ204K042J853N15
54131A75241j058j730j298m40K23O42J011J252J071L89l75p21o47n13l92m8L59
54114A72966K57m04q82p62o05q86j107p58m28r18j740j733q43j34q2m3M72J075
$$ plain form
54096 163445 164713 165850 166752 167328 167592 167834 168277 168694 168673 168164 167554 167365 167986 169418 171026 171864 171570 170798
54078 170798 170533 171131 172163 172935 172993 172299 171141 169883 168763 167965 167626 167534 167165 166386 165794 165795 165752 164864 163604
54059 163604 163233 163960 164714 164894 165147 166016 166909 167069 166650 166159 165548 164600 163684 163435 164022 165174 166513 167558
54041 167558 167878 167587 167251 167148 167217 167762 169237 171115 172129 172117 172541 174514 177435 180316 183297 186815 190291
54024 190291 192949 195186 197880 200908 203583 206019 208761 211498 213524 215292 218088 222082 225876 228189
54010 228189 228985 228754 227637 225549 222471 218360 213326 207961 202929 198248 193545 188998 185387 183169 182094
53995 182094 181710 181745 181955 182082 182024 181723 181105 180438 180349 180923 181206 180333 178863 178151 178599 179395 179887 180326 181153
53976 181153 182311 183514 184671 185917 187570 189885 192365 193669 192900 190835 189135 188497 188346 188172 188210 188649
$$ packed form
54096A63445J268J137R02N76K64K42M43M17k1n09o10j89O21J432J608Q38k94p72
54078A70798k65N98J032P72N8o94j158j258j120p98l39r2l69p79n92Jm3q88j260
54059A63604l71P27P54J80K53Q69Q93J60m19m91o11r48r16k49N87J152J339J045
54041A67558L20k91l36j03O9N45J475J878J014j2M24J973K921K881K981L518L476
54024A90291K658K237K694L028K675K436K742K737K026J768K796L994L794K313
54010B28189P96k31j117k088l078m111n034n365n032m681m703m547l611k218j075
53995A82094l84L5K10J27n8l01o18o67q9N74K83q73j470p12M48P96M92M39Q27
53976A81153J158J203J157J246J653K315K480J304p69k065j700o38j51j74L8M39
$$ plain form
53960 188649 189117 189267 189254 189318 189384 189255 188865 188371 188331 189605 192431 195745 198098 199207 199987 201198 202900 205113
53942 205113 207963 211031 213500 215301 217360 220352 223956 227648 231498 235715 240017 243995 247729 251694
53928 251694 256340 261920 268213 274220 278752 281707 284252 287422 291025 294288 297034 299638 302164 304134
53914 304134 305035 304714 303416 301692 300082 298591 296659 293865 290466 286982 283439 279343 274340 268691 263166
53899 263166 258556 255182 252712 250482 248083 245641 243625 242449 242129 242156 241800 240773 239482 238481 237850
53884 237850 237415 237335 238051 239724 242224 245637 250357 256623 264299 273088 282472 291351 298185 301824 302070
53869 302070 299398 294364 287363 278735 269049 259388 251137 245122 240927 237404 233904 230744 228529 227408
53855 227408 227045 227023 227124 227377 227909 228695 229548 230403 231432 232743 234258 236062 238490 241587 244832 247840
$$ packed form
53960A88649M68J50j3O4O6j29l90m94m0J274K826L314K353J109P80J211J702K213
53942B05113K850L068K469J801K059K992L604L692L850M217M302L978L734L965
53928B51694M646N580O293O007M532K955K545L170L603L263K746K604K526J970
53914C04134R01l21j298j724j610j491j932k794l399l484l543m096n003n649n525
53899B63166m610l374k470k230k399k442k016j176l20K7l56j027j291j001o31
53884B37850m35q0P16J673K500L413M720O266P676Q789R384Q879O834L639K46
53869C02070k672n034p001q628r686r661q251o015m195l523l500l160k215j121
53855B27408l63k2J01K53N32P86Q53Q55J029J311J515J804K428L097L245L008
$$ plain form
53839 247840 250951 254633 258707 262780 267132 272403 278517 284599 289952 294483 298281 301474 304456 307550
53825 307550 310394 312398 313870 315947 319215 323091 326807 330340 334042 337988 342118 346576 351462 356474
53811 356474 361190 365598 370226 375775 382509 389732 396096 400825 404507 408208 411981 414840 416043 415646
53797 415646 413852 410741 406831 403108 400110 397536 394990 392409 389441 385172 379039 371542 363568 355480
53783 355480 347354 339613 332719 326449 320141 313685 307850 303432 300284 297304 293403 288451 283198 278291
53769 278291 273693 269241 265351 262587 260786 259195 257377 255352 253003 250132 247130 244766 243063 241126
53755 241126 238393 235321 232534 230020 227664 225873 225029 224757 224374 223780 223376 223297 223245 222919 222273 221424 220629
53738 220629 220246 220408 220776 220746 219895 218281 216500 215394 215398 216120 216822 217244 217645 218151 218616 219075 219772 220638 221277
$$ packed form
53839B47840L111L682M074M073M352N271O114O082N353M531L798L193K982L094
53825C07550K844K004J472K077L268L876L716L533L702L946M130M458M886N012
53811C56474M716M408M628N549O734P223O364M729L682L701L773K859J203l97
53797D15646j794l111l910l723k998k574k546k581k968m269o133p497p974q088
53783C55480q126p741o894o270o308o456n835m418l148k980l901m952n253m907
53769B78291m598m452l890k764j801j591j818k025k349k871l002k364j703j937
53755B41126k733l072k787k514k356j791q44k72l83n94m04p9n2l26o46q49p95
53738B20629l83J62L68l0q51j614j781j106MP22P02M22M01N06M65M59O97Q66O39
$$ plain form
53719 221277 221581 221811 222012 221920 221627 221723 222586 224040 225848 227923 229916 231334 232392 234080 236968 240551
53703 240551 244107 247568 251160 254822 258520 262540 267002 271611 276343 281744 287952 294041 298997 302886
53689 302886 306386 309640 312348 314592 316753 318784 320305 321289 321965 322213 321655 320284 318425 316169 313375
53674 313375 310116 306565 302573 297945 293056 288519 284286 279720 274661 269735 265448 261605 257958 254830
53660 254830 252564 250726 248441 245479 242521 240299 238871 237875 237067 236297 235270 233839 232450 231712 231405
53645 231405 230539 228700 226753 225659 225152 224271 222837 221553 220875 220698 221041 222096 223483 224387 224615 224732
53629 224732 225015 225226 225603 226908 229011 230513 230520 229902 229976 230766 231472 231973 232761 233823 234647 235186 235953 237262
53611 237262 239060 241319 243912 246327 248224 250095 252667 255841 258948 261874 265119 268779 272316 275449
$$ packed form
53719B21277L04K30K01r2k93R6Q63J454J808K075J993J418J058J688K888L583
53703B40551L556L461L592L662L698M020M462M609M732N401O208O089M956L889
53689C02886L500L254K708K244K161K031J521R84O76K48n58j371j859k256k794
53674C13375l259l551l992m628m889m537m233m566n059m926m287l843l647l128
53660B54830k266j838k285k962k958k222j428r96q08p70j027j431j389p38l07
53645B31405q66j839j947j094n07q81j434j284o78j77L43J055J387R04K28J17
53629B24732K83K11L77J305K103J502Po18P4P90P06N01P88J062Q24N39P67J309
53611B37262J798K259K593K415J897J871K572L174L107K926L245L660L537L133
$$ plain form
53597 275449 278518 281721 284570 286438 287295 287693 288274 289389 290960 292636 294246 295989 297996 299949 301458
53582 301458 302575 303559 304399 304983 305527 306261 306873 306897 306623 306906 307917 308696 308328 307187 306583 307268 308604 309259
53564 309259 308583 307216 306279 306187 306503 306759 306893 306782 305973 304292 302382 301176 301048 301739 302783 303594 303488
53547 303488 302222 300443 299299 299591 301400 304187 306989 308953 310113 311412 313608 316434 319129 321399
53533 321399 323411 325251 326946 328741 330752 332652 334215 335942 338531 341853 345012 347273 348468 348761
53519 348761 348676 349155 350890 353541 356122 358110 359715 361217 362643 364061 365581 367015 368053 368818 369827
53504 369827 371395 373460 375905 378600 381241 383624 386030 388840 391862 394524 396679 398687 400713 402465
53490 402465 403676 404382 404734 404935 405334 406094 406801 406883 406361 405747 405214 404429 403249 402071 401287 400761 400003 398633
$$ packed form
53597B75449L069L203K849J868Q57L98N81J115J571J676J610J743K007J953J509
53582C01458J117R84Q40N84N44P34O12K4k74K83J011P79l68j141o04O85J336O55
53564C09259o76j367r37r2L16K56J34j11q09j681j910j206j28O91J044Q11j06
53547C03488j266j779j144K92J809K787K802J964J160J299K196K826K695K270
53533C21399K012J840J695J795K011J900J563J727K589L322L159K261J195K93
53519C48761q5M79J735K651K581J988J605J502J426J418J520J434J038P65J009
53504C69827J568K065K445K695K641K383K406K810L022K662K155K008K026J752
53490D02465J211P06L52K01L99P60P07Q2n22o14n33p85j180j178p84n26p58j370
$$ plain form
53472 398633 396625 394273 391927 389618 387173 384805 383207 382765 383055 383446 383706 383551 382264 379593 376589
53457 376589 374641 373896 373447 372866 372578 372844 373401 374164 375347 376755 377764 378207 378517 378895 379136 379407 380325
53440 380325 381953 383506 384380 384833 385418 386425 388085 390603 393698 396741 399654 403025 407115 411449 415700
53425 415700 420246 425528 431532 438287 446158 455222 464905 474675 484538 494568 504580 514645 525253
53412 525253 536561 548184 560147 573266 587925 603246 618257 633287 649335 666508 684014
53401 684014 701463 719299 737971 757402 777238 797046 816269 834603 852471 870713 889683
53390 889683 908949 927854 946098 963795 981216 998460 1015314 1031610 1047751 1064466 1081782
53379 1081782 1098757 1114636 1129884 1145502 1161663 1177720 1193370 1209024 1224899 1240391 1254673
$$ packed form
53472C98633k008k352k346k309k445k368j598m42K90L91K60j55j287k671l004
53457C76589j948p45m49n81k88K66N57P63J183J408J009M43L10L78K41K71R18
53440C80325J628J553Q74M53N85J007J660K518L095L043K913L371M090M334M251
53425D15700M546N282O004O755P871R064R683R770R863J0030J0012J0065J0608
53412E25253J1308J1623J1963J3119J4659J5321J5011J5030J6048J7173J7506
53401F84014J7449J7836J8672J9431J9836J9808J9223J8334J7868J8242J8970
53390H89683J9266J8905J8244J7697J7421J7244J6854J6296J6141J6715J7316
53379A081782J6975J5879J5248J5618J6161J6057J5650J5654J5875J5492J4282
$$ plain form
53368 1254673 1267548 1279389 1290458 1300511 1308880 1314803 1317810 1318133 1316724 1314632 1312096 1308293 1302156
53355 1302156 1293495 1283100 1271790 1259755 1247082 1234426 1222500 1211080 1199140 1185999 1171784
53344 1171784 1156786 1141019 1124634 1108159 1092008 1076206 1060912 1046663 1033709 1021462 1009098
53333 1009098 996516 984428 973738 965035 958375 953252 948994 945440 943046 942164 942600 943982 946179 949116
53319 949116 952631 956860 962336 969361 977621 986699 996596 1007375 1018753 1030548 1043112 1056862 1071668
53306 1071668 1087240 1103782 1121677 1140828 1160925 1182163 1204966 1229177 1254259 1280366 1308437
53295 1308437 1339026 1371667 1405707 1441221 1478680 1518095 1558983 1600984 1644089 1688300 1733448
53284 1733448 1779416 1826243 1873773 1921332 1968026 2013454 2057991 2102254 2146353 2189682 2231353
$$ packed form
53368A254673J2875J1841J1069J0053Q369N923L007L23j409k092k536l803o137
53355A302156q661j0395j1310j2035j2673j2656j1926j1420j1940j3141j4215
53344A171784j4998j5767j6385j6475j6151j5802j5294j4249j2954j2247j2364
53333A009098j2582j2088j0690q703o660n123m258l554k394q82M36J382K197K937
53319I49116L515M229N476P025Q260R078R897J0779J1378J1795J2564J3750J4806
53306A071668J5572J6542J7895J9151K0097K1238K2803K4211K5082K6107K8071
53295A308437L0589L2641L4040L5514L7459L9415M0888M2001M3105M4211M5148
53284A733448M5968M6827M7530M7559M6694M5428M4537M4263M4099M3329M1671
$$ plain form
53273 2231353 2270713 2307577 2342132 2374533 2404414 2430922 2453438 2472118 2487456 2499481 2507802
53262 2507802 2512228 2512775 2509022 2500062 2485329 2465038 2439719 2409802 2375895 2338983 2299964 2259321
53250 2259321 2217395 2174608 2131177 2087023 2042328 1997895 1954713 1913416 1874215 1836899 1800743
53239 1800743 1764981 1729643 1695382 1662258 1629374 1596125 1563074 1531055 1500152 1470369 1442605
53228 1442605 1417839 1395667 1374664 1354144 1334627 1316628 1299995 1284583 1270621 1258027 1246038
53217 1246038 1233954 1221752 1209666 1197624 1185438 1173207 1161224 1149729 1138868 1128623 1118657
53206 1118657 1108591 1098612 1089474 1081767 1075519 1070619 1067235 1065553 1065436 1066568 1068721 1071690 1075290 1079625
53192 1079625 1085138 1092167 1100680 1110622 1122234 1135715 1150808 1167055 1184301 1202644 1222002 1242056
$$ packed form
53273B231353L9360L6864L4555L2401K9881K6508K2516J8680J5338J2025Q321
53262B507802M426N47l753q960j4733k0291k5319k9917l3907l6912l9019m0643
53250B259321m1926m2787m3431m4154m4695m4433m3182m1297l9201l7316l6156
53239A800743l5762l5338l4261l3124l2884l3249l3051l2019l0903k9783k7764
53228A442605k4766k2172k1003k0520j9517j7999j6633j5412j3962j2594j1989
53217A246038j2084j2202j2086j2042j2186j2231j1983j1495j0861j0245r966
53206A118657j0066r979r138p707o248m900l384j682j17J132K153K969L600M335
53192A079625N513P029Q513R942J1612J3481J5093J6247J7246J8343J9358K0054
$$ plain form
53180 1242056 1262576 1283437 1304296 1324567 1343762 1361681 1378193 1393163 1406662 1418913 1429745
53169 1429745 1438308 1443686 1445761 1445232 1442855 1438922 1433424 1426280 1417194 1405631 1391238 1374232 1355237
53156 1355237 1334891 1313767 1292405 1271038 1249349 1226785 1203157 1178762 1153975 1128995 1103959
53145 1103959 1079093 1054709 1031174 1008780 987529 967107 947312 928271 910026 892101 873849
53134 873849 855138 836276 817395 798350 779229 760569 743012 727067 713090 701037 690206
53123 690206 679659 669042 658753 649387 641336 634695 628942 622844 615338 606546 597318 587920 577953
53110 577953 567478 557123 546851 535671 523123 510119 497674 485694 473827 462747 453477 445809
53098 445809 438423 430519 422579 415519 409650 404451 398860 391827 383063 373283 363557 354538 346415 339159
$$ packed form
53180A242056K0520K0861K0859K0271J9195J7919J6512J4970J3499J2251J0832
53169A429745Q563N378K075n29k377l933n498p144r086j1563j4393j7006j8995
53156A355237k0346k1124k1362k1367k1689k2564k3628k4395k4787k4980k5036
53145A103959k4866k4384k3535k2394k1251k0422j9795j9041j8245j7925j8252
53134H73849j8711j8862j8881j9045j9121j8660j7557j5945j3977j2053j0831
53123F90206j0547j0617j0289r366q051o641n753o098p506q792r228r398r967
53110E77953j0475j0355j0272j1180j2548j3004j2445j1980j1867j1080r270p668
53098D45809p386p904p940p060n869n199n591p033q764r780r726r019q123p256
$$ plain form
53084 339159 332544 326269 320414 315392 311185 307180 303137 299693 297319 295395 293023 290302 287972 286222
53070 286222 284623 282951 281209 279088 276272 273148 270399 267988 265348 262542 260343 259128 258460 257963 257884
53055 257884 258527 259634 260598 260922 260406 259196 257663 256028 254292 252772 252155 252510 252721 251735 249953 248512
53039 248512 247506 246056 243935 241976 240762 240121 240061 241010 242735 244203 245062 246226 248338 250609 252011
53024 252011 252812 254028 255930 258009 259960 261747 263029 263451 263437 263881 264977 266014 266403 266295 266041 265558
53008 265558 264573 263204 262006 261476 261594 261805 261492 260585 259670 259382 259684 259826 259051 257267 255037 252972 251236
52991 251236 249735 248575 248004 247890 247670 247088 246548 246396 246232 245440 244106 242803 241731 240773 240243 240685 241831
52974 241831 242561 242232 241406 240941 240986 241191 241340 241297 240795 239803 238747 238011 237521 237192 237340 238137 238963 238901 237801
$$ packed form
53084C39159o615o275n855n022m207m005m043l444k374j924k372k721k330j750
53070B86222j599j672j742k121k816l124k749k411k640k806k199j215o68m97p9
53055B57884O43J107R64L24n16j210j533j635j736j520o17L55K11r86j782j441
53039B48512j006j450k121j959j214o41o0R49J725J468Q59J164K112K271J402
53024B52011Q01J216J902K079J951J787J282M22j4M44J096J037L89j08k54m83
53008B65558r85j369j198n30J18K11l13r07r15k88L02J42p75j784k230k065j736
52991B51236j501j160n71j14k20n82n40j52j64p92j334j303j072r58n30M42J146
52974B41831P30l29q26m65M5K05J49m3n02r92j056p36m90l29J48P97Q26o2j100
$$ plain form
52955 237801 236451 235728 235858 236385 236577 235979 234843 233982 233977 234677 235606 236641 237972 239539 240867 241493 241416 241179
52937 241179 241595 243167 245557 247712 248762 248749 248332 247941 247488 246804 246035 245497 245296 245225 244988 244478 243809 243191
52919 243191 242809 242794 243141 243648 244142 244773 245815 247019 247601 247208 246595 246868 248243 250035 251669 253081 254222
52902 254222 254925 255429 256407 258126 260019 261348 261895 261824 261276 260409 259522 258838 258392 258247 258590 259488 260828 262482
52884 262482 264203 265466 265974 266312 267363 268887 269497 268490 267009 266763 268129 270175 272082 273739 275190
52869 275190 276340 277221 277950 278380 278329 278210 278899 280792 283324 285540 286869 287217 286677 285437 283812 282123
52853 282123 280505 278918 277415 276275 275748 275599 275154 273976 272430 271298 270923 271037 271288 271486 271298 270261
52837 270261 268332 266082 264111 262583 261496 260985 261112 261623 262197 262650 262754 262252 261337 260732 260938 261677 262354
$$ packed form
52955B37801j350p23J30N27J92n98j136q61nP00R29J035J331J567J328O26p7k37
52937B41179M16J572K390K155J050j3m17l91m53o84p69n38k01p1k37n10o69o18
52919B43191l82j5L47N07M94O31J042J204N82l93o13K73J375J792J634J412J141
52902B54222P03N04R78J719J893J329N47p1n48q67q87o84m46j45L43Q98J340J654
52884B62482J721J263N08L38J051J524O10j007j481k46J366K046J907J657J451
52869B75190J150Q81P29M30n1j19O89J893K532K216J329L48n40j240j625j689
52853B82123j618j587j503j140n27j49m45j178j546j132l75J14K51J98j88j037
52837B70261j929k250j971j528j087n11J27N11N74M53J04n02r15o05K06P39O77
$$ plain form
52820 262354 262781 263063 263075 262485 261239 259714 258508 258234 259210 261025 262691 263576 264059 264873 266007 266675 266325
52803 266325 265286 264299 263673 263051 262010 260750 260003 260138 260639 260846 260974 261764 263205 264415 265025 265889 267939
52786 267939 270976 274065 276534 277947 277761 275914 273491 271915 271441 271079 269995 268469 267463 267774 269611
52771 269611 272510 275557 278009 279746 281059 282231 283556 285312 287237 288334 287762 285742 283139 280468
52757 280468 277873 275752 274538 273893 272880 271014 268564 265850 262904 259904 257231 254927 252687 250543
52743 250543 248941 247939 246950 245548 244022 242770 241678 240453 239196 238296 238064 238738 240486 243030 245562
52728 245562 247391 248522 249384 250220 250979 251537 251767 251562 251083 250816 251186 252266 253976 256232 258673 260566
52712 260566 261430 261607 261800 262126 262043 261177 259775 258165 256149 253317 249838 246552 244120 242313 240378 238072
$$ packed form
52820B62354M27K82J2n90j246j525j206k74R76J815J666Q85M83Q14J134O68l50
52803B66325j039r87o26o22j041j260p47J35N01K07J28P90J441J210O10Q64K050
52786B67939L037L089K469J413j86j847k423j576m74l62j084j526j006L11J837
52771B69611K899L047K452J737J313J172J325J756J925J097n72k020k603k671
52757B80468k595k121j214o45j013j866k450k714k946l000k673k304k240k144
52743B50543j602j002r89j402j526j252j092j225j257r00k32O74J748K544K532
52728B45562J829J131Q62Q36P59N58K30k05m79k67L70J080J710K256K441J893
52712B60566Q64J77J93L26q3q66j402j610k016k832l479l286k432j807j935k306
$$ plain form
52696 238072 236038 235071 235203 235712 235896 235642 235280 235152 235354 235754 236140 236394 236535 236596 236543 236394 236328 236541 237044
52677 237044 237710 238486 239464 240814 242605 244552 245970 246286 245745 245250 245299 245437 245054 244303 243726 243277 242398 240981
52659 240981 239595 238691 238182 237917 238018 238486 238965 239239 239562 240194 240960 241721 242965 245439 249146 253124 256345
52642 256345 258619 260478 262279 263707 264255 264026 263696 263595 263282 262418 261727 262441 264742 267427 269260 270141
52626 270141 270655 271027 271077 270849 270651 270505 270070 269188 268118 267120 266116 264982 263962 263519 263785 264373 264804 264990
52608 264990 265204 265613 266005 266095 265947 265904 266139 266475 266696 266863 267181 267642 267960 267901 267614 267553 268008 268711 269007 268461
52588 268461 267233 265848 264761 264263 264530 265475 266572 267178 267095 266677 266342 266177 266028 265778 265420 264999 264576 264137
52570 264137 263542 262710 261905 261610 261988 262566 262657 262046 261141 260498 260347 260660 261535 263240 265735 268383 270507 272237
$$ packed form
52696B38072k034r67J32N09J84k54l62j28K02M00L86K54J41O1n3j49o6K13N03
52677B37044O66P76R78J350J791J947J418L16n41m95M9J38l83p51n77m49q79j417
52659B40981j386r04n09k65J01M68M79K74L23O32P66P61J244K474L707L978L221
52642B56345K274J859J801J428N48k29l30j01l13q64o91P14K301K685J833Q81
52626B70141N14L72N0k28j98j46m35q82j070r98j004j134j020m43K66N88M31J86
52608B64990K14M09L92R0j48m3K35L36K21J67L18M61L18n9k87o1M55P03K96n46
52588B68461j228j385j087m98K67R45J097O06q3m18l35j65j49k50l58m21m23m39
52570B64137n95q32q05k95L78N78R1o11r05o43j51L13Q75J705K495K648K124J730
$$ plain form
52552 272237 274415 277411 280383 282083 282179 281406 280556 279870 279344 278977 278440 277072 274728 272356 271185 271433
52536 271433 272257 272954 273697 274932 276512 277864 278855 280005 281806 284152 286531 288465 289595 289630 288633 287196
52520 287196 285912 284676 282927 280603 278446 277113 276414 275746 275002 274587 274665 274879 274840 274504 273913 272901 271352
52503 271352 269670 268683 268902 269919 270694 270560 269835 269320 269345 269576 269741 270092 270951 272137 273160 273806 274314 275073
52485 275073 276337 278044 279740 280817 281071 280863 280615 280401 280244 280439 281124 281737 281411 279961 278147 276920
52469 276920 276669 277125 277684 277768 277155 276095 275049 274352 274109 274138 273856 272586 270380 268310 267493 267939 268725 269148
52451 269148 269184 268960 268441 267795 267503 267851 268596 269360 270091 270913 271742 272302 272422 272175 271753 271251 270590 269722 268927
52432 268927 268701 269230 270188 271202 272240 273312 274139 274558 274935 275698 276589 276963 276737 276526 276829 277634 278864
$$ packed form
52552B72237K178K996K972J700R6p73q50o86n26l67n37j368k344k372j171K48
52536B71433Q24O97P43J235J580J352R91J150J801K346K379J934J130L5r97j437
52520B87196j284j236j749k324k157j333o99o68p44m15P8K14l9l36n91j012j549
52503B71352j682r87K19J017P75j34p25n15K5K31J65L51Q59J186J023O46N08P59
52485B75073J264J707J696J077K54k08k48k14j57J95O85O13l26j450j814j227
52469B76920k51M56N59Q4o13j060j046o97k43K9k82j270k206k070q17M46P86M23
52451B69148L6k24n19o46k92L48P45P64P31Q22Q29N60J20k47m22n02o61q68p95
52432B68927k26N29R58J014J038J072Q27M19L77P63Q91L74k26k11L03Q05J230
$$ plain form
52415 278864 280694 283211 286085 288746 290738 291977 292930 294338 296393 298350 299347 299371 298866 297698 295345
52400 295345 292072 289007 286891 285499 284475 283889 283645 283102 281807 280058 278300 276567 274945 273971 273967 274453
52384 274453 274835 275297 276375 277918 279098 279361 278859 278048 277296 276833 276749 277026 277764 279175 281196 283334 285195
52367 285195 286901 288762 290789 292860 295057 297465 299843 301824 303280 304197 304429 303916 302894 301528 299554
52352 299554 296697 293317 290184 287710 285709 283808 281768 279527 277282 275472 274369 273794 273479 273537 274206
52337 274206 275251 276042 276207 275837 275115 274143 273149 272475 272163 271869 271367 270949 271184 272257 273605 274261 273708 272477
52319 272477 271764 272329 273893 275688 277330 278919 280529 282040 283472 285118 287204 289605 292034 294453 297284
52304 297284 301212 306694 313606 321308 328930 335459 339766 341104 339738 336807 333310 329467 325151 320566
$$ packed form
52415B78864J830K517K874K661J992J239R53J408K055J957R97K4n05j168k353
52400B95345l273l065k116j392j024n86k44n43j295j749j758j733j622r74mM86
52384B74453L82M62J078J543J180K63n02q11p52m63q4K77P38J411K021K138J861
52367B85195J706J861K027K071K197K408K378J981J456R17K32n13j022j366j974
52352B99554k857l380l133k474k001j901k040k241k245j810j103n75l15N8O69
52337B74206J045P91J65l70p22r72r94o74l12k94n02m18K35J073J348O56n53j231
52319B72477p13N65J564J795J642J589J610J511J432J646K086K401K429K419K831
52304B97284L928N482O912P702P622O529M307J338j366k931l497l843m316m585
$$ plain form
52290 320566 316239 312632 310028 308488 307626 306725 305480 304386 304025 304164 304002 303155 302024 301239 301160 301818 302967
52273 302967 304198 305395 307014 309562 312812 315904 318319 320381 322662 325202 327490 329053 329880 330367 330981
52258 330981 331973 333349 334987 336611 337724 337884 337307 336969 337843 340106 343255 346724 350073 352758 354280
52243 354280 354635 354344 353935 353666 353784 354695 356645 359363 362264 365019 367845 371186 375165 379456 383794 388454
52227 388454 394025 400761 408426 416771 425744 435084 444165 452635 460915 469667 478905 488053 496805 505552
52213 505552 514927 525251 536497 548563 561446 575244 590061 605901 622686 640320 658614 677189
52201 677189 695749 714490 733974 754400 775278 795898 815829 834835 852716 869511 885496
52190 885496 900682 914635 927056 938096 947685 955113 959984 963208 966243 969378 971571 972019 971226 970266
$$ packed form
52290C20566m327l607k604j540q62r01j245j094l61J39j62q47j131p85p9O58J149
52273C02967J231J197J619K548L250L092K415K062K281K540K288J563Q27M87O14
52258C30981R92J376J638J624J113J60n77l38Q74K263L149L469L349K685J522
52243C54280L55k91m09k69J18R11J950K718K901K755K826L341L979M291M338M660
52227C88454N571O736P665Q345Q973R340R081Q470Q280Q752R238R148Q752Q747
52213E05552R375J0324J1246J2066J2883J3798J4817J5840J6785J7634J8294J8575
52201F77189J8560J8741J9484K0426K0878K0620J9931J9006J7881J6795J5985
52190H85496J5186J3953J2421J1040R589P428M871L224L035L135K193M48p93r60
$$ plain form
52176 970266 969619 969019 968036 966496 964598 962809 961455 960366 959131 957654 956065 954150 951461 948220 945619
52161 945619 944811 945925 948474 952459 958513 966909 976881 987225 997482 1008274 1020425 1033931 1047980
52148 1047980 1061892 1075652 1089435 1102968 1115730 1127499 1138324 1148088 1156567 1163896 1170531 1176581
52136 1176581 1181525 1184750 1186158 1186110 1184979 1182976 1180249 1176917 1172959 1168156 1162197 1154954 1146684 1137860
52122 1137860 1128712 1119050 1108653 1097773 1087108 1077293 1068489 1060387 1052537 1044768 1037308 1030416 1023938
52109 1023938 1017568 1011532 1006529 1002737 999363 995615 991802 988974 987704 987772 988928 991373 995426 1001102
52095 1001102 1008056 1015581 1022637 1028293 1032304 1035025 1036772 1037542 1037332 1036375 1034945 1033154 1030971 1028260 1024839
52080 1024839 1020761 1016481 1012504 1008900 1005362 1001663 997835 994032 990489 987441 984838 982322 979780 977579
$$ packed form
52176I70266o47o00r83j540j898j789j354j089j235j477j589j915k689l241k601
52161I45619q08J114K549L985O054Q396R972J0344J0257J0792J2151J3506J4049
52148A047980J3912J3760J3783J3533J2762J1769J0825R764Q479P329O635O050
52136A176581M944L225J408m8j131k003k727l332l958m803n959p243q270q824
52122A137860r148r662j0397j0880j0665r815q804q102p850p769p460o892o478
52109A023938o370o036n003l792l374l748l813k828j270O8J156K445M053N676
52095A001102O954P525P056N656M011K721J747P70k10r57j430j791k183k711l421
52080A024839m078m280l977l604l538l699l828l803l543l048k603k516k542k201
$$ plain form
52066 977579 975829 973834 970958 967813 965762 965184 965104 964717 964468 965121 966476 967582 967892 967610 967117 966573 966100
52049 966100 965948 966301 967114 968251 969701 971534 973564 975167 975695 975114 973998 972850 971800 971105 971363 972722
52033 972722 974309 975128 975305 975862 977507 980374 984713 990904 998687 1007211 1016052 1025506 1035718 1046279
52019 1046279 1056983 1068271 1080554 1093661 1107358 1121801 1137018 1152435 1167475 1182331 1197706
52008 1197706 1213981 1230938 1248058 1264968 1281846 1299441 1318263 1337669 1356306 1373549 1389805
51997 1389805 1405200 1418872 1430090 1439333 1447561 1454982 1461239 1466296 1470284 1472865 1473684 1473301 1472757 1472172
51983 1472172 1470488 1466769 1461162 1454424 1447039 1439066 1430411 1421012 1410900 1400270 1389388 1378466 1367747
51970 1367747 1357611 1348385 1340110 1332670 1326092 1320593 1316530 1314418 1314703 1317225 1321183 1326002 1332017 1339913
$$ packed form
52066I77579j750j995k876l145k051n78q0l87k49O53J355J106L10k82m93n44m73
52049I66100j52L53Q13J137J450J833K030J603N28n81j116j148j050o95K58J359
52033I72722J587Q19J77N57J645K867M339O191P783Q524Q841R454J0212J0561
52019A046279J0704J1288J2283J3107J3697J4443J5217J5417J5040J4856J5375
52008A197706J6275J6957J7120J6910J6878J7595J8822J9406J8637J7243J6256
51997A389805J5395J3672J1218R243Q228P421O257N057L988K581Q19l83n44n85
51983A472172j684l719n607o738p385p973q655r399j0112j0630j0882j0922j0719
51970A367747j0136r226q275p440o578n499m063k112K85K522L958M819O015P896
$$ plain form
51956 1339913 1349641 1360354 1371189 1381664 1391396 1400078 1407905 1415504 1423165 1430422 1436648 1441886 1446826
51943 1446826 1452022 1457299 1461991 1465665 1468496 1470810 1472397 1472606 1471174 1468617 1465524 1461715 1456380 1448880
51929 1448880 1439116 1427336 1413949 1399490 1384450 1369079 1353499 1337887 1322303 1306524 1290366
51918 1290366 1274121 1258349 1243274 1228677 1214374 1200481 1187134 1174214 1161450 1148633 1135611
51907 1135611 1122195 1108172 1093440 1078188 1062893 1047965 1033371 1018823 1004404 990664 977861
51896 977861 965460 952699 939377 925646 911231 895417 877837 858867 839163 819118 798862
51885 798862 778517 758333 738719 720083 702481 685521 668910 652974 638335 625223 613554
51874 613554 603562 595721 589862 585035 580580 576894 574696 573888 573729 573837 574345 575006 574870 573225 570455 567509
$$ packed form
51956A339913R728J0713J0835J0475R732Q682P827P599P661P257O226N238M940
51943A446826N196N277M692L674K831K314J587K09j432k557l093l809n335p500
51929A448880r764j1780j3387j4459j5040j5371j5580j5612j5584j5779j6158
51918A290366j6245j5772j5075j4597j4303j3893j3347j2920j2764j2817j3022
51907A135611j3416j4023j4732j5252j5295j4928j4594j4548j4419j3740j2803
51896I77861j2401j2761j3322j3731j4415j5814j7580j8970j9704k0045k0256
51885G98862k0345k0184j9614j8636j7602j6960j6611j5936j4639j3112j1669
51874F13554r992p841n859m827m455l686k198q08j59J08N08O61j36j645k770k946
$$ plain form
51858 567509 564794 562082 559437 557666 557578 559138 561702 564985 569495 576044 585050 596346 609578 624839
51844 624839 643007 665231 691792 721452 752083 781807 809230 832687 849863 858582 858072 849552
51832 849552 835732 819437 802162 783703 763419 741771 720287 700044 680784 661699 642565
51821 642565 623745 605550 588071 571461 555968 541809 529250 518636 510059 503191 497678 493532
51809 493532 490855 489366 488496 487811 487090 486116 484622 482321 478839 473824 467352 459990 452299 444490 436748
51794 436748 429487 422969 416984 411309 406235 402251 399514 398040 398097 399866 402935 406767 411486 417560 424769
51779 424769 432197 439393 446870 455195 464020 472244 478810 483122 485110 485240 484288 482834 481025 478882 476660
51764 476660 474829 473793 473694 474331 475256 476022 476369 476145 475255 473877 472480 471188 469250 465521 459611 452282
$$ packed form
51858E67509k715k712k645j771q8J560K564L283M510O549R006J1296J3232J5261
51844F24839J8168K2224K6561K9660L0631K9724K7423K3457J7176Q719n10q520
51832H49552j3820j6295j7275j8459k0284k1648k1484k0243j9260j9085j9134
51821F42565j8820j8195j7479j6610j5493j4159j2559j0614q577o868n513m146
51809D93532k677j489q70o85p21r74j494k301l482n015o472p362p691p809p742
51794D36748p261o518n985n675n074l984k737j474N7J769L069L832M719O074P209
51779D24769P428P196P477Q325Q825Q224O566M312J988J30r52j454j809k143k222
51764D76660j831j036r9O37R25P66L47k24q90j378j397j292j938l729n910p329
$$ plain form
51748 452282 444694 437496 430618 423560 415891 407789 400250 394448 390759 388597 387248 386602 386892 388017 389363
51733 389363 390296 390708 391052 391814 392952 393977 394618 395099 395629 395931 395681 395211 395335 396500 398474 400709 402587
51716 402587 403414 402788 401159 399527 398388 397329 395793 393871 392140 391065 390786 391149 391723 392057 392217 392825
51700 392825 394331 396449 398537 400322 401975 403668 405350 406881 408112 408872 409142 409244 409634 410423 411244 411660
51684 411660 411564 411105 410324 409145 407782 406934 407265 408776 411039 414075 418501 424527 431211 437193 441910 445569
51668 445569 448146 449184 448678 447390 445892 443739 440124 435076 429588 424611 420340 416472 412817 409502
51654 409502 406710 404399 402300 400144 397875 395623 393570 391863 390588 389699 389051 388570 388269 387995 387401 386476
51638 386476 385932 386667 388803 391610 394403 397114 399916 402718 405362 407974 410723 413335 415227 416243 417054
$$ packed form
51748D52282p588p198o878p058p669q102p539n802l689k162j349o46K90J125J346
51733C89363R33M12L44P62J138J025O41M81N30L02k50m70J24J165J974K235J878
51716D02587Q27o26j629j632j139j059j536j922j731j075k79L63N74L34J60O08
51700C92825J506K118K088J785J653J693J682J531J231P60K70J02L90P89Q21M16
51684D11660r6m59p81j179j363q48L31J511K263L036M426O026O684N982M717L659
51668D45569K577J038n06j288j498k153l615n048n488m977m271l868l655l315
51654D09502k792k311k099k156k269k252k053j707j275q89o48m81l01k74n94r25
51638C86476n44P35K136K807K793K711K802K802K644K612K749K612J892J016Q11
$$ plain form
51623 417054 418685 421658 425600 429630 433023 435482 436894 437098 436086 434274 432367 430920 430136 429924 429995
51608 429995 429979 429741 429523 429585 429775 429753 429529 429397 429232 428307 426142 423340 421232 420688 421427 422525 423344 423826
51590 423826 423914 423042 420512 416408 411822 407985 405300 403389 401860 400740 400145 399846 399317 398213 396759 395560
51574 395560 394920 394462 393662 392684 392231 392613 393540 395054 397927 402679 408762 415394 422683 431032 439690 446850
51558 446850 451270 453072 452908 451211 448498 445729 443843 443286 444143 446331 449472 452993 456532 459909 462656
51543 462656 464052 463740 461780 457998 451863 443400 433702 424159 415410 407322 399644 392412 386013 381003
51529 381003 377611 375294 373242 371446 370740 371537 372986 373780 373392 372182 370664 369095 367467 365511 362907
51514 362907 359784 356767 354332 352463 351127 350618 351081 352174 353634 355704 358470 361216 363148 364516 366363
$$ packed form
51623D17054J631K973L942M030L393K459J412K04j012j812j907j447p84k12P1
51608D29995j6k38k18O2J90k2k24j32j65r25k165k802k108n44P39J098Q19M82
51590D23826Q8q72k530m104m586l837k685j911j529j120n95k99n29j104j454j199
51574C95560o40m58q00r78m53L82R27J514K873M752O083O632P289Q349Q658P160
51558D46850M420J802j64j697k713k769j886n57Q57K188L141L521L539L377K747
51543D62656J396l12j960l782o135q463r698r543q749q088p678p232o399n010
51529C81003l392k317k052j796p06P97J449P94l88j210j518j569j628j956k604
51514C62907l123l017k435j869j336n09M63J093J460K070K766K746J932J368J847
$$ plain form
51499 366363 369269 373056 377629 383445 390879 399642 409036 418475 427608 436075 443241 448069 449522 447467
51485 447467 443185 438664 435371 433828 434052 435822 438618 441965 446111 451902 459739 469033 478996 489576
51471 489576 501105 513168 524419 533645 540695 546223 550890 555098 559341 564374 571108 580658 594359
51458 594359 613121 636444 662412 689024 715195 740295 763309 783153 799504 812495 821684 826179
51446 826179 825853 821628 814248 803485 788873 770593 749170 724976 698604 671346 644687 619542
51434 619542 596296 575156 555991 538276 521819 507226 495061 484786 475212 465862 457199 449516
51422 449516 442313 434970 427539 420642 414847 410339 406969 404454 402605 401368 400595 400005 399475 399122 398825
51407 398825 397929 395919 393262 391237 390879 392296 394761 397076 398087 397480 396225 395760 396561 397737 398120 397484
$$ packed form
51499C66363K906L787M573N816P434Q763R394R439R133Q467P166M828J453k055
51485D47467m282m521l293j543K24J770K796L347M146N791P837R294R963J0580
51471D89576J1529J2063J1251R226P050N528M667M208M243N033O734R550J3701
51458E94359J8762K3323K5968K6612K6171K5100K3014J9844J6351J2991R189M495
51446H26179l26m225p380j0763j4612j8280k1423k4194k6372k7258k6659k5145
51434F19542k3246k1140j9165j7715j6457j4593j2165j0275r574r350q663p683
51422D49516p203p343p431o897n795m508l370k515j849j237p73n90n30l53k97
51407C98825q96k010k657k025l58J417K465K315J011o07j255m65Q01J176L83o36
$$ plain form
51391 397484 396587 396351 397131 398615 400244 401712 403030 404062 404194 402717 399485 395016 390006 384965 380254
51376 380254 376232 373244 371490 370807 370523 369755 368092 365905 363810 362029 360388 358692 356819 354670 352429
51361 352429 350705 350011 350169 350600 351127 352131 353894 356207 358748 361569 365030 369352 374364 379746 385653
51346 385653 392964 402528 414000 425846 436751 446583 455555 463065 468172 470959 472521 473580 473955 473497
51332 473497 472594 471246 468372 462731 454261 444009 433046 421993 411369 401730 393344 386162 380287
51319 380287 376142 373904 372949 372124 370627 368564 366677 365645 365593 366142 366814 367429 368177 369293 370708 372175
51303 372175 373807 376197 379727 383964 388101 391917 395908 400548 405864 411728 418004 424291 430128 435707
51289 435707 441887 449155 457092 465243 474030 484352 496696 511185 528039 547401 568938 592280
$$ packed form
51391C97484q97k36P80J484J629J468J318J032J32j477l232m469n010n041m711
51376C80254m022k988j754o83k84p68j663k187k095j781j641j696j873k149k241
51361C52429j724o94J58M31N27J004J763K313K541K821L461M322N012N382N907
51346C85653P311R564J1472J1846J0905R832Q972P510N107K787J562J059L75m58
51332D73497r03j348k874n641q470j0252j0963j1053j0624r639q386p182n875
51319C80287m145k238r55q25j497k063j887j032n2N49O72O15P48J116J415J467
51303C72175J632K390L530M237M137L816L991M640N316N864O276O287N837N579
51289D35707O180P268P937Q151Q787J0322J2344J4489J6854J9362K1537K3342
$$ plain form
51277 592280 617689 645839 677082 711311 748046 785898 822083 853305 877352 893557 902041 903173
51265 903173 897652 886316 869644 847801 821181 790538 756794 721198 685441 650917 618021 586832
51253 586832 558258 533574 512890 495058 479235 465596 454298 444782 436577 429875 424635 419861
51241 419861 414493 408541 402685 397167 391705 386173 380797 375854 371635 368444 366208 364291 362056 359411
51227 359411 356538 353479 350405 347931 346628 346357 346532 346844 347353 348068 348900 349953 351447 353403 355712 358432
51211 358432 361660 365158 368357 370710 371946 372201 372122 372480 373311 373691 372841 371259 370197 370092 370081 369207 367568
51194 367568 366030 365173 364852 364689 364602 364760 365149 365449 365523 365980 367887 371665 376432 380760 384017 386698 389487
51177 389487 392393 394983 397111 399030 400811 401977 401904 400515 398417 396398 394912 394044 393757 394017 394769 395922
$$ packed form
51277E92280K5409K8150L1243L4229L6735L7852L6185L1222K4047J6205Q484J132
51265I03173n521j1336j6672k1843k6620l0643l3744l5596l5757l4524l2896l1189
51253E86832k8574k4684k0684j7832j5823j3639j1298r516q205o702n240m774
51241D19861n368n952n856n518n462n532n376m943m219l191k236j917k235k645
51227C59411k873l059l074k474j303k71J75L12N09P15Q32J053J494J956K309K720
51211C58432L228L498L199K353J236K55p9L58Q31L80q50j582j062j05j1q74j639
51194C67568j538q57l21j63q7J58L89L00P4M57J907L778M767M328L257K681K789
51177C89487K906K590K128J919J781J166p3j389k098k019j486q68k87K60P52J153
$$ plain form
51161 395922 397278 398392 398653 397736 395980 394142 392767 391822 390828 389293 387201 385257 384362 384559 384695 383547
51145 383547 381161 378690 377034 376173 375800 375944 376658 377570 378051 377648 376192 373831 371172 369121 368262 368504
51129 368504 369388 370467 371305 371412 370549 368969 367209 365708 364654 364025 363735 363805 364381 365447 366741 368260
51113 368260 370604 374270 378727 382830 386251 389774 393984 398367 402147 405318 408285 410893 412539 413070
51099 413070 413018 412999 413243 413619 413715 412992 411204 408732 406305 404458 403384 403116 403593 404564 405627 406349 406407 405822
51081 405822 405117 404924 405255 405400 404750 403499 402346 401689 401241 400265 398121 394812 391056 387625 384707 382220
51065 382220 380534 380159 380685 380901 380342 380059 381346 384179 387364 389704 390616 390154 389064 388449 388808 389666 390479
51048 390479 391392 392608 393659 394028 394075 394549 395482 396277 396577 396292 395103 392895 390535 389244 389136 389233 388955
$$ packed form
51161C95922J356J114K61r17j756j838j375r45r94j535k092j944q95J97J36j148
51145C83547k386k471j656q61l73J44P14R12M81m03j456k361k659k051q59K42
51129C68504Q84J079Q38J07q63j580j760j501j054o29k90P0N76J066J294J519
51113C68260K344L666M457M103L421L523M210M383L780L171K967K608J646N31
51099D13070n2j9K44L76R6p23j788k472k427j847j074k68M77R71J063P22N8n85
51081D05822p05j93L31J45o50j251j153o57m48r76k144l309l756l431k918k487
51065C82220j686l75N26K16n59k83J287K833L185K340R12m62j090o15L59Q58Q13
51048C90479R13J216J051L69M7M74R33P95L00k85j189k208k360j291j08R7k78
$$ plain form
51031 388955 388772 389190 389945 390536 390949 391531 392639 394626 397648 401205 404285 406205 407084 407482 407935 408768 409847
51014 409847 410560 410585 410619 411678 413674 415419 416150 416244 416236 416016 415495 415272 415987 417504 419341 421486 424177 427202
50996 427202 429970 432086 433388 433723 433220 432631 432866 434207 436322 438892 441852 445055 448098 450503 451917
50981 451917 452290 452080 452060 452621 453431 454050 454621 455527 456614 457389 457960 459210 461747 465159 468606 471947 475959
50964 475959 481611 489405 499348 511193 524545 538882 553738 568936 584518 600344 615726 629533
50952 629533 640717 648760 653773 656310 657088 656738 655686 654268 652814 651471 649922 647439 643416 637842
50938 637842 631313 624606 618216 612147 606146 600194 594796 590685 588167 586754 585379 583033 579390 575017
50924 575017 570948 567931 566127 565547 566496 569337 573968 579889 586769 594598 603227 612108 620631 628487 635612
$$ packed form
51031C88955j83M18P55N91M13N82J108J987L022L557L080J920Q79L98M53Q33J079
51014D09847P13K5L4J059J996J745P31R4qk20n21k23P15J517J837K145K691L025
50996D27202K768K116J302L35n03n89K35J341K115K570K960L203L043K405J414
50981D51917L73k10k0N61Q10O19N71R06J087P75N71J250K537L412L447L341M012
50964D75959N652P794R943J1845J3352J4337J4856J5198J5582J5826J5382J3807
50952F29533J1184Q043N013K537P78l50j052j418j454j343j549k483m023n574
50938F37842o529o707o390o069o001n952n398m111k518j413j375k346l643m373
50924E75017m069l017j804n80R49K841M631N921O880P829Q629Q881Q523P856P125
$$ plain form
50909 635612 641937 647352 651742 654976 656940 657702 657541 656798 655719 654408 652782 650657 648084 645592 643867
50894 643867 643202 643472 644651 647082 651155 656868 663736 671055 678352 685840 694366 704694 716919 730783
50880 730783 746356 763914 783311 804001 825681 848282 871332 894100 916726 940566 967010
50869 967010 996504 1029198 1065863 1107343 1153498 1203509 1257108 1314674 1376039 1439922 1504809
50858 1504809 1569924 1635068 1699894 1763533 1824577 1881198 1931650 1975059 2011656 2042065 2066433
50847 2066433 2084405 2095837 2101341 2102114 2099415 2094291 2087740 2080832 2074294 2067887 2060480 2050951 2038805
50834 2038805 2023879 2005993 1985415 1963330 1940978 1918184 1893310 1864823 1832383 1796282 1756520
50823 1756520 1713055 1666511 1617993 1568266 1517646 1466605 1416035 1366835 1319590 1274668 1232314
$$ packed form
50909F35612O325N415M390L234J964P62j61p43j079j311j626k125k573k492j725
50894F43867o65K70J179K431M073N713O868P319P297P488Q526J0328J2225J3864
50880G30783J5573J7558J9397K0690K1680K2601K3050K2768K2626K3840K6444
50869I67010K9494L2694L6665M1480M6155N0011N3599N7566O1365O3883O4887
50858A504809O5115O5144O4826O3639O1044N6621N0452M3409L6597L0409K4368
50847B066433J7972J1432N504P73k699n124o551o908o538o407p407r529j2146
50834B038805j4926j7886k0578k2085k2352k2794k4874k8487l2440l6101l9762
50823A756520m3465m6544m8518m9727n0620n1041n0570m9200m7245m4922m2354
$$ plain form
50812 1232314 1192585 1155395 1120681 1088324 1057979 1029347 1002649 978522 957285 938540 921562
50801 921562 905870 891320 877948 865873 855254 846206 838875 833434 829704 826835 823885 820889 818860
$$ packed form
50812A232314l9729l7190l4714l2357l0345k8632k6698k4127k1237j8745j6978
50801I21562j5692j4550j3372j2075j0619r048p331n441l730k869k950k996k029
$$ [...]
##END NTUPLES=NMR SPECTRUM
##END=
