##TITLE=AC1544_ROEFFECT0012_8215172_bp29KGnp56
##JCAMPDX= 6.0         $$ Bruker NMR JCAMP-DX V2.0
##DATA TYPE= NMR SPECTRUM
##DATA CLASS= NTUPLES
##ORIGIN= BRUKER
##OWNER= Administrator
$$ 1.72 TOPSPIN		Version 2.1
$$ 2013-10-12 13:12:26.890 -0700  Administrator@X
$$ Compression mode = diff/dup
##.OBSERVE FREQUENCY= 400.02188249412
##.OBSERVE NUCLEUS= ^1H
##.ACQUISITION MODE= SIMULTANEOUS (DQD)
##.ACQUISITION SCHEME= undefined
##.AVERAGES= 8
##.DIGITISER RES= 22
##SPECTROMETER/DATA SYSTEM= spect
##.PULSE SEQUENCE= zg30
##.SOLVENT NAME= COFFEE_meoh
##.SHIFT REFERENCE= INTERNAL, COFFEE_meoh, 1, 14.98509
##AUDIT TRAIL= $$ (NUMBER, WHEN, WHO, WHERE, PROCESS, VERSION, WHAT)
$$ ##TITLE= Audit trail, TOPSPIN		Version 2.1
$$ ##JCAMPDX= 5.01
$$ ##ORIGIN= Bruker BioSpin GmbH
$$ ##OWNER= Administrator
$$ $$ E:\/data/COFFEE/nmr/AC1544_ROEFFECT0012_8215172_bp29KGnp56/10/pdata/1/auditp.txt
$$ ##AUDIT TRAIL=  $$ (NUMBER, WHEN, WHO, WHERE, PROCESS, VERSION, WHAT)
(   1,<2013-10-12 13:12:20.374 -0700>,<Administrator>,<X>,<go>,<TOPSPIN 2.1>,
      <created by zg
	started at 2013-10-12 13:11:14.713 -0700,
	POWCHK enabled, PULCHK disabled,
       configuration hash MD5:
       C8 4E 4E 5D D3 5C D8 9E 9F 52 82 E0 59 8A DE 15
       data hash MD5: 64K
       DE 60 BC 81 64 15 EE 11 DC 9A DF 96 89 05 77 43>)
(   2,<2013-10-12 13:12:23.218 -0700>,<Administrator>,<X>,<proc1d>,<TOPSPIN 2.1>,
      <Start of raw data processing
       efp LB = 0 FT_mod = 6 PKNL = 1 PHC0 = 0 PHC1 = 0 SI = 32K 
       data hash MD5: 32K
       BE 52 9F F3 AD BA 43 C0 07 A8 56 B5 F7 E4 56 12>)
(   3,<2013-10-12 13:12:23.499 -0700>,<Administrator>,<X>,<proc1d>,<TOPSPIN 2.1>,
      <pk PHC0 = 97.49268 PHC1 = 0 
       data hash MD5: 32K
       E7 07 1C 4B 73 47 2D 85 59 A8 EF 21 E6 DB C0 05>)
(   4,<2013-10-12 13:12:23.577 -0700>,<Administrator>,<X>,<proc1d>,<TOPSPIN 2.1>,
      <abs ABSG = 1 
       data hash MD5: 32K
       B1 D2 93 AC 44 49 71 B4 79 31 4C 20 EA D3 9E 61>)
(   5,<2013-10-12 13:12:23.687 -0700>,<Administrator>,<X>,<proc1d>,<TOPSPIN 2.1>,
      <abs ABSG = 2 
       data hash MD5: 32K
       8F 09 79 B1 DF 49 85 9C 64 E5 93 2C 90 B2 58 A0>)
(   6,<2013-10-12 13:12:23.749 -0700>,<Administrator>,<X>,<proc1d>,<TOPSPIN 2.1>,
      <abs ABSG = 3 
       data hash MD5: 32K
       4B 1C 20 53 88 30 CE C5 CC E4 C1 B1 E9 01 9F 8C>)
(   7,<2013-10-12 13:12:23.796 -0700>,<Administrator>,<X>,<proc1d>,<TOPSPIN 2.1>,
      <abs ABSG = 4 
       data hash MD5: 32K
       C9 70 3B 53 EA 12 F3 18 DB 2C DA B1 28 A2 36 E2>)
(   8,<2013-10-12 13:12:23.843 -0700>,<Administrator>,<X>,<proc1d>,<TOPSPIN 2.1>,
      <abs ABSG = 5 
       data hash MD5: 32K
       9C 49 CE 84 52 43 3F C5 98 41 E4 0C BE A4 9E 13>)
$$ ##END=
$$ 
$$ $$ hash MD5
$$ $$ 06 AC 79 86 30 11 22 07 69 8D 7E 8A 58 ED 5D 23
##$RELAX= 
##$RELAX= 
##$RELAX= 
##$RELAX= 
##$RELAX= 
##$RELAX= 
##$RELAX= 
$$ Bruker specific parameters
$$ --------------------------
##$DU= <E:\>
##$EXPNO= 10
$$ [...]
##$TP= (0..7)
150 150 150 150 150 150 150 150
##$TP07= 0
##$TPNAME0= <>
##$TPNAME1= <>
##$TPNAME2= <>
##$TPNAME3= <>
##$TPNAME4= <>
##$TPNAME5= <>
##$TPNAME6= <>
##$TPNAME7= <>
##$TPOAL= (0..7)
0.5 0.5 0.5 0.5 0.5 0.5 0.5 0.5
##$TPOFFS= (0..7)
0 0 0 0 0 0 0 0
##$TUNHIN= 0
##$TUNHOUT= 0
##$TUNXOUT= 0
##$USERA1= <user>
##$USERA2= <user>
##$USERA3= <user>
##$USERA4= <user>
##$USERA5= <user>
##$V9= 5
##$VALIST= <valist>
##$VCLIST= <CCCCCCCCCCCCCCC>
##$VD= 0
##$VDLIST= <DDDDDDDDDDDDDDD>
##$VPLIST= <PPPPPPPPPPPPPPP>
##$VTLIST= <TTTTTTTTTTTTTTT>
##$WBST= 1024
##$WBSW= 4
##$XGAIN= (0..3)
0 0 0 0
##$XL= 0
##$YL= 0
##$YMAX_a= 648051
##$YMIN_a= -552612
##$ZGOPTNS= <>
##$ZL1= 120
##$ZL2= 120
##$ZL3= 120
##$ZL4= 120
##$ABSF1= 14.98509
##$ABSF2= -5.573092
##$ABSG= 5
##$ABSL= 3
##$ALPHA= 0
##$AQORDER= 0
##$ASSFAC= 0
##$ASSFACI= 0
##$ASSFACX= 0
##$ASSWID= 0
##$AUNMP= <proc_prof1d_extract_pilot.lims>
##$AXLEFT= 0
##$AXNAME= <>
##$AXNUC= <1H>
##$AXRIGHT= 0
##$AXTYPE= 0
##$AXUNIT= <>
##$AZFE= 0.1
##$AZFW= 0.1
##$BCFW= 0
##$BC_mod= 0
##$BYTORDP= 0
##$COROFFS= 0
##$CY= 15
##$DATMOD= 1
##$DC= 0
##$DFILT= <>
##$DTYPP= 0
##$F1P= 0
##$F2P= 0
##$FCOR= 0.5
##$FTSIZE= 32768
##$FT_mod= 6
##$GAMMA= 0
##$GB= 0
##$INTBC= 1
##$INTSCL= 1
##$ISEN= 128
##$LB= 0
##$LEV0= 0
##$LPBIN= 0
##$MAXI= 10000
##$MC2= 0
##$MEAN= 0
##$ME_mod= 0
##$MI= 0
##$NCOEF= 0
##$NC_proc= -8
##$NLEV= 6
##$NOISF1= 0
##$NOISF2= 0
##$NSP= 0
##$NTH_PI= 0
##$NZP= 0
##$OFFSET= 14.98509
##$PC= 1
##$PHC0= 97.49268
##$PHC1= 0
##$PH_mod= 1
##$PKNL= yes
##$PPARMOD= 0
##$PPDIAG= 0
##$PPIPTYP= 0
##$PPMPNUM= 2147483647
##$PPRESOL= 1
##$PSCAL= 4
##$PSIGN= 0
##$PYNMP= <proc.py>
##$REVERSE= no
##$SF= 400.02
##$SI= 32768
##$SIGF1= 0
##$SIGF2= 0
##$SINO= 400
##$SIOLD= 32768
##$SPECTYP= <>
##$SREGLST= <1H.CDCl3>
##$SSB= 0
##$STSI= 32768
##$STSR= 0
##$SW_p= 8223.68421052631
##$SYMM= 0
##$S_DEV= 0
##$TDeff= 65536
##$TDoff= 0
##$TI= <>
##$TILT= no
##$TM1= 0
##$TM2= 0
##$TOPLEV= 0
##$USERP1= <user>
##$USERP2= <user>
##$USERP3= <user>
##$USERP4= <user>
##$USERP5= <user>
##$WDW= 1
##$XDIM= 32768
##$YMAX_p= 453423857
##$YMIN_p= -706448
##$CURPLOT= <Network HP LaserJet P1505>
##$CURPRIN= <$Network HP LaserJet P1505>
##$DFORMAT= <normdp>
##$LAYOUT= <+/1D_H.xwp>
##$LFORMAT= <normlp>
##$PFORMAT= <normpl>
##$SURQMSG= 1
$$ End of Bruker specific parameters
$$ ---------------------------------
##NTUPLES= NMR SPECTRUM
##VAR_NAME=  FREQUENCY,     SPECTRUM/REAL,   SPECTRUM/IMAG
##SYMBOL=    X,             R,               I
##VAR_TYPE=  INDEPENDENT,   DEPENDENT,       DEPENDENT
##VAR_FORM=  AFFN,          ASDF,            ASDF
##VAR_DIM=   32768,         32768,           32768
##UNITS=     HZ,            ARBITRARY UNITS, ARBITRARY UNITS
##FACTOR=    0.250966925370066, 1,           1
##FIRST=     8223.43324360094, -249919,      5682
##LAST=      0,             180363,          -42553
##MIN=       0,             -706448,         0
##MAX=       8223.43324360094, 453423857,    0
$$ Real data points
##PAGE= N=1
##DATA TABLE= (X++(R..R)), XYDATA
$$ [...]
19570f6797B17323d8588I2162a94280K6198k63993B57024F4986i4694A91160b35840
19558A01411J55777a90770P2746m5617m1082l8727A34662c7004B09569l7797g9550
19546a57341g0994n9843O3721B41952b2872A17265a88395e8844A47315a6260o5446
19535h1706m3526c8672N569k52639B34576b12892m5542h1251q0296g2460E9759
19523A44520d2155Q000m4165c5308j21491e644G4295d31347f5525a0130k41190
19512b51320e0009j9330J6125a9577o8946A09212B0173a53j35318N9902J8673
19501e6896k42159B03488a0168k20451G4058a66512K5207M4861A88913I0821l1693
19490E9128K3715a29992J6222i036l17128k2010h7884f872j81950A5179c3190
$$ plain form
19570 -66797 217323 -48588 92162 -194280 -168082 -432075 257024 64986 -94694 191160 -235840
19558 101411 257188 -190770 -118024 -163641 -204723 -243450 134662 -37004 209569 171772 -79550
19546 -157341 -70994 -130837 -67116 241952 -22872 117265 -188395 -58844 147315 -16260 -81706
19535 -81706 -125232 -38672 -33103 -285742 234576 -212892 -258434 -81251 -161547 -72460 59759
19523 144520 -42155 -34155 -78320 -35308 -156799 -5644 74295 -431347 -65525 -10130 -251320
19512 -251320 -50009 -69339 -53214 -19577 -88523 109212 20173 -153 -135471 -75569 -56896
19501 -56896 -299055 203488 -10168 -230619 74058 -166512 -141305 -96444 188913 90821 59128
19490 59128 82843 -129992 -113770 -9036 -326164 -348174 -87884 -6872 -188822 15179 -33190
19478a45736D6216e0671p6736A2025K10764c04350e8637j05576k6341C9908a55600
19466B65307h5217R24k98171G0437A232O4714j2493M3225o945j7133d72961b02489
19453A92047c37958h2077r5383Q7235J7957B4036c5088l25484A824M2147J21217
19442A65188a99771G9471b92066i9232a9902H1672b0274H6422N121C3003a04333
19430d80860g4488C9945j9420e253q5034a1547A5796R2009a46814k5090i650A30728
19417a34104A99627a00283A81281e772B66046i2016A154a84909h1698j02180B14152
19405i0694A40400d889j56258j9508I7988B5862c7906f311m5470n5552c9149p8987
19393a18136j11027Q6197p364J4752p8165A67459R4992c37922B8056a68684g0958
$$ plain form
19478 -145736 46216 -50671 -127407 12025 222789 -304350 -58637 -164213 -190554 39908 -155600
19466 265307 -85217 -84293 -382464 70437 1232 65946 53453 96678 89733 72600 -472961 -202489
19453 192047 -337958 -82077 -177460 -90225 -72268 24036 -35088 -360572 1824 43971 165188
19442 165188 -199771 79471 -292066 -99232 -19902 81672 -20274 86422 91543 33003 -104333
19430 -480860 -74488 39945 20525 -5253 -90287 -11547 15796 107805 -146814 -171904 -9650 130728
19417 -134104 199627 -100283 181281 -5772 266046 -92016 1154 -184909 -81698 -183878 214152
19405 -90694 140400 -4889 -161147 -180655 97988 25862 -37906 -6311 -51781 -107333 -39149 -118136
19393 -118136 -229163 -142966 -150330 -135578 -213743 167459 262451 -337922 28056 -168684 -70958
19381a23345L4172A42954b7019B29878k2604J21843A24920a2030l6004k18876
19371b66910D37701d8352q0126C41105b15933E2879a30832k7202A73968b13773
19360E1488P995j1128b8204j64739D1011J08836b74610B69849e9161n2117m1017
19349a52295A05130D5944a02125r9862k3292j05746J13033Q3652C99047a82956
19338A02540a02217n1379B81305D7201b50161J22211M8481k92124F8c74053n5790
19327d29843J37786A20387h7945D30507A18772c02584D2764J77250a09130C4571
19316b32238P2924J1270e2340j4842r530B35630b92652B61722q0532d4450j10842
19305a55292a7114B7378a04882e2102A08415k9621J39584b3935o2148E6585J32224
$$ plain form
19381 -123345 -89173 142954 -27019 229878 207274 329117 124920 -12030 -48034 -266910
19371 -266910 437701 -48352 -128478 341105 -215933 52879 -130832 -158034 173968 -213773
19360 51488 59483 48355 -28204 -192943 41011 149847 -274610 269849 -59161 -111278 -152295
19349 -152295 105130 45944 -102125 -201987 -225279 -331025 -217992 -134340 399047 -182956
19338 102540 -102217 -153596 281305 47201 -250161 -127950 -79469 -371593 68 -374053 -429843
19327 -429843 -292057 120387 -87945 430507 118772 -302584 42764 220014 -109130 34571
19316 -232238 -159314 -148044 -52340 -67182 -76712 235630 -292652 261722 181190 -44450 -155292
19305 -155292 -17114 27378 -104882 -52102 108415 78794 218378 -23935 -86083 56585 188809
19294A88809K2449r3293O155d1486j01255c5218j7384k31087A4505h0794D1748
19282E5893i6148K6947j01095d467A23506a43373G2707A5643i3008l8460A78980
19270b01020k0688A28876h5297c1403A09829B8294c96456J94867N6868K6766c4035
19258C08282a94701e8276J9093i303I6473D3643c02331I9069a21172r574N7440
19247g3306D0231e9397K8465l68899e3736A38155D5424M0048a64183b6554A37448
19235a25594o2034M4116m48575a42299k48020a29588A66568c32893A31049A583
19224G6347J06597D9453a36049j46064A03510k8194e737B15832H0822K19948D8142
19212A07396h1673M85L5936J5376r2706B92217c36525B25173h5302L6847j76743
$$ plain form
19294 188809 211258 117965 124120 -41486 -142741 -35218 -52602 -283689 14505 -80794 41748
19282 55893 -96148 -69201 -170296 -4467 123506 -143373 72707 15643 -93008 -131468 178980
19270 -201020 -221708 128876 -85297 -31403 109829 28294 -396456 -201589 -144721 -117955 -34035
19258 308282 -194701 -58276 -39183 -9303 96473 43643 -302331 99069 -121172 -130746 -73306
19247 -73306 40231 -59397 -30932 -399831 -53736 138155 45424 85472 -164183 -26554 137448
19235 -125594 -187628 -143512 -592087 -142299 -390319 -129588 166568 -332893 131049 1583
19224 76347 182944 49453 -136049 -282113 103510 75316 -5737 215832 80822 300770 48142
19212 107396 -81673 -81188 -45252 -29876 -122582 292217 -336525 225173 -85302 -48455 -225198
19201b25198L8440H4695A519a27720E5820d8553j00442j63964i3179B99884b05316
19189a18527j21202o1468m2121c1193j09287H8165h2799K5236j53642B40212a92015
19177b6713j44740B7682j2735L9516g6162A64665B2752h6608k3733B12758b11291
19165a31852O5837K5075E3796b97384a27597j20560P7969A96790a34627h711p4714
19154h3425o1327p79f7717C59369b74480H0136d1566j64044Q7986a310A38299
19142A03578J5312C3375b16878G6012b17589n3173J34191A21760b75326H3513
19131f7997k52I0802b56330B510b36165N6953p8296k8913A49855f3850r7571M5842
19119a15579p9815j85312A07896M3240F5208a06750k06887J40961I6454b3950
$$ plain form
19201 -225198 -186758 84695 1519 -127720 55820 -48553 -148995 -312959 -93179 299884 -205316
19189 -118527 -239729 -301197 -343318 -31193 -140480 88165 -82799 -57563 -211205 240212 -192015
19177 -26713 -171453 27682 14947 54463 -76162 164665 22752 -86608 -110341 212758 -211291
19165 -131852 -66015 -40940 53796 -297384 -127597 -248157 -170188 196790 -134627 -8711 -83425
19154 -83425 -144752 -145531 -67717 359369 -274480 80136 -41566 -205610 -117624 -1310 138299
19142 103578 118890 33375 -216878 76012 -217589 -270762 -136571 121760 -275326 83513
19131 -67997 -68249 90802 -256330 2510 -236165 -179212 -257508 -286421 149855 -63850 -161421 -115579
19119 -115579 -195394 -380706 107896 151136 65208 -106750 -313637 -172676 96454 -23950
19108B08693c47637A72836B4833a66824A7775K19850b84053G6994d41192B4197
19097A52890a74626g333G0746C175c3547E9701a0975A57680o1037f10203c1370
19085b64208C4674J34103o7165f2956C3529b13831a01407K482L6560A25374J70459
19074B95833b16099R8303H3989j5394K58422a4125m3875k9479a3637a059l7775
19063c8834C22546c84282a70729j09282A81279b63899J24826E0016a05204A13113
19052A46566b03861B00328c4809I3174J92222b95853a38697l1464A03880A8695
19041G8774b99430J47443D1413R8391G499b74983J02982C3570b34742h6320G8008
19029i0275j85114b3429l4749F11730B2794b90526A00415K13425r7706j1765a49119
$$ plain form
19108 208693 -347637 172836 24833 -166824 17775 237625 -284053 76994 -441192 24197
19097 152890 -174626 -7333 70746 3175 -33547 59701 -10975 157680 96643 -610203 -31370
19085 -264208 34674 168777 101612 -62956 33529 -213831 -101407 -98925 -62365 125374 295833
19074 295833 -216099 -117796 83989 68595 327017 -14125 -58000 -87479 -13637 -1059 -38834
19063 -38834 322546 -384282 -170729 -280011 181279 -263899 -139073 50016 -105204 113113
19052 146566 -203861 200328 -34809 93174 285396 -295853 -138697 -170161 103880 18695
19041 78774 -299430 -151987 41413 139804 7499 -274983 -172001 33570 -234742 -86320 78008
19029 -90275 -275389 -23429 -58178 611730 22794 -290526 100415 313840 216134 204369 -149119
19017A12639l6257N374a83916A59533D7591a9003l39750J67557A64707o3510p403
19006I3794A4721b97992a10072A97194r2156L9993a80865j46814O2673a16629
18995d62728d110B4630h5979l70168H329Q6294a20448p9855j20437a3400H1846
18983A25386a73292P4602B6661M15c22027a02652o5086I0893P0276o9585a34259
18971A8081a48466d808l7201j12897I5533a10916A73115g1309B5981J23069N2370
18960B01420d3937F9825d3490D6959Q7584a78204k5123C11468b10062C07300j43522
18949A63778G2497b61520G3614O8086c26878f270A45827a53520l88508A3789a42889
18937a96428k07405g4042j72072A7592a26203A13766B7389H930b95363P3217G438
$$ plain form
19017 112639 76382 81756 -183916 159533 47591 -19003 -358753 -191196 164707 101197 93794
19006 93794 14721 -297992 -110072 197194 105038 145031 -180865 -327679 -265006 -116629
18995 -462728 -4110 24630 -85979 -456147 8329 94623 -120448 -200303 -320740 -13400 81846
18983 125386 -173292 -98690 26661 27076 -322027 -102652 -167738 90893 161169 91584 -134259
18971 18081 -148466 -4808 -42009 -154906 95533 -110916 173115 -71309 25981 149050 201420
18960 201420 -43937 69825 -43490 46959 134543 -178204 -203327 311468 -210062 307300 163778
18949 163778 72497 -261520 73614 141700 -326878 -6270 145827 -153520 -542028 13789 -142889
18937 -196428 -403833 -74042 -246114 17592 -126203 113766 27389 8930 -295363 -222146 7438
18925a01170b4120k90911j7011a47006e2086A03591i5174B8029K8774a37713m1835
18914a79548B06911b59118l2152D561J78823b70337J1973B79101A03333a94505
18903A20931i4541b6579m4934A04837R9140f1479D7591b01772C85342b05162C34652
18891a48685J3557k09818A63224l6333c45684l8576h5368o2734I0637a70612j03893
18880b74505I2293P6102C6835d15557a71549g1683A46136g4480B7470R4719P8438
18869B00627b57389a0761j58638E9728a57766c1960R150p4453p0041j15147B7282
18857e5656l5097A24687L06441c33073o585A88335n5361k9873b29743p1037D8973
18845i8936j17657d6177C8827a90106C6549L40891a42338b6276j47617Q1055E3629
$$ plain form
18925 -101170 -24120 -315031 -332042 -147006 -52086 103591 -95174 28029 56803 -137713 -179548
18914 -179548 206911 -259118 -291270 4561 183384 -270337 -258364 279101 103333 -194505
18903 120931 -94541 -26579 -71513 104837 203977 -61479 47591 -201772 385342 -205162 334652
18891 -148685 -135128 -344946 163224 126891 -345684 -384260 -85368 -148102 90637 -170612 -274505
18880 -274505 92293 168395 36835 -415557 -171549 -71683 146136 -74480 27470 122189 200627
18869 200627 -257389 -10761 -169399 59728 -157766 -31960 -22810 -97263 -167304 -282451 27282
18857 -55656 -90753 124687 431128 -333073 -339658 188335 132974 103101 -229743 -300780 48973
18845 -98936 -216593 -46177 38827 -190106 36549 377440 -142338 -26276 -173893 -92838 53629
18833c5871E8488B4307J01247c29730G8542a68160F2205d6388j05334H5139q992
18822G6147b11099a5783A0827J76885I2705b23655j08877R6076C906O8973J5626
18811H8505J09674F3705J14283h3802F8531N8297Q9951e09704J88166e956l81282
18800c87238a59200N7321B12185a7522j90862a01736j54999j681a3684k73690
18790b87374M1715d2035A17025c28420h6662A7656f9700B9599b33870E3190b81703
18778a09168M8622k44567J40847L3096A26210c04012A64283a26136e6492r6127
18768a52619b7554n8504L7979j48542A4262g7991G5069a26986A40336a328A7936
18756H6594c1275k8892A13131g0579B18846L5462a92411I5364b51923B00501i9624
$$ plain form
18833 -35871 58488 24307 125554 -329730 78542 -168160 62205 -46388 -151722 85139 76147
18822 76147 -211099 -15783 10827 187712 92705 -223655 -332532 -236456 3906 72879 88505
18811 88505 198179 63705 177988 -83802 68531 126828 216779 -509704 -321538 -5956 -387238
18800 -387238 -159200 -101879 212185 -17522 -208384 -101736 -256735 -258416 -13684 -287374
18790 -287374 -245659 -42035 117025 -328420 -86662 17656 -69700 29599 -233870 53190 -281703
18778 -109168 -60546 -305113 -164266 -131170 126210 -304012 164283 -126136 -56492 -152619
18768 -152619 -27554 -86058 -48079 -196621 14262 -77991 75069 -126986 140336 -1328 17936
18756 86594 -31275 -60167 113131 -70579 218846 254308 -192411 95364 -251923 200501 -99624
18744G7330d9885j41127B537J84121b3296j27376H765L8362i4223I0669c95468
18732C02851d4065l8499c8081B6495A0278g8024A99645k5383G728a50283C1913
18720c57222I086i6089A887a3697j04062N726G6142e8469j35792g7649I51a41577
18707a77322J4057F2538c86981i0008l61388h601o5265R764H1376a8731k10438
18696b29169h8819B09452a67592J2443H1709b59515M2973I993b45272q256D41096
18684E2396R7923i3995H5527N3929A2344a9356k93239j07653A05738B2602a69644
18672e3145D9995c33861C58866a78786A38440c23070a2537o41A67736b00310a6427
18660A15201a15854A46392b99595A4600M6714K1645a02850r0059Q9192A83728
$$ plain form
18744 77330 -49885 -191012 2537 186658 -23296 -150672 8765 47127 -94223 90669 -395468
18732 302851 -44065 -82564 -38081 26495 10278 -78024 199645 174262 7728 -150283 31913
18720 -357222 9086 -96089 1887 -13697 -117759 -112033 76142 -58469 -194261 -77649 951 -141577
18707 -177322 -163265 62538 -386981 -90008 -451396 -8601 -73866 -64102 81376 -18731 -229169
18696 -229169 -88819 209452 -167592 -155149 81709 -259515 -216542 9993 -245272 -253528 441096
18684 52396 150319 -93995 85527 139456 12344 -19356 -312595 -420248 105738 22602 -169644
18672 -53145 49995 -333861 358866 -178786 138440 -323070 -12537 -13178 167736 -200310 -16427
18660 115201 -115854 146392 -299595 14600 61314 82959 -102850 -192909 -103717 183728
18649i6439l7610r8351c5129n1626E7382a43112A88772a99915A84873a12621n4903
18638a67524J9322P4076A01965a06524A77590k4311L20032A47345n1139p38c29058
18626e4078l7708j2620r8897A16667c4176B4075J43384C3617c23568a23027O1101
18615f1926D0654d37826a05023j22657B11966a13451I0392b57928K0340A5111
18604A06717g1817A89087a4996k32517D9182J64923A3387J15531a78770n7380
18594b36150a13247A21137e01517B2175a44156k78890A89833a10611D9432a50925
18583i4064C7734A4847b9575B7694J41012a28220o6112A15363D3737l374A4898
18571b4167G0907h0714c9116r0423k7165L8971l3171A93869k9989B9524g1569
$$ plain form
18649 -96439 -134049 -232400 -35129 -86755 57382 -143112 188772 -199915 184873 -112621 -167524
18638 -167524 -148202 -74126 101965 -106524 177590 153279 473311 147345 96206 95468 -329058
18626 -54078 -91786 -104406 -203303 116667 -34176 24075 167459 33617 -323568 -123027 -61926
18615 -61926 40654 -437826 -105023 -227680 211966 -113451 90392 -257928 -237588 15111
18604 106717 -71817 189087 -14996 -247513 49182 214105 13387 128918 -178770 -236150
18594 -236150 -113247 121137 -501517 22175 -144156 -423046 189833 -110611 49432 -150925
18583 -94064 37734 14847 -29575 27694 168706 -128220 -194332 115363 43737 40363 14898
18571 -24167 70907 -80714 -39116 -129539 -156704 -117733 -150904 193869 163880 29524 -71569
18559B3986L04330I1990L11156a17347B6247d4584K1583l20061a01807j02524
18549b04331d1179J0174j94803i8892n1148j26013O7538C12113a66958G7124a51723
18537a5041A6152K9851J30480R0045C6909a45969A17060a27284e322j28288e1456
18525a84294B14354b71810n6217J0536O9236b7243B63473A06071b67064A43371
18514c349j28488J6118c996k5621l32181C05676B1988a70300j41227P7707j15396
18503c49216A63654h0056a6751C9981b65409N73a16635k94662A81009o7730l1130
18492H2149a8163q7957j20066o5824A69645b04088M8030l58166A78881a94530
18481C28775f2342j25512H1047e468G0806a44657F0401c52030e6506G3486Q095
$$ plain form
18559 23986 328316 91990 403146 -117347 26247 -44584 -23001 -343062 -101807 -204331
18549 -204331 -41179 -31005 -225808 -98892 -150040 -276053 -208515 312113 -166958 77124 -151723
18537 -15041 16152 46003 176483 266528 36909 -145969 117060 -127284 -5322 -133610 -51456
18525 -184294 214354 -271810 -328027 -317491 -248255 -27243 263473 106071 -267064 143371
18514 -3349 -131837 -115719 -3996 -29617 -361798 305676 21988 -170300 -311527 -233820 -349216
18503 -349216 163654 -80056 -16751 39981 -265409 -264836 -116635 -411297 181009 113279 82149
18492 82149 -18163 -106120 -226186 -292010 169645 -204088 -156058 -514224 178881 -194530
18481 328775 -62342 -187854 81047 -5468 70806 -144657 60401 -352030 -56506 73486 81581
18470H1581c44093a45321c6040l93082A0884e5820j4558C4089J00370c38648a63867
18458A004g8559F3191d52574a81704o3613B54965c26316D9528c60160E6957g7332
18446F9195b81324B63613G2507J31168a82598A06576O8171e5986m0501b2455D16965
18434a02878k96614a03149j45477a15981A57541b2376A50422b2885o3497l7661
18424a24043N808j61478D4314J72616c51102C89895d6263r5409J2741C1419J0694
18413D2113g1344J5849j08512a2418j01903F3687K55350p829a11406F4542N9579
18402A24121b6658j47239j8283B91173b26975g2628A04742i5111L0908H8085P9377
18391A67462P6235h779B93783b10491A16690a54133B89573b08607L8859J8779
$$ plain form
18470 81581 -344093 -145321 -36040 -429122 10884 -55820 -70378 34089 134459 -338648 -163867
18458 1004 -78559 63191 -452574 -181704 -245317 254965 -326316 49528 -360160 56957 -77332
18446 69195 -281324 263613 72507 203675 -182598 106576 174747 -55986 -96487 -22455 416965
18434 -102878 -399492 -103149 -248626 -115981 157541 -22376 150422 -22885 -86382 -124043
18424 -124043 -118235 -279713 44314 216930 -351102 389895 -46263 -141672 -128931 31419 42113
18413 42113 -71344 -55495 -164007 -12418 -114321 63687 319037 311208 -111406 64542 124121
18402 124121 -26658 -173897 -192180 291173 -226975 -72628 104742 -95111 -64203 88085 167462
18391 167462 243697 -8779 293783 -210491 116690 -154133 289573 -208607 -169748 -150969
18381a50969K7459r0413B2149c34981a07990j48842k63700A73380q5677B9512
18370i5856A1292a29847B20654E9723a56126l31176g0066B01841n6558M9124m6183
18359A48224J4881a73267D686a87890B58852B6814a55002B1011d67235J67890
18349b99345J48867B6818i8668A06447b12224b6925l551A18790c60924A57151
18338a34142C8731N2719a08013B61221D0089h8837b2621j34459q8000G9025K442
18327H1467b64j98678A22428c1603A49107B9615d0180k21414e4370n1209I3073
18315d0543A44090F9467i9592K6639A14583b21485A27988C2588h1536j19573A14905
18303a61619f3522B38398o4167c9739A12746O9165a43905g1682j3105p7432D3252
$$ plain form
18381 -150969 -123510 -213923 22149 -334981 -107990 -256832 -520532 173380 87703 29512
18370 -95856 11292 -129847 220654 59723 -156126 -487302 -70066 201841 145283 194407 148224
18359 148224 163105 -173267 4686 -187890 258852 26814 -155002 21011 -467235 -299345
18349 -299345 -150478 26818 -98668 106447 -212224 -26925 -30476 118790 -360924 157151
18338 -134142 38731 91450 -108013 261221 40089 -88837 -22621 -157080 -245080 79025 81467
18327 81467 -264 -198942 122428 -31603 149107 29615 -40180 -261594 -54370 -105579 93073
18315 -40543 144090 69467 -99592 -72953 114583 -221485 127988 32588 -81536 -201109 114905
18303 -161619 -63522 238398 174231 -39739 112746 181911 -143905 -71682 -84787 -162219 43252
18291b51947H1637a6142A26384j9300A4081c00736a45594I2334f7852l48676B62282
18279a16368C62014a01273A91542a3433C03839B5967b04558p4522B146b18378
18268a22351I0752a71680r1100P5370h2159J4149l0002A33717h5747k80551C29896
18256b22736M3794A50012p871Q1822a55884C3215i6670D5144b68953A16967O673
18245A23640b10011e9743r3099d1649a6466A09701O4428G3767J30116K96737A40366
18233e3952o1530k13816a37583e8853B58K15876B7053h8929o3845A14854a48106
18221a39342A39887C0524r814a82906B4691c23710c4705j26162j04723h9345A69630
18209i9324l29540A77802a34791F4526b73839J4600K168a22898a806r6272A03740
$$ plain form
18291 -251947 81637 -16142 126384 107084 14081 -300736 -145594 92334 -67852 -416528 262282
18279 -116368 362014 -101273 191542 -13433 303839 25967 -204558 -279080 2146 -218378
18268 -122351 90752 -171680 -262780 -187410 -82159 -68010 -98012 133717 -85747 -366298 329896
18256 -222736 -178942 150012 142141 223963 -155884 33215 -96670 45144 -268953 116967 123640
18245 123640 -210011 -59743 -152842 -41649 -16466 109701 174129 73767 203883 500620 140366
18233 -53952 -115482 -329298 -137583 -58853 258 216134 27053 -88929 -152774 114854 -148106
18221 -139342 139887 30524 20710 -182906 24691 -323710 -34705 -160867 -265590 -89345 169630
18209 -99324 -428864 177802 -134791 64526 -273839 -259239 -257071 -122898 -1806 -98078 103740
18197a13568A07373a45391A00384K01682b06848j17228J58833j10588c1451A36744
18186A57135a85772B30592C4575J20353A0566m098J45321a81747J1979O7184B41475
18174B0363J21471c1469C61611b226D4959a54843M9058B38166a19280j99938d0568
18162c17134M8862h8107H256K66829H2842O7802f8782j51821I0672A4803a11200
18150a46254A4514c39597J53153j06572O7150d0978B05567K10227A5001a23484
18139h2346c6852l6407A06780J42810f897A77510b85963A5738e7882j55112a5996
18127b3540B89985a68723B6987b7036H7d6538G1228a27135j16413a16986I7186
18115b86624B5293g8250A73983n4705J958a0108A61150N6579k4172a79345g5498
$$ plain form
18197 -113568 107373 -145391 100384 302066 -206848 -324076 -165243 -275831 -31451 136744
18186 157135 -185772 230592 34575 154928 10566 6468 151789 -181747 -169768 -102584 241475
18174 20363 141834 -31469 361611 -2226 44959 -154843 -105785 238166 -119280 -319218 -40568
18162 -317134 -268272 -88107 8256 275085 82842 150644 -68782 -220603 90672 14803 -111200
18150 -146254 14514 -339597 -186444 -293016 -225866 -40978 205567 415794 15001 -123484
18139 -82346 -36852 -73259 106780 249590 -6897 177510 -285963 15738 -57882 -212994 -15996
18127 -23540 289985 -168723 26987 -27036 87 -46538 71228 -127135 -243548 -116986 97186
18115 -286624 25293 -78250 173983 119278 121236 -10108 161150 217729 193557 -179345 -75498
18103b04956b233B06988a50088A18656h806o6476B8545J82771e7392j68443A60119
18091B46a16786N0164c038E39639a38352k2353G3793q210j328a50250G5468a64044
18078a16233I94a2955q2595j49995d491m81144a68407C1665a57060C06293A20827
18066b72507a06830c6777A65904a22567j80951k3861K5862A13473Q968a26964
18055a88036A11834g4871J2080o0771B09894p5441j4370f9715C60603A25427Q9201
18044B14628r930d9081l76658f5917J4164k00391A43196c03722C20828g3882K0834
18033e3048r0757p9482J02136l6095A15820b07858r1205A08288c28951A37053
18022I9316i4842l4001A47316O989K05052H7603M774h9047G8114J11659H4737
$$ plain form
18103 -204956 -2233 206988 -150088 118656 -8806 -75282 28545 211316 -57392 -225835 160119
18091 246 -116786 -66622 -3038 539639 -138352 -160705 73793 65583 64255 -150250 75468 -164044
18078 -116233 994 -12955 -95550 -245545 -4491 -485635 -168407 31665 -157060 306293 120827
18066 -272507 -106830 -36777 165904 -122567 -303518 -327379 -301517 113473 122441 -126964
18055 -188036 111834 -74871 -62791 -123562 209894 134453 120083 -69715 360603 125427 214628
18044 214628 204698 -49081 -425739 -65917 -51753 -252144 143196 -303722 320828 -73882 -53048
18033 -53048 -143805 -223287 -121151 -157246 115820 -207858 -299063 108288 -328951 137053
18022 99316 -94842 -128843 147316 154305 359357 87603 92377 -89047 78114 189773 84737
18010a75584F0272M7543b54354j93547b6103A0594P0708F609O0890a9599a466
17998d0061E6325J38797l7413A0469R0409d6281B48329K13358B7199J7218J2219
17987E6636f7967J4142A1037P5324a91308h3207A41513K2874c7492l19327d659
17975G035a94606g9171B64921c09422B04458c6519l14054d3698G3080g6039k86074
17964c62113h0611j5474F8390J42060H4223h8588P888b3500n6145A9027a38895
17952A26264a46191K6032m723K6670B94988E2654f734I6149a09793n837D5322
17940B7202f1771I3479J85972c08472F7795g3054r7060d8149j12124g6630I3261
17928E9568b19035H4624b54124j8983C35870d0438j01426o798k95706A80313a23524
$$ plain form
18010 -175584 60272 107815 -254354 -447901 -26103 10594 81302 6609 67499 -19599 -1466
17998 -40061 56325 195122 157709 10469 100878 -46281 248329 461687 27199 44417 56636
17987 56636 -67967 -53825 11037 86361 -191308 -83207 141513 164387 -37492 -356819 -4659
17975 7035 -194606 -79171 264921 -309422 204458 -36519 -350573 -43698 73080 -76039 -362113
17964 -362113 -80611 -96085 68390 210450 84223 -88588 -80700 -23500 -79645 19027 -138895
17952 126264 -146191 -120159 -124882 -98212 294988 52654 -6734 96149 -109793 -115630 45322
17940 27202 -61771 93479 279451 -308472 67795 -73054 -170114 -48149 -160273 -76630 93261
17928 59568 -219035 84624 -254124 -273107 335870 -40438 -141864 -148662 -444368 180313 -123524
17916a20898l6163B93322A09772J82915f5919A69405h6641b3238n850m4990p3962
17905a48040B15417E4445J1546b47869J12636B66646a12271A15237b14879d2697
17894a13076A78642D4400K367d48k20859B16570I3590e914M09B41563f5409C09736
17881c7215O462B24184a4831H0689b17260f2143j75927c2125n6029M3202B03856
17869b56354P5361G9346N5917c6077l14983a3568B05595A1350a32371l8910g7761
17857a30168m5415C04720B7065K75064j07640C7970a08559n0351H6009b9375m68537
17846d97912a73960h0013k16377G0495i0443F5444J53517r1578c06049b9987A78332
17834A59734C0117d7147l66882g9805D08366e5837j70074j93899B4341b06713
$$ plain form
17916 -120898 -157061 293322 109772 292687 -65919 169405 -86641 -23238 -29088 -74078 -148040
17905 -148040 215417 54445 65991 -247869 -135233 266646 -112271 115237 -214879 -42697
17894 -113076 178642 44400 46767 -448 -221307 216570 93590 -5914 -5505 241563 -65409 309736
17881 -37215 -30753 224184 -14831 80689 -217260 -62143 -238070 -32125 -88154 -44952 203856
17869 -256354 -180993 79346 135263 -36077 -351060 -13568 205595 11350 -132371 -171281 -77761
17857 -130168 -175583 304720 27065 302129 194489 37970 -108559 -158910 86009 -29375 -497912
17846 -497912 -173960 -80013 -296390 70495 -90443 65444 218961 127383 -306049 -29987 178332
17834 159734 30117 -47147 -414029 -79805 408366 -55837 -225911 -419810 24341 -206713
17823g7232E0315O219a77621l980M5000m1852P9869j12440k4791D3575p733c38453
17810g9106j15259K6974G1112d02455e1303A27728b12772C25361a6474I3455L5157
17799A28612J043E5633B2797J58049p857A2341g4672p9388q7465A26249b47967
17787c6740D6057a19381C7882R6346a4312q356o0380B32339M9124G612K7422K12199
17775B47233j06085b6237A72650o2618F422K50770C3355i6906L9220k01054a06267
17763A37452L7395b48632B97921d17566B59511A04033a00726A4068a82947A28648
17752B09693g3438l6723L7557j22645A24664a20391k2154P146D55734B3475J38305
17741A61780G9617e8391C9780b04985q6989B78032n3611c6427A68317h0903D3031
$$ plain form
17823 -77232 50315 56534 -177621 -181601 -136601 -178453 -98584 -211024 -235815 43575 35842 -338453
17810 -79106 -194365 -167391 71112 -402455 -51303 127728 -212772 325361 -16474 93455 128612
17799 128612 129655 55633 22797 180846 172989 12341 -74672 -154060 -241525 126249 -247967
17787 -36740 46057 -119381 37882 134228 -14312 -22668 -83048 232339 281463 7612 35034 247233
17775 247233 141148 -26237 172650 110032 6422 257192 33355 -96906 -57686 -258740 -106267
17763 137452 174847 -248632 297921 -417566 259511 104033 -100726 14068 -182947 128648
17752 209693 -73438 -110161 -72604 -195249 124664 -120391 -142545 -135399 455734 23475 161780
17741 161780 79617 -58391 39780 -204985 -291974 278032 224421 -36427 168317 -80903 43031
17729a31948n2005k0851B42333p1107d4072j55882k74495B44341a8407B62573
17718c1099A47666F5002a59857I8967Q3238c6448j54175A05492b99912a14540
17707b05616k9309A98532b39694G9606a7044B41495K93984a96643C04159j11800
17697A92359A9296h2862A04671a17357D7428K87218C7650J5182a40417G2000J96891
17686B68891d32261e214F0590M6678C9463K67255C806b25798c2314k43283b0276
17674d09592a79683C9011J01765K6507a48366b716k5785A60687h6540E5201K0818
17663G6019e18638c0801D726L57640E9225a16138j08684A16381J50783B9449J02790
17652A32239L7500j1248a25063d2140q3612F6860j1691j8241c682D4540J57544
$$ plain form
17729 -131948 -183953 -204804 242333 171226 -44072 -199954 -474449 244341 -18407 262573
17718 -31099 147666 65002 -159857 98967 182205 -36448 -190623 105492 -299912 -114540
17707 -205616 -234925 198532 -239694 79606 -17044 241495 535479 -196643 304159 192359
17697 192359 19296 -82862 104671 -117357 47428 334646 37650 52832 -140417 72000 268891
17686 268891 -432261 -5214 60590 107268 39463 306718 3806 -225798 -32314 -275597 -20276
17674 -409592 -179683 39011 140776 167283 -148366 -2716 -28501 160687 -86540 55201 76019
17663 76019 -518638 -30801 4726 362366 59225 -116138 -224822 116381 267164 29449 132239
17652 132239 169739 158491 -125063 -42140 -125752 66860 55169 36928 -3682 44540 202084
17641B02084j625a41038j85688H2704b07348A08811b01247A9306M7746M679R3514
17630A65245a18327B7930O6745a54561a0640E9429a98885Q5964C9093d4804B04200
17618i4182c3245A88107P5644a080k32639B84648F32a70444A67778p7605O5892
17607A56065f7050C5539f8900F1304c19420A49922o9173e444F0971g9457B82323
17595c83005C51599I161O8305R794b29457R446a06916b6399j62873D42803b07750
17583A75825b02439B87130d9551A58152a58408j8328f493B15525b7637A95253
17572b2928C3756c8008A98183h9718B9122K24276B449c7983j97641c935G4830
17560B51586n1698A6697Q0203P8718D0705M1871J29084a2789H9130N5597a62936
$$ plain form
17641 202084 200459 -141038 -326726 82704 -207348 108811 -201247 19306 67052 71731 165245
17630 165245 -118327 27930 94675 -154561 -10640 59429 -198885 -112921 39093 -44804 204200
17618 -94182 -33245 188107 263751 -1080 -233719 284648 632 -170444 167778 90173 156065
17607 156065 -67050 35539 -68900 61304 -319420 149922 80749 -5444 60971 -79457 282323
17595 -383005 351599 9161 77466 87260 -229457 -220011 -106916 -26399 -189272 442803 -207750
17583 175825 -202439 287130 -49551 158152 -158408 -176736 -6493 215525 -27637 195253
17572 -22928 33756 -38008 198183 -89718 29122 253398 2449 -37983 -235624 -3935 74830
17560 251586 199888 16697 96900 175618 40705 82576 211660 -12789 89130 144727 -162936
17548B85779D2314a30003c9718l34905c8186k01544A27089a77201A53615C8713
17537B08407f8691A1592J73327b22342M993A27753K9141E9664Q4318h8260b8486
17525C42574i2C23142A13182m1015d47511A42L0690L10568b67526A34305C9720
17513A73706b22508C51117A16924l0530k0028a57083F2832L92235A30079b6314
17502B82597l3773J42040d1295f364o6725A55626a52669F5750P0338J79478R9821
17491D15387A58654a40521E72352F4754a10636d6184E5744R0563K88736A30271
17480C32379N6258f8850B07921q9050a627B61357n2752p0420n6482Q9951e067
17468A24648b53808C41322l0383a15231A31371O638d2008G3978J97404b74226
$$ plain form
17548 285779 42314 -130003 -39718 -374623 -38186 -239730 127089 -177201 153615 38713
17537 208407 -68691 11592 184919 -222342 -217349 127753 156894 59664 143982 -88260 -28486
17525 342574 -92 323142 113182 72167 -447511 142 30832 341400 -267526 134305 39720
17513 173706 -222508 351117 116924 86394 66366 -157083 62832 455067 130079 -26314
17502 282597 248824 390864 -41295 -6364 -73089 155626 -152669 65750 136088 315566 415387
17491 415387 158654 -140521 572352 64754 -110636 -46184 55744 146307 435043 130271
17480 332379 388637 -68850 207921 118871 -1627 261357 208605 138185 81703 171654 -5067
17468 124648 -253808 341322 310939 -115231 131371 138009 -42008 73978 271382 -274226
17457I1496O8987a70562M4895o5922E3740J99009n4735r4992J76572r1094K96149
17446D84649J08692k32999j77779J24814L0075E1015M78334B34473o822K71291
17436D98942k08104j39909J12656K1896I7433L11541c6848A98116R8068j42994
17426A53190e2802D37986N7765H6714J6174J58002p8669K823c3717C2719a4005
17414A37902J11520b69351D3051K43910H1164J60800N2853A03423d2607A64015
17403G8030K42216B9857K12036j17560K5645R7850a26578d5352B64602E3624b01520
17391F7579K05244J21303A65323g9136A61857j0102n1622k5492J09935b2010D3091
17379b0851j6290C58454A77814a78032J0188G8830J00641m5005O2167q3148C0179
$$ plain form
17457 91496 160483 -170562 -125667 -191589 53740 252749 198014 103022 279594 188500 484649
17446 484649 593341 360342 182563 307377 337452 51015 529349 234473 227651 498942
17436 498942 290838 150929 263585 285481 97433 408974 -36848 198116 296184 153190
17426 153190 -52802 437986 495751 86714 102888 260890 182221 185044 -33717 32719 -14005
17414 137902 249422 -269351 43051 286961 81164 241964 294817 103423 -42607 164015
17403 78030 320246 29857 241893 124333 149978 247828 -126578 -45352 264602 53624 -201520
17391 67579 272823 394126 165323 -79136 161857 151755 100133 74641 184576 -22010 43091
17379 -20851 -37141 358454 177814 -178032 -167844 78830 179471 134466 196633 113485 30179
17367b00336C42223M173H356g8787B39303a15419B86777n4444D7049j3491L97529
17356D31087B1153M35410F3857M08647c9950C06124A33711L8160G4609J12822
17346A87431J04472a42832F4106C1362J49830k2357a00445j9277c450A01973p673
17335I4300M2655J5744J8997L468m8111Q8301j0484p7302a03320B68089b55281
17323C60999R6136G7708K7083L92626B8066K93116j30495r4014L383m0746J18283
17312A77593P6073A17788J8574M067C9745J39489M5016n2069J15317A29686J0109
17301A39795l1740M4438J24210c2030D15865c6536j26706O3413I7642J92974C6908
17289B31663a2852B67543F7349R2739J40261G9530L03137e5419A71348g2936B01464
$$ plain form
17367 -200336 342223 346396 8356 -78787 239303 -115419 286777 232333 47049 33558 431087
17356 431087 21153 456563 63857 472504 -39950 306124 133711 171871 74609 187431
17346 187431 291903 -142832 64106 31362 181192 158835 -100445 -119722 -3450 101973 94300
17335 94300 136955 152699 171696 175164 127053 215354 204870 127568 -103320 268089 -255281
17323 360999 457135 77708 104791 497417 28066 321182 190687 96673 100056 59310 177593
17312 177593 253666 117788 136362 140429 39745 179234 224250 172181 287498 129686 139795
17301 139795 108055 152493 276703 -32030 415865 -36536 -163242 -99829 97642 290616 36908
17289 231663 -12852 267543 67349 160088 300349 79530 382667 -55419 171348 -72936 201464
17277B33191J20497a4839B85305E5015R7946K46104e6842E32267e160q7756A17143
17265A2509L53376m7845J02379Q802C2232f3012A99549G9839K06995I6254K78483
17254C74737A62110P3418E8836K34967E7536N3826J65485f4679D48712A16802
17243f5897B27188J1652G7602a6839B95059H8224M18986i716F933J28759a13152
17231D07657j52405B3329R2138K26324I4031c26459A18391J31268Q1683H8792
17220B31573J52409g767o9493A52454l8650J48887m316D6448b14761C33360j52409
17209A80951b02588B63863R2477j2827g533A38382o2475a08713C97708r5343n7713
17198B44652N8726J1693e7043B01161R2883A37995J35585k5161b09484E7103J14933
$$ plain form
17277 233191 353688 -14839 285305 55015 152961 399065 -56842 532267 -5160 -92916 117143
17265 12509 365885 318040 420419 429221 32232 -63012 199549 79839 286834 96254 374737
17254 374737 162110 235528 58836 293803 57536 111362 276847 -64679 448712 116802
17243 -65897 227188 238840 77602 -16839 295059 88224 507210 -9716 6933 135692 -113152
17231 407657 255252 23329 115467 341791 94031 -326459 118391 249659 331342 88792
17220 231573 383982 -7767 -77260 152454 113804 262691 258375 46448 -214761 333360 180951
17209 180951 -202588 263863 356340 343513 -7533 138382 75907 -108713 397708 302365 244652
17198 244652 303378 315071 -57043 201161 294044 137995 273580 248419 -209484 57103 172036
17187A72036l5720J96638j66111R3259J73806k14319J69216j5023J8160J87328
17177E79270E7896J47951L2231K1342J60355j59484k735j25883M00020k32286
17167B99407q8289k5048Q3039K16884B34663K58401I3834a0835B50472q7119i778
17155A1674M09757B01640M8118J23321j40302l6955J08794J9674q5167K18277
17145D57400J22767A5475K50155J32264j31704a00601G16093B03188l7408m6122
17135A19658K95609B3881M2360J66613m1517L8583K37933A66960j0978L21048
17125D77030n295B18098J01663A09302J77192R0517G1341K33497N639A06499K067
17114A08566K01404M608q3705L96287a21192C15009K23609j74027n3257J37790
$$ plain form
17187 172036 136316 332954 166843 260102 433908 219589 388805 373782 391942 579270
17177 579270 57896 205847 238078 259420 419775 260291 257556 131673 531693 299407
17167 299407 211118 186070 269109 485993 234663 493064 93834 -10835 250472 163353 -9778
17155 11674 421431 201640 249758 373079 232777 195822 304616 324290 239123 457400
17145 457400 580167 15475 265630 397894 266190 -100601 716093 203188 165780 119658
17135 119658 415267 23881 66241 232854 191337 229920 467853 166960 155982 477030
17125 477030 471735 218098 319761 109302 286494 377011 71341 304838 310477 106499 108566
17114 108566 309970 314578 230873 627160 -121192 315009 538618 364591 311334 449124
17104D49124j37156p153a3729G54766B83624r5610M24706A73551K27369j6918
17094C84002J544J67687A33771K69507j06689J97872K6266k12214J75150A34642
17083B90586O0248L22319l08218R9690K01644k56455j79592J60031J12067J06414
17073F08734J26733k90934K96667k21419J02682j54070n9898A63463p6857K37666
17063C24272F5468K04786m1576M84368k73645n9222j10507n0131K74319A95997
17052C52902k3420O3099L99558j85110j74337j8034j56442K00616K3560P2640
17042E55032M1217j63984j63785L13991j74089j78762J73432J5338p0719j9666
17032C28005M74786C64367L07735A71914L38742m4025K9199J27135k54306K78333
$$ plain form
17104 449124 311968 304815 -13729 754766 283624 188014 612720 173551 400920 384002
17094 384002 385546 553233 133771 403278 296589 494461 520727 308513 483663 134642
17083 290586 350834 673153 364935 464625 666269 409814 230222 390253 502320 608734
17073 608734 735467 444533 741200 519781 622463 468393 408495 163463 86606 324272
17063 324272 65468 270254 228678 713046 439401 380179 269672 219541 493860 195997
17052 352902 329482 392581 792139 607029 432692 414658 258216 458832 482392 555032
17042 555032 596249 432265 268480 582471 408382 229620 403052 418390 347671 328005
17032 328005 802791 364367 672102 171914 510656 466631 495830 622965 368659 646992
17022F46992p981j00395r3281M74233j58065l34030p8100M61809B22768N27803
17012G50571C70161p2137M11590k66315M7232J73505O9591j95798L5918j35579
17002D38168M95093j38162J542l96748M36408C30630M77337J81049j50185j61088
16992F77743J33842j53829l24369M35840j02784R9074l39952L87606q1464L275
16982G34982j17767M427j07762L77155J99468m25968P7559l8297M8316J28438
16972H80551j61687J01936k74323M41666j58979J41923p7470q6373n0216p6187
16962F80841L15428r2502j00022k27420N27000k42081k20189j24342M99939l41343
16952F75309j04315Q9555K77644K73682j90143j53649K0967L04590q4933l9965
$$ plain form
17022 646992 639011 538616 445335 919568 761503 427473 349373 811182 222768 750571
17012 750571 370161 298024 709614 443299 490531 664036 733627 537829 573747 438168
17002 438168 933261 795099 796641 399893 836301 330630 807967 989016 838831 677743
16992 677743 811585 657756 333387 769227 666443 765517 425565 813171 731707 734982
16982 734982 617215 621642 513880 891035 1090503 664535 742094 703797 752113 880551
16972 880551 718864 820800 546477 988143 829164 971087 893617 807244 757028 680841
16962 680841 996269 903767 803745 576325 1103325 861244 641055 516713 1016652 675309
16952 675309 570994 660549 938193 1211875 1021732 868083 889050 1193640 1108707 1068742
16942A068742P6100j40873o5713o7764L18017m54092N61833j94489N6416m3373
16932A114804L80281j39482j35722k36J29317j73341L0047R3709m03477J6261
16922I12161J28077M62964k58754k51643N18172l3543j73870J54197J94850l01287
16912A351324L61568m29496k54316j2912L93896j18011N05346r5288j96848j71709
16902A333554j64526L6629J79902M37745k0246k03445P2q2780M41522k91010J5317
16891A682734J82294j27906r6923K29451K14843j29627l46088M13517j91913Q6547
16881A916929j8491q3537O3825N7777o2513J80186N5519j41847l21021N89609
16871B236436J21134k47537J72024l1236j39082k86077L66633L78184k32795k43930
$$ plain form
16942 1068742 1144842 1003969 938256 870492 1188509 734417 1296250 1101761 1158177 1114804
16932 1114804 1495085 1355603 1219881 1219645 1348962 1175621 1205668 1299377 895900 912161
16922 912161 1040238 1503202 1244448 992805 1510977 1477434 1303564 1457761 1652611 1351324
16912 1351324 1712892 1283396 1029080 1016168 1410064 1292053 1797399 1702111 1505263 1333554
16902 1333554 1169028 1205657 1385559 1823304 1803058 1599613 1599685 1516905 1958427 1667417 1682734
16891 1682734 1865028 1737122 1640199 1869650 2084493 1954866 1608778 2022295 1830382 1916929
16881 1916929 1898438 1814901 1878726 1936503 1873990 2054176 2109695 1967848 1646827 2236436
16871 2236436 2357570 2110033 2282057 2250821 2111739 1825662 2192295 2570479 2337684 2093754
16861B093754J6828L44675M2314j48852J44958L51107j32496P6715j3341P1097
16851B846759J78589n8058l78082k5609N73206l4883k82721L75171j83173K35493
16841C246692J81129R91o58Q7019r3693L2619O8326J3567N2850J47795k6647j3401
16829C696589N28365j69342K20386J1848N8774l4111J31309J24342L4281J75907
16819D778348k5536M0728O3733M1203K12340J38848q1940J05124L11265o0402
16809E523711P3299K44916l4393K01714N29416j37398L75776j61195J99321L61843
16799G177010k77313N78939o4564N45487k46550N46975r6024K75875L99277L94211
16789I233323k62063N55262j23086N16520J56773O63504l81896N70828K90144
$$ plain form
16861 2093754 2110582 2455257 2497571 2348719 2493677 2844784 2712288 2789003 2775662 2846759
16851 2846759 3025348 2967290 2589208 2563599 3136805 3101922 2819201 3194372 3011199 3246692
16841 3246692 3427821 3428812 3428154 3515173 3421480 3454099 3522425 3535992 3588842 3736637 3709990 3696589
16829 3696589 4224954 4055612 4275998 4287846 4346620 4312509 4443818 4568160 4602441 4778348
16819 4778348 4752812 4793540 4857273 4898476 5110816 5249664 5167724 5272848 5584113 5523711
16809 5523711 5597010 5841926 5807533 6009247 6538663 6401265 6777041 6615846 6815167 7177010
16799 7177010 6899697 7478636 7414072 7959559 7713009 8259984 8163960 8439835 8839112 9233323
16789 9233323 8971260 9526522 9403436 9919956 10076729 10740233 10358337 10929165 11219309
16780A1219309L62561L89104J87094P15034K07760M63724P19691k07355J045427
16771A5102349J10986K07215R87315L07197J027390N16231P77118R00439O18447
16762B0554687M92347J004040Q30863P82655R00803P05089J726280J115280J543105
16753B9655149J325942J363054J378038J738185J424677K077358J943678K144564
16745D3050645K391547K485723K490790K974480K977015L588822L502631L849437
16737F7311090M392781M707744M708103M920178N960585O054608O700242O837279
16729A11592610P233335P978617Q546777Q574023Q692266R297754R023150Q704073
16721A79642605Q406427P494560O539340N545544L547953K733390K99656j491559
$$ plain form
16780 11219309 11581870 11970974 12158068 12873102 13080862 13544586 14264277 14056922 15102349
16771 15102349 15213335 15420550 16407865 16715062 17742452 18258683 19035801 19936240 20554687
16762 20554687 21047034 22051074 22881937 23664592 24565395 25270484 26996764 28112044 29655149
16753 29655149 30981091 32344145 33722183 35460368 36885045 38962403 40906081 43050645
16745 43050645 45442192 47927915 50418705 53393185 56370200 59959022 63461653 67311090
16737 67311090 71703871 76411615 81119718 86039896 92000481 98055089 104755331 111592610
16729 111592610 118825945 126804562 135351339 143925362 152617628 161915382 170938532 179642605
16721 179642605 188049032 195543592 202082932 207628476 211176429 213909819 214209475 212717916
16713B12717916k872228m279495n780906p527504p816928q430822r191226r050833
16705A57767974r451091r283851q683276q329536p764615p511770o974455o397363
16697I3372017o097020n969905n018233m707793m657192l876941l763146l760938
16689E5520849l114674k989724k913486k457382k544684j925110k401118j661847
16681C5512824j558978k177643j452333j398505j488106q29735r40687j159855
16673B4506982j307436j148594n58217r51069j206045n37476o48834l78817r86994
16664A6783500l00082j225364k71476n60373m13216n37763n14406k74874n92059
16655A2093887k35670l83646l76398m03420p1962k25326o00381j04209m24935
$$ plain form
16713 212717916 209845688 205566193 199785287 192257783 184440855 176010033 166818807 157767974
16705 157767974 148316883 139033032 130349756 122020220 114255605 106743835 99769380 93372017
16697 93372017 87274997 81305092 76286859 71579066 66921874 63044933 59281787 55520849
16689 55520849 52406175 49416451 46502965 44045583 41500899 39575789 37174671 35512824
16681 35512824 33953846 31776203 30323870 28925365 27437259 26607524 25666837 24506982
16673 24506982 23199546 22050952 21492735 20541666 19335621 18798145 18149311 17770494 16783500
16664 16783500 16483418 15258054 14986578 14426205 14012989 13475226 12960820 12685946 12093887
16655 12093887 11858217 11474571 11098173 10694753 10622791 10397465 9797084 9692875 9267940
16646I267940k84506j60931n22698l77679K17715j81830l37054j37500l12794
16637G170663j34724j11536O4976l85258R2060m91049l43245Q879m6056k50122
16627E574588k50059M32064l53034j57433k30209o8651r0017j22705m19286N8970
16617D374228N9409J44621m0205o82524l03435L12457k51091n3863j66219k6690
16607C366688J7119j43402R5338m6615J37946k66261K58265j87298j68996q8002
16597B974782k7654k52636p261K10935o0327l35186k1572P176L7307m4131k7972
16586B453461J07142n8780l57965j11372K70090o0807j58918J75013q6801l0171
16576B140892R7978l48261L33807k67577j14097N2227j77309J50409N067N6874
$$ plain form
16646 9267940 8983434 8822503 8299805 7922126 8139841 7958011 7620957 7483457 7170663
16637 7170663 7035939 6924403 6989379 6604121 6696181 6205132 5861887 5870766 5824710 5574588
16627 5574588 5324529 5756593 5403559 5246126 5015917 4947266 4857249 4734544 4315258 4374228
16617 4374228 4433637 4578258 4538053 3855529 3552094 3864551 3613460 3559597 3393378 3366688
16607 3366688 3383807 3240405 3335743 3289128 3427074 3160813 3419078 3231780 3062784 2974782
16597 2974782 2947128 2694492 2687231 2898166 2837839 2502653 2481081 2488257 2525564 2481433 2453461
16586 2453461 2560603 2501823 2143858 2032486 2302576 2241769 2082851 2257864 2171063 2140892
16576 2140892 2238870 1890609 2224416 1956839 1842742 1894969 1717660 1868069 1873136 1930010
16566A930010l11798l421j20600J17854K58872k30594K10269l79247N4655J11375
16556A637375J71585r7126l63485O6126K17993m77414l8144K17628J20286K5468
16546A480292m28317J31711j05979L75992m158k8240l36374L54997j75525L6230
16536A300629r2562m2037L47160m00330K61287l6895q9804L5769k44463P1659
16526A110413j34081J61897k55636J41445r6939k12858J77457J64728l25579J69185
16516I00032p5211N6063K19365k85188J92943k39721J77511k3902o9781J9434
16506H71545K33786j42510k93158J50041k99867j7706M84270l03673l8250N5418
16496F99896j04243J23797J6112K52385l43715K58535j63540p5388B59581M29795
$$ plain form
16566 1930010 1618212 1614791 1494191 1612045 1870917 1640323 1850592 1471345 1526000 1637375
16556 1637375 1808960 1711834 1348349 1414475 1632468 1155054 1116910 1334538 1454824 1480292
16546 1480292 1051975 1183686 1077707 1453699 1449541 1421301 1084927 1439924 1264399 1300629
16536 1300629 1208067 1166030 1513190 1112860 1374147 1337252 1247448 1283217 1038754 1110413
16526 1110413 976332 1138229 882593 1024038 927099 714241 891698 1056426 730847 900032
16516 900032 824821 880884 1100249 815061 1008004 768283 945794 921892 852111 871545
16506 871545 1105331 962821 669663 819704 519837 502131 986401 682728 644478 699896
16496 699896 595653 719450 735562 987947 644232 902767 739227 663839 259581 689376
16486F89376J41161j22084j68021k02461M86047j22022j17706J03975K18432j93763
16476G12934Q5360J5832l9486k91774r0987N13016C61472K58835k46212L6001
16466D10096j48704J77963J21648J01981B44710J16346r5411J31614L18497j36057
16456E79699A20695L71716N5935B06447J77045J68612j64683J22782O9077l8758
16446E40522l0379J9341P6783B82062K00493j04116R784N6923j23549L92869B60311
16434B6757J09574D9899L06638Q6134K12113A92032L72430k53314R9417K8372
16424D38937A58299L88170j5143k21864J61693n1416j70686J07682j74263L52098
16414E34570B63036J11554J08885A69040J2288J93398j07929P5659J39433B29515
$$ plain form
16486 689376 830537 708453 540432 337971 824018 701996 584290 688265 906697 712934
16476 712934 798294 814126 774640 482866 391879 904895 361472 620307 374095 410096
16466 410096 261392 439355 561003 662984 244710 361056 265645 397259 715756 579699
16456 579699 120695 492411 548346 206447 383492 552104 387421 510203 579280 540522
16446 540522 510143 529484 606267 282062 482555 378439 388223 445146 321597 714466 260311
16434 26757 136331 49899 356537 442671 654784 192032 564462 311148 410565 438937
16424 438937 158299 546469 531326 309462 471155 419739 249053 356735 182472 534570
16414 534570 263036 374590 483475 169040 181328 374726 266797 342456 481889 229515
16403B63130K8417P5020H6370K99889F9126J36128K50616j76109K0884I4159J96194
16392B90353r1380K40066j71788r9782j7206J07373J91457J42327G9583M6549
16382A26132J34890o1901F0237K83378j67632j7186K69054r6266q0346j04898
16372A46341b04849B169K65976L1758H9188K32944j26260i4481B67023J05182
16362C72205Q6747e8492B13052r8545k3434m1711c0240A22102K30855e4944E4908
16350C98786j98827Q1936a42439G2188J91184J85329d6406B56244J83335A11428
16339A51032f0728A30576C1830J16096l8087k6425L10154A57659L3328J1113J21173
16328C23273A27493j8737J769M02641j99588j20644M14022B40129j05187J42081
$$ plain form
16403 263130 291547 366567 86370 386259 69126 205254 455870 279761 300645 94159 290353
16392 290353 198973 439039 267251 167469 150263 257636 449093 591420 79583 126132
16382 126132 261022 199121 60237 343615 175983 158797 427851 331585 251239 146341
16372 146341 -204849 2169 268145 299903 89188 322132 195872 -94481 267023 372205
16362 372205 458952 -58492 213052 114507 91073 49362 -30240 122102 352957 -54944 54908
16350 398786 199959 281895 -142439 72188 263372 448701 -46406 256244 439579 111428
16339 151032 -60728 130576 31830 147926 109839 83414 393568 157659 190987 202100 323273
16328 323273 127493 108756 110525 513166 313578 192934 606956 240129 134942 277023
16318B77023J40343j37036j09430J60137j57409g9230A34563l7508a0362D03809
16307i8924B83233A27007h981A58008o0533J20319A8520K00747J26839A14892
16296B73806B1906P4909K9225l1621h3764F1269a7675B04959j2325d3284A64782
16284C115c7883A95447c50780B4036J32035a73835P9233A03399J81107b21521
16273c7144n089n3716d0535C83052c9204C06576A05942g3037F8876J35475j543
16262B02808a9932f529A73906F4597d9977E7643J31066e4347B40207H824g9582
16250E396K31434e1302D0167a54084A63949f6795B65752b8657C09064A11117m8750
16239F2367K09200a52278q7804e410j87075A56670J17982G805N2927L79137F7699
$$ plain form
16318 277023 417366 280330 170900 331037 173628 -79230 134563 97055 -10362 403809
16307 -98924 283233 127007 -8981 158008 97475 217794 18520 219267 346106 114892
16296 273806 21906 96815 126040 94419 -83764 61269 -17675 204959 192634 -43284 164782
16284 3115 -37883 195447 -350780 24036 156071 -173835 -94602 103399 284506 -221521
16273 -37144 -42233 -95949 -40535 383052 -39204 306576 105942 -73037 68876 204351 202808
16262 202808 -19932 -6529 173906 64597 -49977 57643 188709 -54347 240207 8824 -79582
16250 5396 236830 -51302 40167 -154084 163949 -66795 265752 -28657 309064 111117 62367
16239 62367 271567 -152278 -240082 -5410 -192485 156670 274652 7805 60732 439869 67699
16227A63357O2126k7444a06911A48691a89905k6508B65544c8765n6810j41271
16217b36846R1690C9542K1325c6665l8296F8763g2588A07551g899A44944e4317
16205A96993d5258B26546a9091l5913o4552M1731D3031K80247E2429Q1951c10568
16193B59206A15777J14454B119M8339j3128e8927k64138A49075J90101b22785
16182a8336k42054A20055a69204B05057b20986A64354a55974E50542a93441A86600
16171A16397c21868A00786J9432a1698C3197R1249C5526L9076c594F5200a78664
16159A47246O9430a19537A35427A1886J97869i4206G9473J41685a25913a7869
16148a17142A29374c8454d190j810A52997a87205b6528A66336A5233K07532a75199
$$ plain form
16227 163357 225483 198039 -106911 148691 -189905 -216413 265544 -38765 -95575 -236846
16217 -236846 -145156 39542 60867 -36665 -74961 68763 -72588 107551 -7899 144944 -54317
16205 196993 -45258 226546 -19091 -55004 -119556 -77825 43031 323278 52429 134380 -310568
16193 259206 115777 230231 2119 50458 37330 -58927 -323065 149075 339176 -222785
16182 -18336 -260390 120055 -169204 205057 -220986 164354 -155974 550542 -193441 186600
16171 116397 -321868 100786 120218 -11698 33197 124446 35526 74602 -3594 65200 -178664
16159 147246 216676 -119537 135427 11886 209755 -94206 79473 221158 -125913 -17869
16148 -117142 129374 -38454 -4190 -6000 152997 -187205 -26528 166336 15233 222765 -175199
16136a01079j09869R6689B23671D3776M3787d17935D32353c7256O106A08241e7562
16124g4215A12460C9464K09648g1397A65235g0689l2504d2879l2279A6144a85872
16112c49444f0606F3908h6356A43314C8518a22537d1839j4407k50584A09190j3237
16101I5953b81781A23043E9439N8333L9211J6933c49032f9769j33301A34213J2211
16090A46424a14550d2684B48670l3293p1137d2340l27260A19632L1836B6548K23952
16079B50500i8872A30017b1130j37920j64026a31501N663L8603B444e4574i895
16067a76700A56321c7226C2533a70537k27775G1956c12665B6999J58868F8349
16056a22855p3075A85303A0608a28234l2830A05643K20669A4478i678k31149f2003
$$ plain form
16136 -101079 -210948 -114259 223671 43776 87563 -417935 432353 -37256 -31150 108241 -57562
16124 -74215 112460 39464 249112 -71397 165235 -70689 -103193 -42879 -75158 16144 -185872
16112 -349444 -60606 63908 -86356 143314 38518 -122537 -41839 -56246 -306830 109190 95953
16101 95953 -281781 123043 59439 117772 156983 173916 -349032 -69769 -203070 134213 146424
16090 146424 -114550 -42684 248670 215377 144240 -42340 -369600 119632 151468 26548 250500
16079 250500 -98872 130017 -21130 -159050 -323076 -131501 -125838 -87235 2444 -54574 -9895
16067 -176700 156321 -37226 32533 -170537 -398312 71956 -312665 26999 185867 68349
16056 -122855 -195930 185303 10608 -128234 -161064 105643 326312 14478 -9678 -240827 -62003
16044b25275A8788d122o8724r7708A47992e9800C98612c95239M5773J9658A2983
16032A85509b51832Q0619o3796b1613A18507a72920b9102C033b84394G51M8339
16021D9090h276l09166E9281i7059b5787o0061n5867B14918C7373a7510B6903
16009f2038k62920Q4863B05940b51279B38748A14214a17736K6866l09176f8206
15998e9822l08470e3780N795j9629H2023m289b28724d565k58769L7889L0045f4382
15985G884f6838H2986O5942O5997F508K44670o6068D6203P0803K85474G4120c03421
15972a01189n2377N3343j19630A82649B6798L3826b8264G8510d9519A00301c9656
15960g2741A71819C1598f1546b9690k2354m4379j20859C7183a00513j08917R3636
$$ plain form
16044 -225275 18788 -4122 -72846 -170554 147992 -59800 398612 -395239 -349466 -329808 12983
16032 185509 -251832 -171213 -235009 -21613 118507 -172920 -29102 3033 -284394 751 49090
16021 49090 -8276 -317442 59281 -97059 -25787 -85848 -141715 214918 37373 -17510 26903
16009 -62038 -324958 -240095 205940 -251279 238748 114214 -117736 -90870 -400046 -68206
15998 -59822 -368292 -53780 -47985 -67614 82023 77734 -228724 -4565 -263334 -225445 -195400 -64382
15985 7884 -66838 82986 148928 214925 6508 251178 185110 46203 117006 402480 74120 -303421
15972 -101189 -153566 -100223 -219853 182649 26798 60624 -28264 78510 -49519 100301 -39656
15960 -72741 171819 31598 -61546 -29690 -52044 -96423 -217282 37183 -100513 -209430 -115794
15949a15794E5524a80430A28248E6685a17464d7749a5187j54485C3028a53993
15938a47144A20310E8060i1332A77011k2741F0744M8995a85231j37109P7844B12080
15926b91735A15160B7234b7101F9620a57619k2351B4966B640K24426o2833J00503
15915B64736d9348o2010r5835b8110B9380a26989d7367q5881A14538j9760d49549
15903A40604F2655b03964M9816B59568a69396j32571A3433g8816J035n3831A07095
15891G6046a35349j00314R6245k4891b2731H651C027e1606K329k53132A25370
15879b45967O134N5569B31688j09306G078Q0840a4393D2154a48458B41751d8097
15867b0974B1206d5090k56325B63504d7942o2494e0854o0468q272H3300f6384
$$ plain form
15949 -115794 55524 -180430 128248 56685 -117464 -47749 -15187 -169672 33028 -153993
15938 -147144 120310 58060 -91332 177011 154270 60744 109739 -185231 -322340 -244496 212080
15926 -291735 115160 27234 -27101 69620 -157619 -179970 24966 2640 227066 164233 264736
15915 264736 -49348 -111358 -207193 -28110 29380 -126989 -47367 -133248 114538 94778 -449549
15903 140604 62655 -203964 -154148 259568 -169396 -301967 13433 -78816 -77781 -131612 107095
15891 76046 -135349 -235663 -139418 -164309 -22731 8651 3027 -51606 -49277 -302409 125370
15879 -245967 -239833 -184264 231688 122382 7078 87918 -14393 42154 -148458 241751 -48097
15867 -20974 21206 -45090 -301415 263504 -47942 -110436 -50854 -111322 -119594 83300 -66384
15855d497m08989b8244j72339G0895b42447B39234b45182f5526b0386D7051a10724
15843f5052a2667A60975a409o1129H8554c25286h1877r02k0576k91982a69497
15831d90891b20490q3229A5191e7449b980m302j05727e438C0318b76133a00113
15819b43275E1765b45791A01189a76648A20631c37602f6328r2720c8802A80013
15808A4237K01061e5380E6554c9381J5216A27267A1736a98138G75b8044e99j77729
15796a78328j5496H2433M8113a35212j28544a19009G304M3292a49193a9326j37951
15785a57277N3261B06103a7925k78093H287c09364C7333a70017o0412B0185K33133
15774B53318D5497J03864B3562a13070q6561C2269a77499l476e6722H9887g6912
$$ plain form
15855 -4497 -413486 -28244 -200583 70895 -242447 239234 -245182 -65526 -20386 47051 -110724
15843 -65052 -12667 160975 -1409 -62538 88554 -325286 -81877 -82779 -103355 -395337 -169497
15831 -490891 -220490 -303719 15191 -57449 -2980 -7282 -113009 -5438 30318 -276133 -100113
15819 -243275 51765 -245791 101189 -176648 120631 -337602 -66328 -159048 -38802 180013
15808 14237 215298 -55380 56554 -39381 -24165 127267 11736 -198138 775 -28044 -599 -178328
15796 -178328 -193824 82433 130546 -135212 -263756 -119009 7304 50596 -149193 -19326 -157277
15785 -157277 -104016 206103 -17925 -296018 8287 -309364 37333 -170017 -230429 20185 253318
15774 253318 45497 149361 23562 -113070 -199631 32269 -177499 -180975 -56722 89887 -76912
15762f3926l9117J490E2844d2006B51985m9447a12228c8252A91460a60705A96607
15750H4726a11336l4856H7040k9633P8947f4162A09286J895B6601a1723A54792
15738A56540D9864j9146f57m43600E9181L9977b60841a23566O1373B7073a07044
15726a48544D1319a64849G6274b5007k629B9351b48861A47150d17205H1074d74112
15714C5555O3238J94780g498G8005b22906d0586j92348j4241f041C7002A0246
15702D4124L4851b33653g0441k42939J39232G6716B7391b44970b5486m22937B18567
15690B0488K45133d37803g7410H1337Q1659C9711a67629C1537b85272B04238a73491
15678i4462A0277b47455e4103A08417f7923C90417c5720A60797k8337F1174a79216
$$ plain form
15762 -63926 -103043 -101553 52844 -42006 251985 202538 -112228 -38252 191460 -160705 196607
15750 84726 -111336 -146192 87040 57407 136354 -64162 109286 111181 26601 -11723 154792
15738 156540 49864 30718 -657 -444257 59181 99158 -260841 -123566 -62193 27073 -107044
15726 -148544 41319 -164849 76274 -25007 -27636 29351 -248861 147150 -417205 81074 -474112
15714 35555 98793 293573 -7498 78005 -222906 -40586 -232934 -247175 -6041 37002 10246
15702 44124 78975 -233653 -70441 -313380 -174148 76716 27391 -244970 -25486 -448423 218567
15690 20488 265621 -437803 -77410 81337 162996 39711 -167629 31537 -285272 204238 -173491
15678 -94462 10277 -247455 -54103 108417 -67923 390417 -35720 160797 132460 61174 -179216
15666b57611A16713a97175B03441a95608A68823k9204B7287D695c9371A31419
15655H6184L4781b43182k1517L8220P9317G5015J21232p0540B5241R5291J04049
15644B24581g1577k23896C17138i7095A01405g4390c0733j50930N0207a5055j75665
15633a90720A5244a98255H9516J49261b8681l1074j19586L3297B60457b7586k96545
15622c24131B24669I8081b09037d1546C9862a90931N0210A47556L7501a03100
15611G3994J06217J8504G221J2117b85643E3624c33607H8023m284l8164J0171
15600E5746J19633L8590h0226B99208d03667J21462c1710A20564c10068C1880
15589E3097a52201g1050A67047D2383J71559f756j51047j09231A26190a76390
$$ plain form
15666 -257611 116713 -197175 203441 -195608 168823 139619 27287 4695 -39371 131419
15655 86184 120965 -243182 -264699 -226479 -147162 75015 196247 125707 25241 120532 224581
15644 224581 -71577 -295473 317138 -97095 101405 -74390 -30733 -181663 -131456 -15055 -190720
15633 -190720 15244 -198255 89516 238777 -28681 -59755 -179341 -146044 260457 -27586 -324131
15622 -324131 224669 98081 -209037 -41546 39862 -190931 -140721 147556 185057 -103100
15611 73994 180211 198715 7221 19338 -285643 53624 -333607 88023 83739 45575 55746
15600 55746 175379 213969 -80226 299208 -403667 -282205 -31710 120564 -310068 31880
15589 53097 -152201 -71050 167047 42383 213942 -6756 -157803 -267034 126190 -176390
15578A65539b52267o118D0250h6911p8193j0110A05488P7532O8305h648F3368
15566b9214A77015b1422A63848f2675j39175q461O4070f3972j29979j16959B5850
15554B02103k1682M3533c54092L8399j77777b42747A61396I198a39544I9866c8157
15542c65168c2003j14924b9639A19857K41668A74236a05238E6186a17650b9889
15531A57317b56184Q3417F0230Q3762e2586q0085A52951a07900k67072E9420a79214
15519c10178c4848l47215A7144M1537J12636l6562m942a36663j85216A91122a57300
15507A87234C6919J5720n91c3763B44057c97711f2391k10573b9446B13469d10967
15495A04432K3084l8444i3917A73651p1527i1122j46737E4961a24959D32322a3788
$$ plain form
15578 165539 -252267 -258385 40250 -86911 -165104 -175214 105488 183020 251325 -8648 63368
15566 -29214 177015 -21422 163848 -62675 -201850 -210311 -146241 -63972 -193951 -310910 25850
15554 202103 180421 223954 -354092 -315693 -493470 -242747 161396 9198 -139544 99866 -38157
15542 -365168 -32003 -146927 -29639 119857 361525 174236 -105238 56186 -117650 -29889
15531 157317 -256184 -172767 60230 143992 -52586 -132671 152951 -107900 -374972 59420 -179214
15519 -310178 -34848 -382063 17144 58681 171317 134755 129813 -136663 -321879 191122 -157300
15507 187234 36919 52639 52048 -33763 244057 -397711 -62391 -272964 -29446 213469 -410967
15495 104432 127516 89072 -93917 173651 102124 -91122 -237859 54961 -124959 432322 -13788
15483c3543j95710i8639A27304Q5200a3391H7190K58413c8735j98146P0511A42492
15471b49241A23133k4693m7709Q5313D0980C105b584C06650l3453c7100I5300
15459a26010N4271k67744I3378b40352d3306I7551B2218e1400A44403g4336C09656
15447a34762D6252c81107D4939k322H932J40691b32947A14356R8240p7780a12295
15435B50545G5723J66355F7929J18445J0871J0065a04314j10532j00424A77017
15424f2126J7665C41485a70031f376j58269O0630J9731B0118b17085C66373c94448
15412F431L126J52102J29752j02370b2920I2344I89a35508r6748C42690d46978
15400G0271l807J05049b47642A7541J35092d08666I3382a64396j91657A28685
$$ plain form
15483 -33543 -229253 -98639 127304 212504 -13391 87190 345603 -38735 -236881 -166370 142492
15471 -249241 123133 98440 50731 136044 40980 3105 -2584 306650 273197 -37100 95300
15459 -126010 -71739 -339483 93378 -240352 -43306 97551 22218 -51400 144403 -74336 309656
15447 -134762 46252 -381107 44939 42617 8932 149623 -232947 114356 212596 134816 -112295
15435 250545 75723 242078 67929 186374 197245 207310 -104314 -214846 -315270 177017
15424 -62126 -44461 341485 -170031 -6376 -164645 -104015 -84284 20118 -217085 366373 -394448
15412 6431 9557 161659 291411 189041 -22920 92344 989 -135508 -232256 342690 -446978
15400 70271 66464 171513 -247642 17541 152633 -408666 93382 -164396 -356053 128685
15389A15160g8975D5638M0646e4379M869j10038l1882A27284c9125j43101g8510
15377B5582Q9810b19015R7798F5130J13003b17083O4793D2910R1949B1290M2388
15366F3678b1212r219b220E10465a29979H7314M4324b30233G8079k4177O7426
15355A21328F138i8223K9572j68332B1272R1386b67243K75A63465b32163B45836
15343i5692k6371I7916l7603A6024b3226A67046C1567K62333l8868J03967p8658
15332B80341k4753d1648B7666a83057E4433k3077a62483n1086D3926J46481b17616
15320h1986a0265G4493d936j45429A0204e820r4957C15094i9671C5239b75275
15308b01425C6527R0192K1805Q560n2598l9371f5584B82156i7554A49239a58831
$$ plain form
15389 115160 -78975 45638 86284 -54379 -49510 -159548 -191430 127284 -39125 -182226 -78510
15377 25582 115392 -219015 -121217 65130 178133 -217083 -152290 42910 134859 21290 63678
15366 63678 -21212 -30431 -2220 510465 -129979 87314 131638 -230233 78079 53902 121328
15355 121328 6138 -98223 -68651 -236983 21272 112658 -267243 -266968 163465 -232163 245836
15343 -95692 -122063 97916 60313 16024 -23226 167046 31567 293900 255032 358999 280341
15332 280341 255588 -41648 27666 -183057 54433 31356 -162483 -213569 43926 190407 -217616
15320 -81986 -10265 74493 -4936 -150365 10204 -5820 -100777 315094 -99671 35239 -275275
15308 -201425 36527 126719 148524 157084 104486 65115 -65584 282156 -97554 149239 -158831
15296i6884B16988b22369A64586b41511c1827B19044R2237A27736N0481h8774
15285B45281b26364A2620J95570a08089C04436I5653A6269c3638j21945A76717
15274A58171f5831A59174e3505j43337F1970a04220b9643A94331G0740J1261i6087
15262b69658B05595a32476A57785M79953B46343d5166n3937I883e8648C57433
15251B34883D6760L81410K87879Q30609l45662r2446M49701n96802C37728F9387
15240a36530A11959M9851B0464J35416m5761m2469K71673e8414l4717j61118D8102
15228A52670b32376A16801q82k7080a12946n2842A58118N9876J47191H3458j2529
15217G0929F368a22813k6439r870A50667E3244a19117K0866j21676C252K27098
$$ plain form
15296 -96884 216988 -222369 164586 -241511 -31827 219044 311281 127736 178217 -88774
15285 245281 -226364 12620 208190 -108089 304436 95653 16269 -33638 -155583 176717
15274 158171 -65831 159174 -53505 -196842 61970 -104220 -29643 194331 70740 82001 -96087
15262 -269658 205595 -132476 157785 637738 246343 -45166 -99103 9883 -58648 357433
15251 234883 46760 428170 716049 1546658 1200996 1108550 1558251 961449 337728 69387
15240 -136530 111959 161810 20464 155880 110119 67650 339323 -58414 -93131 -254249 48102
15228 152670 -232376 116801 115919 88839 -112946 -165788 158118 217994 365185 83458 70929
15217 70929 6368 -122813 -149252 -159122 150667 53244 -119117 -98251 -219927 3252 230350
15206B30350G5173J42840P8274r6081j6278F804K51383P6899L7189A65675h534
15194A12113n4666a97037G0218C0303J65022J42092o1819A35500j3941p341B4137
15182D34197e4569J4891C63018b8291H2401g0146P907J5018j51310C03189o5942
15171B37247K49260a1798k71783I3720Q8871D336L0085M01B826O9206N6568Q6
15159A28686a94058B87397F056d6201A66424a64524B74914p5881m0791J33040
15149B91282r8394a94787A93366g5295A53978d4763A673R8560L40635A01641c60807
15137C4290O6837a24560A64936a16002J7337l8263f099j99554B0800a56741D38274
15125C53280f9736A65288G8950L3793b8619B65544N9936a64987A46772a70497
$$ plain form
15206 230350 75173 218013 296287 200206 183928 6804 258187 335086 372275 165675 -8534
15194 112113 57447 -197037 70218 30303 195325 337417 275598 135500 121559 114218 24137
15182 434197 -54569 -39678 363018 -28291 82401 -70146 -62239 -47221 -198531 303189 237247
15171 237247 486507 -11798 -283581 93720 182591 4336 34421 34822 2826 72032 128600 128686
15159 128686 -194058 287397 6056 -46201 166424 -164524 274914 199033 158242 291282
15149 291282 192888 -194787 193366 -75295 153978 -44763 1673 100233 440868 101641 -360807
15137 34290 101127 -124560 164936 -116002 -98665 -136928 -6099 -205653 20800 -156741 438274
15125 353280 -69736 165288 78950 112743 -28619 265544 325480 -164987 146772 -170497
15114G0651L77897A81265A6323J69377n6521K68354n380b5991F4239N6392K35191
15103C55822j58606d1026A5445J29453J74162B5466J41343A8513L19993m5451
15093B93055A39054J45268a9595B62237q2204k0809P6094j12448K2714M3555Q1243
15082B70382b0097A16120F693L22004E1453N4276m1029K00241J0570n7107C5296
15070C6976p583J1275K41572a85507C12013A00489d00017a00973C73220J5368
15060C88588h6598C51223p0942J1079o3189I5281Q1716F1205M16681I6334g5207
15048a29860A19653J81722J62315b07387D92477j77332A11704L50598A4543K48405
15038B62948a79940A84207C7907Q8635e5165B01274J55369q9065j0754D5333K32160
$$ plain form
15114 70651 448548 181265 16323 185700 129179 397533 392153 -25991 64239 120631 355822
15103 355822 197216 -41026 15445 144898 319060 25466 166809 18513 338506 293055
15093 293055 139054 284322 -19595 262237 180033 159224 235318 122870 145584 189139 270382
15082 270382 -20097 116120 6693 328697 51453 105729 64700 264941 275511 218404 35296
15070 36976 29393 40668 282240 -185507 312013 100489 -400017 -100973 373220 388588
15060 388588 -86598 351223 280281 291360 228171 95281 176997 61205 477886 96334 -75207
15048 -129860 119653 301375 463690 -207387 492477 315145 111704 462302 14543 262948
15038 262948 -179940 184207 37907 126542 -55165 201274 356643 267578 256824 45333 277493
15027B77493O6529a57654B36262k4663B040M05976R0961A0733K92560a4434B58468
15015C70088a9307k0435A98400B042L39843B6118K07563d4886B96860a15554A32860
15003A81001i8548b5698A68017N6713L01711j02922b11327M1299B59426j9626
14993B39800m3391K19576g5150B57173K0692j10138j5425K94980c3510F1388L45558
14982D06946L8101a30550D9318M64316k35484J64331j27688F6352K37119m8685
14972B54786G8914M50907f5815B40279q7316K73883C3915Q2517J8343K15223P8666
14961D28664j18696r9881O6307k8706K35097l8224J04998j48042G4145K05185
14951B79330j31186J55453K93447b2228D57328e569C20781l0831g1591A87775
$$ plain form
15027 277493 344022 -157654 236262 211599 2040 408016 498977 10733 303293 -14434 258468
15015 370088 -19307 -39742 198400 2042 341885 26118 233681 -44886 296860 -115554 132860
15003 181001 -98548 -25698 168017 224730 526441 423519 -211327 -170028 259426 239800
14993 239800 196409 415985 -75150 257173 277865 167727 152302 447282 -33510 61388 406946
14982 406946 445047 -130550 49318 513634 278150 442481 314793 66352 303471 254786
14972 254786 78914 529821 -65815 240279 152963 426846 33915 116432 134775 349998 428664
14961 428664 309968 210087 276394 247688 482785 444561 549559 401517 74145 279330
14951 279330 148144 303597 597044 -22228 457328 -5569 320781 289950 -71591 187775
14940B32422f2178B16250r8536m8790M42186f7636C74437A48936l6808h7243F43241
14928C95480j50771A06928L92920l2552q2728C7432L55991n7476J89296A17706
14917B73637L87428l3673B53062O7335J38130N5185k21686A41885K73168j68089
14907B46964J3355A18241J56761m213J82037A24974Q8288A9644N61010J63679
14897G44333k85451j87912J29311E0929M28853j32265A45635L07962j35212j25954
14887A92431k7562K81191J64165l04179K31500j46585k042r3548L35955p0818
14877E60508m1129B9254N725L37878i4021E28325n542A21195J25961l7153P5924
14866B85927r7897K19596K9366r701L7328q1899J96987B60381I6037L05560J31292
$$ plain form
14940 232422 -62178 216250 117714 68924 511110 -67636 374437 148936 112128 -87243 643241
14928 395480 244709 106928 499848 467296 384568 37432 393423 335947 525243 117706
14917 273637 661065 627392 253062 320397 458527 513712 292026 141885 415053 246964
14907 246964 260319 118241 275002 270789 452826 124974 213262 19644 580654 744333
14897 744333 458882 270970 400281 50929 479782 347517 145635 453597 318385 192431
14887 192431 164869 446060 610225 306046 537546 390961 388919 295371 631326 560508
14877 560508 519379 29254 34979 372857 -94021 528325 522783 121195 247156 210003 285927
14866 285927 188030 407626 436992 427291 464619 382720 579707 260381 96037 401597 532889
14855E32889k24008L77348C29636K53525J40473B21717J16405A11140M69478B35653
14844C26992a44587C46115n67J08548B22820N11939k70258n1048j47164N08064
14834G74353q6428j86174K6846k41488o844J64169P4901O3424k8725A48442N23614
14823F72056o4460j89568J25759n9561j38339J86636k04982K43845L5416Q8006
14813F94808j81080j84231J84527J75307A64998L99835m7338j22674n0858l9727
14803C04236L83780Q3968m5243B65312J26938M80749l46795K41527C42220L3701
14793C75921J67133P3912B88867K68795J45028B90513M49239k62362n4000p6533
14783C46857K92424B08612L46470J43814l07180L62098M058j54852o4639j29648
$$ plain form
14855 532889 308881 686229 329636 583161 723634 221717 338122 111140 580618 235653
14844 326992 -144587 346115 345548 454096 222820 734759 464501 413453 266289 774353
14834 774353 687925 501751 528597 287109 280265 444434 519335 582759 554034 148442 672056
14823 672056 607596 418028 543787 484226 345887 532523 327541 571386 606802 694808
14813 694808 513728 329497 514024 689331 164998 564833 517495 394821 343963 304236
14803 304236 688016 771984 726741 265312 392250 872999 526204 767731 342220 375921
14793 375921 543054 616966 288867 557662 702690 290513 739752 477390 423390 346857
14783 346857 639281 208612 555082 698896 391716 753814 757872 603020 538381 408733
14773D08733L59058k95969J5821K22213q101J66440l06623j1980K26369j30473
14763F45488k39776N61408k87281K8847l07120M5647L90108k06839J65056j99705
14753E95833j08798j63089L92966P4543l75984J2487J49075P0010O6371l29o2505
14742F50580j4899k49818L95548j97057J65621J22304k50221J01433J76852k60947
14732F39396l2957K60689C84163K96708j61869o329M14346k40226B83931K47601
14722E31532P5230L16368k44560K57566k61248Q3739m0701L09490k72670k63911
14712D90835N75644j22608n1860j62952k2672N7990K0885p3791J86307K12818
14702A110596k04375k00228R117J87513J25768k14218L762m8825K5986J39912
$$ plain form
14773 408733 767791 471822 487643 709856 701755 868195 561572 549592 775961 645488
14763 645488 405712 967120 679839 708686 401566 447213 837321 630482 795538 595833
14753 595833 487035 323946 716912 791455 415471 427958 577033 647043 713414 713085 650580
14742 650580 635681 385863 781411 584354 749975 872279 622058 723491 900343 639396
14732 639396 606439 867128 384163 680871 519002 512673 927019 686793 283931 531532
14722 531532 606762 923130 678570 936136 674888 758627 717926 1027416 754746 490835
14712 490835 1066479 943871 892011 729059 706387 764377 785262 711471 897778 1110596
14702 1110596 906221 705993 715110 902623 1028391 814173 817935 769110 795096 935008
14692I35008J82809L4263m32790N16797j69510L26933m51441j00897R5794J23337
14682A060303p9978m31534M38903J7004k01907K16577k19188J19372K21563j11819
14672A029296J79052l5185N1151k42275l4515K02030o2067k70878L36519j96241
14662I56887M06032l61735j66766J04377J22226K84484l57605J03689j71945K41365
14652A161009O5187j74589J08109R5047k28413K22472J6073l99461K28416O4019
14642A157869n824K83168o324j77554R5850l74780J64950j64673L76584l4445
14632A314821K2141J49975m9065n44643L92636m3715j5363L04427p7606r9666
14622A353942j61777K52335K69761o37003M64910J7950j41503J24736j41489K18399
$$ plain form
14692 935008 1117817 1152080 719290 1236087 1066577 1393510 942069 841172 936966 1060303
14682 1060303 980325 548791 987694 1004698 802791 1019368 800180 919552 1141115 1029296
14672 1029296 1208348 1173163 1224314 982039 947524 1149554 1087487 816609 1153128 956887
14662 956887 1362919 1001184 834418 938795 1061021 1345505 987900 1091589 919644 1161009
14652 1161009 1226196 1051607 1159716 1254763 1026350 1248822 1264895 865434 1093850 1157869
14642 1157869 1152045 1435213 1428889 1251335 1347185 972405 1137355 972682 1349266 1314821
14632 1314821 1336962 1486937 1437872 893229 1285865 1242150 1226787 1531214 1453608 1353942
14622 1353942 1192165 1444500 1714261 1077258 1542168 1560118 1418615 1543351 1401862 1620261
14612A620261l1049J70991o4110j90158o963R4363n2586k212k05877J50717k8549
14601A454828m6944J80939K6398J91404r192m09739N34686j77616l3176j00664
14591A610924M83478k67939j19656J15152j96473J91652L48008m15094M07475
14582B157527j49278k01405j56518K65413J20066k62413M86636l99482L68480
14573B229026j74268J27174R5849k3187l22229L07730m48435N66557Q16P8139
14563B437172O4824J63928K11641n14346L65698J49287k20674O20451n6638L47568
14553C568911M0706K96669N56275J941008J759941M994185J0034149J5009672
14545C8201516J92316j5901123A0764455n200815j828021o98620m46406l48327
$$ plain form
14612 1620261 1589212 1760203 1696093 1505935 1498972 1593335 1540749 1538537 1332660 1483377 1454828
14601 1454828 1407884 1588823 1615221 1806625 1797433 1387694 1922380 1744764 1711588 1610924
14591 1610924 2094402 1826463 1706807 1821959 1625486 1817138 2165146 1750052 2157527
14582 2157527 2008249 1806844 1650326 1915739 2035805 1773392 2260028 1860546 2229026
14573 2229026 2054758 2181932 2277781 2254594 1932365 2240095 1791660 2358217 2359033 2437172
14563 2437172 2501996 2665924 2877565 2363219 2728917 2878204 2657530 3277981 3221343 3568911
14553 3568911 3609617 3906286 4462561 6403569 8163510 13157695 23191844 38201516
14545 38201516 38393832 22492709 10764455 5563640 3735619 3036999 2590593 2242266
14537B242266k46494K70383r4733k24603J09639L52124m39952M15576j92566j15474
14527B076166J94551J26778l75271O31669n8061m90089L37575P4277M101j15541
14517B406155J89162r1403P868k71134N30581l3643O2151J85967j72877k4988
14507B787839P0911J71339K8611k26079K35035l32057J7286J94387P6719j20676
14497B903315K90485m4663N4547p7478L49679k74020K93780j43231K68777j47218
14487C473973J71811q578J74456k31515K93777L5368J63603j77001l62591N12971
14477D046274P5360j32636J78905K32228L9269j49605j90696M82432L222l64886
14467D219867L37640O9193j82811m2386J01199L99444P6705m81636P40319p9873
$$ plain form
14537 2242266 1995772 2266155 2171422 1946819 2056458 2408582 1968630 2384206 2191640 2076166
14527 2076166 2270717 2397495 2022224 2653893 2595832 2105743 2443318 2517595 2521696 2406155
14517 2406155 2595317 2503914 2511782 2240648 2771229 2737586 2799737 2985704 2812827 2787839
14507 2787839 2858750 3030089 3058700 2832621 3067656 2735599 2752885 2947272 3023991 2903315
14497 2903315 3193800 3149137 3203684 3126206 3475885 3201865 3495645 3352414 3621191 3473973
14487 3473973 3645784 3637206 3811662 3580147 3873924 3909292 4072895 3895894 3533303 4046274
14477 4046274 4121634 3988998 4167903 4400131 4439400 4289795 4099099 4581531 4584753 4219867
14467 4219867 4557507 4626700 4443889 4401503 4502702 4902146 4978851 4497215 5237534 5157661
14457E157661m26300N80492j22969J82648j33730L58545k75852Q2536J13650j32193
14447E384488M53066k24622K46011K58050m56066K97780K56859r9789n9623L07178
14437F363332J62236L58170m25186M45269R9989k06134j10030K25438M89324n6149
14427G346259l56325L24168J35771J16441L75807O1060k71645N46809K45088j83559
14417H339874K98089j57958K51471K8588K46389j85550L62685P452J71611K44522
14407I607173K19044j4539j45639N18747j56315J00461L91202k1789M54720J08729
14397A1061794J32169N60208l82394L45070L99760k51699M20604N23708j14157
14388A2695063N54748K77225l2291j1009P95334J13943j59281O41003J77870J99383
$$ plain form
14457 5157661 4731361 5311853 5188884 5371532 5237802 5596347 5320495 5403031 5516681 5384488
14447 5384488 5837554 5612932 5858943 6116993 5660927 5958707 6215566 6115777 6056154 6363332
14437 6363332 6525568 6883738 6458552 6903821 7003810 6797676 6687646 6913084 7402408 7346259
14427 7346259 6989934 7314102 7449873 7566314 7942121 8003181 7731536 8278345 8523433 8339874
14417 8339874 8637963 8480005 8731476 8760064 9006453 8820903 9183588 9191040 9362651 9607173
14407 9607173 9826217 9811678 9666039 10184786 10028471 10128932 10520134 10498345 10953065 11061794
14397 11061794 11193963 11754171 11371777 11716847 12116607 11864908 12285512 12809220 12695063
14388 12695063 13249811 13527036 13494745 13483736 14279070 14393013 14233732 14874735 15052605 15251988
14378A5251988K35528M25398K35185L42072M42850K50098M94615k1756O6730O17871
14368A8340579O26955K10429L46646L34681J45975N93912N13607Q29244o580Q82500
14358B2817948L69062L48850P3108R80680M11828J147522O16743O115Q58709P73068
14348B8403633P78281P02042J028381M82969M80548J151366Q30228J037463Q98422
14339C5793333Q96857Q49658J189198R98476J152106J568239J125186J433170
14331D5006223Q41394J619024J473904J670029J410075J949123J584873J846854
14323E7401499K270280J731210K193923J952946K289322K533035K827332K333229
14315G5532776K998865L251983K914598L689749L304372L566478M204208M420212
$$ plain form
14378 15251988 15487516 15912914 16148099 16490171 16933021 17183119 17677734 17655978 17722708 18340579
14368 18340579 18967534 19177963 19524609 19859290 20005265 20599177 21112784 21942028 21935448 22817948
14358 22817948 23187010 23535860 23608968 24589648 25001476 26148998 26765741 26771856 27630565 28403633
14348 28403633 29181914 29883956 30912337 31395306 31875854 33027220 33857448 34894911 35793333
14339 35793333 36690190 37539848 38729046 39727522 40879628 42447867 43573053 45006223
14331 45006223 45847617 47466641 48940545 50610574 52020649 53969772 55554645 57401499
14323 57401499 59671779 61402989 63596912 65549858 67839180 70372215 73199547 75532776
14315 75532776 78531641 81783624 84698222 88387971 91692343 95258821 99463029 103883241
14307A03883241M286389M692109M870819N205866N298963O092154O009835O389946
14299A46729322P036894P597171Q004584P958313Q878099R295642R670055J0331750
14291B15501830J0792627J1312574J2368424J2433126J2941568J3593390J4059622
14284C03003161J4236343J4801102J4494644J5202359J4480102J3849539J3795003
14277D03862253J2428072J1712958R772316Q363884N338537J945837j007218l04075
14269D52112564j440828j982097k390028n533686p689881r267054j0176716j0906744
14261D02725530j2416874j4090504j4971791j5308231j5165821j5269125j4458684
14254C01044500j3674117j3919825j3363845j2678621j2118639j1785036j0547786
$$ plain form
14307 103883241 108169630 112861739 117732558 122938424 128237387 134329541 140339376 146729322
14299 146729322 153766216 161363387 169367971 177326284 186204383 195500025 205170080 215501830
14291 215501830 226294457 237607031 249975455 262408581 275350149 288943539 303003161
14284 303003161 317239504 332040606 346535250 361737609 376217711 390067250 403862253
14277 403862253 416290325 428003283 437775599 446139483 451478020 453423857 452416639 452112564
14269 452112564 450671736 448689639 446299611 440765925 433076044 423808990 413632274 402725530
14261 402725530 390308656 376218152 361246361 345938130 330772309 315503184 301044500
14254 301044500 287370383 273450558 260086713 247408092 235289453 223504417 212956631
14247B12956631j0645459r889490q876322q571198q409592p863959p375098p561942
14239A43763571n909502n516023n780778n644870n286494n047317m506704m152091
14231A01919792l728598l664468l870031l755340l092926l338199l285175k770509
14223G4414546k711799k558048j936076k163138k233484k186762k093163j772177
14215E6759899j965796j339843j689342j466278j768179j442057j482785j055688
14207D4549931o92552j504124j384769j345602r14461q57946r20573r99347r46494
14198C4984063r26801r63566o43664q97463o97057j042414o92885n59803r48736
14189B7611674l55980m46760p78001n51991p18627p97499M531j061581j80997
$$ plain form
14247 212956631 202311172 192421682 183545360 174974162 166564570 158700611 151325513 143763571
14239 143763571 137854069 132338046 126557268 120912398 115625904 110578587 106071883 101919792
14231 101919792 98191194 94526726 90656695 86901355 83808429 80470230 77185055 74414546
14223 74414546 71702747 69144699 67208623 65045485 62812001 60625239 58532076 56759899
14215 56759899 54794103 53454260 51764918 50298640 48530461 47088404 45605619 44549931
14207 44549931 43857379 42353255 40968486 39622884 38708423 37850477 36929904 35930557 34984063
14198 34984063 34057262 33093696 32450032 31552569 30855512 29813098 29120213 28560410 27611674
14189 27611674 27255694 26808934 26030933 25478942 24760315 23962816 23967347 22905766 22724769
14180B2724769p14566k21944p54549j73896o89734l12363m35165m00965l20385
14171A8701202k50331n07806l67961j34483l76270k72432j47901o19827p4833
14162A5949358m54437k89344j9775o48975l63174l8252n3315k42991o22535p2931
14152A3143629Q4991l10052j65363p72310n4833L38416m94104j46174M4969j02095
14142A1567074o96199j34106J29061n3798k38772l90302k65350Q263R1005l46173
14132I670703k67618L68375o65870L03283k59799k60665n2248j00544m53264J38858
14122H421211m26004K48639j98281J8001l27508J27998k01068k83652o0864q1543
14112G236929J26022J45978m55437j84444j36014K55837j03192k14371k0307l11450
$$ plain form
14180 22724769 22010203 21788259 21033710 20859814 20170080 19857717 19422552 19021587 18701202
14171 18701202 18450871 17943065 17575104 17440621 17064351 16791919 16644018 16024191 15949358
14162 15949358 15494921 15205577 15185802 14536827 14173653 14135401 14082086 13839095 13216560 13143629
14152 13143629 13228620 12918568 12753205 11980895 11926062 12264478 11770374 11624200 11669169 11567074
14142 11567074 10870875 10736769 10865830 10812032 10573260 10182958 9917608 9925871 10016876 9670703
14132 9670703 9403085 9771460 9105590 9408873 9149074 8888409 8836161 8735617 8282353 8421211
14122 8421211 7995207 8243846 8045565 8063566 7736058 7864056 7662988 7379336 7318472 7236929
14112 7236929 7362951 7508929 7053492 6869048 6733034 6988871 6885679 6671308 6651001 6339551
14102F339551J15806M9979j99043k66239k63313L13402J28897l70344j30975M1169
14092E758890k54838J72080l07671L4489L08620k47813l78770M37334m52353L25601
14082E395569n19418M06388r3122K06389n11972p7755q3900m2003J6727j64259
14072D532644P2448j66232L07432J8505l27270o0897j7867j78024O0586k2416
14062D218909n7693n0647L8716Q8933j14633J70040k53315L4199j19927l8153
14052C916429k74376K02502p3887J1184L2046Q3258j03583j81904N8026m50696
14042C218999J62380L63701k16186j01769k75375L47122m07698K84801K3183R8845
14032C498003k31326M0485j7031m92554K42422j54129Q7335J30100j30293n6447
$$ plain form
14102 6339551 6455357 6505336 6306293 6040054 5776741 6090143 6219040 5848696 5717721 5758890
14092 5758890 5504052 5676132 5368461 5402950 5711570 5463757 5084987 5522321 5069968 5395569
14082 5395569 4876151 5282539 5189417 5395806 4883834 4806079 4722179 4680176 4696903 4532644
14072 4532644 4605092 4438860 4746292 4764797 4437527 4376630 4358763 4180739 4241325 4218909
14062 4218909 4161216 4110569 4149285 4238218 4123585 4293625 4040310 4074509 3954582 3916429
14052 3916429 3642053 3844555 3770668 3781852 3813898 3897156 3793573 3611669 3669695 3218999
14042 3218999 3381379 3745080 3528894 3427125 3151750 3498872 3091174 3375975 3399158 3498003
14032 3498003 3266677 3307162 3290131 2797577 3039999 2885870 2973205 3103305 2973012 2916565
14022B916565K34312l02911j29871j0474J30669j51844o4063r6813K95944J34928
14012B956442l67007J3263L4008m0555J436J23660k51635J41552k84971J67629
14002B493822m43473J92162j10483j00302K49714k28476N6661J68373k74218L02035
13992B305815J79732l98701P42244J455314L334421R409823J6451454O541594
13984D0021696j4532357j1257715n390262k417976j129582q30267n52943k83454
13976C627140k74054J9318j65237l25269o18618O16351k83451J32289r3899j68003
13966B466567J98628k62174J4052J4887J45832k47684Q0701j60145n89935M61854
13956B122583j86449K4687O4380j82651M91145k16470j00689q0450J16345Q7450
$$ plain form
14022 2916565 3150877 2847966 2718095 2707621 2838290 2686446 2622383 2525570 2821514 2956442
14012 2956442 2589435 2602698 2636706 2596151 2597587 2721247 2469612 2611164 2326193 2493822
14002 2493822 2050349 2242511 2132028 2031726 2281440 2052964 2109625 2277998 2003780 2305815
13992 2305815 2485547 2086846 2829090 4284404 7618825 17028648 33480102 40021696
13984 40021696 25489339 14231624 8841362 6423386 5293804 4463537 3910594 3627140
13976 3627140 3353086 3372404 3207167 2881898 2263280 2879631 2596180 2728469 2634570 2466567
13966 2466567 2665195 2403021 2417073 2431960 2577792 2330108 2410809 2250664 1660729 2122583
13956 2122583 1936134 1960821 2025201 1842550 2333695 2117225 2016536 1936086 2052431 2139881
13946B139881j63301k5971J2772n1116N5295k29383p3499o3810K63360J97619
13936B061847l16869K40388m19855j89276L46254N3760j28512o9154L66437P4270
13926B019290k31294l15625j20966Q5680L10579J92501r1314j04385k20034J01492
13916A625924j5130l7964j95732Q1553K31918k40461O42263k38674n95967j26285
13906A131445P60539n20543K19952l46270M19923o44573R69185q59736L01996
13897A431918p3973p730J81233M90m47516K34601j6865j75881N17877l51993j86753
13886A105408L20123P2802J40178m21262l7420Q3428j31452j9618P320l2310L12437
13875A399634j95028J05468J41088p2870K52133l32084j60102L21560k31668l40497
$$ plain form
13946 2139881 1976580 1950609 1963381 1912265 1967560 1738177 1664678 1600868 1864228 2061847
13936 2061847 1744978 1985366 1565511 1376235 1722489 1776249 1647737 1578583 1945020 2019290
13926 2019290 1787996 1472371 1351405 1437085 1747664 1940165 1848851 1744466 1524432 1625924
13916 1625924 1610794 1572830 1377098 1458651 1690569 1450108 2092371 1853697 1257730 1131445
13906 1131445 1891984 1371441 1591393 1245123 1665046 1020473 1989658 1129922 1431918
13897 1431918 1357945 1350215 1531448 1531938 1084422 1319023 1302158 1126277 1644154 1292161 1105408
13886 1105408 1425531 1498333 1638511 1217249 1179829 1263257 1131805 1112187 1119507 1087197 1399634
13875 1399634 1204606 1310074 1451162 1378292 1630425 1298341 1138239 1459799 1228131 887634
13865H87634O14020l12420q4267l3708J07515J50843k09256K97256k01724j35606
13855A080287K05091q3464p9187N3726k6935k86846O28127j66231n05716K65345
13845A084197K1783k02337l07868P87754j27423l35407j1612K7626K42219j51891
13835A027041k06052K81587k87404L06136j18349L24476m90667j9925K24319r3004
13825I48158p6067q442M38600n07012K60298l94161M45909k10593j66711M4983
13815G74962J98692J31663m65101L45447k71759L97758j39095k79332O201r4073
13805F05363M62281l01757k3107J30239K06738n39812M6803L87355j34472J82002
13795A021633k95468K55950j7851n366D26253J61502P2124M19780k17635r1440
$$ plain form
13865 887634 1501654 1189234 1104967 1071259 1178774 1329617 1120361 1417617 1215893 1080287
13855 1080287 1285378 1201914 1122727 1176453 1149518 862672 1490799 1324568 818852 1084197
13845 1084197 1105980 903643 595775 1383529 1256106 920699 909087 936713 1178932 1027041
13835 1027041 820989 1102576 815172 1121308 1002959 1327435 836768 816843 1041162 948158
13825 948158 872091 863649 1302249 795237 1055535 661374 1107283 896690 729979 774962
13815 774962 973654 1105317 640216 985663 713904 1111662 972567 693235 699436 605363
13805 605363 1067644 765887 742780 873019 1079757 539945 586748 974103 839631 1021633
13795 1021633 726165 982115 964264 958898 426253 587755 659879 1079659 862024 770584
13785G70584L0206J89719r5001j20193P9068C84657M88330j9857J14779O689l43412
13774F31186K95982m4967k20467q2711K61371C14960M15973j92615J29195N7188
13764G24701j631K92198k39913k24314o4529L54664l53346K3010o9893K77494
13754G18441m8286B99874M63688L5566C97937O22449l87449K75696B39808N01990
13744G41798l02707o5579L19873n1748L40480j15479k45766n8466K65012l85714
13734D41704N7588M75508D16201M6832O6427M21321D27448K60967j74185Q9527
13724F03757Q917J29808k61531j11916K43341j44382K04637p3182N3111n1693
13714F00867k22873M11807j41880A94459M11698J42177l4587j08076J46112k78113
$$ plain form
13785 770584 800790 990509 895508 775315 854383 384657 872987 853130 967909 974598 631186
13774 631186 927168 882201 661734 579023 840394 314960 730933 538318 667513 724701
13764 724701 723070 1015268 775355 551041 486512 841176 487830 510840 440947 718441
13754 718441 670155 299874 763562 799128 397937 1020386 632937 908633 239808 741798
13744 741798 439091 373512 693385 641637 982117 866638 620872 562406 827418 441704
13734 441704 499292 974800 416201 463033 529460 950781 427448 688415 514230 603757
13724 603757 612674 742482 480951 369035 612376 467994 672631 599449 652560 600867
13714 600867 377994 789801 647921 194459 606157 748334 713747 605671 751783 473670
13704D73670N35514B52989L46258k61412L70971p8593J71264l31568j84104A27724
13693F84540j30041R9751K4095J66564C35453j5933K34568j09012j85885J33711
13683C92902K16700j55300J10386J20127Q2762G9666O09392r3994j68364N8479
13673D85179j35432J48415j9432K73515j1664k67373l5329B10967N32475k25497
13663E17945M4107A73112O14878k18410k02845J78492L6990E6959L45165l4175
13653C67949R9592m3670l3747K23002B01041K92573K74515l84045K09461l4234
13643E59311k06083m956j6788A65193O05200k51747P9593A92696J85489M393r0501
13632B92077Q9176K42912j91476J5198J32343Q4607k77504K81391k89094o3116
$$ plain form
13704 473670 1009184 252989 599247 337835 708806 630213 801477 469909 285805 127724
13693 684540 554499 654250 678345 844909 335453 319520 554088 445076 259191 392902
13683 392902 609602 454302 564688 684815 767577 79666 689058 595064 426700 485179
13673 485179 349747 498162 478730 752245 740581 473208 437879 210967 743442 517945
13663 517945 562052 173112 787990 569580 366735 545227 582217 56959 402124 367949
13653 367949 467541 423871 390124 613126 201041 493614 768129 384084 593545 559311
13643 559311 353228 348272 331484 165193 770393 518646 598239 192696 378185 382578 292077
13632 292077 381253 624165 432689 447887 580230 664837 387333 668724 379630 316514
13622C16514K03607k06790L5115M49688C78339j03846m4974M59520j75917j76210
13612C36912p3659o6537N05369k27435A56482M11959k12567L10443l03349r8201
13602B64767J71032N9472j26768l0527N0519K87476e1318F589L96598l2192q3127
13591B87868K42737j48469A73024J32683K05995k48476M47777M4904l41929j71046
13581B42932G0327K85111j53697J61450L4934J38471B40544M963l5095r5822K56907
13570C71497J63852m1682D5292B149M79785q2386k1462l4101J77664B40442G4908
13558B29711J7113K56104j01360J27433j04288A4439K68887J1052L17719j78337
13548D33760A52813J84152G0082K20301L49600k76189M6521B04676L85512B48112
$$ plain form
13622 316514 520121 313331 348446 798134 378339 274493 229519 689039 513122 336912
13612 336912 263253 196716 702085 474650 156482 568441 355874 666317 362968 264767
13602 264767 435799 495271 368503 337976 388495 675971 -51318 6589 403187 370995 287868
13591 287868 530605 382136 173024 305707 511702 263226 711003 755907 413978 242932
13581 242932 70327 355438 201741 363191 398125 536596 240544 245507 210412 114590 371497
13570 371497 535349 493667 45292 2149 481934 399548 378086 343985 521649 240442 74908
13558 229711 246824 502928 401568 529001 424713 14439 283326 294378 612097 433760
13548 433760 152813 336965 70082 290383 639983 363794 410315 204676 590188 248112
13537B73946J20633A14816J39506l4017N5247r0580j8272N1802P3128O7163j23839
13526B34954r6499p499J07821J05116J40463p1628A23946O4421l2600K54261j34186
13515B75842j17284L8830B5669M79548k09401h7216B84020j09140L39071k8576
13505D85375Q4375q0562j37424A0803M08570A14877O6876L34027j89175J34223
13495D60828A18917K2374d2087C90096A0679L69175Q0696A03469J77667J99678
13485D80814m5009o8911j7850K4928j69681J33465r5306m9456J6589K93303j40141
13474C62745j17985J06027J19950j87449G6709L64646j23046j46353J30512l4670
13464B67798o6151P1166H3556L07605A05080L68266A93324b7619C82684j795A30771
$$ plain form
13537 273946 394579 114816 254322 220305 275552 184972 166700 218502 291630 358793 234954
13526 234954 138455 130956 238777 343893 484356 412728 123946 188367 155767 410028 275842
13515 275842 158558 197388 25669 505217 295816 -87216 284020 174880 513951 485375
13505 485375 569750 489188 351764 10803 419373 114877 181753 515780 326605 460828
13495 460828 118917 141291 -42087 390096 10679 379854 460550 103469 281136 480814
13485 480814 435805 366894 349044 373972 204291 337756 242450 192994 209583 502886 362745
13474 362745 244760 350787 470737 283288 76709 441355 318309 171956 302468 267798
13464 267798 201647 272813 83556 391161 105080 473346 193324 -27619 382684 380889 130771
13452B97357q321j03841J50123A0470J25841J31122R0291l2216D5062Q1683J69135
13441B95880A42279O0815J80249p571j85242L52947A58280c4699j21091A987K86824
13430B88811J30967a00452D2074M98172H6895J13718q7277l1503Q0760M4105o5696
13419A41002J59643F0702L28277k2659E6667J87323k6695K15919d3166A06634
13408D41347A62156D2215O1513K73635A85161G6313J00323K0916G9013Q1808J06993
13397B67814K8733A36522h7842A1261Q9852K2M00405L7283D8047P8149K76117
13386D02313A66804D3714K10074F8931O9246J92210J76946G9485L40714A25361
13375C57439m0529k6684a13100C32835j63112K85027O245A34896L1990o5499L430
$$ plain form
13452 297357 289036 185195 335318 10470 136311 267433 357724 325508 45062 126745 295880
13441 295880 142279 203094 383343 375772 190530 543477 158280 -34699 -155790 1987 288811
13430 288811 419778 -100452 42074 540246 86895 200613 113336 81833 162593 206698 141002
13419 141002 300645 60702 388979 366320 56667 243990 217295 433214 -43166 106634
13408 441347 162156 42215 103728 377363 185161 76313 176636 197552 79013 160821 267814
13397 267814 296547 136522 -87842 11261 101113 101135 501540 538823 48047 126196 402313
13386 402313 166804 43714 253788 68931 138177 330387 507333 79485 420199 125361
13375 357439 316910 290226 -113100 332835 169723 454750 460995 134896 166886 101387 104817
13364A04817L07983j07612A40706K7643j0279a189G34119C30784J31307B29380
13353D49817j07953A5499J90770l0822L98497B54416J07192N483o0936K35838
13343E41993B44489A19497L86772A91568J69765L71713D3529A8426M63629r3973
13333C88082L2263A2990J93375B6263L95372g5713C80514N2931b1024p3791D66266
13321A93396r3019J50775N2431F6468O0835K78054a32183I2270l7954N8544L84048
13310D96908B1965M97486A01847D0580L72200j34667n7565c569B96672E4100J10496
13299A64596J69535n0613q6291C6548J96237R9336J62911j75544P2816a1532A94702
13287f3640j91870B48496A09392Q7236r6338D6202J00510J73691A17264f084F2461
$$ plain form
13364 104817 412800 305188 140706 168349 158070 -1189 734119 330784 462091 229380
13353 449817 341864 15499 206269 175447 573944 254416 361608 367091 306155 541993
13343 541993 244489 119497 506269 191568 361333 733046 43529 18426 482055 388082
13333 388082 420345 12990 206365 26263 421635 -75713 380514 433445 -21024 -94815 466266
13321 193396 100377 251152 303583 66468 127303 405357 -132183 92270 54316 112860 496908
13310 496908 21965 519451 101847 40580 412780 278113 220548 -3569 296672 54100 164596
13299 164596 334131 283518 197227 36548 232785 332121 495032 319488 392304 -11532 194702
13287 -63640 -255510 248496 109392 196628 100290 46202 146712 320403 117264 -6084 62461
13275B63043l0667n9191E2445B0674K93741A43855K963E7100K10204c3603D9455
13263B32153C9463M0358J08404M7899q3383L4001m9342J27274H4806c22873B5610
13251B67803l0895c0430n2488A88930a4796H8571b6164B00596N8156c77591D5648
13239D5491b77910I6542J42964b02630i2753C01247L204j13050D6769J7446J41944
13228B06159b96093A98719e8016o5743G652J05228N1892h3353K7418G3127K82279
13217C55406A70165q896J298j7349K3183C6624K21685a40922j7881C8425d2265
13205c1660B04585J1218J17407k8209H3697K36385q6490c9379r8341C65756A47014
13193A7335M00984n6056A16438d7500A47467E7075J94711A01127a52440H2525
$$ plain form
13275 263043 232376 173185 52445 20674 314415 143855 146818 57100 267304 -33603 49455
13263 232153 39463 79821 188225 236124 152741 186742 137400 264674 84806 -322873 25610
13251 267803 236908 -30430 -82918 188930 -14796 88571 -26164 200596 258752 -377591 45648
13239 45491 -277910 96542 239506 -202630 -92753 301247 304451 191401 46769 64215 206159
13228 206159 -296093 198719 -58016 -123759 7652 112880 164772 -83353 -55935 73127 355406
13217 355406 170165 161269 162567 145218 168401 36624 258309 -140922 -158803 38425 -42265
13205 -31660 204585 215803 333210 305001 83697 320082 233592 -39379 -137720 365756 147014
13193 17335 418319 362263 116438 -47500 147467 57075 251786 101127 -152440 82525
13182C6970J06336n134C5249N1633J54071J28659o4637i7210b7538k6628B21681
13170G8887J71703F6887J83990b49520B78722A32568J95463a93581P8192A92075
13159A30628C7035J51919a5220B26164c63104A55875C7822b82216a22925D6005
13148B16982d6847j0569n9643A78719a0267k648j65073B8519J46469g9770m7327
13137a27097d1870p1285A24355M9280O0754m8475D3687R0688Q9068a12870B34592
13125D94026C7477c2845c433l5131l4414A93158G6316L09374A10939M9225p9118
13114H1046e4489a9073k3639E9846A7883J15521a4134n853H3751f7759n7756K9888
13102i5627D2503a95456f8552C66057A40360J80225a1209j95821B2935K44268
$$ plain form
13182 36970 143306 138172 35249 86882 240953 369612 304975 -97210 -27538 -54166 221681
13170 78887 250590 66887 250877 -249520 278722 132568 328031 -193581 -115389 192075
13159 130628 37035 188954 -15220 226164 -363104 155875 37822 -282216 -122925 46005
13148 216982 -46847 -57416 -117059 178719 -10267 -12915 -177988 28519 174988 -79770 -127097
13137 -127097 -41870 -113155 124355 173635 234389 185914 43687 134375 223443 -112870 234592
13125 494026 37477 -32845 -3433 -38564 -72978 193158 76316 385690 110939 160164 81046
13114 81046 -54489 -19073 -42712 59846 17883 133404 -14134 -19987 83751 -67759 -125515 -95627
13102 -95627 42503 -195456 -68552 366057 140360 320585 -11209 -207030 22935 267203
13092B67203g400H8195a08071H2255i283D8007K38191J7974J37193q7858a3355
13080A7269J07762k6003a20465A46593O6943J34086j44592a08879K3356A48888
13069B91555h9920H9198a91551A52109J73597j06860p5055M6271m3180J08733
13059B55615r2865k6452k359l4643A8167M9740a03429A41569I660c01038B19470
13047a67038C85860b91734A72186M4515J59563j76740b18C72471A03902i7819
13036i7453q3487P8356j13097b7045j31561A34434L01929C283a7666H9177J22702
13025B11879g4302l0165j22072G2744f1273m6184G3052f9367k09040K7275a06223
13013A8964J95211l2831p0145d0322h743B54044n3772J39573h3274B45955n2321
$$ plain form
13092 267203 -7400 88195 -108071 82255 -9283 48007 286198 304172 441365 353507 -13355
13080 17269 125031 99028 -120465 146593 213536 347622 203030 -108879 -85523 148888
13069 291555 -89920 89198 -191551 152109 325706 218846 143791 190062 146882 255615
13059 255615 162750 136298 133939 99296 18167 67907 -103429 141569 9660 -301038 219470
13047 -167038 385860 -291734 172186 216701 376264 199524 -218 372471 103902 -97819
13036 -97453 -180940 -102584 -215681 -27045 -158606 134434 436363 3283 -17666 89177 211879
13025 211879 -74302 -104467 -226539 72744 -61273 -107457 73052 -69367 -278407 -251132 -106223
13013 18964 214175 181344 111199 -40322 -8743 254044 200272 339845 -83274 245955 193634
13002A93634a34846j29754a2877A16073J85739h2771E727J24964A1191J16983
12992A28174l8633K38184H1872l3408J23699B6303Q8861a06454B13277G1725h345
12980D66336a63115B55192a2821A85J73906J06788b02175B66745D8442b3128A01205
12968d6927C20681E7668a35971D6581J23583m5942f1536m7505H3022C5504J48600
12957A84104g036B72079Q9796F1882e9197k07591A94013k7695a20136n0060L6487
12946a33709a4605C3408J73650b4065A20711a57125b7184q8147B49363a96889
12935B69261a3784C00412j36544P5829C0395K83176f3584C63486j73957P7343
12925B66872b74073H762a58933B67611G847L1897j9584a97720q4681B55186b28654
$$ plain form
13002 193634 -134846 -264600 -12877 116073 301812 -82771 5727 130691 11191 128174
12992 128174 89541 327725 81872 48464 172163 26303 115164 -106454 213277 71725 -8345
12980 466336 -163115 255192 -12821 185 174091 280879 -202175 266745 48442 -23128 101205
12968 -46927 320681 57668 -135971 46581 170164 124222 -61536 -109041 83022 35504 184104
12957 184104 -7036 272079 361875 61882 -59197 -266788 194013 166318 -120136 -170196 -133709
12946 -133709 -14605 33408 207058 -24065 120711 -157125 -27184 -115331 249363 -196889
12935 269261 -13784 300412 163868 239697 30395 313571 -63584 363486 189529 266872
12925 266872 -274073 8762 -158933 267611 7847 39744 20160 -197720 -282401 255186 -228654
12913a28410n8807A57045N1121c9210B13370p7964b936l01358A16198a26291B00292
12901A9944N3212i3350l12327O2165C22432a0283A98756F9239J05320k5917D9901
12889f5673o3279D4022J14968a1108C90550a47813b6183C3567r279a54759C78400
12877i73A30912A3302L44961j61543b01828B62595a63052D3201a59417A74347
12866a91835A7821a70601r815A13669A7321a71208A32798L2496f0162j12225j49499
12855c21886a17131A01171F587J18612a53170l44685d681n9422A18484K13147
12845C31631C8210f0018l39519A13734d8674g924A45228n6218J94920A26950e8380
12833A19137L419K68032F5701K40540c91007a42687B37682j87G2267m896L26991
$$ plain form
12913 -128410 -187217 157045 208166 -39210 213370 135406 -2936 -304294 116198 -126291 200292
12901 19944 73156 -93350 -405677 -343512 322432 -10283 198756 69239 174559 148642 49901
12889 -65673 -128952 44022 158990 -11108 390550 -147813 -26183 33567 24288 -154759 378400
12877 -973 130912 13302 358263 196720 -201828 262595 -163052 43201 -159417 174347
12866 -191835 17821 -170601 -180416 113669 17321 -171208 132798 165294 -60162 -172387 -321886
12855 -321886 -117131 101171 6587 125199 -153170 -497855 -4681 -64103 118484 331631
12845 331631 38210 -60018 -399537 113734 -48674 -7924 145228 89010 283930 126950 -58380
12833 119137 122556 390588 65701 306241 -391007 -142687 237682 237495 72267 67371 394362
12822C94362a35992d0027F0913a80689B24860H298J48509C5252K4084O0924Q4850
12811B05110j6108r4048a26817N8063A89289b34629K8220B27359o1965i0755L096
12800h7659A08337C1928L2580J5574p039M72074a93538F4734G908g988C76242
12788e2967k9186K2519A30162a59561d9076j45486n6239C3849M0769J19239n7218
12777A36639b66533A60115q938a74221k7770E3938f0242C90675d626B15159B3177
12765B17687a61411C51401A53286n6283K28416g1895A55363B6526c0624j15542
12755a46166B3585J19316c8382C13911C6355P042a4159A44024a33936m6537L9369
12744a41104E55J45805b04747A05096a54620D6072K36926A11406l4180M7470m5577
$$ plain form
12822 394362 -135992 -40027 60913 -180689 224860 8298 156807 35252 59336 120260 205110
12811 205110 189002 94954 -126817 -68754 189289 -234629 -206409 227359 165394 -90755 -87659
12800 -87659 108337 31928 64508 80082 73043 545117 -193538 64734 7908 -7988 376242
12788 -52967 -82153 -59634 130162 -159561 -49076 -194562 -250801 33849 74618 193857 136639
12777 136639 -266533 160115 151177 -174221 -201991 53938 -60242 390675 -4626 215159 23177
12765 217687 -161411 351401 153286 97003 325419 -71895 155363 26526 -30624 -146166
12755 -146166 23585 142901 -38382 313911 36355 43397 -14159 144024 -133936 -180473 -141104
12744 -141104 555 146360 -204747 105096 -154620 46072 282998 111406 77226 124696 79119
12733G9119b91321A29476l6208k3186A833a80633C5555j0277A2607a71167A66459
12721a26499A11148A3152J018M50547a09221C00342e8447A29877R4192F2050J56541
12710B18591K12825G322N72104e634B18091A3733f6650G6639J10310o5521K58306
12699C79734A3340k960J99191g2716I9319j4881i1190e580E3975B0273c00409
12687a314D8059a01054C4197a5032F5936O919J77827a2659A32024l3n5127Q8331
12675A65195g3878E8737J02651K9906J36660o9459D30a54347C27123b67511e6335
12663A51800h0977E9875f1849B3790P9654L1247a80105B71160j04356L1679E5120
12651C893M08460j29523a81828C82354o7297a38560f897k32032N1807G9305j402
$$ plain form
12733 79119 -291321 129476 93268 70082 1833 -180633 35555 25278 12607 -171167 166459
12721 -126499 111148 13152 14170 464717 -109221 300342 -58447 129877 224069 62050 218591
12710 218591 431416 7322 579426 -5634 218091 13733 -66650 76639 186949 121428 379734
12699 379734 13340 10380 209571 -72716 99319 84438 -91190 -5580 53975 20273 -300409
12687 -1314 48059 -101054 34197 -15032 65936 72855 250682 -12659 132024 131991 76864 165195
12675 165195 -73878 58737 161388 191294 327954 258495 430 -154347 327123 -267511 -56335
12663 151800 -80977 59875 -61849 23790 103444 134691 -180105 271160 166804 198483 55120
12651 3893 412353 282830 -181828 382354 315057 -138560 -6897 -238929 -187122 79305 77903
12640G7903j8034a68248O1367G5931L06532C3627f1182A35599b5087G0208c10686
12628C66682A31687g3814D36928A31978D8120i0153C19271A06819J90484n7763
12618B39540E763a45812C2328j1383b1217j39652D69689C7635a80250a1911A71423
12606E0401R619N7628a5415C19421j39801D861K02662E006R7648L54685A32732
12594b11463K0531A13532j9558b28838A9635b70778A58465P5567r1235J24473
12584B67270c5532k43938g3696J4183n7220F8221B2113a76120f2106c378B67531
12572b06054B26988a56428A03761J38338k9564a67255A17905a1884B8485a66062
12561F9815g5509A0059J45648N4172F4823d0310k5835C05993c7546q5818A44916
$$ plain form
12640 77903 59869 -168248 -106881 75931 382463 33627 -61182 135599 -25087 70208 -310686
12628 366682 131687 -73814 436928 131978 48120 -90153 319271 106819 297303 239540
12618 239540 5763 -145812 32328 20945 -21217 -160869 469689 37635 -180250 -11911 171423
12606 50401 60020 117648 -15415 319421 179620 4861 207523 5006 102654 457339 132732
12594 -211463 -190932 113532 93974 -228838 19635 -270778 158465 234032 142797 267270
12584 267270 -35532 -279470 -73696 -59513 -116733 68221 22113 -176120 -62106 -3378 267531
12572 -206054 226988 -156428 103761 242099 212535 -167255 117905 -11884 28485 -166062
12561 69815 -75509 10059 155707 209879 64823 -40310 -66145 305993 -37546 -123364 144916
12549a81262F3854g1435A62889J6754H8057D2302J39129a07364A14668b49982
12538a91041B69519A19625c7484C27963I3729J4499l3939J3135M5976a02837J0379
12527i2458M4247B73294f6784D3025b01971N7880A17637n6314R621e5578A87656
12515A18436D025K1239G472a35082k2640H7555a97141P8199l2638D1868J12879
12504A54747j9076b01734A87643D9013G704Q4304a31466A30394b1348p869C10925
12492a3888G074J61905d50488A55551n2501J43140d9390p6197B54221a14193A5137
12480b36044q2520c4321A00834b12106p1829A86988a87156c1072A77711a77048
12469A5520C177b08253p6070D8728b60646A01027J19142H7969h6357k04219A75516
$$ plain form
12549 -181262 63854 -71435 162889 179643 88057 42302 181431 -107364 114668 -249982
12538 -191041 269519 119625 -37484 327963 93729 108228 74289 87424 133400 -102837 -92458
12527 -92458 -48211 273294 -66784 43025 -201971 -144091 117637 61323 70944 -55578 187656
12515 118436 4025 25264 7472 -135082 -157722 87555 -197141 -118942 -151580 41868 154747
12504 154747 135671 -201734 187643 49013 7704 92008 -131466 130394 -21348 -29217 310925
12492 -13888 7074 168979 -450488 155551 103050 246190 -49390 -125587 254221 -114193 15137
12480 -236044 -318564 -34321 100834 -212106 -283935 186988 -187156 -31072 177711 -177048
12469 15520 3177 -208253 -284323 48728 -260646 101027 220169 87969 -86357 -290576 175516
12457b22394B99539b07586m1408C05269c59977N2758C1986a0302A15268n1161
12447F4107B8400J46009O216b7029I7362a01213J4781G4534l398a32062n8560
12436a90622A83457K0571D530b29868M2407E2262a66448f4570l56239a625q2495
12425h4120A42959B0594b04783N2273m0738f0824C30846e3082j84116A7480J18862
12414A36342K75951A30131g2707E01824d2425A31911b4130B0401J63707q6548
12404I7560a35501I2550a67905A14968l0629a40840d1861A75489j211E1678a40587
12392a58767A08772a22692c5283q2577o0413B37984b147B51007m466i5259M7353
12381d7906h75A3118J70805N5919E2530J99883K0741d3771C88628d6797j0108
$$ plain form
12457 -222394 299539 -207586 -248994 305269 -359977 -307219 31986 -10302 115268 64107
12447 64107 28400 174409 180625 -27029 97362 -101213 -86432 74534 71136 -132062 -190622
12436 -190622 183457 204028 4530 -229868 -187461 52262 -166448 -64570 -420809 -1625 -84120
12425 -84120 142959 20594 -204783 -152510 -193248 -60824 330846 -53082 -237198 17480 136342
12414 136342 412293 130131 -72707 501824 -42425 131911 -24130 20401 184108 97560
12404 97560 -135501 92550 -167905 114968 84339 -140840 -41861 175489 174278 51678 -140587
12392 -158767 108772 -122692 -35283 -117860 -178273 237984 -2147 251007 246541 -95259 -47906
12381 -47906 -875 13118 183923 239842 52530 252413 273154 -43771 388628 -46797 -56905
12370e6905j28999N4764d833k47031b235n8426R918j38576i02A81769P5506b62378
12357A81986a94461P3413B83088a33013F0105j0426a18575a0741j4805D3388e1671
12345g2170L0336m8277F0264h9792l4218D73946i2840A41175d7666A91595K9259
12334B20854E1253H450M9533h3878A91216f1788H4454a80404d8366r7383I784
12322b23407M6779B22093a12023C50153a10773A59545C6687a2934C0890K78642
12312C09532e0494R239B13021b48472P0205B46583h8845j49065J09452m7494A72562
12300a62385B14857b74067A1625b7400A2012J83461a21402B15913m1828J84588
12290C58673e9876a3739A13798J16509d3662C28250C7002J8306B3894c05483F8794
$$ plain form
12370 -56905 -185904 -131140 -4833 -251864 -2235 -60661 -50743 -189319 -902 181769 257275 -262378
12357 181986 -194461 -121048 283088 -133013 60105 49679 -118575 -10741 -25546 43388 -51671
12345 -72170 -41834 -90111 60264 -89792 -124010 473946 -92840 141175 -47666 191595 220854
12334 220854 51253 8450 57983 -83878 191216 -61788 84454 -180404 -48366 -145749 9784
12322 -223407 -176628 222093 -112023 350153 -110773 159545 36687 -12934 30890 309532
12312 309532 -50494 -41255 213021 -248472 -178267 246583 -88845 -237910 -128458 -175952 172562
12300 -162385 214857 -274067 11625 -27400 12012 195473 -121402 215913 174085 358673
12290 358673 -59876 -13739 113798 230307 -43662 328250 37002 55308 23894 -305483 68794
12278C63087E7967J4861P1341n4671K32158m7067N6948j06802J506A03356K78744
12267C82100j85426f2922p4808A36678N5157l3199A4307M8209a37672I8347k6471
12256G1876j2961Q6389i0526A28103a82198D21437g1491D82317E9471a18443D11190
12244e6602a9290A2820Q2585M2626a47978c6372I5362l5346J30230C6487L4911
12233G1398r395J82058a09489a1889E88578D8613M7444J41702l31a2415B60092
12221A15934J92688a82814c3561A75104o2991J3369J04738I0555b26306c4711
12210c4542B8556c8314B22895r4950J13831J17068a0021A24639K47918q4009P836
12199B96384G8412J06215m7352O6332r3656K3389i6789B04592N9092o4375D2791
$$ plain form
12278 363087 57967 72828 144169 89498 321656 274589 331537 224735 226241 103356 382100
12267 382100 196674 -62922 -137730 136678 191835 158636 14307 62516 -137672 98347 71876
12256 71876 58915 145304 -90526 128103 -182198 421437 -71491 482317 59471 -118443 411190
12244 -56602 -19290 12820 95405 138031 -147978 -36372 95362 60016 190246 36487 71398
12233 71398 62003 244061 -109489 -11889 588578 48613 96057 237759 237428 -12415 260092
12221 115934 308622 -182814 -33561 175104 112113 125482 230220 90555 -226306 -34711
12210 -34542 28556 -38314 222895 127945 241776 358844 -10021 124639 372557 288548 296384
12199 296384 78412 184627 137275 203607 109951 133340 -96789 204592 263684 199309 42791
12187F8951h003E4035K15512J3082j13334G2105L9375f4657G1374K6526b88663
12175C4224b90454C53758e6457C72830A35369D6297A2313K528c24176D6427j5212
12164C1215K43210b37398d8424A22262J30977g1957l1589J5513l559a7414l5542
12153e2956A35928E6734Q3035d07303e735F9549b132l14986B79330b75345C63797
12141a19245E8268K43456E4378K050Q6902M3727k1569M1779K7931b03138g9649
12129E8927P1837b66855c2479B90044A35429F5514a17038B49423A4734M494K8656
12118D7884J4378K1751a28103D37331i1298A4885K5005n433K8694J70540G9678
12106A83563a75640N0374C6754a95352f3850n6756j656L9063j2821m4867H9388
$$ plain form
12187 68951 -8003 54035 269547 282629 169295 72105 111480 -64657 71374 97900 -288663
12175 34224 -290454 353758 -56457 372830 135369 46297 12313 14841 -324176 46427 31215
12164 31215 274425 -237398 -48424 122262 253239 -71957 -103546 -88033 -91592 -17414 -52956
12153 -52956 135928 56734 139769 -407303 -5735 69549 -2132 -317118 279330 -275345 363797
12141 -119245 58268 301724 54378 56428 143330 187057 165488 207267 235198 -203138 -79649
12129 58927 130764 -266855 -32479 290044 135429 65514 -117038 249423 14734 19228 47884
12118 47884 62262 84013 -128103 437331 -91298 14885 39890 34457 63151 233691 79678
12106 183563 -175640 -125266 36754 -195352 -63850 -120606 -122262 -83199 -96020 -140887 89388
12094B02506E7756A6536g5969j58893g7454B96026C6626L44959D586a14944M9777
12083f5167A12852E6205R654h9619l3744e3333A62031M4801b29095E73083M40523
12072A013606K12655n11970F2562J16945E4941h7981F8247k0911A7397K3901j3485
12061B7813d55754F33b345G4515M1687K27965g9641G413c33298C14871a06730
12049I0347b10369B17149b10841a7297o2641D0077L7307J12082o2082B0034d6861
12037a31465F2447f1274j77226g0870k2640n5545B57792G254K20872a3247A4869
12025c5040j8013A01674L10175a85726j9986f2726J3483I8019g9275J4196H5519
12013C32117B4474L83165d6691G9216G987P9812f11B6363e3314A67047c49522
$$ plain form
12094 202506 57756 16536 -75969 -234862 -77454 296026 36626 381585 4586 -114944 -65167
12083 -65167 112852 56205 65859 -89619 -123363 -53333 162031 206832 -229095 573083 1013606
12072 1013606 1226261 714291 62562 179507 54941 -87981 68247 47336 17397 41298 27813
12061 27813 -455754 633 -2345 74515 116202 344167 -79641 7413 -333298 314871 -106730
12049 90347 -210369 217149 -210841 -17297 -79938 40077 77384 189466 127384 20034 -46861
12037 -131465 62447 -61274 -238500 -70870 -93510 -149055 257792 7254 228126 -13247 14869
12025 -35040 -53053 101674 411849 -185726 -205712 -62726 -49243 98019 -79275 -65079 85519
12013 332117 24474 407639 -46691 79216 7987 87799 -611 26363 -53314 167047 -349522
12001d00224B2038J29005a97564e7752k63407i7929e478a603A44596e5579A01391
11989a3311k53728L2396C5214a03888a0442I3061e4299A82539J53646h5625I4363
11977A69367C9805b05449e6098b838A56141b68687l136b1240r7160A1604J49674
11966A61278a09708B50270b3117j73111A61937b04550e0773B27747j12068Q7812
11956B03491e0594j0121A43355Q0237q7201n2540c78436A17422a93458a5143n0101
11945f5244C01445G542a11590m3067E0753a18148A76603G7488a49476e1291B68945
11933a63246r8233i1365k9873L1187K6227A00808C0272g7156G0516J41818a05241
11921a89562R2799C02692D4267J9407J08699j4371n4796a84829I2742J9715c36761
$$ plain form
12001 -400224 22038 151043 -197564 -57752 -321159 -97929 -5478 -1603 144596 -55579 101391
11989 -13311 -267039 -234643 35214 -103888 -10442 93061 -54299 182539 336185 -85625 94363
11977 169367 39805 -205449 -56098 -2838 156141 -268687 -271823 -21240 -118400 11604 161278
11966 161278 -109708 250270 -23117 -196228 161937 -204550 -50773 227747 115679 203491
11956 203491 -50594 -60715 143355 223592 136391 83851 -378436 117422 -193458 -15143 -65244
11945 -65244 301445 7542 -111590 -154657 50753 -118148 176603 77488 -149476 -51291 268945
11933 -163246 -261479 -91365 -121238 -90051 -63824 100808 30272 -77156 70516 212334 -105241
11921 -189562 -96763 302692 44267 63674 172373 158002 103206 -184829 92742 112457 -336761
11909b50377B8600J19997a18878c4649d283A14871C653f6158B37946a48434d07
11897I9057m7426a92859K4055O006j812n7114E9406J29172r314j5727i507B31027
11884G7619J06585a62686B00955k1178D5153i5345O033l6191H2769b33513M7786
11873a85727c380q7401b0475j47930C03621d9770F8518L3377b7158C37636a1503
11861I3822e3742A76852b6052r8995B91087r8021a64803l1186A68460i4217B42820
11849b17080k5335j54217d1696a908H8580a71429j50617b9709k18075A04598J51078
11838B55676e6246A09743Q5070b90648A55540b0199A53324b00657I8959f3061
11827a69745m8951A6391Q6534a98486h1393F1960A7653J41752b07112j22497b684
$$ plain form
11909 -250377 28600 148597 -118878 -34649 -4283 114871 3653 -66158 237946 -148434 -407
11897 99057 51631 -192859 -168804 -162798 -164610 -221724 59406 188578 179264 163537 -9507 231027
11884 77619 184204 -162686 200955 179777 45153 -95345 -89312 -125503 82769 -233513 -185727
11873 -185727 -3380 -90781 -20475 -168405 303621 -49770 68518 101895 -27158 337636 -11503
11861 93822 -53742 176852 -26052 -125047 291087 193066 -164803 -195989 168460 -94217 242820
11849 -217080 -242415 -396632 -41696 -1908 88580 -171429 -322046 -29709 -247784 104598 255676
11838 255676 -56246 109743 194813 -290648 155540 -20199 153324 -200657 98959 -63061
11827 -169745 -218696 16391 102925 -198486 -81393 61960 17653 159405 -207112 -329609 -2684
11815A04108J32729g254A45423D173b21473A82819c10043a6018j2106k34319a21642
11803C9811A4770a65339O019C451d6697n9691C3182N1033M1286a51066g1230j75802
11791b47032B1649J53500G1121a8132C1701J69973g5406A48477h2778l35432L224
11780d14986i5055E4009L5809a06734A12591K19216B4928g0123B10876p7993i0892
11768a15242B64896A21515I063L0064a71394A42107J1600l4544m2852J22545n0487
11757A48369K3007a15501C27542i6271J1914B59212g7607N129j0901B24405a88509
11745A7553J26141c32461J56113b8159A89502f5298A35044L0980L6675A8481a1770
11733a15944q2212A659O4043f8776G1122a5642B25122D5605f6229j31020B45453
$$ plain form
11815 104108 236837 -7254 145423 4173 -221473 182819 -310043 -16018 -28124 -262443 -121642
11803 39811 14770 -165339 -159320 3451 -46697 -106388 33182 84215 125501 -151066 -71230 -247032
11791 -247032 21649 175149 71121 -18132 31701 201674 -75406 148477 -82778 -418210 -414986
11780 -414986 -95055 54009 89818 -106734 112591 331807 24928 -70123 210876 132883 -90892
11768 -115242 264896 121515 9063 39127 -171394 142107 153707 119163 76311 198856 148369
11757 148369 171376 -115501 327542 -96271 -84357 259212 -77607 -72478 -83379 224405 -188509
11745 17553 143694 -332461 -176348 -28159 189502 -65298 135044 166024 202699 18481 -11770
11733 -115944 -198156 1659 65702 -68776 71122 -15642 225122 45605 -66229 -197249 245453
11721a72416j6446i026E1654K52723f0303B48629a06140a5712p3561J4017B71658
11709D8141i8445C71524D3479i9615B48466b83300A8811K68102j42096a1506A77165
11697a15470A06402b0069j31463I6060J74633f7376b519k56192A47158h4884m982
11686h9866a4634G0594K95135a25087B72921b0092A5526K44950F2024L4815f1529
11674a72871D37920A82598K7163K29304e4565k5422C2995K43664a15671k6568
11664a42239m1683D218O5890J40052r652B066K69659b14014h6980m5682A47963
11652B03594N467E2428J77468d8052j72689b3007A39465b20101m9845n419A7195
11640b2077A74961q2527l1376C32f8838j24708B4234J83892o2095J46679a73014
$$ plain form
11721 -172416 -188862 -9026 51654 304377 -60303 248629 -106140 -15712 -89273 -75256 271658
11709 48141 -98445 371524 43479 -99615 248466 -283300 18811 286913 144817 -11506 177165
11697 -115470 106402 -20069 -151532 96060 270693 -67376 -2519 -258711 147158 -84884 -89866
11686 -89866 -14634 70594 365729 -125087 272921 -20092 15526 260476 62024 96839 -61529
11674 -172871 437920 182598 209761 439065 -54565 -79987 32995 276659 -115671 -142239
11664 -142239 -183922 4218 70108 210160 200508 2066 271725 -214014 -86980 -132662 147963
11652 203594 209061 52428 229896 -48052 -220741 -23007 139465 -220101 -269946 -275365 17195
11640 -22077 174961 92434 61058 332 -68838 -193546 24234 208126 146031 292710 -173014
11628c5297A759a86375B07106N2522e3735D50258F9104A099J76178Q4765c76899
11616e6802k0544B04475b46379L8314o4307A80135P0573c0272r2527C83366B0354
11604H3319K03924E1929K27152A35346C2100L5115c3938j6526B04734a12662D0849
11592b4647r0227B17062L47204b34914f7664A81989n3697j2693J05331Q2047P3784
11581C76761j26696J89470k19583B7167G609L32473a40523d3578A18742L79722
11571D98464k44486J59860H4523l6993a07369E0671B0511P588J51561J04711p6053
11560B08318a58237M5470n676E3683a1034G0265b22244B7958P9045b23983p64
11549b24747b2128P296n2730k23815A66063a69011k2382B63642N5481c5126A82139
$$ plain form
11628 -35297 1759 -186375 207106 259628 -53735 450258 69104 1099 177277 262042 -376899
11616 -56802 -77346 204475 -246379 -208065 -272372 180135 250708 -30272 -122799 383366 20354
11604 83319 287243 51929 279081 135346 32100 67215 -33938 -50464 204734 -112662 40849
11592 -24647 -114874 217062 564266 -234914 -67664 181989 128292 115599 220930 302977 376761
11581 376761 250065 439535 219952 27167 7609 340082 -140523 -43578 118742 498464
11571 498464 253978 413838 84523 47530 -107369 50671 20511 28099 179660 284371 208318
11560 208318 -158237 -112767 -118443 53683 -11034 70265 -222244 27958 107003 -223983 -224747
11549 -224747 -22128 -14832 -67562 -291377 166063 -169011 -191393 263642 319123 -35126 182139
11537A21828D4044B1923K37343l4572a35386G8268J24191d7715B17451k468g0696
11525B4638K85120p1297f3595k90587B59845a7067j05486E8034Q0863l574a71237
11513B1052L4551a33529m6113B31203C0791O5026J23903B7791b1406C9994f756
11501C531K73174o9714l437L9868p3601J09216F4103j5848L9994C931a5643A39799
11488D51262A09350j6353d3667A39175o1773O8239J20448E3900C265e767C33748
11476A08892L02835a9470H54a94755q100J01292D7711i3154A24659j112P3660
11465A97207f3138O59G2834a09899a664A79726L10134b71730D9758b31365B14917
11453a07246b5811F492a9074I286Q2467A4257L07353j53033J20161A07268P732
$$ plain form
11537 121828 44044 21923 259266 224694 -135386 78268 202459 -47715 217451 214983 -70696
11525 24638 309758 238461 -63595 -354182 259845 -17067 -122553 58034 138897 135323 -171237
11513 21052 55603 -133529 -179642 231203 30791 95817 219720 27791 -21406 39994 -6756
11501 3531 276705 206991 203554 243422 169821 279037 64103 48255 88249 3931 -15643 139799
11488 451262 109350 92997 -43667 139175 77402 145641 266089 53900 3265 -5767 333748
11476 108892 411727 -19470 854 -194755 -202855 -101563 47711 -93154 124659 123547 197207
11465 197207 -63138 -62479 72834 -109899 -1664 179726 489860 -271730 49758 -231365 214917
11453 -107246 -25811 6492 -19074 9286 91753 14257 321610 168577 288738 107268 115000
11442A15000a88853E1231J73765d7806A16682j1516O8906p9881f5226D02970h3503
11430a18524E6913L5390d4631J3357n4515j38006j31973A40274c5744H821J82425
11419A91246o3541n3879c12703Q5941K4009A19635A0450a26544q5038b0376j95233
11408b15609A54805d4404D6102g7868B74278F5124j2040L00022q4073a54698N0786
11397a03912d9105A9151K6581J05265J37706n8394d0133m7984J3339B19853m212
11386B15641b32424J03940B58433D9581R8560a2047k43527i2918j33492A96821
11375H768d6107j2893A23104a74739B52840b00914q6627J28751e5197A34476A6572
11363c29252i322H7051D1891a6937k00465F1446a12770d2810G8832J14121i9263
$$ plain form
11442 115000 -188853 51231 224996 -47806 116682 105166 174072 94191 -65226 402970 -83503
11430 -118524 56913 92303 -44631 -31274 -85789 -223795 -355768 140274 -35744 8821 191246
11419 191246 127705 73826 -312703 -226762 -202753 119635 10450 -126544 -211582 -20376 -215609
11408 -215609 154805 -44404 46102 -77868 274278 65124 53084 353106 269033 -154698 -103912
11397 -103912 -49105 19151 45732 150997 288703 230309 -40133 -88117 -74778 219853 215641
11386 215641 -232424 -128484 258433 49581 148141 -12047 -255574 -92918 -226410 196821
11375 8768 -46107 -59000 123104 -174739 252840 -200914 -287541 -158790 -55197 134476 16572
11363 -329252 -9322 87051 41891 -16937 -217402 61446 -112770 -42810 78832 192953 -99263
11351I8512L3552k3814j141c43942C9826a94737A27731d7977j52146f1224A68954
11339a44332A86859A9412a59186B55444c9208k56221J44513d634p5666b0024j86701
11328b06725d1582C40687j62109g19B2155Q9689a36028b6168E6715A1471K31231
11317B42702I1110c2038k80546B20225d0552B07485b52670M9444A39736l6884
11307A02852m4439a56041b3609k34337B337h9945k07128J04865C27561a38133
11296C8079f527A72675i8575j09354A15424B543a47222q174A5586b30756E5706
11284i7986j49356n0992F8088a61717j52042P5064P3986k52394B28818c6369J2167
11273b4202k48316B8329L28784a22160E5245K06233b89124C17447f8576C97118
$$ plain form
11351 98512 132064 108250 107109 -343942 39826 -194737 127731 -47977 -200123 -61224 168954
11339 -144332 186859 19412 -159186 255444 -39208 -295429 -150916 -4634 -80300 -20024 -206725
11328 -206725 -41582 340687 178578 -719 22155 111844 -136028 -26168 56715 11471 242702
11317 242702 91110 -32038 -312584 220225 -40552 207485 -252670 -203226 139736 102852
11307 102852 58413 -156041 -23609 -257946 2337 -89945 -297073 -192208 327561 -138133
11296 38079 -6527 172675 -98575 -207929 115424 2543 -147222 -155396 15586 -230756 55706
11284 -97986 -247342 -298334 68088 -161717 -313759 -238695 -164709 -417103 228818 -36369 -24202
11273 -24202 -272518 28329 357113 -122160 55245 261478 -289124 317447 -68576 397118
11262b38389M4133P5424d3419A28934a10979d6852e328A08350m4511P1841e7279
11250a41508A22251g225j71292I046b56614a675j79244F0086a23294L9390B42821
11238a10450F5167B1213e4473B71255A4037a98500G2232f4300p3207O6552k79152
11227c50107h5833n8622j76021a14358c4999C63302b11810D7091a45766J7573
11217a28193H5671a10560M3643C6550b65378g6320j46198M6910A35582a31737
11206b39439A09056E709c90771R9887g272k01509L737f5382A07682i8989j19309
11195b18298D4406Q1069N2585j8890F6747J24687n8747b75487E2343a64084e5586
11183i4719A56852c35764A8482R9422a26761e125p7077j6360n7986B08157r3020
$$ plain form
11262 -238389 -194256 -118832 -43419 128934 -110979 -46852 -5328 108350 63839 135680 -57279
11250 -141508 122251 -7225 -178517 9046 -256614 -1675 -180919 60086 -123294 -83904 242821
11238 -110450 65167 21213 -54473 271255 14037 -198500 72232 -64300 -137507 -70955 -350107
11227 -350107 -85833 -144455 -320476 -114358 -34999 363302 -211810 47091 -145766 -128193
11217 -128193 85671 -110560 -66917 36550 -265378 -76320 -222518 -175608 135582 -131737
11206 -239439 109056 5709 -390771 -290884 -7272 -208781 -205044 -65382 107682 -98989 -218298
11195 -218298 44406 125475 178060 159170 66747 191434 132687 -275487 52343 -164084 -55586
11183 -94719 156852 -335764 18482 117904 -126761 -5125 -82202 -98562 -156548 208157 115137
11172A15137K92347c48564a03953E7798a77050Q2340B75914l5276r6252a36636
11161a9001m30677f0628E4332J8797a9521E8417a36896B7321a0717L272B41843
11149a9169H5205a07355r3564A52862g8831b7291H7515J82999g5623m9573L5230
11138h9966B01731b14884A98505K5880D100K2159a72520c0738n2876H2024M1123
11127A23147b3374C67635j53924C3260M1801Q1069J20518E2200q374L01611c41344
11115E2081K1262K12909G3310C0232a46169D9290R1943b85062A97081E1267K0101
11104G1368J16549J47317A12146D4713K4377J11627J66194D7666J58519i1381
11093B75078j26519a4529E5267M7488K34170p9261N6485j53577G5656L05971d3281
$$ plain form
11172 115137 407484 -348564 -103953 57798 -177050 -94710 275914 240638 144386 -136636
11161 -19001 -449678 -60628 54332 73129 -19521 58417 -136896 27321 -10717 -7445 241843
11149 -19169 85205 -107355 -200919 152862 -78831 -27291 87515 270514 -75623 -125196 -89966
11138 -89966 201731 -214884 198505 224385 4100 26259 -172520 -30738 -83614 82024 123147
11127 123147 -23374 367635 213711 33260 75061 156130 276648 52200 43826 345437 -341344
11115 52081 73343 286252 73310 30232 -146169 49290 141233 -285062 197081 51267 71368
11104 71368 187917 335234 112146 44713 69090 180717 346911 47666 206185 -91381
11093 275078 148559 -14529 55267 102755 336925 257664 314149 160572 75656 381627 -43281
11081C30025A02035c087A95511f423H0556J83102a12067C83151q7501K19429o7226
11070D47853j72949J71822o7280A57084l6657K17438j5619R8282K23191m1319
11060F02400B23317K56834R9316R270J40835n7713r2468N4067k5978K03182k88824
11049E21838K87415J14698m16844K88212R5021Q5456l97061J38663Q4256m7849
11039G53805K42452m46007J75882R362L2734J73271k41383j79718J48271k981
11029F65688L0317J87898r271l25439K86286k05618J3996r3988K01754k39843
11019E11780J71452N572k86231N25563C73964M51930m11465K58326k62686j1813
11009C98256K5890J49476j95487K19074j01457k1597L1263J69816l08170J05986
$$ plain form
11081 330025 102035 -3087 195511 -6423 80556 263658 -112067 383151 295650 515079 447853
11070 447853 274904 446726 379446 157084 120427 337865 322246 420528 643719 602400
11060 602400 223317 480151 579467 588737 729572 671859 579391 633458 607480 810662 521838
11049 521838 809253 923951 507107 795319 890340 975796 578735 717398 801654 753805
11039 753805 996257 550250 726132 735494 768228 941499 700116 520398 668669 665688
11029 665688 696005 883903 874632 549193 835479 629861 643857 549869 751623 511780
11019 511780 683232 688804 402573 928136 373964 825894 414429 672755 410069 398256
11009 398256 424146 573622 378135 597209 495752 474155 505418 675234 367064 473050
10999D73050L06125k46360J3946J95344j07159j88239L27436k94381O2752O2841
10989F05355m6166M2135J84090J89237j62246N00821j29646q7143j53736K09707
10979A152408M73973m93408N80327j140M21936j22152P18745r5488K01048j21664
10969B714585k45510l68957K65310l85824r8271k53763Q8352J16120l78572K02358
10959A655828M11124m90676J02189K53875m61799J00415j35725k74190k21251
10950I39790j82347k91051Q7400k51196K68491q7559j96433D2980K14747e4374
10939B15407m8493P9167H6289R6938n742a9064j26901A61830J24811n9524Q1600
10928C08717a4382B7081J24098M5290B5132b936H7718k6522R1873b92576A033
$$ plain form
10999 473050 779175 532815 546761 742105 634946 446707 774143 479762 542514 605355
10989 605355 559189 601324 785414 974651 812405 1313226 1183580 1096437 942701 1152408
10979 1152408 1626381 1132973 1713300 1712160 2134096 2011944 2730689 2635201 2836249 2714585
10969 2714585 2469075 2100118 2365428 1979604 1881333 1627570 1715922 1832042 1453470 1655828
10959 1655828 2066952 1576276 1678465 1932340 1470541 1570956 1435231 1161041 939790
10950 939790 757443 466392 553792 302596 571087 483528 287095 42980 257727 -54374
10939 215407 166914 246081 86289 183227 177485 -19064 -145965 161830 286641 227117 308717
10928 308717 -14382 27081 151179 196469 25132 -2936 87718 61196 153069 -292576 1033
10916A24663b752D00172j46454H3823B0198J17861C2618c29541A12646D5565g6624
10904I9062F748a11785G748c3191C1899c10482j32750J28813A36458o964g5639
10892a53557F504L9341a59117B19872L3319b81920a19267j4630B13572a70735
10881C3694O082A8550c7848D7735b45156B37257r6865O3692o4414D6377R6973
10870A43350l2626M4356M8570g9020B4623J02684a62590O627j6357O1429q3859
10859a94750A33174i2686o7989G743d15438N1361F6244a08230A43396I276J4327
10848B3603j085e0172A23859b77141h7059A20207m2444B7275J7914a5824F9309
10836A71973P1917b77605R9001e2087B90247l421A7245c5233j4024K470o5208
$$ plain form
10916 124663 -2752 400172 253718 83823 20198 138059 32618 -329541 112646 45565 -76624
10904 99062 6748 -111785 7748 -33191 31899 -310482 -443232 -314419 136458 129494 -75639
10892 -153557 6504 45845 -159117 219872 253191 -281920 -119267 -133897 213572 -170735
10881 33694 39776 18550 -37848 47735 -245156 237257 140392 204084 139670 46377 143350
10870 143350 110724 155080 203650 -79020 24623 127307 -162590 -155963 -172320 -110891 -194750
10859 -194750 133174 -92686 -160675 7743 -415438 -364077 66244 -108230 143396 9276 23603
10848 23603 22518 -50172 123859 -277141 -87059 120207 77763 27275 45189 -15824 69309
10836 171973 243890 -277605 -178604 -52087 290247 286826 17245 -35233 -49257 -46787 -111995
10825a11995A03933a00880C02245b58538B91185c4122A69837C0065b00081A05855
10814a6743B53325a77084A86944q4371l6866h7634j37763Q5770A48248b08389
10803H7547a28836A60726b54885D0191a57795A63414B9980a97702A6910h4684
10792c34536I1458J0120d85047J81564a49749D7630a62023r9199a7523A21769
10781a18861A11730a55901f3490B6128c51285a2008k48236M1928E2117i6351C7633
10769E4882C351J28758J53505c16356m8835G444J56096b68566h9474E1348a16885
10757E2392k1940F673Q1290n979k4428i9830D0021b2891r3697n9036h7234F0044
10744a22246N2088B00847a14579d2677B01099f5583J6380A056J90591a13953J1752
$$ plain form
10825 -111995 103933 -100880 302245 -258538 291185 -34122 169837 30065 -200081 105855
10814 -16743 253325 -177084 186944 102573 65707 -87634 -225397 -139627 148248 -208389
10803 87547 -128836 160726 -254885 40191 -157795 163414 29980 -197702 16910 -84684
10792 -334536 91458 101578 -485047 -303483 -149749 47630 -162023 -261222 -17523 121769
10781 -118861 111730 -155901 -63490 26128 -351285 -12008 -260244 -218316 52117 -96351 37633
10769 54882 3351 132109 285614 -316356 -365191 7444 163540 -268566 -89474 51348 -116885
10757 52392 30452 6673 87963 81984 57556 -99830 40021 -22891 -116588 -175624 -87234 60044
10744 -122246 -70158 200847 -114579 -42677 201099 -65583 -49203 1056 191647 -113953 -102201
10733a02201a226r3563j0657b9748I3010a28677J543D5744K93700g3072o2439
10722a35511A28446b6379m1252q1419k6065p0714a11012j67565a12296o5675N4533
10711a23438B3347J97605e7314B08286l5623I733a45879A12546c8818A57448A289
10699a30883J3126M9674k92312B17711a15161j52720G7092a27506k37579a1822
10688g069I1597N9061c3065m59303b31005E5303K114e290B85994a9239A4937L4753
10676D9690f709l7169l7088K5625D3328c02198A04198f0091K8454k54821J10081
10665a76377A1467K21254a2416l20705A47607e26121B84368c88763D85a8103n2323
10654g0426H0287g5271C00595r7717c09913h3940A48551a74447P3340b3619j89751
$$ plain form
10733 -102201 -1226 -94789 -105446 -29748 93010 -128677 -127134 45744 339444 -73072 -135511
10722 -135511 128446 -26379 -67631 -149050 -175115 -245829 -111012 -278577 -112296 -177971 -123438
10711 -123438 23347 220952 -57314 208286 172663 9733 -145879 112546 -38818 157448 1289
10699 -130883 -117757 -68083 -360395 217711 -115161 -267881 77092 -127506 -365085 -11822
10688 -7069 91597 150658 -33065 -492368 -231005 55303 57417 -5290 285994 -19239 14937 49690
10676 49690 -6709 -43878 -80966 -55341 43328 -302198 104198 -60091 -31637 -286458 -176377
10665 -176377 11467 232721 -12416 -333121 147607 -526121 284368 -388763 485 -18103 -70426
10654 -70426 80287 -75271 300595 202878 -309913 -83940 148551 -174447 -101107 -23619 -213370
10643b13370P8198j73258B64053n8721a42565K6308l4103I312b12066D429b7956
10631e2378K4126j99650J2251C22961F222a7777l04039a57210I8631b53099A32947
10619A08627i9263j73060B16648b48131A72580a98527R4375D9206h0575j87178
10609b67753F0369b03452O6711n1264B84780D1290a78770k5900n150j45351E5032
10597b01315R1488a4538A18592r396g0940K7294q1774a5566I2514I238b9554B26188
10584b52749b2275E0541b35033N6900N0291C61928B5290J94499P7741e0161B82265
10572E5855a7834J183j88433j30756I9869a82792r9455e7762J4819k08199C6841
10560E6376K69504b65396a11937A14414c03015a07862A28677K04013B1550i5360
$$ plain form
10643 -213370 -135172 -308430 264053 205332 -142565 -116257 -150360 9312 -212066 4429 -27956
10631 -52378 -28252 -227902 -215651 322961 6222 -17777 -321816 -157210 98631 -253099 132947
10619 108627 -99263 -272323 216648 -248131 172580 -198527 -104152 49206 -80575 -267753
10609 -267753 60369 -203452 -136741 -188005 284780 41290 -178770 -204670 -209820 -355171 55032
10597 -201315 -109827 -14538 118592 109196 -70940 -43646 -125420 -15566 92514 9238 -29554 226188
10584 -252749 -22275 50541 -235033 -178133 -127842 361928 25290 219789 297530 -50161 282265
10572 55855 -17834 -16651 -205084 -335840 99869 -182792 -282247 -57762 -42943 -251142 36841
10560 56376 325880 -265396 -111937 114414 -303015 -107862 128677 332690 21550 -95360
10549b05440A85659d11527E4662b06464r8371a50857D8787b05038c0906a4083
10538A69463R155b02455c8185k28955F2412a46175A70671l1849j7906h6149p5341
10527a61490d5449E8064b0068D3067R0562b16596q8398D4321J2819a80887Q0512
10516a00375q1510C2388K59687H8001b06523L48A28196c3342k3062q4530H727
10504A49245b54368d0111k87607g5914j12473A42077b39747I0949C095K34500
10494B37595b686l40315A36847n4023d0646j20260B09651p5737J39778c3574m2042
10483g5616D66775L437j04530J06983o4594G0336J46769f8551A98299l1289c7519
10471f4831j20624n3963e1596B51917A16312b77992R7703r976i265j86782B09185
$$ plain form
10549 -205440 185659 -411527 54662 -206464 -304835 -150857 48787 -205038 -30906 -14083
10538 169463 178618 -202455 -38185 -267140 62412 -146175 170671 138822 120916 -86149 -161490
10527 -161490 -45449 58064 -20068 43067 133629 -216596 -304994 44321 57140 -180887 -100375
10516 -100375 -181885 32388 292075 88001 -206523 -206175 128196 -33342 -56404 -140934 8727
10504 149245 -254368 -40111 -327718 -75914 -188387 142077 -239747 90949 3095 237595
10494 237595 -2686 -343001 136847 82824 -40646 -160906 209651 133914 273692 -33574 -75616
10483 -75616 466775 470212 365682 472665 408071 70336 217105 -68551 198299 167010 -37519
10471 -64831 -185455 -239418 -51596 251917 116312 -277992 -180289 -190265 -9265 -196047 209185
10459a6370m07404a22796a6803B2116O9830d27841J65604M1250h3664m7425F3135
10447G708d67197B03653m7754a90089q4581I9043b78204A70878K1629f4420k41331
10436c05751a35210A67261N1042l4372G2930M7585j0485a95013i2505P946A15717
10424G6389c17810a21211F2110J22175g4105G7848C2219a7360B53584M2448a11804
10412i3165D40189c0944k28889A21994j8690D4918J37786O0739b06985M076A4639
10400f3194I5402a26670A19419L6003J82986D8713J41895q0058a60293B02990
10389b24838B73210Q366A23949c0488o4103A64340m3601C7799M1068a93201A75782
10377C14663j16236r895M4197Q1760M2276A67535Q2970J27048F9118J38575N33257
$$ plain form
10459 -16370 -423774 -122796 -16803 22116 91946 -427841 -262237 -220987 -83664 -131089 63135
10447 7708 -467197 203653 155899 -190089 -274670 99043 -278204 170878 192507 -64420 -305751
10436 -305751 -135210 167261 218303 183931 72930 120515 110030 -195013 -92505 -84559 115717
10424 76389 -317810 -121211 62110 184285 -74105 77848 32219 -17360 253584 296032 -111804
10412 -93165 440189 -30944 -259833 121994 103304 44918 182704 243443 -206985 -202909 14639
10400 -63194 95402 -126670 119419 155422 338408 48713 190608 110550 -160293 202990
10389 -224838 273210 281576 123949 -30488 -94591 164340 120739 37799 78867 -193201 175782
10377 314663 198427 188532 232729 314489 356765 167535 250505 377553 69118 207693 740950
10366G40950k66773o6970j34920E2269L99534m7023o2649q3649D061J88645a64874
10354D97996j99595l0070J45832J7298j07513K969m9868J88669k15564o0077K71389
10343D61466j73968A04341K735a1198E08093j76561r4840k6556M5566K8627b00908
10331c87811E8765P9473l2818A4790L6412J25056q4672Q193b07425A71138K43024
10320D14162j603d2050A97232H2444i139j80767A67211C9515L7978b1888C5452
10308h6636D3625b3653j11657r5756I5369b4766B68232a46231a9285k33338C1299
10296i5843H4657L23587c675k1303A53405a81461C97564c18564a50011H8740K4168
10285A12908l7502a3743j91860L2711P7051j14735f2965B60858a04644A35612
$$ plain form
10366 740950 474177 407207 272287 52269 451803 404780 342131 258482 4061 192706 -164874
10354 497996 298401 268331 414163 431461 323948 326917 277049 465718 250154 190077 461466
10343 461466 287498 104341 107076 -11198 508093 331532 236692 210136 255702 284329 -200908
10331 -387811 58765 138238 105420 14790 51202 176258 91586 99779 -207425 171138 414162
10320 414162 412559 -42050 197232 82444 -9139 -189906 167211 39515 77493 -21888 35452
10308 -86636 43625 -23653 -135310 -231066 95369 -24766 268232 -146231 -19285 -252623 31299
10296 -95843 84657 408244 -3675 -24978 153405 -181461 397564 -318564 -150011 88740 112908
10285 112908 75406 -13743 -205603 -172892 -95841 -210576 -62965 260858 -104644 135612
10274h1317p0807D19302A93274e3762r2098d552j06226H1569a45112J9247e3576
10262A1957M6762K97508k4065K18584l3502p0539j47123D2209J29032i8372q8668
10251a87040A31186K11599D290N0831a55007D9134L5832a04642j08470A95793
10240B39646N47j19451B6149a48395B14879A04a85554L6910j26412B24272H3848
10228A10023a08789A14046b24876h8443m3915k14796J33608a7716j53750M0974
10218a30492K0603A54657a0758j96490q9521G8234O2966a10225j34768J19519
10208a25474p1548C1076R9437b59498b7858B55677a38190a6584p0581j13892G6976
10196b34036d5175n2299a6977p4804A32853N8350C258e0907a0525A29543a90499
$$ plain form
10274 -81317 -152124 419302 193274 -53762 -145860 -4552 -110778 81569 -145112 -125865 -53576
10262 11957 58719 356227 332162 550746 517244 446705 299582 42209 171241 -98372 -187040
10251 -187040 131186 342785 4290 55121 -155007 49134 84966 -104642 -213112 195793
10240 239646 240193 120742 26149 -148395 214879 104 -185554 -148644 -275056 224272 83848
10228 110023 -108789 114046 -224876 -88443 -132358 -347154 -213546 -17716 -171466 -130492
10218 -130492 -109889 154657 -10758 -207248 -296769 78234 141200 -110225 -244993 -125474
10208 -125474 -197022 31076 130513 -259498 -27858 255677 -138190 -16584 -87165 -201057 76976
10196 -234036 -45175 -97474 -16977 -91781 132853 191203 3258 -50907 -10525 129543 -190499
10184f8253L0190A3139d02275c0801j77926Q5280l37772B13837h7860n0850k12729
10173c51439D1584J58442a42274C24741a93431N0766f6082B3628K27216g0466
10162e5448K717k091o4199D9276c20420L7822A27973g840I9283R010b5792J2535
10150a3257L20j38380K87G4132a23433l3208G7063i9317d3389A56693h2374c4787
10137c02228A05495B8318K81536a18908B36359D5787J31810B5104c64079g7012
10126C2941a73909e7954j57795Q2260a162m9836k0994A91112a69538b0326o8818
10115h9144m16373h12A10324f3421K2476q9416r2847g6678p165H7858a85945P047
10103a78898B19154l5340e6980A67947a00581M0834K1538I1330a08686D71149
$$ plain form
10184 -68253 -38063 13139 -402275 -30801 -208727 -123447 -461219 213837 -87860 -138710 -351439
10173 -351439 41584 200026 -142274 324741 -193431 -142665 -66082 23628 250844 -70466
10162 -55448 -52731 -54822 -119021 49276 -320420 -282598 127973 -7840 99283 108293 -25792 -13257
10150 -13257 -12937 -151317 -151030 74132 -123433 -156641 77063 -99317 -43389 156693 -82374 -34787
10137 -302228 105495 28318 309854 -118908 236359 45787 177597 25104 -364079 -77012
10126 32941 -173909 -57954 -215749 -133489 -1162 -50998 -71992 191112 -169538 -20326 -89144
10115 -89144 -505517 -812 110324 -63421 -40945 -130361 -223208 -76678 -83843 87858 -185945 -178898
10103 -178898 219154 183814 -56980 167947 -100581 -59747 -38209 91330 -108686 471149
10092b53849a7057q5683M8866j22960I5033a58595j04137b7640B10400C8063d98215
10080b15530g3519E5585g0116H9393g7123A72059a16822e5178o7610A63711a2393
10068A49154h1440b8624j31760P8568k19873B0382L280K3266K7542b16306B12082
10056f3913k13507H1795J14946B576b67368A43807A4085a5181G6638J06317b95646
10044b45609B207O209J2290J05325K5143J22161c82130D3234d48369M0682K00385
10033b07302A47681i1326G0334i7906I90a75946k95175b27274Q8316j61995A7107
10021c19985B7348a57805n3706i5656j08981h9337k53221A73860b82683p2749
10011c55432d6343A38471h7480j90301g3890k28325h9907B1585K00610a78185
$$ plain form
10092 -253849 -17057 -102740 -53874 -176834 95033 -158595 -262732 -27640 210400 38063 -498215
10080 -215530 -73519 55585 -70116 89393 -77123 172059 -116822 -55178 -122788 163711 -12393
10068 149154 -81440 -28624 -160384 -81816 -301689 20382 23662 46928 74470 -216306 212082
10056 -63913 -277420 81795 196741 2576 -267368 143807 14085 -15181 76638 182955 -295646
10044 -245609 2207 8416 20706 126031 151174 273335 -382130 43234 -448369 -407687 -207302
10033 -207302 147681 -91326 70334 -97906 990 -175946 -471121 -227274 -138958 -300953 17107
10021 -319985 27348 -157805 -211511 -95656 -204637 -89337 -342558 173860 -282683 -355432
10011 -355432 -46343 138471 -87480 -277781 -73890 -302215 -89907 21585 222195 -178185
10000A23594d9130H5124b59828d0270p9584j27743F7587a35A01458f0235A79003
9988A10119K83420j65941A9871a54462E7380O3449h2488B60868a40460r952j44563
9977b94975j34487G9846l0490b16853P6932M201l5331j36744E6298J59936a16864
9965E4059c43604J00149J2523B68701c9898F0445c97116e8319j64122iE7453b95168
9952G8235a26520F6834b08526A6303K46994j24425l7602B6972B087a54841k33203
9941c88044g9000p6462J9478M8003d2385k49467N6728F2528a28495B75118h6406
9929D4986R0352H080b43262B4719d4627k8407D41483a02150A23588b07011l3491
9918b40502A76408l4782d21244A32795J00235b9416R863l9482j58716a1133j16345
$$ plain form
10000 123594 -49130 85124 -259828 -40270 -119854 -247597 67587 -135 101458 -60235 179003
9988 110119 393539 227598 19871 -154462 57380 120829 -82488 260868 -140460 -150412 -294975
9977 -294975 -429462 79846 49356 -216853 -139921 -135720 -171051 -307795 56298 216234 -116864
9965 54059 -343604 -243455 -230932 268701 -39898 60445 -397116 -58319 -222441 -9 57453 -295168
9952 78235 -126520 66834 -208526 16303 263297 138872 101270 26972 2087 -154841 -388044
9941 -388044 -79000 -155462 -135984 -87981 -42385 -291852 -235124 62528 -128495 275118 -86406
9929 44986 135338 8080 -243262 24719 -44627 -73034 441483 -102150 123588 -207011 -240502
9918 -240502 176408 141626 -421244 132795 233030 -29416 -19553 -59035 -217751 -11133 -127478
9907a27478l062l94965i6405C16528a70324Q309k42178a66215l1097f8560a0375
9895b57781H1183b44527A59265o7548b70221a32578G2621J15454p4885c9436n6610
9884i6046j4923k1364E8517a20161q8969m63744B42182c15724D0642b9126C1148
9872d47593e8069j5804C20345a13183k01834c9026m725D1487a26101o8149F8299
9860C4704a65083d2870l5599k00346J00904a1042m7649j63505C8050J01661O3242
9849B02953o5515B0114e131j60756m06724G8310a04078d4234A38943d15203D8807
9837B06930a5645j08315A0754L8906c57650j33581C17730C2294Q5511a87400A2572
9825b15366D1059f4956L2452o1111A8826p667J56320a78441k1973L9879M2568
$$ plain form
9907 -127478 -130540 -525505 -96405 316528 -170324 -162015 -404193 -166215 -197312 -68560 -10375
9895 -257781 81183 -244527 159265 91717 -270221 -132578 72621 188075 113190 -39436 -96046
9884 -96046 -110969 -132333 58517 -120161 -209130 -672874 242182 -315724 40642 -29126 31148
9872 -447593 -58069 -73873 320345 -113183 -315017 -39026 -43751 41487 -126101 -194250 68299
9860 34704 -165083 -42870 -78469 -278815 -177911 -11042 -58691 -222196 38050 139711 202953
9849 202953 137438 20114 -5131 -165887 -572611 78310 -104078 -44234 138943 -415203 48807
9837 206930 -15645 -123960 10754 49660 -357650 -491231 317730 32294 117805 -187400 12572
9825 -215366 41059 -64956 -32504 -93615 18826 11159 167479 -178441 -200414 -160535 -117967
9814a17967A5785P309K39888a60836J6808k23124B9095J04346a43587o6083m263
9803b13933P9367H4533b15571A40776h5685j13573G9885j0925O3796m3560B1091
9791i6216B4159c43527g0650k8528B00721e8479E9767e4761j90975e9858o3931
9780a23789R109j69365o8408a13200M5077m4459M6175F7086K53108l0267c42743
9768A89421p5865b52333A40329a60132C05060j39181c3263A02101a50970B4584
9757b19791E0104J32837b25117F0009c22892a54456A43864F5461B9636K35417
9747B65053H748g6797j47103o9849J13904A08127a81253G6611K8813L1612d84795
9735G0471B8946a82634A80277m2602a09215L3066E1715d6411p0139F5177g3216
$$ plain form
9814 -117967 15785 23094 262982 -160836 -144028 -367152 29095 133441 -143587 -209670 -213933
9803 -213933 -134566 84533 -215571 140776 -85685 -199258 79885 68960 132756 89196 21091
9791 -96216 24159 -343527 -70650 -99178 200721 -58479 59767 -54761 -245736 -59858 -123789
9780 -123789 -114680 -284045 -352453 -113200 -68123 -112582 -66407 67086 320194 289927 -342743
9768 189421 113556 -252333 140329 -160132 305060 165879 -33263 102101 -150970 24584
9757 -219791 50104 182941 -225117 60009 -322892 -154456 143864 65461 29636 265053
9747 265053 8748 -76797 -223900 -293749 -179845 108127 -181253 76611 105424 137036 -484795
9735 70471 28946 -182634 180277 137675 -109215 -76149 51715 -46411 -116550 65177 -73216
9723e8231j11167k1326N5141f2048I703P4506C3589a5293C17374b40831B9269
9711b75332k9705e4246C17264E505a08088b6803j82499o1374F1789a26619K2530
9700a04089M8680n7887b7409j6631k14389B58564d0315j23192d2700A61169b82919
9688a63339A77855a24484e7393I1823P0713a45572A01368B2177N9336i1139j55836
9677b46975K7822Q1150o3708A6244d68099a92898k8106A0720K20721b17215A66068
9665f4853A37726i835j30819l948C59076a52908n2456N9148f6864A10701a05020
9653b25452R7131A92729c15358J32859q120i86j7392A0807h6760M2064D706c11462
9640A21402B4213d9576H772O1227a80359O2072A16900b35713D3895d86481a34416
$$ plain form
9723 -58231 -169398 -190724 -135583 -62048 9703 84209 33589 -15293 317374 -240831 29269
9711 -275332 -305037 -54246 317264 5505 -108088 -26803 -209302 -270676 61789 -126619 -104089
9700 -104089 -55409 -113296 -27409 -44040 -258429 258564 -40315 -163507 -42700 161169 -282919
9688 -163339 177855 -124484 -57393 91823 162536 -145572 101368 22177 81513 -91139 -246975
9677 -246975 -219153 -138003 -201711 16244 -468099 -192898 -221004 10720 231441 -217215 166068
9665 -64853 137726 -9835 -140654 -144602 359076 -152908 -205364 -146216 -66864 110701 -105020
9653 -225452 -128321 192729 -315358 -182499 -190619 -986 -18378 10807 -86760 -44696 4706 -311462
9640 121402 24213 -49576 8772 69999 -180359 -118287 116900 -235713 43895 -486481 -134416
9628b4591C56245a1698j62547L0448j11936R0168g8425A28309i6310k1811A52038
9616A70168M5848I70b50711k121q3771A11355b50410B39099b49322r6435a12861
9604D1513c20273e2748m32357g9446E8627B4832a00781l36267A71936B7487b9827
9592a53162M0096m2714C87512F9709K2396b65826A01878b5384k55429P370A0984
9580c09854H7614a08715e1309E0479c988I1751J25483M4680A12694b30727J10266
9569a20461N1979q9755f084A22601P1205G8935k9752a15449b3050B62217A04758
9557A43449d1950k33075B590a27121A26419a7702E3973a91242A95590l9993a22247
9545E4006b82141a32092j0194A08230g4220K6740k43642k9750a12151B7884M659
$$ plain form
9628 -24591 356245 -11698 -174245 -143797 -255733 -165565 -78425 128309 -96310 -118121 152038
9616 170168 216016 970 -250711 -252832 -336603 111355 -250410 239099 -249322 -345757 -112861
9604 41513 -320273 -52748 -485105 -79446 58627 24832 -100781 -437048 171936 27487 -29827
9592 -153162 -113066 -155780 387512 69709 92105 -265826 101878 -25384 -280813 -273443 10984
9580 -309854 87614 -108715 -51309 50479 -3988 91751 217234 261914 112694 -230727 -120461
9569 -120461 -68482 -158237 -6084 122601 193806 78935 49183 -115449 -23050 262217 104758
9557 143449 -41950 -275025 2590 -127121 126419 -17702 53973 -191242 195590 155597 -122247
9545 54006 -282141 -132092 -142286 108230 -74220 -47480 -291122 -320872 -112151 27884 32543
9534C2543J38685a68209H5439C6560c8354p9178A35513L22950I6730d75875J95365
9523b80510a13712b4109A20847e3880R120F8546a34326j91621b2443j38307k20995
9512c81745G7034C6359a58710j7298g7200L6589n1483B22998b64473h7075p0927
9501a58002j40219i9515a2125A41339c13619A97604b31066B50767a73364j39784
9491c13148a11222k45965A48614a19067j26160c9356B52571r5724C4283a77053
9480A75275D6838P768R2901E5276b54240A05081m7084b45776a14321a7529A5197
9468a24911A64708d745A83711p5397m2168a03984j12312F0032B758L3704c8803
9456c8720j17294P4659o9009j6070A22933J3263p704a61079k2644Q6262C0714
$$ plain form
9534 32543 171228 -168209 85439 36560 -38354 -117532 135513 458463 96730 -475875 -280510
9523 -280510 -113712 -24109 120847 -53880 -44760 68546 -134326 -325947 -22443 -160750 -381745
9512 -381745 77034 36359 -158710 -176008 -77200 -40611 -92094 222998 -264473 -87075 -158002
9501 -158002 -298221 -99515 -12125 141339 -313619 197604 -231066 250767 -173364 -313148
9491 -313148 -111222 -357187 148614 -119067 -245227 -39356 252571 156847 34283 -177053
9480 175275 46838 54606 147507 55276 -254240 105081 57997 -245776 -114321 -17529 15197
9468 -124911 164708 -4745 183711 108314 66146 -103984 -216296 60032 2758 36462 -38803
9456 -38720 -156014 -81355 -150364 -166434 122933 136196 128492 -161079 -183723 -97461 30714
9444A69483J9780g4230j92122F4390a08021D2298c1772o5454b8423n8109G6248
9432a17770c2636k11141A01612f5131H1533a1454k27672a0327I3909l0131c3672
9420C5065c71930C3652a98326m2161F8750b41921K4285D8123R7166m0050h1031
9408e2443j43600k1139b8036m3182G9074J5508b05481q6683b7362I0777a25064
9396c84399A60262m4239c62919a30240A7270b418B42219g4509B09414f59992a76184
9384g6487A07442b88570d6651j72282j0166J02438e5914f51B49390i3337F8804
9372g5832j61727g4253N648j089H1805k8368b97521A30608K6684b13226P3137
9361a40089j47744g0311E0878d943A57818c84310a40800F2928J32638c96546a18040
$$ plain form
9444 169483 189263 -74230 -266352 64390 -108021 42298 -31772 -97226 -28423 -86532 76248
9432 -117770 -32636 -243777 101612 -65131 81533 -11454 -239126 -10327 93909 63778 -33672
9420 35065 -371930 33652 -198326 -240487 68750 -241921 -217636 48123 145289 105239 -81031
9408 -52443 -196043 -217182 -28036 -71218 79074 94582 -205481 -292164 -27362 90777 -125064
9396 -384399 160262 116023 -362919 -130240 17270 -2418 242219 -74509 209414 -659992 -176184
9384 -76487 107442 -288570 -46651 -218933 -229099 -126661 -55914 -651 249390 -93337 68804
9372 -75832 -237559 -74253 -68605 -69694 81805 53437 -297521 130608 157292 -213226 -140089
9361 -140089 -287833 -70311 50878 -4943 157818 -384310 -140800 62928 195566 -396546 -118040
9349b32228K3069A07273J41941b59424g2237A18825d5971F0301a35297c4189q2212
9338a16401o8162m9808J13687o7154J3837O2394A05404j5122a15262j99330E2144
9326a94199I3889c1317E4904b10458N1762H8790d7523A6604b27494e7386G9981
9314b95249B72497c59399J30024a5356q66k49191f8870j12341A64259b22765k09302
9303d32067E9988a90881k20373A21340b0378q2132m9662N3591M5540B85997A12718
9291a09671d1776E7202a05517p7370I2962h499L671B2479L0319b39975A58986
9279d2599j55677c821l7597j23372o3741j10237C2655L27024G3562a45029f0505
9267f8057C64968c44672H9831n279c2027p7934J2070D5683c35994J48082n7481
$$ plain form
9349 -232228 -209159 107273 249214 -259424 -72237 118825 -45971 60301 -135297 -34189 -116401
9338 -116401 -184563 -234371 -120684 -187838 -174001 -111607 105404 90282 -115262 -314592 52144
9326 -194199 93889 -31317 54904 -210458 -158696 88790 -47523 16604 -227494 -57386 79981
9314 -295249 272497 -359399 -229375 -15356 -16222 -265413 -68870 -181211 164259 -222765 -432067
9303 -432067 59988 -190881 -411254 121340 -20378 -102510 -152172 -98581 -53041 285997 112718
9291 -109671 -41776 57202 -105517 -182887 92962 -8499 -4828 22479 52798 -239975 158986
9279 -42599 -198276 -3821 -41418 -164790 -228531 -338768 32655 359679 73562 -145029 -60505
9267 -68057 364968 -344672 89831 84552 -32027 -109961 -97891 45683 -335994 -187912 -245393
9256b45393A02139L39349A69464H879L96528a18736j34538G4144a6931p9054m8366
9245a44351A57798h1687E2195e78787B65755a71286A9327Q3049c92119i8968o2112
9234a61080k8135B2998K32683a83792Q6098q7843D0345b2285H8786J83662c2781
9222a73955h2105c1425r7370d0303n0332H0744c02875J46741B1763e6006m7499
9211a03505B21257j5865e43021A75269m5101a63209j10693M2481J5923l457a9303
9199g8704A65967D8556c38770a9371o4378r8733e7995r352j86285L8196c1424
9187a43729j01035A71592J7897l4390E543M4956e18482E8329B1878K17200a1579
9175E473M9528L1659j6824G180K08374b87888k3894g5816r0691C57688b78143
$$ plain form
9256 -245393 102139 441488 169464 8879 405407 -118736 -253274 74144 -16931 -95985 -144351
9245 -144351 157798 -81687 52195 -578787 265755 -171286 19327 102376 -392119 -98968 -161080
9234 -161080 -189215 22998 255681 -183792 -97694 -185537 40345 -22285 88786 272448 -32781
9222 -173955 -82105 -31425 -128795 -40303 -90635 80744 -302875 -156134 21763 -56006 -103505
9211 -103505 221257 205392 -543021 175269 130168 -163209 -273902 -231421 -215498 -218955 -19303
9199 -78704 165967 48556 -338770 -19371 -83749 -182482 -57995 -67347 -253632 -215436 -31424
9187 -143729 -244764 171592 189489 155099 5543 50499 -518482 58329 21878 239078 -11579
9175 5473 55001 86660 69836 7180 215554 -287888 -311782 -75816 -166507 357688 -278143
9163c332l53470J29773l580a760l0527B64047e6145A93966N9710i3162a9106B3876
9150b06333i1479c4923H050c5482k0036q3836k3330B2122a84674A71323c08864
9138b37872A50020g9187A15368g3267j94349A62647b29084A86413b12008E2243
9127c2688k30113O5361g0120q5837J3659D6456J16662N2222g4827o2789m7719
9116a85335B39744j11243C4692d7602B37990F4868M5660c60857A5587g6581I5080
9104A67949j6254B0807J61287D4674g0285k5935j61216e5343j70341A98579a69907
9092d69939G4755c1177J314j39887j76286D2007a16434j05198G2682a78946P9375
9081i9571l25549I6876b4669K129l71074a07131M0878B73251b4922j56690d468
$$ plain form
9163 -3332 -356802 -227029 -230609 -1760 -32287 264047 -56145 193966 253676 -93162 -19106 23876
9150 -206333 -91479 -34923 8050 -35482 -55518 -139354 -162684 22122 -184674 171323 -308864
9138 -237872 150020 -79187 115368 -73267 -267616 162647 -229084 186413 -212008 52243
9127 -32688 -262801 -197440 -70120 -155957 -142298 46456 163118 215340 -74827 -137616 -185335
9116 -185335 239744 128501 34692 -47602 237990 64868 110528 -360857 15587 -76581 95080
9104 167949 151695 20807 182094 44674 -70285 -96220 -257436 -55343 -225684 198579 -169907
9092 -469939 74755 -31177 -29863 -169750 -346036 42007 -116434 -221632 72682 -178946 -99571
9081 -99571 -425120 96876 -24669 -22540 -393614 -107131 -66253 273251 -24922 -181612 -4468
9069f5688o72c513A63330c86301c7628k15133h988C0918g0471A06381b83457J35605
9057a47852H9898e4635k37952A52781i5279A46686b95238h472I0271H454J02099
9046A10553g6456j43604n5971e3438l71650a60585J5711m1220Q2445l57873g2686
9034d52006E3331K889a42234j32183A34979a58753P6457D035d7911n0955A28212
9022E8301J87956d0442k6175J9814j71478l2393C1335J55586h0105L8508j42207
9011a83804d7983A26865B353a10985A57821a36626N286g171n7687j2989B0206
8999A17821c30167R6831a1807G1091d7178k43253h9834k28137e4307k52433g0327
8987A30834c23182j23695a57283n5519N9674N2945A8544j144b4342A33152M326
$$ plain form
9069 -65688 -66360 -3513 163330 -386301 -37628 -252761 -8988 30918 -70471 106381 -283457 -147852
9057 -147852 89898 -54635 -292587 152781 -95279 146686 -295238 -8472 90271 8454 110553
9046 110553 -76456 -220060 -276031 -53438 -425088 -160585 -144874 -186094 -103649 -461522 -72686
9034 -452006 53331 56220 -142234 -274417 134979 -158753 -82296 4035 -47911 -98866 128212
9022 58301 246257 -40442 -66617 -46803 -218281 -250674 31335 186921 -80105 -41597 -183804
9011 -183804 -47983 126865 2353 -110985 157821 -136626 -131340 -7171 -64858 -77847 20206
8999 117821 -330167 -233336 -11807 71091 -47178 -290431 -89834 -317971 -54307 -306740 -70327
8987 130834 -323182 -446877 -157283 -212802 -153128 -100183 18544 17400 -24342 133152 137478
8976A37478a84139r63A58965b54333a25737k37449A35671D8030Q771L67015a30808
8964a29655G5571J94293k7984G3467a30819a0086B15938d12860l6403f345k62589
8953b68934h0482b2628A51269b8269A25356c61966a09545E0854N0528d40682D0174
8941i8757j33033B33626a67573c3963B75453a2356C04372d2651G3673a47097C0152
8929a99347A63910F0388L75458P0813L44738K111576M579846R022738q062587
8920H502970B588392I39029C86961J2572R998C6309J21827O2939a66006I9167
8909A69326M15714k73033n2306c24442B21634I5022N9116A8682O4192E89b6665
8897C2220K35265b18013A99366b3789k20729B07617n290p1790g6796r9050j28878
$$ plain form
8976 137478 -184139 -185102 158965 -254333 -125737 -363186 135671 48030 56801 423816 -130808
8964 -129655 75571 269864 241880 73467 -130819 -10086 215938 -412860 -449263 -6345 -268934
8953 -268934 -80482 -22628 151269 -28269 125356 -361966 -109545 50854 101382 -440682 40174
8941 -98757 -231790 233626 -167573 -33963 275453 -12356 304372 -42651 73673 -147097 30152
8929 -199347 163910 60388 435846 506659 851397 2962973 7542819 16565557 8502970
8920 8502970 2588392 939029 386961 399533 409531 36309 158136 221075 -166006 99167
8909 169326 585040 312007 259701 -324442 221634 95022 154138 18682 82874 589 -26665
8897 32220 267485 -218013 199366 -23789 -244518 207617 202327 130537 -76796 -175846 -304724
8886c04724C6124J81144d5814a9528p9075I541b25541M8296E2296R6128D9573
8874A52268g1175b6487j95985g5064I881J29289E223J58858a85204F6117a46193
8862I515i8788m1415B12201q7351b17151B34241a1805A65386a00622l02838d8404
8850A9604b93268I2907b17212j51162B57787B9909a19875A6000b58575h2543A15303
$$ plain form
8886 -304724 36124 217268 -45814 -19528 -98603 9541 -225541 -177245 52296 148424 49573
8874 152268 -71175 -26487 -222472 -75064 9881 139170 5223 164081 -185204 66117 -146193
8862 9515 -98788 -140203 212201 124850 -217151 234241 -11805 165386 -100622 -403460 -48404
8850 19604 -293268 92907 -217212 -368374 257787 29909 -119875 16000 -258575 -82543 115303
$$ [...]
##END NTUPLES=NMR SPECTRUM
##END=
