##TITLE=AC1544_ROEFFECT0012_8215172_bp29KGnp56
##JCAMPDX= 6.0         $$ Bruker NMR JCAMP-DX V2.0
##DATA TYPE= NMR SPECTRUM
##DATA CLASS= NTUPLES
##ORIGIN= BRUKER
##OWNER= Administrator
$$ 1.72 TOPSPIN		Version 2.1
$$ 2013-10-12 13:25:26.851 -0700  Administrator@X
$$ Compression mode = diff/dup
##.OBSERVE FREQUENCY= 400.02188249412
##.OBSERVE NUCLEUS= ^1H
##.ACQUISITION MODE= SIMULTANEOUS (DQD)
##.ACQUISITION SCHEME= undefined
##.AVERAGES= 64
##.DIGITISER RES= 22
##SPECTROMETER/DATA SYSTEM= spect
##.PULSE SEQUENCE= noesygpps1d.comp
##.SOLVENT NAME= COFFEE_meoh
##.SHIFT REFERENCE= INTERNAL, COFFEE_meoh, 1, 14.96063
##AUDIT TRAIL= $$ (NUMBER, WHEN, WHO, WHERE, PROCESS, VERSION, WHAT)
$$ ##TITLE= Audit trail, TOPSPIN		Version 2.1
$$ ##JCAMPDX= 5.01
$$ ##ORIGIN= Bruker BioSpin GmbH
$$ ##OWNER= Administrator
$$ $$ E:\/data/COFFEE/nmr/AC1544_ROEFFECT0012_8215172_bp29KGnp56/12/pdata/1/auditp.txt
$$ ##AUDIT TRAIL=  $$ (NUMBER, WHEN, WHO, WHERE, PROCESS, VERSION, WHAT)
(   1,<2013-10-12 13:25:20.041 -0700>,<Administrator>,<X>,<go>,<TOPSPIN 2.1>,
      <created by zg
	started at 2013-10-12 13:13:50.280 -0700,
	POWCHK enabled, PULCHK disabled,
       configuration hash MD5:
       C8 4E 4E 5D D3 5C D8 9E 9F 52 82 E0 59 8A DE 15
       data hash MD5: 64K
       95 49 19 CD 6F 4E A6 68 29 80 2F D2 EF 55 07 2C>)
(   2,<2013-10-12 13:25:24.174 -0700>,<Administrator>,<X>,<proc1d>,<TOPSPIN 2.1>,
      <Start of raw data processing
       efp LB = 0.3 FT_mod = 6 PKNL = 1 PHC0 = 0 PHC1 = 0 SI = 128K 
       data hash MD5: 128K
       4C 30 42 00 61 CA 70 99 1F 14 19 83 2F F9 54 ED>)
(   3,<2013-10-12 13:25:25.509 -0700>,<Administrator>,<X>,<proc1d>,<TOPSPIN 2.1>,
      <pk PHC0 = -80.28259 PHC1 = 0 
       data hash MD5: 128K
       F0 32 B9 DE 6D FB BA F5 F4 33 7D 45 E5 98 6E B0>)
(   4,<2013-10-12 13:25:26.134 -0700>,<Administrator>,<X>,<proc1d>,<TOPSPIN 2.1>,
      <abs ABSG = 1 
       data hash MD5: 128K
       67 53 96 CE 42 D1 6E 8A E3 EF 03 E9 BC ED 33 2A>)
(   5,<2013-10-12 13:25:26.284 -0700>,<Administrator>,<X>,<proc1d>,<TOPSPIN 2.1>,
      <abs ABSG = 2 
       data hash MD5: 128K
       FC 64 C7 D2 AC 3D 2F C7 E2 40 D7 A3 97 A8 FC 84>)
(   6,<2013-10-12 13:25:26.392 -0700>,<Administrator>,<X>,<proc1d>,<TOPSPIN 2.1>,
      <abs ABSG = 3 
       data hash MD5: 128K
       86 D7 AF 5F 47 5E 3F 98 4A A9 B7 A8 BD CE C6 93>)
(   7,<2013-10-12 13:25:26.521 -0700>,<Administrator>,<X>,<proc1d>,<TOPSPIN 2.1>,
      <abs ABSG = 4 
       data hash MD5: 128K
       98 0A 35 B2 30 15 E8 60 58 A0 76 D6 0C F8 5F 96>)
(   8,<2013-10-12 13:25:26.629 -0700>,<Administrator>,<X>,<proc1d>,<TOPSPIN 2.1>,
      <abs ABSG = 5 
       data hash MD5: 128K
       EE 34 F7 25 00 D3 9D 14 7B 5B 19 C5 D7 0D AC A7>)
$$ ##END=
$$ 
$$ $$ hash MD5
$$ $$ 17 64 0A 2B 0F FF 47 F5 44 39 3A 5E EE 63 55 13
##$RELAX= 
##$RELAX= 
##$RELAX= 
##$RELAX= 
##$RELAX= 
##$RELAX= 
##$RELAX= 
##$RELAX= 
$$ Bruker specific parameters
$$ --------------------------
##$DU= <E:\>
##$EXPNO= 12
$$ [...]
##$TP07= 0
##$TPNAME0= <>
##$TPNAME1= <>
##$TPNAME2= <>
##$TPNAME3= <>
##$TPNAME4= <>
##$TPNAME5= <>
##$TPNAME6= <>
##$TPNAME7= <>
##$TPOAL= (0..7)
0.5 0.5 0.5 0.5 0.5 0.5 0.5 0.5
##$TPOFFS= (0..7)
0 0 0 0 0 0 0 0
##$TUNHIN= 0
##$TUNHOUT= 0
##$TUNXOUT= 0
##$USERA1= <user>
##$USERA2= <user>
##$USERA3= <user>
##$USERA4= <user>
##$USERA5= <user>
##$V9= 5
##$VALIST= <valist>
##$VCLIST= <CCCCCCCCCCCCCCC>
##$VD= 0
##$VDLIST= <DDDDDDDDDDDDDDD>
##$VPLIST= <PPPPPPPPPPPPPPP>
##$VTLIST= <TTTTTTTTTTTTTTT>
##$WBST= 1024
##$WBSW= 4
##$XGAIN= (0..3)
0 0 0 0
##$XL= 0
##$YL= 0
##$YMAX_a= 6328131
##$YMIN_a= -12513025
##$ZGOPTNS= <>
##$ZL1= 120
##$ZL2= 120
##$ZL3= 120
##$ZL4= 120
##$ABSF1= 14.96063
##$ABSF2= -5.597551
##$ABSG= 5
##$ABSL= 3
##$ALPHA= 0
##$AQORDER= 0
##$ASSFAC= 0
##$ASSFACI= 0
##$ASSFACX= 0
##$ASSWID= 0
##$AUNMP= <proc_prof1d_extract.lims>
##$AXLEFT= 0
##$AXNAME= <>
##$AXNUC= <1H>
##$AXRIGHT= 0
##$AXTYPE= 0
##$AXUNIT= <>
##$AZFE= 0.1
##$AZFW= 0.1
##$BCFW= 0
##$BC_mod= 0
##$BYTORDP= 0
##$COROFFS= 0
##$CY= 15
##$DATMOD= 1
##$DC= 0
##$DFILT= <>
##$DTYPP= 0
##$F1P= 0
##$F2P= 0
##$FCOR= 0.5
##$FTSIZE= 131072
##$FT_mod= 6
##$GAMMA= 0
##$GB= 0
##$INTBC= 1
##$INTSCL= 1
##$ISEN= 128
##$LB= 0.3
##$LEV0= 0
##$LPBIN= 0
##$MAXI= 10000
##$MC2= 0
##$MEAN= 0
##$ME_mod= 0
##$MI= 0
##$NCOEF= 0
##$NC_proc= -2
##$NLEV= 6
##$NOISF1= 0
##$NOISF2= 0
##$NSP= 0
##$NTH_PI= 0
##$NZP= 0
##$OFFSET= 14.96063
##$PC= 1
##$PHC0= -80.28259
##$PHC1= 0
##$PH_mod= 1
##$PKNL= yes
##$PPARMOD= 0
##$PPDIAG= 0
##$PPIPTYP= 0
##$PPMPNUM= 2147483647
##$PPRESOL= 1
##$PSCAL= 4
##$PSIGN= 0
##$PYNMP= <proc.py>
##$REVERSE= no
##$SF= 400.020009786726
##$SI= 131072
##$SIGF1= 0
##$SIGF2= 0
##$SINO= 400
##$SIOLD= 131072
##$SPECTYP= <>
##$SREGLST= <1H.CDCl3>
##$SSB= 0
##$STSI= 131072
##$STSR= 0
##$SW_p= 8223.68421052631
##$SYMM= 0
##$S_DEV= 0
##$TDeff= 65536
##$TDoff= 0
##$TI= <>
##$TILT= no
##$TM1= 0
##$TM2= 0
##$TOPLEV= 0
##$USERP1= <user>
##$USERP2= <user>
##$USERP3= <user>
##$USERP4= <user>
##$USERP5= <user>
##$WDW= 1
##$XDIM= 131072
##$YMAX_p= 378836390
##$YMIN_p= -11692
##$CURPLOT= <Network HP LaserJet P1505>
##$CURPRIN= <$Network HP LaserJet P1505>
##$DFORMAT= <normdp>
##$LAYOUT= <+/1D_H.xwp>
##$LFORMAT= <normlp>
##$PFORMAT= <normpl>
##$SURQMSG= 1
$$ End of Bruker specific parameters
$$ ---------------------------------
##NTUPLES= NMR SPECTRUM
##VAR_NAME=  FREQUENCY,     SPECTRUM/REAL,   SPECTRUM/IMAG
##SYMBOL=    X,             R,               I
##VAR_TYPE=  INDEPENDENT,   DEPENDENT,       DEPENDENT
##VAR_FORM=  AFFN,          ASDF,            ASDF
##VAR_DIM=   131072,        131072,          131072
##UNITS=     HZ,            ARBITRARY UNITS, ARBITRARY UNITS
##FACTOR=    0.0627417313425164, 1,          1
##FIRST=     8223.62146879497, 887,          -63607
##LAST=      0,             3087,            -62846
##MIN=       0,             -11692,          0
##MAX=       8223.62146879497, 378836390,    0
$$ Real data points
##PAGE= N=1
##DATA TABLE= (X++(R..R)), XYDATA
$$ [...]
61731D90045j976k365l626m474l936k274n46N18R14R37P71O01O83J012J215J017
61715D78516O84P20J205J689J786J523J130O73Q6n60j071j324j408j623k278l375
61699D76373m396m671m133l502l496l957m101l546k788k556k990l632m007m003
61685D24595l790l527l229k856k514k485k889l350l285k600j886j707j923j933
61671C86621j490r89r08j241j539j443j053q32j066j495j526r62k79nJ2M57J634
61654C73896L006L741L511K655J735J131J003J331J955K621L069L113K672J877
61640D07316J110Q41J188J689J706J118M71K16O0n97j644k253k008j524j550j869
61624D04270j690r11k99l86q85j403k107l197m227m521m069l442k922k380j993
$$ y = [490045, 488069, 485704, 482078, 477604, 473668, 471394, 470848, 471366, 472280, 473217, 473988, 474589, 475272, 476284, 477499, 478516, 479200, 479920, 481125, 482814, 484600, 486123, 487253, 487926, 488012, 487452, 486381, 485057, 483649, 482026, 479748, 476373, 471977, 467306, 463173, 459671, 456175, 452218, 448117, 444571, 441783, 439227, 436237, 432605, 428598, 424595, 420805, 417278, 414049, 411193, 408679, 406194, 403305, 399955, 396670, 394070, 392184, 390477, 388554, 386621, 385131, 384142, 383234, 381993, 380454, 379011, 377958, 377126, 376060, 374565, 373039, 372077, 371798, 371793, 371805, 372262, 373896, 376902, 380643, 384154, 386809, 388544, 389675, 390678, 392009, 393964, 396585, 399654, 402767, 405439, 407316, 408426, 409267, 410455, 412144, 413850, 414968, 415439, 415655, 415715, 415118, 413474, 411221, 409213, 407689, 406139, 404270, 402580, 401669, 401370, 400984, 400099, 398696, 396589, 393392, 389165, 384644, 380575, 377133, 374211, 371831, 369838]
61609C69838k299l313m135m039l528l671m638n536n719n466n099m255k648j101
61595C14391q89k092l320l336k371j544j439j736j949k011k082k154k002j503
61581B85963q89o38r68j479j547j105p07p14p77m06K51O16M82J73J5k0o7j38j50
61562B77895j5L43Q57J248J305J162J108J247J525J954K448K645K235J420O86
61547B98063K02j48k65J05Q06J299J343J176R25M18k25m54m8M13L22j10k19J87
61529C03790O76P89M35j48n31m13n0j04q60j804k289k291k118j769j072k15L77
61512B92403O23P54Q56R15J108J572J895J524O44N4R4K85K50L03P96J394J493
61495C06963J028M46Q3K9K92P48R75O16j03n34k97L77R58J034M60n36j330j201
$$ y = [369838, 367539, 364226, 360091, 356052, 352524, 348853, 344215, 338679, 332960, 327494, 322395, 318140, 315492, 314391, 313502, 311410, 308090, 304754, 302383, 300839, 299400, 297664, 295715, 293704, 291622, 289468, 287466, 285963, 285074, 284436, 283468, 281989, 280442, 279337, 278630, 277916, 277139, 276733, 276984, 277600, 278082, 278255, 278270, 278250, 278183, 278045, 277895, 277880, 278223, 279080, 280328, 281633, 282795, 283903, 285150, 286675, 288629, 291077, 293722, 295957, 297377, 298063, 298265, 298117, 297852, 297957, 298763, 300062, 301405, 302581, 303506, 303924, 303699, 303245, 303197, 303610, 303932, 303822, 303603, 303790, 304466, 305255, 305690, 305542, 305011, 304598, 304548, 304444, 303584, 301780, 299491, 297200, 295082, 293313, 292241, 292026, 292403, 293026, 293780, 294636, 295551, 296659, 298231, 300126, 301650, 302294, 302348, 302442, 302727, 302977, 303280, 304076, 305470, 306963, 307991, 308437, 308520, 308549, 308841, 309589, 310564, 311180, 311077, 310543, 310246, 310623, 311581, 312615, 313075, 312539, 311209, 310008]
61477C10008O6J929L439L908L355K446J921J905J816J120R4m65k71L5k74j077
61461C29955j607j432q58l89j91j62k37l62l86k10J14N37J073J551J560J018N20
61444C30494O60J135J132O37O21J643K888L195K557J962J868J691Q78j69n29J60
61428C50823J418K359K345J440M70L08R08J262N44q90j927j896r94K76J553K497
61412C60496K734K207J351N66j78r89j508j258m84j58q17j816k091j490r00j093
61396C54572j859k362k095j270m88k13m76r34j166r78l48O73J793K352J839P20
61380C49760K48J133K649L437K994K032J487J652K141K369K012J312R44J296J912
61365C77378J964J305O28M78O32O67P11J132J751J950J525J025J036J550K241
$$ y = [310008, 310074, 312003, 315442, 319350, 322705, 325151, 327072, 328977, 330793, 331913, 332007, 331542, 331271, 331306, 331032, 329955, 328348, 326916, 326058, 325669, 325478, 325316, 325079, 324717, 324331, 324121, 324235, 324772, 325845, 327396, 328956, 329974, 330494, 331154, 332289, 333421, 334058, 334679, 336322, 339210, 342405, 344962, 346924, 348792, 350483, 351361, 351192, 350663, 350823, 352241, 354600, 356945, 358385, 358855, 359163, 360071, 361333, 361877, 360987, 359060, 357164, 356170, 356446, 357999, 360496, 363230, 365437, 366788, 367354, 367176, 366187, 364679, 363421, 362937, 362779, 361962, 360146, 358055, 356565, 355665, 354572, 352713, 350351, 348256, 346986, 346498, 346285, 345809, 344875, 343709, 342731, 342383, 343056, 344849, 347201, 349040, 349760, 350008, 351141, 353790, 357227, 360221, 362253, 363740, 365392, 367533, 369902, 371914, 373226, 374170, 375466, 377378, 379342, 380647, 381275, 381753, 382385, 383052, 383763, 384895, 386646, 388596, 390121, 391146, 392182, 393732, 395973]
61350C95973L005L853M495M547M196M107M458M535L723K539K008K237K325J849
61336D43850J590K349L647M260L774K949K659L024L561L740L284K329J397R50
61322D83363R14Q79P01N97P03R35J315K025L031L891M130L788L494M055N783Q085
61306E27689R971J1069J1822J2531J2710J2031J1220J1137J1204R860O700L085
61294F51029M14j288k669l981n285o877q731j0135j0605j0611j0733j0656r828
61281E60044q639p949p784p472o858o400o153n568m447l176j890k74J535K755
61267D97724L042L032L358L745L660L179K722K400K248K692M022N653O562O441
61253E50480N818N168M497L811L328L036K592J927J551J886K632L096K939K267
$$ y = [395973, 398978, 402831, 407326, 411873, 416069, 420176, 424634, 429169, 432892, 435431, 437439, 439676, 442001, 443850, 445440, 447789, 451436, 455696, 459470, 462419, 465078, 468102, 471663, 475403, 478687, 481016, 482413, 483363, 484277, 485156, 485857, 486454, 487157, 488092, 489407, 491432, 494463, 498354, 502484, 506272, 509766, 513821, 519604, 527689, 537660, 548729, 560551, 573082, 585792, 597823, 609043, 620180, 631384, 641244, 647944, 651029, 651443, 650155, 647486, 643505, 638220, 631343, 622612, 612477, 601872, 591261, 580528, 569872, 560044, 551405, 543456, 535672, 528200, 521342, 514942, 508789, 503221, 498774, 495598, 493708, 493434, 494969, 497724, 500766, 503798, 507156, 510901, 514561, 517740, 520462, 522862, 525110, 527802, 531824, 537477, 544039, 550480, 556298, 561466, 565963, 569774, 573102, 576138, 578730, 580657, 582208, 584094, 586726, 589822, 592761, 595028]
61239E95028J187k20j548k137j780j078q60j372k131k417j733p0J979L521M160
61224E90529M450N215O432P226P100O572O366O460O424O309O551P087P311O977
61210F81009O572O463O202N135L455K138J820K163K375K133J794J852K454L430
61196G28995M578N759O821P704Q583R623J0550J0664R541P485N141K871P55j013
61182H18057k121k602k924l541m476n407n972o044n858n866o235o635o725o724
61168G46927p146p945q432q086p153o293n948o156o684p153p343p509q128r138
61154F43813r774r420q265o924n735m729l957l398k825k195j894k196k739l135
61140E76627l785n288p120p906p212o160n750n384l885j456M30R61Q48J200K275
$$ y = [595028, 596215, 595995, 594447, 592310, 590530, 589452, 588592, 587220, 585089, 582672, 580939, 580869, 582848, 586369, 590529, 594979, 600194, 606626, 613852, 620952, 627524, 633890, 640350, 646774, 653083, 659634, 666721, 674032, 681009, 687581, 694044, 700246, 705381, 708836, 710974, 712794, 714957, 717332, 719465, 721259, 723111, 725565, 728995, 733573, 739332, 746153, 753857, 762440, 772063, 782613, 793277, 802818, 810303, 815444, 818315, 819070, 818057, 815936, 813334, 810410, 806869, 802393, 796986, 791014, 784970, 779112, 773246, 767011, 760376, 753651, 746927, 739781, 731836, 723404, 715318, 708165, 701872, 695924, 689768, 683084, 675931, 668588, 661079, 652951, 643813, 634039, 624619, 616354, 609430, 603695, 598966, 595009, 591611, 588786, 586591, 584697, 582501, 579762, 576627, 572842, 567554, 560434, 552528, 545316, 539156, 533406, 528022, 524137, 522681, 523111, 524072, 524920, 526120, 528395]
61125E28395L714N246O685P678Q124Q664J0152J2626J5197J7024J8042J8708J9388
61112F79643K0162K0953K1595K1921K1954K1959K2089K2096K1522K0233J8569
61101I12696J6900J5175J3027J0311P289M268J214k024n220p874r832j1434j2938
61088I31558j4187j5131j6259j7907j9442j9874j9270j8818j9218j9736j9237
61077G32479j7621j5709j4099j2756j1487j0210q857p504o526o144n890m987l374
61064F07315j849j110r82p75m9J087K223L046L698M739O510Q503R752R906R611
61049F61625R727J0523J1798J3357J4997J6360J7243J7948J8978K0461K2121K3761
61037H58899K5473K7351K9373L1564L4044L6731L9258M1395M3388M5603M7930
$$ y = [528395, 532109, 537355, 544040, 551718, 559842, 568506, 578658, 591284, 606481, 623505, 641547, 660255, 679643, 699805, 720758, 742353, 764274, 786228, 808187, 830276, 852372, 873894, 894127, 912696, 929596, 944771, 957798, 968109, 975398, 979666, 980880, 978856, 973636, 965762, 955930, 944496, 931558, 917371, 902240, 885981, 868074, 848632, 828758, 809488, 790670, 771452, 751716, 732479, 714858, 699149, 685050, 672294, 660807, 650597, 641740, 634236, 627710, 621566, 615676, 610689, 607315, 605466, 604356, 603374, 602599, 602550, 603637, 605860, 608906, 612604, 617343, 623853, 632356, 642108, 652014, 661625, 671352, 681875, 693673, 707030, 722027, 738387, 755630, 773578, 792556, 813017, 835138, 858899, 884372, 911723, 941096, 972660, 1006704, 1043435, 1082693, 1124088, 1167476, 1213079, 1261009]
61026A261009M9882N1292N2575N4132N5955N8083O1129O5772P1922P9037Q7179
61015A947967R7100J09139J22877J38310J56799J80479K11292K51005L01398L63850
61005C880216M39373N29775O38052P66910R17817J092132J289984J502790J704775
60996A2761824J854820J910729J844986J652421J352358R90181O32402L46229
60988B3345950J70376R8729Q9182Q6416L9292r1000l22375o40673r98433j332975
60978B0444489j593194j754621j815536j785687j680762j522429j336211j145388
60970G810661r66086q06960o71244n58441m65837l90313l29233k80202k41006
60961C101339k10068j86133j67222j50889j35907j22696j11475j01056r0266p9664
$$ y = [1261009, 1310891, 1362183, 1414758, 1468890, 1524845, 1582928, 1644057, 1709829, 1781751, 1860788, 1947967, 2045067, 2154206, 2277083, 2415393, 2572192, 2752671, 2963963, 3214968, 3516366, 3880216, 4319589, 4849364, 5487416, 6254326, 7172143, 8264275, 9554259, 11057049, 12761824, 14616644, 16527373, 18372359, 20024780, 21377138, 22367319, 22999721, 23345950, 23516326, 23615055, 23704237, 23790653, 23829945, 23738945, 23416570, 22775897, 21777464, 20444489, 18851295, 17096674, 15281138, 13495451, 11814689, 10292260, 8956049, 7810661, 6844575, 6037615, 5366371, 4807930, 4342093, 3951780, 3622547, 3342345, 3101339, 2891271, 2705138, 2537916, 2387027, 2251120, 2128424, 2016949, 1915893, 1825627, 1745963]
60951A745963p0722o3926n8662n4505n1438m9076m6743m4352m2318m0661l8918
60940A184642l6881l4733l2540l0356k8641k7787k7334k6550k5629k5324k5432
60929H63435k4762k2937k1147k0539k0660k0178j8552j6363j4432j3178j2582
60918F58105j2274j1770j0873r801q805p890o990o024m766l104j543q77j186j562
60904E70640j161j00R39J586J888J950J840J619J218N13k50m77N4Q12J132R17
60888E83120M21l57j635l341n009o157o621o646o732p180p702p698p016o194n777
60873E05476n776n898n966n922n673n218m684m087l338k559k044j695r99J96J264
60858D53077J505R82L04o2m9J92L43J31k32p1R25K142K634K036P07o92j476j253
$$ y = [1745963, 1675241, 1611315, 1552653, 1498148, 1446710, 1397634, 1350891, 1306539, 1264221, 1223560, 1184642, 1147761, 1113028, 1080488, 1050132, 1021491, 993704, 966370, 939820, 914191, 888867, 863435, 838673, 815736, 794589, 774050, 753390, 733212, 714660, 698297, 683865, 670687, 658105, 645831, 634061, 623188, 613387, 604582, 596692, 589702, 583678, 578912, 575808, 574265, 573388, 572202, 570640, 569479, 569379, 570318, 571904, 573792, 575742, 577582, 579201, 580419, 580932, 580682, 580205, 580259, 581071, 582203, 583120, 583541, 583184, 581549, 578208, 573199, 567042, 560421, 553775, 547043, 539863, 532161, 524463, 517447, 511253, 505476, 499700, 493802, 487836, 481914, 476241, 471023, 466339, 462252, 458914, 456355, 454311, 452616, 451617, 451813, 453077, 454582, 455564, 455868, 455806, 455757, 455949, 456292, 456423, 456191, 456120, 457045, 459187, 461821, 463857, 464564, 463872, 462396, 461143]
60840D61143l97J01l53j356k247k982l766m274m000l186k647k681k754k375j741
60825D26485j305j124q66k87M20P64N63L05N57R96O08q38k175k267j510j102j333
60808D17891j504j361j522k337l172l229k503j675j440k078l248m119m148l704
60794C81851l527l615l312k492j910k162k900l412l416l012k362j768j574j704
60780C44685j584q93k4M56M61K79J35J69M85J030J560J936K232K536K907L526
60764C59896M360M771M072K641J752K041K777K991K648K205J725J037L22j78o34
60749C92426j198j446r60j42K20K5j70o1J19J09k36j184k793m377n035m808m623
60732C65866m984n343n006m087l211k732k552k415k100j570j108j034j182j031
$$ y = [461143, 460746, 460847, 460494, 459138, 456891, 453909, 450143, 445869, 441869, 438683, 436036, 433355, 430601, 428226, 426485, 425180, 424056, 423190, 422903, 423323, 424087, 424650, 424955, 425512, 426508, 427116, 426278, 424103, 421836, 420326, 419224, 417891, 416387, 415026, 413504, 411167, 407995, 404766, 402263, 400588, 399148, 397070, 393822, 389703, 385555, 381851, 378324, 374709, 371397, 368905, 366995, 364833, 361933, 358521, 355105, 352093, 349731, 347963, 346389, 344685, 343101, 342208, 342184, 342640, 343101, 343380, 343515, 343684, 344169, 345199, 346759, 348695, 350927, 353463, 356370, 359896, 364256, 369027, 373099, 375740, 377492, 379533, 382310, 385301, 387949, 390154, 391879, 392916, 393238, 393060, 392426, 391228, 389782, 388822, 388680, 388900, 388925, 388755, 388694, 388813, 388922, 388686, 387502, 384709, 380332, 375297, 370489, 365866, 360882, 355539, 350533, 346446, 343235, 340503, 337951, 335536, 333436, 331866, 330758, 329724, 328542, 327511]
60718C27511m41N4o9o98j305j556j452j160r25r60j158j108n65K37Q83J234J398
60701C19920J460J435J370J286J117Q06M05M2o0M52J747L340M226L818K557J413
60685C45334R61J179J865K815L647L916L565L062K901L120L385L397L124K672
60671C84943K080J371P50N29O92O10m24k315m113m990n084n091n230m994l919
60656C54815k272q52j97j61j81R1M94O52N61O38J177J911K270J967J156J87o16
60639C61640j032j105j237j844k843l682l874l448k767k114j470o95J63P51O98
60624C37141J13l70k61K15M63L01O8j7j45m29n23p7O53R93O33l4m01k84L0K87
60604C38356N64J005J370J203N58J75O62J664K277K148J711J400J162Q79O88O45
$$ y = [327511, 327070, 327124, 327055, 326357, 325052, 323496, 322044, 320884, 319959, 318999, 317841, 316733, 316168, 316405, 317288, 318522, 319920, 321380, 322815, 324185, 325471, 326588, 327394, 327799, 327841, 327781, 328233, 329980, 333320, 337546, 341364, 343921, 345334, 346295, 347474, 349339, 352154, 355801, 359717, 363282, 366344, 369245, 372365, 375750, 379147, 382271, 384943, 387023, 388394, 389144, 389673, 390365, 390975, 390551, 388236, 384123, 379133, 374049, 368958, 363728, 358734, 354815, 352543, 351691, 351494, 351333, 351152, 351243, 351737, 352389, 352950, 353588, 354765, 356676, 358946, 360913, 362069, 362256, 361640, 360608, 359503, 358266, 356422, 353579, 349897, 346023, 342575, 339808, 337694, 336224, 335529, 335692, 336443, 337141, 337254, 336884, 336623, 336838, 337301, 337602, 337670, 337653, 337508, 337079, 336556, 336479, 337132, 338125, 338758, 338724, 338323, 338039, 338069, 338356, 338920, 339925, 341295, 342498, 343056, 343231, 343893, 345557, 347834, 349982, 351693, 353093, 354255, 355134, 355822, 356467]
60588C56467M96J16j67o2K12L09L49O86J288J721J690J296Q30O10Q60J521K269
60571C70491K929L676M722O000P361Q724R800J0095R573Q802Q080O935N087L281
60557D65556K288J551Nk124l489l629l487l690l595k582j175p4R92K622M636O412
60541D60217P817R046J0013J0701J1661J3336J5175J6231J6426J6480J6641J6148
60529F19892J4003R927M646m27m048o057p266q204q549q136p713p988q523q488
60515E73069p938p299o155l891j260J47P9q3O46J884L257N227P924J0463J2412
60500E88482J4833J8710K3255K6942K9617L2299L5262L7604L8698L8855L8336
60489I22893L6714L3629K9496K5002K0356J5330R662L195m049j1614j8758k5063
$$ y = [356467, 356963, 357079, 356912, 356850, 357062, 357371, 357720, 358406, 359694, 361415, 363105, 364401, 365231, 365841, 366701, 368222, 370491, 373420, 377096, 381818, 387818, 395179, 403903, 413703, 423798, 433371, 442173, 450253, 457188, 462275, 465556, 467844, 469395, 469400, 467276, 463787, 460158, 456671, 452981, 449386, 446804, 445629, 445555, 446547, 449169, 453805, 460217, 468034, 477080, 487093, 497794, 509455, 522791, 537966, 554197, 570623, 587103, 603744, 619892, 633895, 643822, 648468, 648041, 643993, 637936, 630670, 622466, 613917, 605781, 598068, 590080, 581557, 573069, 565131, 557832, 551677, 547786, 546526, 546673, 546752, 546669, 547315, 549199, 552456, 557683, 565607, 576070, 588482, 603315, 622025, 645280, 672222, 701839, 734138, 769400, 807004, 845702, 884557, 922893, 959607, 993236, 1022732, 1047734, 1068090, 1083420, 1093082, 1096277, 1092228, 1080614, 1061856, 1036793]
60477A036793l0622l5453l9099m1151m1928m2088m1669m0050l7039l3455l0317
60466F23922k7691k4954k1964j9378j7620j6162j4242j1878r743q272p387o905
60454D37726o648o252n397m254l317k771k417k194k263k508k467j927j249r11
60440C93151j080j644k316k636k290j586j229j487j918j939j364l81N60Q40K47
60425C74928n27n41J39M62j79j190j685j442o89L35J213J438J138J100J633K083
60409C78216J949J715J875J904J163K12J71J050J770J742J453J476J735J923J961
60394D00315J943K075K684L747M517M212L121K355K471K977L195L077K935K917
60380D42541L039L306L592L718L724L822L968L865L408K916K772L094L661M020
$$ y = [1036793, 1006171, 970718, 931619, 890468, 848540, 806452, 764783, 724733, 687694, 654239, 623922, 596231, 571277, 549313, 529935, 512315, 496153, 481911, 470033, 460290, 452018, 444631, 437726, 431078, 424826, 419429, 415175, 411858, 409087, 406670, 404476, 402213, 399705, 397238, 395311, 394062, 393151, 392071, 390427, 388111, 385475, 383185, 381599, 380370, 378883, 376965, 375026, 373662, 373281, 373841, 374681, 374928, 374401, 373860, 373999, 374461, 374282, 373092, 371407, 369965, 369276, 369611, 370824, 372262, 373400, 374500, 376133, 378216, 380165, 381880, 383755, 385659, 386822, 387034, 387205, 388255, 390025, 391767, 393220, 394696, 396431, 398354, 400315, 402258, 404333, 407017, 410764, 415281, 419493, 422614, 424969, 427440, 430417, 433612, 436689, 439624, 442541, 445580, 448886, 452478, 456196, 459920, 463742, 467710, 471575, 474983, 477899, 480671, 483765, 487426, 491446]
60366D91446L776L018K311J966J628Q93R4l1P40J930K984L593L719L769M519O162
60350E32517P720Q127P756P976R116R844Q857O450L969K250J099o0j484k939m080
60335E97118m901n700o435o530n739m825m701n215n539n531n811o477o872o708
60321E16134o472o390n939m893l895l457l105k192q90L00J500L149N131O931Q488
60306E04400J0290J2620J5132J7118J7994J7614J6305J4398J1754Q014L329j608
60294F47360o260j0473j3952j6244j7421j8076j8315j7508j5374j2677j0293q296
60282D82471o464m973l915k779j234P2L24k64q72j296j850k300j993j066n81j109
60266D52171j911j896j023l17p44k208l702m301m030l580l303k979k529k336k432
$$ y = [491446, 495222, 498240, 500551, 502517, 504145, 505038, 505132, 505101, 505841, 507771, 510755, 514348, 518067, 521836, 526355, 532517, 540237, 548364, 556120, 564096, 573212, 583056, 591913, 598363, 602332, 604582, 605681, 605621, 604137, 601198, 597118, 592217, 586517, 580082, 573552, 567813, 562988, 558287, 553072, 547533, 542002, 536191, 529714, 522842, 516134, 509662, 503272, 497333, 492440, 488545, 485088, 481983, 479791, 478901, 479201, 480701, 483850, 488981, 495912, 504400, 514690, 527310, 542442, 559560, 577554, 595168, 611473, 625871, 637625, 645639, 648968, 647360, 641100, 630627, 616675, 600431, 583010, 564934, 546619, 529111, 513737, 501060, 490767, 482471, 476007, 471034, 467119, 464340, 463106, 463178, 463502, 463238, 462366, 461070, 459220, 456920, 454927, 453861, 453280, 452171, 450260, 448364, 447341, 447024, 446280, 444072, 440370, 436069, 432039, 428459, 425156, 422177, 419648, 417312, 414880]
60251D14880k105q81N90J321J270J132J185J132Q83O95N58K47r2J3O20J286J720
60234D24454J940J857J344P69P39J220J533J397J345J852K576K841K503J964J634
60219D49968J611J793K118K715L762N017N792N690N206N120N468N663N573N745
60205E11241O484P268P376O646N504M580M464N325O629P550P787P575O970N766
60191F01165M239L246L150L184K412R28l92j059j334j616j989k346k591k662k670
60176F01665k933l645m473m793m394l757l560m012m745n209n099m499l783l336
60162E43427l230l099k574j871j673k166k522j829l40P83R89Q44R06R20N63J92
60146E29320K25L57K07J65O83J204Q67J17L78K055L906M724M679M545M571M699
$$ y = [414880, 412775, 411894, 412484, 413805, 415075, 416207, 417392, 418524, 419407, 420102, 420660, 420907, 420815, 420828, 421448, 422734, 424454, 426394, 428251, 429595, 430364, 431103, 432323, 433856, 435253, 436598, 438450, 441026, 443867, 446370, 448334, 449968, 451579, 453372, 455490, 458205, 461967, 466984, 472776, 478466, 483672, 488792, 494260, 499923, 505496, 511241, 517725, 524993, 532369, 539015, 544519, 549099, 553563, 558888, 565517, 573067, 580854, 588429, 595399, 601165, 605404, 608650, 611800, 614984, 617396, 618324, 617932, 616873, 615539, 613923, 611934, 609588, 606997, 604335, 601665, 598732, 595087, 590614, 585821, 581427, 577670, 574110, 570098, 565353, 560144, 555045, 550546, 546763, 543427, 540197, 537098, 534524, 532653, 530980, 528814, 526292, 524463, 524123, 524906, 525895, 526739, 527645, 528565, 529128, 529320, 529545, 529902, 530109, 530274, 530957, 532161, 533028, 533145, 533523, 535578, 539484, 544208, 548887, 553432, 558003, 562702]
60130E62702N076N626N651M661L293K680L026L402L014K095J449J426J679J765
60116F07545J742K005K668L433M049M548M839M519L595K873L036L575L469K668
60102F54564J989J653R45l96j487j589j207j244j681j831j460r32n45l48m22p95
60086F45214j160j208j120j363k029k732l063k957k620k344k246k174j980j916
60072F16302k402l337m115m478m877n719o749p514p986q323q423q121p539o858
60058E29861o119n572n651o230o339n292l713k811k917l328l332k795j856p24
60044D73182K75R69J614K511L487M138M399M457M382M275M490N128N547N054L840
60029E27748K624J575M07o52r32m88l22j149k559l705m188m069l592l251l555
$$ y = [562702, 567778, 573404, 579055, 583716, 587009, 589689, 592715, 596117, 599131, 601226, 602675, 604101, 605780, 607545, 609287, 611292, 613960, 617393, 621442, 625990, 630829, 635348, 638943, 641816, 644852, 648427, 651896, 654564, 656553, 658206, 659151, 658755, 657268, 655679, 654472, 653228, 651547, 649716, 648256, 647324, 646779, 646431, 646009, 645214, 644054, 642846, 641726, 640363, 638334, 635602, 632539, 629582, 626962, 624618, 622372, 620198, 618218, 616302, 613900, 610563, 606448, 601970, 597093, 591374, 584625, 577111, 569125, 560802, 552379, 544258, 536719, 529861, 523742, 518170, 512519, 506289, 499950, 494658, 490945, 488134, 485217, 481889, 478557, 475762, 473906, 473182, 473457, 474426, 476040, 478551, 482038, 486176, 490575, 495032, 499414, 503689, 508179, 513307, 518854, 523908, 527748, 530372, 531947, 532354, 531702, 530770, 530282, 529960, 528811, 526252, 522547, 518359, 514290, 510698, 507447, 503892]
60014E03892m402n100n317n479n982o493o490o019n491n085m762m520m267l688
60000D30797k736j889j488j142l42N45P05K10J27J025K082K179J459J121J861
59985D34514L127L990M245M341M653N109N399N196M302K898J554P20K06m80j369
59970D78405j996k132k120k298k536k617k603k516k002p97O96J756K142K145J992
59955D65519J651J205R87J175J519J554R59j97j358j764j135j6P60R09P38N23
59939D73029K14k47o96q54n91o2K86O1n16o66L2J053J678K020K734L869M792N232
59921D91368N712O667P776Q476Q651Q450P845O867N942N514N441N155M442L658
59907E81964L156K783K261J799J912K516K635J500k50j158p97l41r40k195k856
$$ y = [503892, 499490, 494390, 489073, 483594, 477612, 471119, 464629, 458610, 453119, 448034, 443272, 438752, 434485, 430797, 428061, 426172, 424684, 423542, 423200, 423745, 424450, 424660, 424787, 425812, 427894, 430073, 431532, 432653, 434514, 437641, 441631, 445876, 450217, 454870, 459979, 465378, 470574, 474876, 477774, 479328, 480048, 480254, 479774, 478405, 476409, 474277, 472157, 469859, 467323, 464706, 462103, 459587, 457585, 456788, 457484, 459240, 461382, 463527, 465519, 467170, 468375, 469362, 470537, 472056, 473610, 474569, 474372, 473014, 471250, 470115, 470099, 470859, 471768, 472506, 473029, 473243, 472996, 472300, 471446, 470855, 470793, 471079, 471140, 470624, 469958, 469990, 471043, 472721, 474741, 477475, 481344, 486136, 491368, 497080, 503747, 511523, 519999, 528650, 537100, 544945, 551812, 557754, 563268, 568709, 573864, 578306, 581964, 585120, 587903, 590164, 591963, 593875, 596391, 599026, 600526, 600276, 599118, 598321, 597980, 597040, 594845, 591989]
59892E91989k509j792j276r74q35q67p47m2J087K086K839L624M251M182L669L744
59876F08429M733N650N620N053M809M858M536L565K112K34j943l814m737m756
59862F34349m343l677k816k205k317k822k843k083j088l50K85J249K694M420N928
59847F24381O609O235N305M500L785K555P15j005j969k376k719k978k836k483
59833F37719k586l459m691n751o618p537q337q464p711o553n534m628l576k552
59819E59722k026k007k009j801j678j801j839j552j241j206j139o06J70N41K49
59804E41777m31j187j855k196k047j632j373j340j348j452j881k482k719k414
59790E17420j987j841j876j899k061k585l210l341k708j656p57k61r1j68n44j108
$$ y = [591989, 589480, 587688, 586412, 585438, 584603, 583736, 582989, 582947, 584034, 586120, 588959, 592583, 596834, 601016, 604685, 608429, 613162, 618812, 624432, 629485, 634294, 639152, 643688, 647253, 649365, 649599, 647656, 643842, 639105, 634349, 630006, 626329, 623513, 621308, 618991, 616169, 613326, 611243, 610155, 609805, 610090, 611339, 614033, 618453, 624381, 630990, 637225, 642530, 647030, 650815, 653370, 654085, 653080, 651111, 648735, 646016, 643038, 640202, 637719, 635133, 631674, 626983, 621232, 614614, 607077, 598740, 590276, 582565, 576012, 570478, 565850, 562274, 559722, 557696, 555689, 553680, 551879, 550201, 548400, 546561, 545009, 543768, 542562, 541423, 540817, 540987, 541528, 541777, 541346, 540159, 538304, 536108, 534061, 532429, 531056, 529716, 528368, 526916, 525035, 522553, 519834, 517420, 515433, 513592, 511716, 509817, 507756, 505171, 501961, 498620, 495912, 494256, 493499, 493238, 493147, 492979, 492435, 491327]
59774D91327j374r17M8P97Q94N69K90L86J183K917N141O614O481N278M354M446
59758E28434N297O367P268P644P396P013P101P531P739P797Q408R685J0755J0954
59744F39389J0600J0175R416P915O047M544L455K307J072K21j90p41j771k824
59730F89615l262l073k764k755l098l673m284m623m386l650l015l163m130n138
59716F38601n277m387l124k250j997k063j937j233l0J064J473J322J285J697K222
59701F25366K587L079L975M883N245N243N570O347O921O792O275N919N676N022
59687F98900L761K360J474J273J328J127O02P9k41n18j010j747k638l673m764
59672F96313n585n858n711n486n342n281n394n701n814n242m037k726j617n89
$$ y = [491327, 489953, 489036, 489084, 489881, 490775, 491344, 491634, 492020, 493203, 496120, 501261, 507875, 514356, 519634, 523988, 528434, 533731, 540098, 547366, 555010, 562406, 569419, 576520, 584051, 591790, 599587, 607995, 617680, 628435, 639389, 649989, 660164, 669580, 677495, 683542, 688086, 691541, 693848, 694920, 695141, 694951, 694210, 692439, 689615, 686353, 683280, 680516, 677761, 674663, 670990, 666706, 662083, 657697, 654047, 651032, 647869, 643739, 638601, 633324, 628937, 625813, 623563, 621566, 619503, 617566, 616333, 616303, 617367, 618840, 620162, 621447, 623144, 625366, 627953, 631032, 635007, 639890, 645135, 650378, 655948, 662295, 669216, 676008, 682283, 688202, 693878, 698900, 702661, 705021, 706495, 707768, 709096, 710223, 710825, 710904, 710663, 710145, 709135, 707388, 704750, 701077, 696313, 690728, 684870, 679159, 673673, 668331, 663050, 657656, 651955, 646141, 640899, 636862, 634136, 632519, 631930]
59658F31930L78J018J382K032L301M723N669O196O753P277P157O103M574L224
59644F91717K237J335J88j286k942m614o321q105r618j0132r332p896o911o756
59630F21564o949o981o852o654o207n377m459l903l795l846l746l439l193l520
59616E52643m744o510p915q318p810o813n582m331l449l100k837k130j175o61
59602D87268p81r72p66l45p8J05M36P73P18K63m9K29Q56J169R17O44J059K049
59584D93495K650K060M71j295k673l567l927l683l115k797k924l078k850k383
59570D66384k083k043k051j979j897j866j827j717j553j383j206q95l42L06O14
59555D46462L08l32p50o89k62M83J545K600L136L137L164L590M243M968N930P083
$$ y = [631930, 632308, 633326, 634708, 636740, 640041, 644764, 650433, 656629, 663382, 670659, 677816, 683919, 688493, 691717, 693954, 695289, 695477, 694191, 691249, 686635, 680314, 672209, 662591, 652459, 643127, 635231, 628320, 621564, 614615, 607634, 600782, 594128, 587921, 582544, 578085, 574182, 570387, 566541, 562795, 559356, 556163, 552643, 547899, 541389, 533474, 525156, 517346, 510533, 504951, 500620, 497171, 494071, 491234, 489104, 487929, 487268, 486487, 485515, 484749, 484404, 484326, 484431, 484867, 485640, 486358, 486621, 486572, 486801, 487657, 488826, 489743, 490387, 491446, 493495, 496145, 498205, 498676, 497381, 494708, 491141, 487214, 483531, 480416, 477619, 474695, 471617, 468767, 466384, 464301, 462258, 460207, 458228, 456331, 454465, 452638, 450921, 449368, 447985, 446779, 445884, 445542, 445848, 446462, 446770, 446438, 445688, 444999, 444737, 445220, 446765, 449365, 452501, 455638, 458802, 462392, 466635, 471603, 477533, 484616]
59539D84616P938Q435R404J1498J4039J5714J6010J5166J3012R094M009m98l338
59526F05099n084o631p622p112n264l376k209j222K27J730K380K051J378N83r05
59511E74023l285n549o479o198n956o405o928o888o654o751o701n699m027k865
59497D93638k748l096l308l405l401k902j824q52o09p67m86N15J768K694L078
59482D78295L089L108L429L908M132L998L827L820L773L529L219K888K314J566
59468E24895J198J474J839J584P21k27r13j187q78j57L78N11R12K042L142L240
59452E38574K858L441N208O819P410P603P999P912O531M423K802J818O23j194
59438F02827l187m928o332p167p112o437n914n732n214l904k425j754k007k367
$$ y = [484616, 492554, 500989, 510393, 521891, 535930, 551644, 567654, 582820, 595832, 604926, 608935, 608437, 605099, 600015, 593384, 585762, 578650, 573386, 570010, 567801, 566579, 566806, 568536, 570916, 572967, 574345, 574928, 574023, 570738, 565189, 558710, 552512, 546556, 540151, 533223, 526335, 519681, 512930, 506229, 500530, 496503, 493638, 490890, 487794, 484486, 481081, 477680, 474778, 472954, 472102, 471493, 470726, 470240, 470755, 472523, 475217, 478295, 481384, 484492, 487921, 491829, 495961, 499959, 503786, 507606, 511379, 514908, 518127, 521015, 523329, 524895, 526093, 527567, 529406, 530990, 531711, 531484, 530571, 529384, 528506, 528349, 528727, 529238, 530150, 532192, 535334, 538574, 541432, 544873, 550081, 556900, 564310, 571913, 579912, 587824, 594355, 598778, 601580, 603398, 604021, 602827, 599640, 594712, 588380, 581213, 574101, 567664, 561750, 556018, 550804, 546900, 544475, 542721, 540714, 538347]
59424E38347k025p86J077L150N014O452P633Q991J0777J2818J4826J6791J8918
59411F41983K1143K2907K3493K2462J9629J4942Q787K377k748n905p613q483q184
59398G44790o008k244J622M087M520K867q03o022j1574j5974j8399j8960j8282
59385F59620j6922j5135j2865j0079p152m800l370k385j111M87J720K125K089
59372E92222K308K961L712M340M962N621O017N831N180M526M171M049L928L733
59358F53561L566L576L867M474N251N865O028N817N716O248P529R166J0564J1378
59344G42606J1763J2165J2923J3976J4952J5396J5017J3859J2348J0980R789Q269
59332H94043N979L189O49j176k410l431m564o080q019r888j0975j1169j1075j1123
$$ y = [538347, 536322, 535536, 536613, 539763, 544777, 551229, 558862, 567853, 578630, 591448, 606274, 623065, 641983, 663126, 686033, 709526, 731988, 751617, 766559, 775346, 777723, 774975, 769070, 761457, 752974, 744790, 738782, 736538, 738160, 742247, 746767, 749634, 748831, 742809, 731235, 715261, 696862, 677902, 659620, 642698, 627563, 614698, 604619, 597467, 592667, 589297, 586912, 585801, 586288, 588008, 590133, 592222, 594530, 597491, 601203, 605543, 610505, 616126, 622143, 627974, 633154, 637680, 641851, 645900, 649828, 653561, 657127, 660703, 664570, 669044, 674295, 680160, 686188, 692005, 697721, 703969, 711498, 720664, 731228, 742606, 754369, 766534, 779457, 793433, 808385, 823781, 838798, 852657, 865005, 875985, 885774, 894043, 900022, 903211, 903860, 902684, 900274, 896843, 892279, 886199, 878180, 868292, 857317, 846148, 835073, 823950]
59318H23950j1003j0354r549r214r238q974q277p679p440p131o396n511m850m241
59304G14093l290k003o57P74K587M825O998Q318Q114O172K907r94n132r430j3466
59289G19816j6334j7492j7391j6754j5573j3447j0698q353o991o217n391m244
59277E80931k632l98K161M262N541O562P960R485J0482J0939J1425J2141J2679
59264F71538J2702J2246J1320R786P750N576L374R85j440l365m642n792p135q193
59250G04710q407q072p918q010p745o823n622m511l412k189j038k13L00O56R40
59235F42646J241J650K064K278K347K576K986L171K860K273J733J208N32k16q89
59220F68460j503k123k727l469m597n811o196n366m270m106m757n094m640m046
$$ y = [823950, 812947, 802593, 793044, 783830, 774592, 765618, 757341, 749662, 742222, 735091, 728695, 723184, 718334, 714093, 710803, 708800, 708143, 708917, 711504, 716329, 723327, 731645, 739759, 745931, 748838, 747844, 742712, 733282, 719816, 703482, 685990, 668599, 651845, 636272, 622825, 612127, 603774, 596783, 590566, 585175, 580931, 578299, 577901, 580062, 584324, 589865, 596427, 604387, 613872, 624354, 635293, 646718, 658859, 671538, 684240, 696486, 707806, 717592, 725342, 730918, 734292, 735277, 733837, 730472, 725830, 720038, 712903, 704710, 696303, 688231, 680313, 672303, 664558, 657735, 652113, 647602, 644190, 642001, 640963, 640750, 641050, 641706, 642646, 643887, 645537, 647601, 649879, 652226, 654802, 657788, 660959, 663819, 666092, 667825, 669033, 669565, 669349, 668460, 666957, 664834, 662107, 658638, 654041, 648230, 642034, 636668, 632398, 628292, 623535, 618441, 613801, 609755]
59206F09755l909m010l993l864l484k438q60K70K76k97n46m72o81j192j362q14
59190E82379J55J114J867K365K699L181M004M901N486N788O015O068N754N322
59176F37098N192N285N190M908M749M587L975L092K734L161L684L765L710L899
59162F95029L961L427K600K076J841J482R32L39n90k221m151n476o031o554p526
59147F79138q510q975r126r433r840r890r440q777q196p828p680p533o931n717
59133E61262m506m125m561m887m407l418k548j732l44J694L527M283M112L987
59119E48337M643N916P121P790P972Q008Q186Q526Q747Q476P593O392N297M466
59105F47470L736K986K318J805J247L37q83j961k414k190j749j711k311l065l154
$$ y = [609755, 605846, 601836, 597843, 593979, 590495, 588057, 587197, 587467, 587743, 587446, 586900, 586428, 585747, 584555, 583193, 582379, 582534, 583648, 585515, 587880, 590579, 593760, 597764, 602665, 608151, 613939, 619954, 626022, 631776, 637098, 642290, 647575, 652765, 657673, 662422, 667009, 670984, 674076, 676810, 679971, 683655, 687420, 691130, 695029, 698990, 702417, 705017, 707093, 708934, 710416, 711348, 711687, 711097, 708876, 704725, 699249, 693218, 686664, 679138, 670628, 661653, 652527, 643094, 633254, 623364, 613924, 605147, 596951, 589123, 581443, 573910, 566979, 561262, 556756, 552631, 548070, 543183, 538776, 535358, 532810, 531078, 530734, 532428, 535955, 540238, 544350, 548337, 552980, 558896, 566017, 573807, 581779, 589787, 597973, 606499, 615246, 623722, 631315, 637707, 643004, 647470, 651206, 654192, 656510, 658315, 659562, 659899, 659016, 657055, 654641, 652451, 650702, 648991, 646680, 643615, 640461]
59090F40461k290j076l05q3K7J03l01j320k354k790k755k795l132l648m221m669
59074F08852m647m178l943m458n157n080m312l878m224m648m459l844l193k483
59060E50348j788j677k395l259l531l421l504l618l194k339j752j677j746j769
59046E14678j919k119j979j457r56o57k91K68O93P48P07J034J873K914L537L228
59030E20302K178J376J641K690L580L948M215M805N801P356R545J1719J2822J2638
59016F04616J2031J1629J0972R410P160M954L093J403k31j720k920l659l872l876
59002F48990m028l942k766n64J310J816J561J799K649L174K942K528K483K600
58988F60552K372J628N84l64q07o58l16j85j71K3L69P46J476K993N060O941Q432
$$ y = [640461, 638171, 637095, 636790, 636707, 636734, 636837, 636536, 635216, 632862, 630072, 627317, 624522, 621390, 617742, 613521, 608852, 604205, 600027, 596084, 591626, 586469, 581389, 577077, 573199, 568975, 564327, 559868, 556024, 552831, 550348, 548560, 546883, 544488, 541229, 537698, 534277, 530773, 527155, 523961, 521622, 519870, 518193, 516447, 514678, 512759, 510640, 508661, 507204, 506248, 505591, 505300, 505568, 506261, 507009, 507716, 508750, 510623, 513537, 517074, 520302, 522480, 523856, 525497, 528187, 531767, 535715, 539930, 544735, 550536, 557892, 567437, 579156, 591978, 604616, 616647, 628276, 639248, 648658, 655818, 660772, 663865, 665268, 665037, 663317, 660397, 656738, 652866, 648990, 644962, 641020, 638254, 637690, 639000, 640816, 642377, 644176, 646825, 649999, 652941, 655469, 657952, 660552, 662924, 664552, 665136, 664772, 663965, 663307, 662991, 662806, 662635, 662658, 663027, 663773, 665249, 668242, 673302, 680243, 688675]
58971F88675R962J1645J2879J3290J3385J3792J4300J4243J3592J2977J2660J2031
58959H43431J0418Q065N957M631L492J468j728n307q329j0604j2445j3928j4821
58946H10300j5091j4986j4551j3590j2295j1393j1248j1142j0028p930o039n234
58934F76773n026m334k991j855j525j515r91R2J039J326J095Q71J074J761K438
58919F68232K251P96j225k497k347j266k62m2p45j918k613j995k05J692K833L378
58903F64067M053N296P037Q956J0650J1779J2378J2788J3150J3263J3074J2901
58891G89392J2936J2979J2987J3512J5002J7019J8605J9249J9077J8289J6916
58880I65963J5138J3287J1541R800P912N836L577J214j079l070m546n383n761
$$ y = [688675, 698637, 710282, 723161, 736451, 749836, 763628, 777928, 792171, 805763, 818740, 831400, 843431, 853849, 861914, 867871, 872502, 875994, 877462, 875734, 870427, 862098, 851494, 839049, 825121, 810300, 795209, 780223, 765672, 752082, 739787, 728394, 717146, 706004, 695976, 688046, 682007, 676773, 671747, 667413, 664422, 662567, 661042, 659527, 658536, 658628, 659667, 660993, 662088, 662959, 664033, 665794, 668232, 670483, 671279, 670054, 667557, 665210, 663944, 663682, 663640, 662895, 660977, 658364, 656369, 656164, 657856, 660689, 664067, 668120, 673416, 680453, 689409, 700059, 711838, 724216, 737004, 750154, 763417, 776491, 789392, 802328, 815307, 828294, 841806, 856808, 873827, 892432, 911681, 930758, 949047, 965963, 981101, 994388, 1005929, 1015729, 1023641, 1029477, 1033054, 1034268, 1033189, 1030119, 1025573, 1020190, 1014429]
58867A014429o263p356q710r513r537r334r282r134q865r112j0122j0998j0809
58854H95394j0011r845j0630j1569j2049j2227j2314j2114j1441j0390r099p774
58842G65931o861o676o841o769o601p054q273r502j0046r925r499r005q589q277
58828F52013p746o655n251m106l251k168p47N16J406K366L640M702N015M805M608
58813F49147M507M301M036L888L774L513L169K841K374J613P54M3o63j663k841
58798F78793l781m361m819n240n389n224n202n683o256o122n213m398m292m279
58784F08534l313j414L76J503K505L863N156N866O254O700O802O038M781L743
58770F57394K736R74j542l930n633o779p376p244o816p005p923q585q194o974
$$ y = [1014429, 1008166, 1000810, 992100, 982587, 973050, 963716, 954434, 945300, 936435, 927323, 917201, 906203, 895394, 885383, 875538, 864908, 853339, 841290, 829063, 816749, 804635, 793194, 782804, 773705, 765931, 759070, 752394, 745553, 738784, 732183, 725129, 716856, 707354, 697308, 687383, 677884, 668879, 660290, 652013, 644267, 637612, 632361, 628255, 625004, 622836, 622089, 622605, 624011, 626377, 630017, 634719, 639734, 644539, 649147, 653654, 657955, 661991, 665879, 669653, 673166, 676335, 679176, 681550, 683163, 683917, 683960, 683297, 681634, 678793, 675012, 670651, 665832, 660592, 655203, 649979, 644777, 639094, 632838, 626716, 621503, 617105, 612813, 608534, 605221, 603807, 604183, 605686, 608191, 612054, 617210, 623076, 629330, 636030, 642832, 648870, 653651, 657394, 660130, 661104, 659562, 655632, 649999, 643220, 635844, 628600, 621784, 614779, 606856, 598271, 590077, 583103]
58756E83103n485l912k361j165m47k1P8l45q57n35O73J616J478R12J012J795K475
58739E78014K694K806L277M328N852P178P339O123M540L729L779M037M104L951
58725F41751L461K591J786J606K045K627K995L034K707K246K303L313M832N893
58711F83190O002N451M809M442M359M178L369J742m21k848n533q317j0672j2246
58697F77505j3295j4181j4768j4729j4182j3604j3262j3073j2800j2132j0863
58686E30616r284q062p421o833n837m768m189m062l955l750l537l158k392j480
58672D61888q53n15j40L88J034J914L106M284N127N858O837P730P737O609M911
58657E15915L211J571j35j791l172m156m696m797m588m280m051m023m209m383
$$ y = [583103, 577618, 573706, 571345, 570180, 569733, 569712, 569790, 569445, 568588, 568053, 568726, 570342, 571820, 572732, 573744, 575539, 578014, 580708, 583514, 586791, 591119, 596971, 604149, 611488, 617611, 622151, 625880, 629659, 633696, 637800, 641751, 645212, 647803, 649589, 651195, 653240, 655867, 658862, 661896, 664603, 666849, 669152, 672465, 677297, 683190, 689192, 694643, 699452, 703894, 708253, 712431, 715800, 717542, 717121, 714273, 708740, 700423, 689751, 677505, 664210, 650029, 635261, 620532, 606350, 592746, 579484, 566411, 553611, 541479, 530616, 521332, 513270, 505849, 499016, 493179, 488411, 484222, 480160, 476205, 472455, 468918, 465760, 463368, 461888, 461035, 460520, 460380, 460768, 461802, 463716, 466822, 471106, 476233, 482091, 488928, 496658, 504395, 511004, 515915, 519126, 520697, 520562, 518771, 515599, 511443, 506747, 501950, 497362, 493082, 489031, 485008, 480799, 476416]
58643D76416m198l649l090k686k181j449q83p79p89m19K02O01P75J130J779K386
58627D63166K602K301J516N85J13L49P51O92L84N18J155J652J724J864K511L377
58611D85260L893L957L879L812L616L198K774K659K881L118L041K633K069J466
58597E28256R63Q53J199J403P87m07j143q61pQ82J931L300M564N261N642O284
58581E58907P271Q233Q885R132Q988Q734Q731Q752Q128O939O344P078Q271Q622
58567F73015Q229Q337R619J1583J3488J5041J6253J7377J8826K0601K1883K1797
58555H56049K0368J8221J5692J2843R979P348M592J314k008m442n766o460o795
58542I20935o762o756p434q839j0420j1897j3396j4839j5968j6935j8086j9164
$$ y = [476416, 472218, 468569, 465479, 462793, 460612, 459163, 458280, 457501, 456712, 456293, 456495, 457096, 457871, 459001, 460780, 463166, 465768, 468069, 469585, 470170, 470283, 470632, 471383, 472075, 472459, 472977, 474132, 475784, 477508, 479372, 481883, 485260, 489153, 493110, 496989, 500801, 504417, 507615, 510389, 513048, 515929, 519047, 522088, 524721, 526790, 528256, 529219, 530072, 531271, 532674, 533461, 533054, 531911, 531050, 531043, 531925, 533856, 537156, 541720, 546981, 552623, 558907, 566178, 574411, 583296, 592428, 601416, 610150, 618881, 627633, 635761, 642700, 649044, 656122, 664393, 673015, 681244, 689581, 699200, 710783, 724271, 739312, 755565, 772942, 791768, 812369, 834252, 856049, 876417, 894638, 910330, 923173, 933152, 940500, 945092, 946406, 944398, 939956, 934190, 927730, 920935, 914173, 907417, 899983, 891144, 880724, 868827, 855431, 840592, 824624, 807689, 789603, 770439]
58530G70439j9432j8602j6986j4840j2357j0151q835q093p002n450m309m039l991
58517F36352l411k477j915k110k917l959m808n119m761l813k565j590j413j810
58503E93684j908j371q78r48r85l07O10R11Q08J036J400J108L18k5L28Q48J510
58486E96139K753M195M878M893N349O580P764Q566R725J1499J3014J3736J4239
58473G03330J4835J4729J3335J1336R521P576M883J711j257l829n945p120p068
58460G56037o394n913n624m880l169m64K765N574P248Q136R125J0134J0132Q746
58446G91453O769M684J978j410m214n427n799o675q087r035r046q452p515o180
58432G33044m496k579m70J544K942L758M799O471Q070Q783Q819Q800Q673Q008
$$ y = [770439, 751007, 732405, 715419, 700579, 688222, 678071, 669236, 661143, 654141, 648691, 644382, 640343, 636352, 632941, 630464, 628549, 626439, 623522, 619563, 614755, 609636, 604875, 601062, 598497, 596907, 595494, 593684, 591776, 590405, 589527, 588579, 587594, 587287, 587897, 588808, 589616, 590652, 592052, 593160, 593478, 593453, 593781, 594629, 596139, 598892, 603087, 607965, 612858, 618207, 624787, 632551, 641117, 650842, 662341, 675355, 689091, 703330, 718165, 732894, 746229, 757565, 767086, 774662, 779545, 781256, 779999, 776170, 770225, 763105, 756037, 749643, 743730, 738106, 733226, 730057, 729593, 732358, 737932, 745180, 753316, 762441, 772575, 782707, 791453, 798222, 802906, 804884, 803474, 799260, 793833, 788034, 781359, 773272, 764237, 755191, 746739, 739224, 733044, 728548, 725969, 725499, 727043, 729985, 733743, 738542, 745013, 753083, 761866, 770685, 779485, 788158, 796166]
58418G96166O880N647M251K423L14j728l637n358o522o978p203p612p880p597
58404G61166p068o785o484n557m111k888k286k034j706r52M64K382M069M845M791
58389G37846M498M366M484M877N425N711N397M668M003L668L609L630L515L172
58375G98869K805K698K829K983L193L670M374N123O009P067P704P341O583O777
58361H68025Q173R527R854R649R898J0713J1447J1586J1035J0026R041Q347P553
58348I94874O193M678L837L628L314K958L402M578N232M831M527N531P588R687
58334A064858J1272J2179J2322J2144J2487J3492J4385J4716J4817J4774J4053
58323A211499J2610J1211J0178R010P688P023P132O933N916N048N203N960O708
$$ y = [796166, 803046, 808693, 812944, 815367, 815681, 813953, 810316, 804958, 798436, 791458, 784255, 776643, 768763, 761166, 754098, 747313, 740829, 735272, 731161, 728273, 725987, 723953, 722247, 721295, 721759, 724141, 728210, 733055, 737846, 742344, 746710, 751194, 756071, 761496, 767207, 772604, 777272, 781275, 784943, 788552, 792182, 795697, 798869, 801674, 804372, 807201, 810184, 813377, 817047, 821421, 826544, 832553, 839620, 847324, 854665, 861248, 868025, 876198, 885725, 895579, 905228, 915126, 925839, 937286, 948872, 959907, 969933, 978974, 987321, 994874, 1001067, 1005745, 1009582, 1013210, 1016524, 1019482, 1022884, 1027462, 1032694, 1037525, 1042052, 1047583, 1055171, 1064858, 1076130, 1088309, 1100631, 1112775, 1125262, 1138754, 1153139, 1167855, 1182672, 1197446, 1211499, 1224109, 1235320, 1245498, 1254508, 1262196, 1269219, 1276351, 1283284, 1289200, 1294248, 1299451, 1305411, 1312119]
58310A312119P666Q886R642R753J0296J2003J4039J5303J5825J6060J5952J5598
58298A463142J5686J6421J7080J7337J7789J8579J8921J8661J8821J9849K0924
58287A663210K1696K2972K4863K6183K6613K7521K9431L0802L0645L0313L1162
58276A965411L2480L3312L4407L6523L8654L9749M0560M2017M3491M4384M5742
58265B396730M8484N1727N4509N7366O0639O3233O4732O6597O9495P1750P2333
58254C077595P2895P4725P6314P6397P6737P9150Q2325Q4474Q6682R0580R5156
58243C973030R9017J03461J10040J17451J24122J31505J41362J52235J62209J72766
58233E287198J86103K01086K15657K30793K48120K66325K83980L03200L26221
$$ y = [1312119, 1319785, 1328671, 1338313, 1348066, 1358362, 1370365, 1384404, 1399707, 1415532, 1431592, 1447544, 1463142, 1478828, 1495249, 1512329, 1529666, 1547455, 1566034, 1584955, 1603616, 1622437, 1642286, 1663210, 1684906, 1707878, 1732741, 1758924, 1785537, 1813058, 1842489, 1873291, 1903936, 1934249, 1965411, 1997891, 2031203, 2065610, 2102133, 2140787, 2180536, 2221096, 2263113, 2306604, 2350988, 2396730, 2445214, 2496941, 2551450, 2608816, 2669455, 2732688, 2797420, 2864017, 2933512, 3005262, 3077595, 3150490, 3225215, 3301529, 3377926, 3454663, 3533813, 3616138, 3700612, 3787294, 3877874, 3973030, 4072047, 4175508, 4285548, 4402999, 4527121, 4658626, 4799988, 4952223, 5114432, 5287198, 5473301, 5674387, 5890044, 6120837, 6368957, 6635282, 6919262, 7222462, 7548683]
58224G548683L51334L76700M04977M39272M77807N17962N62176O14155O72745
58215A1965811P35862Q06937Q90895R87285J094528J217306J362446J531658J726633
58206B2319361J957169K235553K567923K961551L436096M016890M722846N573962
58198D9791351O605469P860641R375709J1186703J3340569J5874904J8787043
58191A32822389K2028562K5480748K8848429L1554765L2820982L1953845K8620694
58184C34130414K2918490J5297095O490391k561944j0916505j7893512k3191629
58177C24272800k6774522k8705476k9108470k8218512k6380614k3967808k1299824
58170A39817574j8613261j6063571j3737145j1673703r888494q377907p117292
$$ y = [7548683, 7900017, 8276717, 8681694, 9120966, 9598773, 10116735, 10678911, 11293066, 11965811, 12701673, 13508610, 14399505, 15386790, 16481318, 17698624, 19061070, 20592728, 22319361, 24276530, 26512083, 29080006, 32041557, 35477653, 39494543, 44217389, 49791351, 56396820, 64257461, 73633170, 84819873, 98160442, 114035346, 132822389, 154850951, 180331699, 209180128, 240734893, 273555875, 305509720, 334130414, 357048904, 372345999, 378836390, 376274446, 365357941, 347464429, 324272800, 297498278, 268792802, 239684332, 211465820, 185085206, 161117398, 139817574, 121204313, 105140742, 91403597, 79729894, 69841400, 61463493, 54346201]
58163E4346201o070123n202371m484513l886453l381240k952250k589340k280308
58155B3499603k012682j780609j582356j412841j264864j135367j023912r26794
58147A2360178q38660p58285o87141o23806n64983n10512m62239m19505l80486
58138G114561l46436l19611k98423k79237k61679k47601k36116k24238k11519
58129D689701j99743j88897j77569j66406j57223j49354j40627j31206j22949
58120C255727j15895j08880j02602r8467r5230r0379q4190p8965p5066p1054o6989
58109B268010o4100o1832n8575n4809n2252n0553m8071m5219m3698m3044m1314
58098A704543l8753l7298l6854l5545l3431l2398l2447l1590k9527k8052k7498
$$ y = [54346201, 48276078, 43073707, 38589194, 34702741, 31321501, 28369251, 25779911, 23499603, 21486921, 19706312, 18123956, 16711115, 15446251, 14310884, 13286972, 12360178, 11521518, 10763233, 10076092, 9452286, 8887303, 8376791, 7914552, 7495047, 7114561, 6768125, 6448514, 6150091, 5870854, 5609175, 5361574, 5125458, 4901220, 4689701, 4489958, 4301061, 4123492, 3957086, 3799863, 3650509, 3509882, 3378676, 3255727, 3139832, 3030952, 2928350, 2829883, 2734653, 2644274, 2560084, 2481119, 2406053, 2334999, 2268010, 2203910, 2142078, 2083503, 2028694, 1976442, 1925889, 1877818, 1832599, 1788901, 1745857, 1704543, 1665790, 1628492, 1591638, 1556093, 1522662, 1490264, 1457817, 1426227, 1396700, 1368648, 1341150]
58087A341150k6167k3783k2218k2149k2042k1206k0912k1563k1611k0335j9150
58076A100014j9047j9043j8302j7604j7632j7661j7084j6489j6380j6254j5758
58065I08760j5262j4807j3919j2917j2824j3495j3452j2081j0471r599r193q858
58053G61882q770q752q119o977o332o445o489o104n954o253o214n473m793m815
58039F70392n192n414n449n247m641m027m127m959n946o998q407r759j0235r949
58025E80042r716r569q884p852p358p338o837n786n148n123m775l785l021k945
58011D91905k919k586k505k906l114k788k505k612k559j988j409j370j813k593
57997D58238l712m782n218n199n480o129o475o316o060n668m623l088j859j087
$$ y = [1341150, 1314983, 1291200, 1268982, 1246833, 1224791, 1203585, 1182673, 1161110, 1139499, 1119164, 1100014, 1080967, 1061924, 1043622, 1026018, 1008386, 990725, 973641, 957152, 940772, 924518, 908760, 893498, 878691, 864772, 851855, 839031, 825536, 812084, 800003, 789532, 779933, 770740, 761882, 753112, 744360, 736241, 729264, 722932, 716487, 709998, 703894, 697940, 691687, 685473, 680000, 675207, 670392, 665200, 659786, 654337, 649090, 644449, 640422, 636295, 631336, 625390, 618392, 609985, 600226, 589991, 580042, 570326, 560757, 551873, 544021, 536663, 529325, 522488, 516702, 511554, 506431, 501656, 497871, 494850, 491905, 488986, 486400, 483895, 480989, 477875, 475087, 472582, 469970, 467411, 465423, 464014, 462644, 460831, 458238, 454526, 449744, 444526, 439327, 433847, 427718, 421243, 414927, 408867, 403199, 398576, 395488, 393629, 392542]
57983C92542k77L99J44r18j632j525j315j394j248p06m37o87q11m98l01m94n81
57966C80261l31j89k97k21N1N2p8L39J111J223N41j5k13q66j986k392j775j491
57948C73724k349l209k809j614p56l32J14N06P64J457K865M268N033N625O611
57933C89898P530P644P054O231N231M079L177K541J461l38k048k967l493m182
57919D21818m783n014n331o047o492o038n181m637m156l198k055j295p24R2P99
57904C67758P90L48K71P07J187J508J726J674J221P38O61Q33Q35O63N54N86Q14
57887C82874J296J570P91r98k433k380j400r01j339k035k367k406k503k850l333
57872C61586l570l266k723k559k814k841k248j320m49K31N18L25K95J225K794
$$ y = [392542, 392265, 392664, 392808, 391890, 390258, 388733, 387418, 386024, 384776, 384070, 383633, 382946, 382135, 381637, 381336, 380842, 380261, 379930, 379741, 379444, 379223, 379274, 379326, 379248, 379587, 380698, 381921, 382462, 382447, 382234, 381368, 379382, 376990, 375215, 373724, 371375, 368166, 365357, 363743, 362987, 362655, 362769, 363275, 364039, 365496, 368361, 372629, 377662, 383287, 389898, 397428, 405072, 412126, 418357, 423588, 427667, 430844, 433385, 434846, 434508, 432460, 429493, 426000, 421818, 417035, 412021, 406690, 400643, 394151, 388113, 382932, 378295, 374139, 370941, 368886, 367591, 366867, 366959, 367758, 368548, 368896, 369167, 369874, 371061, 372569, 374295, 375969, 377190, 377928, 378589, 379422, 380257, 380920, 381474, 382060, 382874, 384170, 385740, 386531, 385533, 383100, 380720, 379320, 378419, 377080, 375045, 372678, 370272, 367769, 364919, 361586, 358016, 354750, 352027, 349468, 346654, 343813, 341565, 340245, 339796, 340027, 340545, 340870, 341165, 342390, 345184]
57857C45184L873M296M972O049O449N839N355N564N299L745K190K173K990K753
57843D06731J084p00j633j861j785j703k059l002l931m331m501m781m781m284
57829C68463m033m541m966m393l377k925k656j535J82J320J648J857J974J403
57815C48421M01n6J41Q3o06j389k045l051m538n910o664o750o220n362m911n164
57799B96380n150l901k108j282j496j426n46K64L75K84N55J176K194L738N200
57784B94257N657N319N283N634N292M132L636M673O041O200N366M810M951N211
57770C66462N131M614L509J776j10j572k564l347l975m395m688m888m819m435
57756C46699l994l678l344k857k292j750j290j113j259j213l99Q50J537J337J051
$$ y = [345184, 349057, 353353, 358325, 364374, 370823, 376662, 382017, 387581, 392880, 396625, 398815, 400988, 403978, 406731, 407815, 407115, 405482, 403621, 401836, 400133, 398074, 395072, 391141, 386810, 382309, 377528, 372747, 368463, 364430, 359889, 354923, 350530, 347153, 344228, 341572, 340037, 340219, 341539, 343187, 345044, 347018, 348421, 348822, 348766, 348907, 348990, 348384, 346995, 344950, 341899, 337361, 331451, 324787, 318037, 311817, 306455, 301544, 296380, 291230, 287329, 285221, 283939, 282443, 281017, 280471, 280735, 281110, 281394, 281949, 283125, 285319, 289057, 294257, 299914, 305233, 310516, 316150, 321442, 325574, 329210, 333883, 339924, 346124, 351490, 356300, 361251, 366462, 371593, 376207, 379716, 381492, 381382, 379810, 377246, 373899, 369924, 365529, 360841, 355953, 351134, 346699, 342705, 339027, 335683, 332826, 330534, 328784, 327494, 326381, 325122, 323909, 323510, 324360, 325897, 327234, 328285]
57741C28285J474K436L168L092K089O55j26N53K126L183L217L046L314L541L163
57726C63216K606K524K660K266J256K78j56j16jk74j098k023k305j870j440j501
57710C64022j696j657j799k656l874m579m555m360m404m453m084l178j923n94
57696C20210N58J405J906J906J192o0j171j585j590k033l277m564m680l247j222
57681C03748J43Q20K047M738Q353J1688J4371J7012K0248K4389K9790L6611M4164
57668E18122N1174N6743O0290O0508N5431M4134K7856R084r896k7268m1342n0876
57656G53960n5638n6268n3716m9014m3256l7362l1917k7141k2852j8542j3990
57645C44264r890p285o273n807m970l781k556j221K44J294J414Q57L11R6J32L40
$$ y = [328285, 329759, 332195, 335363, 338455, 340544, 341199, 341073, 341626, 343752, 346935, 350152, 353198, 356512, 360053, 363216, 365822, 368346, 371006, 373272, 374528, 374806, 374650, 374534, 374533, 374259, 373161, 371138, 368833, 366963, 365523, 364022, 362326, 360669, 358870, 356214, 352340, 347761, 343206, 338846, 334442, 329989, 325905, 322727, 320804, 320210, 320768, 322173, 324079, 325985, 327177, 327117, 325946, 324361, 322771, 320738, 317461, 312897, 308217, 304970, 303748, 303891, 304711, 306758, 311496, 319849, 331537, 345908, 362920, 383168, 407557, 437347, 473958, 518122, 569296, 626039, 686329, 746837, 802268, 846402, 874258, 883342, 873446, 846178, 804836, 753960, 698322, 642054, 588338, 539324, 496068, 458706, 426789, 399648, 376796, 358254, 344264, 334374, 327089, 320816, 315009, 310039, 306258, 303702, 302481, 302725, 304019, 305433, 306290, 306601, 306697, 306829, 307169]
57629C07169N67L67n89j968l010l244k781k091j728j976k552k800k448j917j717
57614B79282j871k106k289k363k175j704j241j121j368j758j933j462k21J055
57600B58725J158k09j852k357j669r55j123j959k627k624k182j933k222k724k858
57585B32589k479j943j480r94n16l60o17r47j068j024p83j27P52J102N72k36o04
57568B21837p21j296k450l561l958l364j959m52K68J3m17k88J10J38J2M73J491
57551B05876K148J929J252N86k05j265k093k060j259m29j54m38r45j304j235o01
57535A99803M53J480J997J880J405Q84L58j87m85k55K16K80j74m31J00J084J792
57518B10200K029K096K036J590Q38L37M71J043J669K203K587K558J829N04q85
$$ y = [307169, 307736, 308103, 307514, 305546, 302536, 299292, 296511, 294420, 292692, 290716, 288164, 285364, 282916, 280999, 279282, 277411, 275305, 273016, 270653, 268478, 266774, 265533, 264412, 263044, 261286, 259353, 257891, 257670, 258725, 259883, 259674, 257822, 255465, 253796, 252841, 251718, 249759, 247132, 244508, 242326, 240393, 238171, 235447, 232589, 230110, 228167, 226687, 225693, 225177, 224817, 224200, 223253, 222185, 221161, 220378, 220251, 221003, 222105, 222677, 222441, 221837, 221116, 219820, 217370, 213809, 209851, 206487, 204528, 204076, 204344, 204357, 203940, 203652, 203762, 203900, 203912, 204385, 205876, 208024, 209953, 211205, 211791, 211586, 210321, 208228, 206168, 204909, 204480, 204326, 203888, 202943, 201639, 200404, 199803, 200256, 201736, 203733, 205613, 207018, 207902, 208260, 208073, 207588, 207333, 207549, 207829, 207655, 207224, 207324, 208408, 210200, 212229, 214325, 216361, 217951, 218789, 219126, 219597, 220640, 222309, 224512, 227099, 229657, 231486, 231990, 231105]
57503B31105j768j950j647j237j036j192j621j989j942j491j082j122j557k018
57489B09453k229k048j376m04K24M0n33n92O9P33P77L92R4Q1L07O91R82P93R0
57470B07544o97j253j640j768j232o1R25J014N01J05p5m39r86j260j143j048j243
57453A97244j442j239o32j8J74r7l79j35N98J182J129O06Pn34r04p15J82J163
57435A96190J419J031Q34J217J609J364O85L32O54J268J601J560J478J556J564
57420B14362J179M97r2m18o29q30r54j014j120j135p43P6Q77J276J311J196J040
57403B14879R02P64M04l45j156j458j119m60L67J306J820J296K03j42O28J318
57387B19207R65K68M89J687K870L343L020K020Q20L23Q45J465J283P69Q89J392
$$ y = [231105, 229337, 227387, 225740, 224503, 223467, 222275, 220654, 218665, 216723, 215232, 214150, 213028, 211471, 209453, 207224, 205176, 203800, 203396, 203620, 203660, 203127, 202535, 202604, 203337, 204114, 204506, 204600, 204681, 204988, 205679, 206661, 207454, 207544, 206847, 205594, 203954, 202186, 200954, 200893, 201818, 202832, 203333, 203438, 203363, 202924, 201938, 200678, 199535, 198487, 197244, 195802, 194563, 193931, 193913, 194087, 193990, 193611, 193476, 194074, 195256, 196385, 196991, 196998, 196464, 195560, 194845, 195027, 196190, 197609, 198640, 199474, 200691, 202300, 203664, 204349, 204681, 205335, 206603, 208204, 209764, 211242, 212798, 214362, 215541, 216038, 215946, 215528, 214899, 214069, 213115, 212101, 210981, 209846, 209103, 209179, 210056, 211332, 212643, 213839, 214879, 215781, 216545, 216949, 216604, 215448, 213990, 212871, 212411, 212778, 214084, 215904, 217200, 217403, 217261, 217889, 219207, 220172, 220440, 220929, 222616, 225486, 228829, 231849, 233869, 234689, 235012, 235857, 237322, 238605, 239374, 240263, 241655]
57371B41655J139nr32r00l37P5J14l07j168j917j808r35j45J73M49R11J147R33
57353B38142P47J014J456J550J117L16m82o81O2J147J526R77L29J88L02M21Q87
57336B49018J825K486K152J256Q56J228J651J455Q02L51M75R38J210J035O59M17
57320B67814K92J34Q4L85Q02P80K23l27m23j85R3L36N07L93j63r50j516j501q88
57301B65890r0L14J76j9J76N92Q33R32J085J037M47k81l30L94J239J843K360K610
57283B79208K029P65J3O73K331L950M964N294M925M010L062K498K309K396K785
57268C21212L304L532L381L262L368L332K955K663K811L037K814K245J786J589
57254C61291J527J546J546J302Q95Q35J333J912K199K527L178L541K913J830J614
$$ y = [241655, 242794, 242789, 241857, 240957, 240620, 240695, 240809, 240502, 239334, 237417, 235609, 234674, 234529, 234702, 235151, 236062, 237209, 238142, 238889, 239903, 241359, 242909, 244026, 244342, 243860, 243179, 243241, 244388, 245914, 246891, 247220, 247408, 247710, 248131, 249018, 250843, 253329, 255481, 256737, 257593, 258821, 260472, 261927, 262729, 263080, 263555, 264493, 265703, 266738, 267397, 267814, 268106, 268240, 268324, 268709, 269511, 270291, 270514, 270187, 269764, 269579, 269672, 270008, 270515, 270908, 270745, 269795, 268279, 266778, 265890, 265800, 266114, 266290, 266271, 266447, 267039, 267872, 268804, 269889, 270926, 271373, 271092, 270762, 271156, 272395, 274238, 276598, 279208, 281237, 282002, 282015, 282688, 285019, 288969, 293933, 299227, 304152, 308162, 311224, 313722, 316031, 318427, 321212, 324516, 328048, 331429, 334691, 338059, 341391, 344346, 347009, 349820, 352857, 355671, 357916, 359702, 361291, 362818, 364364, 365910, 367212, 368107, 368942, 370275, 372187, 374386, 376913, 380091, 383632, 386545, 388375, 389989]
57239C89989K637L873M351M257M314M634M729M327L716L342L335L531L756L959
57225D44750M092M040L804L684L992M575M844M485L907L882M735O072P228P901
57211E11991Q313Q781R214R296R178R541J0662J1730J1630J0247Q575P610P609
57198F34377Q311R292J0100J0490J0602J0688J0765J0882J1281J1804J1632J0441
57186G60665R378R747J1031J1553J1019J0820J1643J2383J2189J1966J2921J4780
57174I00095J6624J8372K0222K1492K1475K0890K1039K1937K2534K2538K2704
57163A129922K3366K3977K4206K4427K4856K5156K5183K5332K5864K6527K7121
57152A405937K7813K8630K9145K8956K8135K7103K6399K6523K7602K9134L0456
$$ y = [389989, 392626, 396499, 400850, 405107, 409421, 414055, 418784, 423111, 426827, 430169, 433504, 437035, 440791, 444750, 448842, 452882, 456686, 460370, 464362, 468937, 473781, 478266, 482173, 486055, 490790, 496862, 504090, 511991, 520304, 529085, 538299, 547595, 556773, 566314, 576976, 588706, 600336, 610583, 619158, 626768, 634377, 642688, 651980, 662080, 672570, 683172, 693860, 704625, 715507, 726788, 738592, 750224, 760665, 770043, 779790, 790821, 802374, 813393, 824213, 835856, 848239, 860428, 872394, 885315, 900095, 916719, 935091, 955313, 976805, 998280, 1019170, 1040209, 1062146, 1084680, 1107218, 1129922, 1153288, 1177265, 1201471, 1225898, 1250754, 1275910, 1301093, 1326425, 1352289, 1378816, 1405937, 1433750, 1462380, 1491525, 1520481, 1548616, 1575719, 1602118, 1628641, 1656243, 1685377, 1715833]
57141A715833L1568L3079L5402L8342M1527M4810M8155N1462N4597N7431N9815
57130B212021O1792O3682O5843O8370P1275P4699P8657Q2705Q6157Q8636R0349
57119C044186R2018R4617R8819J04498J10963J17752J24835J32148J39608J47743
57109D207187J57487J69058J81913J96261K13742K36077K64039K98554L41805
57100F266123L96187M62934N42892O37950P50479Q81637J031097J197598J378366
57091A3545263J568470J761822J952311K132993K295523K432440K539502K614677
57083C0843001K656921K668065K651309K598538K476483K234119J835067J287120
57075D9250623O39698m6097p23845j365033j948102k451218k853611l139316l299682
$$ y = [1715833, 1747401, 1780480, 1815882, 1854224, 1895751, 1940561, 1988716, 2040178, 2094775, 2152206, 2212021, 2273813, 2337495, 2403338, 2471708, 2542983, 2617682, 2696339, 2779044, 2865201, 2953837, 3044186, 3136204, 3230821, 3329640, 3434138, 3545101, 3662853, 3787688, 3919836, 4059444, 4207187, 4364674, 4533732, 4715645, 4911906, 5125648, 5361725, 5625764, 5924318, 6266123, 6662310, 7125244, 7668136, 8306086, 9056565, 9938202, 10969299, 12166897, 13545263, 15113733, 16875555, 18827866, 20960859, 23256382, 25688822, 28228324, 30843001, 33499922, 36167987, 38819296, 41417834, 43894317, 46128436, 47963503, 49250623, 49890321, 49844224, 49120379, 47755346, 45807244, 43356026, 40502415, 37363099, 34063417]
57066C4063417l335807l260542l096962k872675k613607k340714k069746j811954
57058A2661410j574599j361513j174071j012118q74213p57599o58771n74580n02768
57049D171178m41554l89158l43977l04772k70382k39599k11676j86707j65022
57040A618331j46308j29681j14415j00336q7515p5860o4964n4135m2802l0937
57030G71378j8859o503O620K0304L3035M3001M9224N0940M6289L3136J1748j4034
57018A026279l8967n9375p3868q2137q4237q1019p4258o5811n6875m8160m0289
57007C21283l3656k8214k3761k0310j7809j5756j3546j1242r515q746q526q223
56995A21979p608o750n685m506l438k472j173P52K970M921O480P789Q639Q562
$$ y = [34063417, 30727610, 27467068, 24370106, 21497431, 18883824, 16543110, 14473364, 12661410, 11086811, 9725298, 8551227, 7539109, 6664896, 5907297, 5248526, 4673946, 4171178, 3729624, 3340466, 2996489, 2691717, 2421335, 2181736, 1970060, 1783353, 1618331, 1472023, 1342342, 1227927, 1127591, 1040076, 964216, 899252, 845117, 802315, 771378, 752519, 746016, 752636, 772940, 805975, 848976, 898200, 949140, 995429, 1028565, 1040313, 1026279, 987312, 927937, 854069, 771932, 687695, 606676, 532418, 466607, 409732, 361572, 321283, 287627, 259413, 235652, 215342, 197533, 181777, 168231, 156989, 147474, 138728, 130202, 121979, 114371, 107621, 101936, 97430, 93992, 91520, 90347, 91099, 94069, 98990, 105470, 113259, 121898, 130460]
56981A30460P439N544L068Q3l032n663p582r048j0199j0707j0145q417n889l282
56967G2630j331j39R71K578M404O006P858J0744J4131J6277J6302J5133J3818
56954A79382J1938Q518L839p31m384p352r872j1519j1796j0806r127p345n714
56941A25031m028j839R24L717O059Q216J0782J3742J6455J8497J9823K0134J8648
56928B56161J4922R436L137l232r153j4013j7266j8872j9261j8954j8287j7352
56916A47266j5968j3904j1418r287p956o871n242l393k492k842l260k703j730
56903F0200j460j745j494n26K18M11R55K391L938M891N867P727J0059J1947J3530
56888A16909J5478J7296J7620J6177J4144J2311J0171P142L621K06l190o728r715
$$ y = [130460, 137899, 143443, 146511, 146594, 143562, 137899, 130317, 121269, 111070, 100363, 90218, 81801, 75912, 72630, 71299, 71160, 72131, 74709, 79113, 85119, 92977, 103721, 117852, 134129, 150431, 165564, 179382, 191320, 199838, 203677, 202946, 198562, 191210, 181338, 169819, 158023, 147217, 138090, 130745, 125031, 121003, 119164, 120088, 123805, 129864, 138080, 148862, 162604, 179059, 197556, 217379, 237513, 256161, 271083, 280519, 283656, 280424, 271271, 257258, 239992, 221120, 201859, 182905, 164618, 147266, 131298, 117394, 105976, 96689, 88733, 81862, 76620, 73227, 70735, 67893, 64633, 61930, 60200, 58740, 56995, 55501, 54975, 55193, 55604, 56559, 58950, 62888, 67779, 73646, 81373, 91432, 103379, 116909, 132387, 149683, 167303, 183480, 197624, 209935, 220106, 227248, 230869, 231075, 227885, 221157, 211442]
56875B11442j1077j0381q048m816j387J793M776P955J1530J5407J9604K4293K9264
56862B90355L3882L7648M0234M0845L8306L2273K3789J4255M357n575j4720k1897
56850E13752k6313k7788k6563k3284j8838j3739p872j128O065J3214K0426K8214
56838D36146L6785M5786N4447O1662O6090O6583O2427N3289L9326K1635K242j6569
56826I29849l2816m5002n2494n5897n6376n4427m9804m2768l4477k5821j6759
56815D63208p319J664R554J6857K4345L1754L8155M2943M5508M4503L8692K8426
56803G78290J5401J078j3684k7594l8773m6027m9596n0338m8759m5083l9759l3502
56791D01654k6986k0573j4259p955j930L270P565J1586J5745J9377K1342K1132
$$ y = [211442, 200365, 189984, 181936, 177120, 175733, 177526, 182302, 190257, 201787, 217194, 236798, 261091, 290355, 324237, 361885, 402119, 442964, 481270, 513543, 537332, 551587, 555944, 550369, 535649, 513752, 487439, 459651, 433088, 409804, 390966, 377227, 369355, 368227, 374292, 387506, 407932, 436146, 472931, 518717, 573164, 634826, 700916, 767499, 829926, 883215, 922541, 944176, 946418, 929849, 897033, 852031, 799537, 743640, 687264, 632837, 583033, 540265, 505788, 479967, 463208, 455889, 457553, 467107, 483964, 508309, 540063, 578218, 621161, 666669, 711172, 749864, 778290, 793691, 794769, 781085, 753491, 714718, 668691, 619095, 568757, 519998, 474915, 435156, 401654, 374668, 354095, 339836, 331881, 329951, 333221, 340786, 352372, 368117, 387494, 408836, 429968]
56779D29968J8910J4810Q853J404o867j5265k2839k8315l1016l1661l1436l0567
56767B75979k8539k5548k2598k0148j7626j4633j1669r403p901o961o525o376
56755I8052n992n135m167l469k938k385j955j796j721j531j390j530j797j841
56741F0405j579j225r67q16o63l59J63P78J183J113N30l03q76p63o6O79J186J645
56723F0065K117K168J612J158J566K445K630J739N93M9R5K57K33q8o93j236j220
56706G3490n29M84J496K370K831K568J697O76l39j475k430k496j547l63L40O61
56690G7434J002J378J639J848K005J808J153M97K60J95j27n20l78L89J190J489
56674I1262J365J233J296J414J337J014O61N83Q71J303J520J348J006R74J452
$$ y = [429968, 448878, 463688, 472541, 473945, 467078, 451813, 428974, 400659, 369643, 337982, 306546, 275979, 247440, 221892, 199294, 179146, 161520, 146887, 135218, 125815, 117914, 110953, 104428, 98052, 92060, 86925, 82758, 79289, 76351, 73966, 72011, 70215, 68494, 66963, 65573, 64043, 62246, 60405, 58826, 57601, 56634, 55818, 55155, 54796, 54959, 55737, 56920, 58033, 58563, 58260, 57384, 56621, 56555, 57234, 58420, 60065, 62182, 64350, 65962, 67120, 68686, 71131, 73761, 75500, 76093, 76142, 76237, 76494, 76727, 76639, 75946, 74710, 73490, 72961, 73445, 74941, 77311, 80142, 82710, 84407, 85083, 84744, 83269, 80839, 78343, 76796, 76433, 76773, 77434, 78436, 79814, 81453, 83301, 85306, 87114, 88267, 88764, 89024, 89219, 89092, 88572, 88194, 88583, 89773, 91262, 92627, 93860, 95156, 96570, 97907, 98921, 99582, 100165, 101036, 102339, 103859, 105207, 106213, 107187, 108639]
56659A08639J906J527L92l27K30J364J678R77M12P36J299J179M66j27l48m66n76
56642A18961n16l24k65l58k88J17O01P34L41l38q90j060q93m92J35P80Q82O2j151
56623A16038j658j035q6M0q96k045k419j836j061r78j598j999j437k76N30O74
56607I9958O43P48O39L6p13j070r64o49k35L10Q39J035P66L03J58N91J163J068
56589A04626J59o56m97K84O06K38Q0P78J864K548K646K305J445P2j239j743j225
56572A12291k2J435K737L480L508L152K981L362M333N673O980P953Q661R365J0035
56557A85924J0379J0278R732Q448O105L202R33j04m84r41j411j586j740k245k711
56542B23779k449j683j465k250l211l244k254j154p98j227j962k661l255l512
$$ y = [108639, 110545, 112072, 112464, 112137, 112367, 113731, 115409, 116386, 116798, 117534, 118833, 120012, 120478, 120351, 120003, 119537, 118961, 118445, 118121, 117856, 117498, 117210, 117327, 117928, 118662, 119003, 118665, 117775, 116715, 115822, 115330, 115465, 116245, 117127, 117189, 116038, 114380, 113345, 113259, 113299, 112403, 110358, 107939, 106103, 105042, 104064, 102466, 100467, 99030, 98754, 99284, 99958, 100601, 101349, 101988, 102024, 101311, 100241, 99277, 98628, 98393, 98703, 99542, 100577, 101343, 101646, 101804, 102395, 103558, 104626, 104785, 104129, 103632, 103916, 104522, 104760, 104840, 105618, 107482, 110030, 112676, 114981, 116426, 116498, 115259, 113516, 112291, 112269, 113704, 116441, 119921, 123429, 126581, 129562, 132924, 137257, 142930, 149910, 157863, 166524, 175889, 185924, 196303, 206581, 216313, 224761, 230866, 234068, 235001, 234897, 234413, 233472, 232061, 230475, 228735, 226490, 223779, 221330, 219647, 218182, 215932, 212721, 209477, 207223, 206069, 205271, 204044, 202082, 199421, 196166, 192654]
56528A92654l001j848j072j579k930l772l464k620j974j442p10k5J45k07p54j332
56512A66069j793j828j473j393k065k847k637j355j63Lm69n21J40O90K39j046
56496A49551k058j911q10L01P64N95R6n11j031j254j136q86p36p25o63j89Q63
56479A40260J988K201J146k29o63RR36J511J751J627J044M89P09J510J831J352
56463A57472R66J215J332N92l37l87K70N87K82M8L31P59Q45N58J21k33j89M52
56445A64684J460K265K449J994J198N13K38K38J23j78l75m05n90j029j287j014
56429A70284l82L06J004J560J572R43J54l87p88j102r35q7R08J403J390J122N56
56412A77521l01r49r61o04l45j12L12O18L42k87o38n49l38j32K35P53J182J416
$$ y = [192654, 189653, 187805, 186733, 185154, 182224, 178452, 174988, 172368, 170394, 168952, 168242, 168217, 168362, 168155, 167401, 166069, 164276, 162448, 160975, 159582, 157517, 154670, 152033, 150678, 150515, 150518, 150049, 149528, 149668, 150358, 150597, 149551, 147493, 145582, 144772, 145073, 145837, 146432, 146528, 146017, 144986, 143732, 142596, 141710, 140974, 140249, 139586, 139397, 140260, 142248, 144449, 145595, 145366, 144703, 144712, 145648, 147159, 148910, 150537, 151581, 152070, 152779, 154289, 156120, 157472, 158438, 159653, 160985, 161577, 161240, 160853, 161123, 161710, 161992, 162040, 162371, 163130, 163975, 164533, 164654, 164421, 164232, 164684, 166144, 168409, 170858, 172852, 174050, 174563, 174801, 175039, 175162, 174984, 174609, 174204, 173614, 172585, 171298, 170284, 169902, 170208, 171212, 172772, 174344, 175287, 175441, 175054, 174266, 173164, 172229, 172142, 173050, 174453, 175843, 176965, 177521, 177220, 176271, 175310, 174706, 174361, 174249, 174561, 175179, 175521, 175234, 174596, 174047, 173709, 173577, 173812, 174565, 175747, 177163]
56394A77163J463J241P46K43rm4N0L10O25P59Q18J185J678J540O73Q8M67J114
56376A90110J093O71O38Q85P33K74K20O41R26Q82Q87J060J168J284J627J773J027
56359B05899l79j338j236m86K87Q89J220J167J049J461K409L124K975K163J289
56344B20493P16M50L26K02J65N56J445K317K609K444K394K655K909K931K859K902
56328B48373L078L261L232K864K394K278K582K861K787K464J964J181L71J05L22
56313B80117K17l81m69O03J973K494K285K080J938J681J890L050M323M535L990
56298C10326L947M649N306N685O204O569N984M780M361N153O012N992N538N445
56284C85951N799O411P330Q437R296R809J0332J0964J1429J1836J2702J4031J5201
$$ y = [177163, 178626, 179867, 180613, 180856, 180847, 180803, 180853, 181163, 181788, 182547, 183365, 184550, 186228, 187768, 188441, 188529, 188996, 190110, 191203, 191874, 192512, 193397, 194130, 194404, 194624, 195265, 196191, 197073, 197960, 199020, 200188, 201472, 203099, 204872, 205899, 205520, 204182, 202946, 202460, 202747, 203636, 204856, 206023, 207072, 208533, 210942, 214066, 217041, 219204, 220493, 221209, 221659, 221985, 222187, 222352, 222908, 224353, 226670, 229279, 231723, 234117, 236772, 239681, 242612, 245471, 248373, 251451, 254712, 257944, 260808, 263202, 265480, 268062, 270923, 273710, 276174, 278138, 279319, 279690, 279795, 280117, 280334, 279953, 279484, 280087, 282060, 284554, 286839, 288919, 290857, 292538, 294428, 297478, 301801, 306336, 310326, 314273, 318922, 324228, 329913, 336117, 342686, 348670, 353450, 357811, 362964, 368976, 374968, 380506, 385951, 391750, 398161, 405491, 413928, 423224, 433033, 443365, 454329, 465758, 477594, 490296, 504327, 519528]
56271E19528J5889J6441J7123J7823J8659K0061K2020K3995K5801K7867L0615
56260G55822L4105L8370M3326M8408N3120N7987O4138P1906Q0644Q9892R9893
56249A437611J10812J22326J34044J45686J56789J66875J75723J82871J87188
56240B819925J87787J85004J79395J70195J56036J36963J14362Q9065O0941L0496
56230D130169n60l0632n8964q4850j07347j26081j41323j53086j61116j65691
56220C100519j67403j66275j62262j56456j50292j43723j35727j26518j17520
56211A774343j09152j00591r2031q4996p9779p4595o8193o1619n6241n1736m7183
56200I48227m2743l8925l5383l1626k8077k5323k3111k0985j9039j7317j5366
$$ y = [519528, 535417, 551858, 568981, 586804, 605463, 625524, 647544, 671539, 697340, 725207, 755822, 789927, 828297, 871623, 920031, 973151, 1031138, 1095276, 1167182, 1247826, 1337718, 1437611, 1548423, 1670749, 1804793, 1950479, 2107268, 2274143, 2449866, 2632737, 2819925, 3007712, 3192716, 3372111, 3542306, 3698342, 3835305, 3949667, 4038732, 4099673, 4130169, 4129609, 4098977, 4040013, 3955163, 3847816, 3721735, 3580412, 3427326, 3266210, 3100519, 2933116, 2766841, 2604579, 2448123, 2297831, 2154108, 2018381, 1891863, 1774343, 1665191, 1564600, 1472569, 1387573, 1307794, 1233199, 1165006, 1103387, 1047146, 995410, 948227, 905484, 866559, 831176, 799550, 771473, 746150, 723039, 702054, 683015, 665698, 650332]
56189F50332j3067j1031r527q056o552n794n957n896m818l490k909k849k627k286
56175E65473k036j492m46L85L72J1J53Q69J762K667L410L652L516L628M136M566
56159E90626M939N876P252Q071Q209Q914J0867J3122J4771J6250J8205K0360K2522
56146G49984K5341K9212L3518L7946M3243M9769N6596O2972O9249P5293P9426
56135A312549Q0261P8410P5089P0384O4161N7545N1922M7366M3321L9861L7008
56124A957877L3727K8966K2888J6008Q089r48j0059j8384k6628l5898m5985n5874
56112A873779o5051p3085p8880q1604q1608p9463p5030o8458o0982n3660m6349
56101A109609l8979l2506k7399k2552j7121j2237r341p920o431m497k625p50J362
$$ y = [650332, 637265, 626234, 616707, 608651, 602099, 596305, 590348, 584452, 579634, 576144, 573235, 570386, 567759, 565473, 563437, 561945, 561499, 561884, 562256, 562267, 562420, 563289, 565051, 567718, 571128, 574780, 578296, 581924, 586060, 590626, 595565, 601441, 608693, 616764, 624973, 633887, 644754, 657876, 672647, 688897, 707102, 727462, 749984, 775325, 804537, 838055, 876001, 919244, 969013, 1025609, 1088581, 1157830, 1233123, 1312549, 1392810, 1471220, 1546309, 1616693, 1680854, 1738399, 1790321, 1837687, 1881008, 1920869, 1957877, 1991604, 2020570, 2043458, 2059466, 2067555, 2066607, 2056548, 2038164, 2011536, 1975638, 1929653, 1873779, 1808728, 1735643, 1656763, 1575159, 1493551, 1414088, 1339058, 1270600, 1209618, 1155958, 1109609, 1070630, 1038124, 1010725, 988173, 971052, 958815, 949474, 941554, 935123, 930626, 928001, 927251, 928613]
56088I28613L024L468L168L113L427L812M511N704O793P328P739Q354Q757Q987
56074A006798R946J1675J2763J2495J2054J2411J2783J2492J2571J3983J5883
56063A145854J7153J8073J9012J9289J8808J8997K0458K1605K1271K0664K0953
56052A362137K1138K0292J9662K0291K0819K0019J9368K0438K1913K1932K1388
56041A589397K2050K3322K3870K4575K6770K9317L0503L1166L2850L4617L4979
56030A903416L5227L7413M0547M2263M2797M3925M5405M6003M6615M8853N1797
56019B384261N3596N4921N7434O0337O2051O3726O7401P2098P5472P7836Q0909
56008C110042Q4239Q6633Q9357R3951R8751J01623J04186J09141J15581J21435
$$ y = [928613, 931637, 935105, 938273, 941386, 944813, 948625, 953136, 958840, 965633, 972961, 980700, 989054, 997811, 1006798, 1016744, 1028419, 1041182, 1053677, 1065731, 1078142, 1090925, 1103417, 1115988, 1129971, 1145854, 1163007, 1181080, 1200092, 1219381, 1238189, 1257186, 1277644, 1299249, 1320520, 1341184, 1362137, 1383275, 1403567, 1423229, 1443520, 1464339, 1484358, 1503726, 1524164, 1546077, 1568009, 1589397, 1611447, 1634769, 1658639, 1683214, 1709984, 1739301, 1769804, 1800970, 1833820, 1868437, 1903416, 1938643, 1976056, 2016603, 2058866, 2101663, 2145588, 2190993, 2236996, 2283611, 2332464, 2384261, 2437857, 2492778, 2550212, 2610549, 2672600, 2736326, 2803727, 2875825, 2951297, 3029133, 3110042, 3194281, 3280914, 3370271, 3464222, 3562973, 3664596, 3768782, 3877923, 3993504, 4114939]
55998D114939J28138J38052J49574J59940J70571J84199J99130K12079K24446
55989E681068K39709K57020K73598K91093L12871L37444L61623L87702M20050
55980H562178M57040M94434N34326N82279O37984O97838P64370Q43483R34620
55971A4508552J034014J145728J278935J436635J618699J833789K095897K411831
55963B7364080K786217L236937L790872M467140N281372O264462P458886Q899151
55955F9549117J0615951J2653790J5055284J7823884K0914938K4223427K7489256
55948A98325647L0179828L1542566L0875948K7801760K2333964J4816554N905187
55941C61781454l447314j2175685j9422807k4737105k8017657k9366392k9029941
$$ y = [4114939, 4243077, 4381129, 4530703, 4690643, 4861214, 5045413, 5244543, 5456622, 5681068, 5920777, 6177797, 6451395, 6742488, 7055359, 7392803, 7754426, 8142128, 8562178, 9019218, 9513652, 10047978, 10630257, 11268241, 11966079, 12730449, 13573932, 14508552, 15542566, 16688294, 17967229, 19403864, 21022563, 22856352, 24952249, 27364080, 30150297, 33387234, 37178106, 41645246, 46926618, 53191080, 60649966, 69549117, 80165068, 92818858, 107874142, 125698026, 146612964, 170836391, 198325647, 228505475, 260048041, 290923989, 318725749, 341059713, 355876267, 361781454, 358334140, 346158455, 326735648, 301998543, 273980886, 244614494, 215584553]
55934B15584553k7397300k4934405k2070032j9132812j6353549j3871817j1735090
55927H0089548r926436q411422p157368o124117n265679m547272l947549l445009
55919C1264696l016333k647490k332958k063534j826240j615499j432946j276078
55911A5053618j137341j013979r08454q18858p38362o64671o01087n47639m99535
55902H123692m55042m16929l85153l55608l27105l02656k82721k63696k44191
55893E090591k26797k12520j99125j85881j74600j65011j54302j42110j31186
55884C499059j22373j13697j04987r8693r5316r2603q9919q9009q9705q9206q6621
55873B426930q4106q2599q0262p6199p1924o8262o4209n9743n6443n4475n2055
$$ y = [215584553, 188187253, 163252848, 141182816, 122050004, 105696455, 91824638, 80089548, 70163112, 61751690, 54594322, 48470205, 43204526, 38657254, 34709705, 31264696, 28248363, 25600873, 23267915, 21204381, 19378141, 17762642, 16329696, 15053618, 13916277, 12902298, 11993844, 11174986, 10436624, 9771953, 9170866, 8623227, 8123692, 7668650, 7251721, 6866568, 6510960, 6183855, 5881199, 5598478, 5334782, 5090591, 4863794, 4651274, 4452149, 4266268, 4091668, 3926657, 3772355, 3630245, 3499059, 3376686, 3262989, 3158002, 3059309, 2963993, 2871390, 2781471, 2692462, 2602757, 2513551, 2426930, 2342824, 2260225, 2179963, 2103764, 2031840, 1963578, 1899369, 1839626, 1783183, 1728708, 1676653]
55862A676653m8614m5526m3212m0547l7563l5712l4936l3507l1189k9569k8899
55851A267379k7630k5533k4294k4417k4448k3884k3956k4949k5453k4903k4315
55840I93597k3929k2717k0693j9246j8675j7828j6504j5697j5234j3843j1909
55829G97322j1367j2333j2632j1309r965r906j0557j1413j2948j4680j4933j3487
55817F51792j2193j1947j1366r476p467o605o417o060n700n482m811l572k570
55804E58126k058j313k11M78P40J430K348K203R84L65J098J951J988J857K016
55789E72002J653L58q90j380j701k309k748l061m313o794r241j0708j1655j2451
55775E06762j2476j1501j0438r791q888p448o306n766m890l347k348k639l128
$$ y = [1676653, 1628039, 1582513, 1539301, 1498754, 1461191, 1425479, 1390543, 1357036, 1325847, 1296278, 1267379, 1239749, 1214216, 1189922, 1165505, 1141057, 1117173, 1093217, 1068268, 1042815, 1017912, 993597, 969668, 946951, 926258, 907012, 888337, 870509, 854005, 838308, 823074, 809231, 797322, 785955, 773622, 760990, 749681, 739716, 729810, 719253, 707840, 694892, 680212, 665279, 651792, 639599, 627652, 616286, 606810, 599343, 592738, 586321, 580261, 574561, 569079, 564268, 560696, 558126, 556068, 554755, 554544, 555022, 555762, 557192, 559540, 561743, 562727, 563092, 564190, 566141, 568129, 569986, 572002, 573655, 574013, 573123, 571743, 570042, 567733, 564985, 561924, 557611, 550817, 541576, 530868, 519213, 506762, 494286, 482785, 472347, 462556, 453668, 446220, 439914, 434148, 429258, 425911, 423563, 420924, 417796]
55762D17796k707k027k263l231m032m518n128o047p363r155j0778j1097j0103
55749C39347r159r023q858p921o834o296n789m645l383k853k916k869k507j971
55735B64323j320q57j121j901k184j561q41p88j270k050l282m631n107m501l877
55720B29032l931l976l309k415j927j495o14L21P64J030J622K304K618K702K812
55705B25538K713K211J667J324P86k92j562k569l320l902m252m599n295n888n307
55690A97253l434j515n63l03j53j51l17j56N38J219J577K038K741K999K437J741
55674B05951J608J794J749J370O28o47k034k598k220j804j712j192L3Q94O13K3
55658B02456K39J066J710K126K614K888K628K248K127J760O24p86j631j873j953
$$ y = [417796, 415089, 413062, 410799, 407568, 403536, 399018, 393890, 387843, 380480, 371325, 360547, 349450, 339347, 330188, 321165, 312307, 304386, 297552, 291256, 285467, 280822, 277439, 274586, 271670, 268801, 266294, 264323, 263003, 262146, 261025, 259124, 256940, 255379, 254538, 253750, 252480, 250430, 247148, 242517, 237410, 232909, 229032, 225101, 221125, 217816, 215401, 213474, 211979, 211365, 211686, 212450, 213480, 215102, 217406, 220024, 222726, 225538, 228251, 230462, 232129, 233453, 234239, 233947, 232385, 229816, 226496, 222594, 218342, 213743, 208448, 202560, 197253, 193819, 192304, 191741, 191438, 191285, 191134, 190817, 190661, 191199, 192418, 193995, 196033, 198774, 201773, 204210, 205951, 207559, 209353, 211102, 212472, 213100, 212453, 210419, 207821, 205601, 203797, 202085, 200893, 200926, 201820, 202433, 202456, 202695, 203761, 205471, 207597, 210211, 213099, 215727, 217975, 220102, 221862, 222486, 221700, 220069, 218196, 216243]
55643B16243j908j642j467j637j896k060k455l246l975m350m638m910m717m088
55629A73254l829m179m279l610k858k609k359j677j154j183r33K32J428J506P05
55614A48455j57j115k390l226k935k291k431k990k787j834j135j021j064j227
55600A21852j747k106j621p53n58r83r70j35Q25J334J460J319R01L89j44r84j980
55583A16099k108q39O73J024N72P05J631K501L330M962P096Q129P435O331O246
55568A63787P136Q065Q348P618N818L527J546j81k388n035p007p579p279o906
55554A69470o567o169n969o042n798m743l356k641k951l607l589k495q74K97N47
55539A15513K55j6j44k12r5K64N55O09Q42J556K196J995J038N5o30j147j454j491
$$ y = [216243, 214335, 212693, 211226, 209589, 207693, 205633, 203178, 199932, 195957, 191607, 186969, 182059, 177342, 173254, 169425, 165246, 160967, 157357, 154499, 151890, 149531, 147854, 146700, 145517, 144584, 144816, 146244, 147750, 148455, 148298, 147183, 144793, 141567, 138632, 136341, 133910, 130920, 128133, 126299, 125164, 124143, 123079, 121852, 120105, 117999, 116378, 115625, 115067, 114084, 113114, 112979, 113804, 115138, 116598, 117917, 118818, 119207, 119063, 118079, 116099, 113991, 113152, 113825, 114849, 115421, 116126, 117757, 120258, 123588, 128550, 135646, 143775, 151210, 157541, 163787, 170923, 178988, 187336, 194954, 200772, 204299, 205845, 205664, 203276, 198241, 191234, 183655, 176376, 169470, 162903, 156734, 150765, 144723, 138925, 134182, 130826, 128185, 125234, 121627, 118038, 115543, 114669, 114966, 115513, 115768, 115752, 115608, 115396, 115301, 115565, 116120, 116729, 117571, 119127, 121323, 123318, 124356, 124411, 123781, 122634, 121180, 119689]
55521A19689j712k518l297l054j941j207j499k142k289j964j633j518j632j865
55507I1418j823j113m3N15J63o39j321j724j786j314m25K99M43K35J27K03K45
55490H3460J42K0M7J97J84k69r18j094m52N29J069Q63J15p92j339j039l7P97Q53
55471H2336M86K94J97j51n87p95j054j662k075j515l29K81j67j021j540j511q99
55454G0288J58R50P56m1k87L69J063J079O49J82l85r59r10N1J179J479Q40j21
55436G6340r07j435j650j402o45L89J223J418J001N54N12N27k6j006j513j080
55420G2300k62K00K97N52J208J963K371K187J425L16o84j014m33N39Q31l8j222
55403H0536j455p10j95o09j251j260q45o13n08k09M2p5j84J76O04M30j36l79k37
$$ y = [119689, 117977, 115459, 112162, 109108, 107167, 105960, 104461, 102319, 100030, 98066, 96433, 94915, 93283, 91418, 89595, 88482, 88439, 88954, 89117, 88478, 87157, 85433, 83647, 82333, 81908, 82207, 82650, 82885, 83012, 83215, 83460, 83602, 83622, 83669, 83866, 84050, 83781, 82863, 81769, 81317, 81846, 82915, 83778, 83893, 83101, 81762, 80723, 80686, 81483, 82336, 82822, 83116, 83313, 83162, 82575, 81780, 80726, 79064, 76989, 75474, 75145, 75426, 75259, 74238, 72698, 71187, 70288, 70446, 71396, 72152, 72111, 71824, 72193, 73256, 74335, 74984, 75166, 74781, 73822, 72912, 72963, 74142, 75621, 76461, 76340, 75433, 73998, 72348, 70946, 70301, 70690, 71913, 73331, 74332, 74886, 75398, 75925, 75899, 74893, 73380, 72300, 72038, 72238, 72535, 73087, 74295, 76258, 78629, 80816, 82241, 82557, 81873, 80859, 80426, 80965, 81796, 81758, 80536, 79081, 78371, 78176, 77567, 76316, 75056, 74211, 73598, 73090, 72881, 72923, 72848, 72664, 72840, 73444, 73874, 73738, 73359, 73122]
55384G3122j38o3K57N26L00j26k57m39j136j592p04R82J665Q51j14k26J5P9M26
55365G3428J267J707J066N0m09n33r89j587j665j173m77L69J296J647Q66m90j252
55348G3121j051n48l35l26k23nJ93L94O47P94N29j82q17o84K65J258J577J310
55330G5917R33N33pl99k88J8j20o53r56q27o15l96Q5O14O02R6j41J83M41J35l69
55309G4786n00k21J53L32O0o43j163q96j55K78M16Q93J551J450N52R7P81J686
55291G9457J674Q69M3m88o80l34L21M88m2l59J54O85J95r76j632j311m77L86R63
55272G8936Q62O4p14q59o44n54l87J44M93J8p95r09l43m6l09m12M1M85L79Mj81
55251G5273l08p18j210j169m29L79M63j75o52k67N62Q21K55l87n09l15j67j5J16
$$ y = [73122, 72984, 72921, 73178, 73704, 74004, 73878, 73621, 73182, 72046, 70454, 69750, 70732, 72397, 73248, 73134, 72908, 72923, 73002, 73428, 74695, 76402, 77468, 77518, 77109, 76576, 75587, 74000, 72335, 71162, 70685, 71054, 72350, 73997, 74863, 74373, 73121, 72070, 71522, 71187, 70861, 70638, 70633, 70826, 71220, 71867, 72661, 73190, 73008, 72191, 71507, 71772, 73030, 74607, 75917, 76850, 77383, 77376, 76977, 76689, 76707, 76587, 75934, 74978, 74151, 73536, 73140, 73225, 73839, 74441, 74537, 74396, 74579, 75020, 75155, 74786, 74286, 74065, 74218, 74550, 74610, 73967, 72804, 71908, 71753, 72031, 72447, 73340, 74891, 76341, 76893, 76990, 77771, 79457, 81131, 82000, 82043, 81555, 80875, 80541, 80862, 81350, 81308, 80949, 81103, 81788, 81983, 81007, 79375, 78064, 77587, 77973, 78936, 79798, 79862, 79148, 78289, 77645, 77091, 76704, 76848, 77341, 77359, 76564, 75655, 75312, 75266, 74957, 74545, 74586, 75071, 75450, 75454, 75273, 74965, 74247, 73037, 71868, 71439, 71818, 72281, 72106, 71454, 71187, 71749, 72570, 72825, 72438, 71929, 71614, 71447, 71432, 71548]
55232G1548j79q60j054j88R88J297O47j21n28p37p70l29M96J066R68M74J24J33
55214G2975K81J64l80j005j146o71J7N87J045J292J032M14J03L03M18Q2j25K56
55196G5642N89R9p49r06l19J62K34L46N97M95J8j49L02P54O05J9n23q91j094r33
55176G4298k94N33J141J441J544J428R53J72n21o30m4O89Q55L99m0m4K3k93p41
55157H0869p67l46J10M61P95Q35J40j023j657j157j64J16p72k074k620k018r46
55140F9782k92j62m0K59L60J03q5R1L18L07M07J006J803K204K104J740J089R6
55122H1090q32j150q65m72l05l87o16p00k62N28Q70M04j04J72Q48R72N29L04M78
55103H0502M17j04m70k15L51P56R22R37Q43Q54J203J666J731J308Q08M31Qm34
$$ y = [71548, 71369, 70509, 69455, 69267, 70255, 71552, 72199, 72078, 71550, 70813, 70043, 69714, 70210, 71276, 72244, 72718, 72842, 72975, 73256, 73420, 73040, 72035, 70889, 70218, 70235, 70822, 71867, 73159, 74191, 74605, 74708, 75011, 75429, 75511, 75386, 75642, 76231, 76330, 75581, 74675, 74356, 74518, 74752, 75098, 75695, 76190, 76208, 76059, 76361, 77115, 77720, 77739, 77216, 76325, 75231, 74298, 74004, 74537, 75678, 77119, 78663, 80091, 81044, 81216, 80695, 80065, 80021, 80710, 81565, 81964, 81924, 81880, 81903, 81610, 80869, 80102, 79756, 79866, 80327, 81122, 81957, 82097, 81074, 79417, 78260, 78096, 78212, 77440, 75366, 72746, 70728, 69782, 69490, 69328, 69288, 69547, 69907, 70010, 69925, 70016, 70334, 70641, 71048, 72054, 73857, 76061, 78165, 79905, 80994, 81090, 80258, 79108, 78243, 77771, 77466, 77079, 76463, 75763, 75501, 76029, 76899, 77303, 77199, 77371, 78219, 79191, 79720, 80024, 80502, 80919, 80815, 80345, 80130, 80481, 81237, 82159, 83096, 83939, 84793, 85996, 87662, 89393, 90701, 91509, 91940, 91948, 91514]
55085I1514n86l79o7K62O32O88J2r25j010O2J273J612J193O98L47P3O6M11N26
55066I6402k68j618k283j522L6J128J203Q00O97R98J193R42M01k31j022j907k309
55049I2640j696m08N08L25o96j604j559m89P89J213N00o28j327j403j070m23L63
55032H5035Q49R19J146J893K442J843L69q11j220j378j516j105L6J062J104L25
55016I0993m79q20o78k00K95L63j21p13q10k03Q21J640J578M73r66j770j731j417
54998H6255j144n47O20J815K269J870J119M63kl83p91j251j606j641j322r08o46
54981H4170n19k75L02J075J540J347P96N44P03P44M78L96O69N51n16j828k342
54964H7835k121j790j094O64K913M014L380K179J550J321R59N92M12N7o50j073
$$ y = [91514, 90928, 90549, 90482, 90744, 91376, 92064, 92076, 91151, 90141, 90203, 91476, 93088, 94281, 94979, 95326, 95399, 95465, 95876, 96402, 96134, 94516, 92233, 90711, 90747, 91875, 93078, 93878, 94575, 95573, 96766, 97708, 98109, 97878, 96856, 94949, 92640, 90944, 90536, 91044, 91369, 90673, 89069, 87510, 87021, 87810, 89023, 89523, 88895, 87568, 86165, 85095, 84672, 85035, 85884, 86803, 87949, 89842, 92284, 94127, 94496, 93685, 92465, 91087, 89571, 88466, 88502, 89564, 90668, 90993, 90514, 89694, 89016, 88816, 89111, 89474, 89353, 88640, 87830, 87627, 88448, 90088, 91666, 92139, 91173, 89403, 87672, 86255, 85111, 84564, 85184, 86999, 89268, 91138, 92257, 92720, 92718, 92335, 91544, 90293, 88687, 87046, 85724, 84816, 84170, 83651, 83376, 83678, 84753, 86293, 87640, 88436, 88980, 89683, 90427, 90905, 91301, 91970, 92521, 92005, 90177, 87835, 85714, 83924, 82830, 83494, 86407, 90421, 93801, 95980, 97530, 98851, 99810, 100402, 100814, 100871, 100221, 99148]
54948I9148o89m3k1o19j104j032n34J01N40M43j96q80j211j253j115n58N35J673
54930I3185K162J856J214Q69J241K162K802K465J606J417K221L081L380L818N143
54915A28622O680P124O304N228M658M512M505M464L990K628N33j578l278m701
54901A69691n939o706o783o403n910n350m561l543k545j865j602j605j632j621
54887A13626j672j768j643j066j21Q28J445J693J893K438L281L920M037L966M144
54872A35001M441M520M604N140N791N653M564L336K459J447j12j742k853l595
54858A68654m332m839m710m190l898m040m364m561m340l543k581k283k795l229
54844A14949k874k195j912j828j404r12r69j330j287j032j384k212k341j305r2
$$ y = [99148, 98459, 98416, 98395, 97776, 96672, 95640, 95106, 95207, 95747, 96190, 95994, 95114, 93903, 92650, 91535, 90977, 91512, 93185, 95347, 97203, 98417, 99286, 100527, 102689, 105491, 107956, 109562, 110979, 113200, 116281, 119661, 123479, 128622, 135302, 142426, 148730, 153958, 158616, 163128, 167633, 172097, 176087, 178715, 179248, 177670, 174392, 169691, 163752, 157046, 150263, 143860, 137950, 132600, 128039, 124496, 121951, 120086, 118484, 116879, 115247, 113626, 111954, 110186, 108543, 107477, 107356, 108184, 109629, 111322, 113215, 115653, 118934, 122854, 126891, 130857, 135001, 139442, 143962, 148566, 153706, 159497, 165150, 169714, 173050, 175509, 176956, 176844, 175102, 172249, 168654, 164322, 159483, 154773, 150583, 146685, 142645, 138281, 133720, 129380, 125837, 123256, 120973, 118178, 114949, 112075, 109880, 107968, 106140, 104736, 103824, 102855, 101525, 100238, 99206, 97822, 95610, 93269, 91964, 91872]
54829I1872L44K92M42O77M65n3k72j34k06o62r11m75K16L69l3k00L28R56Q61J68
54809I4044k75j33Q9K3K1M34R67J227J377J668J779J271M34lJ65M95O15N07K04
54790A04909k04l65k3M62M90N7l13l92m21m88l50j7J83K36O15J438K046J820J069
54771A10752O73J043J825K510K960L290L535L649L686L843M178M483M601M770
54757A55798N343O095O195N099L198J292l04j833l419m766n493n563n328n282
54743A51032n613n878n424m284l250k834k610k009j310j051q87K6J524K279J484
54728A21195l0q31m47N48J556K449L224L722L821L630L409L426L846M624N439
54713A59581N855N573M592L139J505r9j545k701l426l747l952m409n223o086o496
$$ y = [91872, 92216, 92508, 92950, 93627, 94092, 94039, 93767, 93633, 93427, 92765, 91854, 91379, 91595, 91964, 91931, 91731, 92059, 93015, 93876, 94044, 93769, 93636, 93725, 93748, 93769, 94203, 95170, 96397, 97774, 99442, 101221, 102492, 102926, 102923, 103088, 103583, 104198, 104705, 104909, 104705, 104340, 104317, 104779, 105269, 105326, 105013, 104621, 104200, 103712, 103362, 103345, 103528, 103764, 104379, 105817, 107863, 109683, 110752, 111425, 112468, 114293, 116803, 119763, 123053, 126588, 130237, 133923, 137766, 141944, 146427, 151028, 155798, 161141, 167236, 173431, 178530, 181728, 183020, 182716, 180883, 177464, 172698, 167205, 161642, 156314, 151032, 145419, 139541, 134117, 129833, 126583, 123749, 121139, 119130, 117820, 116769, 115882, 115908, 117432, 119711, 121195, 121165, 120334, 119887, 120435, 121991, 124440, 127664, 131386, 135207, 138837, 142246, 145672, 149518, 154142, 159581, 165436, 171009, 175601, 178740, 180245, 180146, 178601, 175900, 172474, 168727, 164775, 160366, 155143, 149057, 142561]
54698A42561o150n196m091l157k364j571q20k50Q8P1n92j875k998l091k240j375
54682A06950r95p03j48K60L8n73r49r13o63k45L82J014J357J353J042L50n87j255
54664A05715j255p50j25M07N89N1j011j616j103j11K64n3k04K34P67Q47N02K6
54646A03174l44m33k68j63k99l85j40J60J64J39M84Q42N49j56l03M15J244J478
54628A06158J220Q22L72m2k11k31m82r56j148p92k14J96L47K29j10l24j12J67
54610A04889o2m79j12J077J824J275J46l65j08K54M15M90M03J3l70k98J27L67
54592A09486J99j31l50l72j75J09R9m19j025j054m00L10L90k46j057j388j011
54575A02965l18J38K11J60J32mk36k92q3J08Q7M9J83L38L83N09Q60J195J288J318
$$ y = [142561, 136411, 131215, 127124, 123967, 121603, 120032, 119212, 118962, 119050, 119121, 118529, 116654, 113656, 110565, 108325, 106950, 105955, 105252, 105104, 105364, 105402, 104829, 103880, 102967, 102304, 102059, 102441, 103455, 104812, 106165, 107207, 107557, 106970, 105715, 104460, 103710, 103585, 103992, 104581, 104632, 103621, 102005, 100902, 100791, 101055, 101002, 100798, 101032, 101799, 102646, 103148, 103174, 102830, 102397, 102129, 101966, 101667, 101282, 101142, 101302, 101466, 101605, 102089, 102931, 103480, 103324, 103021, 103436, 104680, 106158, 107378, 108200, 108572, 108530, 108319, 108088, 107606, 106650, 105502, 104710, 104496, 104692, 105039, 105268, 105158, 104834, 104722, 104889, 104827, 104348, 104236, 105313, 107137, 108412, 108558, 108193, 108085, 108339, 108754, 109244, 109647, 109660, 109290, 108992, 109119, 109486, 109685, 109554, 109204, 108832, 108657, 108766, 108865, 108446, 107421, 106367, 105967, 106277, 106667, 106421, 105364, 103976, 102965, 102647, 102785, 102996, 103156, 103288, 103284, 103048, 102756, 102673, 102781, 102868, 102917, 103100, 103438, 103821, 104330, 105190, 106385, 107673, 108991]
54555A08991J441J318N86l60p05k52L32M36K24L22J033K022K636K433J549N75
54539A22581l6l50o65r53q54k48M28O29L34N4J45L04j1p24j071n62K57M07l15
54520A19350j188j546j443j234r66m48L31J132J634J531O70o97j949k595k548
54505A10034j997j158l17J54Q6k61l90K5Q65J615J684R67Q4k01K08P12P92M77
54487A13379N6l06n11m48j64J41L94O73R12Q99O77N52O42O93N40L82M10N59P55
54468A20235J058J336J200N69p0k35m5J05J18J67L06L74J96l18r82j216n23P07
54450A22982J352Q54j19o48p12p58o83r9O36N83m37j403j313l48M92N54m3q20
54432A20070j384j483j007j16O90Q38K26n44o61M9R81J545J798K112K424K257
$$ y = [108991, 110432, 111750, 112336, 111976, 111271, 111019, 111351, 111787, 112011, 112333, 113366, 115388, 118024, 120457, 122006, 122581, 122545, 122195, 121530, 120577, 119723, 119475, 119903, 120532, 120866, 120920, 121065, 121369, 121358, 120634, 119563, 119001, 119258, 119665, 119350, 118162, 116616, 115173, 113939, 112973, 112525, 112856, 113988, 115622, 117153, 117823, 117126, 115177, 112582, 110034, 108037, 106879, 106562, 106716, 106802, 106541, 106151, 106176, 107041, 108656, 110340, 111307, 111391, 111190, 111398, 112110, 112902, 113379, 113435, 113129, 112618, 112170, 112006, 112147, 112541, 113214, 114126, 115025, 115702, 116254, 116896, 117589, 118129, 118511, 118921, 119480, 120235, 121293, 122629, 123829, 124398, 124328, 124093, 124048, 124153, 124271, 124438, 124744, 125118, 125314, 124996, 124014, 122798, 122275, 122982, 124334, 125188, 125069, 124421, 123709, 122951, 122268, 122169, 122805, 123388, 122951, 121548, 120235, 119887, 120379, 120933, 120890, 120070, 118686, 117203, 116196, 116080, 116770, 117608, 117834, 117290, 116629, 116678, 117659, 119204, 121002, 123114, 125538, 127795]
54416A27795J444M23k59n39p24r87j094p02J82J059J324Q01j18q31r61n30J38
54399A26421O67Q78Q62P81O70N53O28J003J359J213N56p2k06J31P11J372J847
54382A39374J727R34Jm86n26n41p41r12p67k28N73J377J856J763J123K62l73m97
54364A43919k02K04O51J415K586L606L799L287K879L016L340L367L082K598J744
54349A79291M34r56j977k632l147l466l407l110k979l177l460l458k935j947r54
54334A42120n63r18j449j473r19k97o3k88p72j211j295q74j19O21J019R22M04
54317A34845k23n92n90l80j30J07K79K89R1l08q74j330j163k66N97N08l68r22
54299A29570n62J55N14N65O36O11K78j17k42k78n64q75o62J38R83J350J118M78
$$ y = [127795, 129239, 129662, 129403, 128864, 128140, 127153, 126059, 125357, 125539, 126598, 127922, 128723, 128605, 127774, 126813, 126283, 126421, 127088, 127966, 128828, 129609, 130279, 130832, 131460, 132463, 133822, 135035, 135591, 135519, 135313, 135444, 136155, 137527, 139374, 141101, 142035, 142036, 141550, 141024, 140483, 139742, 138830, 138063, 137835, 138408, 139785, 141641, 143404, 144527, 144789, 144416, 143919, 143717, 143921, 144572, 145987, 148573, 152179, 155978, 159265, 162144, 165160, 168500, 171867, 174949, 177547, 179291, 179725, 178769, 176792, 174160, 171013, 167547, 164140, 161030, 158051, 154874, 151414, 147956, 145021, 143074, 142120, 141557, 140639, 139190, 137717, 136798, 136501, 136438, 136150, 135378, 134167, 132872, 131998, 131879, 132500, 133519, 134441, 134845, 134622, 134030, 133440, 133060, 132930, 133037, 133316, 133605, 133696, 133388, 132514, 131184, 130021, 129755, 130352, 130860, 130492, 129570, 129008, 129163, 129677, 130242, 130878, 131489, 131767, 131650, 131408, 131130, 130566, 129691, 129029, 129167, 130150, 131500, 132618, 133096]
54281A33096j45k41L63J240J736J576J003M64K47K60J40k62n49l24O2r8p55j069
54263A36744o59j06M7P2L31N85M95K70K09K39L47Q29J570J823J330R12J159J375
54245A47572P41k51o17m63n68r07q90o62q28j085o29K05J61r64j967k083j817
54228A34948j554q06N27J435J208O16O70J087Q99K1p28q26m77o9J45Nl42l76J77
54209A36560Q61J009N95J08k27o13j102j293q01J26O44J61r16j448q10L84J076
54192A34314J000O27K24k84o56l89L68P49L51k42m00l07l91n34l92o9J32L27Q22
54173A35250J481J765J378N85q5k65o8l2n61j322j603j266q66p01l88K95Q16O90
54155A35103L95P03J436J575O12q31j770j793j203n74k91k83j90J38L86K38j26
$$ y = [133096, 132951, 132710, 133073, 134313, 136049, 137625, 138628, 139092, 139339, 139599, 139739, 139477, 138928, 138604, 138666, 138568, 137813, 136744, 136085, 135979, 136026, 136098, 136429, 137014, 137509, 137779, 137988, 138227, 138574, 139403, 140973, 142796, 144126, 145038, 146197, 147572, 148313, 148062, 147445, 146982, 146414, 145507, 144617, 143955, 143127, 142042, 141413, 141618, 141779, 140815, 138848, 136765, 134948, 133394, 132588, 133115, 134550, 135758, 136374, 137044, 138131, 139030, 139051, 138323, 137497, 137020, 136951, 137096, 137101, 136759, 136383, 136560, 137421, 138430, 139025, 139133, 138906, 138293, 137191, 135898, 135097, 135223, 135867, 136028, 135112, 133664, 132854, 133238, 134314, 135314, 135941, 136165, 135881, 135225, 134836, 135204, 135953, 136304, 136062, 135662, 135355, 134964, 134430, 134038, 133969, 134101, 134428, 135250, 136731, 138496, 139874, 140459, 140374, 140109, 140041, 140009, 139448, 138126, 136523, 135257, 134391, 133690, 133302, 133597, 134413, 135103, 135498, 136201, 137637, 139212, 139824, 138993, 137223, 135430, 134227, 133653, 133362, 133079, 132889, 133027, 133413, 133651, 133525]
54138A33525l08k50k00k22j19J86N44Q66J171J343J140N64l5l12k54J9M49R57
54120A39064J359J545J619J607J224K78p54j017l59L82M45J35J91N36M83Q8K56
54103A47082J153J576N70j004j567q75p0J79L25P11Q25K54m97o83k90K05N62Q67
54085A49323J199J652K441L528M433M682M364L963L814L859L778L213K110R56
54071A93315L51K18k16j411k802l451l161k568k274k234k044j565j097j020j316
54056A68725j495j072j06Q53J254R49K16l95l11O41K024L141L590L452L089K927
54040A87482L211L761M172M461N131O318P326P443O880O290N794N185M727M863
54026B63044N311N420N248N364N604N190M157L479L481L328K517J705J385Q07
$$ y = [133525, 133217, 132967, 132767, 132545, 132426, 132612, 133156, 134022, 135193, 136536, 137676, 138240, 138205, 137893, 137639, 137658, 138107, 139064, 140423, 141968, 143587, 145194, 146418, 146696, 145942, 144925, 144566, 144948, 145393, 145528, 145719, 146255, 146738, 146826, 147082, 148235, 149811, 150381, 149377, 147810, 146935, 146865, 147044, 147369, 148080, 148905, 149159, 148662, 147979, 147689, 147894, 148456, 149323, 150522, 152174, 154615, 158143, 162576, 167258, 171622, 175585, 179399, 183258, 187036, 190249, 192359, 193315, 193666, 193884, 193668, 192257, 189455, 186004, 182843, 180275, 178001, 175767, 173723, 172158, 171061, 170041, 168725, 167230, 166158, 166052, 166905, 168159, 169108, 169324, 168929, 168618, 169259, 171283, 174424, 178014, 181466, 184555, 187482, 190693, 194454, 198626, 203087, 208218, 214536, 221862, 229305, 236185, 242475, 248269, 253454, 258181, 263044, 268355, 273775, 279023, 284387, 289991, 295181, 299338, 302817, 306298, 309626, 312143, 313848, 315233, 316040]
54012C16040q47l072m759n690o395p034p349p365p319p096o479n749n381n301
53998B36204n036m443l742l066k434j973j739j557j377j478j883k107j878j641
53984B01850j766j865j543j248j500j779j261k85L4m75q56n70j83k09l76l53l90
53967A87225o53p32l39J04J42J12O04J488K043J951J572J305J229J426K122L176
53951B02775L793L285K072J475K225L674M755N342O037O935P463P579Q162R725
53937B75297J1500J2422J2514J2487J2293J0981P980L936J23k574m055m775n168
53924C42961n177m401k856j222j11O45J581K818M079N142N828N878N432N293O001
53909C71891O831O526M914L136K136J738J306O81R5l35p13j245k157l462m673
$$ y = [316040, 315193, 312121, 307362, 301672, 295277, 288243, 280894, 273529, 266210, 259114, 252635, 246886, 241505, 236204, 231168, 226725, 222983, 219917, 217483, 215510, 213771, 212214, 210837, 209359, 207476, 205369, 203491, 201850, 200084, 198219, 196676, 195428, 193928, 192149, 190888, 190603, 190637, 190162, 189306, 188736, 188553, 188344, 187968, 187615, 187225, 186572, 185840, 185501, 185605, 185747, 185859, 186463, 187951, 189994, 191945, 193517, 194822, 196051, 197477, 199599, 202775, 206568, 209853, 211925, 213400, 215625, 219299, 224054, 229396, 235433, 242368, 249831, 257410, 265572, 275297, 286797, 299219, 311733, 324220, 336513, 347494, 355474, 359410, 359533, 356959, 352904, 348129, 342961, 337784, 333383, 330527, 329305, 329194, 329839, 331420, 334238, 338317, 343459, 349287, 355165, 360597, 365890, 371891, 378722, 385248, 390162, 393298, 395434, 397172, 398478, 399159, 399254, 398919, 398206, 396961, 394804, 391342, 386669]
53894C86669n183m987m726m888n379n975o740p765q745r183q849p911o747n759
53880B93832n186m970m885m855m944n052m826m105l333l215l895m575m256k909
53866B32826j611j331j869k382k581k745k731j978p11j63j033k428l047k729k165
53851B03322j660j085p08j013j826k361k196j565q04q9L51M13L58M00K82j97n46
53834A91076k65K08J21k78q7P07J165R29P20R98J169O57j63o49p82q17o00J33
53816A94242J162J975K310K256K063K035K319K644K678K642L114M153N204N873
53802B34670O192O056N181L859K979K951L291L578L994M592M798M275L565L267
53788B93248L133K686K062J593J023n3j288j927j874j723j855k179k597l196l895
$$ y = [386669, 381486, 376499, 371773, 366885, 361506, 355531, 348791, 341026, 332281, 323098, 314249, 306338, 299591, 293832, 288646, 283676, 278791, 273936, 268992, 263940, 259114, 255009, 251676, 248461, 244566, 239991, 235735, 232826, 231215, 229884, 228015, 225633, 223052, 220307, 217576, 215598, 214887, 214724, 213691, 211263, 208216, 205487, 203322, 201662, 200577, 199869, 198856, 197030, 194669, 192473, 190908, 190104, 190015, 190366, 190779, 191137, 191537, 191819, 191622, 191076, 190811, 191019, 191140, 190862, 190775, 191482, 192647, 193576, 194296, 195294, 196463, 197120, 196957, 196308, 195526, 194709, 194109, 194242, 195404, 197379, 199689, 201945, 204008, 206043, 208362, 211006, 213684, 216326, 219440, 223593, 228797, 234670, 240862, 246918, 252099, 255958, 258937, 261888, 265179, 268757, 272751, 277343, 282141, 286416, 289981, 293248, 296381, 299067, 301129, 302722, 303745, 303692, 302404, 300477, 298603, 296880, 295025, 292846, 290249, 287053, 283158]
53773B83158m426m723n008n456o039o545o598n931m808l867l297k598j541p65
53759B21556q88j443j530j185j254j996k667k642k178j800j550j242r38p80o10
53744A98853j94L55O62N28R0m02p84r76r10n61JO02J040J190J061P66N00M45O05
53725B02871P61P84Q86J315J886K137J992J875K005K034J620J010P07Q47J226
53710B23956J667J983J847J210P20J161K455L664M046L699L083K445J984K089
53696B56009K890L718L608K493J458J483K262K674K198J396R27P22L89o3l70n53
53680B81241p54q40o87o77j254k059k225j609j013r93j177j063q43r47j251j300
53664B62549j008o08k10K00M63L99J05j89m08m79j98M10Q24N64j48o56p01n87
$$ y = [283158, 278732, 274009, 269001, 263545, 257506, 250961, 244363, 238432, 233624, 229757, 226460, 223862, 222321, 221556, 220668, 219225, 217695, 216510, 215256, 213260, 210593, 207951, 205773, 203973, 202423, 201181, 200243, 199463, 198853, 198659, 199014, 199676, 200204, 200294, 199892, 199108, 198132, 197222, 196661, 196662, 197264, 198304, 199494, 200555, 201321, 201821, 202266, 202871, 203632, 204416, 205302, 206617, 208503, 210640, 212632, 214507, 216512, 218546, 220166, 221176, 221883, 222730, 223956, 225623, 227606, 229453, 230663, 231383, 232544, 234999, 238663, 242709, 246408, 249491, 251936, 253920, 256009, 258899, 262617, 266225, 268718, 270176, 271659, 273921, 276595, 278793, 280189, 281116, 281838, 282227, 282164, 281794, 281241, 280487, 279647, 278960, 278283, 277029, 274970, 272745, 271136, 270123, 269130, 267953, 266890, 266047, 265100, 263849, 262549, 261541, 260933, 260723, 260923, 261386, 261785, 261890, 261701, 261293, 260814, 260616, 261026, 261850, 262414, 262266, 261610, 260909, 260322]
53646B60322n63m20K10J342K480K928K414J502J132J587K178K190J764J569J826
53631B82461K158K232K108J976J917J932J950J897J942K447L389M121M105L753
53617C18388L950M847N703N958N861N811N667N105M354M028M266M495M099L105
53603C85637K032J293Q93P01O68O91N08J8m31m20j14j33p21j379j579j458j479
53586C84727j656j557r95l38j24n83j549k544k963k429j195r1R0p44j921k595
53570C63533k498k036j688j485j253j084j167j251p99J82R65J018O80O59J069
53555C54845J391J198O22J54J80P06J388J888K171K365K394K126J820J991K734
53540C77973L614M351N055N660N729N209M801N082N798O498P315Q445R396R610
$$ y = [260322, 259759, 259339, 259549, 260891, 263371, 266299, 268713, 270215, 271347, 272934, 275112, 277302, 279066, 280635, 282461, 284619, 286851, 288959, 290935, 292852, 294784, 296734, 298631, 300573, 303020, 306409, 310530, 314635, 318388, 322338, 327185, 332888, 338846, 344707, 350518, 356185, 361290, 365644, 369672, 373938, 378433, 382532, 385637, 387669, 388962, 389855, 390556, 391224, 391915, 392423, 392441, 392010, 391590, 391476, 391343, 390622, 389243, 387664, 386206, 384727, 383071, 381514, 380519, 380181, 380057, 379474, 377925, 375381, 372418, 369989, 368794, 368703, 368793, 368049, 366128, 363533, 361035, 358999, 357311, 355826, 354573, 353489, 352322, 351071, 350272, 350454, 351419, 352437, 353117, 353776, 354845, 356236, 357434, 358056, 358210, 358390, 359096, 360484, 362372, 364543, 366908, 369302, 371428, 373248, 375239, 377973, 381587, 385938, 390993, 396653, 402382, 407591, 412392, 417474, 423272, 429770, 437085, 445530, 454926, 464536]
53526D64536R526J0060J1196J2045J2336J2774J3680J4329J4192J4076J5181J7414
53514F21345J9437K0271K0259K0420K1313K2671K3826K4309K4218K4053K4150
53503H66272K4248K3849K2907K1975K1492K1214K0583J9564J8717J8429J8450
53492A097700J8358J8106J7831J7454J6905J6528J6722J7261J7503J7263J6963
53481A288594J6844J6615J5980J4980J3615J1696R309O963M936K929O55j707l936
53468A397473o146q365j0232j1520j2456j3231j3652j3738j3990j4583j4944j4859
53456A249757j5228j6790j8702j9551j9377j9445k0103k0243j9146j7567j6514
53445A047091j5947j5307j4487j3547j2114r873p338n401m287l508k657j760r46
$$ y = [464536, 474062, 484122, 495318, 507363, 519699, 532473, 546153, 560482, 574674, 588750, 603931, 621345, 640782, 661053, 681312, 701732, 723045, 745716, 769542, 793851, 818069, 842122, 866272, 890520, 914369, 937276, 959251, 980743, 1001957, 1022540, 1042104, 1060821, 1079250, 1097700, 1116058, 1134164, 1151995, 1169449, 1186354, 1202882, 1219604, 1236865, 1254368, 1271631, 1288594, 1305438, 1322053, 1338033, 1353013, 1366628, 1378324, 1387633, 1394596, 1399532, 1402461, 1403116, 1401409, 1397473, 1391327, 1382962, 1372730, 1361210, 1348754, 1335523, 1321871, 1308133, 1294143, 1279560, 1264616, 1249757, 1234529, 1217739, 1199037, 1179486, 1160109, 1140664, 1120561, 1100318, 1081172, 1063605, 1047091, 1031144, 1015837, 1001350, 987803, 975689, 965816, 958478, 953077, 948790, 945282, 942625, 940865, 939919]
53432I39919j98M67R89J542K536M177O114P651Q441Q844R618J1217J3386J5423
53418A030126J6722J7195J7406J8262K0223K2769K4921K6374K7690K9278L0803
53407A281769L1937L3095L4852L7036L9089M0992M3143M5467M7406M8713M9640
53396A733139N0356N0817N1233N2006N3059N3817N3923N3505N2687N1341M9525
53385B305408M7631M5942M4373M2680M0560L7547L3415K8695K4286K0421J6482
53374B687440J1964P050K083k959q213j3615j9073k4590k9955l4715l8647m1954
53362B494816m4832m7168m8774m9594m9667m9184m8554m7957m6911m4934m2605
53351A974636m1238m1276m1691m1336m0242l9122l8249l7341l6149l4588l2605
$$ y = [939919, 939721, 940188, 941177, 942719, 945255, 949432, 955546, 963197, 971638, 980482, 990100, 1001317, 1014703, 1030126, 1046848, 1064043, 1081449, 1099711, 1119934, 1142703, 1167624, 1193998, 1221688, 1250966, 1281769, 1313706, 1346801, 1381653, 1418689, 1457778, 1498770, 1541913, 1587380, 1634786, 1683499, 1733139, 1783495, 1834312, 1885545, 1937551, 1990610, 2044427, 2098350, 2151855, 2204542, 2255883, 2305408, 2353039, 2398981, 2443354, 2486034, 2526594, 2564141, 2597556, 2626251, 2650537, 2670958, 2687440, 2699404, 2706454, 2708537, 2705578, 2697365, 2683750, 2664677, 2640087, 2610132, 2575417, 2536770, 2494816, 2449984, 2402816, 2354042, 2304448, 2254781, 2205597, 2157043, 2109086, 2062175, 2017241, 1974636, 1933398, 1892122, 1850431, 1809095, 1768853, 1729731, 1691482, 1654141, 1617992, 1583404, 1550799]
53340A550799l0358k8316k6779k5518k4131k2480k0525j8168j5651j3704j2823
53329A312346j2702j2802j3135j3903j4674j4646j3784j3008j3051j3561j3667
53318A163413j3046j2025j0818r186p056n029l798l129k023q0J853K846L208M038
53304A109168N762P831R677J1195J2306J2964J3718J5454J8177K0751K2268K3051
53292A282322K3840K4685K5178K5306K5315K5076K4159K2531K0616J8706J6641
53281A534375J4116J1075P837M849K169p10m188p761j0368j1643j2342j3435j5291
53268A498683j7853k0880k3659k5215k5384k5178k5590k6440k6907k6712k6213
53257A228652k5772k5569k5720k6015k5905k5247k4717k4877k5244k4988k4164
$$ y = [1550799, 1520441, 1492125, 1465346, 1439828, 1415697, 1393217, 1372692, 1354524, 1338873, 1325169, 1312346, 1299644, 1286842, 1273707, 1259804, 1245130, 1230484, 1216700, 1203692, 1190641, 1177080, 1163413, 1150367, 1138342, 1127524, 1118338, 1111282, 1106253, 1102455, 1099326, 1097303, 1097223, 1099076, 1101922, 1105130, 1109168, 1114930, 1122761, 1132438, 1143633, 1155939, 1168903, 1182621, 1198075, 1216252, 1237003, 1259271, 1282322, 1306162, 1330847, 1356025, 1381331, 1406646, 1431722, 1455881, 1478412, 1499028, 1517734, 1534375, 1548491, 1559566, 1567403, 1572252, 1574421, 1573711, 1569523, 1561762, 1551394, 1539751, 1527409, 1513974, 1498683, 1480830, 1459950, 1436291, 1411076, 1385692, 1360514, 1334924, 1308484, 1281577, 1254865, 1228652, 1202880, 1177311, 1151591, 1125576, 1099671, 1074424, 1049707, 1024830, 999586, 974598, 950434]
53246I50434k3481k3113k2602k1841k1264k0994k0564j9608j8264j6735j5032
53235G26936j3300j1915j1026j0396r815r285q716p999p459p743r000j0514j1442
53222E98326j1640j1558j1598j1831j2170j2541j2914j3242j3397j3184j2507
53211D61744j1485j0320r196q376q212q718r257r059q101p225p199p863q383q222
53197C40128p653p252p103o810o231n740n528n086l988k872k800l674m206l647
53183B67538k704k270k207j973j708j813j962j545p56l46m98p69j024j517k088
53168B44358k112j460p42m24l28j97j42k62l35j94qnk21p07j527k439k869k502
53150B27884j621p96m23n51q86r74o43k12QK07P04J341J693J740J722J489P70
$$ y = [950434, 926953, 903840, 881238, 859397, 838133, 817139, 796575, 776967, 758703, 741968, 726936, 713636, 701721, 690695, 680299, 670484, 661199, 652483, 644484, 637025, 629282, 620282, 609768, 598326, 586686, 575128, 563530, 551699, 539529, 526988, 514074, 500832, 487435, 474251, 461744, 450259, 439939, 430743, 422367, 414155, 405437, 396180, 387121, 379020, 371795, 364596, 356733, 348350, 340128, 332475, 325223, 318120, 311310, 305079, 299339, 293811, 288725, 284737, 281865, 279065, 275391, 271185, 267538, 264834, 262564, 260357, 258384, 256676, 254863, 252901, 251356, 250600, 250254, 249756, 248987, 247963, 246446, 244358, 242246, 240786, 240044, 239620, 239292, 239095, 238953, 238691, 238356, 238162, 238154, 238149, 237928, 237221, 235694, 233255, 230386, 227884, 226263, 225467, 225044, 224493, 223607, 222633, 221990, 221778, 221786, 221993, 222697, 224038, 225731, 227471, 229193, 230682, 231452]
53133B31452k5j13M46O86J19n94p61n94n52m38J40Q76J124Q48N57M62K39l24r75
53114B32573j285j046m03K18L91R2k24j87M2K3m47j149j628j437n28M12M50n27
53096B25340j516j573r36n24o63q97q51o83o10n89n85o54o44k60L68O48L73J80
53078B15924O77J397J194j94j618j773o54N90J072R24P20N95K84k87q64j255j472
53061B15260j530j414j301j470j789j677q25K57Q10P41N94P33R12Q03M86K30R0
53044B10910j0J6K91O27O21J35n42j010j076p10k0O55Q40L76l58p88o38pQ06J394
53024B11512J405R84P84J241J859J685N38p03j112o55K7M35N08L89K28J29P2r4
53006B19232m77r42j149q03J08J147J649J276L64m52q23p25j85O01J053P43J47
$$ y = [231452, 231427, 231314, 231760, 232446, 232565, 231971, 231210, 230616, 230064, 229626, 229766, 230642, 231766, 232614, 233171, 233633, 233872, 233548, 232573, 231288, 230242, 229839, 230057, 230448, 230540, 230316, 230129, 230171, 230194, 229747, 228598, 226970, 225533, 225005, 225417, 225867, 225340, 223824, 222251, 221315, 220791, 220128, 219231, 218380, 217697, 217087, 216498, 215913, 215259, 214615, 214355, 214723, 215371, 215744, 215924, 216601, 217998, 219192, 218998, 217380, 215607, 214953, 215543, 216615, 217539, 218259, 218854, 219138, 218851, 217987, 216732, 215260, 213730, 212316, 211015, 209545, 207756, 206079, 205254, 205511, 206321, 207062, 207656, 208389, 209301, 210104, 210590, 210820, 210910, 210900, 210916, 211207, 211834, 212455, 212590, 212048, 211038, 209962, 209252, 209232, 209887, 210727, 211103, 210745, 209957, 209319, 209312, 210118, 211512, 212917, 213901, 214685, 215926, 217785, 219470, 220008, 219305, 218193, 217538, 217565, 218000, 218508, 218897, 219125, 219254, 219326, 219232, 218755, 217813, 216664, 215861, 215969, 217116, 218765, 220041, 220405, 219953, 219130, 218405, 218220, 218821, 219874, 220617, 220764]
52989B20764K21J091J796J577P80J40j84l47k15L55R96J251J271J538K105K577
52973B35716K786K876K862K585K058J502R95M41j98q14j211j088k88P55J199P52
52957B50928O5k15k93o46j076j089q42r39j399j609j304r06q44j150j764k674
52941B34243l555l805l068j517L81K024K786K387J223M9o14o23j43K88P5o30r06
52924B28595l37K43k1o35n94m9K3m48n40K6M21P6n41q67r19p72k58M64Q09O34
52904B25310L68J08n51j520j937j380m73J01L81N66N16K80L14P34J057J135J471
52887B26480K093K100J003l18q03o26o06q32p83l32J62N21Q26J071J232J410J530
52870B34128J298P52L36J67j35n86n97l9L67K45J70M98N93J26J5R66J964J651
$$ y = [220764, 220985, 222076, 223872, 225449, 226229, 226369, 226185, 225838, 225623, 225978, 226974, 228225, 229496, 231034, 233139, 235716, 238502, 241378, 244240, 246825, 248883, 250385, 251380, 251821, 251623, 250809, 249598, 248510, 248222, 248977, 250176, 250928, 250993, 250778, 250485, 249839, 248763, 247674, 246832, 245893, 244494, 242885, 241581, 240675, 239831, 238681, 236917, 234243, 230688, 226883, 223815, 222298, 222679, 224703, 227489, 229876, 231099, 231148, 230534, 229911, 229768, 230056, 230131, 229501, 228595, 228258, 228501, 228480, 227845, 227251, 227202, 227225, 226777, 226237, 226263, 226684, 226760, 226219, 225352, 224433, 223661, 223403, 223867, 224676, 225310, 225678, 225786, 225235, 223715, 221778, 220398, 219925, 220026, 220407, 220973, 221489, 221769, 222083, 222817, 223874, 225009, 226480, 228573, 230673, 231676, 231358, 230555, 229929, 229323, 228491, 227708, 227376, 227538, 228059, 228885, 229956, 231188, 232598, 234128, 235426, 236178, 236514, 236681, 236546, 235960, 235363, 235324, 235691, 235936, 236106, 236604, 237197, 237323, 237338, 238304, 240268, 241919]
52852B41919L94l95n01r27k004k975l428l732m016l887l295k616j840p34K08J64
52836B12335o56j187j136j232j675j680r38k87k79k36N64J637K101J939J661J236
52820B12167K84r77j760j688j168q28q20p43j45Q63J616J649J286J149J309J463
52804B13657J589J800J746R64k06r47j174j536k082k037j155l08j69l17k09j62
52788B09454o30j207j230q08m56j76L16P90P85M78M77Q40R85N62j18n63n78k77
52770B08644kj35o54r85p00j44K9k13l34j34l7l25o11l74K68O57M19p3j95J38
52750B05239L92K41P7M67J267J844K047K290K627K425J402K70j07J57L85M20P20
52733B22163J451K185K477K263J671R12L56K37K78j5n81q07m16Q9J24k03l48j46
$$ y = [241919, 242313, 241918, 241417, 240490, 238486, 235511, 232083, 228351, 224335, 220448, 217153, 214537, 212697, 211963, 212171, 212335, 211679, 210492, 209356, 208124, 206449, 204769, 203831, 203544, 203265, 203029, 203593, 205230, 207331, 209270, 210931, 212167, 212451, 211474, 209714, 208026, 206858, 206030, 205210, 204467, 204322, 205185, 206801, 208450, 209736, 210885, 212194, 213657, 215246, 217046, 218792, 219756, 219550, 218603, 217429, 215893, 213811, 211774, 210619, 210311, 210142, 209825, 209616, 209454, 208824, 207617, 206387, 205579, 205123, 204947, 205263, 206053, 206838, 207316, 207793, 208633, 209618, 210180, 210062, 209499, 208921, 208644, 208642, 208507, 207853, 206868, 206168, 206024, 206053, 205840, 205506, 205372, 205335, 205010, 204399, 204025, 204293, 204950, 205369, 205296, 205101, 205239, 205631, 205872, 205949, 206416, 207683, 209527, 211574, 213864, 216491, 218916, 220318, 220588, 220481, 220638, 221023, 221443, 222163, 223614, 225799, 228276, 230539, 232210, 233122, 233478, 233715, 233993, 233978, 233397, 232590, 232174, 232263, 232387, 232184, 231836, 231690]
52715B31690J9k09p58j337j775j937j586o33M86J106J098R54R48O49k77j237j355
52698B25846p97n54q74p93L46J744K084J189K5n49m28N9M82M18j59o75n98k15
52680B26551k29p29j062p95k41R6R0j26m47p43q60q32q45q89o76r8N24P93O87
52661B20169M93M64O15Q11R73J179J532J881J874J493J333J998L305M332M265
52646B46717K985R90q90j859j733j193j095j499j816j760j566j224l23J016J769
52631B38519J219L3m47K43J419K316K768K905K771K361J613L81j247k615k981
52616B49258k419j819j830k162k198j846j466j227r28m74q4M2N1K00M01K67l14
52599B33452q52p45q1M17L16pJK61K96K9j93k61l92n61m21O1M49N60P25J037R76
$$ y = [231690, 231709, 231500, 230742, 229405, 227630, 225693, 224107, 223474, 223960, 225066, 226164, 227118, 228066, 228715, 228438, 227201, 225846, 225049, 224495, 223621, 222828, 223174, 224918, 227002, 228191, 228216, 227667, 227239, 227298, 227780, 228198, 228039, 227364, 226766, 226551, 226322, 225593, 224531, 223736, 223495, 223591, 223681, 223555, 223108, 222365, 221505, 220673, 219828, 218939, 218263, 218165, 218689, 219482, 220169, 220662, 221126, 221741, 222552, 223525, 224704, 226236, 228117, 229991, 231484, 232817, 234815, 238120, 242452, 246717, 249702, 250692, 249802, 247943, 246210, 245017, 243922, 242423, 240607, 238847, 237281, 236057, 235734, 236750, 238519, 239738, 239771, 239324, 239567, 240986, 243302, 246070, 248975, 251746, 254107, 255720, 256101, 254854, 252239, 249258, 246839, 245020, 243190, 241028, 238830, 236984, 235518, 234291, 233363, 232889, 232805, 232847, 232898, 233098, 233499, 233766, 233452, 232600, 231855, 231774, 232191, 232507, 232500, 232501, 232762, 233058, 233087, 232894, 232633, 232241, 231680, 231259, 231320, 231769, 232329, 233054, 234091, 235067]
52578B35067K70l74r9Q88J610J584J102M56l33r73r91n21k90n84q60p02m41m01
52560B34408k85J11K09n03j375j350n41r6m34o76j31N70M57k87o32j87L16R1p26
52541B28939j367j333p89k31L7R9K04L97M37K04l5J05N69R30J000J086J423J658
52523B33333J294N51K61P68J414J388P02j3m07n71m41K61J426K428K799K687K471
52506B50351K353K462K839L037K328P27o84j052r44j479k693l555l499l003k545
52491B44643j954j090l65o6K17Q87J558J589J056N36K31q5l35j31N12R92R20N83
52473B49698L95K92K3k37lQ29J731K062J705J116Q15R27J227J498J758K078K310
52456B68224K125J353K00q86j565j852k081k513k983l047k576k028j910k074j918
$$ y = [235067, 235337, 234963, 234864, 235752, 237362, 238946, 240048, 240504, 240171, 239198, 238207, 237686, 237396, 236812, 235952, 235250, 234809, 234408, 234123, 234234, 234443, 233940, 232565, 231215, 230674, 230578, 230144, 229468, 229337, 229907, 230364, 230077, 229445, 229258, 229574, 229665, 228939, 227572, 226239, 225450, 225219, 225256, 225355, 225559, 225956, 226393, 226597, 226562, 226667, 227236, 228166, 229166, 230252, 231675, 233333, 234627, 235178, 235439, 236207, 237621, 239009, 239711, 239698, 239291, 238720, 238279, 238540, 239966, 242394, 245193, 247880, 250351, 252704, 255166, 258005, 261042, 263370, 264097, 263413, 262361, 261417, 259938, 257245, 253690, 250191, 247188, 244643, 242689, 241599, 241234, 241168, 241385, 242272, 243830, 245419, 246475, 247011, 247242, 247157, 246822, 246691, 247203, 248195, 249115, 249698, 250093, 250385, 250408, 250171, 250168, 250997, 252728, 254790, 256495, 257611, 258426, 259353, 260580, 262078, 263836, 265914, 268224, 270349, 271702, 271902, 271016, 269451, 267599, 265518, 263005, 260022, 256975, 254399, 252371, 250461, 248387, 246469]
52441B46469j254o02m03m22k47q4m91j390j944j563o30Q0K83K41K58N03J084J853
52423B41741K263J905J082M62K40R2q5NM31Q26R80J122J395J631J912K700L962
52406B62664M779M566M140M658N823O187N226M012L506L167J884l23k382l585
52392C04322m166m602m916m857m321l381k149q43J82O34N64L84N68J275K246L013
52376B83953L242K863K086J385J357K280L740M848M967M246L388L021L204L426
52362C28006L102K134J060M51K96Q1m70j069j318j195q73k55R11K444L592L700
52346C40597K918K063J807K180K850L584M290M864N275N683O216O736P116P607
52332D03786Q514R633J0592J1682J3569J6046J7887J8432J8502J9162K0223K0854
$$ y = [246469, 245215, 244613, 244210, 243788, 243541, 243457, 242966, 241576, 239632, 238069, 237439, 237519, 237802, 238043, 238301, 238804, 239888, 241741, 244004, 245909, 246991, 247453, 247693, 247785, 247700, 247705, 248136, 248962, 249942, 251064, 252459, 254090, 256002, 258702, 262664, 267443, 272009, 276149, 280807, 286630, 292817, 298043, 302055, 305561, 308728, 310612, 310289, 307907, 304322, 300156, 295554, 290638, 285781, 281460, 278079, 275930, 275087, 275269, 275903, 276467, 276851, 277419, 278694, 280940, 283953, 287195, 290058, 292144, 293529, 294886, 297166, 300906, 305754, 310721, 314967, 318355, 321376, 324580, 328006, 331108, 333242, 334302, 334753, 335049, 335130, 334660, 333591, 332273, 331078, 330205, 329950, 330861, 333305, 336897, 340597, 343515, 345578, 347385, 349565, 352415, 355999, 360289, 365153, 370428, 376111, 382327, 389063, 396179, 403786, 412300, 421933, 432525, 444207, 457776, 473822, 491709, 510141, 528643, 547805, 568028, 588882]
52320E88882K1134K1859K3029K3616K3018K1777K0715K0057J9615J9171J8469
52309H21342J7443J6619J6545J6783J6255J4783J3333J2463J1513R954Q437P669
52297I83139P076N700L826K453J509j46k942n944q186r598j0325j0151r157q175
52283I39079p921q058p760o787n378l440o43K719N617P315Q070Q620R412J0517
52269I51362J1924J3446J4579J4917J4710J4622J4906J5134J4867J4230J3681
52258A108378J3452J3425J3259J2486J0774Q438O441N446N030M158K375J04k107
52245A201659m128o006p669r117j0592j2312j4123j5559j6221j6108j5647j5344
52233A058833j5262j5039j4482j3848j3272j2397j0919r252q048p298o514n557
$$ y = [588882, 610016, 631875, 654904, 678520, 701538, 723315, 744030, 764087, 783702, 802873, 821342, 838785, 855404, 871949, 888732, 904987, 919770, 933103, 945566, 957079, 967033, 975470, 983139, 990215, 995915, 999741, 1002194, 1003703, 1003557, 1000615, 994671, 986485, 976887, 966562, 956411, 947254, 939079, 931158, 923100, 915340, 908553, 903175, 899735, 899092, 901811, 907428, 914743, 922813, 931433, 940845, 951362, 963286, 976732, 991311, 1006228, 1020938, 1035560, 1050466, 1065600, 1080467, 1094697, 1108378, 1121830, 1135255, 1148514, 1161000, 1171774, 1180212, 1186653, 1192099, 1197129, 1201287, 1203662, 1203766, 1201659, 1197531, 1191525, 1183856, 1174739, 1164147, 1151835, 1137712, 1122153, 1105932, 1089824, 1074177, 1058833, 1043571, 1028532, 1014050, 1000202, 986930, 974533, 963614, 954362, 946314, 939016, 932502, 926945]
52221I26945m670l874l056k506k513k498j477N45K471L591M234M742M890M670
52207I31494M705N216N509N107M559M421M211L262J977J353J653K362K999L296
52193I82124K962K142J656K020K575K448J943K003K599K717J889O96k91j190k178
52178A004115l033l561l997m708n798o999p679p268o053n166n239n454m721l330
52164I31109k430k183j628l29J027J918K662L399L527K763J944K004K722L135
52150I49640K778J905R12J09k04J34R53J955K977L855M322M149L388K408J818
52135I81099K209L589N250O605P942R812J1930J3471J4416J5729J8018K0806K3422
52122A134298K5763K7870K9446L0318L0762L0964L0708K9988K9294K8829K7953
$$ y = [926945, 922275, 918401, 915345, 912839, 910326, 907828, 906351, 906896, 909367, 912958, 917192, 921934, 926824, 931494, 936199, 941415, 946924, 952031, 956590, 961011, 965222, 968484, 970461, 971814, 973467, 975829, 978828, 982124, 985086, 987228, 988884, 990904, 993479, 995927, 997870, 999873, 1002472, 1005189, 1007078, 1007774, 1007483, 1006293, 1004115, 1001082, 997521, 993524, 988816, 983018, 976019, 968340, 961072, 955019, 949853, 944614, 939160, 934439, 931109, 928679, 926496, 924868, 924539, 925566, 927484, 930146, 933545, 937072, 939835, 941779, 943783, 946505, 949640, 952418, 954323, 955235, 955344, 955140, 955274, 956227, 958182, 961159, 965014, 969336, 973485, 976873, 979281, 981099, 983308, 986897, 992147, 998752, 1006694, 1016506, 1028436, 1041907, 1056323, 1072052, 1090070, 1110876, 1134298, 1160061, 1187931, 1217377, 1247695, 1278457, 1309421, 1340129, 1370117, 1399411, 1428240, 1456193]
52111A456193K5952K3004J9848J6866J3888J0631P004L322L52j334k261l595n506
52098A564364o817o798o434p097q642r861j0365j0862j1778j2674j3161j3496
52086A446379j4033j4691j5220j5481j5266j4263j2375r838o985m142j628M65
52074A322922K475M782P291R569J1437J3041J4458J5560J6221J6463J6444J6514
52062A467177J6926J7228J6340J3810J0665Q368P168O104M465K528P92o73k039
52049A568859l445n129p280r640j1765j3708j5904j8309k0358k1907k3474k5183
52037A392757k6202k5775k4236k2545k1224k0253j9538j8836j7694j6010j4376
52026A166068j3228j2045j0108p840o484o495p117p634q143q780r100q762q253
$$ y = [1456193, 1482145, 1505149, 1524997, 1541863, 1555751, 1566382, 1573386, 1576708, 1577060, 1575726, 1573465, 1569870, 1564364, 1557547, 1550749, 1544315, 1537218, 1528576, 1518715, 1508350, 1497488, 1485710, 1473036, 1459875, 1446379, 1432346, 1417655, 1402435, 1386954, 1371688, 1357425, 1345050, 1335212, 1328227, 1324085, 1322457, 1322922, 1325397, 1330179, 1337470, 1347039, 1358476, 1371517, 1385975, 1401535, 1417756, 1434219, 1450663, 1467177, 1484103, 1501331, 1517671, 1531481, 1542146, 1550514, 1557682, 1563786, 1568251, 1570779, 1571571, 1570898, 1568859, 1565414, 1560285, 1553005, 1543365, 1531600, 1517892, 1501988, 1483679, 1463321, 1441414, 1417940, 1392757, 1366555, 1340780, 1316544, 1293999, 1272775, 1252522, 1232984, 1214148, 1196454, 1180444, 1166068, 1152840, 1140795, 1130687, 1122847, 1116363, 1109868, 1102751, 1095117, 1086974, 1078194, 1069094, 1060332, 1052079]
52013A052079q217q526q675q768r372j0512j1626j2473j3430j4700j5899j6743
52001I13138j7558j8653j9622j9811j9260j8629j8311j8058j7468j6457j5162
51990G14149j3690j2131j0631r367q522q168q036p653o927o399o564p159p553
51977F01349p754q387r606j0616j0606r712q739q243q158q069p564o485n130l927
51963D88353k807j175J190L573N052N590N912O408O630N910M196K131M91m73j154
51948E29827k066l144l772l624l094k615j897l62J894M062N553O519P422Q486
51934E43189R594J0415J0569R999R172Q535P783O144L504P58j138k117k787l686
51920F09934m985o480p548p515o531n804o462q367j0457j2037j3183j4024j4361
$$ y = [1052079, 1043862, 1035336, 1026661, 1017893, 1008521, 998009, 986383, 973910, 960480, 945780, 929881, 913138, 895580, 876927, 857305, 837494, 818234, 799605, 781294, 763236, 745768, 729311, 714149, 700459, 688328, 677697, 668330, 659808, 651640, 643604, 635951, 629024, 622625, 616061, 608902, 601349, 593595, 585208, 575602, 564986, 554380, 544668, 535929, 527686, 519528, 511459, 503895, 497410, 492280, 488353, 485546, 484371, 485561, 489134, 494186, 499776, 505688, 512096, 518726, 524636, 528832, 530963, 531454, 530981, 529827, 527761, 524617, 520845, 517221, 514127, 511512, 509615, 509253, 511147, 515209, 520762, 527281, 534703, 543189, 552783, 563198, 573767, 583766, 592938, 601473, 609256, 615400, 618904, 619662, 618524, 616407, 613620, 609934, 604949, 598469, 590921, 583406, 576875, 571071, 564609, 556242, 545785, 533748, 520565, 506541, 492180]
51907D92180j4093j3445j2487j0963q824o528m476k588p30Q30J876K734L755M585
51893D31826M619L936L087K063K66k282m591n900o566p217p646p160n659l728
51879C95048j892l03J010K166L427M675N218M675L841L807M438M559L721K793
51865D37183K498K372J600K01j245k456l421l914l781l326k881k231j071J79O71
51850D20378K90n8N52K071L527L865K797J024m62j417k425l797m877m917m252
51835D12299l894m182m553m576m444m284l722k463q59M92J324J666J574J239R77
51820C86594P82J67j196k838l901m063l707l237k601j582k98Q24J465J734J995
51805C70138K372K550K191J488J040J095J208Q44P1n35o32m10l43p63j689k732
$$ y = [492180, 478087, 464642, 452155, 441192, 432368, 425840, 421364, 418776, 418046, 418876, 420752, 423486, 427241, 431826, 436445, 440381, 443468, 445531, 445797, 443515, 438924, 433024, 426458, 419241, 411595, 404435, 398776, 395048, 393156, 392853, 393863, 396029, 399456, 404131, 409349, 414024, 417865, 421672, 426110, 430669, 434390, 437183, 439681, 442053, 443653, 443854, 442609, 440153, 436732, 432818, 429037, 425711, 422830, 420599, 419528, 419707, 420378, 420668, 420610, 421162, 423233, 426760, 430625, 433422, 434446, 433984, 432567, 430142, 426345, 421468, 416551, 412299, 408405, 404223, 399670, 395094, 390650, 386366, 382644, 380181, 379322, 379814, 381138, 382804, 384378, 385617, 386594, 387376, 387543, 386347, 383509, 379608, 375545, 371838, 368601, 366000, 364418, 364120, 364944, 366409, 368143, 370138, 372510, 375060, 377251, 378739, 379779, 380874, 382082, 382926, 382997, 382462, 381830, 381420, 381077, 380314, 378625, 375893]
51789C75893l267k970k227j750j771j930j946j959k060j947j382o15O2Q26J850
51774C54807K630K479J625J081J354K022K748L853N425O708P070O983P255P773
51760D13813P883P678P790Q018P271N137K527L51j580l819o106p676q344q611
51746D24332q806q659p792o381n181m863n176m996l517j233Q38K603M781P319
51732C83269R081R428R080Q722P789N702L478K861M066N568O018N332L906J841
51718D66141o27k865m446n524o290o512n908m655l330k590k867m013n217n741
51704D05556n656n435m939l595j595l0N62R32J884K988L185K266R70q0q05j145
51688C95063q76j75K20k69j416k511l160l535l878l995l438k139p09J52M41Q07
$$ y = [375893, 372626, 369656, 367429, 365679, 363908, 361978, 360032, 358073, 356013, 354066, 352684, 352069, 352131, 352957, 354807, 357437, 359916, 361541, 362622, 363976, 365998, 368746, 372599, 378024, 384732, 391802, 398785, 406040, 413813, 421696, 429374, 437164, 445182, 452453, 457590, 460117, 460468, 458888, 455069, 448963, 441287, 432943, 424332, 415526, 406867, 399075, 392694, 387513, 382650, 377474, 372478, 368961, 367728, 368566, 371169, 375950, 383269, 392350, 401778, 410858, 419580, 427369, 433071, 436549, 439410, 443476, 449044, 455062, 460394, 464300, 466141, 465514, 462649, 458203, 452679, 446389, 439877, 433969, 429314, 425984, 423394, 420527, 416514, 411297, 405556, 399900, 394465, 389526, 385931, 384336, 384306, 384868, 385800, 387684, 390672, 393857, 396123, 397093, 397013, 396208, 395063, 394187, 394012, 394232, 393963, 392547, 390036, 386876, 383341, 379463, 375468, 372030, 369891, 369182, 369334, 369775, 370582]
51672C70582J754L116M480N699O816P726Q348Q982J0072J1519J2497J2080R953
51659D73624O553K696q33l532n326o489p300p791p795p211o175m913l592k344
51645D19572j389j019j395k376l576m610n357o008o747p450p756p461o628n286
51631C52514l435j518m17m66p73j78J152J871J324M98O83J789K640K496J665P71
51615C60616O5n04j016j463j725j654j332j135j317j719k085k384k586k375j536
51600C37850l99N33J184J820K494L109L784M720N692O198O066N525M677L371J599
51585C88223l72k297l961m899m624l243j499k1J163K348L717N271O855Q189R108
51570D03958R844J0841J2243J3743J4925J5580J5782J5913J6477J7622J8976K0183
$$ y = [370582, 372336, 375452, 379932, 385631, 392447, 400173, 408521, 417503, 427575, 439094, 451591, 463671, 473624, 480177, 482873, 482040, 478508, 473182, 466693, 459393, 451602, 443807, 436596, 430421, 425508, 421916, 419572, 418183, 417164, 415769, 413393, 409817, 405207, 399850, 393842, 387095, 379645, 371889, 364428, 357800, 352514, 349079, 347561, 347144, 346678, 345905, 345727, 346879, 348750, 350074, 350572, 351255, 353044, 355684, 358180, 359845, 360616, 360681, 360177, 359161, 357698, 355973, 354319, 352987, 351852, 350535, 348816, 346731, 344347, 341761, 339386, 337850, 337451, 337984, 339168, 340988, 343482, 346591, 350375, 355095, 360787, 366985, 373051, 378576, 383253, 386624, 388223, 387851, 385554, 381593, 376694, 372070, 368827, 367328, 367307, 368470, 370818, 374535, 379806, 386661, 394850, 403958, 413802, 424643, 436886, 450629, 465554, 481134, 496916, 512829, 529306, 546928, 565904, 586087]
51558E86087K1370K2759K4145K5200K6006K6689K6733K5282K2011J7165J0970
51547H34417L785l440r768j5308k0728k5715k9025l0294l0650l1026l0852k9125
51535E82271k5983k2411j9051j6100j3838j2343j1040r357p608o489n885n000
51523D27166l569k201j406r78n37j45p4l61q50j440k086k644k975l127l295l608
51507C97870l969m211m275m186l836l099k199j695j737j754j291q46j224k187
51493C61361k598j963r93m17l8N67J179J341J064O32N2o97j279j418j376j547
51477C53870j895k188k513l004l385l303k906k576k390k223k196k423k635k532
51463C17701k277k117j784r35P8M89J78k32k59J6M16R16J374J544J447J355J389
$$ y = [586087, 607457, 630216, 654361, 679561, 705567, 732256, 758989, 784271, 806282, 823447, 834417, 838202, 834762, 824994, 809686, 788958, 763243, 734218, 703924, 673274, 642248, 611396, 582271, 556288, 533877, 514826, 498726, 484888, 472545, 461505, 452148, 444540, 438051, 432166, 427166, 423597, 421396, 419990, 419012, 418475, 418330, 418256, 417895, 417045, 415605, 413519, 410875, 407900, 404773, 401478, 397870, 393901, 389690, 385415, 381229, 377393, 374294, 372095, 370400, 368663, 366909, 365618, 364772, 363548, 361361, 358763, 356800, 355807, 355390, 355352, 355919, 357098, 358439, 359503, 360135, 360187, 359490, 358211, 356793, 355417, 353870, 351975, 349787, 347274, 344270, 340885, 337582, 334676, 332100, 329710, 327487, 325291, 322868, 320233, 317701, 315424, 313307, 311523, 310588, 310666, 311155, 311333, 311101, 310842, 310858, 311274, 312190, 313564, 315108, 316555, 317910, 319299]
51446C19299J582K224L529M984N741N786O079P203Q475Q822Q084O945N838M492
51432C99083K596N01r24j139n50k02p91k089l360m182m568m522l895k789j714
51417C71455j195j299j615j625j136m64j28j88j04N43J426J845J605J111O80K26
51401C71137k65m67j19N54J038J035O49K84L73J075K173L318M353N269N992O529
51385D02928P241Q695J1080J4061J7196K0332K3556K6973L0600L4289L7721M0620
51373F75292M2880M4272M4129M1632L6517K9235K0550J1188J910o633j4312k1450
51361I05210k8126l3780l7720l9841m0605m0507l9783l8433l6226l2856k8456
51350E08877k3907k0235j7610j5307j2874j0868j0030j0015r652q449p117o348
$$ y = [319299, 320881, 323105, 326634, 331618, 337359, 343145, 349224, 356427, 364902, 373724, 381808, 388753, 394591, 399083, 401679, 402180, 401256, 400117, 399567, 399365, 398574, 396485, 393125, 388943, 384375, 379853, 375958, 373169, 371455, 370260, 368961, 367346, 365721, 364585, 364121, 363993, 363805, 363701, 364244, 365670, 367515, 369120, 370231, 370911, 371137, 370872, 370405, 370286, 370840, 371878, 372913, 373562, 373846, 374219, 375294, 377467, 380785, 385138, 390407, 396399, 402928, 410169, 418864, 429944, 444005, 461201, 481533, 505089, 532062, 562662, 596951, 634672, 675292, 718172, 762444, 806573, 848205, 884722, 913957, 934507, 945695, 947605, 940972, 926660, 905210, 877084, 843304, 805584, 765743, 725138, 684631, 644848, 606415, 570189, 537333, 508877, 484970, 464735, 447125, 431818, 418944, 408076, 398046, 388031, 378379, 369930, 362813, 356465]
51338C56465n788m824l774l462l835l981l429k658k083j476o87j35j16k57j57
51323C19803n3j96j57N88J700K248J800P49j74l52M43J677K352K074J529J422
51307C35453J456R67P5o66j251j990k589k550k228k363k675k119o89K54j77j320
51291C17588k153k557k801k650j799n88L79R91J471J897K288K754L220L444L595
51276C25079M204N119N302M189K627J730J443J055N51N11R37J203J091R96J106
51261C57143J164J072R81P47R8o55q26m76m68j132j715j620j429j982l025l555
51245C44322l287k915l027l453l755l783l553l022k256j511r61n68l21l30n07
51230C11073m78r4K30m6q48j500j410n79N32J446J976K242K418K482K347K227
$$ y = [356465, 350677, 345853, 342079, 338617, 334782, 330801, 327372, 324714, 322631, 321155, 320468, 320333, 320217, 319960, 319803, 319750, 319554, 319397, 319985, 321685, 323933, 325733, 326482, 326308, 325956, 326399, 328076, 330428, 332502, 334031, 335453, 336909, 337876, 337951, 337285, 336034, 334044, 331455, 328905, 326677, 324314, 321639, 319520, 318831, 319085, 318908, 317588, 315435, 312878, 310077, 307427, 305628, 305040, 305419, 306410, 307881, 309778, 312066, 314820, 318040, 321484, 325079, 329283, 334402, 339704, 343893, 346520, 348250, 349693, 350748, 351299, 351810, 352747, 353950, 355041, 356037, 357143, 358307, 359379, 360360, 361107, 361205, 360550, 359724, 359248, 358780, 357648, 355933, 354313, 352884, 350902, 347877, 344322, 341035, 338120, 335093, 331640, 327885, 324102, 320549, 317527, 315271, 313760, 312799, 312231, 311910, 311580, 311073, 310595, 310501, 310731, 310685, 309837, 308337, 306927, 306348, 306880, 308326, 310302, 312544, 314962, 317444, 319791, 322018]
51214C22018K513L128L365K770J847J404J475J475J252J190J308J096M15j86l94
51199C44676n67q29n93L87J169P13o14j525j439q68l56kJ17j02k97N0P33R48M89
51180C42090P5K88Q10J062R61O81K00m40q18n44K01Q56J030O47j62j069j606j483
51162C42779p62L33J566K615L191L398L683M200M510M098K970J497n9j626l054
51147C69339m067m403l960k881j662r54j036j559j953k070k232k588k703j995
51133C35276o25M14L94k20l79J18M58J48k25M3P76J434K059K888L494L220K237
51116C51510J418J239J552K194L021L462L006K101J668J734J526R27O93J057J234
51101C78342Q19N65J067J649J350L98k04n3M34Q17J031J165J320J478J307M43
$$ y = [322018, 324531, 327659, 331024, 333794, 335641, 337045, 338520, 339995, 341247, 342437, 343745, 344841, 345256, 345070, 344676, 344109, 343280, 342687, 343074, 344243, 344956, 344342, 342817, 341378, 340510, 340154, 340152, 340269, 340167, 339870, 339920, 340653, 341601, 342090, 342165, 342453, 343263, 344325, 345286, 345967, 346167, 345727, 344909, 344365, 344566, 345422, 346452, 347099, 346937, 345868, 344262, 342779, 342017, 342350, 343916, 346531, 349722, 353120, 356803, 361003, 365513, 369611, 372581, 374078, 374019, 372393, 369339, 365272, 360869, 356909, 354028, 352366, 351412, 350376, 348817, 346864, 344794, 342562, 339974, 337271, 335276, 334651, 335065, 335459, 335239, 334860, 334978, 335436, 335584, 335359, 335402, 336178, 337612, 339671, 342559, 346053, 349273, 351510, 352928, 354167, 355719, 357913, 360934, 364396, 367402, 369503, 371171, 372905, 374431, 375358, 376051, 377108, 378342, 379161, 379726, 380793, 382442, 383792, 384190, 383986, 383933, 384367, 385184, 386215, 387380, 388700, 390178, 391485, 391928]
51085C91928p61j390j141p48q16r56n78J25N80O70N79L26N1K59J061J678J434
51068C92301Q18Q45J775L140M667O311P776Q790R687J0945J2388J3484J4160J4579
51054E01666J4406J3202J1415J0116R778J0043J0556J1245J1835J1872J1311J0352
51042F37797Q751O036K440j136m139o680q762j0003j0314j0187j0116j0231j0572
51029E72884j1126j1611j1736j1727j1871j1663j0248p767n309l355j357Q13K109
51016D78036J801Q87J021K537M326N375N626N518N455N724O360P029P458P902
51002E45055Q774R869J0436J0151R522R163Q990Q461P449O475N975N661M904L699
50988F54584K830K885L472L759L582L586M334N749P471R317J1248J3142J4818
$$ y = [391928, 391167, 389777, 388636, 387888, 387072, 386116, 385538, 385663, 386243, 386913, 387492, 387818, 387869, 388128, 389189, 390867, 392301, 393119, 393964, 395739, 398879, 403546, 409857, 417633, 426423, 436110, 447055, 459443, 472927, 487087, 501666, 516072, 529274, 540689, 550805, 560583, 570626, 581182, 592427, 604262, 616134, 627445, 637797, 646548, 652584, 655024, 653888, 649749, 643069, 634307, 624304, 613990, 603803, 593687, 583456, 572884, 561758, 550147, 538411, 526684, 514813, 503150, 492902, 485135, 479826, 476471, 475114, 475927, 478036, 479837, 480724, 481745, 484282, 488608, 493983, 499609, 505127, 510582, 516306, 522666, 529695, 537153, 545055, 553829, 563698, 574134, 584285, 593807, 602970, 611960, 620421, 627870, 634345, 640320, 645981, 650885, 654584, 657414, 660299, 663771, 667530, 671112, 674698, 679032, 684781, 692252, 701569, 712817, 725959, 740777]
50975G40777J6128J7073J7929J9208K1163K3475K5767K8337L1850L6376M1197
50964A019280M5731N0086N4554N9066O3327O7095P0036P1794P2453P2493P1995
50953A717910P0306O6883O1995N6205M9633M2271L4620K7308K0319J3286O458
50942B167194O77l638o863r428j1372j2801j4129j5523j6631j7299j8083j9573
50930B022531k1525k3301k4904k6919k9573l2496l5480l8796m2511m6083m8984
50919A651959n1289n3222n4572n4956n4364n2996n0854m7977m4820m1822l8770
50908A106317l5262l1544k8252k5383k2446j9603j7735j7047j6496j5146j3371
50897H64032j2082j1326j0410q982p321n763m463l550k985k412j576p75m69o14
$$ y = [740777, 756905, 773978, 791907, 811115, 832278, 855753, 881520, 909857, 941707, 978083, 1019280, 1065011, 1115097, 1169651, 1228717, 1292044, 1359139, 1429175, 1500969, 1573422, 1645915, 1717910, 1788216, 1855099, 1917094, 1973299, 2022932, 2065203, 2099823, 2127131, 2147450, 2160736, 2167194, 2167871, 2164233, 2157370, 2147942, 2136570, 2123769, 2109640, 2094117, 2077486, 2060187, 2042104, 2022531, 2001006, 1977705, 1952801, 1925882, 1896309, 1863813, 1828333, 1789537, 1747026, 1700943, 1651959, 1600670, 1547448, 1492876, 1437920, 1383556, 1330560, 1279706, 1231729, 1186909, 1145087, 1106317, 1071055, 1039511, 1011259, 985876, 963430, 943827, 926092, 909045, 892549, 877403, 864032, 851950, 840624, 830214, 821232, 813911, 808148, 803685, 800135, 797150, 794738, 793162, 792387, 791918, 791304]
50883G91304p04l21O60K032L202L629L616M129N389O440O775P473R572J2031J2860
50868H68087J2089J1963J3909J6846J9075K0500K2122K4345K6956L0140L4330
50857A100362L9275M4127M8511N2935N8086O4235P1323P9219Q7723R6578J05672
50846A848046J15137J25128J35364J44957J52860J58658J62751J65543J66655
50837C175099J65196J60514J52277J40143J24042J04803Q3875O2303M0479J8889
50827D227620j510j9773l5266m7356n5369n9198n9474n6993n2309m5989l8858
50816C755525l1871k6110k2851k3052k6673l2974m1459n1905o3600p5509q7282
50805C272239r9140j10548j20038j26742j31034j33210j32573j28695j22619j15821
$$ y = [791304, 790600, 790279, 790939, 792971, 796173, 799802, 803418, 807547, 812936, 819376, 826151, 833624, 843196, 855227, 868087, 880176, 892139, 906048, 922894, 941969, 962469, 984591, 1008936, 1035892, 1066032, 1100362, 1139637, 1183764, 1232275, 1285210, 1343296, 1407531, 1478854, 1558073, 1645796, 1742374, 1848046, 1963183, 2088311, 2223675, 2368632, 2521492, 2680150, 2842901, 3008444, 3175099, 3340295, 3500809, 3653086, 3793229, 3917271, 4022074, 4105949, 4168252, 4208731, 4227620, 4226110, 4206337, 4171071, 4123715, 4068346, 4009148, 3949674, 3892681, 3840372, 3794383, 3755525, 3723654, 3697544, 3674693, 3651641, 3624968, 3591994, 3550535, 3498630, 3435030, 3359521, 3272239, 3173099, 3062551, 2942513, 2815771, 2684737, 2551527, 2418954, 2290259, 2167640, 2051819]
50795B051819j08608j00430r1191q1305p1133o1236n2631m5738l9510l2744k5867
50784A341426k0266j6245j2930j0008q099p240o487n390m659m792n191n212n199
50771A229708n715o573p410q478j0004j1372j1864j1796j2038j2688j3159j3311
50759A105300j3586j3978j3849j2943j1749j0593r131p196n386m161k871n07K888
50746A002238O247Q874J1134J3747J7080K1282K6378L1920L7057M1499M5965N1125
50734A314546N6561O1338O5342O9287P3448P7157P9727Q1251Q2204Q2770Q2868
50723B126499Q2435Q1375P9441P6472P2424O7067N9919N0750L9775K7245J3198
50712B776600j864j6535k9205l9192m6789n2220n5019n4538n0828m4881l8020
$$ y = [2051819, 1943211, 1842781, 1751590, 1670285, 1599152, 1537916, 1485285, 1439547, 1400037, 1367293, 1341426, 1321160, 1304915, 1291985, 1281977, 1273878, 1266638, 1260151, 1254761, 1250102, 1245310, 1240119, 1234907, 1229708, 1223993, 1217420, 1210010, 1201532, 1191528, 1180156, 1168292, 1156496, 1144458, 1131770, 1118611, 1105300, 1091714, 1077736, 1063887, 1050944, 1039195, 1028602, 1019471, 1012275, 1006889, 1002728, 999857, 999350, 1002238, 1008485, 1017359, 1028493, 1042240, 1059320, 1080602, 1106980, 1138900, 1175957, 1217456, 1263421, 1314546, 1371107, 1432445, 1497787, 1567074, 1640522, 1717679, 1797406, 1878657, 1960861, 2043631, 2126499, 2208934, 2290309, 2369750, 2446222, 2518646, 2585713, 2645632, 2696382, 2736157, 2763402, 2776600, 2774736, 2758201, 2728996, 2689804, 2643015, 2590795, 2535776, 2481238, 2430410, 2385529, 2347509]
50701B347509l1099k4322j7813j2229q568p426q731j2200j7652k4776l3028m1907
50689B107758n0975n9467o6299p0814p3163p3700p2383o9153o4445n8838n2467
50678A396054m5359l8118l1623k6042k0642j4717q356k205L195P752J1654J4944
50666A246537J7269J8210J7981J7483J7334J7141J6162J4544J3313J3192J3886
50655A423052J4694J5386J6178J7163J8147J9022K0040K1588K3693K5940K8000
50644A642903L0147L2931L6361L9738M2429M4483M6199M7502M8081M7947M7400
50633B106121M6559M5316M3722M2003M0296L8601L7012L5590L3927L1078K6107
50622B526332J8651R088j588j2025k0869k7137l0382l0722k8663k4804j9631j3708
$$ y = [2347509, 2316410, 2292088, 2274275, 2262046, 2253478, 2246052, 2237321, 2225121, 2207469, 2182693, 2149665, 2107758, 2056783, 1997316, 1931017, 1860203, 1787040, 1713340, 1640957, 1571804, 1507359, 1448521, 1396054, 1350695, 1312577, 1280954, 1254912, 1234270, 1219553, 1211197, 1208992, 1212187, 1219939, 1231593, 1246537, 1263806, 1282016, 1299997, 1317480, 1334814, 1351955, 1368117, 1382661, 1395974, 1409166, 1423052, 1437746, 1453132, 1469310, 1486473, 1504620, 1523642, 1543682, 1565270, 1588963, 1614903, 1642903, 1673050, 1705981, 1742342, 1782080, 1824509, 1868992, 1915191, 1962693, 2010774, 2058721, 2106121, 2152680, 2197996, 2241718, 2283721, 2324017, 2362618, 2399630, 2435220, 2469147, 2500225, 2526332, 2544983, 2554071, 2552483, 2540458, 2519589, 2492452, 2462070, 2431348, 2402685, 2377881, 2358250, 2344542]
50610B344542p893l049M82K681L182J345k869q715j5643k3769l2967m2127n0056
50597B165144n6662o2493o7497p1013p2777p3036p1772o8708o4197n9350n4975
50586A442664n0982m7021m3098l9338l5689l2208k9222k6841k4632k2032j8928
50575A072673j5648j2581r891p419m805j958O11K356L600N396Q239J1332J3455
50562A065360J4368J4973J6187J7971J9582K0613K1511K2919K4682K5932K6234
50551A290332K6138K6277K6396K5774K4325K2642K1129J9788J8791J8642J9676
50540A539910K1844K5030K9094L3617L8213M3125M8925N5568O2374O9087P6197
50529B042984Q3902R1412R7767J02923J07550J12080J16217J19150J20006J18492
$$ y = [2344542, 2336649, 2333600, 2334082, 2336763, 2339945, 2341290, 2338421, 2329706, 2314063, 2290294, 2257327, 2215200, 2165144, 2108482, 2045989, 1978492, 1907479, 1834702, 1761666, 1689894, 1621186, 1556989, 1497639, 1442664, 1391682, 1344661, 1301563, 1262225, 1226536, 1194328, 1165106, 1138265, 1113633, 1091601, 1072673, 1057025, 1044444, 1034553, 1027134, 1022329, 1020371, 1020982, 1023338, 1026938, 1032334, 1040573, 1051905, 1065360, 1079728, 1094701, 1110888, 1128859, 1148441, 1169054, 1190565, 1213484, 1238166, 1264098, 1290332, 1316470, 1342747, 1369143, 1394917, 1419242, 1441884, 1463013, 1482801, 1501592, 1520234, 1539910, 1561754, 1586784, 1615878, 1649495, 1687708, 1730833, 1779758, 1835326, 1897700, 1966787, 2042984, 2126886, 2218298, 2316065, 2418988, 2526538, 2638618, 2754835, 2873985, 2993991, 3112483]
50519C112483J15210J10936J05413R7461Q6520P3423N9240M4053K7548J0235o854
50508C835668k3385l9709n5551o9518q0192q7187r0869r1427q8586q2137p2490
50497C054617o0602m7326l2934j7484j682J2880K4560L2499L6469L6299L1751
50486C069047K2824R786o858k6113m6319o5753q3394r8729j11046j19436j23587
50475B420422j24092j21744j17025j10416j02738r4698q6394p7705o9034o1103
50465A455473n4046m7261m0379l3937k8746k4802k1333j7842j4573j1851r453
50454A151250o929m270j803M28K715N194P629R772J1679J3534J5409J7187J8591
50441A240386J9282J9173J8654J8212J7779J6713J4509J1310P685M227J509L8
$$ y = [3112483, 3227693, 3338629, 3444042, 3541503, 3628023, 3701446, 3760686, 3804739, 3832287, 3842522, 3835668, 3812283, 3772574, 3717023, 3647505, 3567313, 3480126, 3389257, 3297830, 3209244, 3127107, 3054617, 2994015, 2946689, 2913755, 2896271, 2894589, 2907469, 2932029, 2964528, 3000997, 3037296, 3069047, 3091871, 3101657, 3094799, 3068686, 3022367, 2956614, 2873220, 2774491, 2663445, 2544009, 2420422, 2296330, 2174586, 2057561, 1947145, 1844407, 1749709, 1663315, 1585610, 1516576, 1455473, 1401427, 1354166, 1313787, 1279850, 1251104, 1226302, 1204969, 1187127, 1172554, 1160703, 1151250, 1144321, 1140051, 1138248, 1138676, 1141391, 1146585, 1154214, 1163986, 1175665, 1189199, 1204608, 1221795, 1240386, 1259668, 1278841, 1297495, 1315707, 1333486, 1350199, 1364708, 1376018, 1383703, 1387930, 1389439, 1389477]
50429A389477r3O31J518K256K983L924N096O347P610R049J0901J3184J5680J8333
50415A486896K1454K5267K9542L3939L8533M3481M8286N2050N4476N6048N7012
50404A946984N6904N5372N2840M9863M6291M1653L5979K9563K2238J3571L702
50393B354960o698j7244k7998l8686m8326n5958o1325o4628o5965o5245o2424
50382A840463n7504n0576m2060l2768k3498j4625o241J446Q009J3006J6075J6953
50370A668680J5597J2185O827n64r854k0120k9903l8112m4511m9311n2599n4377
50358A403938n4804n4037n2080m9080m5606m2165l8608l4644l0747k7796k5619
50347I48752k2756j8242j2965q514n135j733K286O015Q096Q061O539M600L117
$$ y = [1389477, 1389384, 1390015, 1391533, 1393789, 1396772, 1400696, 1405792, 1412139, 1419749, 1428798, 1439699, 1452883, 1468563, 1486896, 1508350, 1533617, 1563159, 1597098, 1635631, 1679112, 1727398, 1779448, 1833924, 1889972, 1946984, 2003888, 2059260, 2112100, 2161963, 2208254, 2249907, 2285886, 2315449, 2337687, 2351258, 2354960, 2348262, 2331018, 2303020, 2264334, 2216008, 2160050, 2098725, 2034097, 1968132, 1902887, 1840463, 1782959, 1732383, 1690323, 1657555, 1634057, 1619432, 1613191, 1614637, 1622646, 1635652, 1651727, 1668680, 1684277, 1696462, 1703289, 1702725, 1692871, 1672751, 1642848, 1604736, 1560225, 1510914, 1458315, 1403938, 1349134, 1295097, 1243017, 1193937, 1148331, 1106166, 1067558, 1032914, 1002167, 974371, 948752, 925996, 907754, 894789, 886275, 881140, 879407, 881693, 887708, 895804, 903865, 910404, 915004, 918121]
50334I18121K223J307j43j634k162j588q14m15J28J371K866L826M342N185O565
50319I39178P852Q428Q222P398O079M473K829J113q64k911m393m946m922m842
50305I62694m635l773k114k72R32J297J398J989L338N112O862Q546J0538J3054
50291A004966J5654J7599J8840K0423K3550K8217L3145L6927L8800L8173L4111
50280A310405K5935J4222Q53j1868k2074k8918l2814l4859l5507l4144l0410k5462
50268A095359k1095j7914j5302j3013j1619j1221j0856r725q165o858n705m079
50256I59807j748R76L574N535O719P779R648J2266J4491J5666J6475J7638J8605
50243A087431J8459J7477J6769J6716J6760J6479J5919J4904J2971J0127O855
$$ y = [918121, 920344, 921651, 921508, 919874, 917712, 916124, 915310, 914895, 915023, 916394, 919260, 923086, 927428, 932613, 939178, 947030, 955458, 963680, 971078, 977157, 981630, 984459, 985572, 984708, 981797, 977404, 972458, 967536, 962694, 958059, 954286, 952172, 951900, 952832, 954129, 955527, 957516, 960854, 965966, 972828, 981374, 991912, 1004966, 1020620, 1038219, 1057059, 1077482, 1101032, 1129249, 1162394, 1199321, 1238121, 1276294, 1310405, 1336340, 1350562, 1351415, 1339547, 1317473, 1288555, 1255741, 1220882, 1185375, 1151231, 1120821, 1095359, 1074264, 1056350, 1041048, 1028035, 1016416, 1005195, 994339, 984614, 976449, 969591, 963886, 959807, 958059, 959035, 962609, 968144, 974863, 982642, 992290, 1004556, 1019047, 1034713, 1051188, 1068826, 1087431, 1105890, 1123367, 1140136, 1156852, 1173612, 1190091, 1206010, 1220914, 1233885, 1244012, 1250867]
50232A250867L291r58o023j1362j6297k0441k3523k5315k5893k5540k4382k2455
50220A051969k0130j8027j6470j5535j5551j6948j9421k1838k3205k3406k2870
50209H38568k1932k0658j8988j6845j4355j2007j0211q832p474o212n509n364
50197F90181n175m612m113m163m585m795m533l965l433l261l614m289m831n052
50183F29760n163n357n539n586n559n481n215m770m345l962l368k570k023j973
50169E68849k016j664j074p31o32l07M44J353K178K967L649L882L615L510M404
50154E88427O285Q150R023Q953Q831R248R850R956R474Q933Q707Q618Q379Q035
50140G10869P852P984Q491R489J1119J3406J6336J9938K4122K8502L2480L5547
$$ y = [1250867, 1254158, 1253200, 1247177, 1235815, 1219518, 1199077, 1175554, 1150239, 1124346, 1098806, 1074424, 1051969, 1031839, 1013812, 997342, 981807, 966256, 949308, 929887, 908049, 884844, 861438, 838568, 816636, 795978, 776990, 760145, 745790, 733783, 723572, 714740, 707266, 701054, 695545, 690181, 685006, 680394, 676281, 672118, 667533, 662738, 658205, 654240, 650807, 647546, 643932, 639643, 634812, 629760, 624597, 619240, 613701, 608115, 602556, 597075, 591860, 587090, 582745, 578783, 575415, 572845, 570822, 568849, 566833, 565169, 564095, 563364, 562732, 562425, 562869, 564222, 566400, 569367, 573016, 576898, 580513, 584023, 588427, 594712, 602862, 611885, 620838, 629669, 638917, 648767, 658723, 668197, 677130, 685837, 694455, 702834, 710869, 718721, 726705, 735196, 744685, 755804, 769210, 785546, 805484, 829606, 858108, 890588, 926135]
50128I26135L7447L8188L8012L7340L6601L5991L5359L4374L2828L0808K8499
50117A311582K5736K1925J6567R740J969o229j4352k1634k7289l1142l3697l5337
50105A217839l5860l5051l3376l1625k9989k7965k5164k1836j8565j5874j4210
50094I28324j3838j4332j4508j3422j1324r225p564n815l559j219N56J791K904
50081H38769L867M361M499M736M946M414K938J351M82M3r23k735m724o055o498
50066H49471o356n984n516m973m538m553n094n657n643n117m677m559m374l841
50052G78589l201k594j674k42J225K199K868L730M841O023P310Q560R024Q265
50038H24923P168P094Q047Q644Q037O871O097N690N140M487M219M427M594M187
$$ y = [926135, 963582, 1001770, 1039782, 1077122, 1113723, 1149714, 1185073, 1219447, 1252275, 1283083, 1311582, 1337318, 1359243, 1375810, 1385550, 1387519, 1381290, 1366938, 1345304, 1318015, 1286873, 1253176, 1217839, 1181979, 1146928, 1113552, 1081927, 1051938, 1023973, 998809, 976973, 958408, 942534, 928324, 914486, 900154, 885646, 872224, 860900, 851675, 844111, 838296, 834737, 833518, 834074, 835865, 838769, 842636, 846997, 851496, 856232, 861178, 865592, 868530, 869881, 870363, 870406, 869483, 866748, 862024, 855969, 849471, 843115, 837131, 831615, 826642, 822104, 817551, 812457, 806800, 801157, 796040, 791363, 786804, 782430, 778589, 775388, 772794, 771120, 770878, 772103, 774302, 777170, 780900, 785741, 791764, 799074, 807634, 816658, 824923, 832091, 839185, 847232, 855876, 863913, 870784, 876881, 882571, 887711, 892198, 896417, 900844, 905438, 909625]
50024I09625L143J880R29N28N12O39Q66J131J300J641K958N497Q069R169Q949
50009I56836R021J0211J1524J1778J1186J0683J0481J0213R894R813R771R248
49997A080659Q206O946N294K612j281n832j0408j4765j8757k2064k4422k5829
49985I80359k6378k6156k5407k4527k3736k2920k1909k0771j9705j8765j7913
49974G32172j7235j6865j6583j5706j3725j1095q971p996p649p099o325n855n693
49961E91375n251m375l647l441l321k748j860j072m25K94J074J893L070M853O883
49946E83302Q481R385R810R932R758R340Q736P842O579N215M116L245K263J026
49932F79030l94k130m452p237r854j1747j2876j3502j3741j3443j2369j0413p891
$$ y = [909625, 912768, 914648, 915577, 916105, 916617, 917256, 918122, 919253, 920553, 922194, 925152, 930649, 938718, 947887, 956836, 965857, 976068, 987592, 999370, 1010556, 1021239, 1031720, 1041933, 1051827, 1061640, 1071411, 1080659, 1088865, 1095811, 1101105, 1103717, 1102436, 1096604, 1086196, 1071431, 1052674, 1030610, 1006188, 980359, 953981, 927825, 902418, 877891, 854155, 831235, 809326, 788555, 768850, 750085, 732172, 714937, 698072, 681489, 665783, 652058, 640963, 631992, 623996, 616347, 609248, 602923, 597068, 591375, 586124, 581749, 578102, 574661, 571340, 568592, 566732, 565660, 565235, 565529, 566603, 568496, 571566, 576419, 583302, 591783, 601168, 610978, 620910, 630668, 640008, 648744, 656586, 663165, 668380, 672496, 675741, 678004, 679030, 678636, 676506, 672054, 664817, 654963, 643216, 630340, 616838, 603097, 589654, 577285, 566872, 558981]
49919E58981n549m103l592l336k569j100O05J790J976J324N82N19J304K480L461
49904E52773L998M225M448M907N664O608P580Q462R124R417R286Q853Q365P988
49890F51698P651P011N684L676J511k06j412k539l934n528p108q594r905j0784
49876F27221j0997j0612r977r493r385r515r400q653p454o295n320m186k661r64
49862E22309N85J856K775L241L413L706M286M898N388N977O840P820Q792R752
49848E91638J0373J0050Q871P880P795P953P225N537L727K219P83o21j743k790
49834F58897m343o299p661p743o949o117n632n505n713n972n683m580l228k411
49820E81061k193j909r61O36K439L999N222O340P537Q584Q977Q463P326O158N528
$$ y = [558981, 553432, 549329, 545737, 542401, 539832, 538732, 539337, 541127, 543103, 544427, 545009, 545528, 546832, 549312, 552773, 556771, 560996, 565444, 570351, 576015, 582623, 590203, 598665, 607789, 617206, 626492, 635345, 643710, 651698, 659349, 666360, 672044, 675720, 677231, 677025, 675613, 673074, 669140, 663612, 656504, 647910, 638005, 627221, 616224, 605612, 595635, 586142, 576757, 567242, 557842, 549189, 541735, 535440, 530120, 525934, 523273, 522309, 522894, 524750, 527525, 530766, 534179, 537885, 542171, 547069, 552457, 558434, 565274, 573094, 581886, 591638, 602011, 612061, 620932, 628812, 636607, 644560, 651785, 657322, 661049, 663268, 664051, 663430, 661687, 658897, 654554, 648255, 640594, 632851, 625902, 619785, 614153, 608648, 602935, 596963, 591280, 586700, 583472, 581061, 578868, 576959, 575998, 576634, 579073, 583072, 588294, 594634, 602171, 610755, 619732, 628195, 635521, 641679, 647207]
$$ [...]
##END NTUPLES=NMR SPECTRUM
##END=
