##TITLE=AC1544_ROEFFECT0012_8215172_bp29KGnp56
##JCAMPDX= 6.0         $$ Bruker NMR JCAMP-DX V2.0
##DATA TYPE= NMR SPECTRUM
##DATA CLASS= NTUPLES
##ORIGIN= BRUKER
##OWNER= Administrator
$$ 1.72 TOPSPIN		Version 2.1
$$ 2014-08-04 18:42:09.056 -0700  Administrator@X
$$ Compression mode = diff/dup
##.OBSERVE FREQUENCY= 400.02188249412
##.OBSERVE NUCLEUS= ^1H
##.ACQUISITION MODE= SIMULTANEOUS (DQD)
##.ACQUISITION SCHEME= undefined
##.AVERAGES= 8
##.DIGITISER RES= 22
##SPECTROMETER/DATA SYSTEM= spect
##.PULSE SEQUENCE= zg30
##.SOLVENT NAME= COFFEE_meoh
##.SHIFT REFERENCE= INTERNAL, COFFEE_meoh, 1, 14.98509
##AUDIT TRAIL= $$ (NUMBER, WHEN, WHO, WHERE, PROCESS, VERSION, WHAT)
$$ ##TITLE= Audit trail, TOPSPIN		Version 2.1
$$ ##JCAMPDX= 5.01
$$ ##ORIGIN= Bruker BioSpin GmbH
$$ ##OWNER= Administrator
$$ $$ E:\/data/COFFEE/nmr/AC1544_ROEFFECT0012_8215172_bp29KGnp56/20/pdata/1/auditp.txt
$$ ##AUDIT TRAIL=  $$ (NUMBER, WHEN, WHO, WHERE, PROCESS, VERSION, WHAT)
(   1,<2014-08-04 18:42:01.922 -0700>,<Administrator>,<X>,<go>,<TOPSPIN 2.1>,
      <created by zg
	started at 2014-08-04 18:40:56.492 -0700,
	POWCHK enabled, PULCHK disabled,
       configuration hash MD5:
       16 EA D6 F4 BB 67 03 14 9B FF E7 A0 43 5B 48 2E
       data hash MD5: 64K
       41 A6 DB 4C 23 79 3B 7E 54 32 B9 22 32 B1 90 74>)
(   2,<2014-08-04 18:42:05.174 -0700>,<Administrator>,<X>,<proc1d>,<TOPSPIN 2.1>,
      <Start of raw data processing
       efp LB = 0 FT_mod = 6 PKNL = 1 PHC0 = 0 PHC1 = 0 SI = 32K 
       data hash MD5: 32K
       82 38 64 51 1A 22 1C 9C 81 6A DF 87 12 14 E6 EB>)
(   3,<2014-08-04 18:42:05.494 -0700>,<Administrator>,<X>,<proc1d>,<TOPSPIN 2.1>,
      <pk PHC0 = 91.89514 PHC1 = 0 
       data hash MD5: 32K
       B4 E3 3F 4C 07 74 63 45 01 40 F8 5C 76 71 DA 9E>)
(   4,<2014-08-04 18:42:05.603 -0700>,<Administrator>,<X>,<proc1d>,<TOPSPIN 2.1>,
      <abs ABSG = 1 
       data hash MD5: 32K
       02 1B CD AF F1 5B CE F6 EE 0D D4 75 EC 3F E8 A2>)
(   5,<2014-08-04 18:42:05.665 -0700>,<Administrator>,<X>,<proc1d>,<TOPSPIN 2.1>,
      <abs ABSG = 2 
       data hash MD5: 32K
       40 E2 F5 8C 42 50 A9 24 B6 31 7F 07 60 F5 35 C0>)
(   6,<2014-08-04 18:42:05.744 -0700>,<Administrator>,<X>,<proc1d>,<TOPSPIN 2.1>,
      <abs ABSG = 3 
       data hash MD5: 32K
       E2 E6 D8 AA AA 91 6A 09 B2 37 10 57 63 E4 19 28>)
(   7,<2014-08-04 18:42:05.822 -0700>,<Administrator>,<X>,<proc1d>,<TOPSPIN 2.1>,
      <abs ABSG = 4 
       data hash MD5: 32K
       C1 A4 4C 10 4D C0 00 D8 1D 55 CF C5 81 CE C8 2D>)
(   8,<2014-08-04 18:42:05.915 -0700>,<Administrator>,<X>,<proc1d>,<TOPSPIN 2.1>,
      <abs ABSG = 5 
       data hash MD5: 32K
       01 7F 59 D3 F9 0F 9B B0 43 C4 3F 34 78 8F EA A2>)
$$ ##END=
$$ 
$$ $$ hash MD5
$$ $$ 0D 5B 0C 58 94 D1 91 9D 7F FA C8 02 E1 47 55 1D
##$RELAX= 
##$RELAX= 
##$RELAX= 
##$RELAX= 
##$RELAX= 
##$RELAX= 
##$RELAX= 
$$ Bruker specific parameters
$$ --------------------------
##$DU= <E:\>
##$EXPNO= 20
$$ [...]
150 150 150 150 150 150 150 150
##$TP07= 0
##$TPNAME0= <>
##$TPNAME1= <>
##$TPNAME2= <>
##$TPNAME3= <>
##$TPNAME4= <>
##$TPNAME5= <>
##$TPNAME6= <>
##$TPNAME7= <>
##$TPOAL= (0..7)
0.5 0.5 0.5 0.5 0.5 0.5 0.5 0.5
##$TPOFFS= (0..7)
0 0 0 0 0 0 0 0
##$TUNHIN= 0
##$TUNHOUT= 0
##$TUNXOUT= 0
##$USERA1= <user>
##$USERA2= <user>
##$USERA3= <user>
##$USERA4= <user>
##$USERA5= <user>
##$V9= 5
##$VALIST= <valist>
##$VCLIST= <CCCCCCCCCCCCCCC>
##$VD= 0
##$VDLIST= <DDDDDDDDDDDDDDD>
##$VPLIST= <PPPPPPPPPPPPPPP>
##$VTLIST= <TTTTTTTTTTTTTTT>
##$WBST= 1024
##$WBSW= 4
##$XGAIN= (0..3)
0 0 0 0
##$XL= 0
##$YL= 0
##$YMAX_a= 647203
##$YMIN_a= -556763
##$ZGOPTNS= <>
##$ZL1= 120
##$ZL2= 120
##$ZL3= 120
##$ZL4= 120
##$ABSF1= 14.98509
##$ABSF2= -5.573092
##$ABSG= 5
##$ABSL= 3
##$ALPHA= 0
##$AQORDER= 0
##$ASSFAC= 0
##$ASSFACI= 0
##$ASSFACX= 0
##$ASSWID= 0
##$AUNMP= <proc_prof1d_extract_pilot.lims>
##$AXLEFT= 0
##$AXNAME= <>
##$AXNUC= <1H>
##$AXRIGHT= 0
##$AXTYPE= 0
##$AXUNIT= <>
##$AZFE= 0.1
##$AZFW= 0.1
##$BCFW= 0
##$BC_mod= 0
##$BYTORDP= 0
##$COROFFS= 0
##$CY= 15
##$DATMOD= 1
##$DC= 0
##$DFILT= <>
##$DTYPP= 0
##$F1P= 0
##$F2P= 0
##$FCOR= 0.5
##$FTSIZE= 32768
##$FT_mod= 6
##$GAMMA= 0
##$GB= 0
##$INTBC= 1
##$INTSCL= 1
##$ISEN= 128
##$LB= 0
##$LEV0= 0
##$LPBIN= 0
##$MAXI= 10000
##$MC2= 0
##$MEAN= 0
##$ME_mod= 0
##$MI= 0
##$NCOEF= 0
##$NC_proc= -8
##$NLEV= 6
##$NOISF1= 0
##$NOISF2= 0
##$NSP= 0
##$NTH_PI= 0
##$NZP= 0
##$OFFSET= 14.98509
##$PC= 1
##$PHC0= 91.89514
##$PHC1= 0
##$PH_mod= 1
##$PKNL= yes
##$PPARMOD= 0
##$PPDIAG= 0
##$PPIPTYP= 0
##$PPMPNUM= 2147483647
##$PPRESOL= 1
##$PSCAL= 4
##$PSIGN= 0
##$PYNMP= <proc.py>
##$REVERSE= no
##$SF= 400.02
##$SI= 32768
##$SIGF1= 0
##$SIGF2= 0
##$SINO= 400
##$SIOLD= 32768
##$SPECTYP= <>
##$SREGLST= <1H.CDCl3>
##$SSB= 0
##$STSI= 32768
##$STSR= 0
##$SW_p= 8223.68421052631
##$SYMM= 0
##$S_DEV= 0
##$TDeff= 65536
##$TDoff= 0
##$TI= <>
##$TILT= no
##$TM1= 0
##$TM2= 0
##$TOPLEV= 0
##$USERP1= <user>
##$USERP2= <user>
##$USERP3= <user>
##$USERP4= <user>
##$USERP5= <user>
##$WDW= 1
##$XDIM= 32768
##$YMAX_p= 468377384
##$YMIN_p= -803721
##$CURPLOT= <Network HP LaserJet P1505>
##$CURPRIN= <$Network HP LaserJet P1505>
##$DFORMAT= <normdp>
##$LAYOUT= <+/1D_H.xwp>
##$LFORMAT= <normlp>
##$PFORMAT= <normpl>
##$SURQMSG= 1
$$ End of Bruker specific parameters
$$ ---------------------------------
##NTUPLES= NMR SPECTRUM
##VAR_NAME=  FREQUENCY,     SPECTRUM/REAL,   SPECTRUM/IMAG
##SYMBOL=    X,             R,               I
##VAR_TYPE=  INDEPENDENT,   DEPENDENT,       DEPENDENT
##VAR_FORM=  AFFN,          ASDF,            ASDF
##VAR_DIM=   32768,         32768,           32768
##UNITS=     HZ,            ARBITRARY UNITS, ARBITRARY UNITS
##FACTOR=    0.250966925370066, 1,           1
##FIRST=     8223.43324360094, -153739,      -187911
##LAST=      0,             -193399,         -272940
##MIN=       0,             -803721,         0
##MAX=       8223.43324360094, 468377384,    0
$$ Real data points
##PAGE= N=1
##DATA TABLE= (X++(R..R)), XYDATA
$$ [...]
23786 -379212 -97812 -175630 2297 -82522 87721 -199305 -291232 -111998 258004 -36678 53648
23774 -168097 -185712 -247458 -2968 169266 -206541 -84781 116081 -14565 132111 -141178 -73258
23763 -73258 -47844 102045 -295720 -193320 180990 -225039 210212 36867 85179 -126467
23752 -151572 105417 -244251 -15681 -43777 -271740 -51785 78963 -123962 61867 -42912 -121499
23741 -121499 238093 19480 39514 103195 -186583 206788 -65357 246367 -12537 -179827
23731 -179827 -226218 105969 -50022 -77136 -430343 15946 -52239 10612 47780 -35289 -71935
23720 -71935 215139 -180447 -57950 142599 4244 -94740 81572 225259 4226 -37337 -61562
23709 -61562 46985 80744 123049 36232 -28243 -146896 118027 -194153 -6570 -110305 376249
23697 3348 110670 66536 -11085 -104374 5384 -151192 -178674 135400 -176035 104076 58969
23686 58969 -386372 -26528 -50523 -131051 -39015 -135383 -105023 -91315 -122762 513163 299885
23675 299885 -137512 71875 33337 270069 10265 -49723 -131005 -170923 103024 -70985 -101361
23664 -101361 -218266 78722 361729 351030 135436 -104655 295368 -24745 -269943 -110091
23653 87095 -13093 -4965 -58507 158608 -329541 202479 168389 181429 190450 -129555 -24016
23641 -244569 160354 -45019 249708 -503370 42346 73891 35636 -151770 354269 -55822
23630 -23352 38814 86222 100030 111444 -128988 58863 262963 -99032 -37288 117801 -9204
23618 42525 203726 -109819 -111087 -415913 78246 -128684 -148241 356780 -87743 -154701 -115201
23607 -115201 -17017 -10998 -85431 -154722 -37254 184952 -56664 71212 -77543 -112574 7643 -179821
23594 -206543 192726 -40070 -112586 -133040 243139 -79716 -97592 -9932 -209860 241729 123781
23583 123781 -138792 -56490 -216191 -35988 18827 -195224 -201837 -46138 73917 -79987 -366573
23572 -366573 -370690 -14407 -196177 -16947 -248417 -204325 115857 -134590 323959 58136 227350
23561 227350 -7971 -197448 25718 62689 50547 -141020 233293 245848 -112685 -77713 -301899
23550 -301899 -217926 162946 -236924 -4114 -232572 348485 -181473 260948 -155311 -185056
23540 -185056 -83235 -236488 -9024 243800 104137 -86691 28714 -277940 -37358 -56216 52659
23528 -203245 1370 -264439 93835 -165447 -22801 33003 -197161 -58700 52182 88815 -163776
23516 321299 -203891 79753 441713 -411840 152525 -227769 283117 214152 -37778 -74568
23506 -74568 -112989 71377 -6057 -136615 -53338 84447 -90896 -34986 -212036 78126 -33048
23494 289483 -18863 7335 354488 -40001 -11764 -108015 192970 91458 -236548 -36217 73743
23482 267322 -53653 -169993 -246576 -253012 -113559 109451 43055 237015 -281720 -45351 -345014
23471 -345014 -325744 69579 -32239 -287582 75814 133773 -248324 -194377 -324564 -244543 -227103
23460 -227103 165994 -446192 55999 -25288 124518 -184888 315 -105150 128493 -52618 189972
23448 -56933 198501 -23718 -65883 -142199 224578 -75267 -98760 155582 393897 -181813 170753
23436 43025 -626 -145448 36469 -412354 -303400 233361 -509503 -344868 310469 -152617
23425 -164524 -49850 -114653 166690 -288683 -63881 -112577 -876 -218015 -168923 9546 160039
23414 160039 -70311 160935 -37687 -429019 264167 -183723 -85128 -166052 -164376 97575 115988
23403 115988 203772 304581 -111665 405029 -350767 -241054 -22864 111434 55999 -205451
23392 12064 99072 97237 -106378 132173 49040 283847 -127288 113301 -165753 -27992 -104003
23381 -104003 429803 181471 -132903 -189272 -172609 -76506 275580 -64743 -272213 -68078
23370 39838 360359 -28600 95317 60027 83291 -1306 -258271 -99587 -284735 133202 -209694
23358 -530226 -76965 215602 19753 -40827 -169320 278078 368188 -102926 119830 -108254
23347 -123934 -152027 -92213 34515 -199437 183565 -104829 77696 -110678 -213305 -188400
23337 -188400 36093 142040 68132 -100282 -210986 275763 208462 -17200 188847 -80056
23326 -286917 -218174 102541 65350 -144164 255545 -29418 -96628 -96417 -131018 120198 -50335
23314 -7383 94840 128271 179743 -91684 87175 87946 -103658 70880 -334408 -92455 -104051 -223509
23302 -223509 373526 -135628 -218397 -18370 -3288 261254 -83078 32154 174275 108487 158023
23291 158023 -49568 -448113 -97596 140222 166640 23162 -168680 -71091 -166510 -270270 -135420
23280 -135420 71020 -246052 -48707 -55365 -144615 -353683 -79776 -108253 39266 75850 1146
23268 -19564 113545 112728 -122748 -27006 76415 250233 -44908 134350 -1107 -325844 16572
23256 196524 278670 -219314 58177 -319258 122041 37770 -117472 118123 -378151 -414920
23246 -414920 67333 188407 219588 194151 168729 -186249 76464 -127634 206582 10863 222942
23235 222942 -372958 -75600 -189157 -135128 142078 86646 26854 112698 -371232 447931
23224 131919 -149131 4841 -192329 151619 -490106 131053 -122269 -73717 -17933 -107333
23214 -107333 45214 -46822 238722 -351 272928 -221878 -128222 -343337 68580 122409 88874
23203 88874 -89309 283976 -157478 -137697 -172602 -96307 164803 -169011 -92621 161824 -213904
23191 222284 25736 280452 -32648 168468 -166581 108391 -49380 -68638 -146020 -117650 -159869
23180 -159869 -49002 108994 134869 -103080 173184 -100800 -218801 -178671 -239445 -39415
23169 -378466 -87398 -246984 190721 -273131 -173283 168430 369778 4702 -83748 54956 -312530
23157 -431220 -16136 -55047 -5927 -89288 16261 -35230 -57460 -39943 10792 47709 -227185
23145 -156741 -58266 -15514 104634 435847 253155 5904 -314317 -368411 -64930 -142230 160806
23133 126564 -1217 109006 -32579 -11223 206967 -318289 3615 50804 61334 98759 -17511
23121 -281004 78993 -411252 240726 -48938 -170201 -181732 -51716 -67035 -34225 -254885 78615
23109 -32349 54455 -271377 -282144 404791 67114 -72237 -32939 126372 38837 262407 -168403
23097 214910 120907 -144583 22786 -105479 121950 -49986 -65165 -158288 118875 -11019 -184563
23086 -184563 -314273 112099 176924 94100 211176 133573 -371570 -118767 -82248 210233
23075 345180 123955 -15168 106545 61951 -327750 1866 -276018 -179227 223967 212060 265103
23064 265103 279210 -276107 -40745 18120 -380056 -209297 -50504 -423372 -325122 30923 159857
23053 159857 234136 22214 -50499 -269391 13742 -142896 70387 -414038 -249133 -276185 -346279
23042 -346279 -156707 96522 -86448 14613 87591 -63540 111937 14211 68592 106623 -123960
23030 7368 -279384 24816 -130886 -574498 -76178 64706 -13997 119512 248798 132587 -9578
23018 34342 168298 18508 -122860 -85861 97053 100668 25570 -12315 -430747 -197843 -22291
23006 -133715 59805 -117862 39607 107393 -7612 197849 -180606 -32949 -60673 447469 100726
22994 3702 460533 -148975 157175 22881 77547 -99210 99200 -90522 -230994 -240535 -183326
22983 -183326 -97991 -105852 126923 -414163 74226 -428524 70079 28533 -111296 79387 -359297
22971 99504 108434 3655 -6609 -63520 47659 -185369 -188194 131383 -19785 -279191 -304255 -296031
22959 -296031 -280162 -182484 -67634 -67521 -79465 -23728 244287 144573 247910 -65493 282170
22947 58525 106224 68687 238230 -163069 -387683 -346245 -246258 2674 127506 112687 140785
22936 140785 -94344 84327 -132181 -239428 -44956 -328951 233681 -27388 71935 87351 157949
22925 157949 109266 81764 140734 -170321 -154080 -1879 -64365 -108710 -493464 -105780 -164242
22914 -164242 -1638 137340 -310 79935 45740 95051 279030 154382 -12250 -112599 32534
22902 -123893 -61184 71917 -114038 -202509 307608 28290 -316924 383930 -49856 -337185
22892 -337185 -171802 85841 -114088 -75066 -59010 -19192 -187834 -115042 -76058 135761 109590
22881 109590 218943 19855 37787 296241 139913 -122765 -39816 124533 -365795 235533
22870 -145013 -97617 -125183 8237 -155242 -25298 -88300 -161963 -30333 36355 222531 151664
22859 151664 121640 18027 -95819 -185317 -40486 137272 -269789 -105404 -237454 -4737 101552
22847 107122 -124909 -98238 61167 282553 280309 165120 -86664 45374 -107291 -44162 32334
22835 393343 -299237 -97710 102594 60798 -272863 -277475 2071 -149141 42097 95676 58373
22824 58373 -76843 -317797 -273826 -201766 -412301 -80863 145131 23210 -294636 131643 92351
22813 92351 32841 -409063 -66147 -56348 -141907 -190638 103079 -78649 20635 -213787 -192839
22802 -192839 -255276 -39124 -98645 -269288 -9643 19855 -85702 -117332 -214281 235032 180115
22791 180115 -282348 -73669 -224876 -15409 87090 -28577 -201400 -281971 23190 178669 45845
22779 -221584 -86404 -125166 -23374 78304 -67207 329734 -153729 115978 -66064 316590 308950
22768 308950 42386 -48694 -65733 -165880 -15278 294727 -214273 130033 -318801 85227
22757 -14391 12498 -150086 -312491 -93029 -215425 -7393 -130322 8501 177573 50941 -140469
22745 -107791 3138 38498 -111101 -222286 -138615 -118158 -172645 -259937 -404021 -13785 -169118
22734 -169118 167039 -112196 -262292 -31184 -43740 -216643 -33075 348248 -241500 -33365
22723 74570 -105301 -109439 -42810 216337 53533 4047 49601 346701 49948 99740 -197830
22711 -109961 -143699 101353 175220 -123924 92033 -237996 166449 260408 233642 226634 -129383
22699 -83954 -26035 -158524 -140476 -245253 164201 15470 -280731 134932 -13921 -215788
22689 -215788 -269188 -132348 182469 -5807 -31190 4797 -48439 -313582 563976 181811 -6363
22677 11964 -66784 27665 -41072 34211 112192 -229769 -42107 34305 -52432 48805 51302 -114075
22664 142812 -58496 -452033 -282952 -301063 -62151 -314004 -173219 46935 103281 329247
22654 329247 -158336 54382 -305395 106482 -259893 177627 240764 319040 76246 45025
22644 45025 -223710 33041 119892 -222631 -135275 -314161 250353 36159 146853 -80110 19213
22632 134374 -286767 -13784 50954 145970 -2142 -87934 -55346 143182 17683 -453908 -58696
22620 -353820 -254059 -30268 -163770 -98787 -268840 227653 -237991 -543414 -20096 108536
22609 -53622 -121185 -23205 -327474 -184076 -290174 130334 -425300 -275233 -33912 -212130
22599 -212130 -214889 197735 11277 58916 -64271 -253085 21380 -31516 240200 138442 51438
22587 -112021 51152 -212475 165098 -4313 -153186 -385977 24036 100683 -106413 200272
22576 -85755 -193136 -7075 -289635 29659 46253 -91824 284258 -188011 152187 -222056 -203089
22565 -203089 104762 214304 -31482 -130288 -28190 69110 -38837 140686 -273532 97590 -43064
22553 135583 -73447 -40656 -58507 -23993 128090 -248632 -297455 131602 -37967 -29858 -228341
22542 -228341 -173249 -222243 -312296 -213628 91928 -218442 -96117 75967 -69824 -54044 47087
22530 -376158 -22310 -1317 -186186 -4017 274242 -110035 79503 -71336 -483206 202893 -63777
22518 -404248 -75664 300593 -127954 -333671 57817 -81196 111364 57436 -330861 161512
22507 67407 -390382 134889 -21118 12522 -75178 101347 33575 140867 158518 -300289 953
22495 43429 -80982 -127641 -90920 -190991 42404 -110619 -154129 -129669 -235814 -76354 66770
22483 -42723 -107656 -98790 219049 -46183 -429081 88902 -154193 45811 120285 -7067 30900
22471 137990 -293905 -40466 427869 -161012 183984 -167781 -110630 -161104 315761 -120370
22460 257816 -80286 140591 17357 8469 186835 -302103 -234835 239642 -34059 -269290 -72022
22448 147004 -221935 -8490 -60232 59528 330821 305519 376105 -21454 -415841 110444 209745
22437 209745 -49578 -171322 -50380 -44532 159172 11989 -94152 -13104 -126049 166246 236665
22426 236665 -163380 173955 25764 180086 -170668 112448 18199 223705 -125148 -20498
22415 95028 44533 -170781 83991 295102 19205 148873 -371496 -26141 -216777 -254783 -73144
22403 -163423 138966 -52577 47731 -176634 -150102 272832 143055 -17284 -12108 64475 -62287
22391 -67347 -213388 49289 132191 351367 49950 -366711 22369 36488 -19715 -23689 -5343
22379 -349229 152891 74797 20215 -173288 131362 102258 156611 -116806 -246629 -369932
22369 -369932 302096 -12945 -67301 -212867 -88298 -81597 65869 -114226 -171416 159130 -83286
22357 -43105 -85352 -213507 27510 69064 75380 -33349 -149986 81565 122671 -353956 16286
22345 35809 252201 140810 -266001 61268 57095 85193 174975 -7288 -209425 120095 108994
22334 108994 -112678 -33451 -32775 183093 -124481 -238392 -6184 -13327 -49805 -126649 -15964
22322 -234015 63402 -95275 8765 -162194 -85536 -123702 -225244 100590 4258 -90346 -434783
22311 -434783 -114086 81870 241730 -125875 590 93562 -213993 211171 12945 -132732 -25917
22299 69876 -56705 -121741 -188 -121696 -202110 -47186 113057 14016 -38484 343085 -47118
22287 -223614 118448 -176299 164024 15397 -307266 -83002 -200872 -59051 145213 -29738
22276 110664 -170921 -184091 -233586 29491 202396 138068 -185590 320450 42457 -111815
22265 -212700 -170673 -143640 258195 256786 46200 -329675 438699 222816 -306599 -8853 -222378
22254 -222378 -269352 -8416 319485 136897 -98782 -14641 13124 -85160 -37720 235711 -64165
22242 -48919 292195 144115 -102798 62102 -6836 -134101 -107432 88731 -18500 -425048 10158
22230 -154341 -149577 -94469 -37125 164455 178583 -110115 -65967 -212113 177589 -103929 -225424
22219 -225424 -152667 -339995 -36872 -325593 325094 -152561 -164657 -260348 81686 -82260 187792
22207 -197726 37554 -238938 139769 -116212 -47474 -50791 -119677 937 130935 10954 -204216
22195 83817 -60967 -105877 259255 -3080 -93755 -309717 -3915 23823 190346 -101784 76812
22183 -89268 130242 159696 215157 -39982 -24644 -104027 -259810 -411204 -68229 -190097 -198800
22172 -198800 -55722 -69320 -230098 -99356 17525 175675 -82268 337768 4872 -143939 -122049
22161 -122049 -340333 101529 -83103 -57608 -218881 6511 69559 -353975 205171 149456 -74094
22149 -138299 199319 -109790 36686 -106736 140530 67782 -313253 -105136 116603 -98704
22138 -206893 146554 955 -184826 -178228 61546 -31763 -307287 343559 273423 103688 -22517
22126 -1138 478196 56801 316960 109367 -97284 138229 -65860 -36493 173254 -405994 -3787
22114 -299262 341571 3000 -181514 -85264 42801 183255 23333 -304828 -190555 -222915 222216
22102 -285567 34158 230849 -125349 182891 -172906 -304589 -65184 134144 18201 112728
22092 112728 9134 16449 -504807 -122422 96796 -173437 -139628 -26896 111060 77235 120534
22081 120534 -155966 -30984 -321643 72215 539940 -185523 156389 -34184 -264016 -273246
22071 -273246 10953 -219398 -249827 -284912 217748 -194670 -290768 -105941 -9578 145607 22062
22059 -134583 -200042 -152853 -251686 -284988 -279719 255691 -194342 -364803 157037 -165690 -238774
22048 -238774 115083 -47136 243537 -63788 127069 82718 236525 -126826 -227674 -83068
22037 -52360 34028 175086 -57943 152014 -103303 -62012 39685 90574 145962 137451 -105988
22025 78660 -42110 37059 44910 -470839 91017 -141006 -1875 -121873 114272 -112108 -459527
22014 -459527 -118927 -35248 -180091 -41209 -75266 18741 -151786 -39117 28022 -151137 -63172
22002 47874 2969 -13712 201747 -417646 15555 -278839 -288270 -69668 -154373 -77943 -194302
21991 -194302 -23374 263227 -140793 -192026 56499 -66134 7334 185336 7829 67559 501 -143856
21978 -322698 -304116 -275980 -433150 -87355 -138409 90822 -4803 -25473 237195 -232860 -92111
21966 59226 42741 -41444 49761 368633 201909 249324 -49139 -78896 -14902 -158294 -35605
21954 -276118 39493 104331 -171759 141556 84680 -289443 -75834 128209 -47534 237497
21943 193883 197202 82337 -154626 136042 -27213 -151397 170046 -123923 -13405 -49871 -34438
21932 -34438 -28768 -20766 -455941 -145058 -88064 -65362 -154328 -240059 87876 135916 104579 -119812
21919 169108 241944 240434 -416883 -157405 -73408 -48834 -473297 -88816 -151881 91212 28368
21907 79463 -382488 -87031 127378 191799 195249 117604 18736 -35270 -184375 -270812 -73194
21895 -18156 -90812 132058 67463 -134641 29997 -81855 -183663 -233472 -32718 -2632 -405123
21884 -405123 -105165 -213622 124534 24538 -126809 -44523 229693 95294 12952 51464
21874 51464 -56745 -66722 -204427 -294215 -359202 -251634 -46865 66726 193578 77439 -51976
21862 -157068 -239816 -126994 -38094 -166747 -262592 -64918 105652 70168 -8406 -96026 -98468
21851 -98468 26119 -95894 -63209 108295 -56390 11594 -303351 20614 -90414 -8742 44342
21839 -160320 -160613 -286666 112049 -75744 -163398 -275989 -22621 111536 -158714 139217 258367
21828 258367 -122508 -70676 -221453 -73278 -176921 -228537 -194688 160772 -23268 24147 -169513
21816 269945 -170757 -188029 302561 271000 -79139 -117290 -296434 -235973 -309422 -226255 396600
21804 -126206 261598 -85402 -328986 101793 -212940 -65683 -8196 -37960 -402967 -261847
21794 -261847 -139814 22189 -99237 158417 19166 39109 -112887 -95133 -13273 62422 208585
21783 208585 -30542 52687 -57647 271485 -83023 175677 149986 38643 358239 -290031 101365
21771 61643 66859 -374399 -219721 -69892 -231344 -329808 -64641 232435 141693 -143592 18755
21759 -162286 180819 -148345 78804 -18754 -242671 -156800 68408 -693191 228443 328202
21749 328202 -100709 -428903 17703 -97651 -295042 115299 -336513 -45324 -71760 -189661
21739 -189661 -202303 -266763 146710 217729 5965 298465 -54637 -66883 -110796 -121282 -161103
21728 -161103 -337195 -296154 40036 -311479 -19532 -210354 -83998 -155330 -292377 208539
21717 -225889 -159598 -347715 -161543 -824 -962 -99797 32349 34860 60794 20619 62872 -129102
21704 128553 -325751 83411 187708 68677 -119816 -58884 28349 14599 -45119 -136483 -125476
21693 -125476 -186105 25198 36397 -94155 223069 82860 496506 -22906 -99321 72036 68478
21682 68478 -68256 44761 -315935 266170 -323580 -192685 -168970 60208 -25234 69746 23163
21670 231478 -259184 19307 -36234 121742 99063 -191533 143610 -155624 -111096 -261516
21660 -261516 -18503 24825 -13117 -185078 -495926 -42874 -314908 -70818 119218 59733 -113752
21648 -22231 88584 -22311 -139682 180350 12892 -190503 -146717 41849 -94596 -99133 86449
21636 -308503 -52028 225581 191995 48200 -64342 -309511 169526 -109719 -145475 252303
21625 2362 -257852 -96854 -71092 -260369 92690 163439 -19902 -128973 -75651 317647 156269
21613 -84356 -70312 -52375 244043 97740 56097 30720 -182108 -184321 291553 77834 88456
21602 88456 206364 23975 194314 -131594 105731 -123397 -48694 -4317 17647 140445 -90210
21590 34784 40162 165946 -21234 -235041 113822 -175060 -72779 -303373 -133461 -132792 -39046
21578 -22647 -13590 186043 276328 104055 -176461 -219241 19778 -169192 -290938 -54918 -165055
21567 -165055 -50758 -220546 -68718 -182875 409152 -491972 -101137 -10114 -299335 59993
21556 127815 -117860 -160174 -197385 -36023 -285208 -200776 -55117 -1037 -96905 157429 61307
21544 9237 -122674 53638 78249 -232561 -151346 13530 -85828 14623 -92788 -127587 123316
21532 -261881 -125192 -110591 -152301 23826 -429647 -107292 -23626 -59516 -123419 13189 -173864
21520 126736 -147267 -71222 113536 -62550 -103397 221100 -145432 -110679 106398 -189736
21509 -136866 58553 -83775 13030 -133505 -193386 -25737 -161782 -96220 -237112 -41736 227751
21497 33848 78183 -66360 -174015 -60997 76190 -207272 168952 32460 -85023 -34405 -12285
21485 -145038 147216 -88100 -1896 23334 -132213 134933 -147400 33900 -299357 -49436 -115222
21474 -115222 99040 -33397 19722 -168968 -206770 -132568 -9429 -209684 52051 35150 27404
21463 27404 -90046 175315 -281027 213157 213846 19602 193089 -42118 -389620 250973 60614
21451 32588 -235936 140720 -130756 47702 61697 172666 -66649 -233603 -356389 -223423
21441 -223423 141181 -351650 -100151 131601 50735 -202949 -84896 -77570 46820 -54512 29575
21429 -269798 65704 -144134 142417 118966 -281093 -40802 32821 2657 126880 -20214 62080
21417 -447986 29126 227609 209511 309111 269711 258913 277493 139863 342402 -141275 278843
21405 -147306 -124380 176542 46448 -208702 267896 -446194 -13338 -5190 -111469 -4795 81030
21393 399554 -47572 24382 53523 -232705 -184875 -289160 -165421 -201633 111712 -238717
21382 23679 174766 -88643 183973 -212142 -282961 70258 -608 33032 -192748 101486 143151
21371 143151 125167 -59369 -48389 -26046 -280638 -293111 42672 113173 -38277 171820 54492
21359 214658 -126337 -166854 -235366 39933 -142866 20130 78612 -30552 -191791 78025 -200782
21347 359851 142947 -115298 -75496 -15325 -186400 -62914 199373 -39397 -2218 -121664 65105
21335 -93818 -461577 -60179 -205543 249676 86355 -157125 58341 208221 153131 188009 370687
21324 370687 -350849 68712 -89570 96659 142210 -198695 116847 -38689 -32863 344639 209554
21313 209554 87399 -119525 15981 -332883 -269396 -108843 -350161 -178333 -287531 -105636
21302 -175691 34732 -216798 -218580 -85851 -138739 77585 103278 -127654 -22929 -92337 -92293 -85471
21290 -85471 -49271 3413 -74730 -342883 -120850 144436 -40562 -283783 105339 2264 -49221
21278 64634 -81617 372831 21774 -56292 -6443 -63455 133413 -94159 -332638 -1180 -80847
21267 -80847 -199714 -209899 -5117 141344 -109864 11909 -107323 83248 -64119 -192849 -26218
21255 49684 243029 238388 273928 -109663 252118 -29204 -151753 -192976 -114838 -44318 -287183
21244 -287183 -499743 78739 -111281 42195 153545 -146652 166042 -323869 6152 -250175
21233 327799 -34579 -137856 -84932 -185012 106552 -119771 51191 -339512 110645 254016
21223 254016 -160901 93674 210430 -62262 120688 -111233 335957 -11155 37186 169719
21213 169719 99804 223394 -105849 -47665 -128413 1796 148563 3015 -103551 -86263 -193688
21202 -193688 -25267 -117511 -285443 109750 -115901 -272932 -377189 200367 -52675 -128118
21192 -128118 -4773 -12016 -26230 -230582 433 -299812 -101862 -334716 176531 45599 -30338
21180 -22202 -293870 191242 -126254 -155531 -25025 -171232 -254481 2355 -175393 -122164 3478
21168 -39774 81956 30153 -195149 -275079 264424 115454 -173015 -150023 181827 201598 102912
21157 102912 -287781 -345548 19816 1750 23152 -107707 -109205 -43604 -34844 -233646 32594
21145 -3376 -142127 -281597 -200045 67590 377309 34874 -199380 -102625 -191472 -365914 21211
21133 -111777 6490 -220525 -19731 -192584 -182836 -41623 41050 -344326 -264320 100901 -462750
21121 -278147 -33658 244111 -102044 -97057 -5261 40697 -302879 -102698 -61625 138358 238608
21110 238608 -190947 -241843 72753 258732 -187168 -191035 35643 137674 -186120 100131
21099 142716 173580 301898 21350 -149198 -414201 -153502 -80522 -67193 -236559 -154402
21089 -154402 15174 -643 -51487 -72132 -182779 29507 343687 -107354 -46462 -64677 -384491
21078 -384491 121034 -57165 -111600 -145125 188884 -234607 -342207 251942 -141433 205457
21067 346756 184724 -209786 -20542 -175798 181892 -179778 -410245 -64721 -61355 140705
21056 113206 -127400 -305291 129445 76424 -386451 264166 71897 -115700 -20300 -135211
21046 -135211 17276 -229107 114493 263447 189193 -75157 -326474 -147132 -101010 -259812
21036 -259812 -244044 -120344 198779 -191530 -30604 -61008 155299 184442 82532 -201671
21025 -188099 11196 266734 270121 -11340 181611 -33933 -119591 -85649 -152473 229511 51957
21013 133482 25915 -171117 -67878 4985 -107706 70839 125060 -11876 -250391 -81540 354159
21001 28998 27535 -242224 -101527 77024 -25041 -218946 6532 -123764 -228979 -265446 -295822
20990 -295822 106461 -319041 27406 80887 205537 -109013 -229551 -33569 -92505 24353
20979 -109316 33255 10485 -127811 33869 -172512 -167838 -217141 356975 -132292 -130044 -1961
20967 -202956 -302529 184007 -89948 114105 -59957 81286 21017 -292655 -158353 -412328
20957 -412328 -26798 15646 59201 -131163 -149696 143991 134048 27275 29562 113260 227223
20946 227223 -36496 185675 -28728 -197407 -82543 336099 150532 67537 -22911 -81431 -30228
20934 199623 171667 244629 204454 -64045 -29767 -78391 -198028 7602 -331966 247473 19601
20922 -254373 211212 50712 -214448 -24581 -95950 -7009 -254567 -80811 -263012 -192608 19801
20910 85585 -160931 114067 -66182 3573 -157444 299146 -83791 107259 62819 -39811 -188240
20899 -188240 -165797 -107873 84377 91959 -168619 -174931 140421 -34506 170059 -213287 83259
20887 -137030 86336 72721 -189989 91847 -93746 -114851 122085 232320 35230 -28674 -276188
20876 -276188 -92522 -333224 3255 -351066 -131087 11163 37640 -176920 -176959 -65307 115947
20864 -121201 -232650 288652 23765 -159259 56683 29810 -17930 97938 -266389 107833
20853 -126500 -200230 -300263 178757 -37578 -54258 -82491 165624 -23656 -10209 -212400 -34122
20841 -83428 13240 -200295 22190 -368857 63717 342157 -127437 -56878 -8487 -70645 -147690
20830 -147690 -197656 -192089 -276857 -75143 -219805 249865 7480 -17779 -137254 -87181 42468
20818 129303 -233657 -152503 -47786 -53586 -44677 -204581 -112192 -880 277589 -335858 -137311
20806 -22791 138709 -347229 -49519 151069 -105680 -39061 -38545 333291 -110034 -174066 -53722
20794 357611 -283969 16785 -36646 27666 -159798 -196588 -135096 -471334 -129880 158826
20783 -31453 -243056 97488 -215326 -381362 21926 44394 -97695 -222861 249750 109604
20772 203510 21971 -120486 12352 31355 -44791 -38411 -25761 -53850 -10432 262518 354811
20761 354811 6523 -119116 106853 -46025 -335162 -61949 -64131 173036 46817 23528 123933
20750 123933 -400091 -198957 39662 -219691 40374 76525 -70898 -415073 395691 52420
20739 125922 -435812 -183103 93972 -347130 14121 -135631 25754 -263436 -62738 4177 -45437
20727 62927 -311930 -96455 -203930 -344876 123834 -3550 -120660 -73049 -244891 47303 58490
20716 58490 265396 -177566 -108656 35638 73674 -162372 -103696 -30039 -16731 -270955 -48796
20704 -10199 236351 257000 202648 -355987 174640 -167669 -141567 55230 200835 -63162 73966
20692 37904 -160090 151472 -81489 26208 -106718 -3513 19416 270470 -238885 -86238 -97030
20681 -97030 -41606 -219428 17387 -77830 -297681 -390261 266 -216074 27959 141831 -40906
20669 215609 -169546 -187559 160692 49606 116064 265655 -328597 92462 -312105 130369
20658 -20569 -28193 -9805 -48916 -159978 -198062 -234841 -444201 -52541 134021 -373522 -7393
20646 142311 -368315 115302 -439713 163039 -81427 190288 -185064 -90923 -2230 95018
20635 -140348 -155926 225234 125487 225473 361564 78246 -145047 -68332 -230156 132206
20624 -37468 206970 -104626 -78184 -36753 129196 -408651 -157152 -95155 -12022 -230584
20614 -230584 -213535 -142045 -93788 -203153 109309 -31091 -147059 -39010 -291554 -168169
20604 -168169 51223 -64785 -79566 84556 -378322 126026 -177390 85767 -135723 -34865 -160565
20593 -160565 -186085 -30899 -49946 189255 -198320 12630 -39807 -210026 406417 -57079 367015
20581 -151681 -37588 -323793 -197792 233105 23487 51172 -116534 -263573 10065 -190790
20570 162694 -129814 -36190 109331 -56146 -45576 -101963 96388 147913 -48536 -39428 -3891
20558 301629 -109530 348691 133189 69854 323390 27908 185945 463865 -101143 -145659
20548 -145659 -378641 80569 -133373 62276 119765 317651 -172580 303040 -58461 -94404
20538 -94404 -211729 -46174 -152893 -40096 -21865 5170 -69720 217661 -307987 -15388 -68593
20527 -68593 37955 -242997 30014 -103134 -159509 -155688 -146302 -145707 -35651 -190033 -106396 -26672
20514 88457 253744 -139662 -117329 -208733 23900 -49566 114842 -221829 -119865 -128853 -193666
20503 -193666 -250608 94131 -305202 -109740 -212882 -110265 -22858 -64262 46460 -82270 -352445
20492 -352445 194095 -258924 201557 175004 -244979 105908 -101348 -138618 -76384 95842
20481 17266 26106 -213333 -260448 -173074 148639 -119319 109812 -88903 166966 -196958 -350443
20470 -350443 -213973 -215166 -27428 -231322 109829 65970 68386 139633 -32307 7702 -169402
20458 -271016 -326087 161932 165991 -105054 144361 82938 -254565 -62140 124611 167747 -30117
20446 53291 -8378 -202388 46932 83830 -76027 111520 -240785 311711 29751 -110751 -431792
20435 -431792 -147561 -283430 6376 -297670 -127815 -72434 265455 170210 -26052 -26760 9024
20423 154423 48825 -244647 -17446 -85573 164624 66648 -30494 222247 -58018 -163626 20296
20411 147797 -156338 -230478 -29186 65524 -123213 -170480 279865 -198221 -39333 -196990
20401 -196990 -247681 -90165 -219491 -100211 -390653 -58563 92560 -89107 54526 4964 60860
20390 60860 -38059 230886 -190635 -114042 -72447 -114789 -116761 -32509 -95131 -110411 62733
20378 -9074 -253573 16050 -248114 276900 134633 -191035 372204 -12387 -152549 -217182
20368 -217182 -55268 -37758 -339029 -259823 163592 -262382 294310 361118 126482 -177824
20357 -159316 -42787 -303543 56999 -40298 -137073 -174929 17186 144489 141733 87665 -221861
20345 -325503 50691 68489 -238238 -138672 -6072 -203565 -185858 -343321 -3843 150924 18467
20333 -250218 269854 -53303 -181938 -319752 -3371 -169005 -216774 81001 -1522 -1561 146888
20321 -26746 52501 -119272 180849 -317488 340011 -21280 -254273 -252864 -74033 -110395 -42418
20309 37486 -201463 -161269 -118068 -152076 -283312 -38141 54262 -37434 119915 120538 -246231
20297 518839 -214538 16587 -13106 -92929 217020 -17619 -201795 251033 -148274 -58651
20286 -72097 -179814 -96889 121296 -137486 -250291 -212362 -166353 152282 227239 -126378
20275 -106582 -209371 194511 128999 175790 175900 -177641 -55594 -250629 -64101 -236766 -125476
20264 -125476 59783 29187 -277148 -143687 310854 -6139 210241 165771 -104297 -155291 -215590
20253 -215590 -149622 -81102 -326300 -241829 -299970 33035 -23108 52584 -41507 -160196 22601
20241 -248261 -62704 -64246 51330 74097 -109198 -149571 512 88546 -484822 83631 21290 -140141
20228 226678 -126324 -191297 -147292 -347570 63235 51633 -79899 -98372 -450342 -106276 -264199
20217 -264199 -57565 -25902 19332 187052 -128608 109696 -336137 -197518 -155900 153119
20206 -246315 64887 -293329 80636 -138171 19476 77022 274603 -131661 139831 -172304
20195 -344424 -83170 98288 285472 44662 -87507 61520 56928 -39769 50713 -112561 302640
20183 -160101 -20254 71 -46700 -162696 -360180 300152 89448 91674 -103246 173644 -219805
20171 93313 -23449 -274760 -145240 35204 5955 -38453 154638 224360 -122516 -233843 -4412
20159 125850 -114567 266638 -93993 240123 -110286 399709 -169923 132850 -169347 -225214
20149 -225214 -37386 -283469 164991 42474 -440889 -105975 29471 -100758 -2456 21159 46758
20138 46758 84204 50729 142812 108120 -268917 94110 -154110 -177024 84060 -283091 98628
20126 -226209 101329 -43349 -35617 -52371 31796 146476 63215 -265085 299035 226438 156007
20115 156007 -340334 243102 54464 227801 -227383 -186599 -376830 -49058 188194 -247073
20104 59742 -112286 -56956 -31256 -14030 -244949 -230083 54872 -27992 -14053 374355 59443
20092 120570 -106204 122839 344188 -232706 -230724 -53936 264722 -223649 23036 -7457 -51355
20081 -51355 43116 -29118 63232 95907 -178822 -31630 -161632 -67814 -92810 -49289 -214479
20070 -214479 139408 -281350 240757 -355192 131008 -103251 70167 61583 -351239 -246556
20060 -246556 -126667 -29662 -230893 -278884 -208683 -241747 115918 62568 -17576 -209318 13617
20048 -249193 -240556 -199712 -21664 -5849 -72056 -314494 -235405 369878 -28470 -183895 -106290
20037 -106290 26004 -359717 -122187 -23870 -203508 -168756 191973 -378817 -325226 -56577
20026 -204709 -23459 -116570 135051 14852 75732 -110667 -247228 -406673 -76970 -53943 -106858
20015 -106858 223010 -79203 -129974 -64160 -166626 -224040 -54518 342 -34066 -15365 253353
20003 120535 -158942 268774 137214 5510 -206024 -108883 -93088 -29539 63228 -290806 -60965
19991 227070 47629 -218580 45241 -11614 -289977 -263755 102135 322651 -319037 -92264
19980 58768 -26270 -236154 -94537 212422 -283784 -119786 68004 -96121 -222632 -138030 -264815
19969 -264815 118339 51895 -399758 209938 -142061 284066 -97174 -48182 -4112 -27640 -250192
19958 -250192 40694 -50033 -225579 -135471 -106462 -101271 -332838 -1012 249250 -361369 28326
19946 321475 15022 -36503 -140387 73300 112582 44416 -15022 180035 4486 236651 -310443
19934 -126974 -89528 -317280 -97271 252913 44068 -217837 -91188 35924 251222 -178553
19923 37041 133113 -145116 192380 -283318 280601 -2064 -68552 121603 -404409 -63268 298225
19911 -194442 100137 125952 -135813 1357 -300411 -77333 77199 -46816 35277 -78209 -41339
19900 -41339 -6211 4978 -603050 -47399 -104983 -458809 -78298 -310168 -298849 -165834 -201002
19889 -201002 135405 110108 -190222 -85458 -302271 105767 110977 -173058 -143191 42929 -50117
19877 -305367 -244152 6112 -437136 142325 -74977 -102297 60154 -86295 77954 54005 -279480
19865 131625 3994 2256 -330061 -32541 -69139 -148946 14706 -162067 -78582 59337 126290
19854 126290 258912 -99758 54169 199745 122622 -351793 -313918 251798 -161476 -33247
19843 23328 -116385 70093 -48487 -215315 -16954 -303834 108721 -176470 -124912 13737 -175767
19831 -121465 -129135 -3868 -318321 -447507 90903 -141730 67220 94241 -12442 189171 -413439
19819 17236 87192 104769 -125740 -89147 -173923 -87822 74970 112023 158856 17503 -115782
19807 -90152 249976 -412772 121971 -117852 -80497 324781 -217102 -211723 346299 157515
19796 74801 -234011 109656 -9411 14412 -91173 -300783 -199937 239334 -60289 -381609 -177047
19784 -382321 -177493 25573 -97613 -248510 84854 -64394 -26810 -121267 27468 149441 6474
19772 216479 37910 -371758 -348305 -164149 108182 -48848 -202431 -394873 54702 -50325
19761 18050 74489 331879 -109563 -80399 89372 233483 -291924 -212173 -62648 9964 -384217
19749 -329618 -273613 1824 113774 -282381 -13872 -418488 7891 169924 -84127 53185 -38295
19737 8121 288422 -154790 -523841 -256186 -25083 56181 -212942 -87846 -243841 -138571
19727 -138571 -114695 -195095 117235 -183601 136970 24828 202867 -304700 -136670 -101726
19717 -101726 -142665 158064 -103568 -39303 8188 209381 77206 -1741 -327458 -66351 -6037
19705 -217515 -2055 -21153 105994 108267 -5510 -273724 87499 48486 -101233 59849 240261
19694 240261 -129577 39092 -297639 -274097 -26644 -195980 -170654 -308363 -69981 134231
19683 184220 -46563 -122836 -231063 -409924 -41827 -41605 -83457 -520316 -53512 44755 -425718
19671 112612 -77764 157361 137568 11474 -7479 72566 -61562 -128853 64869 136358 109101
19660 109101 -100127 -288643 -288109 -88301 -96786 -256332 12888 102133 24449 -77684 296346
19648 -110062 -203480 -19308 -177071 -113763 103980 -127940 -49896 -123228 -2552 -343408 -19855
19636 67823 -98582 218732 -362208 -186042 111030 -256065 103969 -505337 40188 13769
19625 -502927 278504 -199717 -23450 -39646 391736 -166412 110203 -201578 -444428 -219229
19614 -225721 232577 -29187 226789 36948 -246978 -115081 231283 -86589 -58631 -114325
19604 -114325 -103266 -2847 -61604 284600 22970 -20623 -62065 -211769 -7836 93515 -160288
19592 -36741 357540 -390700 43537 35514 -181896 304052 95231 61695 -99403 -200338 -53480
19580 -257938 -59214 48948 -376216 -386430 -183578 88102 133923 -290896 -214184 140926 -3615
19568 125796 9396 -100028 -436030 -178217 85276 130382 27791 -110571 340456 13659 -127483
19556 -204033 -184459 -289641 -319981 -6559 237513 80923 -298530 274157 -16633 47143 -1014
19544 -273054 87101 -198336 -150464 -184032 -186124 -290255 183050 158986 297166 -320161 -207698
19533 -207698 -285703 -30362 -207447 -163656 -147902 -92150 -380353 -104055 -73335 -103980 -51512
19521 52588 165469 155970 -39475 -160748 80437 -88068 14050 -248034 106765 -280004 -68960
19509 -187493 9523 -273065 -97997 43740 -159515 -297708 304109 -245336 282375 248944
19499 248944 396398 15737 -269383 -5687 -183392 188633 159298 -292388 -223265 -54580 -409799
19488 -409799 -288228 -243865 -111643 256035 83860 -63208 -85742 -345152 6331 276983 149834
19477 149834 -157963 -237922 -99500 -1927 75927 -321543 -12224 37018 -136298 -99195 -186336
19466 -186336 134009 -204597 -41044 -43833 -186599 80784 237575 -255035 -26692 -72906 -15486
19454 -127386 42617 -27797 37647 224045 210903 -27607 -271553 -60488 -152777 -282842 -546186
19443 -546186 -60032 14210 -233932 -232106 -303563 -207414 -373008 147455 -543 -167225 -152634
19432 -152634 64431 -214700 -126438 165136 27163 -436877 -229697 -70858 -147671 25164 -20454
19420 -99348 -188991 -252437 88894 -115652 117718 146047 -111888 -216677 -76833 -283726 54691
19408 357983 -130524 -184478 335833 -88471 -166671 -275489 -133774 158933 81014 -185723
19397 304601 -100798 -215964 -150127 -82440 95393 19645 -2621 -6478 -25259 -145121 -26496
19385 -184889 -135347 68720 102313 25986 -37109 -244297 159011 -88603 27947 -288883 -266757
19374 -266757 -447719 55259 239033 80140 -209514 51493 -225536 -107347 14180 -132017
19363 -222130 -89145 -49935 -41866 -241223 475225 -377922 -134102 -360745 90701 -126869
19352 27325 -210268 187296 189496 86684 -127453 -75667 123014 256822 238649 -385213 -276282
19341 -276282 -380270 -163791 -253630 38405 -380577 -98505 128805 -124711 -116138 -184547 -176298
19330 -176298 18909 -346881 -60904 91783 -164343 -21026 -375745 106292 -5085 264948 -51524
19318 84584 68220 -129683 -163139 375805 22389 -225137 -82564 317181 -257433 -50793 -70966
19307 -70966 -100856 -93458 -110176 -203402 -93236 122811 -140017 40468 -161877 157596 134628
19296 134628 -311450 250918 24502 -87437 -26344 -251724 -149660 -89052 -459150 -173003
19285 -43968 -98079 39237 -333195 -44211 -130046 28054 -160791 -159293 -115036 23316 23428 -93453
19272 -33426 -298485 -61581 -45417 -249982 -192610 -151677 78801 -273621 -157811 73705 -175651
19260 -11482 -171047 -13268 329145 213922 24577 -154825 134073 -233355 -23884 -63949
19250 -63949 -75843 45779 -283971 66798 -273700 262067 -28155 -472677 -136956 -46339 -91352
19239 -91352 -109717 54982 180101 62853 -237910 90372 -283450 -242133 66650 268011 153485
19228 153485 134533 -251139 107776 224744 85760 146719 -2966 -118572 143604 -203536
19217 -391237 -107165 210288 -358605 -403081 -10155 -180347 -36073 -416274 -235035 -294759
19207 -294759 -142972 394789 -27030 181794 -74416 177443 -44694 -17791 -34270 118479
19196 -45233 -62803 22906 8422 -60922 -463060 52231 -132173 -225887 335114 -104076 -25421
19184 -95434 -7341 387065 -128956 -86621 143275 -78325 -265830 19295 171610 68859 3481
19172 -163882 27458 173900 18865 -146390 -261172 287265 -293530 44967 -27344 54454
19161 -258804 179734 54893 -43659 -247806 -141033 -65074 75972 -166680 67007 -145551
19150 257634 113444 -89496 -84209 151940 -34202 -441058 208407 -54280 -124530 -244570 50384
19138 48672 -232364 -277096 -512106 -34655 -244560 -537246 -58323 31083 -167414 -173052 55733
19126 71006 -58274 -138976 -188186 -256394 -52965 85753 -170121 -16038 -296071 343397 66445
19114 71417 83095 -153745 -215691 -297203 -98003 104220 -49342 42654 -41033 -127270 -77930
19103 -77930 65688 -124554 -275643 -255450 -145509 20669 62962 -94044 -146376 -41295 -27333
19092 -27333 -9596 80060 127141 59328 -40005 156331 -238500 35735 123709 -100532 -346503
19081 -346503 32925 -120406 -149487 56770 212666 -293603 86907 69343 -498074 170625
19070 -199338 -204046 85040 52387 -56123 -549337 -169468 -60735 -128733 6813 -433770 66719
19058 78280 58253 56025 -215205 -226014 -68197 -10591 -3818 27349 138341 -96396 126545
19046 -70326 -33513 -113323 -175970 -313902 -99783 -244675 -125589 -154791 73270 121954 97923
19035 97923 222116 116926 -14705 -166998 -78917 -54312 76813 -30661 25696 -340805 -157483
19023 86899 79903 -210996 -82471 -127157 -55226 111827 -81519 -62655 -234097 -99864 -156958
19012 -156958 98807 -140277 157515 -309734 55853 25092 122613 -160916 78226 -36484 25103
19000 14639 -115502 -289789 367773 185004 -30542 328585 -68496 -55393 67473 -44918 -155572
18989 -155572 293411 -90676 90577 133607 -164432 65530 -33168 106570 -79548 -40974 -58768
18978 -58768 -86762 25513 -10611 94087 -419311 11339 363416 47932 196897 -184883 -90131
18966 -103326 -44466 278900 -294561 -781343 -181536 96437 -178514 -127140 -43219 45263
18955 54275 212917 -83229 -58493 -373173 268026 -233339 -241372 94998 79839 82291 -334240
18943 -146025 78598 173749 -67807 -103536 -21672 200097 -188018 122651 -5939 -81311 -207733
18932 -207733 44885 -213706 -324405 37128 122652 46208 276687 -201125 -76343 -161532 -271039
18921 -271039 -290580 -205028 132780 -78082 -477313 -313543 -347766 42027 -194356 -129008 -98707
18910 -98707 -196514 299043 130059 -157542 66467 101885 -253123 -6784 44749 -193661 184953
18898 -207808 247055 -91559 -72786 183925 -74790 122863 -222059 141446 -51506 -11115
18887 -246353 -36650 3472 72988 -319152 109528 81325 -300942 807 9044 -109687 -3033 -19358
18875 -19358 166891 -44028 -216482 -2606 -131906 193905 103014 -99599 118981 -282623 65082
18863 -113156 47919 -205789 4327 15319 -318025 124513 236683 200392 -76641 -335710 133888
18851 -314110 -180855 -187536 42840 -15366 -62927 336970 75273 -51958 -191642 -226668 -21005
18839 80444 61661 3950 -150471 46120 57758 1231 327201 -314671 -30726 257518 -298470
18827 97483 208937 136196 -105675 203662 61141 112228 388997 -78578 165810 -127268
18816 207275 100038 223710 -123394 219879 -100347 83471 174138 395946 -340365 -169016
18805 -131666 -99364 15753 35517 -56002 -141907 -49941 -251149 -99135 89764 -91309 18217
18793 -79552 -17503 -257323 215929 222418 51167 -172612 223155 -25235 296500 38104 104239
18782 104239 -160265 5072 -3543 95146 -141815 -579522 31675 -154120 -126819 -102138 37100
18770 -470871 -148832 118050 -3101 -177120 -166548 -212828 104371 100058 -31636 -112396 -37794
18758 54647 -113227 264395 -348415 -106894 68270 57430 -134040 -52844 227565 85450
18747 -122557 -161091 -30286 -85426 -14821 -138901 -91451 126325 -94248 56916 -182886 9170
18735 -338741 132484 2511 -105638 188505 46465 24302 -195860 -255701 210266 69816 -175558
18723 67243 68037 -88948 -218710 197226 78225 -425849 -187636 -219630 -36529 -191251 -28605
18711 -328950 92911 64090 -242424 56701 58853 -195836 159696 -22265 -48903 -36583 72061
18699 -162537 -27584 133280 155746 -213759 -374048 -278552 -116673 178385 -29631 -26225 -6863
18687 52103 36000 -75815 -278192 -324654 37720 73480 15892 6274 -410207 -62037 -243683
18676 -243683 -32863 -113489 -174821 -232161 81009 42580 -218076 111262 157267 -18257 -272524
18665 -272524 338986 133961 202591 47224 -18073 -186032 -92116 -55115 12472 -77670 -90409
18654 -90409 271972 -311607 -149372 -193932 -346837 326568 -161879 107664 -7488 -149470
18644 -149470 218124 51665 92888 -81601 -129977 -107722 -207336 -64734 221912 -126169 -133552
18633 -133552 63990 -236965 -48792 195590 -181355 -120379 -11589 132287 -33407 -46871 2480
18621 -587279 243084 -56037 -200516 317291 -462449 157157 -150023 59114 82124 -285529
18610 -131469 67449 318181 -282607 -92084 208355 -5275 -40056 -13126 -157598 -202158 28844
18598 -207 41475 -268402 -145677 -71195 -13147 180157 -70735 -50112 -3557 -139698 -39536
18586 -413286 -5449 53705 -161381 -204855 250670 133883 151327 -85380 164764 68168 -158892
18574 200309 -179077 -20879 -308700 -42503 -219835 -356949 -411608 7267 -182698 -140652 -79122
18563 -79122 -242672 174105 5450 194182 333668 -197726 -388112 -114836 -214394 -24932
18552 205346 303173 -86699 154856 -139055 51470 -109297 -83132 -33455 -6649 111129 269819
18541 269819 358787 -185996 507192 34287 -212733 192077 -84830 -75536 21474 -27343 -94813
18530 -94813 -78926 5505 -294118 -34907 -65926 -269280 -48706 -36026 62375 -136505 -271576
18519 -271576 179470 5968 -12067 194721 33117 -74506 -101286 279421 -56707 -257663 -54259
18507 102378 -390356 -200535 118412 180619 -267220 -46791 -197122 -89942 -212618 -13861
18496 -81056 -389835 84555 -38504 -74740 -74260 99531 -139422 -98474 176250 -25774 41946
18484 2851 -129230 142242 20000 -99513 -11829 125843 -51591 -374019 37439 -338421 -227941
18473 -227941 -275691 -198793 -109373 -28365 -109 -450335 -59109 -101727 -15042 50732 51959 32201
18461 32201 254448 -298121 -128522 110332 -205039 224456 87341 -46109 -549490 -224048
18450 -7287 28868 111914 -6931 -134779 -242091 -103488 -206540 -168411 -15735 -38622 -126960
18439 -126960 -155169 -434603 -89550 41817 52146 206090 58308 -166257 -229199 253737 -489451
18427 -142397 59105 -43550 -52215 29020 -120465 -111012 98253 38802 -347743 191048 -191079
18415 -270358 122959 124616 89791 603 44280 260253 -382783 -208224 -1967 83433 123466
18404 123466 -264847 71337 70122 -248878 -138331 215876 -55868 59640 -144605 90161 62647
18393 62647 -17756 242689 23673 39295 97916 -322659 -36261 -180856 -259704 -293640 20673
18381 134104 -110825 30803 -204490 106010 197037 127446 -146703 151046 424942 172285
18370 -107864 147084 113428 -59871 -106956 236545 84807 -178853 -14996 -69097 103940 13718
18358 310770 166835 -25828 143096 -77047 -177015 -79665 186378 198754 35774 465717 -110549
18346 -433567 -163509 -31871 80720 263612 20649 -118786 57073 120897 -47564 -12825 112326
18334 155795 -453 -93060 41470 -131760 39658 -123096 33515 -176450 -390924 128101 27329
18322 207709 -92531 90756 -29789 -142313 -111622 -276279 212502 226477 -275512 130022
18311 -24396 -16592 -210900 54024 -190235 -268551 123941 -278527 7912 -3741 23071 157217
18300 157217 -315511 -48061 -212898 -40187 -225978 51841 134787 211242 -212841 -166451 55704
18288 -216349 21205 -428015 342348 -18366 -169028 -192086 -207370 206055 -119334 63412
18277 -40976 155968 -164598 -215177 81871 -4464 133331 -202177 -287600 201334 -98292 -109861
18266 -109861 132411 -82783 -54622 -65531 -25898 161310 219707 86632 -89223 -136589 -331158
18255 -331158 -37221 34938 114022 -45812 271577 -187415 175789 102902 -385548 -232145
18245 -232145 36401 -413993 65553 280232 219054 21822 -234620 261309 -213307 -158658
18235 -158658 12263 -439183 -78737 -211134 -270867 -137781 -5920 -73835 -301008 -381150 -30642
18223 53898 -268698 -324246 -26030 97653 89098 -346716 5233 188588 -8662 -209756 111049
18211 41504 -12942 167200 -121528 211814 133973 -200236 -5027 -249111 113107 -98876 173365
18199 98891 54279 -18195 85004 206177 -169990 -73715 -256984 112056 192069 -326574 -96942
18187 -130846 59534 -440920 83025 361777 930 -272286 -106249 -132096 83098 -333866 -102030
18175 92816 153970 8231 -45128 -98478 290796 -99857 -62219 -189615 -303326 136407 256960
18164 256960 -247645 -112780 -131173 120862 -36579 139980 122367 166871 -94723 152321
18153 -287207 -388742 -347635 -72147 -129817 359175 -231253 -334870 81873 62882 107667 -28725
18141 281806 -43264 80348 -42894 -139555 33955 -12304 -10171 -39024 -70943 76184 -23992 19734
18128 -15995 61189 158768 -375036 -213906 38510 22828 -234399 -162585 -56311 -52384 -101992
18117 -101992 231983 72649 -25935 -135575 -278662 163550 276718 -30167 234843 -57 43955
18105 337 -205761 -49440 -330233 233709 -187526 -127582 -55356 61888 58284 -51456 -194114
18094 -194114 -131906 -297545 -296144 275074 73865 62337 -169370 -105709 63601 16271 211558
18083 211558 172806 -8156 75728 -142923 87562 -73807 138655 -240718 -803721 -175579 69604
18071 14756 177682 -363691 14387 -285505 46104 -14754 -164614 130513 -302900 290499
18060 -232770 85011 -329300 -10284 38899 243899 59303 126723 104948 -13345 91481 -29103
18048 42995 -33544 -385745 170277 -86522 -57432 -51828 79846 320229 -161728 192301 -273894
18036 26585 38384 -105421 164968 230899 -139411 -13205 320396 155870 -120542 -34185
18025 4911 -222102 104737 -365385 -126045 424280 -5509 -389181 -66242 101425 -105193
18014 -60366 -259459 -22268 30973 -247898 -136550 -122845 41008 111358 -152744 -78770 32476
18002 -220233 178657 -68397 50508 337655 61165 -17489 159413 66339 -257442 -363030
17992 -363030 -80181 10759 -253953 58005 -134387 14573 -190367 -100171 -57369 7131 -216528
17980 16457 -973 139287 41524 -176923 530691 -20712 33351 -42276 103176 -224755 121498
17968 203680 93136 225317 -20512 28935 -65013 144715 -511 12867 72980 -474277 -3602
17956 -110806 19517 -182539 -83547 5769 -100702 -135210 -73212 82501 -140017 -4672 -63846
17945 -63846 145626 -173586 246813 18394 -42356 240134 -218482 -33715 -231806 -151643
17935 -151643 -78434 -121009 -115761 -121059 -116490 -211891 -237386 105170 -31277 13167 186079 95311
17923 95311 24888 -250159 78730 53550 158184 -217683 -152390 66315 8862 -366975 59836
17911 -242991 131595 -223126 -155455 -113744 57189 5048 -22676 2765 -53837 80467 -326317
17899 -335937 -225894 219720 -82733 -11289 145394 -119671 -233599 108704 -48456 304540
17888 332505 144983 -84981 -133803 -66185 -25545 -34051 -232253 297772 -43713 289 37078
17877 37078 -269481 128564 27769 237203 -234163 219881 169127 -12173 125564 -107989
17866 123788 -11704 132788 162091 -6008 219085 102153 87433 74975 -202615 169922 -176885
17854 148682 18455 -167671 -316615 -58740 -215690 134918 257164 225478 115119 -10550
17843 -73413 174390 69524 -126392 52742 182104 -41476 192384 89386 -48089 9126 114033
17832 114033 211003 11570 -30303 142499 -106127 -247555 154161 502726 -282613 292691
17821 272733 397646 116281 8121 122770 -260755 110514 -215164 -132012 290455 66808
17810 6339 -59461 -84148 106438 -3096 81365 -285780 -48904 -56474 -200891 67905 -31176 -75466
17798 -75466 65213 -396296 -211268 -205827 -16700 -262138 282966 -4781 -137914 -144881 180402
17786 13213 -97573 72140 -231235 -539974 138087 -329354 33011 -3756 -219406 -23654 52462
17774 37959 -241974 -85028 157709 270029 19375 78384 103582 38239 -108895 190649 260277
17763 260277 173192 77103 278816 -29905 -137307 135685 -196505 -275010 27655 3923 121705
17752 121705 60576 65556 -11280 -63073 -320613 223157 -244437 38897 -10441 194710 -22396
17740 -257033 22680 -32349 -319802 26587 -143445 -112163 -190598 9624 281873 -35920 -113244
17729 -113244 64850 -48804 167607 212067 -94396 39270 43355 -276273 6610 103405 -141596
17717 274092 -208708 75269 -61713 43705 97265 -61842 -120667 -70583 239484 102152 -303225
17705 199411 38209 -32537 -104192 -94549 -14456 316602 -292904 355566 224251 216771 -46490
17693 78679 -158194 248182 25856 66670 10451 -6547 -266939 -73813 271067 364924 -29135
17681 186034 119782 198262 -142950 401633 303477 -83560 86628 -42056 213648 -162261 -219855
17670 -219855 110822 -6579 237136 -85597 268070 -286141 -64950 54478 -103301 180343
17659 122418 366283 -137008 -3912 201715 -262566 21979 -168019 -46592 -158362 394339
17648 92948 -189829 139688 118440 -48810 -344392 50756 61098 -146084 108149 4277 25380
17637 25380 200468 246783 -353265 238571 47520 16133 196991 -218043 -120839 105024
17626 213064 128819 138685 192250 135918 115477 291774 -72392 768 -35840 121656 208492 -46163
17613 -224882 84398 94176 94989 156949 -19716 183824 -47961 147012 486958 99062 21396
17601 60562 286475 151625 132360 87839 267926 156900 -65699 -307063 35697 167625
17591 167625 -287287 477673 126748 204882 -82943 -108770 18481 128373 -37786 194471
17580 119703 312619 62983 -43163 -377517 -358590 -814 116232 -149619 -335646 -198029 -373537
17569 -373537 145984 -115773 164833 -343943 81480 219643 -76614 -300100 -193769 532
17558 83305 -443828 -152888 98468 334718 -6976 -192371 -45894 -254819 -93926 46012 361595
17547 361595 36658 94957 145191 73560 -189673 -72446 196387 -224231 -92555 76794 276278
17536 276278 154015 16641 242930 379223 180067 14460 -87638 -170204 -165498 186609 3257
17524 -423835 315178 159607 298341 162544 -158980 -8493 -13133 20514 60475 -20869 -323858
17513 -323858 186769 -190944 29849 129829 36495 25223 249136 -57407 11329 274555 3775
17501 -113746 -198303 276899 100466 -78028 142018 122427 45480 11205 -159913 227442
17490 -3074 -304999 -236190 14073 68921 -60136 235174 378567 104742 -26930 -116681 267329
17478 -108357 -244943 -36717 225872 212151 -4038 -216494 -31931 -128444 224706 -12351 -45257
17467 -45257 44311 405441 284522 90285 -326249 -182576 145137 194716 -45514 104853
17456 281466 291690 -33530 18221 564340 16318 454642 253263 19630 205025 20969 437756
17445 437756 253089 103880 59658 78152 121725 122503 556922 314111 -11304 -59257 335723
17433 -70712 -4317 95729 348923 458113 -50577 35939 344998 325659 35517 348582 555135
17422 555135 92716 59120 257499 -117985 160573 -115432 167163 226983 364344 77545
17411 92747 308892 203652 201287 165170 -128582 163144 133700 130467 205240 315961 663437
17400 663437 397430 446627 71369 278803 207202 118598 152534 139105 271293 21309 151680
17389 151680 383593 92257 388530 72879 440879 92405 -103576 382353 362782 262395
17379 262395 356019 49648 -168894 82851 257091 -14394 235290 1902 219797 263130 422077
17368 422077 -22311 15974 475525 40209 -17046 124960 25859 -194757 -7395 -129043 347382
17356 313115 97728 95964 186874 250795 71146 60316 136125 209363 503259 296766 70398
17344 360147 174847 -381882 127820 272767 420360 -45954 37636 439077 75148 -31957
17333 353495 414804 80183 26918 168906 -67193 -44099 163471 221882 374892 72747 105788
17322 105788 573186 72353 152492 297017 135035 25307 167388 397870 -101989 302562
17311 112687 327344 341777 14226 1722 -112489 152586 156869 191259 120669 142415 160509
17300 160509 85381 82880 4384 54519 -62114 19478 144187 197753 303896 111019 164243
17289 164243 103660 148510 -46325 -81725 259061 -21603 34433 155566 -239521 19582 158737
17278 158737 171284 -167044 63941 -212352 42002 90498 106747 222562 146051 316711 301301
17267 301301 427818 167984 -63397 402680 219870 388339 7845 169081 245304 194499
17257 194499 342266 112529 222797 313935 -16562 46800 312772 165924 15473 -39197
17246 351316 319662 150200 253936 166391 466897 169373 -32285 229983 205213 128485
17236 128485 101913 106306 293117 561699 -276052 97705 217240 167077 74926 152525 70567
17224 98545 294302 525077 237646 317850 -26902 54729 271665 471623 339602 -98714
17213 -57300 321968 430922 118162 -95455 260735 124803 270639 411791 389127 189698
17202 260422 693397 150773 537632 391375 94446 304851 319027 190049 413019 319782
17192 319782 280404 157620 305897 -41484 295982 315643 220232 265705 199073 105079 403912
17181 403912 -43218 -38929 -124906 111316 290251 627467 260020 349199 330800 263434 338143
17170 338143 240034 288583 622452 267392 295515 -38310 -74015 320902 290137 -89240 -20218
17158 167140 354012 368992 503188 403233 578679 243490 48690 478550 170680 296511
17148 296511 558730 301726 502913 291617 120132 384531 399010 201482 450478 350808
17138 350808 268688 511521 350574 525540 391008 136436 558733 355431 76939 407134
17128 407134 338930 133894 345814 225804 334085 386072 282359 80102 459695 287894
17118 287894 611779 198310 446647 594960 266113 179745 316564 603182 386870 475597
17108 475597 42974 287079 766770 368712 743536 357223 387570 388566 374330 443997 455546
17097 455546 383272 319432 332104 307521 258832 260336 626134 657817 80263 500454 417481
17086 417481 349878 380726 381538 182108 353452 244429 46573 319972 518900 305037 684663
17075 684663 276866 202956 646976 486407 597788 517830 421486 409639 265034 615445
17065 615445 407128 566956 643585 355283 630717 562097 501826 332344 419754 667421
17055 667421 375786 323727 356920 713447 269324 506656 394579 470255 551912 486205
17045 486205 646997 195788 528259 648162 638426 941685 724660 352510 650975 328397
17035 328397 847516 715284 846304 535580 627375 915341 362787 404155 871295 506126
17025 506126 612205 545235 705233 381163 675301 802899 847217 1083382 540156 562683
17015 562683 432741 831808 892507 429079 759140 594893 880039 258734 714236 450391
17005 450391 599628 608742 435180 809328 597933 906663 575634 751986 813616 721196
16995 721196 819815 501680 1015089 875596 805413 884477 771335 1008174 1083822 618636
16985 618636 346308 869642 627995 1005402 592122 589850 1042452 993364 893298 892446 1183563
16974 1183563 737779 789664 973295 839248 694075 1091193 728754 620728 1092446 1012378
16964 1012378 951834 963991 784363 785646 777005 733896 910192 970741 682449 776903 902281
16953 902281 981064 978542 980917 854206 982245 1050452 1205015 697924 1160392 1099539 1045996
16942 1045996 979619 1351530 1117238 1101700 944348 1126493 1328801 1019338 1065193 904980
16932 904980 1072589 1018177 1558005 1095741 1106552 1034024 1250269 1193979 1169246 1506639
16922 1506639 1171747 1435431 1393350 1329725 1171383 1438922 1398077 1294655 1163520 940432
16912 940432 1370161 1483703 1300406 1235396 1277288 1387846 1349981 1496268 1631009 1679172
16902 1679172 1506423 1549884 1614397 1557229 1534824 1594754 1386469 1630367 1750722 1656850
16892 1656850 1758557 1680073 2071371 1916986 1955749 1782816 1722552 2019929 2026006 2063331
16882 2063331 2182713 1931811 1876629 1788686 1906051 2336821 1974806 2309646 2139749 1831426
16872 1831426 2132899 2171009 2166327 2350289 2211836 2268706 2422866 2467879 2512471 2453678 2432887
16861 2432887 2424051 2334718 2360544 2364172 2334846 2580274 2573029 2767505 2680002 2828630 2610967
16850 2610967 2843702 2739844 2610092 2821991 2815326 2857379 2739629 3122514 2947750 3273032
16840 3273032 3147967 3256326 3167196 2925930 3080131 3384084 3259834 3574111 3694816 3478045
16830 3478045 3612980 3319596 4092527 3991851 3862047 3804662 3820426 4204801 3977408 3866559
16820 3866559 4211063 4172998 4475253 4469342 4316471 4503368 4361268 4521757 5067461 4644867
16810 4644867 4915794 4610237 4592634 5044325 5006899 4980652 5032702 5126390 5295709 5755010
16800 5755010 5578035 5643731 5877686 5783528 6021781 6021122 6472156 6150560 6328222 6547564
16790 6547564 6954586 6968817 6997641 6946485 7519803 7413373 7593235 7874697 7898846 7769923
16780 7769923 8266945 8372037 8853196 8615034 9025930 9523941 9797540 9898288 10227626
16771 10227626 10458758 10412459 11088789 11286133 11071442 11495992 11843102 12279573 12751249
16762 12751249 12892187 13220059 13551871 13833003 14107240 14667509 15343125 15233706 16068439
16753 16068439 16524737 16773641 17702551 17867945 18536317 19196314 19702532 20434835 20777734
16744 20777734 21542715 22366890 23395539 23872837 24779068 25822041 26599308 27670275 28857180
16735 28857180 29598495 31066057 32470476 33510565 34970655 36411540 38118154 39568350
16727 39568350 41282234 42919489 44947453 47023836 48759194 51427458 54054599 56451786
16719 56451786 58915250 61921113 64858175 68127399 71642775 75165728 78949568 83103899
16711 83103899 86976805 91480710 96538710 100980798 106062184 111012129 116751019 122192343
16703 122192343 127672910 133110860 138703163 143902704 149541772 154212940 158470773 162684696
16695 162684696 166192799 168604143 170532864 171556784 172306241 171483497 169822019 167714268
16687 167714268 164540938 161168963 157224745 152188231 147164710 141899715 136407130 130348561
16679 130348561 124763870 119399556 113091311 107820280 102531057 97405778 92600920 87962909
16671 87962909 83646626 79338299 75181937 71193759 67830229 64613732 61587511 58529671
16663 58529671 55720111 53053555 50345044 48416890 45930797 43784682 41818919 39919930
16655 39919930 38333515 36710956 35325334 33722114 32343153 30987497 29622854 28643626
16647 28643626 27492716 26304569 25328005 24534783 23876872 22908865 22064491 21371846 20769803
16638 20769803 19865473 18919036 18686483 17791701 17613674 17075833 16574843 15958309 15414367
16629 15414367 14982231 14534005 13775801 13561148 13407265 13030195 12491495 11966535 11823759
16620 11823759 11619566 11319673 10399283 10730829 10036203 9963260 9878180 9643645 9296553 8913127
16610 8913127 8565092 8688094 8437744 8232974 8226039 8120127 7768333 7262830 7360981 7464410
16600 7464410 7112239 6706729 6583612 6722604 6342281 6287572 6241659 6289787 5860743 5746851
16590 5746851 5834456 5469804 5451183 5382247 5168918 5309046 4966339 5255454 4975436 4799585
16580 4799585 4550382 4694349 4414733 4438846 4363855 4518560 4395214 4036235 4358383 3974583
16570 3974583 4160233 3680206 3790979 3773489 3536335 3554031 3697519 3583213 3309991 3397724
16560 3397724 3516207 3406446 3349597 3054780 3541709 3312001 3025068 2670646 3048363 2994993
16550 2994993 2911171 3059773 2868076 2428828 2962650 2567380 2648033 2836259 2752570 2386637
16540 2386637 2664547 2925110 2236289 2461720 2136357 2432175 2462247 2124219 2391409 2250837
16530 2250837 2006842 2363607 2185633 2144897 2115882 2135874 2035133 1709520 2013397 1940978
16520 1940978 1981105 2165400 1713874 1915106 1922372 1879802 1593430 1394618 1827978 1775060
16510 1775060 2055267 1628473 1822021 1396842 1678171 1818649 1440100 1646290 1494156
16501 1494156 1911265 1517415 1168107 1595097 1704649 1357989 1301196 1463565 1524668 1250756
16491 1250756 1174004 1231246 965046 1303533 1080371 1407505 1145290 1177452 1133801 1394009
16481 1394009 1111410 1226133 1192646 1111392 1086511 1324833 1082269 1145812 1300009 869387
16471 869387 956449 1044081 1140424 1163551 1292715 1021799 866636 1041389 1219236 842759
16461 842759 1159587 595369 795198 1140903 1141190 675411 1328481 1131074 772879 972816
16451 972816 783849 995479 948945 1074631 1098053 1110783 933893 719803 556773 859483
16441 859483 971096 748281 719020 668020 918533 661946 788973 737691 684862 656687
16431 656687 956864 724087 565275 983177 608490 718045 623201 494656 760725 650505
16421 650505 862447 532783 800534 874206 780504 589754 851385 661003 776194 532602
16411 532602 700358 479296 488608 786325 515149 588965 757377 481029 673902 812877
16401 812877 494709 491562 513197 184334 377457 601010 712512 635487 636867 417959 669424
16390 669424 379913 578249 614259 611710 376267 256248 468363 603167 301140 435005
16380 435005 283525 272689 93985 529571 393640 383029 413556 504046 431308 300284 308840
16369 308840 553140 270361 182752 263658 567663 152389 93276 515893 495377 226850
16358 631253 489641 636235 363344 216783 246245 252287 444370 377846 182906 242160
16348 242160 333085 434479 454978 46953 -136936 368631 494631 110345 60474 280672
16338 280672 226370 391475 550167 222491 482371 287114 418415 162801 472032 495008
16328 495008 281892 290796 173856 187636 155139 278822 294005 39791 294422 400142 221375
16317 221375 251785 432328 260463 -36613 319712 473056 315574 603015 50593 505252
16307 505252 262305 575436 333400 183174 318631 320429 88630 96567 265697 112116
16296 133165 237860 226878 30780 -109960 400183 173778 305430 186736 -24381 203063
16285 330182 212010 431209 317906 586409 320493 359870 -57265 129069 -67282 159082
16274 576531 242779 103563 308762 122655 147104 -55872 32858 386212 79334 253417
16264 253417 536318 209278 160370 357173 2454 345854 117960 38752 27621 88828 155975
16253 155975 335283 277594 191271 -58297 117820 323145 503072 321935 285617 385678
16243 385678 -160082 151678 830 274341 108223 20853 23263 -92730 127885 155692 426981
16232 426981 116193 175881 -69197 261215 425932 392000 176837 215815 594471 293279
16221 83674 151587 -246613 69195 199686 -58321 -143468 430810 189336 49094 -48381 186234
16209 235301 21517 205889 75781 286987 281481 20429 63455 214471 178179 69700 -69309
16197 163451 124373 97573 85774 10372 101246 219414 75118 -132650 -279721 -115736 132825
16185 249984 73751 19792 91447 217595 221754 -72608 235058 132898 215663 75444 -64546
16173 213453 367328 80158 172988 95000 76541 5971 -147950 -130072 -44869 31185 -22588
16161 40195 -145820 -90684 -28295 246373 256630 163944 -185320 -172941 -209167 -107538 212932
16149 88773 -37697 -389480 344626 308075 22918 192694 270449 -8681 217655 -143882 49931
16137 10434 100495 -120147 356988 234617 -16054 329752 209562 333026 315681 19660
16126 177913 -60000 16418 23891 -169078 353697 -18259 -4839 52834 317273 -63143 5699
16114 -241572 -200161 274864 407733 210408 -124028 241468 -18485 54061 49820 28850 -98466
16102 -36399 -176816 373622 -107569 184181 -40558 -174897 -3010 38666 174026 127995 105039
16091 105039 67054 -4731 -148601 -111696 329424 26384 207283 282261 233944 314355 -60609
16079 329166 162320 -189913 194135 149877 125646 94568 -57535 -164057 -152952 286289
16068 88467 -263842 -41244 -206980 205942 -202252 -26565 74058 102651 -250193 134166
16057 458743 -87202 -196815 -35863 -110791 -17612 -184421 -4157 163676 77146 -6379 -73923
16046 -73923 -126796 4888 -87579 -375431 -35899 278377 -139392 50724 127905 -150517 -359961
16035 -359961 -93752 5928 24084 -237277 -55322 -185736 -65067 -176050 74149 18771 -10945
16023 -104445 42928 207460 -133046 30804 57803 258143 -28297 219683 -16969 -358759
16013 -358759 -261289 193048 182918 -301192 -8833 106972 144129 -224598 -111387 48706 40245
16002 40245 -240403 70621 -109016 -110846 -72619 150204 92405 58396 -176453 237312 -50953
15990 132195 -338908 352523 -170221 -26091 50441 -189290 27333 40336 59213 -88520 -162488
15979 -162488 85346 -134786 195474 -92629 -296050 -93048 75056 -90346 85683 -123273 32487
15967 -126787 -7711 89352 -162314 11627 -10010 259559 333957 243945 247954 421605 400908
15956 400908 195553 604409 425401 -274597 199703 36285 -135291 235289 -26234 43963
15945 -56440 112340 -304139 -75728 -232861 9865 -70051 30212 40118 159535 -156957 190556
15933 -198174 -50225 -153653 5516 45425 -130548 -41011 215712 4010 30454 345818 122364
15921 33227 -101981 -63697 -124095 -98278 -259681 9509 -122570 341123 -125742 -242990 -21473
15909 -104396 -47206 -90861 -67843 80186 -250081 140359 -159981 -212842 -33075 -441482 -166652
15897 -95540 -127807 -306916 145663 48402 -70477 -82522 -115480 -365243 347548 -72696 49106
15885 -143124 -202005 -11464 -170999 31747 219857 228679 -16620 67249 -343453 95781 139935
15874 139935 -206237 152944 -53059 -118131 167463 -226563 51770 180077 -37481 171635
15863 22616 13588 -55738 130743 -262293 -144949 -122716 -79602 -299621 -125782 -37569 21795
15851 -292830 77104 58145 8912 42096 246906 114985 2526 37092 -249238 122470 -104795
15839 -236996 -321062 86792 -318562 -75935 -78748 179363 -266238 254026 356495 84290 -191974
15827 459885 -43695 -195287 -25215 126320 -46450 -100249 -125512 68760 -280327 -163703 62088
15815 -230040 -136645 -306838 316259 -113360 170476 105371 202479 -218170 275568 121686
15804 -128499 -11801 42993 67455 -238091 32452 -106050 -153180 -240912 19408 -116574 13469
15792 170727 -116354 149543 113571 -263218 27489 129105 61895 -274944 164203 67132
15781 -357316 80696 -198975 108487 -109132 66012 183154 84828 70273 -173090 244203
15770 47090 -235782 -79577 -81370 -23161 37304 -118924 -40261 -24800 149914 99661 72150
15759 72150 -269383 306177 -161368 15386 -58178 71733 334513 -31171 99202 -131160 -48749
15747 70133 -195314 -88098 -311293 -180325 141308 278534 -89283 -256489 64419 -84782
15736 -281794 108101 236306 60340 -61617 314769 7316 -88180 -130056 43054 53644 56305
15725 56305 219479 -4312 38941 6466 -39304 -19619 109360 325080 -178957 -60284 133479
15713 390324 -136278 -119915 185435 -161586 31152 192769 -164860 -83326 5509 117360
15703 117360 232671 -183041 66941 -363181 -70690 7166 -292378 -126870 -24050 -147889
15693 -147889 247687 -124898 147685 -206482 -90479 -71121 -315852 49922 -254088 -37668
15682 -155305 -9655 -297112 135162 -149239 -267562 -73524 106936 -2325 3303 -204097 -262262
15671 -262262 34156 -10993 -350901 95851 170130 99733 -20668 -93575 -49890 344547 -65073
15659 202740 78252 -194351 -367674 206070 150704 -60667 -456313 16037 104631 201328 -194535
15647 13796 -287019 -45482 -240303 -62660 54269 161806 -21236 -223433 -173479 46006 152824
15636 152824 -243403 -264844 -90858 -141247 -68941 -399336 396350 183047 -11209 213001
15625 -189318 90648 252447 -245938 96526 -148328 114256 31055 -44543 169950 -181762
15614 -163703 -385526 284198 -111661 98958 -43503 134643 50115 -21802 314500 -292421
15603 562393 -255004 154585 113731 52904 66863 -116041 -64312 182936 40364 83592 -66148
15591 291472 217299 -304661 196437 -31708 72885 126569 22302 -167688 -268518 22641 -132738
15579 -323252 136059 -12711 -204414 -316277 82434 256815 131068 191142 229827 -133245
15568 -136683 -34568 -195690 -177077 -165223 344140 82273 216564 -143387 91317 8874 40570
15557 40570 332862 -56230 23162 -38586 130109 -31310 45809 -158326 -63714 119627 51593
15545 -178017 -6371 86214 -339440 160272 271727 -143159 -69041 17582 300829 -139286
15534 -126200 248332 152987 -67409 3617 63602 5359 -233000 -221788 -26663 -210971 -53590
15522 4095 -158936 24301 -142502 -648 215482 -1046 54862 -125822 -75044 -4146 -370829 97854
15509 -24394 -191684 157018 -50610 482679 108765 -101747 -70022 -346257 -339224 -182314
15499 -182314 66968 169548 -132532 -1058 -82179 -114061 113816 478349 220406 148039 121941
15488 121941 364754 112464 222945 59928 -129814 -52335 123868 71916 -683 216084 -168694
15476 -152863 -128801 -106679 156870 -114871 -72931 -84551 -270780 99298 111934 239662 42615
15464 314347 1049 -47038 -110693 -187973 -266031 -347832 65724 -114616 187824 -489264 -96480
15452 161043 -276739 -238506 -99880 89629 -309791 84237 -147724 -78724 40880 286480 -141958
15440 -20452 -190257 57840 124324 -202943 -63226 55602 442764 -208890 -324931 47578 -169618
15428 -42402 40778 -120424 -217361 456404 310068 271489 89689 341923 -166213 55608 51104
15417 51104 99015 93172 116461 57354 -144703 233156 -40715 -63806 -314722 455342 2476
15405 -46618 215587 -192233 -79771 -340902 216632 48775 237983 31907 -163604 -84804
15395 -84804 29245 3986 95359 -110920 149269 53095 -7007 -248655 -153040 -30511 159544
15383 -75218 144744 -256534 57109 113595 194507 -161843 -433871 19898 -313211 -76080 199248
15371 44490 187412 -129601 229893 -64257 492787 -19564 9948 246778 -68140 -38067 -159751
15360 -159751 -158016 23714 94966 51034 100804 289414 70650 161837 -72196 -398628 49769
15348 118533 -44049 311243 -94877 19306 231711 101423 -40809 -225788 -166229 -83003 56012
15336 -214451 -101928 -15155 -56931 -201985 -45402 237240 -70336 -451111 -32524 157486
15325 230424 -188125 368822 247584 148114 51519 25906 -45815 57504 -256730 -190349 -103987
15314 -103987 211968 90487 151670 408519 522043 -67333 46699 395241 -104745 -140377
15304 -140377 -281405 345268 -10192 -55074 130077 -121972 37306 -33512 -114448 123804
15293 252962 197223 -81142 -195771 -188817 -153585 -20256 290683 50977 -245798 -232206 70064
15281 -313027 -81642 -22574 96620 -148790 -22999 40162 -334005 95717 -75248 9344 342738
15270 342738 -58574 78780 295564 -293813 67551 121079 82152 -39960 277089 67374 8867
15258 -67702 -263967 -11228 184595 170745 172027 -108182 38082 -38001 112230 -40422 84567
15246 94234 212564 -178009 189134 94928 -69752 115785 385467 2166 73770 25106 -78885
15234 -212885 -259976 178832 175606 -23559 400676 64086 181194 45728 -35672 291566 156918
15223 156918 595561 1645338 1777083 1404178 1668395 863987 279869 184817 117632 128031
15213 128031 120552 -135795 232334 215608 24588 -154262 123475 -101390 118195 130907
15203 130907 14367 154618 181334 -57623 142585 18479 -191914 -326606 80443 -247576
15192 73987 420577 -411599 160743 387315 57613 222880 258089 -33430 23981 238996
15182 238996 265113 -196122 248582 -127777 174885 106400 43974 -70845 -146539 59020 -314779
15170 209301 -210071 109174 421935 84046 345671 20752 101428 40652 197287 28088
15159 122669 44422 251465 59167 431951 -51994 -89354 187374 -401829 -160669 53445
15148 79385 -28295 258135 341424 78438 86424 -270972 39811 82586 276046 -52767 259076
15136 22537 -246031 308761 -71336 231546 30405 31135 97848 213791 90708 107774 261309
15125 261309 243953 -94225 38617 3935 -104911 102323 282904 50973 217429 -126350 545780
15113 -277414 225612 -25122 -43941 264414 304974 424477 187041 285841 83314 304334
15103 304334 206799 -118365 517330 -172520 296248 384897 -210336 -8620 352814 -119854
15092 -47861 152358 307502 264438 109528 466800 342389 64913 -95479 348082 346495 -175377
15080 -176549 459292 475921 -37035 210309 932 155433 336138 192768 -130714 329063
15069 277241 162135 -75262 -129470 243051 408374 210914 480584 49640 304414 185960
15059 185960 13733 -72852 -116716 37482 305964 175855 53097 584 -49777 -3970 107032
15047 160570 47475 104321 36093 70627 152018 166606 86049 -55668 162340 -59429 -305291
15036 -305291 195307 -184089 -104625 -97143 174187 -45602 153541 454698 215654 123683
15026 123683 50157 221433 -448656 96259 134721 36109 59177 352692 455292 200483
15015 68868 99793 145808 370805 76723 369564 60061 243826 -71432 165786 37338 126688
15004 126688 320376 368235 179119 420145 354363 -9499 187227 79335 -9726 247153 82735
14992 -150721 155228 444126 -14833 19969 524151 122929 102653 96547 217413 115491
14982 115491 170667 41085 252608 44095 167104 193622 531423 346269 68965 458449
14972 458449 113520 -113269 248030 463815 146428 55338 67317 333474 99725 121786
14962 121786 443708 -46837 233054 717267 247455 209386 15945 172745 180881 353153
14952 353153 127703 237396 259229 275692 -15031 290660 220903 449161 -109804 263148
14941 384001 388597 389407 78838 498489 539443 168367 193849 25927 100179 154084 -251207
14929 332661 102006 480510 -28548 234107 322799 331432 8865 211448 378857 300005 533947
14918 533947 48730 404878 69721 603527 411960 340512 16696 210108 226352 424224
14908 424224 -176896 443349 53035 271643 234509 463977 204999 262499 265718 383514
14898 383514 90807 603413 235901 97952 319301 747617 540385 -36953 224678 525090
14888 525090 101014 398916 139878 473211 121517 169855 367717 222895 280962 -149053
14877 456402 439549 257078 431425 212040 417055 208943 345858 170145 298276 445824
14867 445824 179109 347678 250446 748450 564208 353197 587810 64389 553260 663404
14857 663404 345875 232755 545576 214843 530372 242808 600386 266731 335596 274021
14847 274021 316641 297232 189322 495359 359837 447115 273442 597147 573268 451093
14837 451093 417932 254799 509344 537048 247515 209047 356419 455964 102069 240133
14827 240133 381272 147834 467173 348547 113726 449237 460148 327926 408844 345394
14817 345394 75191 283235 181791 392296 386467 455850 498624 573768 579284 393170 428515
14806 428515 323650 469103 333375 696631 542497 343818 825114 522278 368568 573479
14796 573479 262550 429204 710450 116418 647907 460618 428056 582756 638520 737365
14786 737365 526867 495742 497157 166928 443146 272641 516909 574427 448457 530589
14776 530589 724047 429655 254568 474880 814076 680020 376252 563695 364019 463783
14766 463783 831017 846306 638118 447538 532684 759694 803938 461520 558218 474781
14756 474781 657310 441492 432872 406103 504794 405392 634668 587077 585974 483065 614713
14745 614713 536639 851685 471456 537808 752813 564804 525549 485809 340960 253714
14735 253714 334550 539585 513402 795815 419352 362925 710716 550809 510389 575604
14725 575604 834911 676478 619748 717141 161532 168392 591087 741752 843459 290048
14714 852605 819945 658066 656665 561679 666278 945584 866952 866083 679990 443183 900231
14703 900231 498026 899064 817477 834516 482051 728064 737699 879097 794967 717846 993405
14692 993405 694140 800590 1074737 704650 934768 823861 841978 754530 761608 658539
14682 658539 875029 661065 948217 463975 819323 642735 1073647 975632 613635 819066
14672 819066 601477 678250 677562 948618 878435 1227736 1172600 1031933 912189 914648 852592
14661 852592 922581 813145 906090 892565 955225 1081717 990997 740943 1018079 744198
14651 744198 1090339 887369 848146 1303257 790443 999184 964842 1064413 1183870 1109279
14641 1109279 1203568 916526 1099396 590009 1199805 883015 1001783 1026066 1187046 1055536
14631 1055536 1034079 1021427 1057355 1083469 1292013 976085 1191249 1204306 998371 1126625
14621 1126625 845952 1240897 1008710 791746 1016177 1210893 1683980 1138043 958893
14612 958893 1199798 1424631 1144934 1411191 1643160 1164456 1364014 1168304 1149057 1395235
14602 1395235 1153954 1438714 1613305 1642664 1300854 1375423 1615235 1024817 1167395 1457961
14592 1457961 1513992 1138560 1615183 1622929 1410636 1210750 1581089 1913241 1444061 1565489
14582 1565489 1577249 1714389 1538944 1781182 1553281 1838508 1314872 1514465 1693991 1564823
14572 1564823 1654875 1591650 1654364 1764754 1800404 1658385 1417056 2014814 1740953 1792987
14562 1792987 1790800 1894433 1576134 1804890 1567875 1918280 1697467 1922892 1872256 2144758
14552 2144758 1861324 1994078 2471421 2243890 2267677 2148590 2116567 2113038 2268269 2195209
14542 2195209 2296584 2121424 2518876 2311447 2283319 2470639 2679924 2729246 2645578 2724743
14532 2724743 2683082 3077545 2867517 3468496 3631813 3753853 4504927 4794932 6211897
14523 6211897 9497406 14931016 25825383 45880147 39981258 17359258 8089267 4147033
14515 4147033 2543408 2067947 2021748 1756039 1825680 1812556 1824848 1991332 1958509 2195446
14505 2195446 2304081 2275467 2030795 2297594 2449545 2173599 2264715 2286926 2575263 2558169
14495 2558169 2529703 2581537 2203901 2690831 2185789 2712178 2192708 2835922 2925456 2579802
14485 2579802 2776404 2901394 3038926 2649422 2854827 2703616 2851199 2864553 2814983 2951064
14475 2951064 3325241 3159893 2873963 3295717 3379683 3376337 3217388 3463834 3268969 3362816
14465 3362816 3330799 3265994 3299191 3478267 3583398 3751820 3482181 3948601 3703985 3530345
14455 3530345 3751484 4057978 4151920 4129380 3850325 3831513 4150294 4453086 4332353 4223635
14445 4223635 3962928 4097490 4539870 4329633 4526910 4627375 4555411 4572144 4829508 4521563
14435 4521563 4762380 4810885 4801449 4965868 4948669 5115631 5043593 4994029 5399339 5031097
14425 5031097 5216636 5403012 5523141 5210860 5684991 5421292 5740676 5793470 5871058 5977155
14415 5977155 6210418 5978917 6270523 6030038 6314892 6245671 6426081 6561469 6873286 6809507
14405 6809507 6997758 7121537 6951382 7201786 7012232 7239464 7573761 7618276 7687450 7891343
14395 7891343 7678022 7890481 7759293 8013939 8303062 8391615 8589682 8601835 8647542 8512958
14385 8512958 8910777 8960091 9279777 9305600 9706730 9938916 9666684 10117712 10344542 10073701
14375 10073701 10319457 10292582 10878317 10937162 11033402 11233006 11329450 11797641 12081053 12195623
14365 12195623 12095767 12570023 12734462 12801051 12975107 13196577 13643682 13529005 14455896 14382345
14355 14382345 14696547 14959299 15129302 15514231 15523308 15949133 16518116 16785407 17252066 17181987
14345 17181987 17774898 17904429 18441341 18854535 18910085 19374818 19965365 20493954 21131863
14336 21131863 21367968 21832333 21913389 22893922 22957193 23927626 24438842 24810378 25431624 26146127
14326 26146127 26326480 27630316 27901658 29143904 29713379 30349276 31060164 31641597 32431749
14317 32431749 33613034 34261228 35067165 36509937 37099929 38285261 39473751 40688233
14309 40688233 42160939 43018501 44542152 45943850 47209760 48758366 50233961 51958788
14301 51958788 53634344 55257316 57377303 59449125 61152971 63327998 65885612 68056238
14293 68056238 70566578 73397145 76091278 79507166 82405429 85107979 89049814 92556860
14285 92556860 96644061 100654138 105187371 109766214 114576172 119665699 125614962 130854494
14277 130854494 136576817 142866510 149454455 156688585 164276039 171835091 180711996 189647135
14269 189647135 198890591 208987876 219875071 231153836 242892349 255056663 268423366
14262 268423366 281782918 295673492 310290301 325183829 340452890 355735454 370491809
14255 370491809 385614681 400901353 415463868 428928512 441408926 452404576 461598769
14248 461598769 467471014 468377384 467951296 467423638 467921750 467366815 462039064 457319636 449441678
14239 449441678 438571768 425857361 412151659 397207116 381604556 365585773 349449797
14232 349449797 332884800 317193422 302057421 286999781 273574746 260047844 247131139
14225 247131139 234529097 222723841 211711522 201216397 191077379 181841190 172772487
14218 172772487 165025361 156958309 149623555 142724297 136456124 130014599 124971721 119171117
14210 119171117 114099965 108960560 104141993 100438704 96568703 92939254 88704246 85368341
14202 85368341 82293537 79347587 76127329 73454534 70660635 67916661 65389182 63491606
14194 63491606 61667401 59437270 57820271 55746210 53984571 52361315 50874773 49433678
14186 49433678 47555058 46159156 44702721 43722871 42457189 41729261 39888376 39029734
14178 39029734 37894256 36834181 36181974 35197520 34285295 33510767 32497138 31701967 30820739
14169 30820739 30027967 29269063 28287725 27720359 26990370 26697613 25711219 25515286 24594679
14160 24594679 24658103 23669922 23311375 22749845 22368643 21764003 21299543 21035316 20372232
14151 20372232 20020035 19589276 18877546 19042862 18374530 18273048 17636479 17377458 17123631
14142 17123631 17046475 16886302 16115226 16040248 15505536 15415769 14846100 14921664 14672869 14286092
14132 14286092 14439522 13787041 13609598 13524131 13437839 12691280 12615251 12131147 12278179 12279935
14122 12279935 11623546 11663752 11580262 11287578 10873016 10972353 11005312 10793760 10717790 10242515
14112 10242515 10274527 10220653 9700110 9767113 9723359 9716209 9569290 9089328 8816293 9090845
14102 9090845 9132357 9106707 8866254 8429528 8315058 8131066 8097948 8018605 8056982 7922304
14092 7922304 7585154 7562842 7578995 7263307 7100304 7098661 7301121 7573099 6777396 7321943
14082 7321943 6767596 6795415 6734277 6711328 6383152 6494072 6248036 6141736 6094268 6094957 6246616
14071 6246616 6119313 5370677 5820246 5689394 5805126 5318465 5335965 5322327 5821556 5552525
14061 5552525 5000738 5236126 5272887 5374938 5339459 5086538 4972383 5202511 5062937 4782660
14051 4782660 4994076 4734682 4546052 4551099 4277059 4813598 4474368 4448688 4552048 4175966
14041 4175966 4385019 4541428 4440914 4172889 4267379 4394756 4086655 4431073 4102025 4438283
14031 4438283 4093731 3950836 4285223 3738102 3854726 3915851 3742777 3840101 3897390 3551773
14021 3551773 3545196 3597460 3493071 3432212 3363910 3598349 3555802 3486001 3796481 3240502 3349481
14010 3349481 3337528 3104085 3083407 3152973 3209152 2804416 3040861 3180397 3083365 2737158
14000 2737158 2802741 2674235 3233256 3065443 3182475 2737826 3018674 2605939 2361796 3013234
13990 3013234 2901619 2572491 2726699 2405019 2347825 2550541 2250874 2250704 2360916 2522587
13980 2522587 2086617 2073220 2274396 2418990 2451674 2488744 2293956 2271804 2166905 1911536
13970 1911536 2022947 2054184 2255525 1987543 1940926 2085027 2917526 4599263 8749158
13961 8749158 17999653 38555927 44819386 21858089 11733122 7080756 5586140 4535208
13953 4535208 4049475 3260892 3193269 3393409 2822467 2830974 2996762 2711643 2532364 2666908
13943 2666908 2602100 2458027 2471902 2653581 2430325 2169404 2059054 2054727 2272663 2197018
13933 2197018 2311701 2287673 1907638 2074354 2174222 1893962 1891233 1888014 1955068 2165390 1893244
13922 1893244 2086718 1780884 2110654 1924806 1796200 1799935 2079541 1864888 1808311 1507979
13912 1507979 1727329 1940880 1798914 1918603 1749567 1478837 1769938 1741504 1622967 1734796
13902 1734796 1835028 1397366 1931982 1832601 1619311 1462581 1384012 1788499 1392138 1715500
13892 1715500 1500719 1553023 1439071 1297125 1617299 1499021 1380263 1828952 1278764 1570237
13882 1570237 1457137 1901372 1454404 1538421 1295482 1265673 1441618 1415101 1169430 1533837
13872 1533837 1393184 1426285 1655381 1548728 1283312 1399896 1155983 1475059 1158354 1162463
13862 1162463 941638 1151075 1189773 1218760 1028728 1581210 1361433 1306158 1268061 900400
13852 900400 1240858 1303189 1065154 1251264 1318925 1139848 987532 1279189 1119278 1131779
13842 1131779 1117912 1109627 1346589 1129224 1155417 1261932 1261227 1072536 918862 985613 753332
13831 753332 1163972 1021973 948771 1169687 1192593 1263265 1121050 1207898 1042760 975984
13821 975984 737233 999620 1156916 1127471 1204709 942420 866367 991410 760596 1256092
13811 1256092 1025438 1003528 1074226 1202914 1095901 900683 852719 1084511 675495 479927
13801 479927 846705 1059263 812914 829499 1025680 1155017 967679 1008927 1131119 1082254
13791 1082254 1207517 691647 1170934 1215347 913816 872626 999661 912229 679795 599915
13781 599915 953348 719755 1200789 993977 744825 819142 605999 788096 969719 664662
13771 664662 828089 1019558 539472 931602 1239803 716640 902514 1029791 838829 896909
13761 896909 995917 973744 1275850 681293 437594 766626 775179 968366 796877 848995
13751 848995 701249 852355 670246 863732 980573 731272 644458 874182 643016 680337
13741 680337 655147 567423 567430 517174 453487 520005 720737 836047 620776 769578 644130
13730 644130 550328 1052531 695365 850450 771399 910541 628068 658578 579444 765473
13720 765473 765031 607950 435469 583168 605446 758808 837981 776557 683116 892881 412501
13708 947073 350370 1026054 920036 965134 717381 617528 633470 755581 527724 744276
13698 744276 702821 719195 696792 486274 287131 590761 605091 847693 616016 359538
13688 359538 599569 445906 715817 613313 833765 494472 233973 624082 504925 123308
13677 543831 224881 579961 458347 540865 582146 466108 293266 641393 745535 566037
13667 566037 207059 514026 547363 395374 626476 362747 309057 771491 631305 545824
13657 545824 545396 681314 848423 562607 645578 454271 316637 379445 148978 567704
13647 567704 299413 408536 361253 464882 649970 363469 685705 355595 447228 842082
13637 842082 548098 515217 553317 310788 266413 323688 618237 873210 465122 482735
13627 482735 398156 563329 575327 336394 319730 795551 426728 510669 291066 633574
13617 633574 271315 582364 842749 239126 464631 443047 325607 363004 376151 262361
13607 262361 455268 708705 375985 768827 668326 416603 385087 312503 432568 529450
13597 529450 780922 -65419 804834 259264 509460 237531 451282 356941 501862 258435
13587 258435 213641 434978 647172 219231 477946 405031 88434 629500 485144 380798
13577 380798 348461 420400 419807 372822 489221 75667 628900 328637 431313 552331 46563
13565 250671 457618 355964 241525 200678 621350 541853 274126 526897 44538 204505
13555 204505 343943 229013 626322 438164 420048 589027 369796 595511 214761 277481
13545 277481 176387 322707 587380 237154 -34736 157134 197507 419179 253918 530750
13535 530750 351889 371939 222769 190551 504958 302832 35163 160040 200330 52767
13524 374884 419277 564582 455519 403415 434083 433976 -12637 455629 254682 361383 469278
13513 469278 292583 163114 389637 366705 386133 411269 227328 541586 234470 448165
13503 448165 374418 80570 188040 303040 298418 221756 447794 299960 375938 330750 540927
13492 540927 495439 324771 322401 345703 20363 559816 175541 193400 299091 351429 306098
13481 306098 281793 274609 240624 70894 254175 191937 36055 452986 363327 369777 138762
13469 412899 73656 404739 17033 295919 133925 508232 68310 417688 304296 523466
13459 523466 530738 349291 272638 102612 201478 227152 372223 151229 77962 424055 7522
13447 -42780 474681 -104549 544882 338956 280519 203467 351187 253732 149266 300347
13437 300347 372589 212801 488073 573489 242900 140002 -188045 -98768 160889 104684
13427 104684 368373 460175 161197 317521 270623 127453 187020 114963 159027 675976
13417 675976 106240 403680 115751 481676 216759 300757 199750 307125 200847 148595
13407 148595 259974 -29212 100681 297019 110040 325069 545089 163714 610992 418790
13397 418790 74535 -20245 187056 487293 542390 107964 354396 141027 32276 345702
13387 345702 253009 387368 245353 152267 411463 149468 -113572 477279 95353 311368
13377 311368 48337 113151 -22460 49383 741822 515850 532080 382743 -230697 463945
13366 269528 391633 197719 365023 315650 160982 38136 420302 257849 393206 131299
13355 229774 138208 58385 139300 294264 442849 119381 216416 282937 37195 64882 104029
13344 104029 -22647 35416 147860 274958 294070 161536 236851 100676 321925 175334
13334 175334 132602 329114 453842 476507 274088 192795 188723 140683 177309 170056 -107212
13322 271474 252340 252924 470126 128941 265114 281327 309769 253530 162576 226424 -9572
13310 366721 470737 258649 42874 331963 392329 233272 88408 361133 170741 139501
13300 139501 490468 21561 170890 49916 61679 430943 334196 567634 148265 703374
13290 703374 424680 235268 120516 176474 260776 218505 92573 226002 -86945 183945
13279 213625 -278064 280318 -55061 326445 99185 -9106 270550 369610 268270 7172 209517
13268 209517 61205 113554 137907 212048 163887 88114 -70556 -28416 -13918 3174 46654 34993
13256 34993 -53692 78298 4064 89834 407768 289506 -23061 34800 28397 94030 56923 -127320
13243 158586 138026 111338 313747 -62030 14850 180198 143505 330673 97630 -282015 58680
13231 631073 201022 191951 208416 -98087 294007 83705 421873 -56499 224589 468250 -355537
13219 76273 -27856 100581 110209 333860 184943 193853 192513 -23001 97099 256856 88742
13207 -27733 250313 151620 285916 -278653 288293 429206 152968 104115 67185 165150
13197 165150 142874 289772 -50005 -53539 327709 266460 -147501 275711 134492 167463 125846
13186 125846 -41985 383998 256269 33653 144880 218427 265414 183885 567904 336745
13176 336745 155962 -243844 -163324 101451 335873 380243 204080 223783 165296 -55889
13165 38683 6763 -99506 357830 335818 334585 329771 49932 92611 525647 -24399 240761 93224
13152 182228 521043 -55708 396074 -205425 114867 270520 42865 40267 313340 -26686
13141 -94345 -57608 -2331 94265 -17954 -334451 219637 283269 268465 169831 226519 369438
13130 369438 68371 -100325 266227 118868 -22121 191179 94436 80062 -194511 53286
13119 217952 356427 124692 110503 163480 316735 -231976 29188 48047 13204 -87684 230917
13107 99434 230137 -249492 399965 229814 121282 92928 -80887 -91764 -139547 -38826 106420
13095 -19848 70687 -38870 -32434 160070 74694 203283 -160507 173882 175098 -180117 151002
13083 111165 -86235 80296 -271252 234244 156867 -78336 -206306 205865 190425 132353 17522
13071 84523 -50107 23138 66787 330243 52681 60893 388516 138214 -158019 -113161 231325
13059 -164425 212149 169901 -48129 -156114 234343 411587 224633 -108592 369498 225543
13049 225543 50906 53730 74972 91410 144137 -139814 307087 -160958 -305674 -78626 92421
13037 63865 79349 203266 360713 216896 7377 97170 -40443 157451 179810 139596 20214
13025 34195 378140 -380554 612623 43545 104913 117667 149039 -188450 154513 -76268 -87353
13014 -87353 308102 -133028 -65149 266356 127281 224678 175308 -33811 -118265 -80355 465795
13002 454921 295883 61399 -60586 224659 282198 -183742 134529 108856 255017 -74152
12991 -145642 168188 209079 299521 -145006 200558 -179726 57233 -64261 419098 19088
12980 -98299 171306 303640 85472 153884 154816 107742 157927 -41813 82919 4274 96435 124901
12968 124901 44879 196267 16189 400931 -458221 63775 -25544 -31609 165096 224250 294030
12957 294030 75887 -126743 -19134 -99768 -59077 118046 216931 208932 163133 -90062 -245684
12946 -245684 -15671 -224460 -235123 -236937 57420 262624 192487 76770 -242093 240196 240226
12935 240226 138844 37486 -207564 9750 53062 51616 39278 303963 -63014 -13221 93829
12923 86841 -175132 135389 -36052 -62174 15275 -1262 -30777 -18876 -7837 25211 32453 324995
12911 324995 -143751 -93588 172834 -142993 -249035 230332 -43481 -123804 252598 279808
12901 279808 267978 143373 -346981 154820 31634 212212 -38031 1518 145130 72131 130939
12890 130939 -178790 45733 177166 -201934 218971 -161607 276958 -222759 -51071 -132131
12880 -132131 -309004 -79331 -190584 -68980 -6142 -147763 251276 22600 500181 206334
12869 166600 266096 -10262 -91858 216874 -89972 -60331 -359291 74064 75963 77342 -249467
12857 -153085 165304 -156701 -23006 28199 -36895 124784 -77030 338443 -46483 -2865 62964
12845 -199768 195441 95842 229645 98529 -295191 16674 156369 1738 -396298 193500
12834 -243195 190839 87721 244890 107960 386225 184743 -141822 -127274 -80828 -31773
12823 -223216 47193 35945 -252805 142304 -177907 86708 -208757 -131354 -242654 -28059
12812 208075 -29046 -67718 95211 -412464 -573094 2157 158922 -162572 235053 162551 -213975
12800 59271 -406590 -165908 -52281 -123755 -74815 -278160 22824 1124 221129 367615 -107387
12788 -2566 111541 33539 126216 -135273 -175310 213879 -94538 -76588 -31505 -120077 -85784
12777 -85784 260707 115519 9821 80064 260279 -252635 161799 -190045 93794 -423528
12766 -89624 -31161 143621 127423 8219 -30433 -130659 -104306 -139106 116237 -110731 -259809
12755 -259809 93702 -29187 265770 -150345 186841 116568 -141400 27113 112767 -102810
12744 254904 43888 -259245 -106739 -25492 -112150 -538 173528 78550 -53713 -34691 1353
12732 161863 308701 77434 343995 -204194 294818 -69354 34028 114826 -14683 238603
12721 -323329 370352 212380 -162502 -216401 -53514 21938 100231 173957 -16208 383104 71726
12709 22527 319260 -141567 -123905 261842 -121821 -108046 204576 123042 -8319 335013 -97043
12697 -86383 -150232 20056 329114 -102222 384759 50340 -43997 -202904 266663 112547
12686 257386 173941 22493 110160 524604 145384 232318 134917 131819 403765 258492 435532
12675 435532 949 -105765 368470 303527 -222691 271960 7059 -187718 -76399 -11762 -123748
12664 -123748 140646 -162386 -119713 16218 -104654 27488 269827 211761 -27619 260137
12653 128676 165306 474611 232023 34123 622497 -77780 -492 146309 193114 -87640 -154512
12642 -154512 -51808 -4045 10654 40784 119589 339733 375785 -19090 189629 340725 265566
12631 265566 345516 27426 146994 71559 -63829 -303549 -348126 92139 113526 -35374 52630
12619 389669 -141509 52834 -108641 -4747 -212914 65167 195632 247905 -238902 25439 95308
12608 95308 125595 77425 306818 284290 223094 231771 397988 249536 6212 153072 150066
12597 150066 202513 230992 46085 -60582 -244378 -221019 205362 100323 67351 121440 -26392
12585 112337 218719 63508 102339 100278 -40771 -54597 -312814 -299369 -711 -196253 251710
12573 152275 286128 112043 125216 23892 62285 67652 -241487 237279 133183 23814 61221
12562 61221 -393195 -11174 -158891 180182 58635 -60055 146115 -195944 -135370 55900 219365
12551 219365 -249320 323161 -15854 -207264 35471 39082 -72039 -256049 291190 142170
12540 75635 31569 -359194 -138982 -171596 -13070 -144435 190295 -42847 -86658 72879 -199408
12528 240479 -348534 -106841 2230 -65975 269763 -226622 276476 222247 -83133 35502 121898
12517 121898 -73084 290638 39931 133646 8560 157100 10954 129276 -264538 -5083 -101660
12506 -101660 114490 402214 215114 255317 -62741 83535 102944 49480 29060 508701 -103254
12494 60349 56679 -216217 150339 222136 201655 132868 38658 55490 24935 18798 95954 393996
12482 393996 202542 365045 -120268 87977 -190803 -7321 -29590 -342615 -52905 471903
12471 -4265 -117268 276120 -412735 -183763 -252610 -70101 -125288 104073 -32870 37334 -36429
12459 -107884 35747 -34240 70190 207237 -168818 -25242 -131514 78283 -211150 -297096 143406
12447 -44767 103518 166380 -61606 4409 -121510 25087 1350 -142095 -211788 23403 -167862
12435 25038 282289 -95721 172209 167420 32711 138982 -118373 -160931 -163068 -221265 210426
12423 146967 -4529 82185 -151287 199792 256560 126416 -349262 35159 10438 111889 206902
12412 206902 211066 315220 107313 -20556 -196916 -108538 222217 -99615 -5756 -390193 -189030
12400 169352 -290998 -189819 363 241010 294417 62486 -67178 44830 -162546 -255214 46282
12388 -136373 -136714 64262 189785 -224174 -120842 215108 49062 -12849 -291909 -418754 -38110
12376 86182 -212809 -254732 -305231 -203210 -73875 43337 -99410 340177 160254 346595 112917
12364 289343 196208 -71445 158350 59048 -129902 -44450 78630 -23133 235636 59363 -72784
12352 -33607 -187513 -147679 -227269 -140565 34496 -110411 -98683 314862 30938 55445 117958
12341 117958 -142706 210048 252432 -30296 -15430 155387 -224884 72570 174049 -196667
12330 -264038 -162882 -596897 25941 -360080 270543 -134148 -20210 -463224 10304 104366
12320 104366 -84921 -252895 -85586 188734 42352 385021 173638 -8916 149548 -2967 87866
12308 -242948 25089 64770 -206123 45598 88465 -113530 -58949 37762 -1804 -255562 89142
12296 -18912 178416 249240 -218771 -196990 -138509 -176262 -146104 -38482 -59615 290310 110823
12284 74180 -86880 107350 -211269 143905 138468 -30473 518176 53804 -225158 -57055 -55594
12273 -55594 79009 -109245 33242 100809 -79815 -225714 -36331 150163 42323 172314 -305375
12261 159621 240659 72406 164135 153422 335380 166766 88075 -115281 72880 260810 378842
12250 378842 242181 185465 119586 104622 313099 111365 210700 22204 143344 199154 268691
12239 268691 -48755 563813 -23262 34894 138496 83759 356634 357519 121667 127104 -49330
12227 238918 16142 -92712 145586 304525 112782 -48965 66993 242888 119302 325801
12217 325801 -15718 87077 420142 106885 94664 107658 129236 288984 166277 262109 157923
12206 157923 -190536 -41077 -180861 -36431 120615 430009 43242 235608 363868 154129
12195 -58943 381927 409374 65777 34598 96382 69518 274015 -146150 -49924 82969 115759
12184 115759 121731 191235 -81852 208886 384083 -85446 257197 -79910 131743 464841 37014
12172 156335 420538 91273 -4928 243350 168314 256524 316970 250029 -120687 401233 227643
12161 227643 83162 -6204 239901 95250 37956 94352 17891 -180310 30271 -139091 137083
12149 345219 -65235 108879 197172 123504 68113 104324 377320 363 315167 295553 163038
12138 163038 142656 398348 140835 737446 -39029 -206070 184253 319647 -26520 42808
12127 204304 -189347 311662 -33442 139800 264389 -128110 -31190 -137130 -344666 473963
12116 127401 208762 -65516 104491 854 91890 268919 -72281 315118 -113026 -115589 68139
12104 24340 289030 -208581 198374 -43106 -171269 -19761 -268285 31760 128330 -19034 -192741
12093 -192741 -137926 67562 1996 -692 62141 -360050 -109707 -40667 -200713 -23263 -138004
12082 -138004 103811 97054 -82318 -43652 -34643 -168824 -70600 -83434 271888 -76365 -83301
12071 -83301 156479 -54320 -39753 170849 -25264 -188755 -134184 -21934 -119400 103877 -158082
12059 178610 -50762 163708 181060 373864 225108 716279 1639837 1931020 653927 252178
12048 -77613 47658 -151887 77046 -170078 -411266 103920 -384328 152697 -279052 -14467
12037 -189902 178374 -28332 -91184 223072 159056 25232 -261029 67137 -154592 875 38244
12026 38244 -69453 -167054 85845 271517 -28589 80664 -145064 16828 92351 60881 -225229
12014 267344 220897 -66246 355717 -233493 20384 24296 138768 5282 -201615 -45460 114531
12002 42945 -224181 17279 208131 -84966 -62893 -139656 -842 49123 -7968 224488 38487 189723
11990 189723 -115379 79946 507391 221226 418060 -337186 -65518 57403 17906 111455
11980 111455 215263 239133 307328 -363353 24793 -133190 -154268 -91956 60084 121862 400
11968 213123 65649 -30998 168768 -110301 -211467 -86660 -303419 117202 194761 3428 75572
11957 75572 43866 17229 -12903 -282129 -13414 -109916 194041 -51852 236504 -188406 -160698
11946 -160698 339537 204179 331857 -9849 -171317 -383277 112874 -46461 -50935 99043 42116
11934 7118 227219 -603505 144784 13603 205870 162471 -241921 -78135 28788 -10334 -109280
11923 -109280 -15231 115959 -163717 104571 307671 -121368 7719 -128771 17383 224109
11913 224109 -46007 -82574 261399 -69454 -156274 320657 204024 -2530 -125745 -124226 -101104
11902 -101104 -3577 -225628 102244 21231 -29247 771 57085 91690 -29225 195599 -121881
11890 17632 185407 -50573 315966 -76421 -232919 28910 -46144 14684 -28980 -16521 -30853
11879 -30853 1652 204698 49282 -370812 -170428 25128 -321386 90563 -67428 64875 102465
11868 102465 -10987 55870 -106044 -372391 -95777 -158121 99291 -443988 -83907 160856 -74536
11856 72952 -202075 6160 -218151 212624 -93495 21809 123026 -159526 -184750 -14666 123029
11844 81014 358814 -188574 338394 12084 -9029 124839 -288109 -326879 -53186 439249 -108072
11832 -160564 -153348 54020 38672 -263217 -55849 1947 -32175 -101492 253388 -185563 70418
11820 251300 33868 177724 220586 -5517 -95844 -225560 -124673 82199 -138043 -8155 87846
11808 -133993 39594 86709 -134533 139884 34515 -125456 58989 129072 136462 -152816 36545
11796 -7243 80252 -114066 -100295 -145524 -8837 -105041 30951 11635 -196256 -105283 -836 -233776
11784 -233776 -190379 69956 -78085 -357004 -50257 -170593 -151413 -20095 107147 -315146 -134506
11772 -166654 -103450 -4695 -30477 5909 11688 -278824 -332277 -145194 62489 -84218 -12307 -138527
11760 -138527 -312439 -224593 -322309 -157990 181273 -194375 171989 18258 -73232 182303
11749 -139985 -116676 -7656 -77191 225717 245579 -46594 -18041 71791 58293 310417 13937
11737 -74122 287581 14123 -5461 -426141 83295 8264 -256260 -193010 -51504 -325778 -197811
11726 -197811 96593 42723 23601 177475 153478 411050 163571 -102897 -193713 119616
11715 -39687 28684 -57899 -319245 154637 -130124 101841 -81109 -140733 -338089 -224515
11705 -224515 267284 -274643 -147296 -194608 172171 146282 22785 74406 97367 -119017
11694 -7393 -104867 1511 9933 177161 222083 347794 329615 255322 -104494 145692 126189
11683 126189 96130 163016 248169 62123 183913 48136 250209 -84289 -149043 206357 -175147
11671 242004 49559 28617 50927 33252 208812 44912 -196349 190658 149182 -127781 -220718
11660 -220718 -41035 -264882 114257 -23888 222826 -228154 -190626 63284 338509 127563
11649 155390 285653 25775 -404433 -172875 -55774 -142978 90590 -434922 1403 49113 146350
11638 146350 68363 144189 -302515 33374 -81160 -47051 3805 146546 26975 -9392 466361
11626 -474874 166347 65738 9212 83452 85373 94842 204253 291476 105892 205743 -21477
11614 -248165 97328 75828 -8359 -200009 1170 131196 -103543 -115612 34909 195830 -273620
11602 -69164 157751 147252 270419 -313425 75506 -129869 516765 -273817 -92902 27633
11591 65445 319785 112596 201572 -151505 240886 18428 50576 212847 23388 101721 371327
11580 371327 100923 -33673 352134 38580 67823 25635 -102657 341465 -112711 -86001
11570 -86001 -32155 106196 71668 -11738 399270 -4944 69428 245705 -143021 62414 -95377
11558 264222 26273 407853 -222196 42543 32078 -336063 29111 2259 -17860 -1640 -67441
11547 -67441 155545 61107 -237937 101493 -108699 -229223 155289 167747 207027 118287
11537 118287 -186109 317856 126627 86009 247660 -175103 200570 342007 112071 -222729
11526 177163 81336 12786 -89078 268246 107769 -12512 80217 197276 187587 11814 -37313
11514 221794 19027 131649 103984 -192233 -3187 140463 31279 60160 434663 97429 416951
11503 416951 434299 111061 102471 -22508 223989 -5297 -158587 361457 60927 337823 -107976
11491 203505 80835 342577 34280 257584 -42563 65868 294615 -86960 -7061 10233 64394
11480 64394 176836 304968 68929 -181240 125446 335542 223889 20908 125219 -15455
11469 338978 319945 140181 214003 -13055 -22318 396326 -44363 53757 -126254 78092 -54170
11457 -56955 138356 -332962 175823 5990 238611 3346 309133 10359 -44463 326845 315019
11446 315019 134691 162538 160096 82024 -72047 293736 53805 460366 461216 32622 -60298
11434 67526 177967 -28959 -290614 -105226 -331514 462896 271637 -55115 -168517 204652
11423 -103201 10129 226600 391564 -297513 -267109 133036 104380 -12568 397038 75179
11412 33712 176491 194163 361062 230883 125766 -22711 -43691 131359 -148273 55078
11401 -54082 -32667 -95001 -199092 -113194 122809 64608 -216976 49500 -114249 -262505 192543
11389 116640 -147072 -139922 28487 218276 76046 -44715 -47679 -172749 -65059 -225390 250329
11377 -153291 -67518 319355 249794 -145224 -23949 -65299 201595 263056 105029 -322032
11366 234463 40700 44825 -107636 118544 76838 -109841 -5065 -199903 -357774 -73188 -262149
11355 -262149 -30814 66210 244309 -174239 39909 67678 129198 110089 5142 197682 338624
11344 338624 20672 107091 121698 -7825 -237922 -48092 -51450 237428 31454 39540 -317413
11332 -5181 -41642 -78096 -46782 485232 40896 33067 265234 -82706 -171625 -1081 86858 239425
11320 239425 168280 -15869 112001 4060 -62739 187501 -15288 629 -291892 -213094 -360250
11309 -360250 76801 -89371 57622 248336 287230 -335109 41577 -115064 150939 89966 -53947
11297 19053 -92013 125258 -204698 25778 1111 -10025 -226328 71679 119675 -216932 109981
11285 -111655 -48827 -23168 -97601 93432 -316935 194040 -390765 -168338 -211116 253797
11274 450 43320 -126864 -31343 -99537 18467 -169367 -221184 98803 138463 -240204 45788
11262 -101654 251241 -322301 145028 -107965 -172802 -79545 -20307 -23063 -37493 -131399 -224980
11251 -224980 -269448 -332338 -120917 -40686 -259595 -15167 -225798 -33225 -77256 -185366 172384
11239 -155705 -212716 97142 -24339 327440 89735 110740 -221448 -158019 -29162 -59189 201423
11227 -135277 -101850 -96424 -140670 7188 30858 -168288 -24407 83636 -130743 -158724 -255482
11216 -255482 -337749 -38158 94002 -111714 -34903 103002 -17694 83260 -60050 95365 126216
11205 126216 -177498 16171 92789 11529 405520 108517 359 -283664 114724 246702 5457
11193 93125 292600 77587 -54149 -90001 -182378 7042 51779 -150378 28088 -88752 -202131
11182 -202131 -201553 13366 -109612 -65955 -248987 91265 -346474 -372912 237783 -38025 93095
11170 -29191 -37522 -87326 -308739 150285 319712 -98344 -239183 -12570 -48102 90228 77766
11159 77766 -423373 -248669 -309225 288508 -199540 471757 -53680 164056 530982 67361
11148 -99221 -140203 -166784 107090 -101763 -155896 -30256 -247109 105893 -61851 -136108 285119
11136 191016 216535 289232 4222 604412 -68083 62630 312714 304683 289959 -229296 32209
11124 -96399 -576162 55594 -3827 113427 -134334 21308 -87311 -285 -68774 35030 -293641
11112 29477 -22613 -169049 -127423 327515 127567 -24704 -90310 -114106 -82795 -363765 2245
11100 159042 302135 301893 7361 -62191 216592 -359069 18973 -15298 -156586 12741 -140129
11088 297360 -16424 259842 -69986 -41319 633 134223 -43542 126960 -16393 100876 208818
11077 208818 107386 -139530 456963 661265 494618 53974 -134575 276796 403519 -113758
11066 379853 115520 65625 -21117 -10492 192723 135725 18018 315298 359393 -54247 339196
11054 197775 605598 170122 128674 -211020 288836 -35135 317451 253999 167043 489662
11044 489662 402425 239426 245511 188180 198927 670188 305552 649436 293892 571837
11034 571837 349369 527026 733821 550882 461484 564750 703830 585464 435173 566422
11024 566422 721696 672914 985322 583516 534370 770833 550277 587500 529930 695872
11014 695872 526508 694702 642941 935288 520858 792202 782518 711607 511631 522999
11004 522999 316902 747231 771702 286303 504864 421994 684564 379571 697175 602892
10994 602892 467206 581698 436971 669371 546156 687664 663302 696040 180821 362197
10984 362197 507600 539904 437247 608815 428460 587742 546132 511636 832347 523340
10974 523340 503905 563639 550588 577061 601321 383505 627951 540772 322748 465888 354491
10963 354491 551169 585766 912730 693923 695929 861163 977082 673531 920797 871108
10953 871108 1167875 1354982 1200567 1562714 1476848 1803722 1888613 2042183 2291417 2193839
10943 2193839 2388975 2208643 2237570 1888406 1631117 1859041 1990958 1458370 1511487 1388347
10933 1388347 1668154 1472829 1765843 1583639 1564763 1591516 1409507 1307648 1295090 1249266
10923 1249266 870218 916865 688885 703625 411548 333363 126730 -21026 416437 190229
10912 -93780 272285 573109 198885 13485 -46821 -218992 26733 230029 -107504 -49307
10901 40897 373398 209350 337494 135939 19824 44322 -402280 206911 -63556 -67411 106101
10889 -56266 158062 113009 -251672 -144722 -11848 -10330 333339 297924 162440 155481 -112264
10877 37171 -28268 115286 275496 -43044 3555 402236 -204472 271899 101535 -124496
10866 114493 18955 -19020 296706 171427 -128540 299049 335182 57690 -288223 -176918
10856 -176918 -116945 -43054 -208815 -67497 -95021 -167019 -291847 199626 105313 213329 -73468
10844 -40420 309532 -2269 -103881 93349 -353352 -322923 -98041 124954 -13997 -131152 84099
10832 60842 -164091 -18730 -15971 -105479 -85601 -240999 141448 42707 18122 -109640 58028
10820 -241892 200510 -116742 180315 120819 59695 -401587 -3707 37525 -54522 -284039 -22015
10808 272504 -63963 -51264 -186727 -56212 -98133 187484 215796 -250265 335213 -248060
10797 -111411 163969 -272416 406536 -123814 154481 -194576 -166381 -18988 170720 -165746
10786 35248 -58658 -113734 135952 422079 -195944 -104646 -259890 -7395 285223 -1664 174555
10774 -53583 229886 121147 142266 44826 28996 -26517 163520 -297864 133536 -347454
10763 -90006 5601 -61895 132807 89973 22274 -157840 34354 -83862 -100906 242454 2930
10751 57063 -65792 -2717 -223366 53797 -170989 -14689 -279541 -36690 -126917 -83209 38828
10739 117480 -304332 -107799 167632 -20131 -476843 -139774 1871 -34142 72551 -123031
10728 59253 128559 9629 -71797 8664 -84675 -486123 -113649 -149419 43990 -250440 -277604
10717 -277604 168270 47289 -177903 31161 65011 194841 36428 -346504 -279805 262182
10706 -136645 -54771 101722 -327007 55040 -84141 95393 -225629 -650488 61820 -42800 -165906
10695 -165906 93951 -160424 -66985 -48813 -44774 316805 67055 122969 7678 -67542 -109888
10684 -109888 18977 -264291 164985 186933 -8726 -77797 -136499 -39503 131053 360449 -27241
10672 173365 90533 298229 -183728 67813 -122488 75103 222587 -218769 -258258 81767
10661 -13606 -283281 -14431 43606 -19962 -149701 323147 -51465 84232 -67080 74722 -153725
10649 313063 222237 -322878 76750 19919 -112601 -7859 -328963 -112342 -265207 -404388
10639 -404388 287192 -229431 -400490 166362 207383 57158 101786 -28791 161052 -130993
10628 -46853 155349 -64322 -29004 -161910 -136027 -26656 -31636 -33364 -353325 280121 68966
10616 -151833 129192 188159 -98626 -197931 100550 -185865 -366180 22783 255649 -449125
10605 217584 -102169 168412 -97076 -292169 -180104 -14002 402340 238965 -33475 73718
10594 -110898 -72018 104735 -9993 -106251 -216376 -135664 -81201 -41569 361679 -52747 -143500
10583 -143500 80620 23150 204970 -41349 -219595 -408489 -41250 -287566 -44696 254428
10572 145412 11416 212517 -53226 -4280 -36914 -111491 -197011 264825 -191812 -416131 -37118
10560 125278 -119390 -161921 -263403 -11345 -139286 -221985 -159669 -52925 -7217 -146000 -110297
10549 -110297 -95117 -202646 84405 66549 72593 243226 159433 28937 25650 162901 -2530
10537 -28107 -47239 -365895 -144104 -117365 -87779 27451 1991 64575 -76779 -436038 -309433
10526 -309433 41951 57567 -454365 305225 -217512 -160848 59056 -106454 -84457 146203
10515 192103 106655 -38828 36908 122374 -243033 -10564 -142326 69123 -121392 220127 62253
10503 23747 412473 328566 -557678 -248330 81198 157530 125370 -151659 -214210 141457 52978
10491 -44932 42971 -46212 -9467 -171674 -138804 142265 -40851 104654 -99996 -63387 104982
10479 34349 202549 198110 -11821 -147256 57499 23109 -54139 -159665 53652 -250498 -331573
10468 -331573 112381 133111 -23691 -644246 236614 -107298 -76511 -87820 86695 -64134 -52250
10457 -52250 347158 196323 274192 89870 513641 80582 146003 421785 375503 139633 255350
10446 255350 87177 -13132 76876 -277651 83474 261060 95450 237680 -250036 136047
10435 -210645 -94042 115158 420049 -8254 40150 -222612 -141451 77583 -428671 -326486 50241
10423 111979 118501 28635 -84893 82610 -16452 171526 -122863 84003 -54250 -25774 -50303
10412 -50303 -116538 -48197 -102146 -147426 -181862 -114922 -363335 -312260 148285 -18802 9000
10400 -127949 -205643 149008 -3884 -351535 259924 -280663 208257 -204108 42459 -159023
10389 142058 2715 136087 64217 113441 -350519 -199494 -275106 -362253 -58300 -7369 -49051
10378 -49051 33791 86084 83240 -185850 33711 12618 -47352 -243630 -79521 437339 -220962
10366 191302 -69311 134228 -4511 45048 -88950 349486 107256 -141540 186657 -72086 142900
10354 337995 -41959 162635 164965 79008 -134698 142924 319815 98827 284905 156787
10344 156787 271374 408682 113748 564735 523240 470753 500031 296880 467550 318980
10334 318980 154212 51145 147219 236480 116372 320007 421871 60751 352027 612325
10324 612325 513413 646614 207032 593635 354361 521440 725757 185553 159960 54030
10313 89059 139300 363014 180640 269860 2321 422008 334924 222540 216907 -3822 242278
10301 71424 122298 151854 409329 -90095 269150 93018 200199 -18272 183195 -171070 -207489
10290 -207489 236597 36316 467427 -142610 28344 -152219 301433 105485 121119 -148458
10279 -138212 -79183 244655 84745 95651 299823 -148418 -136368 -58398 226151 -95111 -186963
10268 -186963 -104468 149899 -179842 -101537 259404 208711 -257739 -187815 -53247 -61431 -47257
10257 -47257 -426320 -24376 -188885 18072 -96520 3814 43121 102337 204211 -10755 79822
10245 71021 32584 116716 -29330 130778 41076 -273714 30545 149877 -79141 -204809 45751
10233 35528 -32861 360993 -67506 200473 164628 169795 43337 115072 246248 72268 -62027
10221 -261037 89232 149884 211506 136565 -70966 89608 71128 -270486 -250957 -330725 -392483
10210 -392483 958 -204634 202216 158557 -363614 -85745 130225 296885 52887 -178945 -135552
10199 -135552 202450 -47401 -55521 -262534 213250 83616 -95031 58295 114347 2077 90668
10188 90668 91470 300439 -127303 -251663 -108022 -213204 -56665 -49131 105400 -92726 250911
10176 -32456 62032 -75622 -71821 13471 -63825 361595 -36713 -107726 -90804 -449119 -38882
10164 -95443 259442 102025 -11553 80796 -128455 -136984 14909 -30146 114362 -24268 81860
10152 -225189 13990 167549 -150180 -60665 -307053 -398942 324151 217707 -123906 36721
10141 -120232 484592 158024 -13716 72349 -93939 -238225 -344573 192069 112552 -382237
10130 -44474 98483 -59363 5292 5507 67288 -170733 -183497 -191153 94340 -69070 -97453 130567
10117 119221 -251870 -88675 -2344 134019 -88097 35036 -608508 207956 -34084 -245002 110875
10105 -3287 22611 -280739 222559 151973 37657 -76376 -173258 -300128 170861 79584 -54550
10093 -200335 -73153 -348691 -180010 110885 95773 268075 -125923 -57725 -246024 -49428
10082 44849 120859 61305 -122352 -210548 -127869 -130895 -364771 -274629 -173846 235153 -175319
10070 -127931 -132170 -103380 194606 -72382 233008 -521920 171260 -813 -77872 -93118 -159608
10059 -159608 -254975 87796 18048 -233142 77055 -171197 -446151 51362 101988 -14320 -2974
10047 -16751 355146 -103406 150136 149487 -17159 124947 -276854 -386950 -64853 -366453 -203342
10036 -203342 38134 -227016 -55475 -352981 -110496 -238243 -5311 -110842 187709 -25289
10025 -25953 -77974 -7177 -111631 -77829 -369782 -313741 185493 -100737 14771 -20618 -272884
10014 -272884 -247588 -141193 -57048 -38459 72266 -3808 -326283 -469243 126663 -52696 -170105
10003 -170105 -206381 -257728 -99890 -105617 1862 144557 -90611 -122075 -32685 40693 -102080
9991 -70879 -171745 -127927 -401894 120447 22714 3115 -59675 -97119 -86208 70517 6911 -249090
9978 114085 -2665 -259826 -202760 -234036 -71335 -155813 14519 61735 109468 -51274 409733
9966 -248980 376435 -109646 -239003 -43890 6084 35298 120730 -47798 187001 -188084 131459
9954 -205140 45456 26439 -111576 85385 -8020 156057 -65547 202477 65151 176517 38688
9942 -210489 -71326 -27577 -82447 -182620 151593 -143455 71091 -332873 -118569 -172783 -168853
9931 -168853 -9595 62074 -263003 -419879 -235463 -174783 204267 -150601 405406 623 69742
9920 69742 -183887 -17987 -149744 139756 307687 117911 -238906 154287 -231040 240078
9909 139062 -358507 255966 -163047 198605 -137460 -284871 75900 -261151 26781 171945
9899 171945 -116254 -225863 -165090 -72219 -232467 -84932 -280426 -266143 -188686 -174430 -12494
9887 -461696 -14168 115341 -178477 253677 44553 72637 146772 -286111 32142 -525718 -121496
9875 -134387 -152935 235858 -44251 -43697 -228952 -112432 198557 -288675 -104137 -12693 -338789
9864 -338789 -218499 -189739 -225437 119243 -38332 -80859 90310 323247 64223 -65027 47517
9852 335556 -160750 -324658 111392 -192496 -185421 -264761 -327252 433765 -13677 -73882 -439764
9841 -439764 -121364 -301333 41839 -30029 -46298 225139 329904 -370255 -103258 -252571
9831 -252571 186292 -227637 -218933 163181 -119736 -136035 234675 -134297 -95346 242121
9820 -29949 128887 -16022 -316733 85914 -292895 319929 193068 -400692 -133042 121051
9809 293462 -111627 -201357 -4224 -79482 -416832 -68114 -171114 -204645 -217578 -123826 122533
9797 -130767 495612 -319474 -80135 205866 -277078 -105487 8064 -383646 108444 -374746
9786 -30054 320872 -219184 293004 -456816 46993 -57603 -98467 -175589 -158865 -26377 257244
9774 -353751 -196413 -348367 -18251 -45667 50868 153748 -402469 -19833 207807 -178989
9763 -227565 297037 -114767 -302196 -310325 -142127 -311232 362627 -87295 -81661 -334593 -207932
9752 -207932 162774 -556367 -151945 -216906 -50149 51598 50011 -86003 -169976 146052 153477
9741 153477 197069 101362 -286401 -174553 -21818 -6947 88257 -97586 -190426 -124203 30904
9729 -400928 179185 38773 -96187 -63041 -75078 -408840 226940 -137883 -100497 45150 -150951
9717 -303687 -129424 -268564 -7284 165384 84542 -100326 174621 -148060 272969 88793
9706 222159 266847 -159917 120500 -41575 -65627 120069 -189976 -154163 -239678 -31716 87789
9694 70657 -142472 139313 -64161 3472 292089 225981 -150368 223766 178277 52810 -249841
9682 -279901 157115 6105 62582 46574 -336975 -263204 -247773 92099 -48538 -222490 -209759
9671 -209759 -42460 52353 -31766 -244161 156853 455288 14661 13990 16754 301836 -71824
9659 -234182 137031 10471 -127835 -227647 142774 270766 -78414 -38809 -113768 27087 -150743
9647 -79187 -280393 -313815 256790 -387677 269478 -278660 32056 68018 -192301 -442084
9637 -442084 108495 -154078 -131910 210007 213452 -43164 -9878 -312340 -77409 30688 -69525
9625 38522 -330625 81049 -209140 162703 -198121 -273162 54768 -280695 123864 -220598
9614 -381008 -222171 61913 39839 -74656 -97943 -201636 202132 82930 -57600 -170562 -330485
9603 -330485 -225314 -122032 14643 176397 -106820 264182 78011 -81364 -311089 -139297
9592 89488 210901 -4059 -128036 -192402 83274 -187401 -110050 -69366 -87335 -255010 -2368
9580 69722 -100670 79424 -94296 -42148 62244 12398 -317229 50473 298615 -48813 94567
9568 -66314 -159827 -189191 180164 218866 -131142 -60193 -131828 -19509 133560 -203515 -43817
9556 -212223 -52816 28882 -456434 18452 -60609 -159497 -139245 -94392 -313449 145549 -473276
9544 45089 -367645 100783 -35303 69770 -271216 47775 175406 -94740 -10417 -71143 -170308
9533 -170308 -137380 -183270 -106687 -215389 -8728 230714 -21551 135742 -127790 -68684 169151
9521 -88991 -324668 -33540 -271823 94303 -226738 -69428 374 -148934 -154735 -229231 -10809 -7466
9509 -7466 112839 -69621 -8448 100021 8400 -183078 -144787 -223338 -277284 -500288 -410176 38411
9496 -53881 -124850 -528828 -234025 -13090 40303 -206403 123644 -83593 -29585 -67722 -33581
9484 -19973 -336337 -226414 -66183 125166 47332 163640 -22940 -156845 -56726 135866 379412
9473 379412 -229177 46860 -191944 -168592 -500109 13476 -116676 -91357 151170 77001 -11228
9461 16871 -108764 -63103 -25856 469 71593 85261 -125391 -160001 -153951 -317728 133078 -67731
9448 84024 -200145 192266 -140301 -19014 141923 -245841 -108861 -154151 -130386 42020 -136117
9436 295977 46804 -52330 -759 60734 -311725 78767 144807 -226245 -123719 -51603 -310830
9425 -310830 -26179 -137522 -206120 -167697 186134 181426 -59995 49174 -309507 -317063 61715
9413 -118936 110242 -286144 3342 -226245 -220397 -120574 -318988 -314086 542773 -82784 -166721
9402 -166721 85556 -217665 180051 -26300 83839 -203481 -55417 -212366 279607 -321245
9391 -51909 -176326 191178 223890 63955 123922 35666 -136450 637 154935 -198256 -425845
9380 -425845 -396971 -142798 -51669 -58096 -122258 -112781 54637 168387 -8442 -186831 109557
9368 113569 35913 85040 109258 -120798 -107747 42940 99216 -114754 70928 -25684 -249100
9357 -249100 137471 -52945 -60172 267260 93290 157140 95573 420176 -171916 -267496 -176135
9346 -176135 -235515 97428 -145672 298575 13213 -13816 -63895 -83392 -142858 -120988 276517
9334 3426 24794 12938 -110552 -47882 68411 107251 104661 91551 -88422 -41274 -87919 91129
9321 -39119 91865 92304 -138167 -107936 -148518 -160951 97054 -190448 128886 -34149 -72172 -59155
9309 -59155 -1281 170465 -218839 -123591 -132993 -187688 -153061 -377286 -33503 48956 37497 150633
9297 150633 44985 -219713 -359505 84847 -81068 288894 222374 32145 51274 -349102 -59791
9285 -81031 -173870 9621 28734 364084 -237589 -162672 254951 100726 -141669 -187335 93746
9273 -367811 31735 -31358 -166225 -197146 -149651 -123955 -150728 -270816 -106756 -93280 168279
9261 159570 -16420 58602 64331 82655 -193158 -196856 -269646 -183311 -367469 -182927 30852
9249 202954 -141829 -204065 -62325 -193241 144918 -243925 -91354 -46458 -382460 -51592 63832
9237 -101757 254671 -227282 -201892 -345970 30954 -73050 -278575 -190283 -214256 -245160 -71466
9225 -151655 -36695 387694 -315743 89152 104522 42369 43032 -83347 -176047 -192016 -119652 -179496
9213 -179496 98246 199324 -243213 186291 -46293 42544 -101225 -85584 -7245 27564 -44878
9201 -175479 -183555 211172 -1018 4922 -129447 -99937 91601 -109562 -118780 -181482 -68340 71906
9188 -2556 56401 120661 -92907 30902 -42501 115043 20406 -88146 -158597 -113959 35746 -170025
9175 106550 -198810 35608 -67949 -187532 -88557 -6571 -83469 -126548 -140470 47901 56492 -151822
9162 -214285 -19511 -174709 -234876 15933 -30754 -42035 -188330 88771 -366972 -22942 -455
9150 52182 107825 -255221 29320 -240161 2979 64046 146961 -171048 215747 -245225 -42507
9138 98662 26696 146686 121677 -85862 76020 -220537 57821 -172731 -76564 -89472 -139562
9127 -139562 -45173 -182977 -68235 -386061 -110984 -57033 -268456 61713 132143 216057 79316
9115 109306 62656 -21440 -118093 -231699 -157011 -32761 54296 -209252 206939 -170602 -310891
9104 -310891 -142081 -229078 31465 -134883 343307 -155344 -234787 -102585 -198775 -183129 -195741
9093 -195741 -189253 7592 -45818 -101340 -37052 63548 86385 42457 -171522 212910 -98381 174795
9080 -32863 71005 12085 39609 88067 -149499 -91515 156728 166496 -23065 33758 -192413
9068 97127 -251852 -107852 -191395 99803 -363118 94626 -162703 -2673 137863 62182 -40201
9056 -263627 34313 -236812 108895 -186860 -140147 -106685 140960 188156 -3171 -101598 -244796
9045 -244796 -110559 109390 -31089 -223843 168850 102097 162331 -191553 -330366 -43553
9034 -3844 -46784 229470 -289491 -51865 -74248 2715 72459 -121673 42722 248260 -137974
9022 -113556 -192610 194149 -70661 125894 -65915 52927 -182264 -72277 -116264 113916 -130887
9010 -277675 155343 58036 36850 -264358 169325 235963 181594 -158153 -2265 -91663 -159811
8999 -159811 124573 -311137 -198786 400104 -369601 -284684 22052 -138700 17565 -257607
8988 -75018 -322619 46719 -191521 -324873 16006 6304 -26191 39329 11738 -142961 -171695
8977 -171695 -229873 -102019 -51146 143106 -169669 -82001 -98363 -208696 -434628 393093
8966 -165702 46311 -162334 -100462 51740 -258992 -159864 -239698 21051 -11147 85587 108487
8955 108487 -60324 -129230 158398 -131344 95512 -6800 -105436 -70523 -78326 -4317 65154 -151688
8942 -93888 99686 16194 321465 -180268 -53765 -348146 240322 177647 -322876 -13028 -70709
8931 -70709 -107076 -219632 -161816 -179377 -13782 -265331 -347400 415859 -138435 -260537 -247334
8920 -247334 -86171 -141255 167333 -128901 -251783 -275427 201381 -470554 -97542 71037 -357702
8908 201684 -328091 63519 22786 -153136 105636 -72272 -154788 -40639 -99251 44752 -81130
8896 8786 199289 712916 -97554 -236993 -369274 -2567 -85520 63258 219529 128301 -391750
8884 -64138 163959 -121232 -203760 -167346 39400 168784 -12695 11752 164754 -296095 64021
8872 76443 54480 -86435 -101813 -374588 -157586 -152546 182567 -81145 -174193 -130169 -188767
8861 -188767 -193031 67691 183137 -88384 96609 -44931 361293 -245713 209632 128581 -56770
8849 104145 159351 -33435 114461 91795 80384 -51734 -287895 95230 45151 160131 276138
8838 276138 93836 -327350 -78843 -7628 -9835 -71645 -253755 -108681 -217330 -341496 81665
8826 -106245 -54159 3229 -289664 -231391 -221587 57379 92898 72683 194044 133068 -186357
8814 -161363 29061 305817 290102 26619 79359 -197499 303205 -139585 -196674 -49189 -2019
8802 12934 -273762 302601 -146796 -4176 131469 41536 -251871 112306 48010 -55138 -87164
8791 -87164 -211675 305902 -511531 -170655 -42287 243085 4059 162519 8032 44375 -78179
8779 465332 72567 147294 -96876 -474311 -157734 -119012 100541 -59260 105760 229466 195322
8768 195322 -50101 -209947 37036 -119945 183599 31524 60270 -119273 -232271 -25340 106331
8756 -257072 -23511 -211867 -35018 -14862 12778 -475805 -279401 -113751 -17379 -240809 -392467
8745 -392467 -40895 138971 -148273 -109898 -271409 -283569 71489 89087 -239122 -62644 65554
8733 -156342 123828 -28925 -150312 103 -23011 61449 210891 -30354 -230017 -120798 -15938
8721 -30391 -219421 117129 -254708 -365753 -103869 -88083 153433 -103023 -198356 112101
8710 -258379 -132076 -197660 -14539 80648 -153748 12095 -117120 -268226 53953 102481 -152501
8698 53303 -198578 -218179 -116798 -252612 146931 -123925 118251 306672 -370097 -29503
8687 55328 -88730 -94623 -34513 -137317 -37509 251435 -147182 15858 276547 123002 184038
8676 184038 214864 -308749 138897 -203926 -42753 -333951 -39145 11968 -134311 -196369 -245461
8665 -245461 140334 -88502 -34596 -124134 69582 109749 -119636 -130594 17089 -222960 236457
8653 261742 -340660 -105044 131906 312396 -256067 -53955 -153424 -111417 -132521 -70334 126688
8641 -428302 19008 -111951 35775 208151 -322309 -168620 -273823 -716 -97582 -112175 -234635
8630 -234635 -140965 13494 -334550 -225749 -152153 -246966 -37292 -242488 -350845 171355 -256293
8618 119833 52901 -216481 -223678 -157942 -211742 -313825 -101701 -287098 73335 -302133 -172106
8607 -172106 -235156 42327 -172233 -207379 -156225 -247567 -74635 -20754 -198883 -239928 218121
8595 454407 -362769 22552 -189208 -92160 83970 -68626 -152652 79452 102311 -113530 -51381
8583 -2970 -55386 -118903 244291 -125767 204524 -58779 -155861 63892 124421 -356134 -107888
8571 176971 5282 -102380 -192066 -128543 -158496 -134512 397741 -131112 268446 -309195 -82729
8559 -442840 198279 -260902 -133173 -104366 -84920 -122172 -120094 225365 -170577 -90742 149825
8547 -86968 237166 -219577 174563 52062 -327336 242103 -231282 -271482 -321559 -49325 -250990
8536 -250990 11593 -216900 -237523 215573 -73603 -81540 247649 -161496 -126513 -281342 -2361
8524 -71334 131939 183849 -50099 111092 254851 106302 -239249 -139660 -86941 -107318 -168981
8513 -168981 200749 -243719 -27472 -3299 -493317 65614 -92139 -14082 -82412 96868 -110832
8501 -99184 173430 -42619 86858 -210630 140268 86398 -101545 -244 85643 75595 60185
8490 60185 -72479 -331225 -159084 -273915 204411 -84154 -203980 17683 314245 -149558
8479 -113285 -125844 -35663 141013 -121978 -98053 -210519 -322633 -253266 -17289 -175857 35640
8467 132397 85365 -165311 49247 -282192 -174835 -217149 -185668 -6246 -103732 -126914 6588
8455 136925 -414175 221220 -196973 -22314 -147693 -43811 -278365 -47278 -80086 219950
8444 5149 -268218 -14705 -33885 -285853 -103748 83949 -36257 54514 11466 -186438 271642
8432 -96027 -49538 57711 11662 -151023 -172145 -111136 -64790 -149846 -704972 -207309 124404
8420 35047 111431 65428 108153 -123867 274118 229779 -2412 -341613 -26522 -137008 81757
8408 -68140 -126524 -3403 180657 260513 -81916 -12961 -168529 -336836 -136101 -119685 18151
8396 11687 172818 70103 75769 -53232 -41000 82164 -55799 83364 -220050 120998 -91097
8384 -576 -145739 -30258 -167513 -130884 -77730 373887 -65586 127382 23342 -203870 -158776
8373 -158776 -24966 -154789 10430 -110893 201069 -406141 28873 -82484 -32529 -171527 -75203
8361 98432 79347 -291948 -296598 -55523 -19728 -221965 88770 40844 116044 -26048 -180900
8350 -180900 -85430 -219862 5624 -256344 -233373 -232131 66216 238291 -56488 -100410 -8021 29813
8337 -72334 -313107 -119487 -379535 248765 88214 -221385 -543586 -5324 -120286 -179366 73924
8325 29538 11075 246030 -110338 120367 -63116 -328973 214503 103928 231580 240191 -3335
8313 -20645 -149308 -62268 259976 -240602 -14145 158000 113395 106478 -41962 -68197 75728
8301 -236722 -186066 34293 72930 -327253 -173000 -328008 27343 -496497 -83772 27724 34433
8290 34433 146915 113268 -19042 160738 -14212 -175606 242997 -76037 -500139 -232723 69142
8278 162307 -96181 121172 84149 -197995 -106517 -176926 3754 38332 -247936 -48883 26807
8266 236250 -216359 -376373 -92531 -182728 -54943 -46870 -215823 -108829 -171159 -143516 193761
8254 -262322 76257 112629 -172356 86119 -26413 39487 175769 1419 -67922 83208 256125
8243 256125 -69855 -84115 -128443 -222925 139614 -211731 -75125 -147638 47918 -342527 -330003
8232 -330003 24705 -305640 108112 86090 -46423 -233165 -222540 -270929 350332 -232690 183173
8220 -275186 107280 141753 -178713 119490 -275657 229705 -426566 5356 -53259 -66521 19959
8208 -44216 18864 -157175 65687 -71762 -156795 221500 -81953 -101626 91596 -62862 -41540
8197 -41540 47466 9128 119246 -90051 153627 -313260 -34188 -57508 -125324 -35520 82056
8185 -105772 -40283 -117721 105084 245961 103246 9634 -165741 -34678 -222351 -289196 -336527
8174 -336527 -92035 -160573 104488 121077 -30334 87026 -214692 -318945 -40888 -211967 131368
8162 119904 -295989 -132427 -55437 309389 -294096 -14946 210606 -124364 -81880 -18761
8151 -148274 -141911 -181304 -3143 56198 5520 -9119 31571 -1069 -334503 65794 -56303 194487
8138 71259 -118205 -135762 -76040 -194376 61685 -128441 71112 -73308 -59945 126524 -202516
8126 -369223 -351643 -179386 49575 -180761 -257977 282206 -137024 55726 -243369 188049
8115 -258829 -212425 -269808 -83983 -8472 -370072 -280147 -174805 -266618 -72454 -148309 10384
8103 24048 -171187 24858 361591 -10527 -214047 261427 -103585 -364904 185636 207874
8093 207874 59506 23200 124548 117509 -356652 -277231 -119711 -105915 -47818 185446 -17786
8081 53064 -260590 -189784 255275 -139869 -426468 -47941 115388 -328268 457669 84907
8070 251157 -98811 46729 -171349 -207796 -51813 -141723 39768 -214022 -17398 -183141 -91946
8059 -91946 -108749 19112 53969 -416668 314396 -277039 126445 532847 85567 -187540 -67829
8047 151622 -288758 -273449 29840 7920 -673 32246 118041 -93428 -27697 125801 -341196 -29068
8034 -146031 -42754 128645 -85599 185282 -1322 -46650 9268 21373 -5605 -1463 -199985 6856
8021 -169308 -150555 -168223 -3976 -319145 -356528 -13115 253616 48584 123038 128691 -229717
8009 -60913 -71483 311087 -117555 -258897 -130697 -48353 -48067 40499 -164350 -26958 -46758
7998 -46758 -58612 55396 -151297 306502 -48167 -233104 -175154 378364 -346750 -314918 -1702
7986 -84558 -130604 -339846 -152378 -225079 18519 -67893 -149952 -156959 -38400 159121 -366192
7974 -11997 167780 -234461 -272817 -537734 -181473 209223 323930 134287 -106852 -10460
7963 201759 -38925 -20292 170539 11287 230303 94572 -104086 195830 -198760 -95822 -295591
7952 -295591 -141917 244174 -128783 -150280 159137 17645 -50099 -110774 21130 -236308 131696
7940 164566 -72459 245975 -183794 -32390 -62224 -79484 85976 101477 -197618 -230524 1362
7928 -224697 -139111 -122165 -9135 -127055 -418141 -71527 -101864 -19168 2232 -180841 90114
7916 329348 -97014 -169987 26839 254271 -393289 -58455 -81727 -156418 168578 -179510 -433828
7905 -433828 225107 135908 173636 -146793 24431 201827 -176085 -47497 204401 6010 -177213
7893 65569 99340 -199186 127718 -19336 312296 -91002 -119030 -115725 -321101 -196088 79656
7881 209069 -131968 -76452 -51706 -364751 113784 -50314 56739 -181995 218924 54170 193851
7870 193851 -70948 225656 34352 109764 82955 -7750 -44004 -71699 -204462 -83188 -78156 -105583
7858 -105583 -35404 -320168 232759 -214589 -191100 101108 46206 80185 -225934 -295170 294823
7846 166744 -200387 141445 -120317 -174693 -146244 -176645 -123188 -14089 24860 226851 -197461
7834 -188463 118029 320115 -26504 61827 52498 15671 -70646 268258 34691 148312 -205239
7822 -81323 -132318 -84116 42741 -124096 219218 323226 103933 174172 -117980 23832 -279335
7810 -143198 -93732 109653 -215918 43983 24225 -44163 98413 353489 -238979 -57763 -91625
7799 -91625 24163 220732 -355345 -367439 -17050 106155 -38336 -5321 -293929 -153771 133097
7787 75201 147737 46134 -152843 258443 93436 -491667 -175560 21334 -181234 -30399 10681
7775 3341 -372053 -111861 59198 -240583 -328965 99101 13313 -207694 -55003 -57189 -216053
7764 -216053 -252270 -27217 -312793 -39378 60010 -98863 335005 -183620 95275 -211549 6058
7752 -250547 -179661 79674 -83003 313371 316952 30800 -337033 -210941 31403 -64069 51344
7740 -95066 -370186 -329754 210021 -293553 -258374 -33381 -46419 47402 -54112 18174 -226677
7728 -181738 -104025 134003 -187767 -115504 -467099 230866 -216645 -163886 303772 149792
7717 -176408 126404 -64962 -154613 -88107 -81118 126483 -2052 145808 164312 -152431 128943
7705 238400 -110386 248258 -166303 22140 -1494 -421185 -200140 55150 -51886 92417 -8098
7693 -316001 29969 -161624 133166 84616 -65062 76929 212234 -114815 -265643 -405779
7683 -405779 -244472 -165879 -182986 -75220 -86520 -63709 -226658 -100609 -170919 -14988 42926
7671 -173974 -494858 31705 -82516 -33739 23394 13184 -108444 -18244 49778 -224831 360649
7659 -92265 27877 -124218 25815 -99288 7092 -207855 62171 -211608 -103463 -44442 228450
7647 -33412 109043 -5591 164815 -43548 272892 -370552 194393 -13133 243592 -5629 340789
7635 131125 5555 -47877 307917 -69617 258759 45463 24423 -69949 -14179 -151576 -359597
7624 -359597 4916 87416 -192302 -152145 -473894 -371830 -161828 320571 78145 -292868 128442
7612 258606 44752 -201033 -263580 -178180 11138 112280 5903 -130980 330237 -12296 -316547
7601 -316547 70280 -106598 -862 229661 65412 -88402 -128850 -255578 -30395 222041 -230208
7589 -212409 -138014 61996 144487 443139 -126738 -129084 -114419 272397 201033 -39289 -227178
7578 -227178 18495 -143596 126911 -178549 -69697 422849 -234769 -38254 -154727 -116928
7568 -116928 69678 -211095 -313889 -20518 -372164 -130860 -171355 91725 265698 145919
7558 145919 -171652 221288 102077 -147535 -344438 -37779 -150404 -391569 175876 -134150
7547 -214118 114229 -320957 58861 92278 148728 125447 88610 -86288 -254465 -47804 13412
7535 -291386 -127179 -99125 53683 43699 -266695 36239 -94771 126133 71171 -380653 -140214
7523 160502 -460986 153529 157059 28275 168305 -32070 314603 -358517 -305569 -440803 311977
7511 -147771 -144214 -192165 -39000 -144636 56054 -132543 11832 -36652 88144 -121890 202755
7499 -466894 -279442 103523 128066 73569 -238481 137179 221670 -227312 -99337 -28120 136062
7487 318181 -122771 19905 31645 20124 -242330 -265565 -47891 -136953 75252 -210894 -32958
7475 -218698 -34573 38136 293610 86523 21363 -174596 -185353 -67403 53029 58779 111505
7464 111505 -110585 -173057 -11018 -181734 259248 -109176 52298 90549 -150740 -36472 -6026
7452 -23833 -234090 586831 -30804 -183923 39309 4417 22949 132730 273954 -69114 -37071
7441 -37071 -211584 -311730 -51415 -223362 33283 -33345 -265142 -667941 -272940 -36193 -26690
7430 -26690 235324 169844 -438760 89845 -63220 -119155 261413 -133405 -199719 -266106 -20967
7418 -195624 350490 -199255 205216 -449915 250222 -123366 -24091 -136548 -254064 -19405
7407 17366 -229590 -263247 -184213 -11204 -73851 -4503 -296723 -276508 134373 36546 -246204
7395 220067 374973 26105 -10374 -27945 311271 -103753 -179556 21483 -2350 -60938 176235
7383 -82726 82297 29343 -102981 -63146 206576 -264699 -244805 -18656 -66466 360056 -248533
7371 -115765 92170 40743 167219 448048 -416758 -243277 -32438 -244377 -66935 62544 114134
7360 114134 282764 -206112 -67974 18946 -292881 -211405 -76206 -289024 156745 -38103 30327
7348 -265091 30527 -223362 95063 -119189 -106054 65830 110302 238891 54044 9663 203949
7337 203949 45883 51279 -109456 13927 -134042 -144225 151814 -342729 223621 94376 -226630
7325 -282298 -461971 -156633 -84285 118210 18161 165643 79235 264515 -26680 -44696 -38680
7314 -38680 100699 -36632 -195545 -182012 -40465 -289141 -112306 -26011 317572 -199504 148549
7302 -181238 -185567 -55307 82815 38441 13707 -70168 220127 -64904 311674 -187810 -73661
7290 119410 -70949 34698 -68011 -44960 304809 -8392 -516513 -82697 351601 26332 141631
7279 141631 224198 20311 -223272 -35376 -71695 -21194 -54614 -85541 131469 348643 -95337
7267 -3127 351523 218545 -210818 6514 -378937 380379 78528 -112052 2202 -255638 -196737
7256 -196737 -130471 151563 -112846 254022 11007 5081 4273 10433 240139 92372 -248354
7244 -116023 -80869 -15950 74989 -105553 -280134 90497 47635 -14646 -318979 -436525 -9628
7232 24327 -81981 -23935 -210452 -400622 -178049 29930 189260 48207 143229 3329 -165007
7220 -258302 -113396 -393826 193688 75849 -98083 -260018 -167174 29637 63258 72971 78078
7209 78078 -166901 169241 -185842 -171026 -247493 18013 235412 161830 -38130 -262706 169179
7197 19413 25675 440196 -171144 -338780 73775 -74123 -384502 41733 2702 -131354 269273
7185 2466 100904 222493 42777 66038 205515 -371138 198224 -123898 -191225 152761 52781
7173 173784 -462403 197178 212408 -67550 77686 158286 80941 -139264 -138631 150013 -34062
7161 140352 -166277 -12983 108385 205695 -62885 -409685 -77467 -30880 -223614 -133298 72082
7149 -33516 -123476 -257616 -73997 -213352 149534 180711 177914 141796 108696 -31106 -475926
7138 -475926 -50030 -92707 -108064 -166379 -169907 43510 -57992 -47134 181786 14187 126228
7127 126228 -43393 18148 -54711 -352172 192633 -6747 -11567 322447 181180 221712 -86272
7115 -127402 361052 52367 -219489 -317547 5479 40561 65389 -70892 -336858 -216431 -57177
7103 -86045 -53398 367847 -149891 -63014 -145990 -93345 101053 -68138 -156395 138197 112354
7092 112354 -60230 -360362 47356 -156176 63316 -149849 -181328 59405 -328605 123106 -76550
7080 84926 -96246 -69208 -412640 -33874 -48572 -44154 9235 -48277 -52293 -100341 16185 -68144
7067 171887 304606 32638 -64333 138899 -4353 -42801 59812 53155 -200590 16213 -103095
7055 -153035 106395 68273 319429 160907 -104145 17138 118357 -33605 -77267 421860
7044 79016 -246337 -54574 133382 -178000 -119100 174614 264212 35884 -10442 -114513 27935
7032 -150132 -157788 -36356 14406 -236804 -28561 -81612 -130172 -296426 80629 -103781 -45146
7020 22666 111865 78856 311027 171144 -136532 37274 -404959 29556 -194326 -103987 218403
7008 -228421 -107612 245356 5973 -304512 -247195 383883 -218893 -178162 -39608 52758 -3791
6996 87528 -74378 -15894 4603 -93515 -32564 1201 -19213 -87320 -81169 -73751 -50820 261123
6983 166711 -96913 -266016 -398404 -165478 -109621 -166495 -238216 -134292 47885 81683 -48888
6971 47644 129012 -153434 -224514 243678 129167 54492 -173788 -128527 -405445 -110968 -168706
6960 -168706 269424 52935 -79156 -60455 -398401 390029 188406 -86990 42207 44912 -67287
6948 6594 239301 101546 178274 -453280 69207 -132007 -129798 324082 -17578 129233 -162362
6936 -101764 -130211 -76315 5901 -104559 81411 -185846 10672 -37914 -222539 -315428 -190686
6925 -190686 -32538 -32759 172420 -80168 -33077 329919 -134212 -205947 -129389 195455 64840
6913 23470 -307462 283004 169853 44826 27077 140123 -167478 51960 -229165 146457
6902 -22806 212085 -11041 35017 48158 -195578 81681 -227775 -30103 -380555 311647 9810
6890 -256372 67434 241581 -204671 72618 -20947 300746 -11179 35245 -205059 -43348 136745
6878 -16600 50921 -70733 -96307 -198950 5687 -88722 -219943 49304 187183 -194783 -21140
6866 -201683 358616 -159836 -181829 21728 61644 69449 90367 -74866 13935 154189 -59162
6854 -49466 -277016 -109156 -108669 22059 3822 28249 -100299 308126 89845 -377208 258318
6842 -5520 156071 89503 310252 134797 36211 -178473 -438239 -198786 35452 61927 113647
6831 113647 -178578 56058 -29318 -198266 -205477 248698 -84229 -198744 -2021 246169 -207097
6819 233419 84957 -114992 -76506 -123454 86378 142563 7642 -101987 -106192 59121 138633 -110875
6806 365374 -175880 -53906 84911 64960 -51291 -160910 165458 -114611 -236216 -65775 -202486
6795 -202486 227428 66007 81680 82756 27057 -197637 -201383 -122610 -13543 263857 -442143
6783 -57575 -151973 122499 -427351 -112670 -3669 157669 65512 39601 -297598 127072 -322838
6771 -21925 -4420 -211228 -340433 -280269 -283362 121746 -133596 84284 93438 -51842 75385 -375853
6758 278574 -110175 112708 -302168 6015 -86963 -357962 293448 213561 -42597 -233300 -190448
6747 -190448 185291 39652 61650 222933 300253 -37621 67500 -21587 -179853 -23006 251059
6735 194963 130341 -49934 180627 294137 -39649 239284 -155657 -70629 -220472 94100 -59647
6723 337783 313071 63818 -51596 -140946 128484 -237911 28950 -207042 -168346 -230332 146685
6711 -85170 74426 -54122 -239230 -31305 231704 69484 22006 -155388 -274837 -321406 83428
6699 -88971 -149296 -264511 -72241 18464 -226408 270924 137399 15160 85250 -148538 112877
6687 -26413 -253860 -126961 58579 -705 -23848 -6638 -38586 33688 118881 -13665 101588 -65630
6674 205050 -73559 119487 62253 -17222 -408594 -48809 360463 -3724 484049 -29845 263160
6662 105182 -48239 43561 89085 5548 139239 -212764 -103134 262169 148717 -82215 332331
6650 21120 -214645 -34720 287375 -3012 -179451 -254295 2518 -241399 -74269 -236441 59132
6638 129799 333694 -250176 -61886 -191027 262518 88306 -427753 280067 -94986 -360745
6628 -360745 117372 2757 -5732 28490 228024 -14919 29330 -186115 -15411 137310 -156509
6616 24414 -401603 340386 -61615 51948 -13650 121697 103990 38146 -216963 90691 -49355
6604 49593 -316778 -4614 343481 286416 -157030 -250336 -43690 -69037 -100649 26701 -61007
6592 155683 -6194 -135504 236362 25563 -234724 -131262 -10091 135919 71570 -93361 -148389
6581 -148389 190110 -43683 161498 155798 366138 187088 -180288 260951 126114 172846
6571 172846 153060 -127164 -27158 -88436 -256604 -373633 -282566 124406 -173054 -259483 38884
6559 76837 -173485 2482 -248357 104292 -149971 163420 -46014 258725 84844 227541 -222660
6547 -15412 -7955 -75070 4485 -378527 112150 -96879 -154961 184420 -172365 283097 -40082
6535 -8137 -181341 117729 -55249 32693 97072 139481 217445 -97205 336697 278952 113283
6523 33228 -171474 -185363 3337 -135087 -167665 23439 -21097 -272071 -39075 -204233 4455
6511 117482 -27418 256467 -136385 87500 226542 -127745 -263973 269108 89979 96829 -3808
6499 -257677 -25475 251392 -631680 -17699 -99863 499220 -210764 152773 -10386 233441
6488 -132817 -43737 -16789 -236104 -358441 -165356 -64321 216925 -183295 6966 -142213 -296916
6477 -296916 218232 -157885 13675 75611 51066 -106903 -43002 -112835 59847 -367301 -24137
6465 -64411 42920 -191520 361694 -48666 233765 -233437 129240 -265459 -44612 -26415 211990
6453 118027 -328689 -145500 156361 3126 -185018 -91210 -254166 195631 2315 -58592 73203
6441 -167633 114387 297438 -320411 -6022 -99942 -72204 -200635 186436 -141875 248042
6430 419351 -74240 -100176 331724 62022 -263314 4780 -196365 -213680 -136283 -56726 -28045
6418 80237 -24385 157620 133891 77258 -80643 -183856 31661 -47540 303582 -161716 186101
6406 -242045 -76052 94768 -16513 -99821 32623 315504 167943 35967 -152022 148521 18439
6394 -238230 -337263 -184712 -124361 -156974 -168661 -308431 287793 236527 -18126 46028 210100
6383 210100 40798 -65957 10643 -257550 177474 131005 -150762 -17464 -190690 36423 66069
6372 66069 2568 -130568 -122816 277690 79369 63552 -161490 181463 -155212 103238 -54238
6360 5148 -152236 -9611 -265092 -183912 -152323 110291 -37583 -240710 184843 124227 3840
6348 248320 52586 -31609 152582 -32414 -182882 -99590 175461 -423151 86389 -301514 -281165
6337 -281165 -240073 37545 -187146 98306 114641 298347 -102132 83462 125954 145632 68418
6325 -238111 -168664 165708 -25901 -47843 225098 -77034 -135824 -62093 -168375 43403 -99518
6313 -346319 -17133 -54536 439668 4016 68880 -800 323157 -89233 -111460 35060 -104496 290221
6300 169785 169443 86545 240579 -99677 -89644 -221327 -231759 -125036 349815 107533 3451
6288 252412 -223078 101634 -65075 -36675 -152276 -27963 113435 -71075 -53296 -91164 51391
6276 -66439 -223409 140610 -78733 62816 -21793 70430 49050 316923 -221261 -366929 -45582
6264 203726 -11578 81653 -19002 -40712 104868 -292023 71325 -145582 155548 -200018 54906
6252 -172911 -182724 -39623 -7586 -312376 -315389 -72893 274195 -31055 -5881 -241175 -385903 -112145
6239 64758 -158836 143504 -170649 229706 -26308 -372515 398387 -116524 115340 232372
6229 232372 -110561 116023 -24647 148658 -137309 -248245 73097 220602 55014 134752
6219 134752 -61343 -200850 -304935 -23235 148299 259595 -112628 49619 211696 -237653
6208 -152365 -277019 71943 -47623 -201555 -228040 -141845 -194146 -113188 58477 -73797 145288
6196 229193 -133394 -84283 301070 -338213 -29560 178037 35629 26913 -14917 -13687 -281115
6185 -281115 262738 14744 -43803 252762 174458 65302 -94931 52691 -198010 80956 236718
6174 236718 199050 22553 73442 -75494 -88003 -166054 86128 76889 -146662 171013 -73300
6162 -99482 -204806 154791 50834 -266775 324297 -380649 -21944 -410617 132513 206142
6152 206142 -175671 297159 85722 -196086 19738 -112775 2092 -42303 127221 -180914 156150
6140 -286346 -270155 -227560 -31643 -31369 176200 127940 28146 -196392 168087 116947 -276710
6128 -205189 109722 -443904 -39283 -109844 -253962 139808 -151891 -160667 -231637 147297 600983
6117 600983 38342 228049 181019 -265518 -100530 -68379 -63964 -161032 -222128 301543 218525
6106 218525 129918 -192236 -35723 138144 -94076 62374 -33391 103317 -85979 -331108 150557
6094 128956 -50898 43843 112597 -78225 164508 52713 338492 -74916 -29850 236451 102400
6082 -221910 73958 317665 34867 -192479 -289250 19883 -182630 -498903 -25445 158790 15290
6070 -153101 -121397 -425681 57165 150267 168403 60890 -237739 153594 -341885 -43585 -185369
6059 -185369 82449 -215129 317167 -31747 -87231 -36405 195345 -61407 20264 -119429 -73495
6048 -73495 -4093 -7920 326210 -95824 -81095 -24550 273635 -21800 -164938 40237 -66525 21750
6035 32982 -386149 -25775 78775 -18401 -47462 6290 107551 89522 -99770 -208852 -58857
6023 -13320 235756 54275 -9535 -42847 32642 262823 -17142 -97629 -237200 346457 -40988
6011 247866 371007 368320 -481307 -89756 41035 -7545 503861 -62229 -438272 17298 177041
6000 177041 108054 -70949 88426 -386446 -103157 -64864 -58329 22775 -88616 152821 122615
5989 122615 -304358 -60270 -294568 -55067 294037 73716 384967 -195381 1945 176238 177405
5978 177405 353362 -207573 250001 -122361 -132714 148586 205283 117787 100908 49848 -51227
5966 31757 -135378 83968 -229867 -170083 -94303 2950 19579 -91366 -169699 185913 -114029
5954 -27134 -179326 137095 -46241 158904 354996 -250969 159263 -186101 -35524 -208961
5944 -208961 -47672 89607 -309134 -383587 129371 -75503 -102009 31575 -104285 198947 -251202
5932 -110144 89644 -313291 -116442 -33968 -51101 -52214 -107556 -233916 146807 -19274 -17013
5921 -17013 7809 -198018 -208465 -251506 -192612 -87392 71968 146711 4613 -256803 132865 -80668
5908 65703 3036 -81223 134358 -71240 -66862 183509 -2421 105534 -79605 -121038 206099 179920
5896 179920 238333 112847 72018 -81311 -188413 94210 -54296 872 142303 -128235 -149031
5885 -149031 239070 -25591 -27947 116775 -172415 186067 46077 -177950 193628 -59399 -64821
5874 -64821 296433 148809 -45728 272264 -19101 230705 -32098 10604 85644 407719 45530
5862 -27020 9505 -35155 30583 5813 49548 306536 19072 -67492 10477 -171520 152219 -162481
5849 -83657 -94806 91839 -82035 23755 235738 -64390 -183762 -157477 204003 184871 -36599
5837 15649 294697 145133 -149781 161206 119215 -29525 109565 -309238 -226954 22228 -42970
5825 -312572 -241592 16691 50236 70067 -50830 -83491 -110623 -155103 170728 -224205 92541
5813 -86778 -671 -125523 199621 -171803 -96088 271006 253376 206587 -94584 -148912 141507
5801 -65276 -290071 272214 -314190 50455 -119503 -197863 -226556 -131869 -212631 48899 -184929
5789 -19790 -56581 23098 -98333 -182140 111813 -434085 -135270 227900 -16570 211717 116918
5778 116918 275531 266675 169418 -128668 -205905 181144 57868 -105135 -167190 76629 20671
5766 45096 13423 65881 162366 660490 4396 -140422 119200 -206196 222428 101514 150585
5755 150585 -15962 -69373 225241 86449 -121799 -120874 30407 86346 40531 -133 -90812 -181637
5743 -181637 -193601 -422711 -106506 4073 -40538 11384 113380 -102109 -260233 162570 -537419
5731 139663 -92631 272989 -327100 1158 106633 -84484 -385194 -48411 174889 90611 30016
5719 106322 -57409 220950 77258 104930 -150444 -177444 -398762 -111368 -264191 -242232 89793
5707 242110 164212 -256321 92625 -1615 83362 -201129 -318473 192379 212377 -15594 119376
5695 80507 137942 -126934 -376116 48180 16832 -79241 -154832 9310 176887 284119 -90457
5683 -72954 155467 -369758 24857 163103 -198920 141723 35455 -309213 -12146 -388990
5673 -388990 -80633 83908 -1861 206942 -80630 -42642 121720 -361680 137508 115256 -30497
5661 131724 -11871 -7931 28071 320780 -28172 -43405 -264492 139032 135364 -163827 149140
5649 -21477 153658 91827 -438977 -49631 33748 24114 -52687 32416 -228707 318831 400304
5638 400304 -14634 83815 15914 -148824 64837 -95892 26773 -23391 -445650 90029 -233456
5626 35330 126141 23281 -105820 227799 255717 264628 -277044 148717 -6899 -16 186346 -231260
5613 23398 18831 277509 256466 296299 75639 -128706 -108931 -114587 14922 32017 -191225 -61811
5600 167328 73275 197612 100083 6617 133296 40929 -217123 117868 -127147 92721 -377543
5588 47100 -77496 -230589 70483 -145363 -32138 270113 259592 31403 1495 -27235 211171
5576 25180 -407152 -313148 245207 -32708 100813 -148975 -340944 -68163 -10021 -298081 -91323
5564 -79564 -248075 -114674 -351818 -9884 -308483 -167580 202627 -235046 -222203 -61938 216142
5552 -355674 -179523 21255 -14324 -149719 183249 -126035 -260195 154289 25312 259650
5542 259650 -129873 -11148 146374 -36163 157323 -12887 -124687 204608 -25764 258913
5531 -131349 1943 -29745 6723 43629 -90548 -329111 -300331 24593 -15784 -220467 13287 184993
5519 184993 -176383 -135705 38403 122829 171061 -216806 135576 96392 -225826 -9338 -228798
5508 -228798 26106 -100533 442272 109482 34286 152716 29884 429255 -319914 -24231
5497 158567 -253952 -90993 -133985 48689 -124267 95440 -111452 -207633 103610 -80014 -19233
5485 161342 -241571 61083 23816 119153 174667 256570 160164 6209 -154553 -29347 181285
5473 211989 62985 -90263 -152211 -39788 60886 170394 -133889 101794 8888 -153873 -324445
5462 -324445 -227798 196824 -319023 14436 -144553 70003 60131 -76267 -260438 99763 91206
5451 91206 235198 -99936 229054 169285 -430359 54189 19091 -15857 4416 -34208 -41071 -89163
5439 -89163 186857 137086 52046 -60402 -18670 -217126 -195306 -320305 19844 100588 379093
5428 379093 -6262 -24049 349917 -18263 140772 -269226 30879 49154 -75359 -211515 102352
5416 -91900 -32724 26531 -22872 -461255 -2926 33116 15634 133610 178627 -275383 -11446
5404 -84271 -42587 -494052 120079 -92261 262384 -28985 -53431 5901 233014 -271323 -213463
5393 -213463 -179799 101351 2931 -134480 277184 -31103 542462 181031 100607 173738 -64123
5381 -219468 -526844 181001 -281854 91005 124814 -45045 174186 -25233 240410 -83848 -184218
5370 -184218 14687 116240 5202 -61730 117538 29668 -2073 209347 46503 339150 283428
5359 283428 153110 250666 40604 -57137 -182684 62598 32251 137852 124330 139564 60930
5347 461654 -116115 27346 -110342 -155893 -181739 -114088 28238 66128 83061 -231387 85527
5335 -143293 -116898 -151307 256024 -28525 310666 -32460 120534 10607 -171083 -34757 -92011
5324 -92011 -166801 -119839 18874 -90142 -220050 -344151 576 70873 -116730 137853 346839
5313 346839 156447 71146 52288 211164 -46819 -8665 437255 -52743 -138382 196208 -107853
5301 92847 -127218 -143782 229377 -146477 83317 -38527 107262 -128173 -71261 151011 10889
5289 -188587 159441 -61593 47650 132161 57192 40920 -47373 -312449 -53077 -79348 122631
5277 -351090 322046 -278128 22610 303928 270413 -60389 173568 990 28696 46698 -146594
5265 119656 -124006 -215461 113216 -97655 126175 20337 88934 -334821 -140743 53732 -8876
5253 340177 -106442 -8177 -247877 155052 -15276 177573 70832 -38722 -85567 -31999 185463
5241 64297 400183 -226819 -18269 -202046 -46230 154100 -176641 -303689 -57493 10091 -45351
5229 47019 -123444 -260645 232702 261984 248152 72580 -81423 88917 185266 -259927 -172666
5218 -172666 -65191 -58809 -306406 -251231 -3579 -287374 16399 60020 -88217 -272703 -283856
5207 -283856 64455 -225137 -98466 87471 -160649 -77575 237061 -36309 85754 -91190 -9127
5195 -74805 -181288 42434 -115972 -38914 68579 -10445 140101 -37768 -29850 159624 -128352
5183 87662 191931 4490 -107789 -137991 78630 439864 279989 -137943 188067 81553 -166106
5171 -148175 -15870 -368304 -256305 -116886 -83675 6624 145510 -129116 358122 -55345 -277527
5160 -277527 107351 81032 -26268 -131022 241857 103079 -61543 137935 -13520 120423
5149 99188 17296 -29036 26226 78368 35407 115908 185265 193845 -19259 271812 -166574 -228503
5137 -228503 -290071 -55362 296151 -148611 -67778 -260720 -149099 -25314 200655 -23703 48399
5125 -23242 85569 -128814 240293 -102782 -142993 23993 81673 8889 24939 99886 82088
5114 82088 -14307 -92606 -10949 -74461 90094 83934 -48445 57544 257563 -197068 -110815 154874
5101 -59754 -384061 206509 121815 -65772 198362 -27797 113386 220263 -165749 110360
5090 -37154 -7764 293958 -94349 140318 -16963 196177 40900 280591 49861 -112007 -157821
5079 -157821 119824 -120980 151364 46194 -246506 -82188 -26005 251164 -201879 126515
5068 40350 -422552 -153503 -19947 -79927 252909 -199604 -53216 272700 -244952 -213480 -180494
5057 -180494 113304 53131 18137 -111664 -130166 -43872 43269 344849 -108812 47124 246289
5046 246289 -248603 -339774 -170941 -23659 -166335 19032 284190 318081 78881 -165237 -203143
5035 -203143 -54771 150928 -378725 173697 -41910 -201638 253932 -125442 -93038 -215088
5025 -215088 -88995 -78149 -98564 295993 1375 -11244 262994 128638 -99105 20687 271903
5014 271903 -46822 -698 -152895 66826 -194666 25467 -200200 -220887 -23439 67890 198054
5003 198054 -247888 27965 118844 250441 -25549 365011 -114526 -95268 -105749 170852 260480
4992 260480 6055 -37775 12622 -156883 -123062 168312 298469 -225051 -182349 -145720 114630
4980 -406444 123109 286865 -161420 -234320 25866 188220 394177 -183050 -129806 -204440
4970 -204440 88656 -115928 283013 -155743 61855 -116075 -120190 -279857 -66807 139130 198782
4959 198782 -66178 -233505 288744 239498 -108607 22573 80551 -5697 -210052 -36024 165863
4947 237943 -161094 -152839 -68542 -42362 61593 -26290 218667 105963 -161240 -32778 -32064
4936 -32064 -16230 -113502 8710 113369 45577 -136205 78717 236855 -43489 -91792 -118579
4925 -118579 122734 12229 195115 -33738 -206269 -119974 41911 104988 -121893 13239 -242429
4913 176887 124766 -113257 210627 -177111 -240992 -169627 -210387 -184044 -213928 36806 142804
4902 142804 20503 302161 33906 86083 34650 -43248 162955 27756 348000 275036 -75687
4890 26382 -241397 -22313 142466 65070 44955 179770 182438 -193823 -125888 73041 -66946
4878 -102996 27773 92298 -79806 -167002 -146777 -138224 -321374 84717 -832 -201771 -168289 15674
4865 48724 -47108 430486 -137130 229607 -173850 123071 -164122 -50524 37294 -100775
4854 16392 170328 171442 40814 -175678 -373395 248305 -345501 198323 127844 3751 -211963
4842 -76594 -228574 40972 4211 -105299 -396063 123390 -85403 106013 164710 -291460 124719
4830 8732 90242 178221 -42463 -99339 72197 -377144 -335998 -107344 47906 138261 -148063
4818 54027 -126230 -250612 -127162 90826 103278 218902 182897 229101 141305 -286242 -18731
4806 199947 42754 -293665 26624 -122545 -6272 55395 -169179 8699 273519 33284 60014
4795 60014 118444 -218235 -153681 -42037 -138969 182779 84353 130830 -217761 -110334 165533
4783 -250422 -95454 247487 232193 -42953 275790 -60967 98335 177460 -45795 24765 25611 95688
4771 95688 -236969 197344 -53276 163126 -85320 -40770 -65778 -147304 -258916 29360 243244
4760 243244 -199022 -103195 55199 -162757 12795 153048 -29320 -49752 -347499 110048 -55453
4748 -134735 305249 286192 122564 -390283 -321524 51104 299759 218193 -195810 -134543 -99245
4737 -99245 121684 35699 -54879 -43577 32728 -114525 -6694 32827 -49828 -38435 172334
4725 -214717 -130513 -69459 280483 187820 -70389 -61713 -411217 -28888 -31217 163516 -245545
4713 108236 155913 109509 362624 -5949 217744 -24929 -224510 8466 -403443 245501 -86612
4701 -475 -270472 -100769 237534 22952 240130 -70535 237637 -27274 102709 -27646 -33229
4690 -33229 62273 -398444 -4096 254622 -132915 121856 329077 -91431 31857 -15928 126487
4678 -178016 120872 403046 -112108 182096 -71873 -115391 278712 348 -153157 -33850 250767
4666 316425 213474 47875 41579 121871 8589 185062 -166007 114605 -31402 74011 111946
4655 111946 -175074 316050 170019 159348 -42921 253883 -210176 -144515 -288565 350101
4644 217752 -286063 -13508 -65211 88733 78354 -117332 182738 -40620 -281074 -65231 -69331
4633 -69331 -369787 286690 63610 311216 -23052 -242686 234161 224911 -83178 -134474 332055
4621 -85244 160176 -103608 170786 126688 290335 -144398 -86714 -80637 67544 90541 -125956
4609 149990 -429536 -115595 -205889 -38872 75035 10919 -89956 -398539 190458 -41183 237517
4597 182643 101485 -119151 -97942 227593 -136926 -19238 184218 -304332 20708 -272826
4586 -177546 -1055 18262 106875 -30068 109922 37802 -127063 -349452 -176645 -108375 -152501
4575 -152501 182583 -215292 175163 -177203 -335150 -4450 43237 -148548 -263375 28298
4564 110008 -22089 151939 -172682 69853 -71686 -85471 268906 145434 69906 19222 -302017
4552 -59644 -80726 -25014 336223 215488 -48674 64851 -270037 46719 -46433 196233 150656
4541 150656 133917 -29107 60141 -295235 -13860 -243117 93042 -133153 -121900 26498 -112627
4529 -157769 49281 1069 -540154 134542 8400 173403 -16621 268809 78001 -115602 122151
4517 42184 297178 135785 -296001 45461 -28032 307344 163682 110707 28897 -20066 209385
4505 -166867 -4584 -18385 -1500 -305243 414769 -99246 -54282 -73074 158052 75993 210654
4494 210654 -118439 105092 86514 122928 -27418 -179754 285461 408370 56245 142720 -47401
4482 119708 -538150 31521 71632 118082 213571 174587 46766 208563 -55530 -159600 -326380
4471 -326380 -5660 -60631 123417 187986 70668 -35363 -352721 -197089 -164401 -58061 247773
4459 -189670 54536 -30920 17739 23950 56573 -93307 12941 -249901 137073 287324 253574
$$ [...]
##END NTUPLES=NMR SPECTRUM
##END=
