##TITLE=AC1544_ROEFFECT0012_8215172_bp29KGnp56
##JCAMPDX= 6.0         $$ Bruker NMR JCAMP-DX V2.0
##DATA TYPE= NMR SPECTRUM
##DATA CLASS= NTUPLES
##ORIGIN= BRUKER
##OWNER= Administrator
$$ 1.72 TOPSPIN		Version 2.1
$$ 2014-08-04 18:55:10.678 -0700  Administrator@X
$$ Compression mode = diff/dup
##.OBSERVE FREQUENCY= 400.02188249412
##.OBSERVE NUCLEUS= ^1H
##.ACQUISITION MODE= SIMULTANEOUS (DQD)
##.ACQUISITION SCHEME= undefined
##.AVERAGES= 64
##.DIGITISER RES= 22
##SPECTROMETER/DATA SYSTEM= spect
##.PULSE SEQUENCE= noesygpps1d.comp
##.SOLVENT NAME= COFFEE_meoh
##.SHIFT REFERENCE= INTERNAL, COFFEE_meoh, 1, 14.97763
##AUDIT TRAIL= $$ (NUMBER, WHEN, WHO, WHERE, PROCESS, VERSION, WHAT)
$$ ##TITLE= Audit trail, TOPSPIN		Version 2.1
$$ ##JCAMPDX= 5.01
$$ ##ORIGIN= Bruker BioSpin GmbH
$$ ##OWNER= Administrator
$$ $$ E:\/data/COFFEE/nmr/AC1544_ROEFFECT0012_8215172_bp29KGnp56/22/pdata/1/auditp.txt
$$ ##AUDIT TRAIL=  $$ (NUMBER, WHEN, WHO, WHERE, PROCESS, VERSION, WHAT)
(   1,<2014-08-04 18:55:05.069 -0700>,<Administrator>,<X>,<go>,<TOPSPIN 2.1>,
      <created by zg
	started at 2014-08-04 18:43:34.067 -0700,
	POWCHK enabled, PULCHK disabled,
       configuration hash MD5:
       16 EA D6 F4 BB 67 03 14 9B FF E7 A0 43 5B 48 2E
       data hash MD5: 64K
       4C 68 F5 42 34 F8 D6 0A 33 A3 F6 4A 0F 42 BF 5C>)
(   2,<2014-08-04 18:55:08.319 -0700>,<Administrator>,<X>,<proc1d>,<TOPSPIN 2.1>,
      <Start of raw data processing
       efp LB = 0.3 FT_mod = 6 PKNL = 1 PHC0 = 0 PHC1 = 0 SI = 128K 
       data hash MD5: 128K
       57 3C BB 60 0C 1C 60 71 D8 A3 06 C0 5E EE 61 6E>)
(   3,<2014-08-04 18:55:09.397 -0700>,<Administrator>,<X>,<proc1d>,<TOPSPIN 2.1>,
      <pk PHC0 = -85.41321 PHC1 = 0 
       data hash MD5: 128K
       97 03 76 18 F2 E4 2E 46 A0 A1 F7 7F 2B 49 DA 15>)
(   4,<2014-08-04 18:55:09.975 -0700>,<Administrator>,<X>,<proc1d>,<TOPSPIN 2.1>,
      <abs ABSG = 1 
       data hash MD5: 128K
       2A F1 52 84 05 F8 4C E3 EC 1C 6A 00 9C 6C 08 03>)
(   5,<2014-08-04 18:55:10.132 -0700>,<Administrator>,<X>,<proc1d>,<TOPSPIN 2.1>,
      <abs ABSG = 2 
       data hash MD5: 128K
       6B 8D FF 10 11 B0 31 AC E9 A8 BF BF 94 91 64 D7>)
(   6,<2014-08-04 18:55:10.225 -0700>,<Administrator>,<X>,<proc1d>,<TOPSPIN 2.1>,
      <abs ABSG = 3 
       data hash MD5: 128K
       F2 42 0E F3 3C A8 A7 04 74 48 A6 42 B7 89 87 1D>)
(   7,<2014-08-04 18:55:10.350 -0700>,<Administrator>,<X>,<proc1d>,<TOPSPIN 2.1>,
      <abs ABSG = 4 
       data hash MD5: 128K
       60 A7 FD 2B EC 8F AF C4 83 ED 40 72 C4 D6 F7 5B>)
(   8,<2014-08-04 18:55:10.444 -0700>,<Administrator>,<X>,<proc1d>,<TOPSPIN 2.1>,
      <abs ABSG = 5 
       data hash MD5: 128K
       98 10 DC 73 24 AE 1E 6F 51 C6 50 3A 02 A2 49 FC>)
$$ ##END=
$$ 
$$ $$ hash MD5
$$ $$ F8 43 69 F6 9E CD 82 59 4A 09 0A 31 F7 D0 D4 57
##$RELAX= 
##$RELAX= 
##$RELAX= 
##$RELAX= 
##$RELAX= 
##$RELAX= 
##$RELAX= 
##$RELAX= 
$$ Bruker specific parameters
$$ --------------------------
##$DU= <E:\>
##$EXPNO= 22
$$ [...]
##$TP07= 0
##$TPNAME0= <>
##$TPNAME1= <>
##$TPNAME2= <>
##$TPNAME3= <>
##$TPNAME4= <>
##$TPNAME5= <>
##$TPNAME6= <>
##$TPNAME7= <>
##$TPOAL= (0..7)
0.5 0.5 0.5 0.5 0.5 0.5 0.5 0.5
##$TPOFFS= (0..7)
0 0 0 0 0 0 0 0
##$TUNHIN= 0
##$TUNHOUT= 0
##$TUNXOUT= 0
##$USERA1= <user>
##$USERA2= <user>
##$USERA3= <user>
##$USERA4= <user>
##$USERA5= <user>
##$V9= 5
##$VALIST= <valist>
##$VCLIST= <CCCCCCCCCCCCCCC>
##$VD= 0
##$VDLIST= <DDDDDDDDDDDDDDD>
##$VPLIST= <PPPPPPPPPPPPPPP>
##$VTLIST= <TTTTTTTTTTTTTTT>
##$WBST= 1024
##$WBSW= 4
##$XGAIN= (0..3)
0 0 0 0
##$XL= 0
##$YL= 0
##$YMAX_a= 11337805
##$YMIN_a= -12508512
##$ZGOPTNS= <>
##$ZL1= 120
##$ZL2= 120
##$ZL3= 120
##$ZL4= 120
##$ABSF1= 14.97763
##$ABSF2= -5.580552
##$ABSG= 5
##$ABSL= 3
##$ALPHA= 0
##$AQORDER= 0
##$ASSFAC= 0
##$ASSFACI= 0
##$ASSFACX= 0
##$ASSWID= 0
##$AUNMP= <proc_prof1d_extract.lims>
##$AXLEFT= 0
##$AXNAME= <>
##$AXNUC= <1H>
##$AXRIGHT= 0
##$AXTYPE= 0
##$AXUNIT= <>
##$AZFE= 0.1
##$AZFW= 0.1
##$BCFW= 0
##$BC_mod= 0
##$BYTORDP= 0
##$COROFFS= 0
##$CY= 15
##$DATMOD= 1
##$DC= 0
##$DFILT= <>
##$DTYPP= 0
##$F1P= 0
##$F2P= 0
##$FCOR= 0.5
##$FTSIZE= 131072
##$FT_mod= 6
##$GAMMA= 0
##$GB= 0
##$INTBC= 1
##$INTSCL= 1
##$ISEN= 128
##$LB= 0.3
##$LEV0= 0
##$LPBIN= 0
##$MAXI= 10000
##$MC2= 0
##$MEAN= 0
##$ME_mod= 0
##$MI= 0
##$NCOEF= 0
##$NC_proc= -1
##$NLEV= 6
##$NOISF1= 0
##$NOISF2= 0
##$NSP= 0
##$NTH_PI= 0
##$NZP= 0
##$OFFSET= 14.97763
##$PC= 1
##$PHC0= -85.41321
##$PHC1= 0
##$PH_mod= 1
##$PKNL= yes
##$PPARMOD= 0
##$PPDIAG= 0
##$PPIPTYP= 0
##$PPMPNUM= 2147483647
##$PPRESOL= 1
##$PSCAL= 4
##$PSIGN= 0
##$PYNMP= <proc.py>
##$REVERSE= no
##$SF= 400.02000298415
##$SI= 131072
##$SIGF1= 0
##$SIGF2= 0
##$SINO= 400
##$SIOLD= 131072
##$SPECTYP= <>
##$SREGLST= <1H.CDCl3>
##$SSB= 0
##$STSI= 131072
##$STSR= 0
##$SW_p= 8223.68421052631
##$SYMM= 0
##$S_DEV= 0
##$TDeff= 65536
##$TDoff= 0
##$TI= <>
##$TILT= no
##$TM1= 0
##$TM2= 0
##$TOPLEV= 0
##$USERP1= <user>
##$USERP2= <user>
##$USERP3= <user>
##$USERP4= <user>
##$USERP5= <user>
##$WDW= 1
##$XDIM= 131072
##$YMAX_p= 167680789
##$YMIN_p= -502637013
##$CURPLOT= <Network HP LaserJet P1505>
##$CURPRIN= <$Network HP LaserJet P1505>
##$DFORMAT= <normdp>
##$LAYOUT= <+/1D_H.xwp>
##$LFORMAT= <normlp>
##$PFORMAT= <normpl>
##$SURQMSG= 1
$$ End of Bruker specific parameters
$$ ---------------------------------
##NTUPLES= NMR SPECTRUM
##VAR_NAME=  FREQUENCY,     SPECTRUM/REAL,   SPECTRUM/IMAG
##SYMBOL=    X,             R,               I
##VAR_TYPE=  INDEPENDENT,   DEPENDENT,       DEPENDENT
##VAR_FORM=  AFFN,          ASDF,            ASDF
##VAR_DIM=   131072,        131072,          131072
##UNITS=     HZ,            ARBITRARY UNITS, ARBITRARY UNITS
##FACTOR=    0.0627417313425164, 1,          1
##FIRST=     8223.62146879497, -1112,        -16046
##LAST=      0,             -213,            -16283
##MIN=       0,             -502637013,      0
##MAX=       8223.62146879497, 167680789,    0
$$ Real data points
##PAGE= N=1
##DATA TABLE= (X++(R..R)), XYDATA
$$ [...]
66863 268364 271961 275696 279665 283909 288280 292417 296068 299408 302925 306993 311613 316502 321334 325938
66849 325938 330436 335191 340504 346329 352350 358279 364032 369705 375506 381631 388028 394360 400402 406428
66835 406428 412994 420270 427755 434741 440973 446879 453230 460573 468865 477610 486361 495010 503545 511831
66821 511831 519883 528179 537273 547113 557087 566797 576437 586352 596571 606938 617396 627945 638586
66808 638586 649431 660628 672025 683233 694226 705512 717431 729571 741279 752531 763882
66797 763882 775721 788034 800806 814131 827855 841509 854753 867614 880186 892442 904514
66786 904514 916856 929825 943177 956192 968292 979464 990173 1000917 1011818 1022567 1032814
66775 1032814 1042591 1052215 1061772 1070876 1079071 1086310 1092903 1099090 1104847 1110035 1114521 1118136 1120695 1122248
66761 1122248 1123182 1123903 1124398 1124264 1123216 1121389 1119043 1116142 1112454 1107944 1102755 1096835 1089886 1081843 1073109
66746 1073109 1064180 1055227 1046173 1036914 1027262 1016935 1005898 994567 983369 972210 960660 948531
66734 948531 935957 923036 909835 896683 884017 871785 859374 846329 832851 819425 806189
66723 806189 792907 779374 765633 751895 738406 725367 712838 700714 688857 677175 665570
66712 665570 653948 642300 630703 619211 607919 597067 586873 577191 567511 557441 547026 536532
66700 536532 526114 515844 505881 496392 487368 478637 470051 461546 453123 444839 436787 429045 421682 414809
66686 414809 408460 402404 396200 389542 382475 375259 368187 361493 355240 349178 342924 336411 329999 324039
66672 324039 318529 313267 308162 303222 298442 293897 289752 285984 282246 278220 273972 269759 265673 261690
66658 261690 257912 254418 250964 247199 243172 239287 235748 232366 229006 225905 223336 221162 218944 216390
66644 216390 213544 210628 207836 205255 202825 200358 197647 194621 191452 188529 186246 184676 183427 181929
66630 181929 179930 177634 175345 173133 170916 168739 166769 165043 163357 161504 159516 157576 155710 153743
66616 153743 151599 149514 147793 146420 145067 143495 141772 140053 138335 136541 134726 133043 131596 130409
66602 130409 129435 128479 127194 125381 123250 121263 119715 118574 117668 116899 116231 115581 114791 113725 112408 111098
66586 111098 110090 109366 108549 107331 105897 104754 104188 104021 103864 103430 102612 101431 100021 98566 97244 96217
66570 96217 95590 95244 94804 93990 92954 92087 91512 91027 90519 90127 89879 89468 88651 87635 86795 86163 85471 84620
66552 84620 83781 83018 82137 81057 80088 79604 79533 79400 78862 78065 77381 76972 76687 76347 75966 75681 75545 75452 75219
66533 75219 74669 73690 72341 70933 69888 69371 69147 68875 68499 68198 67986 67579 66763 65714 64743 63888 62992 62142
66515 62142 61720 61908 62433 62911 63220 63345 63111 62410 61557 61080 61152 61498 61821 62015 61965 61525 60808 60173 59770 59348
66495 59348 58702 58030 57607 57357 57031 56612 56256 55968 55628 55258 54947 54584 53968 53148 52398 51815 51221 50506 49800
66476 49800 49258 48904 48783 49024 49623 50317 50827 51119 51311 51432 51425 51271 50994 50557 49898 49104 48481 48314 48500 48499
66456 48499 47809 46537 45336 44700 44476 44234 43873 43610 43502 43362 43154 43102 43283 43445 43395 43318 43506 43929 44289
66437 44289 44412 44373 44333 44418 44713 45174 45534 45449 44786 43725 42600 41713 41270 41340 41784 42237 42308 41947 41602 41867
66417 41867 42797 43703 43786 42969 41891 41114 40618 40130 39609 39166 38684 37878 36727 35612 34912 34623 34475 34353
66399 34353 34459 34978 35678 35982 35549 34681 34002 33787 33800 33731 33559 33403 33286 33226 33339 33684 34118 34478 34773 35069
66379 35069 35337 35591 35984 36500 36741 36396 35832 35812 36550 37410 37686 37320 36696 36090 35598 35351 35402 35485 35272 34849
66359 34849 34632 34784 34997 34921 34539 34012 33389 32708 32162 31989 32215 32667 33181 33676 34091 34395 34622 34776 34775 34578
66339 34578 34296 34024 33648 33008 32192 31475 31019 30850 31091 31880 33012 33969 34440 34577 34596 34443 34029 33549 33258
66320 33258 33124 32989 32925 33076 33302 33340 33262 33354 33547 33396 32764 32152 32098 32537 32980 33129 33020 32733 32289 31814 31533
66299 31533 31520 31615 31650 31639 31677 31742 31682 31384 30895 30361 29916 29679 29766 30189 30721 31028 31036 31059 31428 32063 32573 32729 32657
66276 32657 32609 32704 32938 33249 33505 33544 33341 33074 32993 33255 33837 34511 34932 34873 34427 33911 33641 33803 34432 35244 35638
66255 35638 35175 34113 33214 32956 33130 33233 32992 32418 31683 31104 30979 31231 31417 31298 31144 31259 31447 31337 31056
66236 31056 31143 31785 32524 32862 32846 32890 33211 33632 33883 33884 33763 33695 33762 33877 33852 33582 33203 33000 33068 33110 32719 31906
66214 31906 31201 31070 31369 31531 31269 30857 30745 31101 31775 32478 32923 32991 32870 32873 33077 33290 33433 33666 34024 34249
66194 34249 34163 33991 34004 34073 33881 33450 33154 33200 33418 33544 33476 33202 32719 32114 31598 31365 31494 31923 32454 32838 32965
66173 32965 32919 32780 32513 32194 32140 32562 33180 33496 33381 33112 32835 32339 31484 30559 30026 30055 30427 30764 30781 30418
66153 30418 29862 29371 29071 28960 29044 29296 29527 29536 29421 29511 29926 30456 30975 31686 32752 33894 34629 34782 34522 33966
66133 33966 33089 32035 31240 31065 31424 31892 32118 32069 31952 31985 32233 32583 32881 33067 33189 33278 33274 33091 32726 32268
66113 32268 31842 31575 31566 31793 32045 32044 31694 31154 30654 30294 30099 30165 30594 31308 32065 32718 33320 33939 34440 34570 34205
66092 34205 33509 32885 32767 33312 34209 34921 35168 35133 35127 35201 35168 34924 34562 34245 34105 34227 34581 34965 35113 34927 34547
66071 34547 34181 33895 33575 33080 32457 31985 31956 32393 33086 33845 34581 35138 35290 35027 34640 34372 34124 33674 33021
66052 33021 32311 31584 30831 30211 29937 30006 30271 30714 31418 32310 33175 33904 34471 34706 34450 33975 33884 34386 34976 35037
66032 35037 34576 34128 34061 34277 34534 34780 35109 35527 35931 36268 36623 37103 37707 38325 38851 39159 39038 38346 37354
66013 37354 36678 36670 36984 37012 36678 36533 37036 38005 38862 39215 39141 39037 39288 39929 40614 41030 41292 41763 42485 43100
65993 43100 43347 43371 43394 43417 43392 43454 43700 43917 43804 43394 42968 42639 42237 41651 41031 40603 40418 40383 40419 40515 40682 40913
65971 40913 41200 41576 42123 42881 43721 44389 44713 44757 44708 44656 44534 44244 43830 43514 43546 43947 44427 44595 44316 43797
65951 43797 43348 43110 43046 43089 43231 43449 43609 43493 43008 42378 41998 42029 42257 42438 42644 43052 43554 43897 44142 44659
65931 44659 45610 46722 47719 48671 49758 50896 51767 52090 51744 50839 49833 49324 49500 49920 50090 50087 50344 50993
65913 50993 51730 52302 52783 53334 53975 54730 55762 57229 59118 61342 63876 66633 69285 71386 72724 73534
65897 73534 74303 75376 76705 77952 78786 79074 78828 78115 77079 75951 74931 74039 73182 72353 71652 71091 70439
65880 70439 69369 67758 65819 63889 62139 60515 58950 57540 56497 55987 56043 56525 57082 57275 56876 56024
65864 56024 55019 54051 53281 52984 53320 53971 54339 54201 53925 53966 54388 55027 55870 57001 58321 59589 60676 61586
65846 61586 62262 62605 62740 63105 64140 65899 67978 69832 71179 72116 72846 73390 73640 73679 73823 74324 75152 76154
65828 76154 77301 78690 80361 82209 84045 85747 87363 89029 90690 92053 93004 93958 95443 97327 98828
65813 98828 99425 99440 99515 99869 100316 100707 100987 101021 100756 100470 100494 100692 100518 99618 98143 96476 94907 93540 92309
65794 92309 90966 89271 87249 85175 83305 81705 80257 78699 76731 74300 71782 69718 68344 67518 67022
65779 67022 66718 66443 65980 65236 64314 63372 62541 61979 61834 62067 62456 62809 63126 63475 63782 63803 63325 62435 61565
65760 61565 61143 61170 61280 61262 61311 61621 61963 61952 61585 61211 61040 60975 60915 60949 61192 61642 62229 62840 63309 63531 63603 63689
65738 63689 63794 63841 63935 64321 65123 66330 67955 69968 72121 74148 76134 78365 80836 83239 85439 87567
65722 87567 89578 91107 91949 92296 92281 91663 90250 88392 86696 85403 84300 83098 81661 79966 78152 76527
65706 76527 75296 74321 73286 72039 70633 69156 67793 66931 66935 67712 68678 69215 69157 68847 68811 69309 70128 70877
65688 70877 71526 72510 74233 76601 79203 81784 84328 86803 89149 91493 94083 96942 99747 102121 103848
65673 103848 104771 104682 103509 101505 99071 96410 93455 90166 86802 83787 81362 79477 78074 77358 77634
65658 77634 78929 80944 83401 86251 89494 92987 96630 100575 105044 109975 114981 119658 123776 127225
65644 127225 129923 131801 132788 132810 131884 130194 127950 125161 121650 117290 112190 106640 100995 95565 90510
65629 90510 85807 81375 77238 73519 70322 67706 65710 64260 63063 61762 60311 59061 58349 58082 57822
65614 57822 57254 56467 55805 55524 55653 56055 56507 56722 56489 55885 55309 55118 55258 55372 55258 55038 54845 54557 54073
65595 54073 53697 53963 55025 56432 57565 58192 58525 58903 59579 60698 62280 64172 66144 68144 70416 73279
65579 73279 76734 80428 84032 87648 91751 96732 102598 109071 115814 122495 128780 134449 139485 143940
65565 143940 147760 150864 153377 155575 157562 159140 160047 160241 159869 159095 158119 157296 157029 157473 158397 159376 160096
65548 160096 160441 160358 159741 158477 156546 153965 150641 146403 141222 135373 129235 122999 116638 110167 103796
65533 103796 97775 92231 87211 82743 78756 75057 71564 68559 66481 65425 64969 64505 63691 62522 61160
65518 61160 59775 58512 57443 56588 56019 55870 56174 56719 57167 57299 57146 56908 56820 56983 57251 57322 57062 56696 56553
65499 56553 56673 56782 56613 56160 55643 55409 55827 57041 58775 60551 62142 63697 65427 67380 69575 72076
65483 72076 74833 77660 80545 83800 87701 92182 97051 102306 107969 113712 119016 123672 127853 131674
65469 131674 134898 137168 138309 138354 137412 135561 132785 129020 124388 119314 114211 109097 103746 98195 92840
65454 92840 87985 83569 79464 75749 72563 69854 67452 65257 63213 61287 59624 58562 58296 58596 59072
65439 59072 59604 60343 61331 62396 63408 64407 65400 66213 66689 66937 67205 67546 67694 67320 66369 65128 63997 63197
65421 63197 62687 62313 62010 61800 61649 61359 60709 59692 58560 57586 56885 56524 56649 57263 57942 58107 57682 57244
65403 57244 57314 57757 58102 58242 58449 58832 59189 59422 59728 60285 61035 61919 63006 64243 65322 66039 66626 67473
65385 67473 68640 69834 70784 71458 71896 72056 71889 71480 71050 70778 70591 70164 69215 67826 66380 65199 64332
65368 64332 63715 63316 63050 62692 62014 60986 59777 58607 57628 56839 56097 55307 54668 54553 55044 55717 55993 55696
65350 55696 55170 54946 55321 56173 57059 57596 57807 58090 58807 59989 61415 62810 63912 64543 64771 64898 65149 65465
65332 65465 65659 65688 65639 65543 65350 65070 64809 64681 64708 64816 64877 64838 64765 64734 64731 64745 64842 64973 64803 64011 62800 61745
65310 61745 61112 60625 60052 59618 59636 60020 60500 61071 61910 63009 64206 65474 66883 68353 69721 70982 72215
65293 72215 73337 74207 74878 75473 75837 75633 74803 73687 72655 71829 71174 70632 70087 69437 68787 68427 68521 68916
65275 68916 69287 69384 69179 68902 68929 69500 70500 71580 72495 73270 74094 75148 76502 78117 80023 82506 85945
65258 85945 90351 95235 100109 104943 109939 115043 119946 124394 128208 131149 133100 134310 135054 135100 133882
65243 133882 131267 127770 123974 120092 116181 112376 108722 105059 101313 97715 94521 91700 89059 86547
65229 86547 84258 82268 80620 79355 78446 77783 77270 76833 76286 75377 74056 72572 71231 70205 69588 69397
65213 69397 69368 68999 68034 66789 65835 65423 65386 65503 65773 66317 67134 67980 68483 68464 68168 68102 68600 69603 70862
65194 70862 72175 73410 74430 75139 75509 75519 75196 74757 74533 74631 74812 74797 74587 74383 74295 74283 74277 74214 74049 73811 73576
65173 73576 73283 72709 71762 70699 69842 69177 68430 67510 66655 66106 65839 65713 65700 65816 65952 65968 65958 66243 66971 67865
65153 67865 68463 68601 68507 68436 68410 68335 68201 68016 67657 66979 66018 64989 64142 63720 63906 64599 65330 65649 65585 65520 65588
65132 65588 65536 65207 64879 64892 65128 65119 64610 63825 63154 62722 62324 61725 60979 60409 60321 60770 61601 62567 63389 63853 63999
65111 63999 64069 64202 64313 64409 64770 65505 66142 66084 65385 64642 64110 63445 62444 61572 61428 62025 62884 63634 64226 64760
65091 64760 65359 66105 66880 67396 67535 67528 67631 67822 67994 68267 68826 69616 70440 71250 72066 72687 72798 72394 71855 71550
65071 71550 71512 71543 71514 71522 71841 72714 74080 75535 76615 77151 77330 77485 77880 78607 79620 80863 82348 84020
65053 84020 85643 87015 88324 90056 92487 95508 99018 103192 108197 113893 120076 126780 134096 141831
65039 141831 149668 157500 165362 173096 180379 186996 192885 198014 202446 206413 210057 213113 215120 215839
65025 215839 215260 213313 209968 205627 201014 196580 192222 187648 182676 177088 170525 162837 154418 146002
65011 146002 138163 131075 124638 118673 113064 107803 102951 98535 94573 91132 88282 85956 83958 82162
64997 82162 80605 79390 78578 78181 78186 78488 78898 79214 79291 79103 78787 78596 78698 79010 79269 79268 78993 78596 78272 78106
64977 78106 77978 77725 77425 77408 77851 78528 79090 79448 79675 79721 79514 79255 79260 79524 79718 79681 79634 79800 80069 80182 80072
64956 80072 79865 79674 79538 79477 79513 79689 80107 80816 81617 82098 81940 81149 79958 78624 77384 76447 75894 75650 75608
64937 75608 75699 75773 75548 74841 73800 72764 71855 70839 69467 67869 66475 65575 65102 64928 65172 65953 66909 67306
64919 67306 66805 65904 65420 65674 66362 67059 67592 67998 68406 68959 69675 70382 70951 71538 72385 73418 74339 75069 75863
64900 75863 76895 78004 78922 79559 79950 80136 80225 80381 80638 80895 81183 81741 82682 83759 84640 85332 86117 87153
64882 87153 88276 89199 89806 90215 90596 90914 90898 90363 89515 88748 88118 87252 85868 84175 82578 81189 79859
64865 79859 78569 77497 76700 75985 75173 74346 73753 73535 73597 73682 73532 73049 72341 71592 70906 70294 69766 69338 68978
64846 68978 68639 68366 68262 68304 68326 68261 68298 68638 69163 69569 69807 70167 70787 71350 71483 71309 71271 71478 71551 71192 70552
64825 70552 69947 69482 69137 68947 68893 68838 68768 68904 69354 69842 70068 70158 70453 71011 71639 72294 73073 73912 74690 75561
64805 75561 76783 78244 79605 80996 83031 85984 89331 92371 94912 97108 98985 100513 101910 103474
64791 103474 105239 107023 108742 110357 111605 112081 111600 110304 108433 106162 103661 101121 98687 96429 94388
64776 94388 92585 91091 90114 89879 90313 90928 91200 91036 90772 90754 91022 91329 91354 90914 90069 89047 88039 87109
64758 87109 86235 85357 84364 83213 82067 81159 80494 79850 79099 78341 77663 77000 76332 75804 75486 75213 74802 74256
64740 74256 73615 72856 72109 71747 71997 72644 73334 73993 74676 75227 75448 75526 75913 76781 77867 78855 79687 80537 81693
64721 81693 83433 85747 88237 90553 92865 95625 98925 102441 105987 109680 113444 116781 119266 120993
64707 120993 122248 122969 122776 121406 118959 115822 112540 109591 107067 104641 101995 99228 96710 94627 92878
64692 92878 91353 90101 89179 88493 87902 87405 87181 87399 87965 88505 88708 88693 88938 89761 90999 92300 93581 95057
64674 95057 96864 98851 100753 102461 104083 105877 108101 110825 113800 116617 119046 121190 123280 125434
64660 125434 127665 129981 132324 134473 136192 137502 138647 139693 140298 140024 138782 136855 134511 131747 128439
64645 128439 124615 120519 116507 112888 109811 107230 105040 103247 101924 101020 100384 100025 100142 100754 101459 101768
64629 101768 101602 101296 101140 101150 101266 101567 102181 103122 104310 105660 107118 108629 110121 111442 112337 112598 112265
64612 112265 111572 110648 109422 107834 106022 104163 102258 100219 98096 96072 94275 92755 91566 90690 89865
64597 89865 88754 87421 86439 86313 86874 87440 87576 87477 87597 88110 88842 89588 90372 91456 93185 95742 98930
64580 98930 102288 105519 108752 112247 115983 119693 123189 126434 129301 131508 132795 132986 131913 129547 126291
64565 126291 122851 119691 116766 113916 111226 108841 106683 104639 102886 101711 101134 100979 101234 102048 103345
64550 103345 104745 105956 107030 108196 109636 111499 113911 116831 120075 123599 127642 132448 137877 143327
64536 143327 148025 151382 153284 154123 154485 154671 154557 153943 152936 151914 151194 150800 150475 149828 148564 146722
64520 146722 144654 142692 140860 139037 137317 135991 135150 134513 133766 132962 132378 132054 131650 130814 129498 127869
64504 127869 126031 124026 121969 120010 118129 116143 113961 111731 109659 107812 106151 104677 103481 102722
64490 102722 102607 103258 104490 105822 106889 107775 108813 110117 111456 112615 113642 114673 115628 116244 116338 115949
64474 115949 115190 114096 112687 111130 109710 108564 107502 106220 104661 103035 101466 99818 97960 96098
64460 96098 94633 93763 93388 93345 93544 93809 93801 93245 92209 91046 90077 89389 88938 88791 89184 90283 91930 93652
64442 93652 94974 95665 95741 95411 95057 95103 95680 96435 96840 96713 96324 96019 95858 95679 95367 94990 94704 94615 94674 94700
64422 94700 94517 94116 93681 93445 93534 93941 94611 95542 96809 98466 100440 102571 104784 107154 109755 112484 115119
64405 115119 117555 119938 122541 125536 128794 131910 134431 136129 137032 137214 136676 135424 133561 131176 128280
64390 128280 124939 121425 118137 115401 113404 112189 111568 111137 110551 109799 109090 108532 108058 107576 106997 106078 104519
64373 104519 102326 99997 98155 97037 96369 95794 95290 95161 95610 96460 97361 98178 98999 99842 100606 101380 102452
64356 102452 103825 104991 105450 105331 105195 105332 105562 105639 105541 105357 105228 105438 106252 107568 108977 110246 111531
64339 111531 113021 114663 116386 118365 120850 123887 127395 131365 135819 140709 146044 152030 158903 166717
64325 166717 175449 185252 196446 209332 224186 241436 261679 285540 313524 345928 382703 423395
64313 423395 467313 513616 561036 607619 651139 690116 724393 754604 781059 803181 819856
64302 819856 830021 832940 828202 815860 796622 771713 742312 709021 671838 630659 585916 538911
64290 538911 491562 445750 402791 363452 328234 297398 270771 247828 228145 211581 197931
64279 197931 186676 177316 169702 163750 158945 154534 150201 146257 143065 140554 138331 136071 133657 131158
64265 131158 128802 126812 125116 123367 121371 119382 117873 117046 116702 116578 116700 117358 118734 120619 122575
64250 122575 124404 126337 128647 131217 133570 135247 135980 135667 134398 132494 130299 127924 125397 122938 120821
64235 120821 118992 117189 115452 114225 113843 114164 114828 115634 116559 117638 118958 120576 122357 124088 125802
64220 125802 127692 129608 131008 131607 131769 131958 132067 131631 130510 128975 127205 125067 122422 119404 116306
64205 116306 113368 110704 108312 106121 104115 102397 101080 100175 99622 99362 99307 99370 99612 100209 101186 102333 103511
64188 103511 104860 106551 108489 110496 112623 115039 117666 120226 122663 125295 128479 132226 136143 139710
64174 139710 142647 145091 147358 149470 151044 151755 151751 151420 150932 150219 149339 148540 147961 147516 147114 146827 146740 146763
64156 146763 146651 146113 144899 142893 140187 137027 133671 130283 126911 123515 120111 116949 114401 112600 111277
64141 111277 110054 108773 107440 106048 104690 103709 103467 103955 104810 105685 106422 106939 107192 107288 107446 107796 108316
64124 108316 108933 109536 109909 109870 109456 108831 108026 106971 105776 104787 104258 104114 104093 103994 103773 103490 103213 102898 102401
64105 102401 101705 101098 100991 101523 102484 103602 104786 106110 107689 109642 111975 114494 116953 119379 122173
64090 122173 125833 130593 136316 142595 148913 154797 159887 163895 166586 167818 167556 165811 162627 158212
64076 158212 152990 147442 141987 137025 132894 129592 126725 123925 121214 118790 116629 114580 112766 111547
64062 111547 111069 111109 111355 111592 111622 111326 110845 110499 110435 110580 110920 111563 112425 113154 113504 113592 113702 114032 114705 115756
64042 115756 116931 117765 118073 118204 118556 118995 118993 118304 117266 116427 116084 116203 116647 117315 118078 118727 119134 119452 120039
64023 120039 121043 122192 123140 123935 124951 126405 128230 130412 133154 136570 140456 144530 148721 153035 157256
64008 157256 161000 164009 166283 167962 169230 170311 171464 172919 174812 177115 179652 182250 184878 187538
63994 187538 190077 192233 193863 194953 195448 195296 194764 194464 194859 195844 196926 197694 198014 197892 197357 196457 195244
63977 195244 193708 191750 189224 186075 182524 179045 176033 173456 171005 168531 166139 163883 161668 159582
63963 159582 158040 157380 157438 157728 157906 157929 157922 158059 158525 159413 160681 162263 164157 166366 168907 171969 175866
63946 175866 180702 186256 192345 199098 206631 214650 222676 230588 238581 246613 254202 260877 266580 271480
63932 271480 275599 278780 280900 281915 281702 280065 277000 272916 268439 263950 259402 254648 249800 245115
63918 245115 240573 235847 230698 225210 219571 213929 208547 203813 199863 196388 193058 189966 187405 185376
63904 185376 183616 182005 180633 179519 178624 178172 178558 179816 181436 182934 184386 186179 188385 190647 192650
63889 192650 194521 196682 199466 202917 206889 211207 215747 220484 225554 231195 237527 244344 251284 258219
63875 258219 265375 272944 280691 288112 294966 301559 308505 316309 325180 335085 345912 357590 370174
63862 370174 383893 399119 416205 435290 456318 479420 505232 534761 568923 608364 653703
63851 653703 705685 765005 832275 908342 994473 1091940 1201442 1323006 1456237 1600382 1754220
63840 1754220 1916155 2084454 2257243 2432319 2607082 2778512 2942959 3096087 3233448
63831 3233448 3351379 3447302 3519321 3565864 3585867 3579024 3545644 3486395 3402360 3295323 3167909
63820 3167909 3023536 2866224 2700234 2529551 2357572 2187184 2020994 1861281 1709758
63811 1709758 1567513 1435312 1313908 1203975 1105689 1018443 941113 872646 812359 759684
63801 759684 713842 673898 639037 608616 582026 558673 538102 519949 503743 488889 474882
63790 474882 461440 448451 435947 424110 413143 403014 393449 384247 375549 367742 361175 355979 352067
63777 352067 349258 347470 346833 347583 349894 353840 359446 366563 374721 383349 392259 401828 412545 424450
63763 424450 437087 449934 462755 475573 488376 500885 512572 522886 531446 538049 542635 545346
63751 545346 546516 546402 544884 541579 536309 529321 521042 511737 501419 489950 477171 463130 448250
63738 448250 433088 417820 402142 385841 369267 353052 337476 322386 307658 293452 280014
63727 280014 267499 256085 245969 237108 229061 221315 213720 206493 199896 194029 188839 184133 179609
63714 179609 175051 170616 166784 163917 161915 160341 158791 157074 155155 153101 151093 149300 147688 146076
63700 146076 144418 142904 141675 140559 139231 137570 135749 134007 132472 131158 129998 128847 127586 126270
63686 126270 125087 124185 123585 123229 122976 122574 121828 120880 120173 120014 120248 120442 120317 119883 119234 118403 117463 116635
63668 116635 116175 116136 116292 116336 116166 115918 115740 115561 115172 114567 114058 113999 114411 114985 115439 115759 116084 116444 116727 116881
63648 116881 117034 117366 117931 118684 119623 120793 122136 123449 124573 125538 126476 127436 128372 129253 130071 130750 131130
63631 131130 131127 130903 130839 131319 132433 133869 135178 136215 137281 138762 140702 142777 144602 145967 146847 147396
63615 147396 147900 148597 149466 150238 150596 150319 149378 148063 146963 146534 146638 146722 146510 146274 146353 146662 146921 147141 147634
63596 147634 148619 150082 151940 154051 156100 157756 159031 160293 161802 163380 164645 165418 165758 165717 165272 164497
63580 164497 163640 162956 162483 162050 161431 160464 159067 157244 155165 153212 151870 151429 151758 152389 152862 153044 153156
63563 153156 153483 154075 154665 154858 154429 153476 152325 151246 150255 149185 147983 146863 146104 145666 145119 144069 142591
63546 142591 141146 140105 139478 139108 138970 139108 139423 139711 140000 140678 142161 144433 146970 149119 150574 151538
63530 151538 152537 154078 156396 159404 162850 166541 170483 174850 179826 185447 191507 197626 203509 209270
63516 209270 215475 222726 231160 240430 250247 260775 272373 285058 298376 311787 324957 337619
63504 337619 349346 359598 367950 374150 378021 379445 378548 375889 372380 368884 365724 362616 359153 355336
63490 355336 351484 347574 342935 336780 328962 320029 310619 301020 291279 281498 271914 262868 254790 248050
63476 248050 242672 238327 234734 231943 230082 228981 228354 228302 229269 231369 234031 236548 238801 241202 244041
63461 244041 247207 250529 254075 258046 262564 267723 273644 280376 287875 296249 305892 317162 329990 343983
63447 343983 358874 374640 391090 407471 422486 434629 442597 445729 444319 439478 432542 424592 416480
63434 416480 409009 402763 397788 393681 390070 386828 383732 380208 375626 369730 362534 353869 343423 331323
63420 331323 318388 305582 293361 281749 270793 260563 250828 241218 231887 223615 216937 211408 206101
63407 206101 200700 195728 191688 188390 185316 182326 179707 177640 175945 174344 172751 171183 169612 168048
63393 168048 166651 165567 164677 163734 162776 162215 162397 163160 163998 164575 164981 165524 166376 167432 168378 168949 169269 169858
63375 169858 171137 172885 174434 175398 176003 176594 177124 177329 177150 176685 175862 174549 172999 171824 171367 171285 170940
63358 170940 170081 169018 168229 167993 168322 169098 170184 171507 173145 175298 178101 181475 185225 189274 193712
63343 193712 198590 203800 209263 215159 221827 229498 238286 248383 260008 273074 287015 300938 313775
63330 313775 324361 331808 336103 338162 339160 339919 341035 343187 346964 352517 359731 368631 379343 391764
63316 391764 405579 420466 435912 450873 464067 474699 482602 487658 489567 488388 484941 480346 475360
63303 475360 470365 465673 461447 457377 452776 447059 439998 431518 421467 409667 396169 381422 366207
63290 366207 351279 337006 323388 310452 298464 287713 278228 269906 262775 256891 252067 247943 244437
63277 244437 241904 240747 240957 242174 244101 246687 249895 253514 257386 261715 266936 273220 280292 287811
63263 287811 295787 304454 313931 324209 335401 347734 361239 375650 390623 405826 420740 434577
63251 434577 446564 456210 463203 467255 468256 466570 463019 458536 453840 449319 445038 440817 436354 431384
63237 431384 425720 419166 411419 402120 391140 378818 365853 352909 340379 328533 317674 308011
63225 308011 299484 291966 285596 280761 277724 276385 276265 276452 275621 272503 266586 258350 248850 239163 230115
63210 230115 222145 215219 209023 203339 198188 193616 189612 186260 183740 182064 180964 180154 179512 178929 178244
63195 178244 177495 176995 176924 176953 176507 175369 173866 172460 171300 170195 168968 167755 166906 166561 166446 166202 165788
63178 165788 165350 164825 164012 163019 162229 161734 161162 160257 159315 158795 158751 158910 159085 159269 159503 159944 160922 162635 164846
63159 164846 167073 169019 170673 172126 173471 174756 175881 176677 177261 178133 179719 181941 184465 187187 190205
63144 190205 193469 196799 200194 203886 208072 212822 218143 223954 230069 236438 243374 251287 260249 270017
63130 270017 280405 291331 302603 313970 325456 337373 349953 363124 376665 390349 403921
63119 403921 417155 429996 442563 454995 467431 480017 492766 505457 517878 530045 541968
63108 541968 553221 563053 570876 576397 579319 579220 575853 569337 559999 548243 534556 519418 503162
63095 503162 486172 469183 453049 438120 424190 411152 399401 389388 381079 374175 368679 364959
63083 364959 363306 363673 365817 369523 374644 381065 388623 397009 405792 414653 423590 432839 442539 452511
63069 452511 462366 471789 480730 489291 497504 505255 512408 518835 524288 528375 530778 531362 529976 526321
63055 526321 520220 511907 501809 490134 476947 462604 447778 432995 418373 403901 389812 376529
63043 376529 364383 353450 343590 334558 326204 318577 311841 306065 301208 297211 293988 291379 289249 287604
63029 287604 286496 285908 285890 286662 288324 290538 292749 294727 296621 298564 300507 302443 304464 306513 308393
63014 308393 310060 311630 313015 313913 314304 314644 315316 316151 316680 316713 316448 316166 316019 315997 315919 315557 314884 314086 313245
62995 313245 312192 310822 309410 308378 307834 307534 307197 306731 306168 305621 305310 305519 306400 307837 309508 311138
62979 311138 312692 314324 316086 317858 319621 321691 324455 327944 331837 335810 339671 343287 346740 350550
62965 350550 355328 361084 367213 373298 379613 386668 394594 403256 412699 423198 435002 448273 463125
62952 463125 479495 497119 515902 536204 558546 583094 609543 637389 666108 695253 724579
62941 724579 754097 783811 813491 842794 871533 899686 927272 954380 981186 1007811 1034206
62930 1034206 1060232 1085719 1110306 1133417 1154523 1173265 1189155 1201385 1209128 1211849 1209127 1200416
62918 1200416 1185340 1164124 1137446 1106035 1070753 1032928 994102 955376 917295 880430 845712
62907 845712 814065 785968 761507 740605 723102 708853 697968 690777 687371 687298 689904 694892 702367
62894 702367 712382 724622 738506 753420 768827 784384 800113 816337 833224 850383 867082
62883 867082 882889 897889 912190 925474 937227 947141 954891 959691 960576 957228 950082 939444 924941
62870 924941 906159 883509 858046 830641 801775 772033 742283 713192 684864 657154 630226
62859 630226 604625 580868 559087 539030 520322 502668 485885 469879 454701 440533 427490
62848 427490 415478 404332 394003 384404 375247 366324 357922 350566 344283 338487 332706 327061 321877
62835 321877 317186 312924 309240 306294 303956 301992 300343 298975 297712 296517 295649 295218 294817 293985 292842
62820 292842 291874 291251 290754 290190 289454 288363 286839 285153 283557 281837 279677 277296 275180 273316 271295
62805 271295 269118 267226 265669 263941 261804 259673 257940 256506 255265 254475 254253 254178 253851 253475 253437 253661
62789 253661 253793 253787 253831 253909 253864 253778 253891 254193 254459 254621 254798 254986 255006 254782 254438 254085 253709 253255 252691 252013 251296
62768 251296 250675 250192 249764 249378 249175 249214 249344 249475 249745 250238 250712 250904 250956 251237 251826 252488 253047 253552 254074
62749 254074 254589 255054 255369 255341 254934 254435 254113 253800 253156 252289 251712 251586 251422 250719 249561 248382 247383 246456
62731 246456 245499 244561 243755 243216 243046 243172 243326 243349 243423 243832 244620 245626 246805 248259 249991 251834 253677
62714 253677 255570 257536 259467 261289 263134 265206 267554 270060 272582 275034 277384 279726 282345 285535
62700 285535 289279 293183 296835 300171 303471 307025 310961 315357 320390 326290 333232 341386 351029 362456
62686 362456 375699 390479 406551 424116 443788 466142 491291 518900 548603 580370 614510
62675 614510 651321 690733 732292 775500 820089 865902 912509 959004 1004113 1046410 1084463
62664 1084463 1117022 1143213 1162461 1174168 1177633 1172486 1159084 1138272 1110827 1077363 1038756 996299
62652 996299 951304 904739 857391 810227 764355 720645 679477 640860 604725 571145 540310
62641 540310 512273 486768 463430 442133 422957 405828 390416 376465 363999 353110 343719 335686
62629 335686 328895 323060 317687 312448 307514 303272 299884 297284 295427 294261 293569 293151 293071 293474 294287 295428
62613 295428 297211 300116 304146 308794 313700 319030 325137 332232 340543 350405 361929 374856 389015
62600 389015 404705 422341 441867 462865 485222 509384 535849 564610 595177 627036 659961
62589 659961 693865 728467 763097 796754 828203 856064 879046 896295 907473 912424 910895 902765
62577 902765 888428 868699 844360 816065 784610 750995 716156 680859 645850 611841 579233
62566 579233 548132 518742 491468 466491 443562 422384 402998 385526 369758 355327 342186
62555 342186 330613 320699 312081 304195 296643 289300 282258 275755 270049 265197 260972 257027 253211 249705
62541 249705 246814 244602 242827 241235 239804 238594 237493 236283 234876 233293 231539 229739 228258 227290
62527 227290 226393 224877 222805 221116 220555 220843 221189 221285 221384 221699 222211 222967 224125 225651 227266 228715 229931
62510 229931 230983 232129 233817 236336 239437 242595 245666 249062 253263 258442 264622 271904 280351 289845
62496 289845 300270 311745 324517 338676 354137 370856 388937 408461 429254 450870 472846
62485 472846 494898 516819 538156 558141 575969 591081 603055 611371 615470 615081 610384 601837 589885
62472 589885 574859 557088 537134 515853 494114 472401 450837 429663 409496 390914 373977
62461 373977 358403 344142 331435 320335 310469 301427 293131 285706 279163 273392 268353 264044 260341
62448 260341 257041 254070 251540 249575 248156 247154 246415 245775 245071 244251 243442 242833 242453 242143 241768 241386 241154
62431 241154 241117 241231 241580 242440 244080 246497 249397 252431 255489 258813 262776 267587 273256 279882 287755
62416 287755 297000 307333 318450 330584 344339 359934 376992 395168 414597 435517 457702 480632
62404 480632 503997 527668 551217 573767 594376 612416 627624 640041 649913 657528 663094 666908
62392 666908 669537 671719 674038 676842 680460 685359 691994 700554 710855 722464 734982 748156 761587
62379 761587 774239 784410 790467 791701 788531 781917 772502 760032 743475 721890 695407 665319
62367 665319 633233 600297 567301 535061 504310 475379 448370 423542 401260 381648 364595
62356 364595 350019 337790 327480 318573 310946 304815 300164 296609 293865 292029 291258 291492 292641 294745
62342 294745 297742 301296 305041 308859 312768 316713 320584 324254 327462 329870 331355 332080 332111 331197 329099
62327 329099 325959 322126 317763 312890 307641 302227 296687 290947 285109 279455 274183 269332 264980 261282
62313 261282 258271 255767 253568 251590 249767 247970 246091 244134 242176 240344 238850 237923 237614 237757 238232
62298 238232 239134 240551 242241 243720 244708 245362 246072 247119 248567 250318 252186 254036 255964 258269 261145
62283 261145 264497 268135 272039 276239 280548 284663 288507 292248 295989 299658 303238 306818 310357 313673
62269 313673 316850 320385 324754 330013 336050 342964 350935 359934 369895 381076 393907 408559 424959
62256 424959 443192 463428 485413 508408 531815 555538 579471 602822 624233 642538 657241
62245 657241 668342 675964 680226 681385 679934 676427 671206 664354 655901 645985 634746 622274 608817
62232 608817 594939 581262 568128 555708 544311 534303 525722 518248 511566 505511 499831 494074 487831
62219 487831 480906 473188 464572 455093 444974 434423 423554 412552 401709 391181 380886 370756
62207 370756 360918 351574 342868 334969 328058 322099 316799 311937 307614 304059 301389 299614 298669 298286 298080
62192 298080 297940 298107 298674 299289 299640 299973 300731 301845 302848 303608 304496 305710 306890 307618 307944 308207 308589
62175 308589 309108 309889 311129 312873 315050 317688 320899 324706 329120 334367 340772 348346 356705 365585 375276
62160 375276 386409 399453 414585 431929 451581 473338 496660 521069 546403 572535 598952
62149 598952 624773 649077 671025 689777 704618 715262 721889 724843 724384 720735 714087 704427 691522
62136 691522 675290 656114 634715 611737 587606 562741 537753 513366 490240 468880 449647
62125 449647 432721 418017 405204 393934 384110 375874 369258 363885 359134 354614 350382 346669 343503
62112 343503 340703 338163 336009 334392 333239 332292 331420 330810 330769 331382 332432 333628 334854 336220 337966 340282
62096 340282 343078 345987 348766 351660 355124 359157 363224 366904 370310 373670 376892 379887 382991 386621
62082 386621 390643 394553 398171 401744 405388 408925 412281 415590 418812 421678 424217 426931 430327 434617
62068 434617 440058 447137 456163 466976 479356 493372 509027 525798 542923 559892 576331 591534
62056 591534 604579 614862 622260 626814 628606 627916 625158 620581 614184 605995 596187 584938 572359
62043 572359 558640 544125 529201 514202 499489 485508 472741 461543 451965 443711 436404 429968
62031 429968 424625 420390 416747 412999 408827 404358 399814 395334 391069 387210 383922 381380 379820 379389
62017 379389 379979 381410 383728 387105 391479 396501 401839 407233 412211 416006 417975 418030 416579 414154 411213
62002 411213 408151 405278 402704 400305 397793 394816 391020 386192 380490 374557 369256 365160 362226 360012
61988 360012 358175 356690 355703 355349 355742 356952 358848 361093 363391 365709 368194 371011 374318 378286 383047
61973 383047 388663 395197 402694 411048 420034 429522 439551 450139 461207 472786 485083 498192 511841
61960 511841 525556 538891 551357 562370 571486 578561 583480 585955 585853 583558 579689 574531 567994
61947 567994 560019 550675 539911 527552 513621 498454 482448 465951 449355 433036 417163 401776
61935 401776 387056 373297 360605 348897 338206 328691 320272 312531 305109 297977 291252 285018 279420
61922 279420 274654 270673 267105 263635 260282 257111 253919 250429 246667 242870 239165 235600 232404 229880
61908 229880 228015 226469 225056 224031 223740 224134 224815 225500 226271 227293 228458 229456 230186 230891 231833 232952
61892 232952 233975 234773 235409 235898 236071 235750 234884 233476 231518 229082 226375 223608 220883 218261 215856 213746
61876 213746 211857 210031 208225 206608 205471 205041 205276 205820 206255 206466 206679 207104 207613 207900 207885 207798 207895 208188
61858 208188 208525 208778 208904 208883 208762 208741 209068 209802 210736 211664 212661 214028 215958 218376 221115 224143 227508
61841 227508 231200 235192 239633 244843 251033 258020 265256 272196 278672 284927 291272 297721 304002 309872
61827 309872 315240 319978 323819 326616 328629 330289 331666 332313 331769 330115 327936 325783 323828 322067 320640
61812 320640 319781 319522 319731 320544 322476 325916 330637 336017 341644 347386 353023 358188 362756 366866 370404
61797 370404 372819 373698 373285 372144 370527 368349 365597 362416 358897 355106 351290 347757 344570 341589 338792
61782 338792 336241 333705 330596 326437 321225 315285 308938 302438 296042 290005 284523 279748 275860 273032
61768 273032 271305 270481 270176 270050 270021 270241 270887 272093 274031 276804 280227 283937 287843 292300 297715 304182
61752 304182 311610 319993 329337 339570 350700 362824 375737 388755 401206 412847 423544 432879
61740 432879 440507 446687 451975 456487 459885 461909 462443 461245 458263 454178 450011 446165 442493 439356
61726 439356 437818 438498 440894 444262 448498 453620 458923 463426 466860 469532 471289 471303 468942 464364 458094
61711 458094 450472 441681 432050 422030 412005 402240 392928 384133 375719 367462 359302 351454 344219 337638
61697 337638 331468 325571 320201 315688 311955 308637 305664 303370 301962 301187 300654 300187 299652 298793 297527
61682 297527 296184 295138 294329 293391 292185 290917 289873 289196 288879 288771 288693 288706 289189 290434 292286 294354 296440
61665 296440 298582 300806 303131 305752 308926 312703 316925 321493 326416 331614 336848 341802 346115 349399
61651 349399 351419 352207 351813 350061 346777 342253 337173 332043 326897 321615 316282 311131 306299 301814 297746
61636 297746 294205 291241 288800 286754 284963 283329 281831 280512 279414 278504 277681 276881 276190 275795 275737 275795
61620 275795 275763 275776 276120 276689 276942 276540 275769 275111 274641 274113 273487 272979 272658 272287 271616 270569 269104 267129
61602 267129 264655 261889 259081 256379 253851 251494 249211 246889 244571 242441 240580 238841 237021 235134
61588 235134 233436 232180 231308 230383 228939 226957 224951 223453 222516 221772 220908 219877 218717 217412 215978
61573 215978 214534 213193 211994 210963 210143 209486 208832 208101 207459 207199 207406 207830 208087 208006 207742 207581 207730 208282
61555 208282 209242 210425 211429 211941 212083 212291 212790 213403 213904 214327 214790 215279 215798 216543 217671 219012 220289
61538 220289 221534 223015 224742 226350 227487 228101 228231 227763 226536 224608 222268 219806 217356 214971 212768
61523 212768 210929 209547 208512 207645 206911 206422 206225 206229 206332 206474 206502 206204 205558 204826 204289 203982 203724 203210 202053
61504 202053 200031 197487 195176 193469 191920 189900 187449 185147 183314 181800 180458 179357 178456 177477 176280
61489 176280 175023 173853 172687 171459 170344 169555 169079 168761 168484 168168 167740 167267 166958 166945 167121 167296 167403
61472 167403 167475 167508 167433 167172 166710 166206 166004 166371 167157 167907 168359 168682 169127 169644 169988 170085 170142 170422 171052 172028
61452 172028 173295 174752 176205 177351 177932 178003 177986 178326 179074 179940 180676 181255 181695 181918 181912 181843 181928 182275 182922
61433 182922 183885 185042 186101 186781 187034 187039 187060 187304 187773 188200 188251 187881 187334 186778 186108 185233 184370 183797 183406
61414 183406 182740 181518 180013 178828 178392 178689 179407 180296 181333 182546 183747 184590 184942 185065 185309 185770 186391
61397 186391 187283 188633 190309 191840 192997 194152 195829 197993 200057 201609 202825 204089 205443 206604
61383 206604 207349 207646 207518 207064 206566 206324 206315 206182 205601 204501 202969 201211 199615 198548 197992 197630 197321 197203
61365 197203 197210 196931 196197 195420 195015 194803 194405 193930 193729 193687 193356 192747 192388 192537 192889 193220 193774 194730 195737
61346 195737 196344 196606 196896 197370 197943 198654 199674 200992 202372 203630 204815 206121 207724 209623 211585 213349
61330 213349 214925 216565 218372 220130 221616 222834 223810 224416 224678 225022 225897 227232 228541 229510 230215 230832
61314 230832 231414 231957 232414 232616 232391 231812 231091 230246 229149 227963 227207 227165 227489 227633 227522 227504 227780 228218 228750
61295 228750 229543 230666 231835 232779 233631 234662 235750 236463 236707 236930 237526 238305 238797 238898 238904 239027 239174 239225
61277 239225 239245 239320 239400 239453 239625 240091 240807 241534 242104 242577 243124 243822 244569 245204 245665 246034 246422 246887 247449 248106
61257 248106 248767 249301 249742 250373 251451 252962 254741 256761 259097 261641 264078 266161 267867 269263 270400
61242 270400 271389 272396 273484 274517 275295 275715 275829 275848 276044 276505 277000 277208 277057 276683 276140 275361 274389 273441
61224 273441 272728 272425 272744 273766 275177 276486 277643 279133 281396 284372 287712 291116 294350 297261 300020
61209 300020 303121 306931 311441 316604 322563 329293 336298 342993 349165 354754 359476 363100 365866 368133
61195 368133 369720 370128 369383 368133 366775 365020 362501 359375 356003 352363 348188 343495 338657 334023 329722
61180 329722 325794 322272 319131 316331 313944 312085 310755 309821 309131 308543 307921 307221 306604 306297 306330 306508 306679
61163 306679 306954 307631 308971 311095 313998 317564 321525 325454 328858 331382 332959 333759 333953 333544 332490
61148 332490 330982 329435 328150 327028 325736 324123 322370 320757 319435 318467 317972 318070 318713 319661 320610 321306
61132 321306 321582 321442 321193 321377 322452 324439 326922 329417 331766 334163 336834 339802 343004 346515 350519
61117 350519 355038 359877 364900 370159 375653 381069 385946 390063 393501 396358 398623 400352 401863 403614
61103 403614 405926 408841 412225 416003 420287 425300 431192 437957 445521 453765 462416 471015 479101 486399
61089 486399 492776 498067 502004 504308 504902 504130 502692 501101 499149 496148 491805 486552 480903 474869 468232
61074 468232 461111 453747 446007 437591 428692 419925 411613 403589 395762 388366 381494 374816 368052 361405
61060 361405 355303 349947 345330 341444 338212 335448 333099 331421 330714 331011 332179 334127 336713 339539 342037
61045 342037 343756 344516 344393 343638 342484 340993 339231 337548 336436 336061 336253 337039 338851 342015 346324 351353
61029 351353 356919 363004 369506 376415 384059 392841 402789 413627 425155 437354 450209 463660 477648
61016 477648 491999 506471 521071 536185 552074 568421 584652 600506 615953 630707 644346
61005 644346 656880 668716 679945 690021 698340 704806 709656 713001 714798 715127 714263 712560 710333 707736
60991 707736 704636 700757 696052 690876 685659 680543 675450 670360 665362 660462 655550 650583 645630 640716
60977 640716 635724 630516 625074 619423 613500 607272 600920 594748 588823 582896 576778 570642 564807 559328
60963 559328 554030 548880 544041 539582 535381 531370 527661 524388 521652 519668 518657 518446 518479 518451 518736 519923
60947 519923 522123 525035 528541 532851 538034 543776 549742 555966 562703 570079 577974 586191 594583 603105
60933 603105 611892 621235 631328 642008 652882 663798 675092 687305 700774 715638 732059 750165
60921 750165 769826 790774 812971 836580 861625 888217 917308 950720 990022 1035767 1088173
60910 1088173 1148164 1217189 1296503 1387369 1491919 1613286 1755191 1922109 2119602 2353660
60900 2353660 2630025 2955351 3339277 3794398 4333879 4969396 5710257 6561640 7521295
60891 7521295 8575604 9692577 10809483 11825164 12618275 13097615 13254810 13174625 12990794
60882 12990794 12823415 12742481 12764394 12855558 12929701 12858819 12518728 11851358 10896745 9768394
60872 9768394 8594810 7472794 6455488 5563517 4798256 4149896 3603692 3145355 2762911
60863 2762911 2445428 2182304 1964192 1783356 1632747 1505653 1396585 1301789 1218620 1144976
60853 1144976 1079443 1021176 969271 922616 880539 843073 810275 781612 756162 732978 711070
60842 711070 689371 667160 644412 621640 599474 578343 558354 539438 521714 505579 491241
60831 491241 478353 466359 455023 444349 434268 424877 416689 410072 404542 399162 393602 388249 383375
60818 383375 378818 374530 370751 367466 364251 360910 357803 355307 353330 351553 349836 348183 346568 344946
60804 344946 343216 341172 338723 336102 333532 330788 327502 323797 320110 316497 312680 308740 305100 301746
60790 301746 298132 294047 289973 286371 283188 280252 277615 275245 272951 270895 269645 269442 269855 270405 270978
60775 270978 271391 271129 269986 268463 267131 266016 265000 264322 264222 264478 264765 265168 265932 267053 268493 270443
60759 270443 272912 275401 277480 279399 281635 284100 286277 287941 289271 290396 291268 291884 292242 292200 291725 291152
60743 291152 290839 290676 290228 289224 287611 285291 282147 278229 273674 268600 263295 258291 253933 250063 246399
60728 246399 243016 240120 237568 235029 232478 230160 228156 226307 224486 222695 220951 219344 218068 217169
60714 217169 216377 215434 214421 213529 212669 211589 210238 208818 207592 206821 206647 206856 206990 206929 207095 207820 208833
60697 208833 209655 210225 210780 211387 212005 212772 213784 214768 215336 215449 215300 214970 214535 214281 214372 214487 214209 213633 213155
60678 213155 212819 212332 211628 210945 210382 209789 209034 208070 206774 205103 203369 202013 201119 200431 199734 198962 198103
60661 198103 197345 197172 197962 199571 201561 203589 205264 206005 205627 204884 204796 205529 206414 206928 207077 206937 206549 206319
60643 206319 206857 208205 209724 210840 211443 211483 210773 209406 207874 206498 205143 203654 202159 200761 199359
60628 199359 197999 197027 196620 196493 196361 196369 196801 197562 198273 198717 199004 199388 200087 201156 202444 203736 204970 206162
60610 206162 207183 207789 207875 207494 206668 205451 204110 202943 201948 200971 200072 199399 198717 197576 195985 194482 193398
60593 193398 192465 191339 190101 189012 188144 187484 187155 187240 187562 187868 188069 188213 188377 188701 189308 190188 191322 192908
60575 192908 195145 197738 200019 201663 202970 204303 205643 206834 207875 208708 209065 208776 207990 206876 205403
60560 205403 203598 201759 200144 198713 197388 196279 195443 194726 194142 194110 194929 196289 197679 199078 200784 202697
60544 202697 204258 205125 205508 205739 205802 205413 204348 202625 200560 198699 197504 196996 196777 196429 195819 195058 194362
60527 194362 193956 193964 194302 194741 195120 195440 195737 195984 196197 196531 197122 197818 198187 197920 197183 196450 196026 195852 195794 195897
60507 195897 196187 196435 196367 196065 195908 196120 196572 197044 197476 197882 198178 198260 198145 198000 198043 198433 199192 200187 201238
60488 201238 202248 203226 204254 205434 206818 208347 209938 211615 213354 214812 215526 215493 215277 215383 215789 216309
60472 216309 217015 217987 218980 219808 220802 222378 224368 226316 228348 231075 234675 238674 242747 247140 252068
60457 252068 257194 261957 266038 269270 271501 272734 273150 272791 271589 269846 268278 267336 266836 266517 266562 267295
60441 267295 268665 270407 272518 275245 278788 283219 288501 294410 300669 307420 315283 324673 335275 346459
60427 346459 357961 369799 381613 392463 401269 407261 410128 410033 407500 403142 397446 390848 383780 376522
60413 376522 369139 361790 354944 349156 344666 341350 338930 337159 335939 335435 335973 337709 340521 344303 349246
60398 349246 355721 363989 374092 385895 399281 414451 431991 452290 474787 498157 521385 544339
60386 544339 567127 589260 609757 627845 643248 655993 666232 674100 679376 681342 679166 672382
60374 672382 660935 644915 624556 600376 573162 543864 513621 483713 455241 428884 405017
60363 405017 383878 365442 349342 335111 322479 311325 301512 292903 285425 278971 273335 268347 263904
60350 263904 259846 255988 252378 249302 246909 244973 243140 241209 239138 237067 235354 234300 233714 233089 232335
60335 232335 231887 231898 231742 230697 228802 226747 225174 224381 224414 225020 225707 226177 226538 226895 227042 226903 226896 227399 228088
60316 228088 228334 228105 227980 228352 229030 229643 230034 230294 230675 231419 232409 233129 233247 233079 233141 233483 233873 234421 235467
60297 235467 236947 238450 239891 241596 243624 245550 247085 248462 249970 251517 252922 254315 255949 257793
60283 257793 259571 261150 262704 264524 266668 268812 270474 271541 272474 273823 275620 277466 279088 280505
60269 280505 281684 282462 282885 283354 284248 285594 287150 288633 289825 290644 291244 291907 292791 293912 295314 297088
60253 297088 299267 301938 305410 309990 315536 321485 327348 332971 338231 342783 346252 348479 349474 349246 347804
60238 347804 345158 341279 336238 330492 324841 319876 315569 311561 307757 304441 301782 299456 296940 294116
60224 294116 291406 289224 287451 285603 283444 281214 279295 277909 277204 277366 278441 280260 282712 285930 290048
60209 290048 294912 300187 305606 310958 316014 320653 324900 328650 331565 333409 334365 334795 334925 334980 335345 336209
60193 336209 337160 337522 337024 335773 333679 330335 325539 319653 313342 307168 301433 296201 291403 287018 283117
60178 283117 279656 276431 273414 270903 269054 267441 265464 263044 260527 258050 255432 252727 250381 248750
60164 248750 247772 247207 246898 246723 246616 246704 247180 247958 248719 249327 249904 250469 250802 250812 250757 250961 251506 252260 253035 253618
60144 253618 253855 253809 253698 253638 253574 253466 253349 253227 253071 252933 252899 252963 253100 253406 254001 254862 255972 257459 259382
60125 259382 261517 263700 266164 269150 272325 275134 277674 280638 284289 288079 291469 294670 298256 302435
60111 302435 306965 311456 315510 318869 321756 324827 328474 332348 335818 338747 341521 344419 347227 349510
60097 349510 351066 352048 352675 352912 352515 351425 349981 348570 347214 345692 343924 341966 339760 337251 334706
60082 334706 332524 330755 329166 327758 326765 326100 325304 324244 323382 323143 323387 323761 324177 324620 324853 324734 324585
60065 324585 324819 325331 325588 325262 324449 323351 322059 320683 319433 318446 317641 316809 315873 315036 314654 314908 315629
60048 315629 316534 317541 318723 320012 321190 322191 323191 324369 325765 327346 329032 330685 332259 333961
60034 333961 336035 338459 341129 344208 347906 351955 355751 359057 362069 364726 366449 366854 366290 365380 364370
60019 364370 363197 361887 360527 359121 357790 356915 356785 357210 357702 357895 357670 357105 356478 356117 356050 356011 355856 355685
60001 355685 355452 354896 354113 353800 354551 356188 358167 360289 362621 364961 366953 368600 370188 371724 372857
59986 372857 373352 373250 372573 371280 369561 367808 366140 364229 361770 358945 356255 353997 351996 349778 346964
59971 346964 343499 339544 335195 330424 325341 320308 315650 311427 307623 304399 301881 299807 297687 295387
59957 295387 293299 291857 290994 290234 289237 288134 287297 286878 286716 286695 286975 287728 288811 289950 291153 292622 294286
59940 294286 295771 296861 297671 298282 298599 298679 298775 298857 298484 297436 296134 295062 294085 292777 291179 289702 288411
59923 288411 286927 285065 283075 281087 278724 275557 271713 267795 264330 261467 259148 257306 255880 254769
59909 254769 253874 253178 252669 252207 251533 250508 249309 248319 247846 247947 248449 249033 249421 249589 249753 250053 250414 250815
59891 250815 251493 252600 253879 255024 256197 257725 259363 260403 260610 260537 260742 261181 261623 262174 263002 263900 264501
59874 264501 264745 264791 264669 264353 264006 263855 263871 263833 263630 263363 263232 263446 264129 265210 266530 268120 270151 272542
59856 272542 274852 276660 277864 278548 278857 279047 279272 279203 278275 276473 274500 272946 271741 270635 269706 268972
59840 268972 268029 266601 265117 264232 264013 264086 264325 264855 265588 266335 267315 269014 271536 274515 277652 280917 284208
59823 284208 287229 289788 291916 293629 294813 295358 295270 294707 294099 294062 294940 296552 298597 301133 304362 308123
59807 308123 311962 315565 318838 321683 324057 326083 327747 328633 328337 327059 325418 323774 322056 320161 318117
59792 318117 315962 313831 312106 311059 310449 309886 309523 309896 311124 312742 314375 316154 318335 320958 323969
59777 323969 327357 331039 334865 338779 342679 346176 348888 351012 353185 355673 358082 360010 361539 362877
59763 362877 363867 364176 363761 362913 361918 360867 359699 358330 356808 355340 354093 353039 352163 351718 351976 352771
59747 352771 353633 354428 355590 357606 360543 364170 368274 372657 376985 380797 383642 385165 385260 384255 382849
59732 382849 381774 381477 382028 383148 384298 384871 384417 382775 380059 376527 372368 367616 362394 357168 352458
59717 352458 348258 344082 339738 335688 332429 329941 328037 326839 326423 326321 325887 325009 323995 322982 321975
59702 321975 321262 321212 321686 322172 322438 322558 322401 321708 320675 319831 319218 318289 316745 314929 313224 311566 309834
59685 309834 308197 306787 305393 303814 302185 300709 299371 298129 297111 296392 295802 295185 294645 294370 294392 294650
59669 294650 295111 295787 296789 298419 300875 303867 306855 309767 313119 317271 321936 326676 331568 337057 343317
59654 343317 350001 356539 362537 368002 373239 378473 383559 388251 392646 397052 401393 405189 408248 411024
59640 411024 414017 417078 419578 421086 421637 421483 420819 419781 418529 417289 416279 415526 414794 413806 412518 411066
59624 411066 409539 407965 406437 405057 403806 402643 401629 400769 399887 398930 398228 398102 398362 398607 398893 399647
59608 399647 400996 402641 404436 406587 409233 412285 415785 419951 424713 429615 434340 438958 443518 447784
59594 447784 451559 454926 457997 460710 462990 464840 466141 466714 466651 466301 465846 465233 464507 463769 462718 460721
59578 460721 457488 453312 448519 443148 437346 431595 426282 421432 417031 413258 410157 407479 405071 403055
59564 403055 401505 400334 399694 399983 401191 402711 404142 405824 408280 411503 415163 419070 423016 426515 429190
59549 429190 431167 432677 433514 433229 431654 428882 424931 419806 413697 406832 399313 391399 383717 376841 370797
59534 370797 365222 359840 354605 349647 345364 342253 340325 338830 336819 333809 329734 324692 319077 313667
59520 313667 309046 305090 301340 297716 294471 291636 288976 286413 284116 282150 280393 278806 277543 276734
59506 276734 276330 276203 276308 276745 277667 279008 280328 281132 281395 281534 281842 282252 282690 283246 283870 284297 284505 284878
59488 284878 285658 286585 287284 287691 287854 287702 287316 287021 286865 286376 285198 283636 282195 280935 279680 278538 277659
59471 277659 276745 275352 273568 271942 270831 270183 269866 269815 269930 270143 270528 271075 271515 271624 271543 271531 271593 271634 271760
59452 271760 272112 272560 272920 273308 273983 274981 276203 277693 279529 281630 283960 286757 290307 294731 300174 306914
59436 306914 314972 323951 333527 343673 353853 362431 367563 368706 366871 363589 360071 357073 354864 353219
59422 353219 351825 350722 350040 349500 348585 347066 344997 342374 339267 336117 333377 330858 327867 324002 319469
59407 319469 314736 310224 306222 302692 299278 295878 293038 291331 290516 289811 288883 288051 287621 287585 287927 288665
59391 288665 289577 290362 291151 292366 294058 295818 297393 298921 300520 302071 303500 304872 306157 307283 308425
59376 308425 309835 311340 312459 313065 313503 314025 314555 315099 315903 316999 318013 318628 318924 319121 319296 319537 320078
59359 320078 321092 322566 324456 326744 329293 331949 334868 338434 342734 347294 351475 354933 357699 359965
59345 359965 361890 363401 364143 363782 362326 360056 357272 354238 351225 348349 345524 342785 340496 338968 338129
59330 338129 337853 338327 339673 341470 343210 345067 347652 351150 355272 360001 365689 372393 379704 387375 395593
59315 395593 404497 413953 423914 434487 445530 456663 467776 478886 489159 496680 499710 498077 493209
59302 493209 487120 481525 477393 474881 473752 474003 475830 478827 481491 481851 478564 471464 461383 449657
59288 449657 437609 426205 416056 407478 400352 394137 388439 383513 379823 377189 374884 372613 370830
59275 370830 369926 369590 369291 368998 369083 369733 370725 371692 372475 373324 374765 377063 379869 382634 385300 388250 391630
59258 391630 395226 399067 403620 409185 415488 422131 429105 436617 444665 453023 461455 469790 478005 486313
59244 486313 494909 503577 511763 519084 525446 530607 534083 535645 535575 534206 531515 527370 521859 515168 507360
59229 507360 498543 489092 479505 470192 461423 453288 445599 438037 430517 423209 416201 409368 402625 396029
59215 396029 389570 383187 377075 371663 367147 363279 359713 356301 352993 349782 346864 344626 343300 342854
59201 342854 343214 344318 345922 347711 349755 352574 356634 361987 368477 375943 384028 391996 398846 403485
59187 403485 404902 402639 397329 390552 383949 378474 374369 371518 369777 369166 369827 371728 374583 378269 383087
59172 383087 389246 396296 403505 410645 417877 425008 431496 437226 442691 448280 453872 459162 463884 467675
59158 467675 470283 471961 473135 473631 472804 470500 467250 463445 459036 454217 449678 445815 442325 438896 435748
59143 435748 433116 430815 428633 426663 424879 422909 420593 418252 416032 413536 410469 407124 403815 400366
59129 400366 396641 393050 389931 386856 383147 378786 374292 369975 365853 362019 358589 355417 352335 349511
59115 349511 347230 345460 343999 342839 342060 341592 341328 341298 341462 341619 341752 342172 343044 344105 345064 345945 346740
59098 346740 347176 347178 347194 347634 348343 348983 349554 350153 350599 350774 350973 351431 351849 351902 351909 352464 353622 354949 356165 357199
59078 357199 357836 357864 357446 356883 356108 354867 353274 351730 350400 349177 348082 347295 346863 346752 347060 347833 348754
59061 348754 349340 349373 348908 348042 346938 345824 344603 342674 339548 335518 331339 327443 323778 320233 316767
59046 316767 313283 309804 306644 304031 301669 299064 296179 293379 290838 288411 286033 283832 281861 280083
59032 280083 278641 277825 277710 278053 278576 279188 279949 280994 282446 284315 286539 289126 292098 295293 298544 302109
59016 302109 306554 312058 318207 324603 331220 337946 344323 350121 355696 361352 366780 371563 375835 379882
59002 379882 383446 386000 387448 387993 387519 385731 382787 379289 375679 372059 368511 365167 362068 359285 357090
58987 357090 355641 354640 353618 352414 351046 349364 347225 344814 342394 339911 337192 334373 331761 329446
58973 329446 327398 325704 324387 323178 321828 320385 318894 317155 315158 313338 311966 310669 309073 307522
58959 307522 306527 305829 304725 303071 301307 299618 297776 295748 293812 292113 290662 289656 289244 289089 288779
58944 288779 288580 289102 290239 291131 291254 290952 290743 290706 290730 290903 291381 292194 293353 294893 296741 298776 301044
58927 301044 303681 306717 310206 314420 319577 325477 331727 338181 344804 351265 357021 361697 365070 366894
58913 366894 367152 366245 364575 362144 358990 355705 352948 350651 348300 345849 343797 342452 341721 341579 342152
58898 342152 343322 344744 346281 348003 349803 351432 352833 354083 355108 355872 356662 357681 358577 358894 358850 359092
58882 359092 359810 360701 361687 363088 365106 367702 370979 375107 379910 385078 390730 397220 404384 411554 418367
58867 418367 425082 432038 439254 446507 453417 459502 464594 469074 473302 476966 479519 480966 481633 481330 479475
58852 479475 475972 471282 465645 458873 450954 442281 433234 424070 415186 406971 399437 392474 386317 381215
58838 381215 376888 372979 369831 368095 367695 367956 368634 369918 371503 372591 372955 373132 373441 373562 373259 372710
58822 372710 371936 370663 368972 367385 366060 364568 362681 360779 359262 358135 357342 356915 356684 356382 356230 356836
58806 356836 358468 360954 364291 368619 373627 378750 384115 390515 398283 406888 415732 424613 433265 441303
58792 441303 448871 456628 464842 473223 481803 491158 501457 512088 522503 532670 542356 550779 557395
58779 557395 562374 565928 567844 568039 566895 564666 561213 556685 551844 547286 542922 538587 534510 530867
58765 530867 527401 523880 520394 516920 513227 509478 506250 503586 500643 496658 491680 486075 480001 473712
58751 473712 467684 461943 455907 449311 442696 436578 430694 424534 418012 411188 403874 396067 388317 381212
58737 381212 374817 368903 363304 357873 352584 347904 344463 342160 340224 338352 337063 336664 336692 336741 337070 337977
58721 337977 339292 340966 343371 346501 349602 352110 354286 356416 358137 359177 360049 361271 362439 362775 362155
58706 362155 361041 359782 358499 357214 355672 353466 350713 348087 345863 343568 340901 338261 335885 333296
58692 333296 330196 327139 324695 322632 320661 319269 319035 319707 320761 322335 324827 328052 331576 335463 339924
58677 339924 344601 348940 352960 356978 360894 364367 367383 370000 371829 372320 371281 368711 364525 358959
58663 358959 352768 346558 340335 334179 328753 324560 321266 318360 315946 314235 312825 311208 309534 308160
58649 308160 306915 305521 304261 303487 302947 302364 302230 303189 304983 306859 308754 311226 314394 317728 320814
58634 320814 323722 326671 329835 333344 337072 340645 343989 347432 350950 353829 355580 356633 357612 358481 359049
58619 359049 359733 361079 362952 364925 367040 369539 372248 374891 377591 380368 382593 383612 383478 382431 380192
58604 380192 376489 371784 366635 360836 353950 346255 338306 330021 321124 312126 303915 296608 289663 282913
58590 282913 276665 270997 265771 261143 257342 254132 251173 248640 246790 245261 243542 241838 240693 240020
58576 240020 239286 238441 237910 237909 238430 239683 241870 244758 248067 251980 256676 261792 267007 272703 279298 286348
58560 286348 293050 299168 304615 308570 309963 308609 305095 299921 293560 286967 281053 275836 270845 266062
58546 266062 261755 257779 253901 250495 248077 246503 245329 244554 244229 243884 243186 242654 242801 243141 243005 242736
58530 242736 242948 243174 242503 241107 239822 238635 236936 235017 233869 233631 233556 233491 234045 235248 236342 237083 238101
58513 238101 239792 241823 243922 246204 248575 250656 252411 254070 255492 256369 256914 257551 258119 258243 258232 258685
58497 258685 259452 259951 260239 260741 261252 261309 261302 262044 263478 265012 266914 270105 274624 279607 284710 290363 296610
58480 296610 302927 309190 315643 321897 327125 331297 335063 338507 341209 343484 346259 349729 353408 357540
58466 357540 363121 370392 378629 387562 397702 409096 421048 433280 446008 458611 469494 477662
58454 477662 483295 486588 487262 485575 482562 478862 474371 469342 464679 460778 457087 453118 448858 443996
58440 443996 437875 430504 422576 414249 404996 394854 384717 375094 365678 356411 347855 340265 333347 327157
58426 327157 322172 318275 314738 311397 308749 306743 304645 302270 300169 298435 296523 294439 292846 291791
58412 291791 290540 288889 287361 285960 284063 281816 280203 279430 278657 277691 277471 278355 279325 279490 279186 279054
58396 279054 279152 279491 280319 281438 282314 283151 284732 286974 288965 290629 292976 296395 300155 303951 308466 313903
58380 313903 319457 324832 330864 338048 345680 352995 359851 365822 369961 371967 372338 371038 367471 362162
58366 362162 356870 352497 348352 343999 340208 337547 335633 334460 334831 336737 338916 340795 343350 347251
58352 347251 351712 355979 360323 364646 367652 368425 367429 365080 360850 354688 347873 341510 335521 329928 325534
58337 325534 322437 319483 316243 313957 313427 313554 313160 312742 313190 314159 315000 316015 317615 319455 321499 324576
58321 324576 328755 332500 334578 335519 336070 335622 333427 330070 326440 322372 317531 312524 308028 303889 300016
58306 300016 296968 294793 292602 290179 288599 288323 288257 287652 287323 287906 288627 288996 289985 292151 294293 295417
58290 295417 296459 298519 300921 302520 303540 304580 305230 305171 305309 306376 307682 308613 309866 311889 313645
58275 313645 314413 315226 317027 318990 320255 321724 324450 327796 330869 334262 338625 343036 346564 350021 354395
58260 354395 359004 362917 366656 370718 373934 375256 375722 376707 377693 377656 377226 377450 377767 377236 376462 376383 376466 376032
58242 376032 376059 377696 380338 383006 386273 390947 396305 401515 407307 414277 421105 426461 431120 436179 440844
58227 440844 444034 446465 448952 450382 449737 448444 448321 448859 448888 449229 451107 453639 455461 457301 460362 463779
58211 463779 466297 468802 472559 476632 479827 483421 489033 495451 500596 505019 510438 516316 521070 525239
58197 525239 530330 535863 540592 545258 551106 557154 561989 566735 573173 580444 586787 592916 600459 608715
58183 608715 616265 624096 633686 643766 652489 661057 671584 683158 693747 704157 716186 728713
58171 728713 739781 750829 764680 780976 797749 815746 836798 859582 881500 903182 926710
58160 926710 951091 974081 996688 1021082 1045803 1067957 1088461 1110082 1132144 1152411 1172368
58149 1172368 1195149 1220025 1244500 1270076 1300023 1333206 1366220 1399949 1437768 1478892 1520038
58138 1520038 1562150 1608824 1659528 1711131 1764676 1823648 1887106 1951730 2019134 2093647 2174370
58127 2174370 2257293 2343767 2438770 2542256 2650719 2765907 2893086 3032019 3178758 3335121
58117 3335121 3506982 3694681 3895141 4112055 4353485 4620791 4910973 5228566 5583651
58108 5583651 5979769 6416451 6902474 7453643 8079404 8786463 9594817 10535815 11636888
58099 11636888 12925567 14446817 16257292 18403474 20926415 23888298 27373952 31470905
58091 31470905 36278743 41941711 48641216 56546312 65790738 76485287 88695426 102366788
58083 102366788 117238855 132701819 147537194 159764746 167042150 167680789 161599430
58076 161599430 150386607 136411692 121748879 107646093 94603353 82692174 71840077
58069 71840077 62010688 53253659 45629428 39116457 33610843 28988782 25133959 21923124
58061 21923124 19232375 16966185 15058301 13446330 12068050 10880395 9859157 8978535
58053 8978535 8208362 7530085 6936929 6417154 5952446 5532702 5157244 4820704 4511387
58044 4511387 4224205 3962308 3724980 3505688 3302681 3119957 2956721 2806395 2666815
58035 2666815 2541375 2429383 2324984 2226342 2136483 2054258 1973610 1892846 1816079 1744510 1674650
58024 1674650 1606200 1543436 1487296 1433744 1381403 1333547 1291084 1250555 1210599 1173792 1140608
58013 1140608 1107925 1074945 1044538 1017329 990348 962819 937546 915181 892740 869219 847294
58002 847294 828063 809290 790225 773080 758332 743454 727764 713796 702461 691396 679461
57991 679461 668395 658678 648141 636126 624876 615454 606219 596579 588214 581366 573889 565241 557561
57978 557561 551508 544857 536487 528061 520502 512474 503633 495764 489343 482436 474353 466971 461147 455195
57964 455195 448242 441806 436677 431468 425664 420918 417868 414697 410324 406078 402826 399311 394767 390381
57950 390381 386789 382805 377971 373657 370339 366532 361808 358118 356615 355706 353777 351402 349322 346662
57936 346662 342768 338699 335355 332071 328394 325280 323256 321275 318591 315879 313454 310361 306261 302341
57922 302341 299319 296465 293480 291326 290226 288906 286782 284893 283725 282210 279907 278039 277332 276846 276021
57907 276021 275787 276477 276720 275634 274253 273546 272908 271777 270887 270694 270342 269394 268826 269152 269348 268756 268310 268677
57889 268677 268980 268568 268319 268874 269227 268357 266733 265019 262885 260289 258352 257645 257024 255366 253106 251031
57873 251031 249032 247140 246219 246483 246762 246328 245974 246235 246171 245106 243993 243727 243602 242733 241570 240675 239392
57856 239392 237144 234778 233253 232129 230620 228997 227744 226480 224909 223701 223312 223058 222444 222134 222613
57841 222613 223148 223270 223905 225774 228014 229701 231466 234196 237319 239832 241967 244415 246886 248803 250423
57826 250423 251941 252426 251062 248543 245968 243220 239744 235959 232513 229033 225023 221227 218670 217019
57812 217019 215246 213269 211630 210163 208352 206472 205152 204211 203039 201716 200714 199981 199246 198698 198462
57797 198462 198014 197006 196011 195582 195312 194762 194521 195302 196688 197804 198585 199385 200030 200341 200920 202327 204053
57780 204053 205300 206200 207287 208435 209284 210141 211408 212707 213508 214077 214893 215768 216424 217266 218619 219943
57764 219943 220754 221626 223253 225239 226850 228288 230078 231875 233038 233826 234876 236015 236677 237008 237466 237769
57748 237769 237287 236086 234667 233131 231476 230110 229172 227979 226105 224318 223429 222926 221911 220671 220083
57733 220083 220069 219965 219930 220663 222100 223634 225285 227447 229835 231868 233796 236266 239029 241252 242798 244101
57717 244101 245064 245254 244917 244680 244437 243641 242463 241545 240786 239488 237522 235287 232705 229341 225383 221496
57701 221496 217833 214114 210449 207112 203781 200053 196437 193751 191786 189702 187490 185842 184757 183546
57687 183546 182156 181266 181038 180931 180835 181235 182148 183000 183718 184903 186722 188567 190049 191444 192993 194570
57671 194570 196184 197970 199595 200476 200653 200702 200695 200041 198435 196221 193798 191386 189354 188047 187271 186653 186353
57654 186353 186667 187121 186902 186098 185570 185646 185926 186384 187586 189643 191917 194000 196155 198578 201033 203395
57638 203395 205771 207906 209273 209898 210368 210869 211001 210657 210268 209949 209245 208019 206851 206194 205785 205196 204417
57621 204417 203663 203061 202759 202807 202844 202378 201489 200721 200291 199934 199525 199191 198792 197989 196930 196206 195997 195899 195710
57602 195710 195710 195988 196133 195850 195373 195033 194902 195011 195465 196191 196962 197723 198533 199212 199507 199566 199757 200053 200086 199779
57582 199779 199408 199107 198826 198757 199262 200426 202132 204480 207667 211665 216532 222803 230978 240965 252736
57567 252736 267221 285611 307901 333014 360159 388980 418158 444708 464876 475231 473346 458864
57555 458864 434366 404383 372965 342450 314181 289196 267879 249896 234954 223098 214038 206926
57543 206926 201058 196198 192008 187900 183687 179714 176094 172465 168722 165351 162710 160621 158879 157610
57529 157610 156869 156446 156263 156411 156641 156450 155808 155192 154756 154100 153057 151995 151132 150178 148900 147463 146012
57512 146012 144511 143158 142324 141925 141461 140818 140392 140307 140241 140134 140318 140757 140933 140709 140527 140546 140400 140034 139933
57493 139933 140166 140059 139242 138208 137436 136721 135856 135180 134895 134576 133923 133331 133114 132788 131762 130208 128664
57476 128664 127264 125896 124654 123581 122393 120958 119633 118712 117964 117122 116322 115651 114785 113536 112248 111210
57460 111210 110189 109030 108129 107771 107540 106982 106346 106015 105703 104925 103899 103238 103024 102841 102546 102357 102332 102316
57442 102316 102379 102768 103498 104298 104932 105322 105562 106025 107127 108687 109898 110261 110154 110113 109984 109270 107989 106597
57424 106597 105338 104192 103247 102618 102143 101635 101275 101349 101736 102103 102450 103017 103770 104363 104584 104494 104267 104171 104561
57405 104561 105527 106673 107553 108191 108881 109629 110182 110465 110622 110652 110332 109557 108513 107510 106712 106028 105144 103816
57387 103816 102181 100641 99370 98164 96837 95513 94393 93507 92800 92210 91515 90415 88921 87388 86015
57372 86015 84627 83100 81654 80501 79522 78533 77585 76779 76041 75310 74714 74376 74262 74346 74630 74907 74822 74349
57354 74349 73841 73473 73050 72521 72230 72358 72544 72380 71940 71499 71064 70537 70085 69951 70081 70189 70084 69767 69399
57335 69399 69273 69572 70072 70360 70395 70470 70588 70384 69771 69143 68716 68214 67448 66681 66072 65302 64154 63018 62405
57316 62405 62326 62518 62838 63095 62912 62193 61409 61004 60885 60791 60769 60892 60931 60739 60606 60748 60823 60391 59564 58760 58107
57295 58107 57493 56888 56182 55045 53399 51722 50432 49277 47815 46175 44809 43791 42896 42122 41580 41045
57279 41045 40176 39056 38028 37101 36032 34868 33910 33185 32416 31465 30401 29142 27448 25331 23145 21194
57263 21194 19476 17778 15858 13596 11147 8842 6810 4899 3074 1629 746 154 -484 -1048 -1118 -513
57246 567 1773 2768 3387 3793 4280 4771 4828 4307 3647 3280 3113 2831 2377 1804 1020 3 -1015 -1911 -2865 -4004
57226 -4004 -5136 -6217 -7658 -9790 -12323 -14699 -16742 -18652 -20623 -22793 -25280 -27953 -30451 -32671 -34912
57211 -34912 -37309 -39556 -41487 -43432 -45616 -47679 -49249 -50567 -52052 -53654 -55133 -56605 -58241 -59804
57197 -59804 -61052 -62309 -64058 -66175 -68099 -69627 -71007 -72446 -73992 -75778 -77921 -80280 -82711 -85353
57183 -85353 -88351 -91470 -94381 -97054 -99570 -101775 -103512 -104912 -106065 -106727 -106700 -106210 -105462 -104190 -102150 -99801
57167 -99801 -97954 -96932 -96497 -96402 -96546 -96769 -96990 -97428 -98278 -99299 -100066 -100492 -100773 -101023 -101242 -101461 -101616 -101496
57149 -101496 -101096 -100785 -100870 -101239 -101640 -101993 -102250 -102336 -102407 -102727 -103045 -102582 -100925 -98491 -95866 -93180 -90339 -87249
57131 -87249 -83523 -78599 -72529 -65981 -59166 -51470 -42548 -32913 -22898 -11949 345 13266 25799 37881
57117 37881 50001 62139 73929 85371 96623 107481 117631 126862 134417 138814 139078 135622 129285
57104 129285 120280 108866 96201 83438 70532 56961 43064 29683 16909 4225 -8560 -21476
57092 -21476 -34989 -49458 -64279 -78511 -92017 -105133 -117709 -129468 -140868 -152601 -164580 -176345
57080 -176345 -188084 -200304 -212886 -225439 -238225 -251769 -265928 -280231 -294735 -309746 -325243
57069 -325243 -341544 -359835 -380935 -404071 -428039 -453055 -480328 -510392 -543174 -579172 -619166
57058 -619166 -663042 -710143 -760416 -814038 -870329 -928369 -988359 -1051104 -1116503 -1183849 -1253228
57047 -1253228 -1325293 -1400002 -1476936 -1556593 -1640088 -1727845 -1819802 -1916500 -2018701 -2126410 -2239638
57036 -2239638 -2359705 -2488358 -2626047 -2772498 -2928505 -3095569 -3274110 -3463598 -3664294
57027 -3664294 -3877432 -4104007 -4344722 -4600792 -4873610 -5164124 -5473848 -5805865 -6163570
57018 -6163570 -6549256 -6965349 -7416023 -7906098 -8439462 -9020413 -9655550 -10352731 -11119602
57009 -11119602 -11965395 -12903204 -13948905 -15119869 -16437845 -17932550 -19641249 -21608157
57001 -21608157 -23889257 -26558965 -29712969 -33470915 -37984098 -43441980 -50068354 -58109714
56993 -58109714 -67822701 -79458208 -93239268 -109342604 -127892092 -148952821 -172511341
56986 -172511341 -198448665 -226519077 -256331153 -287330790 -318815231 -350000128 -380104811
56979 -380104811 -408398392 -434202848 -456886347 -475834015 -490357617 -499605532 -502637013
56972 -502637013 -498723909 -487699358 -470087495 -446943018 -419567152 -389287482 -357343580
56965 -357343580 -324828284 -292657530 -261571231 -232149634 -204820742 -179861494 -157409939
56958 -157409939 -137487017 -120016057 -104842413 -91761162 -80545687 -70965139 -62794010
56951 -62794010 -55823046 -49868252 -44770665 -40391761 -36613394 -33339183 -30490195 -27998622
56943 -27998622 -25807006 -23869970 -22151317 -20619143 -19245588 -18008941 -16891949 -15878485
56935 -15878485 -14954250 -14109256 -13336427 -12628256 -11977070 -11377387 -10825316 -10316321 -9845741
56926 -9845741 -9410672 -9009138 -8638229 -8294979 -7978150 -7687070 -7419572 -7172793 -6944473
56917 -6944473 -6730904 -6524476 -6316235 -6101363 -5881034 -5659762 -5442765 -5234887 -5039386
56908 -5039386 -4856920 -4686620 -4527793 -4379708 -4240719 -4109229 -3984985 -3868168 -3757956
56899 -3757956 -3653330 -3554474 -3461803 -3374333 -3290602 -3210537 -3134856 -3063129 -2993967 -2926758 -2861759
56888 -2861759 -2798907 -2737827 -2678623 -2621310 -2564936 -2508524 -2452453 -2397694 -2344238 -2291569 -2240158
56877 -2240158 -2191060 -2144440 -2099767 -2057072 -2016730 -1978393 -1941401 -1905909 -1872372 -1840318 -1808849
56866 -1808849 -1777941 -1748080 -1719033 -1690228 -1661896 -1634531 -1607629 -1580320 -1552957 -1526690 -1501655
56855 -1501655 -1476900 -1451954 -1427259 -1403170 -1379770 -1357611 -1337440 -1319189 -1302158 -1286094 -1271097
56844 -1271097 -1256722 -1242244 -1227645 -1213302 -1198930 -1183933 -1168588 -1153728 -1139334 -1124530 -1108915
56833 -1108915 -1092866 -1076570 -1059759 -1042372 -1024552 -1006097 -986846 -967533 -949371 -932956 -918460
56822 -918460 -906532 -897822 -891685 -886545 -881558 -876945 -872729 -868316 -863410 -858300 -853014 -847106 -840458 -833443
56808 -833443 -826164 -818314 -809918 -801480 -793329 -785486 -778101 -771269 -764444 -756874 -748624 -740441 -732656 -724980
56794 -724980 -717315 -709899 -702678 -695314 -687799 -680306 -672506 -663850 -654504 -645193 -636151 -627019 -617692 -608433
56780 -608433 -599217 -589903 -581065 -573666 -567818 -562709 -557844 -553430 -549417 -545118 -540100 -534648 -529039 -523034
56766 -523034 -516392 -509306 -502035 -494568 -486755 -478335 -468843 -458028 -446294 -434195 -421648 -408338 -394866
56753 -394866 -382772 -373479 -367786 -366128 -368357 -373222 -378982 -384692 -390244 -395195 -398479 -399470 -398513 -396162
56739 -396162 -392521 -387462 -380832 -372277 -361453 -348509 -333833 -317325 -298651 -278159 -256985 -236391
56727 -236391 -217867 -203743 -196535 -197157 -204293 -215620 -229030 -242827 -255794 -267507 -277955 -286673
56715 -286673 -292861 -296429 -298124 -298440 -297093 -293741 -288504 -281467 -272353 -260965 -247497 -232287 -215852
56702 -215852 -199272 -184090 -171798 -163800 -161456 -165197 -173604 -184208 -195235 -205930 -215538 -223295 -229451
56689 -229451 -235063 -240376 -244499 -246947 -248365 -249213 -248833 -246470 -242381 -237257 -231308 -224533 -217268 -209917 -202759
56674 -202759 -196548 -192695 -192224 -194878 -199593 -205398 -211617 -217815 -223941 -230046 -235634 -239868 -242612 -244573
56660 -244573 -246213 -247268 -247636 -247872 -248322 -248558 -248188 -247558 -247077 -246510 -245481 -244113 -242630 -240883 -238818 -236893
56644 -236893 -235479 -234262 -232799 -231238 -230055 -229423 -229224 -229317 -229468 -229439 -229396 -229777 -230474 -230736 -230129 -229027 -227847
56627 -227847 -226467 -224783 -223184 -221937 -220727 -219267 -217851 -216777 -215793 -214582 -213294 -212135 -210914 -209457
56613 -209457 -207990 -206650 -205164 -203419 -201787 -200417 -198800 -196600 -194355 -192727 -191574 -190377 -189133 -188153
56599 -188153 -187366 -186471 -185506 -184672 -183864 -182855 -181714 -180639 -179654 -178828 -178375 -178174 -177653 -176565 -175434 -174746 -174183
56582 -174183 -173188 -171829 -170556 -169461 -168358 -167258 -166240 -165177 -164086 -163405 -163397 -163577 -163210 -162160 -160851 -159683
56566 -159683 -158843 -158330 -157820 -156865 -155537 -154462 -153890 -153287 -152186 -150872 -149743 -148631 -147312 -146112 -145333 -144586
56550 -144586 -143373 -141922 -140730 -139692 -138339 -136670 -135108 -133897 -133088 -132784 -132828 -132607 -131721 -130537 -129571 -128764
56534 -128764 -127932 -127447 -127739 -128489 -129062 -129415 -129894 -130429 -130646 -130528 -130297 -129893 -129221 -128641 -128535 -128617 -128372 -127928 -127788
56515 -127788 -127922 -127875 -127618 -127555 -127757 -127880 -127770 -127554 -127182 -126475 -125582 -124827 -124196 -123463 -122723 -122253 -121954 -121445 -120635
56496 -120635 -119773 -119059 -118616 -118610 -118973 -119211 -118931 -118299 -117585 -116636 -115318 -114072 -113392 -113096 -112737 -112392 -112328 -112232 -111579
56477 -111579 -110540 -109730 -109240 -108651 -107884 -107246 -106736 -106042 -105178 -104419 -103692 -102715 -101630 -100803 -100045 -98759 -96836
56460 -96836 -94728 -92635 -90290 -87557 -84591 -81380 -77736 -73817 -70123 -66976 -64464 -62766 -62004 -61818 -61654
56445 -61654 -61368 -61060 -60569 -59739 -58951 -58710 -58849 -58865 -58839 -59228 -59892 -60210 -60138 -60289 -60858 -61305 -61261 -61051 -61079 -61366 -61878
56424 -61878 -62722 -63811 -64807 -65555 -66144 -66500 -66391 -65902 -65441 -65242 -65252 -65425 -65683 -65732 -65428 -65166 -65391 -65927 -66363
56405 -66363 -66855 -67818 -69020 -69790 -70014 -70131 -70213 -69880 -69163 -68633 -68597 -68863 -69319 -70026 -70694 -70821 -70444 -70029 -69637
56386 -69637 -68894 -67860 -67069 -66670 -66279 -65819 -65659 -65790 -65687 -65189 -64750 -64539 -64096 -63201 -62371 -62120 -62311 -62595 -62887
56367 -62887 -63118 -63055 -62674 -62292 -62092 -61911 -61640 -61424 -61326 -61204 -60976 -60641 -60118 -59449 -59043 -59129 -59196 -58596 -57576 -56943
56347 -56943 -56825 -56550 -55702 -54492 -53119 -51619 -50387 -49953 -50152 -50296 -50267 -50586 -51374 -52131 -52642 -53146 -53481 -53072
56329 -53072 -52023 -51275 -51346 -51756 -51974 -52066 -52119 -51914 -51542 -51500 -51853 -52071 -51968 -51948 -52103 -51943 -51353 -50829 -50419 -49438
56309 -49438 -47709 -46120 -45339 -44911 -44233 -43558 -43324 -43242 -42833 -42260 -41933 -41786 -41563 -41346 -41260 -41077 -40581 -39941 -39363
56290 -39363 -38792 -38266 -38064 -38186 -38206 -37859 -37263 -36437 -35263 -34043 -33359 -33171 -32869 -32353 -32157 -32266 -31887 -30777
56272 -30777 -29760 -29374 -29053 -28254 -27452 -27284 -27572 -27918 -28437 -29152 -29424 -28804 -27803 -27085 -26536 -25799 -25080 -24664
56254 -24664 -24262 -23537 -22740 -22137 -21375 -20177 -19077 -18735 -18945 -19028 -18781 -18372 -17754 -16812 -15785 -14971 -14351 -13906
56236 -13906 -13840 -14122 -14275 -14066 -13811 -13667 -13214 -12201 -11027 -10048 -9052 -7868 -6793 -5940 -4872 -3363 -1819
56219 -1819 -508 861 2318 3282 3606 4040 5060 6127 6776 7510 8857 10461 11977 13939 16780 19774
56203 19774 21986 23591 25347 27391 29511 31932 34842 37718 40053 42255 44894 47641 49875 51809
56189 51809 54076 56660 59093 61357 63756 66392 69409 73214 77772 82296 86392 90781 96096 101803
56175 101803 107190 112650 118911 125722 132442 139301 146929 155159 163487 172262 182339 193911 206692
56162 206692 220887 236938 254723 273976 295177 319127 346053 375995 409565 447418 489447
56151 489447 535435 585970 641796 702779 768466 839014 914521 993947 1075763 1159136 1243426
56140 1243426 1327013 1407714 1483892 1554071 1615962 1667052 1705812 1731460 1743143 1740484 1724404
56129 1724404 1696267 1656719 1606445 1547408 1482076 1411952 1338083 1262406 1187142 1113234 1040726
56118 1040726 970290 903022 839106 778080 720223 666400 616775 570898 528772 490586 455662
56107 455662 422939 392293 364305 339009 315979 295205 276691 259624 243197 227843 214434
56096 214434 202738 191959 182259 174263 167515 160932 154489 148983 144406 140032 135826 132352 129503 126740
56082 126740 124274 122609 121244 119295 117091 115614 114766 113698 112523 112014 111912 111282 110350 110249 111018 111603
56066 111603 111796 112489 113928 115383 116643 118302 120468 122627 124824 127584 130722 133640 136668 140654 145454
56051 145454 150314 155477 161836 169275 177062 185625 196119 208462 221655 235921 252674 272415 294582
56038 294582 319426 348002 380159 414376 449697 485970 522073 555835 585989 612534 635176
56027 635176 653340 667841 680596 692296 701984 708916 713073 713875 710440 703342 694293 683968 671842
56014 671842 657969 642801 625238 603063 575609 544184 510001 473846 437671 404063 373831
56003 373831 346224 321502 300901 284046 269046 255523 245006 237881 232449 227535 223607 220795
55991 220795 218196 215760 214574 214706 214953 215082 216037 217672 218730 219353 221044 223845 226253 228184 231170
55976 231170 235228 238604 241125 244705 249841 254749 258801 263639 269866 275816 280748 286185 292842 299213
55962 299213 304410 309527 314965 319307 322092 324817 328056 330522 332043 334399 338025 341074 342972 345686
55948 345686 350182 354917 359187 364558 371569 378422 384486 391611 400421 408831 415910 423563 432659 441167
55934 441167 448097 455584 465019 474750 483691 493547 505366 517612 529765 544028 561199 578693 594945
55921 594945 611842 630480 648619 664941 681706 700532 719588 737668 756797 778076 799217
55910 799217 819151 840684 865568 891416 916599 943571 974021 1005492 1036296 1069067 1105814
55899 1105814 1144247 1182707 1223829 1269447 1316894 1364293 1414379 1469078 1525779 1583138 1644873
55888 1644873 1713352 1785343 1858839 1937888 2025591 2118823 2215376 2319681 2435542 2559908 2690142
55877 2690142 2830632 2985759 3153437 3332520 3529168 3748638 3988528 4247847 4534731
55868 4534731 4857156 5214844 5609322 6053041 6559378 7133837 7785865 8539580 9422439
55859 9422439 10455260 11665779 13099235 14801567 16806191 19154083 21914153 25170182
55851 25170182 29010327 33555009 38975165 45449507 53112000 62057716 72357329 83992634
55843 83992634 96743916 110102286 123164281 134490225 142178078 144454236 140576322
55836 140576322 131321312 118581439 104425367 90397188 77392408 65843580 55880485
55829 55880485 47427478 40315932 34375863 29447530 25363106 21965491 19135525 16779421
55821 16779421 14805469 13133231 11710419 10500142 9461462 8557089 7767627 7081558
55813 7081558 6479764 5942935 5464518 5042762 4667547 4326835 4018473 3744009 3497440
55804 3497440 3270566 3063098 2877312 2708503 2550296 2403958 2273257 2155044 2043567
55795 2043567 1939399 1845743 1760210 1678252 1600802 1530925 1466638 1404240 1345139 1292439 1244125
55784 1244125 1196355 1150309 1109351 1072471 1036743 1003351 975037 950257 925693 901944 881103
55773 881103 861232 838782 814192 789854 764909 737294 708657 682113 657122 631595 606979
55762 606979 586278 568819 551746 535054 520641 508035 495494 483741 474378 466192 457171 448421
55750 448421 441945 436230 428261 418397 409066 400148 389856 378899 369542 361600 353190 344473 336952 330180
55736 330180 322780 315576 310130 305305 298924 291723 286074 281806 276891 271305 266612 262597 257907 253275
55722 253275 250609 249483 247839 245512 243843 242501 239970 236606 234018 231986 229100 225875 224084 223540
55708 223540 222599 221384 221461 222789 223988 225246 227938 231687 234709 236770 238987 241010 241275 239800 237989
55693 237989 235877 232255 227255 222142 216859 210466 203754 198660 195229 191811 188129 185477 183984 182322
55679 182322 180074 177891 175333 171189 165991 161715 158938 156622 154650 154019 154449 154348 153374 152686 152406 151212
55663 151212 148707 145960 143389 140262 136560 133245 130417 127231 123852 121454 120109 118649 116785 115358
55649 115358 114309 112470 109614 106807 104484 102027 99415 97339 95554 93006 89800 87173 85377 83435
55635 83435 81100 79156 77669 75931 74224 73664 74065 73982 73107 72660 73123 73555 73479 73460 73476 72662 71116 70072
55617 70072 69833 69340 68184 67208 66740 66086 65179 64870 65113 64706 63393 62394 62339 62473 62416 62842 63810 64300 64164
55598 64164 64688 66384 67921 68118 67415 66535 65254 63475 62041 61513 61356 61142 61371 62343 63475 64455 65864
55581 65864 67931 69881 71229 72565 74407 76380 78151 80054 82139 83716 84432 84752 84876 84283 82829
55566 82829 81198 79775 78237 76690 75999 76443 77178 77529 77694 77782 77444 76941 77294 78752 80283 81119 81600
55549 81600 81969 81591 80062 77914 75572 72679 69056 65285 61785 58362 55131 52724 51103 49331 47058
55534 47058 45028 43678 42465 41141 40293 40030 39509 38515 38111 38879 39801 39833 39382 39251 39270 39055 39052 39688 40322
55515 40322 40098 39147 38080 37007 35837 34816 34002 32947 31569 30554 30233 29990 29408 29057 29349 29579 29013
55498 29013 28065 27483 27192 26843 26756 27293 27921 27831 26989 25818 24422 22907 21876 21786 22246 22640 22950 23378 23703
55479 23703 23717 23778 24283 24992 25464 25704 25933 26161 26421 26930 27685 28405 29128 30204 31494 32372 32783 33393 34432
55460 34432 35326 35811 36324 36850 36561 35210 33764 32957 32341 31533 31210 31882 32718 32692 32081 31752 31768 31741 31897
55441 31897 32655 33714 34549 35338 36471 37604 38137 38208 38340 38504 38306 37732 36962 35856 34309 32670 31219
55424 31219 29708 27995 26544 25622 24626 22971 21069 19666 18737 17787 16766 15948 15325 14789 14471 14335 13975
55407 13975 13356 13119 13534 13871 13495 12882 12755 12924 12813 12531 12472 12452 12098 11626 11414 11335 11252 11603 12618 13572
55387 13572 13720 13443 13557 14028 14332 14570 15144 15776 15860 15512 15309 15275 15064 14818 14938 15206 15024 14326 13523 12792
55367 12792 12145 11853 12040 12198 11839 11279 11048 10999 10761 10574 10746 10800 10174 9364 9316 9992 10567 10779 11014 11307
55347 11307 11334 11253 11486 11764 11432 10693 10482 11073 11732 11882 11758 11749 11836 11871 11787 11474 10962 10662 10878 11259 11306 11176
55325 11176 11367 11840 12202 12459 12826 13039 12730 12293 12505 13381 14260 14903 15616 16365 16704 16610 16569 16742 16812 16700
55305 16700 16711 16902 17042 17189 17584 17958 17719 16904 16221 16033 15950 15561 14917 14244 13730 13621 13952 14201 13826 13073
55285 13073 12676 12781 12845 12567 12204 11935 11596 11157 10865 10831 11006 11530 12540 13600 13944 13366 12394 11579 11103
55266 11103 11007 11259 11597 11796 12014 12447 12841 12879 12818 13107 13576 13690 13412 13117 12801 12173 11414 11037 11008 10791
55246 10791 10264 9837 9692 9643 9750 10246 10790 10596 9512 8297 7630 7482 7538 7623 7573 7271 6926 6858 7003 7122
55226 7122 7376 8044 8801 9024 8743 8534 8499 8214 7712 7633 8192 8820 9050 9092 9283 9662 10268 11235 12355 13156
55206 13156 13558 13884 14124 13863 13059 12233 11686 11196 10645 10329 10402 10627 10831 11102 11390 11523 11657 12118 12682
55187 12682 12705 12096 11488 11344 11538 11916 12500 12978 12817 12144 11771 12057 12460 12494 12394 12470 12511 12247 11835 11462
55167 11462 11053 10635 10476 10531 10313 9696 9299 9711 10828 12189 13478 14352 14414 13756 13068 12831 12825 12710 12582
55148 12582 12616 12638 12439 12134 11897 11725 11689 11993 12531 12832 12697 12454 12360 12271 12111 12124 12351 12380 11945 11319 10811
55127 10811 10365 9962 9897 10271 10668 10739 10706 10907 11251 11473 11583 11673 11608 11285 10937 10870 11115 11548 12054 12400 12339
55106 12339 12025 11964 12308 12600 12432 11944 11448 10980 10522 10308 10544 11079 11619 11967 11949 11433 10687 10342 10752 11653
55086 11653 12589 13345 13807 13803 13374 12917 12834 13164 13654 13997 14026 13930 14234 15198 16353 16983 16987 16774 16506 16039 15540
55065 15540 15471 15889 16404 16832 17266 17544 17390 17105 17321 17966 18279 17998 17706 17774 17839 17586 17217 16814 16121 15311
55045 15311 15100 15674 16293 16415 16400 16609 16702 16418 16252 16598 16934 16588 15746 15029 14588 14284 14231 14473 14545 14058
55025 14058 13343 12983 13107 13597 14487 15605 16333 16336 16094 16164 16401 16437 16411 16632 16933 17005 16936 16871 16635 16292 16502
55004 16502 17647 19047 19795 19957 20194 20646 20955 21026 20955 20506 19457 18292 17789 18075 18721 19527 20514 21386
54986 21386 21796 22012 22617 23596 24370 24687 24846 25081 25276 25326 25257 25048 24743 24620 24850 25148 25148 24970 24933 24973 24793
54965 24793 24428 24165 24098 24181 24462 24825 24783 24071 23200 22894 23155 23447 23554 23654 23698 23372 22653 21878 21252 20711
54945 20711 20189 19702 19256 18959 19040 19465 19805 19816 19759 19853 19849 19590 19487 19856 20229 19982 19286 18769 18588 18545 18757
54924 18757 19424 20155 20343 20035 19732 19530 19180 18836 18895 19207 19235 18989 19046 19595 20199 20536 20736 20876 20787 20466
54904 20466 20175 20067 20174 20657 21552 22380 22617 22496 22724 23444 24114 24369 24365 24245 23907 23398 22998 22787 22617 22525
54884 22525 22707 23088 23369 23481 23565 23591 23485 23494 23888 24448 24771 24953 25366 25923 26208 26202 26186 26067 25525 24756 24369
54863 24369 24529 24898 25351 26041 26775 27110 27086 27146 27288 27100 26640 26502 26899 27463 28013 28728 29439 29625 29309 29125
54843 29125 29280 29300 29064 29182 29992 31009 31806 32654 33770 34687 34996 35114 35727 36917 38397 40160 42401
54826 42401 45138 48321 52002 56047 60050 63807 67460 70870 73359 74451 74403 73627 72055 69536 66434
54811 66434 63308 60241 56951 53354 49697 46311 43528 41556 40183 38856 37334 35954 35041 34428 33880
54796 33880 33623 34032 35014 36083 36905 37457 37834 38147 38545 39116 39925 41195 43242 46095 49422 52907 56492
54779 56492 60189 63940 67708 71350 74364 76143 76587 76060 74680 72172 68586 64655 61104 57997 55015
54764 55015 52003 48942 45755 42523 39632 37390 35690 34223 32833 31529 30389 29584 29238 29190 29148 29109
54748 29109 29286 29616 29754 29592 29298 28833 28012 27127 26842 27251 27647 27518 27144 26883 26520 25806 25053 24661 24492
54729 24492 24265 24147 24400 24781 24851 24615 24378 24215 24077 24171 24746 25645 26496 27199 27839 28331 28542 28616 28770 28925
54709 28925 28886 28730 28634 28509 28193 27896 28044 28733 29657 30526 31287 31944 32440 32699 32651 32334 32024 32070 32451 32748
54689 32748 32712 32567 32567 32595 32438 32218 32196 32462 33077 34260 36038 37968 39565 40870 42259 43880 45640 47609
54671 47609 50030 53007 56461 60332 64508 68587 72056 74709 76700 78148 78863 78470 76782 74073 71019
54656 71019 68199 65648 63024 60200 57371 54619 51761 48748 45868 43388 41309 39672 38711 38471 38599
54641 38599 38739 38905 39252 39788 40500 41459 42591 43643 44588 45739 47274 49004 50783 52784 55151 57772
54625 57772 60629 63889 67383 70446 72652 74256 75506 76013 75288 73492 71095 68157 64544 60577 56849
54610 56849 53544 50491 47748 45582 43968 42587 41317 40300 39608 39186 39011 38972 38724 38025 37137 36529 36331
54593 36331 36362 36499 36662 36649 36348 35943 35573 34995 34003 32921 32257 32024 31857 31581 31208 30600 29664 28786 28502
54574 28502 28776 29073 29083 28930 28751 28539 28368 28298 28072 27392 26480 25918 25911 26137 26320 26520 26822 27152 27473 27781
54554 27781 27862 27450 26703 26151 26102 26412 26887 27555 28391 29063 29164 28631 27912 27726 28473 29713 30474 30319 29851
54535 29851 29851 30223 30282 29846 29427 29400 29591 29739 29854 29999 30151 30404 30914 31527 31839 31725 31448 31228 31016 30833
54515 30833 30894 31241 31554 31515 31204 30949 30949 31106 31097 30659 29930 29459 29661 30348 30999 31380 31596 31700 31616 31392 31167
54494 31167 30923 30593 30384 30617 31231 31796 32018 31965 31799 31632 31591 31715 31789 31609 31356 31367 31595 31690 31558 31444 31476
54473 31476 31540 31631 31901 32341 32799 33301 33940 34469 34503 34130 33842 33749 33439 32748 32123 31972 32152 32391 32755 33346
54453 33346 33908 34143 34170 34308 34601 34874 35136 35625 36491 37661 38930 40092 41042 41841 42584 43181 43385 43081
54435 43081 42412 41667 41156 41120 41502 41809 41510 40585 39446 38403 37502 36819 36486 36382 36206 35967 35999 36364 36651
54416 36651 36560 36329 36316 36459 36425 36029 35325 34462 33682 33267 33277 33469 33595 33649 33696 33669 33476 33181 32959 32938 33134 33409
54394 33409 33547 33522 33629 34144 34903 35531 35978 36485 37072 37460 37538 37485 37389 37214 37162 37569 38272 38645 38503 38453 39035
54373 39035 39981 40724 41171 41569 41956 42257 42652 43320 44043 44472 44616 44617 44294 43440 42462 42092 42435 42822 42760 42558
54353 42558 42764 43357 43803 43713 43118 42270 41419 40771 40435 40319 40210 40019 39909 40114 40683 41452 42215 42823 43131
54334 43131 43004 42483 41845 41367 41073 40835 40611 40460 40351 40160 39828 39393 38890 38364 37961 37852 38058 38505 39189
54315 39189 40125 41156 42022 42619 43028 43376 43804 44452 45221 45676 45491 44978 44782 45098 45515 45694 45793 46101 46611
54296 46611 47149 47633 47974 47973 47551 46970 46628 46747 47268 47921 48356 48420 48331 48387 48492 48286 47764 47428 47649 48212 48694
54275 48694 49038 49506 50276 51323 52571 53928 55290 56626 57968 59250 60315 61203 62223 63589 65114
54260 65114 66398 67168 67362 67033 66324 65414 64441 63534 62890 62546 62097 60973 59135 57197 55713 54626 53597
54243 53597 52588 51818 51333 50928 50460 50028 49850 50049 50475 50717 50423 49678 48894 48343 48010 47946 48385 49323 50275
54224 50275 50742 50727 50559 50374 50074 49713 49583 49859 50298 50435 50055 49427 49011 48924 48810 48349 47713 47297 47149 46971
54204 46971 46630 46279 45977 45594 45184 45060 45313 45563 45449 45098 44972 45391 46310 47372 48058 48047 47550 47076 46857
54185 46857 46739 46676 46912 47535 48232 48674 48835 48743 48306 47596 47004 46781 46711 46479 46150 46002 46136 46486 46986 47486
54165 47486 47712 47606 47541 47924 48765 49808 50915 52067 53192 54227 55198 56106 56863 57484 58119 58727 59020 58867
54147 58867 58473 57992 57330 56554 56087 56147 56333 56165 55715 55321 54938 54289 53461 52865 52663 52674 52808 53171 53734 54254
54127 54254 54566 54702 54701 54573 54464 54607 55021 55416 55404 54781 53667 52448 51497 50870 50384 50002 49867 49880 49630 48953
54107 48953 48288 48161 48520 48893 48989 48860 48637 48388 48162 47945 47707 47638 48132 49281 50614 51573 52046 52225 52233 52135
54087 52135 52110 52234 52301 52147 51943 51898 51906 51813 51780 52012 52337 52434 52291 52111 51929 51708 51611 51748 51844 51579 51115 50841
54065 50841 50713 50359 49760 49332 49299 49391 49286 48994 48743 48695 48806 48819 48448 47746 47163 47027 47151 47171 47088 47149 47423
54044 47423 47802 48206 48494 48438 48141 48165 48820 49593 49803 49573 49574 50011 50505 50880 51395 52164 52949 53604 54241 54861
54024 54861 55350 55824 56576 57607 58699 59945 61710 64015 66460 68809 71189 73673 76166 78741 81527
54009 81527 84170 85949 86609 86581 86211 85258 83366 80602 77348 74098 71484 69960 69221 68360 66874 65126
53993 65126 63639 62427 61289 60320 59705 59363 59098 58900 58803 58735 58705 58864 59158 59263 59061 58868 58930 59038 58918
53974 58918 58694 58632 58724 58833 58990 59236 59404 59402 59491 59924 60496 60770 60639 60357 60153 60052 59988 59840 59486 59007 58724
53953 58724 58836 59195 59640 60331 61481 62951 64421 65812 67199 68443 69324 70024 71046 72569 74205 75556
53937 75556 76740 78125 79794 81531 83271 85225 87490 89810 91959 94181 96968 100375 103831 106725
53923 106725 108972 110850 112511 113893 114966 115775 116290 116460 116427 116493 116892 117615 118367 118574 117694 115749 113408
53906 113408 111291 109343 107181 104780 102462 100356 98364 96522 94927 93397 91671 89949 88703 87928
53892 87928 87137 86162 85377 84963 84521 83698 82719 81984 81505 81076 80700 80535 80697 81330 82590 84313 86023 87540
53874 87540 89355 92112 95923 100399 105094 109645 113636 116592 118064 117675 115300 111329 106549 101696 97272
53859 97272 93701 91215 89498 87914 86291 85079 84581 84460 84289 84079 83977 83878 83773 84041 84953 86217 87461
53842 87461 88835 90623 92571 94190 95546 97155 99186 101352 103566 106152 109274 112582 115582 118020
53828 118020 119833 121061 121937 122813 123815 124751 125476 126189 127250 128792 130603 132376 134048 135862 138009
53813 138009 140279 142315 144221 146619 149932 153869 157822 161460 164707 167415 169471 171060 172432 173456
53799 173456 173742 173188 172112 170874 169651 168551 167634 166742 165555 163886 161812 159510 157087 154527 151652
53784 151652 148223 144255 140156 136409 133137 130142 127255 124438 121648 118873 116254 113984 112091 110474
53770 110474 109075 107814 106438 104729 102816 101035 99480 97939 96266 94563 92922 91279 89614 88103
53756 88103 86887 85841 84730 83516 82360 81398 80617 79944 79323 78660 77855 76955 76232 75931 75975 76041 75954 75836
53738 75836 75836 75934 76176 76791 77779 78575 78579 77936 77413 77455 77813 78111 78332 78556 78628 78355 77786 77102 76495 76259 76653
53717 76653 77469 78105 78331 78634 79501 80684 81564 81972 82238 82625 83167 83952 85101 86485 87834 89181 90899
53700 90899 93239 96024 98843 101435 103889 106581 109835 113524 117079 119996 122225 124015 125581 127011
53686 127011 128263 129079 129110 128324 127133 125957 124874 123834 122924 122193 121459 120578 119644 118709 117544 115971 114147
53669 114147 112241 110123 107723 105382 103424 101632 99639 97603 95987 94810 93662 92400 91279 90379
53655 90379 89443 88383 87494 86983 86643 86122 85282 84195 83006 81897 81002 80342 79935 79882 80145 80399 80400 80336 80499
53636 80499 80752 80705 80323 79966 79825 79741 79570 79374 79209 79067 79052 79299 79723 80138 80604 81291 82060 82585 82905 83384
53616 83384 84098 84711 85078 85509 86253 87114 87834 88524 89457 90669 92009 93398 94844 96329 97809 99242 100604
53599 100604 101995 103668 105719 107751 109171 109843 110195 110681 111447 112509 113841 115171 116118 116703 117381 118384
53583 118384 119375 119976 120307 120690 121106 121268 121076 120674 120162 119572 119084 118967 119242 119560 119503 118985 118366 118159 118532
53564 118532 119110 119340 119080 118674 118480 118527 118678 118934 119382 119976 120505 120767 120703 120427 120169 120145 120440 121004 121721 122434
53544 122434 122969 123205 123134 122819 122402 122134 122228 122564 122768 122711 122721 123176 124086 125320 126908 128829 130771 132522
53526 132522 134376 136673 139115 141037 142271 143209 144032 144503 144571 144573 144663 144622 144484 144828 146032 147630 148826 149418
53508 149418 149876 150667 151852 153227 154597 155882 157101 158270 159349 160397 161685 163412 165365 167151 168746
53493 168746 170440 172181 173413 173745 173441 173051 172844 172800 172871 172995 173085 173181 173412 173703 173760 173501 173173 172856 172213
53474 172213 170977 169413 167959 166683 165432 164311 163605 163278 162908 162160 161096 160013 159148 158538 158043 157467
53458 157467 156756 156085 155680 155604 155729 155860 155860 155703 155434 155072 154616 154214 154154 154538 155108 155626 156211 157015 157783 158200
53438 158200 158526 159335 160597 161605 161934 161960 162248 162965 164124 165903 168335 171073 173810 176589 179441 182113
53422 182113 184567 187413 191372 196517 202348 208407 214447 220252 225751 231255 237228 243836 250875 258020
53408 258020 265002 271772 278718 286455 295158 304323 313444 322642 332326 342514 352868 363213 373588
53395 373588 383945 394169 404309 414456 424491 434257 443778 453053 461833 469968 477827 485961 494467
53382 494467 503058 511590 520129 528594 536810 544863 552972 561058 568878 576542 584420 592475 600170 607128
53368 607128 613446 619217 624176 628107 631237 633883 635940 637018 636908 635656 633263 629656 624950 619533
53354 619533 613764 607704 601261 594517 587775 581226 574702 567879 560634 553039 545079 536680 528026 519538
53340 519538 511399 503401 495410 487675 480424 473442 466390 459405 453046 447763 443703 440902 439314 438667
53326 438667 438555 438733 439151 439776 440565 441578 442926 444696 447068 450333 454548 459308 464120 468918 474004
53311 474004 479632 485937 493091 501131 509709 518388 527184 536460 546334 556578 567143 578340 590425
53298 590425 603341 617050 631784 647786 665011 683293 702558 722712 743461 764507 785914
53287 785914 808109 831459 855825 880575 905094 929294 953534 978009 1002430 1026401 1049861
53276 1049861 1072895 1095289 1116600 1136586 1155303 1172808 1189015 1203778 1216915 1228210 1237595
53265 1237595 1245165 1250781 1253895 1254193 1252184 1248586 1243165 1234838 1223045 1208371 1191630 1172946 1152259
53252 1152259 1130218 1107915 1085870 1063816 1041460 1019042 997006 975531 954562 934133 914418
53241 914418 895490 877157 859079 841066 823198 805632 788345 771199 754239 737780 722160
53230 722160 707514 693829 681108 669367 658594 648764 639872 631873 624632 618001 611918 606354 601160
53217 601160 595980 590415 584302 577831 571301 564807 558241 551605 545137 539088 533564 528674 524604 521361
53203 521361 518632 516141 514082 512921 512819 513448 514373 515427 516739 518589 521251 524873 529453 534942 541266
53188 541266 548244 555733 563902 573116 583333 593912 604324 614757 625625 636728 647411 657406
53176 657406 666970 676186 684685 692207 698901 704872 709838 713474 715770 716809 716510 714840 711995 708150
53162 708150 703247 697247 690360 682739 674210 664570 654040 643117 632080 620886 609448 597766 585814
53149 585814 573568 561198 549028 537198 525486 513522 501172 488669 476431 464741 453633
53138 453633 443014 432754 422622 412311 401741 391280 381465 372496 364160 356189 348486 340976 333584
53125 333584 326469 320076 314724 310293 306429 302968 299979 297467 295169 292663 289604 285858 281439 276340
53111 276340 270486 263929 257026 250289 244024 238180 232511 226805 221017 215318 210024 205357 201291 197696
53097 197696 194499 191538 188409 184703 180401 175815 171254 166916 162995 159558 156312 152833 149082 145405
53083 145405 141993 138681 135343 132145 129251 126558 123935 121471 119336 117531 115957 114577 113395 112440
53069 112440 111796 111494 111314 110941 110371 109882 109517 108948 107987 106910 106028 105235 104290 103314 102685 102516 102537 102424 102022
53050 102022 101333 100503 99788 99356 99132 98941 98736 98573 98469 98405 98367 98309 98196 98177 98487 99033 99341 99166 98975 99467
53030 99467 100687 101949 102614 102679 102521 102387 102299 102259 102329 102505 102669 102756 102901 103345 104100 104843 105288 105621 106325 107509
53010 107509 108618 109006 108632 107987 107481 107113 106711 106206 105636 105070 104609 104314 104083 103723 103244 102946 103053 103339
52992 103339 103307 102750 101987 101466 101280 101228 101186 101144 100908 100178 99058 98204 98124 98536 98684 98175 97236 96261 95459 94933
52972 94933 94759 94871 95097 95338 95526 95476 95079 94629 94602 95036 95448 95428 95018 94396 93606 92754 92132 91873 91721 91401
52952 91401 91027 90906 91117 91520 91991 92464 92875 93284 93879 94722 95621 96433 97256 98133 98803 99007 98871 98691 98487
52933 98487 98080 97527 97137 97093 97268 97410 97331 96987 96581 96524 97089 98136 99306 100361 101131 101339 100841 100008 99505
52914 99505 99612 100014 100289 100368 100402 100467 100552 100669 100779 100725 100421 100058 99923 100055 100248 100444 100920 101920 103188 104090
52894 104090 104260 103962 103758 103989 104630 105458 106139 106347 106088 105802 105857 106028 105810 105216 104852 105126 105759 106258 106522
52875 106522 106740 106980 107182 107401 107761 108258 108782 109254 109628 109877 110082 110415 110923 111491 112064 112723 113472 114158 114687
52856 114687 115062 115123 114607 113677 113023 113101 113539 113620 113154 112548 112194 112145 112296 112523 112633 112469 112052 111474 110768 110026
52836 110026 109466 109141 108749 108030 107227 106827 106950 107285 107568 107826 108153 108535 108905 109147 109097 108741 108329 108109 108011
52817 108011 107840 107661 107679 107855 107959 107942 107934 107899 107682 107399 107401 107762 108127 108166 107893 107437 106808 106071 105491 105276 105310 105306
52795 105306 105117 104765 104320 103923 103834 104264 105125 106081 106878 107566 108337 109173 109761 109802 109330 108605 107797 106946 106202
52776 106202 105824 105879 106167 106521 106941 107339 107493 107429 107562 108200 109169 110208 111436 113071 114856 116184 116747 116738
52758 116738 116503 116288 116178 115963 115145 113441 111238 109186 107424 105606 103605 101749 100299 99145 98160 97464
52742 97464 97122 96877 96413 95741 95132 94795 94707 94669 94495 94220 94109 94352 94811 95231 95564 95934 96363 96795 97241 97661
52722 97661 97828 97623 97294 97094 96826 96233 95679 95873 96924 98269 99642 101431 103772 105880 106764 106317 105289
52705 105289 104368 103655 102854 101657 100015 98261 96872 95937 95017 93720 92235 91084 90471 90116 89701 89291
52689 89291 89280 89970 91183 92314 92871 92947 93007 93267 93531 93666 93839 94167 94464 94519 94405 94281 94127 93908 93809 94020
52669 94020 94412 94695 94781 94791 94788 94738 94670 94660 94672 94580 94340 93974 93436 92680 91866 91337 91312 91731 92419 93320 94490 95887
52647 95887 97290 98411 99116 99518 99880 100427 101205 102043 102692 103084 103469 104171 105202 106279 107228 108144 109076 109812
52629 109812 110219 110513 110925 111273 111214 110788 110328 109906 109286 108409 107548 106921 106475 106135 105924 105775 105555 105349 105412
52610 105412 105728 105921 105755 105455 105365 105535 105794 106004 106097 106085 106140 106455 106921 107155 106970 106584 106267 106015 105698 105300
52590 105300 104885 104542 104459 104786 105315 105549 105239 104640 104094 103670 103362 103309 103547 103742 103500 102810 102003 101362 100977
52571 100977 100833 100845 100867 100830 100823 100972 101318 101837 102466 103044 103414 103630 103906 104352 104951 105770 106942 108412 109965
52552 109965 111533 113152 114597 115439 115543 115198 114643 113881 113030 112415 112110 111806 111357 111010 110901 110745 110375 110142
52534 110142 110387 110895 111284 111596 112089 112740 113452 114453 115931 117448 118201 117838 116649 115118 113642 112527
52518 112527 111813 111140 110150 108936 107856 107069 106582 106482 106712 106827 106445 105834 105599 105883 106298 106517 106485 106189
52500 106189 105718 105486 105867 106625 107207 107559 108121 108986 109666 109821 109682 109576 109530 109556 109872 110554 111331 111995 112700
52481 112700 113606 114515 115089 115234 115045 114625 114153 113898 113947 114060 113971 113638 113154 112584 112067 111813 111831 111858 111692 111441
52461 111441 111254 111035 110620 110084 109658 109439 109349 109273 109069 108559 107710 106803 106242 106186 106446 106749 107025 107431 108078 108770
52441 108770 109088 108822 108247 107859 107880 108136 108373 108495 108509 108476 108530 108765 109060 109192 109116 108986 108888 108787 108781 109139 109947
52420 109947 110909 111628 111974 112070 112077 112147 112449 113087 114014 115072 116115 117040 117829 118623 119629 120880 122118 122959
52402 122959 123152 122674 121669 120350 118895 117431 116088 115008 114214 113570 112960 112393 111842 111136 110232 109468 109251
52385 109251 109513 109735 109507 108838 107986 107262 107014 107452 108349 109220 109873 110571 111528 112567 113439 114212 115116 116191
52367 116191 117323 118474 119617 120602 121290 121786 122330 122981 123592 124077 124498 124903 125188 125157 124642 123583 122079
52350 122079 120389 118780 117352 116015 114663 113353 112313 111731 111514 111293 110761 109997 109360 109063 108951 108716
52334 108716 108258 107775 107535 107585 107696 107653 107587 107872 108608 109354 109593 109344 109104 109258 109794 110550 111386 112060 112253 111959
52314 111959 111649 111816 112494 113354 114238 115341 116923 118974 121262 123642 126237 129234 132532 135761 138717
52299 138717 141602 144574 147164 148448 147929 146015 143576 141198 138932 136565 133956 131198 128595 126453
52285 126453 124887 123892 123503 123724 124288 124721 124756 124544 124426 124638 125246 126208 127355 128483 129515 130493 131412 132231
52267 132231 133074 134176 135541 136845 137802 138430 138888 139255 139604 140076 140650 141044 141028 140760 140602 140716 141056 141619
52249 141619 142479 143573 144684 145645 146421 146973 147247 147334 147508 148026 148915 150016 151171 152329 153513 154700 155843
52232 155843 156989 158349 160149 162405 164935 167600 170429 173526 176963 180828 185209 190032 194995 199812
52218 199812 204491 209314 214530 220133 225933 231813 237878 244322 251192 258339 265629 273078 280776 288798
52204 288798 297265 306315 315862 325563 335238 345182 355748 366731 377478 387634 397400 407007 416271
52191 416271 424818 432487 439312 445330 450546 454958 458464 460924 462439 463377 464024 464362 464305 463951 463414 462626
52175 462626 461479 460072 458646 457354 456207 455117 453899 452380 450633 449010 447833 447152 446867 446936 447396
52160 447396 448360 450072 452748 456229 460053 464019 468508 474067 480896 488843 497627 506758 515560 523641
52146 523641 531194 538500 545291 551000 555585 559638 563647 567521 570910 573617 575511 576381 576165 575183 573870
52131 573870 572309 570155 567072 563128 558772 554452 550293 546091 541589 536670 531361 525789 520245 515100
52117 515100 510459 505966 501134 495932 490894 486654 483490 481312 479871 478842 477814 476415 474569 472632
52103 472632 471175 470588 470866 471722 472862 474140 475578 477357 479710 482650 485805 488704 491205 493481 495611
52088 495611 497382 498529 498952 498617 497516 495872 494127 492562 491058 489362 487398 485172 482584 479626 476599
52073 476599 473918 471710 469792 467931 465982 463919 461903 460234 459039 458119 457281 456650 456432 456546 456804 457312
52057 457312 458315 459665 460828 461470 461740 461872 461826 461493 461046 460880 461317 462403 463869 465223 466054 466414 466756
52040 466756 467336 467769 467369 465953 464167 462929 462620 462904 463284 463654 464242 465186 466461 468187 470730 474323
52024 474323 478756 483623 488714 494071 499785 505955 512708 520058 527764 535516 543194 550858 558599 566593
52010 566593 575147 584418 594109 603693 612972 622172 631561 641148 650798 660369 669707 678670 687256 695490
51996 695490 703153 709787 715053 718939 721615 723255 724086 724430 724536 724386 723743 722400 720377 717928 715290
51981 715290 712354 708698 704094 698912 693787 688934 683998 678606 672850 667138 661786 656873 652341 648096
51967 648096 644146 640767 638416 637375 637498 638416 639938 642208 645505 649952 655357 661274 667270 673149 678950
51952 678950 684728 690421 695869 700930 705546 709764 713650 717097 719807 721535 722396 722805 723139 723496 723721
51937 723721 723553 722791 721442 719699 717675 715246 712225 708564 704228 698988 692666 685542 678211 670905 663287
51922 663287 655023 646319 637694 629396 621294 613208 605161 597313 589883 583115 577159 571853 566704 561141
51908 561141 554864 548005 540982 534120 527359 520309 512632 504378 495988 487982 480637 473864 467360 460855
51894 460855 454185 447207 439765 431794 423362 414509 405127 395123 384653 374049 363579 353387 343590
51881 343590 334240 325201 316261 307429 298991 291263 284378 278318 273036 268525 264882 262302 260920 260663
51867 260663 261322 262690 264463 266149 267310 267913 268151 267957 266976 265111 262786 260464 258182 255813 253603
51852 253603 252119 251735 252396 253896 256165 259322 263592 269199 276223 284530 293964 304619 316773 330527
51838 330527 345599 361425 377283 392181 404760 413568 417591 416658 411432 403076 392772 381352 369206
51825 369206 356505 343507 330657 318408 307000 296436 286631 277507 269010 261120 253896 247464 241937
51812 241937 237376 233812 231234 229512 228412 227700 227242 226984 226873 226781 226452 225570 223960 221656 218674 214831
51796 214831 210022 204674 199620 195421 191939 188683 185388 182202 179543 177897 177528 178193 179364 180880 183138
51781 183138 186435 190379 194275 197894 201514 205341 209295 213275 217208 220773 223460 225032 225668 225628 225011
51766 225011 223920 222571 221138 219678 218307 217215 216466 215963 215687 215733 216034 216265 216127 215526 214415 212710
51750 212710 210455 207883 205114 201990 198339 194314 190298 186591 183281 180347 177778 175601 173831 172360
51736 172360 170982 169659 168734 168651 169415 170518 171443 172095 172674 173353 174145 174916 175421 175474 175176 174890 174930 175367 176097
51717 176097 176933 177652 178149 178531 178866 178848 178078 176691 175351 174515 174068 173837 174034 174842 175897 176642 177022 177459
51699 177459 178198 179085 179973 180934 181951 182714 182932 182703 182420 182394 182657 183081 183505 183764 183689 183222 182549 182041 181981
51680 181981 182350 182920 183518 184131 184836 185711 186841 188313 190221 192695 195774 199138 202095 204067 205069 205532
51664 205532 205682 205323 204186 202254 199751 197039 194508 192312 190167 187681 184911 182384 180479 179062 177776
51649 177776 176430 175025 173685 172629 171994 171646 171377 171272 171523 171932 172069 171997 172330 173376 174734 176023 177468
51632 177468 179361 181423 183215 184830 186578 188250 189317 189785 190307 191414 193091 195109 197324 199515 201256
51617 201256 202134 201964 200839 199150 197504 196362 195786 195620 195772 196080 196155 195731 195076 194681 194641 194673 194645 194620 194428
51598 194428 193710 192485 191284 190576 190384 190602 191277 192334 193320 193673 193149 191820 189827 187353 184714 182291
51582 182291 180335 178858 177668 176546 175490 174749 174526 174700 174985 175275 175637 176081 176606 177382 178594 180123
51566 180123 181748 183641 186288 189818 193777 197718 201625 205504 208887 211093 211792 211063 209119 206311 203313
51551 203313 200890 199419 198820 198999 200095 202185 204888 207455 209258 210106 210061 209051 206838 203386 199144
51536 199144 194786 190700 186840 183057 179405 176065 173126 170565 168380 166673 165556 164993 164740 164492 164140
51521 164140 163836 163756 163902 164153 164358 164268 163554 162143 160438 158980 157922 157089 156419 156046 155944 155889 155848 156086 156715
51502 156715 157468 158108 158790 159767 160975 162247 163816 166264 169935 174606 179745 184896 189720 193813 196655
51487 196655 197825 197302 195552 193270 191034 189251 188318 188572 190000 192270 195190 198972 203835 209513 215414
51472 215414 221165 226754 232197 237391 242334 247197 251982 256328 259825 262477 264781 267502 271467 277387
51458 277387 285606 295981 308140 321781 336509 351425 365185 376741 385887 392977 398209 401380
51446 401380 402212 400617 396588 390110 381375 370951 359547 347652 335468 323135 310859 298835 287191
51433 287191 276092 265793 256510 248201 240565 233342 226577 220508 215174 210250 205406 200718 196590 193296
51419 193296 190772 188788 187111 185461 183617 181657 179939 178710 177887 177287 176872 176598 176261 175711 175080 174625
51403 174625 174444 174514 174868 175472 176056 176282 176079 175659 175284 175181 175498 176109 176553 176510 176255 176339 176847 177313 177419 177389
51383 177389 177545 177765 177610 176801 175359 173421 171128 168673 166297 164173 162337 160710 159180 157723 156438
51368 156438 155417 154612 153867 153083 152258 151449 150766 150342 150186 150098 149863 149517 149279 149283 149536 150071 150960 152187 153700
51349 153700 155581 157989 160930 164279 168106 172745 178434 184990 191878 198527 204486 209445 213239 215839
51335 215839 217351 218023 218199 218175 218047 217665 216616 214242 209961 203835 196738 189731 183345 177624 172666 168735
51319 168735 165858 163702 161987 160714 159911 159362 158781 158093 157460 157170 157493 158471 159782 160975 161932 162892 164033
51302 164033 165210 166197 167023 167948 169261 171131 173513 176127 178671 181098 183614 186408 189544 193060 196947
51287 196947 201048 205221 209630 214704 220787 228051 236685 246872 258541 271485 285780 301763 319497
51274 319497 338574 358522 378963 399154 417705 433111 444413 451204 453362 451157 445375 436879
51262 436879 426036 412779 397189 379754 361142 341959 322757 304065 286338 269907 254939
51251 254939 241470 229577 219485 211360 204947 199645 194999 190904 187277 183880 180682 178065 176340
51238 176340 175218 174023 172330 170175 167805 165485 163459 161810 160379 158999 157710 156610 155612 154585
51224 154585 153613 152894 152431 152076 151771 151539 151288 150906 150503 150345 150511 150864 151339 152062 153088 154237 155282 156221
51206 156221 157249 158467 159626 160237 159992 159135 158271 157774 157517 157212 156816 156448 156078 155528 154740 153861 153098 152603
51188 152603 152435 152567 152958 153672 154818 156346 158089 160064 162468 165255 167989 170276 172144 173756 174988
51173 174988 175586 175522 174950 173986 172870 172106 172035 172379 172594 172631 172931 173712 174680 175497 176133 176619 176818 176603 176029
51154 176029 175185 174104 172937 171957 171221 170428 169270 167804 166331 165082 164113 163391 162876 162589 162687 163293 164211
51137 164211 164956 165193 165014 164691 164303 163787 163186 162662 162252 161785 161088 160198 159325 158636 158118 157665 157249 156967 156857
51118 156857 156786 156632 156539 156849 157740 159034 160380 161575 162634 163667 164758 165954 167277 168716 170211 171719
51102 171719 173312 175127 177144 179042 180375 180927 180789 180138 179122 177963 176957 176233 175686 175239 175002 175034
51086 175034 175118 174985 174648 174356 174334 174716 175560 176695 177711 178315 178606 178777 178705 178148 177219 176311 175525 174593 173419
51067 173419 172362 171811 171725 171750 171627 171326 170967 170777 170976 171570 172275 172774 172964 172877 172494 171773 170801 169795 168942
51048 168942 168308 167879 167615 167476 167431 167516 167830 168436 169189 169713 169652 168990 168085 167333 166888 166675 166567 166459 166285 166086
51028 166086 165969 165959 166011 166232 166928 168278 170033 171671 172815 173456 173889 174517 175539 176753 177756 178436 179008
51011 179008 179551 179819 179788 180009 181008 182531 183793 184388 184551 184613 184636 184650 184824 185247 185789 186294 186731 187131 187507
50992 187507 187871 188163 188283 188354 188788 189780 190889 191510 191684 192004 192724 193497 194012 194437 195033 195801 196728 197955
50974 197955 199412 200640 201346 201872 202803 204256 205885 207442 209063 211058 213666 216966 220892 225336 230323
50959 230323 236026 242531 249762 257677 266317 275517 284691 293029 299772 304359 306646 307222 307218 307505 308142 308694
50943 308694 308860 308542 307598 305890 303492 300533 296904 292402 287201 281931 277269 273644 271251 270042 269543
50928 269543 268863 267111 263896 259519 254761 250515 247430 245736 245300 245834 247107 249090 251917 255656 260114
50913 260114 264943 269926 275020 280113 284895 289094 292690 295808 298462 300472 301651 302014 301861 301594 301359
50898 301359 300847 299641 297791 295886 294513 293799 293556 293669 294201 295266 296955 299349 302464 306246 310706
50883 310706 315980 322167 329200 336963 345452 354726 364748 375330 386147 396847 407306 417862 429187
50870 429187 441813 455905 471529 488949 508525 530453 554770 581459 610393 641231 673548
50859 673548 707012 741300 775935 810358 844128 876834 907820 936185 961183 982522 1000201
50848 1000201 1014151 1024238 1030678 1034266 1035972 1036292 1035152 1032529 1028932 1025111 1021437 1017755 1013648 1008618
50834 1008618 1002146 993994 984435 973958 962697 950423 937019 922574 906968 889755 870623 849669
50822 849669 827098 802958 777353 750642 723281 695732 668657 642892 618930 596680 575876
50811 575876 556458 538346 521216 504878 489631 475910 463714 452728 442799 433903 425795 418118
50799 418118 410876 404417 398940 394268 390185 386683 383841 381663 380121 379169 378663 378450 378526 378963 379662 380409
50783 380409 381217 382444 384399 386915 389486 391888 394567 398243 403064 408360 413465 418600 424597 431806
50769 431806 439763 448033 456818 466456 476796 487590 499168 512169 526729 542491 559360 577795
50757 577795 598320 621202 646718 675341 707483 743305 782916 826567 874540 927025 984142
50746 984142 1045859 1111825 1181427 1254055 1329215 1406366 1484816 1563650 1641525 1716499 1786379
50735 1786379 1849320 1903963 1949111 1983704 2007262 2020124 2023051 2016856 2002572 1981792 1956531 1928752
50723 1928752 1900149 1872315 1846831 1824965 1807255 1793391 1782533 1773638 1765452 1756334 1744463 1728406
50711 1728406 1707345 1680670 1647646 1607829 1561624 1510087 1454146 1394376 1331561 1267133 1202827
50700 1202827 1140047 1079660 1022261 968505 919213 875102 836328 802321 772283 745884 723322
50689 723322 704733 689771 677811 668329 660952 655262 650764 647030 643804 640993 638544 636304 633987
50676 633987 631315 628139 624417 620185 615616 610947 606183 601025 595253 589074 582823 576477 569778 562757
50662 562757 555703 548608 541053 532850 524517 516866 510334 504943 500688 497676 495940 495402 496109 498341 502420
50647 502420 508448 516267 525620 536320 548285 561490 575963 591814 609178 628118 648690 671137
50635 671137 695862 723068 752553 783977 817214 852272 888992 927090 966393 1006768 1047822
50624 1047822 1088890 1129318 1168544 1205903 1240567 1271724 1298611 1320360 1336037 1344903 1346531 1340790
50612 1340790 1328008 1309206 1285950 1259897 1232650 1205927 1181389 1160064 1142179 1127688 1116674
50601 1116674 1109064 1104213 1101055 1098576 1095900 1092124 1086283 1077464 1064763 1047271 1024425 996469 964439
50588 964439 929654 893293 856427 820223 785875 754256 725698 700138 677489 657844 641381
50577 641381 628239 618526 612260 609162 608640 610197 613767 619479 627200 636492 646975 658404 670406
50564 670406 682414 693969 704882 715041 724281 732538 739941 746660 752829 758652 764374 770060 775551
50551 775551 780769 785895 791219 796961 803293 810330 818067 826514 835966 846911 859542 873596 888809
50538 888809 905309 923339 942796 963253 984273 1005492 1026504 1046935 1066636 1085674 1104159
50527 1104159 1122194 1139923 1157454 1174738 1191590 1207694 1222349 1234112 1240826 1240332 1231615 1215704
50515 1215704 1195485 1174330 1154586 1137166 1122285 1110142 1100832 1094053 1089303 1086268 1084747 1084266 1083988
50502 1083988 1083042 1080750 1076544 1069803 1059874 1046241 1028699 1007358 982439 954171 923019 889972
50490 889972 856330 823076 790567 758878 728221 698939 671310 645567 621990 600778 581926
50479 581926 565339 550982 538773 528441 519673 512390 506755 502944 501007 500858 502288 505039 508945
50466 508945 513962 520020 526984 534828 543698 553647 564397 575547 586937 598702 611012 623904 637300
50453 637300 651036 664892 678750 692730 707106 722038 737363 752580 767026 780254 792328
50442 792328 803734 814934 826087 837258 848738 861092 874945 890808 908956 929401 952032
50431 952032 976839 1003953 1033440 1065266 1099538 1136641 1176989 1220709 1267593 1317160 1368672
50420 1368672 1421216 1473908 1525880 1576021 1622953 1665455 1702781 1734357 1759342 1776758 1786020
50409 1786020 1787098 1780151 1765233 1742497 1712564 1676627 1636190 1592754 1547701 1502456 1458592 1417721
50397 1417721 1381270 1350434 1326192 1309105 1299108 1295691 1298310 1306410 1319103 1335148 1353309 1372412
50385 1372412 1390882 1406596 1417398 1421607 1417881 1404982 1382169 1349802 1309359 1262859 1212310 1159401
50373 1159401 1105389 1051226 997855 946252 897152 850983 808189 769275 734359 703036 674957
50362 674957 650242 628988 610728 594872 581429 570822 563098 557869 554908 554277 555830 559102 563788
50349 563788 569929 577484 586130 595614 605963 617167 628982 641199 653785 666599 679211 691226
50337 691226 702526 712945 721861 728381 731913 732485 730658 727252 723073 718671 714309 710086 706036 702176
50323 702176 698667 695961 694595 694758 696213 698717 702375 707536 714490 723426 734534 748014 763982 782414
50309 782414 803148 825913 850411 876381 903515 931332 959160 986287 1012105 1036176 1058190
50298 1058190 1077790 1094385 1107253 1115867 1120048 1119673 1114419 1103957 1088307 1067842 1043114 1014854
50286 1014854 983992 951444 917983 884527 852350 822629 795884 772203 751989 736055 724945
50275 724945 718516 716269 717762 722553 730050 739524 750105 760689 770130 777562 782311 783564 780590 773431
50261 773431 762993 750261 735763 719969 703783 688210 673694 660042 646782 633334 618978
50250 618978 603047 585200 565447 544137 522125 500717 481121 463907 449106 436623 426312
50239 426312 417856 410912 405361 401173 398143 396034 394921 395062 396375 398337 400505 402893 405717 408963
50225 408963 412364 415671 418812 421842 424887 428149 431840 436062 440732 445667 450688 455626 460258 464348
50211 464348 467823 470794 473314 475219 476403 477154 477979 479090 480315 481568 483091 485083 487408 489894 492660
50196 492660 495811 499030 501860 504322 506835 509461 511593 512481 511759 509278 504822 498360 490475 482140 474056
50181 474056 466430 459401 453374 448717 445375 443066 441807 441942 443613 446474 450092 454448 459797 466183
50167 466183 473341 481082 489476 498563 508099 517787 527695 538241 549716 561869 573955 585224 595396
50154 595396 604640 613121 620672 627035 632274 636742 640617 643675 645525 645823 644210 640299 634009 625815
50140 625815 616551 607049 598029 590148 583891 579355 576263 574180 572614 570923 568242 563584 556173 545929
50126 545929 533713 520932 508696 497358 486861 477289 468890 461710 455530 450141 445447 441249 437188
50113 437188 433022 428778 424527 420154 415474 410504 405451 400470 395552 390606 385578 380506 375557 370999
50099 370999 366986 363326 359591 355555 351411 347519 344021 340831 337910 335344 333155 331239 329530 328070
50085 328070 326850 325772 324840 324252 324167 324521 325168 325990 326737 327030 326814 326620 327023 327928 328722 329096 329303 329599
50067 329599 329882 330045 330292 330863 331700 332650 333759 335091 336486 337810 339348 341664 345091 349636 355287 362103
50051 362103 369996 378708 388143 398546 410216 423167 437167 452025 467692 484077 500858 517509
50039 517509 533587 548963 563831 578498 593163 607833 622348 636469 649958 662491 673382
50028 673382 681456 685421 684527 678866 669077 655872 639863 621611 601695 580772 559693 539411 520674
50015 520674 503748 488520 474800 462461 451395 441404 432186 423426 414964 406930 399606 393130 387388
50002 387388 382169 377340 372862 368804 365324 362500 360122 357837 355538 353451 351735 350231 348738 347316
49988 347316 346108 345016 343839 342647 341760 341294 340968 340413 339628 339059 339219 340201 341597 342996 344529 346753
49972 346753 349970 353932 358287 363006 368143 373468 378696 383924 389404 394955 399981 404123 407570 410624
49958 410624 413282 415412 417094 418552 419869 420926 421552 421624 421134 420229 419193 418275 417571 417039 416570 416076 415630
49941 415630 415565 416310 418053 420620 423738 427357 431716 437159 443857 451656 460160 469122 478710 489279 500900
49926 500900 513285 526166 539511 553265 567095 580575 593487 605737 617085 627166 635757 642855
49914 642855 648545 652957 656349 658960 660678 661001 659373 655421 648801 639114 626235 610643 593223 574785
49900 574785 556004 537670 520589 505102 491014 478150 466721 456893 448224 439921 431605 423493
49888 423493 415800 408310 400648 392752 384893 377374 370357 363862 357820 352186 347067 342624 338834 335467
49874 335467 332410 329855 328042 326863 325843 324495 322648 320536 318597 317120 316005 314988 314084 313666 314004
49859 314004 314944 316162 317614 319548 322198 325610 329644 333954 338033 341462 344107 345962 346959 347111 346740
49844 346740 346238 345589 344322 342007 338639 334546 330141 325841 321993 318668 315542 312149 308281 304153 300197
49829 300197 296719 293700 290907 288190 285670 283660 282413 281982 282228 282913 283830 284898 286090 287275 288253
49814 288253 289078 290179 292020 294606 297524 300415 303273 306307 309719 313685 318311 323418 328446 332786
49800 332786 336228 338961 341167 342792 343778 344311 344579 344317 342901 339998 335966 331429 326673 321652 316486
49785 316486 311580 307226 303351 299748 296345 293148 290110 287194 284414 281746 279168 276830 274988 273686
49771 273686 272738 272158 272287 273301 274841 276442 278137 280309 283102 286339 289970 294199 299097 304414 309876
49756 309876 315419 320960 326129 330367 333279 334873 335551 335898 336257 336433 335895 334361 332076 329504 326815
49741 326815 323796 320185 316021 311639 307431 303650 300431 297905 296176 295210 294834 294817 294862 294635 294055 293572
49725 293572 293900 295318 297424 299707 302132 305016 308513 312476 316638 320674 324184 326850 328638 329718
49711 329718 330328 330817 331586 332664 333474 333328 332063 329952 327167 323704 319814 316067 312861 310152 307698
49696 307698 305331 302895 300235 297388 294623 292159 289994 288067 286430 285217 284553 284490 284936 285667 286585 287893
49680 287893 289797 292099 294353 296405 298494 300814 303328 306029 309071 312456 315887 319033 321749 323887
49666 323887 325193 325609 325470 325215 324987 324636 323908 322512 320205 317035 313362 309515 305526 301352 297197 293394
49650 293394 290051 287010 284131 281490 279314 277759 276763 276035 275271 274400 273583 272992 272706 272793 273263 273944 274598
49633 274598 275252 276258 277921 280234 283042 286225 289597 292835 295734 298470 301404 304707 308280 311933
49619 311933 315487 318744 321538 323836 325729 327330 328688 329699 330047 329359 327532 324843 321669 318205 314572
49604 314572 311088 308201 306166 304836 303838 302879 301901 300986 300223 299747 299839 300784 302520 304626 306825 309307
49588 309307 312337 315719 319005 322152 325540 329328 333254 337156 341245 345636 350064 354379 358976 364304
49574 364304 370160 375865 380980 385390 388801 390673 390812 389686 387962 385953 383690 381310 379123 377311
49560 377311 375783 374395 373182 372221 371288 369792 367206 363491 359015 354187 349361 345001 341556 338998 336683
49545 336683 333920 330636 327435 325115 324161 324511 325677 327167 328830 330679 332399 333356 333202 332211 330781
49530 330781 328861 326200 322973 319844 317371 315655 314511 313725 313068 312327 311442 310501 309539 308491 307400 306538
49514 306538 306160 306199 306347 306413 306518 306884 307509 308152 308624 308987 309398 309882 310339 310723 311111 311628 312399 313449 314561
49495 314561 315318 315476 315230 314947 314724 314457 314196 314109 314162 314161 314148 314348 314707 314859 314714 314645 314900 315235 315389 315574 316120
49474 316120 316927 317659 318288 319076 320126 321329 322643 324158 325952 328158 331094 334960 339444 343929 348090
49459 348090 352059 356010 359831 363238 366032 368178 369767 370870 371337 370865 369415 367456 365586 363958 362314
49444 362314 360531 358907 357861 357496 357499 357400 356927 356200 355569 355270 355348 355913 357193 359264 361968 365281 369492
49427 369492 374794 380967 387781 395496 404632 415363 427440 440513 454058 467073 478279 486738 492096
49414 492096 494384 494018 492032 489849 488551 488468 489384 490824 492115 492563 491752 489547 485811 480409 473541 465806
49398 465806 457817 449931 442367 435326 428919 423178 418199 414075 410655 407640 404948 402748 401089 399771
49384 399771 398674 397948 397780 398196 399180 400701 402489 404064 405197 406167 407387 408923 410490 411742 412411 412416
49368 412416 412027 411781 412066 412895 414168 415915 418093 420345 422242 423666 424742 425539 426041 426321 426419 426160 425353
49351 425353 424195 423142 422340 421454 420184 418713 417426 416411 415476 414609 414091 414107 414498 415013 415641 416509 417621
49334 417621 418931 420619 422950 425855 428938 432048 435546 439788 444536 449172 453330 457033 460289 462979
49320 462979 465134 466898 468011 467675 465321 461417 457215 453697 451037 449095 448059 448290 449716 451821 454313
49305 454313 457511 461855 467286 473414 480114 487541 495609 503860 511958 519925 527760 535206 542143 548864
49291 548864 555615 562094 567794 572643 576912 580551 583055 584023 583595 582252 580364 577946 574700 570344 565053
49276 565053 559504 554306 549532 544996 540794 537254 534479 532354 530943 530514 531100 532344 533881 535651 537783
49261 537783 540360 543281 546159 548378 549490 549538 548810 547393 545245 542499 539311 535480 530720 525315 520048
49246 520048 515405 511300 507669 504824 502958 501734 500674 499617 498571 497432 496224 495359 495352 496417 498605
49231 498605 502132 507212 513645 520854 528282 535487 541848 546430 548335 547244 543652 538552 532828 526907
49217 526907 520974 515292 510129 505458 500987 496466 491773 486823 481682 476719 472326 468499 465033 462085
49203 462085 460077 459024 458408 457892 457706 458166 459204 460600 462222 463791 464774 464886 464372 463490 462010 459586
49187 459586 456325 452653 448844 445039 441498 438404 435612 432968 430721 429220 428362 427765 427484 428132 430248
49172 430248 433816 438448 443722 449265 454735 459865 464488 468569 472316 476119 480188 484265 487886 490887
49158 490887 493562 496392 499784 503960 508886 514290 519825 525168 529899 533386 534936 534024 530435 524370
49144 524370 516491 507652 498443 489183 480312 472418 465701 459749 454141 448985 444631 441187 438663 437298
49130 437298 437301 438436 440302 442903 446543 451251 456687 462555 468720 474991 481157 487210 493215 498976 504154
49115 504154 508691 512769 516398 519384 521718 523690 525656 528003 531231 535611 540780 546144 551742 558247
49101 558247 565959 574314 582617 590817 599215 607750 615986 623670 630913 637881 644569 650880 656732 662090
49087 662090 666979 671496 675722 679700 683558 687597 692164 697463 703475 710071 717273 725516 735573 748065
49073 748065 763029 780102 799045 819825 842105 864819 886281 904577 917989 925514 927400 925139
49061 925139 920739 915831 911266 907241 903610 900165 896844 893788 891278 889663 889249 890148 892222 895296 899353
49046 899353 904374 910068 916030 922205 928925 936398 944377 952454 960481 968503 976457 984188 991767 999590
49032 999590 1008044 1017146 1026504 1035642 1044370 1052893 1061577 1070628 1080020 1089671 1099633 1110070 1121149 1133000
49018 1133000 1145805 1159899 1175730 1193653 1213829 1236439 1262053 1291645 1326149 1366125 1411965
49007 1411965 1464228 1523467 1589433 1660175 1731776 1799333 1859253 1911449 1959004 2004438 2045273
48996 2045273 2073350 2079449 2059820 2019140 1967388 1913277 1859635 1804059 1743404 1677630 1610104
48985 1610104 1545323 1486789 1436350 1394394 1360250 1332751 1310766 1293330 1279454 1268142 1258635
48974 1258635 1250443 1243154 1236476 1230425 1225203 1220864 1217322 1214595 1212661 1211110 1209341 1207259 1205348 1203929
48960 1203929 1202706 1201252 1199520 1197573 1195192 1192222 1189054 1186319 1184191 1182388 1180796 1179678 1179250 1179422
48946 1179422 1179992 1180686 1180907 1179794 1176820 1172136 1166220 1159465 1152328 1145568 1139892 1135370 1131593 1128418 1126284
48931 1126284 1125701 1126724 1129078 1132517 1136804 1141522 1146193 1150542 1154434 1157669 1160128 1162079 1163990 1165994
48917 1165994 1167798 1169194 1170357 1171538 1172783 1174142 1175868 1178146 1180793 1183477 1186064 1188565 1190909 1193115
48903 1193115 1195583 1198854 1203033 1207657 1212114 1216040 1219363 1222222 1224869 1227472 1229989 1232319 1234523 1236731
48889 1236731 1238913 1240902 1242620 1244026 1244956 1245226 1244882 1244138 1243073 1241619 1239814 1237789 1235469 1232528 1228677
48874 1228677 1223815 1217880 1210840 1202935 1194692 1186540 1178582 1170835 1163536 1157054 1151645 1147423 1144439 1142657
48860 1142657 1141896 1141949 1142781 1144542 1147381 1151302 1156174 1161857 1168284 1175407 1183115 1191246 1199663 1208197 1216537
48845 1216537 1224344 1231537 1238339 1244985 1251568 1258216 1265225 1272875 1281334 1290857 1301847 1314464 1328356
48832 1328356 1343003 1358233 1374206 1391081 1408936 1427842 1447758 1468474 1489917 1512351 1536019
48821 1536019 1560783 1586388 1612855 1640304 1668601 1697559 1727222 1757484 1787661 1817025 1845664
48810 1845664 1874213 1902794 1930844 1957983 1984438 2010480 2036069 2061216 2086089 2110491 2133783
48799 2133783 2155607 2176169 2195544 2213241 2228882 2242829 2255662 2267412 2277798 2286978 2295517 2303737
48787 2303737 2311488 2318496 2324615 2329776 2334004 2337419 2340008 2341439 2341262 2339259 2335479 2330075 2323122 2314442
48773 2314442 2303568 2290119 2274297 2256713 2237661 2216960 2194686 2171571 2148300 2124803 2100680
48762 2100680 2076041 2051448 2027180 2003071 1979041 1955323 1932089 1909213 1886515 1864032 1841954
48751 1841954 1820439 1799509 1779051 1758918 1739223 1720450 1703185 1687735 1674114 1662295 1652333
48740 1652333 1644291 1638124 1633585 1630169 1627310 1624751 1622702 1621563 1621603 1622897 1625404 1628979 1633484 1638985
48726 1638985 1645667 1653481 1662035 1670920 1679969 1689150 1698437 1707882 1717552 1727272 1736714 1745899 1755320 1765334
48712 1765334 1775704 1785983 1796134 1806472 1817115 1827825 1838304 1848484 1858560 1868899 1879777
48701 1879777 1891124 1902636 1914217 1926084 1938337 1950686 1962753 1974386 1985484 1995772 2005039
48690 2005039 2013405 2021142 2028414 2035303 2041857 2047884 2052990 2057041 2060339 2063110 2065074 2065853 2065510 2064353
48676 2064353 2062403 2059457 2055519 2050849 2045669 2040067 2034047 2027376 2019534 2010121 1999203 1987019 1973528
48663 1973528 1958491 1941856 1923804 1904598 1884611 1864280 1843770 1822907 1801725 1780753 1760414
48652 1760414 1740451 1720368 1700205 1680348 1660809 1641273 1621764 1602741 1584557 1567287 1551077
48641 1551077 1536146 1522451 1509727 1497891 1486998 1476887 1467377 1458801 1451839 1446683 1442836 1439857
48629 1439857 1437856 1437047 1437195 1437817 1438703 1440045 1442121 1445050 1448740 1453071 1458040 1463624 1469419 1474769 1479514
48614 1479514 1484358 1490073 1496511 1502797 1508323 1513091 1517192 1520538 1523155 1525214 1526645 1527161 1526805 1526120 1525663
48599 1525663 1525684 1526291 1527534 1529191 1530869 1532479 1534278 1536342 1538303 1539707 1540339 1540153 1539281 1538183 1537417 1537159
48583 1537159 1537266 1537835 1539233 1541424 1543763 1545717 1547398 1549169 1551135 1553323 1555994 1559369 1563280 1567418
48569 1567418 1571752 1576457 1581589 1587069 1592755 1598219 1602599 1605006 1605059 1602823 1598280 1591091 1580844 1567412
48555 1567412 1551071 1532407 1512118 1490819 1469006 1447210 1426069 1406235 1388167 1371982 1357422
48544 1357422 1344038 1331517 1319718 1308357 1296945 1285280 1273787 1262964 1252641 1242191 1231453
48533 1231453 1220940 1211077 1201651 1192141 1182232 1171828 1160944 1149829 1138913 1128462 1118454 1108909
48521 1108909 1100069 1092096 1084854 1078166 1072084 1066753 1062152 1058078 1054291 1050676 1047391 1044839 1043163 1041847
48507 1041847 1040105 1037678 1034880 1031906 1028599 1025040 1021794 1019244 1017045 1014632 1011958 1009337 1006775 1003861
48493 1003861 1000273 996106 991675 987198 982635 977778 972494 966903 961254 955671 950165 944846 939854 935073
48479 935073 930184 925049 919824 914715 909898 905678 902320 899696 897452 895613 894625 894676 895388 896294 897195 897849
48463 897849 897762 896559 894285 891085 886941 881938 876387 870399 863734 856438 849254 842954 837522 832382 827222
48448 827222 822128 817122 812048 806878 801749 796700 791658 786632 781656 776577 771214 765657 760231 755182
48434 755182 750624 746681 743465 740944 739026 737718 737030 736839 737025 737665 738922 740888 743754 747934 753676
48419 753676 760583 767863 775010 781856 787795 791350 790963 786355 778926 770748 763253 756910 751834 748267
48405 748267 746346 745779 746044 746742 747588 748322 749001 750200 752567 756223 760912 766471 772634 778395 782133 782498
48389 782498 778901 771285 760067 746435 732090 718374 705883 694929 685788 678320 671920 666177 661239
48376 661239 657269 653967 650959 648266 646079 644358 642935 641746 640745 639858 639246 639263 639996 641112 642328
48361 642328 643638 644993 646230 647499 649228 651392 653295 654363 654692 654495 653565 651689 649130 646254 643108
48346 643108 639758 636555 633562 630143 625688 620455 615149 609974 604596 598795 592662 586344 580059 574214
48332 574214 569102 564658 560777 557554 554900 552289 549344 546367 543862 541843 539994 538149 536239 534083
48318 534083 531750 529746 528384 527244 525781 524137 522815 521825 520724 519240 517382 515113 512455 509726
48304 509726 507228 504896 502654 500823 499687 498949 498132 497296 496848 496822 496864 496779 496677 496679 496852 497230 497692 498039 498372
48285 498372 499042 500028 500933 501796 503241 505449 507721 509548 511358 513649 516112 518312 520539 523254 526406
48270 526406 530039 534864 541354 548945 557033 566089 576801 588778 601071 613227 624685 633858 639243
48257 639243 641186 641432 641294 641272 641906 643728 646747 651044 657469 666676 678063 690817 705325 722362
48243 722362 741690 762913 786938 815018 847078 882649 922720 968933 1021761 1081532 1150615
48232 1150615 1232623 1330269 1446168 1584929 1752007 1951336 2186692 2464568 2793139 3179914
48222 3179914 3634402 4172504 4814351 5577747 6475977 7518388 8705471 10021098 11428344
48213 11428344 12858199 14180490 15187663 15646256 15413332 14527853 13190553 11651950
48205 11651950 10109055 8675727 7404705 6311791 5388548 4614737 3970247 3437700 2999179
48196 2999179 2637013 2337534 2090550 1886094 1714793 1570409 1448991 1346085 1257157 1179920
48186 1179920 1113702 1056929 1007301 963867 926834 895562 868551 845140 825493 809071 794615
48175 794615 781601 770434 761324 754104 748900 745804 744039 742573 741468 741646 743509 746737 751206 757085
48161 757085 764101 771636 779549 788049 796738 804427 809901 812315 811119 806358 799043 790606 781934 773303
48147 773303 764979 757301 750369 744201 739056 735080 731828 728669 725525 722741 720439 718483 716907 715831
48133 715831 715096 714440 713900 713598 713267 712467 711116 709375 707170 704250 700611 696422 691643 686054 679529 671981
48117 671981 663201 653167 642288 631003 619287 606919 593998 580849 567621 554378 541376 528874
48105 528874 516842 505213 494206 484041 474553 465462 456769 448557 440671 433010 425866 419462 413446
48092 413446 407363 401379 396009 391280 386770 382370 378442 375216 372529 370146 367917 365616 363062 360417
48078 360417 358038 356025 354236 352632 351243 349883 348310 346612 345069 343698 342351 341155 340374 339871 339161
48063 339161 338033 336781 335763 335108 334820 334794 334710 334302 333740 333440 333475 333546 333519 333590 333875 334227 334522 334810 335111 335393
48043 335393 335764 336390 337174 337857 338425 339086 339780 340129 339970 339644 339646 340246 341473 343141 344834 346176 347218 348287
48025 348287 349421 350290 350715 350885 350965 350891 350709 350740 351172 351808 352469 353358 354770 356618 358555 360386 362140 363828
48007 363828 365383 366820 368314 370111 372437 375412 378990 383035 387477 392301 397392 402581 407852 413396
47993 413396 419425 426045 433261 440936 448801 456723 464924 473682 482819 491834 500566 509364 518491 527732
47979 527732 536829 545950 555344 564769 573611 581574 588964 596305 603887 611670 619460 627103 634603 642066
47965 642066 649492 656723 663671 670472 677235 683629 689005 693016 696017 698689 701299 703460 704668 704883
47951 704883 704431 703421 701589 698776 695273 691490 687510 683225 678712 674126 669304 663856 657656 650946
47937 650946 643894 636428 628539 620410 612071 603288 594011 584607 575427 566373 557179 547870 538581 529144
47923 529144 519277 509131 499192 489626 480113 470469 461037 452177 443714 435238 426817 419010 412149 405965
47909 405965 400031 394252 388752 383487 378289 373208 368500 364291 360482 356989 353832 350932 348098 345357
47895 345357 343049 341397 340208 339129 338055 337060 336172 335474 335199 335401 335676 335593 335283 335195 335342 335278 334835 334377
47877 334377 334158 333910 333334 332584 331929 331248 330289 329199 328364 327812 327182 326263 325225 324285 323431 322602 321839 321169
47859 321169 320462 319607 318703 317999 317672 317684 317829 317909 317951 318250 319124 320605 322407 324196 325844 327459 329296 331641
47841 331641 334602 337935 341167 344085 347094 350926 355911 361599 367222 372447 377525 382757 388009 392919
47827 392919 397381 401623 405829 409858 413387 416202 418323 419934 421210 422150 422573 422350 421577 420409 418781
47812 418781 416524 413680 410507 407117 403382 399325 395310 391633 388087 384212 379930 375693 371949 368665
47798 368665 365487 362241 359171 356682 354958 353901 353396 353512 354300 355530 356759 357742 358600 359597 360900 362609
47782 362609 364837 367585 370664 373898 377311 380976 384785 388504 392055 395569 399219 403126 407320 411609
47768 411609 415499 418489 420554 422185 423829 425408 426412 426380 425188 423006 420112 416748 412990 408747 403949
47753 403949 398747 393454 388280 383236 378331 373695 369393 365213 360900 356589 352781 349782 347372 345163
47739 345163 343129 341551 340565 340028 339822 340016 340678 341742 343139 344888 346920 349008 351017 353124 355651
47724 355651 358738 362291 366149 370189 374330 378558 382936 387537 392368 397415 402684 408196 414049 420511
47710 420511 427879 436133 444844 453529 462008 470299 478351 485995 493068 499392 504732 508915 511894 513551
47696 513551 513617 512012 509132 505507 501243 496102 490135 483856 477747 471892 466231 460880 456064 451923 448568
47681 448568 446121 444534 443561 443056 443103 443671 444342 444647 444581 444545 444841 445442 446183 446896 447352 447288 446562 445167 443102
47662 443102 440391 437175 433613 429683 425303 420659 416224 412368 409098 406221 403570 401052 398667 396616
47648 396616 395216 394559 394366 394320 394391 394727 395402 396436 397966 400153 402953 406176 409708 413549 417684 422118
47632 422118 426977 432383 438219 444277 450603 457458 464927 472797 480884 489182 497564 505585 512873 519487
47618 519487 525648 531225 535769 539071 541394 543101 544211 544420 543433 541185 537828 533584 528628 523098 517142
47603 517142 510842 504049 496464 488050 479337 471139 463897 457409 451220 445159 439426 434268 429717 425754
47589 425754 422591 420655 420160 420819 422135 423921 426370 429615 433513 437953 443111 449179 456063 463572 471733
47574 471733 480557 489635 498356 506526 514422 522184 529531 536213 542387 548303 553849 558659 562487 565242
47560 565242 566800 567066 566183 564447 561997 558786 554834 550323 545314 539523 532540 524327 515472 506849 498988
47545 498988 491796 484902 478229 472068 466689 462079 458138 454958 452755 451623 451476 452234 453986 456978 461407
47530 461407 467175 473887 481249 489422 498769 509213 520063 530581 540543 550100 559297 567895 575501
47517 575501 581668 585953 588089 588075 585980 581754 575380 567091 557227 545910 533080 518845 503650 488115
47503 488115 472787 458028 443973 430592 417890 406011 395106 385185 376216 368241 361306 355348
47491 355348 350261 345908 341977 338050 334073 330539 327876 325798 323639 321246 319091 317474 316102 314582
47477 314582 312943 311388 309849 308114 306203 304367 302782 301488 300506 299841 299378 298945 298427 297740 296777 295486
47461 295486 293926 292195 290348 288488 286781 285295 283955 282715 281623 280557 279117 277043 274706 272880
47447 272880 272007 271817 271746 271510 271138 270605 269672 268215 266532 265138 264200 263385 262388 261395 260768 260378 259661 258396
47429 258396 257065 256288 256197 256562 257215 258033 258717 258995 258975 258986 259132 259347 259806 260820 262212 263187 263078 262040
47411 262040 260834 260115 260093 260618 261325 261771 261748 261473 261322 261366 261369 261213 261119 261311 261610 261595 261130 260526 260132 259942 259770
47390 259770 259654 259848 260416 261124 261781 262465 263273 264044 264621 265165 265977 267063 268162 269166 270178 271181 272004
47373 272004 272748 273879 275658 277726 279500 280880 282285 284079 286230 288515 290805 293071 295263 297285
47359 297285 298999 300250 301001 301455 301943 302630 303390 304046 304644 305430 306592 308103 309834 311764 313996 316632
47343 316632 319735 323441 327950 333275 339048 344802 350482 356497 363162 370243 377198 383703 389785 395536
47329 395536 400935 405887 410231 413648 415789 416583 416321 415419 414182 412807 411426 410048 408602 407146 405868
47314 405868 404786 403583 401905 399755 397414 395011 392376 389349 386049 382761 379620 376522 373270 369730
47300 369730 365877 361788 357619 353532 349569 345668 341835 338291 335340 333035 331090 329217 327491 326245
47286 326245 325658 325609 325931 326594 327571 328768 330219 332162 334708 337595 340521 343597 347176 351282 355519 359602
47270 359602 363614 367610 371293 374330 376781 378941 380860 382272 382954 382918 382234 380820 378452 374976 370542
47255 370542 365678 360940 356398 351614 346248 340517 334807 329078 322996 316583 310331 304641 299531 294932
47241 294932 290888 287280 283735 280092 276682 273878 271562 269332 267076 265012 263283 261838 260659 259791
47227 259791 259161 258635 258267 258258 258661 259311 260080 260980 262008 263126 264410 266004 267844 269659 271287 272748 273975
47210 273975 274745 275056 275312 275891 276656 277104 276903 276109 274973 273765 272752 272138 271966 272170 272629 273148 273519 273794
47192 273794 274404 275805 278026 280770 283915 287640 292071 297098 302710 309298 317379 327067 337987 349634
47178 349634 361547 373031 382897 389782 392927 392723 390481 387643 385103 383083 381478 380225 379429 379259
47164 379259 379762 380735 381797 382628 383153 383485 383730 383896 383964 383932 383699 382993 381534 379328 376737 374167 371705
47147 371705 369101 366154 362972 359840 356864 353883 350691 347272 343848 340781 338411 336867 335956 335329 334778
47132 334778 334326 334067 334047 334299 334846 335650 336671 337995 339730 341751 343794 345872 348361 351489 355011 358612
47116 358612 362456 366977 372196 377612 382785 387680 392366 396645 400199 402948 405039 406532 407205 406737 405068
47101 405068 402557 399777 397064 394318 391264 387817 384113 380309 376566 373109 370104 367454 364940 362577
47087 362577 360693 359602 359374 359903 361033 362591 364506 366927 370068 373866 378006 382301 386868 391877 397383
47072 397383 403450 410251 417898 426334 435434 445019 454751 464268 473532 482763 491878 500284 507457 513449
47058 513449 518621 523083 526691 529341 530951 531336 530478 528825 526911 524726 521770 517739 512872 507662 502538
$$ [...]
##END NTUPLES=NMR SPECTRUM
##END=
