##TITLE=AC1545_ROEFFECT0013_8268682_Mjor2CYA9B
##JCAMPDX= 6.0         $$ Bruker NMR JCAMP-DX V2.0
##DATA TYPE= NMR SPECTRUM
##DATA CLASS= NTUPLES
##ORIGIN= BRUKER
##OWNER= Administrator
$$ 1.72 TOPSPIN		Version 2.1
$$ 2013-10-11 20:52:43.137 -0700  Administrator@X
$$ Compression mode = diff/dup
##.OBSERVE FREQUENCY= 400.02188249412
##.OBSERVE NUCLEUS= ^1H
##.ACQUISITION MODE= SIMULTANEOUS (DQD)
##.ACQUISITION SCHEME= undefined
##.AVERAGES= 8
##.DIGITISER RES= 22
##SPECTROMETER/DATA SYSTEM= spect
##.PULSE SEQUENCE= zg30
##.SOLVENT NAME= COFFEE_meoh
##.SHIFT REFERENCE= INTERNAL, COFFEE_meoh, 1, 14.98509
##AUDIT TRAIL= $$ (NUMBER, WHEN, WHO, WHERE, PROCESS, VERSION, WHAT)
$$ ##TITLE= Audit trail, TOPSPIN		Version 2.1
$$ ##JCAMPDX= 5.01
$$ ##ORIGIN= Bruker BioSpin GmbH
$$ ##OWNER= Administrator
$$ $$ E:\/data/COFFEE/nmr/AC1545_ROEFFECT0013_8268682_Mjor2CYA9B/10/pdata/1/auditp.txt
$$ ##AUDIT TRAIL=  $$ (NUMBER, WHEN, WHO, WHERE, PROCESS, VERSION, WHAT)
(   1,<2013-10-11 20:52:36.340 -0700>,<Administrator>,<X>,<go>,<TOPSPIN 2.1>,
      <created by zg
	started at 2013-10-11 20:51:30.558 -0700,
	POWCHK enabled, PULCHK disabled,
       configuration hash MD5:
       C8 4E 4E 5D D3 5C D8 9E 9F 52 82 E0 59 8A DE 15
       data hash MD5: 64K
       24 D8 59 5C 9F 56 55 68 30 F0 06 BC 20 13 60 97>)
(   2,<2013-10-11 20:52:39.355 -0700>,<Administrator>,<X>,<proc1d>,<TOPSPIN 2.1>,
      <Start of raw data processing
       efp LB = 0 FT_mod = 6 PKNL = 1 PHC0 = 0 PHC1 = 0 SI = 32K 
       data hash MD5: 32K
       C2 49 4D 0F 44 90 B5 09 EA 0F 3E E0 F4 31 E8 9B>)
(   3,<2013-10-11 20:52:39.699 -0700>,<Administrator>,<X>,<proc1d>,<TOPSPIN 2.1>,
      <pk PHC0 = 95.02075 PHC1 = 0 
       data hash MD5: 32K
       DF E4 BF 02 42 37 58 0C 4A CA 7A CC A6 30 BC 34>)
(   4,<2013-10-11 20:52:39.777 -0700>,<Administrator>,<X>,<proc1d>,<TOPSPIN 2.1>,
      <abs ABSG = 1 
       data hash MD5: 32K
       B5 C2 2A 9F 1C AF BD 7A 17 79 5C EE 6F A9 94 BB>)
(   5,<2013-10-11 20:52:39.871 -0700>,<Administrator>,<X>,<proc1d>,<TOPSPIN 2.1>,
      <abs ABSG = 2 
       data hash MD5: 32K
       30 BE 01 E8 76 AA F8 00 CD 97 14 54 03 AA 21 90>)
(   6,<2013-10-11 20:52:39.933 -0700>,<Administrator>,<X>,<proc1d>,<TOPSPIN 2.1>,
      <abs ABSG = 3 
       data hash MD5: 32K
       D1 B2 80 2A E0 74 9D 4F D2 B6 41 C1 73 28 9B 3B>)
(   7,<2013-10-11 20:52:39.980 -0700>,<Administrator>,<X>,<proc1d>,<TOPSPIN 2.1>,
      <abs ABSG = 4 
       data hash MD5: 32K
       83 BD 06 06 AD F6 A2 8C 94 1F BE BB CF 55 3C B4>)
(   8,<2013-10-11 20:52:40.027 -0700>,<Administrator>,<X>,<proc1d>,<TOPSPIN 2.1>,
      <abs ABSG = 5 
       data hash MD5: 32K
       D2 AC 8C 1A DA E3 65 3B 88 66 67 1C BA 3C 29 CB>)
$$ ##END=
$$ 
$$ $$ hash MD5
$$ $$ 07 F3 48 06 6C 4D B3 35 BC EA 92 DA 76 FF BB 51
##$RELAX= 
##$RELAX= 
##$RELAX= 
##$RELAX= 
##$RELAX= 
##$RELAX= 
##$RELAX= 
$$ Bruker specific parameters
$$ --------------------------
##$DU= <E:\>
##$EXPNO= 10
$$ [...]
150 150 150 150 150 150 150 150
##$TP07= 0
##$TPNAME0= <>
##$TPNAME1= <>
##$TPNAME2= <>
##$TPNAME3= <>
##$TPNAME4= <>
##$TPNAME5= <>
##$TPNAME6= <>
##$TPNAME7= <>
##$TPOAL= (0..7)
0.5 0.5 0.5 0.5 0.5 0.5 0.5 0.5
##$TPOFFS= (0..7)
0 0 0 0 0 0 0 0
##$TUNHIN= 0
##$TUNHOUT= 0
##$TUNXOUT= 0
##$USERA1= <user>
##$USERA2= <user>
##$USERA3= <user>
##$USERA4= <user>
##$USERA5= <user>
##$V9= 5
##$VALIST= <valist>
##$VCLIST= <CCCCCCCCCCCCCCC>
##$VD= 0
##$VDLIST= <DDDDDDDDDDDDDDD>
##$VPLIST= <PPPPPPPPPPPPPPP>
##$VTLIST= <TTTTTTTTTTTTTTT>
##$WBST= 1024
##$WBSW= 4
##$XGAIN= (0..3)
0 0 0 0
##$XL= 0
##$YL= 0
##$YMAX_a= 652760
##$YMIN_a= -554174
##$ZGOPTNS= <>
##$ZL1= 120
##$ZL2= 120
##$ZL3= 120
##$ZL4= 120
##$ABSF1= 14.98509
##$ABSF2= -5.573092
##$ABSG= 5
##$ABSL= 3
##$ALPHA= 0
##$AQORDER= 0
##$ASSFAC= 0
##$ASSFACI= 0
##$ASSFACX= 0
##$ASSWID= 0
##$AUNMP= <proc_prof1d_extract_pilot.lims>
##$AXLEFT= 0
##$AXNAME= <>
##$AXNUC= <1H>
##$AXRIGHT= 0
##$AXTYPE= 0
##$AXUNIT= <>
##$AZFE= 0.1
##$AZFW= 0.1
##$BCFW= 0
##$BC_mod= 0
##$BYTORDP= 0
##$COROFFS= 0
##$CY= 15
##$DATMOD= 1
##$DC= 0
##$DFILT= <>
##$DTYPP= 0
##$F1P= 0
##$F2P= 0
##$FCOR= 0.5
##$FTSIZE= 32768
##$FT_mod= 6
##$GAMMA= 0
##$GB= 0
##$INTBC= 1
##$INTSCL= 1
##$ISEN= 128
##$LB= 0
##$LEV0= 0
##$LPBIN= 0
##$MAXI= 10000
##$MC2= 0
##$MEAN= 0
##$ME_mod= 0
##$MI= 0
##$NCOEF= 0
##$NC_proc= -8
##$NLEV= 6
##$NOISF1= 0
##$NOISF2= 0
##$NSP= 0
##$NTH_PI= 0
##$NZP= 0
##$OFFSET= 14.98509
##$PC= 1
##$PHC0= 95.02075
##$PHC1= 0
##$PH_mod= 1
##$PKNL= yes
##$PPARMOD= 0
##$PPDIAG= 0
##$PPIPTYP= 0
##$PPMPNUM= 2147483647
##$PPRESOL= 1
##$PSCAL= 4
##$PSIGN= 0
##$PYNMP= <proc.py>
##$REVERSE= no
##$SF= 400.02
##$SI= 32768
##$SIGF1= 0
##$SIGF2= 0
##$SINO= 400
##$SIOLD= 32768
##$SPECTYP= <>
##$SREGLST= <1H.CDCl3>
##$SSB= 0
##$STSI= 32768
##$STSR= 0
##$SW_p= 8223.68421052631
##$SYMM= 0
##$S_DEV= 0
##$TDeff= 65536
##$TDoff= 0
##$TI= <>
##$TILT= no
##$TM1= 0
##$TM2= 0
##$TOPLEV= 0
##$USERP1= <user>
##$USERP2= <user>
##$USERP3= <user>
##$USERP4= <user>
##$USERP5= <user>
##$WDW= 1
##$XDIM= 32768
##$YMAX_p= 455094122
##$YMIN_p= -739662
##$CURPLOT= <Network HP LaserJet P1505>
##$CURPRIN= <$Network HP LaserJet P1505>
##$DFORMAT= <normdp>
##$LAYOUT= <+/1D_H.xwp>
##$LFORMAT= <normlp>
##$PFORMAT= <normpl>
##$SURQMSG= 1
$$ End of Bruker specific parameters
$$ ---------------------------------
##NTUPLES= NMR SPECTRUM
##VAR_NAME=  FREQUENCY,     SPECTRUM/REAL,   SPECTRUM/IMAG
##SYMBOL=    X,             R,               I
##VAR_TYPE=  INDEPENDENT,   DEPENDENT,       DEPENDENT
##VAR_FORM=  AFFN,          ASDF,            ASDF
##VAR_DIM=   32768,         32768,           32768
##UNITS=     HZ,            ARBITRARY UNITS, ARBITRARY UNITS
##FACTOR=    0.250966925370066, 1,           1
##FIRST=     8223.43324360094, 31521,        -173552
##LAST=      0,             9802,            -115273
##MIN=       0,             -739662,         0
##MAX=       8223.43324360094, 455094122,    0
$$ Real data points
##PAGE= N=1
##DATA TABLE= (X++(R..R)), XYDATA
$$ [...]
$$ plain form
19561 -59027 -332576 -72288 -142029 -404259 98722 60389 -413578 198184 -197917 -73165 276830
19549 65696 6336 57856 -151634 355913 -135781 -341882 -51875 33198 -36127 -6975 -174732
19538 -174732 -387399 -91457 204074 -72475 24541 3611 65099 -130887 -162452 -268725 250582
19526 235202 -99859 -81185 53230 202593 -283705 4976 60987 -53425 -177742 -220687 -76254
19514 -57888 -403 -47560 -173927 281901 -5743 -248191 -12640 -28444 383154 104633 -143292
19502 -83778 -81283 -270441 11508 -24349 -388199 -275275 -102990 -469476 16899 -109717 -261193
19491 -261193 421616 177723 -63946 -144737 -101993 -74088 -42029 -116733 -136209 197073 -161601
19479 -279963 -14447 -46981 -259108 -369467 -62669 141883 -220159 -378529 -33568 37756
$$ packed form
19561e9027k73549g2288o9741k62230I8722l8333d13578A98184a97917g3165B76830
19549F5696F336N1520a51634C55913a35781k06101e1875C3198c6127f975j67757
19538a74732k12667i1457B04074g2475B4541C611O1488a30887l1565j06273B50582
19526B35202i9859J8674E3230J49363b83705D976N6011e3425j24317m2945g6254
19514e7888d03m7157j26367B81901e743k42448a2640j5804C83154A04633a43292
19502h3778K495j89158A1508b4349l63850J12924a02990l66486A6899a09717j51476
19491b61193D21616A77723f3946q0791M2744K7905L2059p4704j9476A97073a61601
19479b79963a4447l2534k12127j10359f2669A41883b20159j58370c3568C7756
$$ plain form
19468 -66952 151343 -372551 89215 -50978 -122430 -35638 33442 -167053 -39508 205201 -225914
19456 81521 -239670 -120976 -288211 10765 -56906 -140779 -90948 -50422 103482 -43074 113245
19444 -38766 -157632 175622 -289180 13861 -190414 37968 114281 173126 -199122 407491
19433 -36025 -136585 294589 -76351 -135545 -61273 -279223 209363 -308409 -27907 -118356 249701
19421 305712 53583 59308 -60406 102542 -138453 74319 155532 -213676 -285633 -64948 -282886
19410 -282886 -124613 49966 -9098 131372 -257436 65873 -192738 127359 129235 -120156 -12881
19398 107909 118978 -40408 -339858 45615 49489 -135207 53125 -133410 -74164 192143 -39102
19386 -52238 -2006 53378 -37385 105804 174088 120410 -98876 42109 -195313 59956 -238904
$$ packed form
19468f6952A51343c72551H9215e0978p1452c5638C3442a67053c9508B05201b25914
19456H1521b39670J18694j67235A0765e6906q3873M9831M0526A03482d3074A13245
19444c8766j18866A75622b89180A3861a90414C7968P6313N8845a99122D07491
19433c6025j00560B94589g6351n9194f1273k17950B09363c08409b7907r0449B49701
19421C05712E3583N725f0406A02542a38453G4319Q1213b13676p1957f4948k17938
19410b82886a24613D9966i098A31372b57436F5873a92738A27359J876a20156a2881
19398A07909J1069d0408k99450D5615L874a35207E3125a33410N9246A92143c9102
19386e2238b006E3378c7385A05804O8284n3678i8876D2109a95313E9956b38904
$$ plain form
19374 196539 -142989 -188678 37059 134499 -320554 100811 -4124 20621 -53205 -51511 -194345
19363 -194345 225411 102377 -48318 -173262 -222978 -23615 27602 212102 -129697 -14734
19352 -120644 -147632 100241 388689 -210463 232327 99245 19813 -55482 21206 55603 -400288
19340 -329975 -128505 -319117 82341 11976 -330402 -57224 -50464 -242086 13371 -451839 -281879
19329 -281879 87601 -317694 -153092 -7651 156304 70522 188366 49209 56471 -66722 235878
19317 -152866 15506 136631 1538 -71535 167454 97371 -73406 -88602 -231996 186742 110470
19306 110470 253951 -104391 203257 3299 -11068 -137667 -38576 103256 285866 211891
19296 211891 -148270 -223580 166155 -218514 135355 -172325 -297410 -147406 -172227 -230118
$$ packed form
19374A96539a42989m5689C7059R7440c20554A00811d124B0621e3205J694j42834
19363a94345B25411A02377d8318j24944m9716b3615B7602J84500a29697a4734
19352a20644k6988A00241K88448b10463B32327I9245A9813e5482B1206L4397d00288
19340c29975a28505j90612H2341A1976c30402e7224O760j91622A3371d51839J69960
19329b81879H7601c17694a53092g651A56304G0522J17844D9209P262f6722B35878
19317a52866A5506J21125A538g1535A67454p0083g3406j5196j43394A86742p6272
19306A10470J43481a04391B03257C299a1068j26599c8576A03256J82610p3975
19296B11891a48270p5310A66155b18514A35355a72325j25085a47406k4821n7891
$$ plain form
19286 -230118 118018 -1788 -106518 -180160 -28141 -20120 -382237 -519691 171896 -198048 253405
19274 51902 20739 -173927 -220873 54482 234658 -267767 277066 -27518 -280688 53509 308034
19263 308034 198439 -4012 226491 -240618 -6166 -100844 50321 -118378 -152322 -22263 76729
19251 139097 -31203 -341017 122302 -104158 66648 -148913 -61132 -13556 204329 -94028
19240 82732 128506 207946 -391899 194559 85246 -236115 45021 -7657 -122025 -136624 112895
19228 41060 -215222 105713 144085 -149518 -408689 -132176 -33729 -128494 216135 -123683
19217 -306146 34390 -50380 -5692 -18487 88117 -199846 -332300 57795 286078 25058 277301
19206 277301 -277131 177527 -38847 281715 186040 29011 -324949 217953 217117 454622 3440
$$ packed form
19286b30118A18018a788j04730p3642b8141Q021l62117j37454A71896a98048B53405
19274E1902B0739a73927m6946E4482J80176b67767B77066b7518k53170E3509K54525
19263C08034j09595d012B26491b40618f166r4678E0321a18378l3944b2263G6729
19251A39097c1203l09814A22302a04158F6648a48913f1132a3556B04329i4028
19240H2732M5774P9440c91899A94559H5246b36115D5021g657j14368j4599A12895
19228D1060b15222A05713L8372a49518k59171a32176c3729r4765B16135a23683
19217c06146C4390e0380e692j2795H8117a99846j32454E7795K28283B5058K52243
19206B77301b77131A77527c8847B81715r5675B9011c24949B17953q36K37505C440
$$ plain form
19194 79434 -285049 -57885 155960 -53890 -182093 -331742 123403 -137864 63355 -197861
19183 -201836 -384718 -96555 -21850 -278739 -64952 48226 -330963 -22873 -173673 26003 -172951
19171 -323735 229562 -124105 31044 -33263 -41005 229279 39005 -250414 -177600 -238606 -149043
19160 -149043 76429 40560 276633 94287 -171146 167419 34674 11579 36742 -128692 -621599
19149 -621599 -222295 285899 -222082 405172 140400 -257058 -360044 -203675 -84617 -11282
19138 14041 238856 -36656 -262978 112967 -167803 -5993 -184664 -5199 51673 -14722 -57358
19127 -57358 -42885 -84838 -138330 -275401 122574 23719 301789 -312931 -38144 -275128 3814
19115 32282 441974 -96037 415885 -16108 -29249 45359 -26195 38394 -85192 -407193 -38830
$$ packed form
19194G9434b85049e7885A55960e3890j28203j49649A23403a37864F3355a97861
19183b01836j82882i6555b1850k56889f4952D8226c30963b2873j50800B6003a72951
19171c23735B29562a24105C1044c3263p742B29279C9005b50414P2814o1006Q9563
19160a49043G6429l5869K36073I4287a71146A67419C4674A1579K5163a28692m92907
19149f21599b22295B85899b22082D05172A40400b57058j02986J56369h4617a1282
19138A4041K24815c6656k26322A12967a67803e993j78671e199E1673a4722m2636
19127e7358J4473m1953n3492j37071A22574B3719K78070c12931c8144k36984C814
19115C2282M09692i6037D15885a6108j3141D5359b6195C8394h5192l22001c8830
$$ plain form
19103 84103 -201863 -86385 235155 -40216 -89507 -27355 -169665 -49731 -70930 -6657 30357
19091 -263696 -213963 -119714 -229024 -71046 -283280 -321895 -74441 -192224 -16641 -172589 227753
19079 -163181 90750 -38799 -90736 48449 -31184 41525 -29982 -169425 18914 256068 307682
19068 307682 -130450 -48038 -522756 -170394 247615 266933 -91929 -37523 22056 -16443 47226
19056 -41689 -170212 -105343 -193927 -144369 67406 -173501 -234115 312743 -3124 -114505 -50930
19044 333050 300461 -72420 287051 -470030 79494 -267519 -63422 -146780 104956 243622
19034 243622 149760 221994 -273067 -54432 -20484 20837 -45221 -225173 47857 243029 56325
19022 -106285 -75056 -257407 111888 22556 152711 179114 31113 143487 18783 -329557
$$ packed form
19103H4103b01863h6385B35155d0216m9291b7355j42310d9731k1199f657C0357
19091b63696M9733R4249j09310g1046k12234l8615g4441j17783a6641j55948B27753
19079a63181I0750c8799n1937D8449c1184D1525b9982j39443A8914K37154N1614
19068C07682a30450d8038m74718a70394B47615J9318i1929c7523B2056a6443D7226
19056d1689j28523O4869q8584M9558F7406a73501o0614C12743c124j11381e0930
19044C33050l2589g2420B87051d70030G9494b67519f3422q3358A04956J38666
19034B43622r3862P2234b73067e4432b0484B0837d5221j79952D7857J95172E6325
19022a06285L1229j82351A11888B2556J30155K6403C1113J12374A8783c29557
$$ plain form
19011 48037 122035 -138742 -491073 -334015 164342 428564 38387 191021 93176 22934
19000 68932 -136187 139355 114815 -193395 210082 -155556 -69974 88679 10144 -24032 319975
18988 -170188 70003 -318979 4658 -81696 -2007 69328 -218684 -12777 78511 -50511 -83010
18977 -83010 -202341 -306731 260048 418678 -144365 -132731 94463 -205488 -49198 -288242
18967 -288242 125509 -285836 -120960 -116438 -62960 -329825 -118257 -114908 -42908 -102795 -153208
18956 -153208 233058 -383561 -38354 106895 -503265 116683 -137063 -46094 259015 -135626
18945 -158225 -136366 -142544 -99960 171243 -102975 40632 91674 -183128 -354253 174121 -307426
18933 -248541 177348 -77390 -52786 7687 -163832 -85419 -233781 -1724 123002 -189233 54493
$$ packed form
19011D8037P3998a38742l52331J57058A64342K64222C8387J52634I3176B2934
19000F8932a36187A39355k4540a93395B10082a55556f9974H8679A0144b4032C19975
18988a70188G0003c18979D658h1696b007F9328b18684a2777G8511e0511l2499
18977h3010j19331j04390B60048J58630a44365J1634I4463b05488d9198k39044
18967b88242A25509b85836a20960M522N3478k66865a18257L349d2908n9887n0413
18956a53208B33058c83561c8354A06895e03265A16683a37063d6094B59015a35626
18945a58225K1859o178M2584A71243a02975D0632N1042a83128j71125A74121c07426
18933b48541A77348g7390K4604G687a63832P8413j48362a724A23002a89233E4493
$$ plain form
18921 -430924 247981 -410758 -10490 43160 -111888 -252818 -338874 117088 -62959 2930 18212
18910 18212 246345 31263 229721 -167593 -55330 -243763 78313 -89540 -47253 -119122 -197879
18899 -197879 -162325 92033 2781 89760 55876 16382 136956 266869 -380986 -95138 -73598
18888 -73598 -10739 -37501 -109486 91072 -123087 -233165 -22584 183225 -116132 -1194 12276
18876 -239469 147419 -69184 52374 -193568 -145779 -232101 -571726 -42400 -161551 -169956 81995
18864 -341789 216082 -45127 55490 5094 -86258 31365 332971 -8708 -16721 -69615 -753 152059
18851 -279465 -299674 36081 157116 -108203 138755 -259221 -22808 23962 -83603 71692 23889
18839 -18328 -125746 -92786 -6064 -9340 20596 143772 -26030 -119375 5897 -200241 -117214 -12882
$$ packed form
18921d30924B47981d10758a0490D3160a11888j40930q6056A17088f2959B930J5282
18910A8212K28133C1263J98458a67593e5330j88433G8313h9540M2287p1869p8757
18899a97879L5554I2033B781Q6979l3884A6382J20574J29913c80986i5138K1540
18888g3598a0739k6762p1985I1072a23087j10078b2584A83225a16132a194A2276
18876b39469A47419f9184E2374a93568M7789q6322l39625d2400j19151q405H1995
18864c41789B16082d5127E5490E094h6258C1365L01606h708q013n2894g53A52059
18851b79465k0209C6081J21035a08203A38755b59221b2808B3962h3603G1692B3889
18839a8328j07418L2960f064l276B0596J23176b6030r3345E897b00241Q3027a2882
$$ plain form
18826 -255811 -184622 -230275 354398 -157886 -11760 53180 -104143 64758 105520 -232637 98822
18814 124970 9897 182631 70453 176530 420443 231960 47170 -197824 42378 33373 178705
18803 178705 40593 82180 -120795 -94183 -88865 -65679 -107732 -180106 -20864 119026 -380076
18791 -414919 -19833 -237599 -120917 -215379 69125 -67568 45644 -43988 -167050 -122723 -123966
18780 -123966 -529779 -66179 174004 76097 133430 -52199 -170284 -11755 -81347 -255819 59179
18768 -170946 29 -108637 224772 120181 -102974 -213481 -64678 85356 -57668 50997 -508222
18756 -138625 -227319 -35212 -11853 110734 -316265 -64051 -90452 -160638 -76736 7568 -193000
18744 -31835 -110681 112334 32673 -59724 -157753 -63617 -59746 -242922 -168309 189313 -167962
$$ packed form
18826b55811P1189m5653C54398a57886a1760E3180a04143F4758M0762b32637I8822
18814A24970I897J72734G0453J06077K43913j88483D7170a97824D2378r005J45332
18803A78705D0593M1587a20795K6612N318K3186m2053p2374b0864A19026c80076
18791d14919a9833k17766J16682r4462F9125f7568D5644d3988j23062M4327j243
18780a23966m05813f6179A74004G6097N7333e2199j18085a1755o9592j74472E9179
18768a70946B9a08637B24772j04591a02974j10507f4678H5356e7668E0997e08222
18756a38625q8694c5212a1853A10734c16265f4051k6401p0186g6736G568a93000
18744c1835p8846A12334C2673e9724r8029f3617L871j83176P4613A89313a67962
$$ plain form
18732 -126289 -156061 157519 -130371 -1225 -10206 -210607 -135928 -64052 145030 67720 -181751
18720 87597 -474958 -456654 -266155 83012 -210377 -8439 1787 -18084 -179631 -303428 106415
18708 23908 -106314 318596 156833 24979 -90922 -523976 209251 -17373 97931 -48877 349459
18696 -132184 -175703 -42722 190957 -191496 79468 101657 162511 -124158 -157410 -291771 33832
18684 -135770 -69449 23475 -105548 317011 -218454 -85481 106977 10247 106202 -107480
18673 -237582 -21246 -144357 299325 -115502 383246 251939 240907 4672 -126400 5399 -147750
18661 275667 -287021 -311177 -37544 362675 -6363 -5212 -6024 415622 127659 273349 64782
18649 -388547 -52526 -304400 -200951 234140 223673 -698 -97089 -166215 -285267 36439 -151543
$$ packed form
18732a26289k9772A57519a30371a225q981k00401P4679f4052A45030F7720a81751
18720H7597d74958J8304J90499H3012b10377h439A787a8084j61547j23797A06415
18708B3908a06314C18596A56833B4979i0922m33054B09251a7373I7931d8877C49459
18696a32184m3519d2722A90957a91496G9468K2189O0854a24158l3252j34361C3832
18684a35770O6321B3475a05548C17011b18454h5481A06977A0247R5955a07480
18673b37582b1246j23111B99325a15502C83246j31307j1032D672a26400E399a47750
18661B75667b87021k4156c7544C62675f363J151q12D15622A27659J45690F4782
18649c88547e2526k51874J03449B34140j0467f98r6391o9126j19052C6439a51543
$$ plain form
18637 -297874 175157 -56263 164890 38265 19839 134596 -55213 -49177 -254371 -23383 -203589
18626 -203589 318602 -151089 -91982 15808 -160821 59806 -215855 -341576 307957 101649
18615 57337 -119844 -19011 -104457 -127202 -68923 -7900 -319724 -23004 213811 70865 -231515
18603 -55474 -158938 -116207 -49535 10445 -179664 -82243 -142802 -13627 89297 -130919 37583
18591 -34841 -493939 -205937 -174114 154757 -85595 -536474 -68929 117517 -35012 -74796 -147278
18580 -147278 166571 118394 93964 -185246 200754 -18399 -75216 238299 104110 -122934
18569 108263 18940 60368 186640 -63322 58006 65869 -135318 -253509 255521 43663 98240
18558 98240 8862 -109135 -298717 334636 -19632 -49753 -243697 -300647 120287 214456 10746
$$ packed form
18637b97874A75157e6263A64890C8265j8426J14757e5213O036k05194b3383j80206
18626b03589C18602a51089N9107A5808a60821E9806b15855j25721C07957A01649
18615E7337a19844a9011q5446k2745N8279g900l11824b3004B13811G0865b31515
18603e5474j03464M2731d9535A0445a79664h2243o0559a3627H9297a30919C7583
18591c4841m59098b05937L1823A54757h5595m50879f8929A17517c5012l9784p2482
18580a47278A66571m8177k4430a85246B00754a8399n6817B38299A04110a22934
18569A08263A8940M1428J26272f3322E8006P863a35318j18191B55521D3663N4577
18558I8240H862a09135j89582C34636a9632l0121j93944n6950A20287R4169A0746
$$ plain form
18546 234808 183012 -422418 247 -28549 47986 -53323 -82859 196892 -242865 369914 -23708
18534 -1459 -240676 -174351 42671 -61075 61552 -224170 -185529 -34445 42889 -287791 -88408
18522 -95064 41889 -277213 -188215 -96126 72847 32589 27917 75214 -183852 7502 -20684 -43562
18510 -43562 -268042 -114611 -180510 67617 -243653 -28393 18237 66460 -23102 -250505 -216645
18499 -216645 99899 -50636 -287754 -297467 -123272 201604 -9497 111830 45258 -38017 132877
18487 -7134 -7165 -97575 186651 286851 -24456 -161297 -277 242373 -311930 -94737 -41151 290035
18474 1700 225646 -206502 201329 263574 -145137 22360 -252748 -247775 127921 -238046 -344232
18463 -344232 -242233 -354664 -79085 -102796 168717 -12917 -10963 6296 145921 90605 -319890
$$ packed form
18546B34808n1796d22418B47b8549D7986e3323k9536A96892b42865C69914b3708
18534a459k39217O6325D2671f1075F1552b24170L8641c4445D2889b87791h8408
18522i5064D1889b77213Q8998R2089G2847C2589m672M7297a83852G502b0684k2878
18510d3562k24480a14611o5899F7617b43653b8393A8237M8223b3102k27403L3860
18499b16645I9899e0636k37118r713a23272B01604i497A11830D5258c8017A32877
18487g134l1r0410A86651J00200b4456j36841b77B42373c11930i4737d1151B90035
18474A700K23946b06502B01329O2245a45137B2360b52748M973A27921b38046j06186
18463c44232J01999j12431g9085k3711A68717a2917J954F296J39625n5316c19890
$$ plain form
18451 -222661 -193874 -46759 63391 -9810 -106722 -167364 -287770 -44137 -239895 46644 -293136
18439 213055 83936 -94372 -275930 -17783 -114470 75839 -149382 124297 -320340 209747
18428 -114736 229805 -125824 -233337 108892 -334397 -23283 -143773 10654 131218 -63481
18417 239668 -87007 65832 -380942 -126185 -60227 -115449 -232379 -113052 75451 -318673
18406 133768 187622 -319156 -11368 128136 -211636 5049 244682 -236750 147455 -107719
18395 49999 -55667 -52532 -377966 -93190 -243204 229705 136631 -111691 26556 -177950 -122514
18384 -122514 -25442 -434298 88436 -54040 -56742 11845 -336883 -85231 -1983 -283379 -20980
18372 38442 119001 -169616 -82623 37597 -100027 227511 -127469 -219577 -86668 150856 3188
$$ packed form
18451b22661K8787d6759F3391i810r6912o0642j20406d4137j95758D6644b93136
18439B13055H3936i4372j81558a7783r6687G5839a49382A24297c20340B09747
18428a14736B29805a25824j07513A08892c34397b3283j20490A0654J20564f3481
18417B39668h7007F5832c80942a26185f0227n5222j16930a13052G5451c18673
18406A33768N3854c19156a1368A28136b11636E049K39633b36750A47455a07719
18395D9999e5667L135l25434i3190j50014B29705r3074a11691B6556a77950N5436
18384a22514b5442m08856H8436e4040k702A1845c36883h5231a983k81396b0980
18372C8442Q0559a69616h2623C7597a00027B27511a27469r2108h6668A50856C188
$$ plain form
18360 124844 431048 109926 -87122 -128589 310018 -58467 -465856 -167003 104105 -67416
18349 65041 133395 55226 -188342 -68099 -61214 -111097 -183691 192149 -102790 95484 -281245
18337 17113 -101241 -145876 -120755 -312854 -432434 31198 -344394 -201968 90741 -134699
18326 3000 40047 -74402 -275707 -524099 51301 -203212 -88663 -53650 -34846 54618 87423
18315 87423 -188152 363832 80140 73000 -206382 412168 31600 46352 -79627 93047 -389362
18303 -262987 -1241 -174329 155521 -23187 10721 -232659 6616 -82253 136924 -189681 148028
18291 -137466 144953 -59733 186919 -82844 -131402 -96465 10560 10286 -96369 111230 -314808
18279 88191 301407 43125 17866 -266145 265722 91829 -137111 133279 54350 -150137
$$ packed form
18360A24844L06204A09926h7122m1467C10018e8467m07389a67003A04105f7416
18349F5041O8354E5226a88342f8099O885m9883p2594A92149a02790I5484b81245
18337A7113a01241m4635K5121j92099j19580C1198c44394J42426I0741a34699
18326C000L7047g4402k01305k48392E1301b03212h8663L5013J8804E4618L2805
18315H7423a88152C63832H0140p140b06382D12168C1600J4752g9627I3047c89362
18303b62987a241j73088A55521b3187A0721b32659F616h2253A36924a89681A48028
18291a37466A44953e9733A86919h2844m8558L4937A0560k74i6369A11230c14808
18279H8191K13216D3125A7866b66145B65722I1829a37111A33279E4350a50137
$$ plain form
18268 -320177 -17950 -45 -14227 91714 22593 -34496 -478811 -172360 34730 13417 141470
18257 141470 202652 -127071 -140735 188743 -205257 -11762 -22778 215489 -188051 -70833
18246 137312 -283428 145806 32651 175306 201542 -94941 -334187 189595 125560 -73947
18235 -71647 -245296 51387 189527 148794 -204981 -17672 -20334 238204 -155370 -67838 124881
18223 232631 -391 -114927 15290 -235346 -20652 -111814 -108202 81865 -121064 -14685 -311045
18212 -311045 220436 187220 -39305 -89126 113018 177883 5530 -49970 -242352 -188169 -209754
18201 -209754 147806 -256253 -73940 -27275 -111840 -62135 -170581 43082 75403 -146007 -17336
18189 -126310 -218137 -439875 -145558 218573 163443 110970 -259492 -106643 -126221 -151089
$$ packed form
18268c20177a7950d5j4182I1714B2593c4496m44315a72360C4730A3417J28053
18257A41470O1182a27071j3664A88743b05257a1762j1016B15489a88051g0833
18246A37312b83428A45806C2651J42655K6236i4941k39246A89595o4035g3947
18235g1647j73649E1387J38140m0733b04981a7672k662B38204a55370f7838A24881
18223B32631c91j14536A5290b35346b0652r1162L612H1865a21064a4685k96360
18212c11045B20436l3216c9305m9821A13018O4865E530d9970j92382N4183k1585
18201b09754A47806b56253g3940b7275q4565M9705j08446D3082L2321a46007a7336
18189a26310r1827k21738a45558B18573n5130n2473b59492a06643j9578k4868
$$ plain form
18179 -151089 -287750 -198052 278774 -97014 79569 -154248 195891 -253657 -176667 -400522
18169 -400522 13129 -33877 86553 15306 34498 -119353 -113795 385840 -60087 -82300 11745
18157 -66944 -488767 -8685 46046 -145178 -122457 -47546 -285458 -60620 -356149 -21667 14811
18145 -157084 -250692 124861 -253795 -6790 87410 -48671 -46784 -348530 72317 186317 -370319
18133 66698 171588 -225460 106679 -166706 -344197 -332199 -181748 -118125 64044 84831
18123 84831 16779 157380 154565 43689 -371422 -68955 -330344 195855 -18238 14810 -3528
18111 -133071 -135713 -228019 -242233 -101194 67067 108703 54685 241415 -207074 -29853 -334150
18100 -334150 -673 16603 64053 -78320 130001 -159715 -91698 59137 -146972 21277 -129396
$$ packed form
18179a51089j36661Q9698B78774i7014G9569a54248A95891b53657P6990k23855
18169d00522A3129c3877H6553A5306J9192a19353N558C85840f0087k2213A1745
18157f6944m21823h685D6046a45178K2721d7546k37912f0620k95529b1667A4811
18145a57084r3608A24861b53795f790H7410d8671J887l01746G2317J14000c70319
18133F6698J04890b25460A06679a66706j77491J1998J50451O3623F4044K0787
18123H4831A6779J40601k815D3689c71422f8955k61389A95855a8238A4810c528
18111a33071k642r2306j4214a01194F7067M1636n4018J86730b07074b9853l04297
18100c34150f73A6603M7450g8320A30001a59715O8017E9137a46972B1277a29396
$$ plain form
18088 98442 162366 -186534 -57076 -111384 -304253 -44063 -61766 -192520 -244372 -52589 -141809
18077 -141809 175108 -321555 65572 -310975 -222406 -149847 -202023 149355 94288 373477
18067 373477 -13898 99335 -140328 169188 -91456 102250 -130736 306941 170993 244748
18057 244748 -303749 133432 287899 140481 514253 33951 136083 273406 -242843 -52445
18046 172137 -74596 187039 104263 24084 -89814 -26590 82525 68897 -29234 84674 -303150
18034 -307226 143310 -317639 -276912 -52367 -159403 -153899 -70993 60890 264269 -93284 -113007
18023 -113007 140880 317637 80059 -41005 57827 15207 65538 185313 -148121 217012
18012 34742 -310009 -147743 -368662 8204 -136532 -107560 -109339 137724 -40288 -76555 -14367
$$ packed form
18088I8442O3924a86534e7076n4308j92869d4063j7703j30754n1852e2589q9220
18077a41809A75108c21555F5572c10975Q8569P2559n2176A49355n5067K79189
18067C73477a3898I9335a40328A69188i1456A02250a30736C06941j35948P3755
18057B44748c03749A33432J54467A40481L73772C3951J02132J37323b42843e2445
18046A72137g4596A87039q2776B4084h9814b6590H2525j3628b9234H4674c03150
18034c07226A43310c17639M0727e2367j07036N504g0993F0890K03379i3284j9723
18023a13007A40880J76757H0059d1005E7827A5207N0331J19775a48121B17012
18012C4742c10009a47743k20919H204a36532K8972j779A37724d0288l6267a4367
$$ plain form
18000 -102720 64661 356157 100841 128418 -185998 94 -114408 245314 -242543 -195850 -299350
17989 -299350 -182951 201825 -182500 -201296 205429 -103343 101728 43861 -211088 -300567
17979 -300567 207515 -89173 -29303 -135745 -12129 -289163 200870 -302808 142283 -13963
17968 -57762 171220 -306521 -149697 -74312 1323 191189 -145398 166310 -265761 -325447
17958 -325447 -445830 39589 -351181 26866 -92780 -167627 263055 -172831 275141 48882
17947 236342 400950 86154 -10416 -277701 -216158 85814 302368 7947 -293034 -422734 -175984
17935 -554218 -126471 -48924 -37035 -303797 190215 -207976 -71761 134274 -202774 314776
17924 -3425 155838 405 -31090 -34365 -102437 -68201 -110532 -16762 -280928 -42918 115377 60417
$$ packed form
18000a02720F4661K91496A00841K7577a85998I4a14408B45314b42543M6693j03500
17989b99350J16399B01825a82500j8796B05429a03343A01728D3861b11088q9479
17979c00567B07515h9173b9303j06442a2129k77034B00870c02808A42283a3963
17968e7762A71220c06521a49697g4312A323J89866a45398A66310b65761n9686
17958c25447j20383C9589c51181B6866i2780p4847B63055a72831B75141D8882
17947B36342J64608H6154a0416k67285O1543H5814K16554G947b93034j29700a75984
17935e54218a26471d8924J1889k66762A90215b07976g1761A34274b02774C14776
17924c425A55838D05c1090l275o8072L4236m2331a6762k64166d2918A15377n4960
$$ plain form
17912 60417 -44236 -138942 -124599 -135834 65038 38708 326628 47295 -9235 -49308 -46605 -174823
17900 -174823 -50633 -203024 -150155 -137738 -357826 -204254 -115561 -101479 -227396 -306345 -143307
17888 -72015 174122 -194828 -6432 -266165 -187293 244750 -129073 -51572 285668 -84311 292027
17876 7679 229676 -217336 -188097 114373 317887 69753 -43781 23044 -147933 236303 -4648
17864 102445 -115289 363797 65845 -87298 -117823 173202 217800 -264857 -138334 -158039
17854 -158039 96864 33754 -80846 -348861 119897 -128017 249017 2492 -170241 -61408 -93925
17843 -93925 7240 -158723 -50448 -59876 -97762 -90711 -59313 -62214 290203 -31098 -329887 -317868
17831 -317868 106048 -431534 -242629 226954 -402420 139857 -34544 143063 136259 -71341
$$ packed form
17912F0417d4236r4706J4343j1235F5038k6330K87920D7295i235m0073K703j28218
17900a74823e0633j52391N2869J2417k20088J53572Q8693J4082j25917p8949a43307
17888g2015A74122a94828f432k59733P8872B44750a29073e1572B85668h4311B92027
17876G679K21997b17336K9239A14373K03514F9753d3781B3044a47933B36303d648
17864A02445a15289C63797F5845h7298l0525A73202M4598b64857J26523j9705
17854a58039I6864C3754h0846k68015A19897a28017B49017B492a70241f1408l2517
17843i3925G240a58723e0448r428l7886P051L1398k901B90203c1098k98789J2019
17831c17868A06048d31534J88905B26954d02420A39857c4544A43063o804g1341
$$ plain form
17820 -288222 4573 -92160 -294597 15990 -4547 7090 96733 -46292 136707 -17294 -27178 -419715
17808 -419715 -234027 -241365 59832 103387 -134981 44719 272984 213577 222487 59416 112964
17797 112964 -135235 297750 70512 79880 -113173 -40888 -53948 -280199 -37670 122373 -56480
17785 38484 77930 -202708 342053 31310 -39959 62819 204863 38482 35205 25706 296558
17774 296558 -82721 89151 258933 -62325 -171435 135557 75271 193108 -108693 79673
17763 93258 135105 410366 -29034 -116787 99479 281546 -186371 -49587 187443 -11702 -84660
17752 -84660 -219359 30904 174395 -136464 -74038 185327 -247507 169860 38627 34198 86709
17741 86709 -132258 118797 250007 330001 90654 26405 -293436 -81890 168393 21875 -209807
$$ packed form
17820b88222D573i2160k02437A5990d547G090Q9643d6292A36707a7294r884l92537
17808d19715J85688p338E9832M3555a34981D4719K28265n9407Q910E9416N3548
17797A12964a35235B97750G0512R368a13173d0888j3060k26251c7670A22373e6480
17785C8484L9446b02708C42053C1310c9959F2819J42044C8482l277r499K70852
17774B96558h2721H9151J69782f2325j09110A35557o0286J17837a08693G9673
17763I3258M1847K75261b9034q7753I9479J82067a86371d9587A87443a1702p2958
17752h4660j34699C0904J43491a36464O2426A85327b47507A69860C8627m429N2511
17741H6709a32258A18797J31210P9994I0654B6405b93436h1890A68393B1875b09807
$$ plain form
17729 257581 -35087 326508 -78742 25790 63639 -187213 -256975 11306 -348897 -98262 117703
17717 -225443 206307 -38813 -52177 -117585 5666 -9075 120418 -15530 13601 72839 -63211
17705 137866 266275 93664 60714 -11266 35717 43520 307768 -130682 75708 -83446 -351319
17694 -351319 -329804 -62376 372853 -65048 -61849 -97951 39863 287752 -28039 -23234 177977
17682 -185944 167183 453915 117500 251360 136419 -129266 23441 -81792 -84089 -92553 -114142
17671 -114142 174733 103333 191242 -31316 120124 306048 -148983 283440 -121209 -263970
17661 -263970 246037 -192829 -151664 110160 -94399 -135428 137710 -214017 -169687 113557
17650 -276806 -182631 -3387 212261 8648 36404 120491 -112667 -42806 -32417 -94141 280074
$$ packed form
17729B57581c5087C26508g8742B5790L7849a87213o9762A1306c48897i8262A17703
17717b25443B06307c8813j3364o5408E666i075A20418a5530A3601N9238f3211
17705A37866J28409I3664l2950a1266C5717P803K64248a30682G5708h3446k67873
17694c51319K1515f2376C72853f5048L199l6102C9863K47889b8039M805A77977
17682a85944A67183K86732A17500J33860j14941a29266B3441h1792k297q464k1589
17671a14142A74733p1400Q7909c1316A20124J85924a48983B83440a21209j42761
17661b63970B46037a92829M1165A10160i4399m1029A37710b14017M4330A13557
17650b76806R4175c387B12261H648K7756Q4087a12667d2806J0389o1724B80074
$$ plain form
17638 319409 -218627 127223 -147368 343157 392642 85338 -7235 213712 -330460 -92775
17627 142006 42390 -185227 30106 277214 -121982 -282154 272967 178021 101782 -81694
17616 -222035 -71321 73496 -117058 15983 114186 117434 -276718 -142089 -113976 352097 -55755
17604 -63894 -152824 -69740 74635 179102 -255370 -311661 102657 -266664 19797 -14791 -174618
17593 -174618 185800 -263503 127985 -313312 -124718 66333 122765 184546 100071 195388
17583 195388 -35631 -93381 -166301 259299 41503 -325798 -209260 -33286 -206536 37480 -103731
17571 72270 41813 211165 -97673 302598 -147014 31594 -267220 146132 108934 41064 92495
17560 92495 26981 24387 -160970 184327 -123844 161860 -92767 -25651 -93195 122190 -149763
$$ packed form
17638C19409b18627A27223a47368C43157M9485H5338g235B13712c30460i2775
17627A42006D2390a85227C0106K47108a21982j60172B72967r4946p6239h1694
17616b22035g1321G3496a17058A5983R8203L248b76718J34629K8113C52097e5755
17604f3894q8930f9740G4635J04467b55370n6291A02657b66664A9797a4791j59827
17593a74618A85800b63503A27985c13312a24718F6333N6432O1781q4475R5317
17583A95388c5631n7750p2920B59299D1503c25798J16538c3286j73250C7480a03731
17571G2270l0457J69352i7673C02598a47014C1594b67220A46132l7198D1064N1431
17560I2495B6981k594a60970A84327a23844A61860i2767b5651o7544A22190a49763
$$ plain form
17548 61222 329347 -79696 -11553 -72408 82397 -102490 169276 229799 261688 135206 -71016
17536 49055 177285 -108032 -16102 -25065 30543 67895 320690 29048 258118 95280 229635
17525 229635 58301 23611 302537 88136 -198981 97589 74224 -141731 37013 -226975 136320
17513 284690 353722 29117 26009 70242 152933 -63984 26983 -45130 -77953 103511 -202125
17501 228779 -63743 308606 77751 -359494 139194 275049 327240 -28406 54863 42898 -86454
17489 252691 76991 169838 335541 22043 55700 -350132 -108022 -18408 37160 206306 459676
17478 459676 151029 176224 5451 180750 108342 -131714 96237 494675 201586 57323 -238007
17466 292367 -90525 241735 38248 -147386 67803 115592 132723 439199 134439 164996 90398
$$ packed form
17548F1222K68125g9696a1553o0855H2397a02490A69276O0523L1889j26482g1016
17536D9055J28230a08032a6102q963C0543L7352K52795B9048K29070I5280J34355
17525B29635E8301B3611K78926H8136a98981I7589k3365a41731C7013b26975A36320
17513B84690O9032B9117l108M4233Q2691f3984B6983d5130l2823A03511b02125
17501B28779f3743C08606G7751c59494A39194J35855N2191b8406E4863j1965h6454
17489B52691G6991R2847J65703B2043L3657c50132a08022a8408C7160J69146K53370
17478D59676A51029K5195E451J75299p2408a31714I6237L98438B01586E7323b38007
17466B92367i0525B41735C8248a47386F7803M7789J7131L06476A34439L0557p4598
$$ plain form
17455 90398 54706 -176164 -87944 508874 182924 354981 95438 -9457 335264 523414 110618
17443 385795 -50666 250587 274192 290906 146510 389486 174901 319739 211157 530611
17433 530611 224552 274746 380643 293803 287045 26348 183507 113007 108697 578379 431673
17422 431673 418172 266829 82894 516685 -39127 321763 105623 174746 422078 268476
17412 268476 88679 489464 229895 365749 152545 471602 -195276 495457 140482 563838
17402 563838 282021 -21365 277692 -116024 -179182 31474 113942 -232004 -80163 371996
17391 -136104 124788 573988 202598 296860 -38881 -97397 304221 323588 162419 -29518
17380 30365 492659 201111 141994 88467 100742 -341900 110547 260756 -14218 -158058
$$ packed form
17455I0398l5692a76164h7944E08874A82924J72057I5438i457C35264J88150A10618
17443C85795e0666B50587K3605J6714j44396K42976A74901J44838j08582L19454
17433E30611B24552N0194J05897q6840o758B6348J57159p0500m310M69682j46706
17422D31673j3501j51343H2894M33791c9127C21763A05623O9123K47332j53602
17412B68476H8679M00785B29895J35854A52545L19057a95276D95457A40482M23356
17402E63838k81817b1365B77692a16024o3158C1474Q2468b32004h0163C71996
17391a36104A24788M49200B02598R4262c8881n8516C04221J9367j61169b9518
17380C0365M62294B01111n9117n3527J2275c41900A10547J50209a4218j43840
$$ plain form
17370 -158058 -82114 -38141 -145999 67967 81435 -99653 485219 278830 144326 95686 159136
17359 159136 59860 -44752 -59171 -217422 365675 97272 12505 32305 111288 296158 201890
17348 201890 165700 -49762 374225 -74231 170249 203332 51957 14973 313746 161771 372988
17337 372988 262369 49834 477298 132041 -91790 175358 251381 217263 357682 519495
17327 519495 106011 228272 41490 407248 40476 -24340 -21386 -205860 163835 141666 391253
17316 391253 129800 87620 125628 -75892 387134 413733 307524 180188 134 238012 230051
17305 230051 367683 330640 138496 35037 47479 135239 35415 243265 4354 395171 -28150
17293 100340 61410 89441 725 47501 231605 196074 171396 -157271 52334 -146700 20884
$$ packed form
17370a58058P5944c8141j07858F7967J3468i9653D85219k06389j34504m8640O3450
17359A59136E9860d4752j4419j58251C65675I7272A2505J9800P8983J84870r4268
17348B01890l6190d9762C74225g4231A70249L3083E1957A4973K98773j51975K11217
17337C72988j10619D9834M27464A32041i1790A75358P6023l4118J40419J61813
17327E19495A06011J22261D1490L65758D0476b4340K954j84474A63835k2169K49587
17316C91253A29800m2180L8008g5892C87134K6599j06209j27336A34K37878p961
17305B30051J37632l7043A38496C5037J2442Q7760C5415K07850D354L90817b8150
17293A00340l8930K8031G25M6776J84104l5531k4678a57271E2334a46700B0884
$$ plain form
17281 238119 67954 -12596 263847 174732 348520 -225427 231044 125205 225670 92641
17270 281317 233725 269897 121449 360854 -27328 197863 -56514 239115 159503 412818
17260 412818 286053 240957 165397 246079 123901 144935 -20524 73478 -59676 358704 -139875
17248 447134 -11074 -23739 364171 -4263 263207 131704 139085 -67968 129784 -144853 -8270
17236 62159 118691 220154 437851 567903 310326 118098 194637 312714 12850 465720
17226 465720 269834 -139332 322842 74461 74375 254569 177782 89390 28287 -114532 233832
17214 333427 162648 -220116 147055 77800 45386 392389 148615 264052 -81213 -153634
17204 -153634 231664 15084 235156 95926 112184 190747 391720 484342 365113 -42395 56036
$$ packed form
17281B38119F7954a2596B63847q9115J73788b25427B31044j05839J00465I2641
17270B81317m7592L6172A21449K39405b7328A97863e6514B39115p9612K53315
17260D12818j26765m5096p5560Q0682j22178K1034b0524G3478e9676C58704a39875
17248D47134a1074j2665C64171d263B63207j31503P381f7968A29784a44853h270
17236F2159N6532J01463K17697J30052k57577A18098P6539J18077A2850M52870
17226D65720j95886a39332C22842G4461q6J80194p6787q8392B8287a14532B33832
17214C33427A62648b20116A47055o9255l2414L47003A48615J15437h1213p2421
17204a53634B31664A5084K20072I5926J6258P8563K00973R2622j19229d2395E6036
$$ plain form
17192 214684 321944 51929 103788 189136 107699 94342 462168 269880 248533 50888 246380
17181 246380 248277 370685 56845 343982 27734 221245 207491 176568 218439 369313 330201
17170 330201 297640 36937 365094 404000 313647 434670 441104 245735 98595 512628 163266
17158 123190 354964 168936 245216 370883 100989 538709 -174243 210149 280663 120102
17147 425267 245493 321768 227542 392015 365946 342995 110885 270157 433271 139210
17136 -205181 302052 392176 369312 336732 106551 243088 174652 5005 233930 220820 211445
17125 211445 269207 441530 48032 14253 549817 77541 224471 490774 540615 105071
17114 289841 318949 186459 178612 528985 463450 419127 538957 365702 543969 440697
$$ packed form
17192B14684J07260E1929N1859Q5348q1437j3357L67826j92288k1347E0888J95492
17181B46380J897J22408E6845K87137B7734J93511j3754l0923M1871J50874l9112
17170C30201l2561C6937L28157L8906r0353J21023O434j95369I8595M14033A63266
17158A23190K31774A68936P6280J25667A00989M37720a74243B10149P0514A20102
17147D25267j79774P6275r4226J64473k6069k2951A10885J59272J63114A39210
17136b05181C02052R0124k2864l2580A06551J36537o8436E005K28925j3110r375
17125B11445N7762J72323D8032A4253N35564G7541J46930K66303M9841A05071
17114B89841K9108j32490p847L50373o5535m4323J19830j73255J78267j03272
$$ plain form
17104 440697 380695 377800 535547 341768 541748 264505 411383 456817 580386 169138
17093 334277 52166 291523 641813 429889 403811 423232 368089 279942 30756 274585 455852
17082 455852 306995 482877 676714 128855 400676 446887 442402 72316 179669 163524
17072 163524 420167 509469 423017 619727 237224 454364 770467 661714 452346 538968
17062 538968 220442 335291 432085 689526 336741 424514 493107 506164 471753 379207 567829
17051 567829 435570 721441 390314 515418 563345 665785 207346 607162 764001 516467
17041 516467 400649 661348 496892 644445 482862 379007 290540 422351 409591 657634
17031 657634 764233 566698 370306 644658 490546 760456 666092 722819 566153 603886
$$ packed form
17104D40697o0002k895J57747j93779J99980B64505J46878M5434J23569A69138
17093C34277E2166K39357L50290k11924k6078J9421n5143q8147C0756K43829J81267
17082D55852j48857J75882J93837A28855K71821M6211m485G2316J07353j6145
17072A63524K56643Q9302q6452J96710B37224K17140L16103j08753k09368Q6622
17062E38968B20442J14849R6794K57441C36741Q7773O8593J3057l4411r2546J88622
17051E67829j32259K85871l31127J25104M7927J02440B07346L99816J56839k47534
17041E16467j15818K60699j64456J47553j61583j03855q8467J31811j2760K48043
17031F57634J06599j97535j96392K74352j54112K69910r4364N6727j56666L7733
$$ plain form
17021 603886 621381 732648 580430 638522 313362 790425 164401 451138 720635 330081
17010 1119441 981726 460477 435507 603035 601246 646918 157667 501846 630461 827411
17000 827411 527959 442341 493566 811347 604796 719882 535096 592090 656348 547584
16990 547584 803714 385006 727479 623791 832719 606764 924746 638854 649861 895463
16980 895463 1121464 738690 599184 511454 754669 935004 948141 981578 1094935 612762
16970 612762 522072 761937 523185 1177631 831899 884406 832346 1021960 710422 917059
16960 917059 1050973 790682 777287 787119 828285 926856 838808 1148894 990610 1092244 841243
16949 841243 751930 1157390 1022936 1067433 1123294 1053497 887422 1036194 819089 1145120
$$ packed form
17021F03886J7495J11267j52218N8092C13362M77063A64401K86737K69497C30081
17010A119441j37715D60477k4970J67528j789M5672A57667L44179J28615J96950
17000H27411k99452q5618N1225L17781k06551J15086j84786N6994O4258j08764
16990E47584K56130C85006L42473j03688K08928k25955L17982k85892J1007K45602
16980H95463K26001l82774j39506q7730K43215J80335J3137L3437J13357m82173
16970F12762r0690K39865k38752O54446l45732N2507n2060J89614l11538K06637
16960I17059J33914k60291j3395R832M1166R8571q8048L10086j58284J01634k51001
16949H41243q9313M05460j34454M4497N5861o9797j66075J48772k17105L26031
$$ plain form
16939 1145120 1126458 772531 1126857 1094174 1039564 1235128 994019 931962 1036050 1519023
16929 1519023 988518 1290448 1349216 1142901 1370876 943551 1188893 1395046 1500790 1454406
16919 1454406 1482375 1380058 1391609 1184369 1392720 1457759 1252863 1311586 1403144 1806003
16909 1806003 1520117 1918546 1553798 1249583 1615856 1730440 1234667 1620304 1316683
16900 1316683 1513612 1536369 1301102 1753685 2009479 1593053 1861532 1568760 1547777 2217098
16890 2217098 2064639 1728565 1694901 1707649 1775982 2054240 2147919 1616660 1904701 2005606
16880 2005606 1690368 1956118 2135701 2386323 2285801 2334412 2163672 2028966 2551002 2408185
16870 2408185 2248523 2230323 2385971 1898478 2704969 2549797 2814259 2532260 2634592 2774616
$$ packed form
16939A145120j8662l53927L54326l2683n4610J95564k41109o2057J04088M82973
16929A519023n30505L01930N8768k06315K27975m27325K45342K06153J05744m6384
16919A454406K7969j02317J1551k07240K08351O5039k04896N8723R1558M02859
16909A806003k85886L98429l64748l04215L66273J14584m95773L85637l03621
16900A316683J96929K2757k35267M52583K55794m16426K68479k92772k0983O69321
16890B217098j52459l36074l3664J2748O8333K78258R3679n31259K88041J00905
16880B005606l15238K65750J79583K50622j00522M8611j70740j34706N22036j42817
16870B408185j59662j8200J55648m87493Q06491j55172K64462k81999J02332J40024
$$ plain form
16860 2774616 2580890 2533304 2588191 2855323 2514414 3017723 3014883 2861785 2681003 2883665
16850 2883665 3191450 2852946 3362952 3207618 2949107 3197701 3281032 3327447 3160320 3512921
16840 3512921 3735006 3666003 3710110 3800302 3466180 3876990 3633329 4091734 4022564 4042551
16830 4042551 4229338 4146300 4491429 4308707 4439372 4042714 4683428 4581110 4629196 5039818
16820 5039818 4735561 5146550 4920557 5280411 5478060 5388910 5548456 5423885 5801168 5767097
16810 5767097 6183495 6001842 6154133 6744921 6528689 6528303 6843392 7047066 7440703 7159908
16800 7159908 7545559 7642770 8074250 7998113 8180665 8364580 8632621 8923784 9014316 9482552
16790 9482552 9514560 9777882 10322194 10168813 10528785 10928758 11443895 11950029 12493377 12218381
$$ packed form
16860B774616j93726m7586N4887K67132l40909N03309k840j53098j80782K02662
16850B883665L07785l38504N10006j55334k58511K48594Q3331M6415j67127L52601
16840C512921K22085o9003M4107R0192l34122M10810k43661M58405o9170J9987
16830D042551J86787q3038L45129j82722J30665l96658O40714j02318M8086M10622
16820E039818l04257M10989k25993L59854J97649q9150J59546j24571L77283l4071
16810E767097M16398j81653J52291N90788k16232l86L15089K03674L93637k80795
16800G159908L85651R7211M31480p6137J82552J83915K68041K91163R0532M68236
16790I482552L2008K63322N44312j53381L59972L99973N15137N06134N43348k74996
$$ plain form
16780 12218381 13017981 13151785 13579221 14261872 14548935 14918696 15635221 15811250 16623909
16771 16623909 16812767 17335786 18368155 19217382 19704030 20531835 21254444 22137266 22865813
16762 22865813 23793005 24867916 25729931 26749111 28243975 29552389 30590364 31851128
16754 31851128 33536742 35220865 37044892 38382704 40960275 42727660 44956040 47522592
16746 47522592 50128199 53249175 56030237 59323742 63094233 67042334 70901482 75360792
16738 75360792 79913130 84996863 90768102 96333414 102821264 109316794 116404347 124260329
16730 124260329 132122079 140148233 148907643 157147389 165828443 174100707 181958262 188886094
16722 188886094 195695738 200818587 205085487 207798093 208897033 208620995 206560952 203020031
$$ packed form
16780A2218381P99600J33804M27436O82651K87063L69761P16525J76029Q12659
16771A6623909J88858N23019J032369Q49227M86648Q27805P22609Q82822P28547
16762B2865813R27192J074911Q62015J019180J494864J308414J037975J260764
16754C1851128J685614J684123J824027J337812K577571J767385K228380K566552
16746D7522592K605607L120976K781062L293505L770491L948101L859148M459310
16738G5360792M552338N083733N771239N565312O487850O495530P087553P855982
16730A24260329P861750Q026154Q759410Q239746Q681054Q272264P857555O927832
16722A88886094O809644N122849M266900K712606J098940k76038k060043l540921
$$ plain form
16714 203020031 198296498 192257194 185451238 177953983 169353195 160993174 152425205 143741482
16706 143741482 135317181 127086847 119115796 111409713 104708266 97827759 92010739 85643938
16698 85643938 80696013 75246451 71074685 66652014 62675602 59332601 55934912 52815274
16690 52815274 49639692 47074875 44727339 42182358 40083282 38172091 36542167 34381278
16682 34381278 32628569 31284530 30063209 28881726 27364924 26208022 24706864 23923141
16674 23923141 22708786 21979383 20915746 20223886 19442738 18652514 18119910 17117460 16647964
16665 16647964 16215964 15655488 15117748 14358063 13958619 13472435 13089848 12671867 12342535
16656 12342535 12137089 11774556 11185605 10570851 10450101 10222045 9925941 9435051 9345035
$$ packed form
16714B03020031m723533o039304o805956p497255q600788q360021q567969q683723
16706A43741482q424301q230334p971051p706083o701447o880507n817020o366801
16698H5643938m947925n449562m171766m422671l976412l343001l397689l119638
16690E2815274l175582k564817k347536k544981k099076j911191j629924k160889
16682C4381278j752709j344039j221321j181483j516802j156902j501158p83723
16674B3923141j214355p29403j063637o91860p81148p90224n32604j002450m69496
16665A6647964m32000n60476n37740p59685l99444m86184l82587m17981l29332
16656A2342535k05446l62533n88951o14754j20750k28056k96104m90890r0016
$$ plain form
16647 9345035 8912946 8841427 8962008 8474545 8277759 7742248 7448735 7555504 7146134 6770035
16637 6770035 6986451 7216551 6657452 6504348 6303832 6461782 5993241 6002148 5754189 5861325
16627 5861325 5934139 5611044 5124931 5215922 5205873 5172233 5010223 4672369 4558931 4508505
16617 4508505 4366392 4481425 4203228 4200235 4212020 4122868 4035142 3775116 3616577 3651269
16607 3651269 3989968 3581377 3518998 3401414 3503265 3456930 3431708 3372953 3531577 3243984
16597 3243984 3010656 2951224 2906695 3198101 2564119 2968588 3046990 2426797 2946338 2712683
16587 2712683 2578682 2734108 2376271 2412670 2598343 2557958 2530792 2401730 2499596 1933533
16577 1933533 2282004 2250043 2221484 2424598 1733984 2072350 2141559 1971917 2220641 1973518
$$ packed form
16647I345035m32089p1519J20581m87463j96786n35511k93513J06769m09370l76099
16637F770035K16416K30100n59099j53104k00516J57950m68541Q907k47959J07136
16627E861325P2814l23095m86113R0991j0049l3640j62010l37854j13438n0426
16617D508505j42113J15033k78197k993J1785q9152q7726k60026j58539L4692
16607C651269L38699m08591o2379j17584J01851m6335k5222n8755J58624k87593
16597C243984k33328n9432m4529K91406o33982M04469P8402o20193N19541k33655
16587B712683j34001J55426l57837L6399J85673m0385k7166j29062R7866n66063
16577A933533L48471l1961k8559K03114o90614L38366O9209j69642K48724k47123
$$ plain form
16567 1973518 2215515 1981769 1858004 1756904 1681244 2042062 1563757 1746168 1803498 1946539
16557 1946539 1558748 2000315 1719429 2017849 1970971 1492101 1422280 1801246 1246527 1340724
16547 1340724 1277782 1471161 1360133 1432447 1269971 1378863 1364718 1238933 1374355 1497301
16537 1497301 1411565 1198860 1528743 1501184 1300454 1155047 1430846 1414434 1205687 1167512
16527 1167512 1346445 823233 1294192 847760 1232427 1142263 1393709 943786 1062707 1414156
16517 1414156 1383173 1356777 1097313 1438910 809881 904597 694214 1022715 871584 999051
16507 999051 1380401 936023 1343531 659538 679941 788611 822447 748421 931944 838872
16497 838872 819327 766702 930077 624987 1011926 1074561 850261 798812 1088228 913972
$$ packed form
16567A973518K41997k33746j23765j01100p5660L60818m78305J82411N7330J43041
16557A946539l87791M41567k80886K98420m6878m78870o9821L78966n54719R4197
16547A340724o2942J93379j11028P2314j62476J08892j4145j25785J35422J22946
16537A497301q5736k12705L29883k7559k00730j45407K75799j6412k08747l8175
16527A167512J78933n23212M70959m46432L84667r0164K51446m49923J18921L51449
16517A414156l0983k6396k59464L41597o29029R4716k10383L28501j51131J27467
16507I99051L81350m44378M07508F59538K0403J08670L3836p4026J83523r3072
16497H38872j9545n2625J63375l05090L86939O2635k24300n1449K89416j74256
$$ plain form
16487 913972 1022967 944766 845932 615007 959481 1082440 913250 561558 613492 728873
16477 728873 622546 1057335 579437 432556 783596 787870 836902 816756 693294 853132
16467 853132 553286 609506 311531 618964 511262 983036 929745 709412 559556 660613
16457 660613 588210 549562 544663 785841 828459 702240 724479 756718 481207 224623 554905
16446 554905 684510 455067 622407 379406 763843 373761 273393 475291 411811 652549
16436 652549 552678 454193 364571 703681 387638 365095 305604 579621 584822 716994 539305
16425 539305 239779 594392 676519 480286 764216 255312 374788 616068 523547 621866
16415 621866 310674 449464 203237 506177 511195 441159 425601 613761 587004 599703 289633
$$ packed form
16487I13972J08995p8201r8834k30925L44474J22959j69190l51692N1934J15381
16477G28873j06327M34789m77898j46881L51040M274M9032k0146j23462J59838
16467H53132k99846N6220k97975L07433j07702M71774n3291k20333j49856J01057
16457F60613p2403l8648m899K41178M2618j26219K2239L2239k75511B24623L30282
16446E54905J29605k29443J67340k43001L84437C73761j00368K01898o3480K40738
16436F52549r9871r8485q9622L39110l16043k2543n9491K74017N201J32172j77689
16425E39305B39779L54613Q2127j96233K83930B55312J19476K41280r2521R8319
16415F21866C10674J38790B03237L02940N018p0036j5558J88160k6757J2699B89633
$$ plain form
16403 751020 506344 446789 812121 551137 412572 589777 462811 793166 609008 324302
16393 324302 497285 508173 607779 165708 551254 353739 406240 620512 500139 63882
16382 599472 44212 517121 580708 290807 481710 297833 358038 242567 438255 344154
16372 344154 344967 454894 669083 285454 454221 396361 278282 270653 486137 333092 584091
16361 584091 243573 155485 269432 138627 358372 8516 276692 257526 327609 561460
16351 561460 213493 352230 169892 155044 562409 90567 88056 143034 -56261 344713 544191
16340 544191 213277 225764 329831 469681 652653 420381 552486 249900 65023 131413
16330 131413 224641 257885 187486 419153 229797 260813 102777 310841 47207 92749 437363
$$ packed form
16403G51020k44676n9555L65332k60984j38565J77205j26966L30355j84158k84706
16393C24302J72983J0888R9606A65708L85546j97515N2501K14272j20373F3882
16382E99472D4212M72909O3587k89901J90903j83877O0205j15471J95688r4101
16372C44154Q13J09927K14189B85454J68767n7860j18079p629K15484j53045K50999
16361E84091B43573q8088J13947j30805K19745H516K68176j9166P0083K33851
16351E61460B13493J38737A69892j4848M07365I0567k511N4978e6261C44713J99478
16340E44191B13277J2487J04067J39850J82972k32272J32105B49900F5023O6390
16330A31413R3228L3244p0399K31667j89356L1016A02777K08064D7207M5542L44614
$$ plain form
16319 437363 254222 650100 118675 221553 252364 578249 163168 433122 506712 -1799
16308 239705 368492 421508 308772 173344 -118078 332090 223397 287203 28988 275129
16298 275129 71160 420735 169058 135573 309214 269239 255673 68572 202927 -30170 601069
16286 219456 645992 689896 349679 20434 111671 10355 413032 128993 337686 132996
16275 21970 173099 331296 96599 473275 356956 333376 367831 408276 26047 302487 462270
16264 462270 300732 197676 304859 229947 205912 18152 387715 -18628 54128 380832
16254 380832 247492 387874 230618 -463876 150226 262375 322577 473612 515682 -100858
16243 371598 438204 251757 498210 -367661 165979 -106368 206426 64927 213901 -10461
$$ packed form
16319D37363j83141L95878A18675J02878L0811L25885A63168K69954P3590a799
16308B39705J28787N3016j12736j35428a18078C32090j08693O3806B8988K46141
16298B75129G1160L49575A69058l3485J73641l9975j3566F8572J34355c0170F01069
16286B19456M26536M3904l40217B0434R1237A0355M02677A28993K08693A32996
16275B1970J51129J58197I6599L76676j16319k3580L4455M0445B6047K76440J59783
16264D62270j61538j03056J07183p4912k4035A8152L69563a8628E4128L26704
16254C80832j33340J40382j57256d63876A50226J12149O0202J51035M2070a00858
16243C71598O6606j86447K46453c67661A65979a06368B06426F4927J48974a0461
$$ plain form
16232 -140858 115234 114447 37141 397057 95289 257126 59035 -44239 307483 -81461 142078
16220 53283 99746 -54971 296426 290183 152149 60302 234938 328553 327968 -299163 150424
16208 152140 58433 214220 402928 186229 248534 117937 168711 -170022 123796 249994
16198 249994 211456 42935 236181 -14195 82334 -13122 147472 -124816 -100640 115445 173557
16187 173557 121457 165523 146990 431123 153474 850 -63896 273627 -86625 -145826 348763
16175 116224 154732 -11337 145837 81112 280342 -317645 211288 79253 187915 186355 269888
16164 269888 22413 63893 -42741 115174 -93566 -98614 1414 319054 -156087 98859 -19514
16152 -11256 480115 348923 266896 284889 -19777 113917 149107 26891 201591 -11963 240601
$$ packed form
16232a40858A15234p87C7141L59916I5289J61837E9035d4239C07483h1461A42078
16220E3283M6463e4971B96426o243j38034F0302J74636R3615n85b99163A50424
16208A52140E8433J55787J88708A86229O2305A17937N0774a70022A23796J26198
16198B49994l8538D2935J93246a4195H2334a3122A47472a24816K4176A15445N8112
16187A73557n2100M4066j8533K84133A53474H50f3896B73627h6625n9201C48763
16175A16224L8508a1337A45837o4725J99230c17645B11288G9253J08662j560Q3533
16164B69888B2413M1480d2741A15174i3566n048A414L17640a56087I8859a9514
16152a1256D80115j31192q2027J7993a9777A13917L5190B6891J74700a1963B40601
$$ plain form
16140 109436 104293 -38266 189581 -36737 -112367 -91167 165979 347381 69825 -104622 -101353
16129 -101353 290177 100481 145528 225293 470952 12431 252157 169167 -148138 78870
16118 228624 -143154 306668 106738 253527 8625 275712 -186169 163800 -127289 -26673
16107 9256 63652 -35864 -183224 -181821 -240490 325061 97738 33018 -44058 51825 425454
16096 425454 -210969 -232550 -40878 129841 152251 -115305 56128 164854 101226 -94458 -117748
16085 -117748 -178092 296352 147876 131511 362973 18923 -549908 127753 -97204 65598
16074 -43181 -105103 58089 67537 4656 -241882 78400 59491 111634 306022 107877 75761
16063 75761 178927 -207402 -178156 -154033 160322 121570 52194 -147547 -40212 -181507 -257906
$$ packed form
16140A09436n143c8266A89581c6737p5630K1200A65979J81402F9825a04622L269
16129a01353B90177A00481M5047P9765K45659A2431K39726q2990a48138G8870
16118B28624a43154C06668A06738J46789H625K67087a86169A63800a27289b6673
16107I256N4396c5864j47360J403n8669C25061I7738C3018d4058E1825L73629
16096D25454b10969k1581d0878A29841K2410a15305E6128J08726o3628i4458k3290
16085a17748o0344B96352A47876j6365K31462A8923e49908A27753i7204F5598
16074d3181o1922E8089R448D656b41882G8400j8909N2143J94388A07877l2116
16063G5761J03166b07402K9246K4123A60322l8752E2194a47547d0212j41295p6399
$$ plain form
16052 -257906 46377 -230877 63691 -266597 22729 -26365 42472 52612 -270270 94866 -28996
16040 -159022 464634 -220028 -118087 -257666 -53195 87060 -226081 164485 48094 142121
16030 142121 8560 241313 -259474 -49373 286096 -78448 114128 -47875 14754 -269999 81537
16018 -189535 -95932 127677 -360591 57265 160966 2551 24984 -52882 121270 254223 -334824
16006 55237 -96496 127534 -347156 124782 193558 -200871 -155889 225066 -116739 -161401
15996 -161401 -238568 -227296 -121140 344439 21654 130779 -77877 83477 37247 99728 -168742
15984 -38605 -27984 -138831 -66427 352240 55932 -97357 228542 -134582 18208 220693 -243802
15972 110729 282832 352640 -428540 172142 10842 93636 153327 268139 -417969 -548 392122
$$ packed form
16052b57906D6377b30877F3691b66597B2729b6365D2472J0140b70270I4866b8996
16040a59022D64634b20028J01941j39579e3195H7060b26081A64485D8094R4027
16030A42121H560K32753b59474d9373B86096g8448A14128d7875A4754b69999H1537
16018a89535R3603A27677c60591E7265J03701B551K2433e2882A21270J32953c34824
16006E5237i6496A27534c47156A24782O8776b00871M4982B25066a16739m4662
15996a61401p7167J1272J06156C44439B1654J09125g7877H3477C7247O2481a68742
15984c8605J0621j10847f6427C52240E5932i7357B28542a34582A8208K02485b43802
15972A10729J72103O9808d28540A72142A0842Q2794N9691J14812d17969e48C92122
$$ plain form
15960 118916 290163 -129078 75807 -194726 -565790 -128260 -74913 276075 50487 -288315
15949 -155022 -149843 -2291 -99319 -256212 52525 -116014 -189219 -107700 -80102 -160140 61811
15937 23689 -161646 -296850 -157198 -145510 -90051 -184396 199051 -390636 -3446 -359275 -208858
15926 -208858 -160395 -221723 -268718 -20229 91951 -30009 -23653 -41027 36104 -114979 -115427 -63441
15914 -63441 -150724 202103 175970 -150114 -49723 135025 -104079 -113026 -156804 -399117 -161746
15902 -323491 66521 34112 211497 -107847 85463 407537 236725 -102703 -376395 73530
15891 -288053 -36940 -176322 -141480 -365611 -40931 74271 -173172 115800 -63556 -159285 56579
15879 367034 70500 5542 166767 163784 15391 -131144 115030 160370 -7163 83383 -422848
$$ packed form
15960A18916J71247a29078G5807a94726l71064a28260N3347B76075E0487b88315
15949a55022N179b291r7028j56893E2525a16014p3205Q1519K7598q0038F1811
15937B3689a61646j35204J39652J1688N5459r4345A99051c90636c446l55829J50417
15926b08858M8463o1328m6995b0229I1951c0009O356j7374C6104a14979m48N1986
15914f3441q7283B02103k6133a50114d9723A35025a04079q947m3778k42313a61746
15902c23491F6521l2409J77385a07847H5463L22074j70812a02703k73692G3530
15891b88053c6940j39382L4842k24131d0931G4271a73172A15800f3556r5729E6579
15879C67034G0500E542J61225k983A5391a31144A15030M5340g163H3383d22848
$$ plain form
15867 -39980 52733 -120271 -72233 64161 -26849 -157857 59519 42560 -226685 -277592 219763
15855 -62412 -81768 -68267 36029 -423771 -71203 -70648 176139 185399 156890 -29493 -49439 -214170
15843 -214170 166974 -222365 -23771 -59519 -357248 116834 69611 46795 -129671 17758
15832 113733 93233 17848 -138173 12150 -67900 180124 -308592 14014 -39507 -99527 -191326
15821 -191326 -292127 -282621 -153966 231791 49657 108759 82736 15186 -123316 155309 -59383
15809 153310 139743 88659 -92721 -121777 143546 -171819 -238401 12915 262283 135099 74503
15798 74503 -141621 87360 -17969 31240 -333908 -86658 -56780 -34544 2014 -298993 40812
15786 -178113 -331462 -261128 -63168 -213548 -202133 -411058 22906 -67802 -370766 286338
$$ packed form
15867c9980E2733a20271M8038F4161b6849j31008E9519j6959b26685n0907B19763
15855f2412j9356J3501C6029d23771g1203N55A76139R260k8509b9493j9946j64731
15843b14170A66974b22365b3771l5748k97729A16834m7223k2816a29671A7758
15832A13733k0500A7848a38173A2150f7900A80124c08592A4014c9507o0020r1799
15821a91326j00801R506J28655B31791D9657N9102k6023A5186a23316A55309e9383
15809A53310j3567n1084i2721k9056A43546a71819o6582A2915K49368j27184o0596
15798G4503a41621H7360a7969C1240c33908h6658K9878K2236B014b98993D0812
15786a78113j53349P0334f3168j50380J1415k08925B2906f7802l02964B86338
$$ plain form
15775 -100700 -163104 203122 -149223 -107171 -85821 -122914 248198 -234781 -33391 -36179 -165958
15764 -165958 -363876 -272665 -199943 -455923 -381077 -300197 52719 -115633 79747 -151390 113346
15752 33970 20114 -303795 -122176 -12273 -222952 198282 -22072 -318633 -60099 335191
15741 -29943 -123265 -126850 21404 154309 -25471 206425 232911 -141861 -81172 -288263 154090
15729 82515 282478 -276463 117793 -118275 -251817 -42801 114005 -267310 205691 -72035
15718 -108943 -7828 -4550 44782 -188787 -14362 -336252 85008 -256645 -394718 -171938 39996
15706 -81495 160801 -32511 72949 -49556 -64735 -253419 190819 79414 40971 -112425 -23861
15694 114320 -58967 -216523 133173 293099 -15325 -9713 121856 -85189 153737 118405 -89863
$$ packed form
15775a00700o2404B03122a49223M2052K1350l7093B48198b34781c3391k788j29779
15764a65958j97918R1211P2722k55980P4846Q0880E2719a15633G9747a51390A13346
15752C3970j3856c03795a22176a2273k10679A98282b2072k96561f0099C35191
15741b9943r3322l585B1404J32905b5471B06425K6486a41861O0689k07091A54090
15729H2515J99963b76463A17793a18275j33542d2801A14005b67310B05691g2035
15718a08943g828L278D4782a88787a4362l21890H5008b56645j38073a71938C9996
15706h1495A60801c2511G2949d9556j5179j88684A90819G9414l8443a12425b3861
15694A14320e8967j57556A33173J59926a5325N612A21856h5189A53737l5332h9863
$$ plain form
15682 -53120 -150771 62626 66795 207692 47023 53555 201296 25168 -5065 92013 -359697 160659
15669 -121276 411394 -13983 231775 54911 -14287 210745 177781 63085 -218888 -250307 265830
15657 -139404 -203660 -418187 119079 53589 -141506 -337640 -49295 -156607 250570 -51978
15646 -146887 118004 -125244 116016 -253426 105726 -41773 -238150 -142524 -307534 -329110
15636 -329110 -179675 -43051 -314532 403414 39479 -314678 352082 136314 -160551 201784
15625 -132926 204634 -38672 89339 -176378 -1395 267899 19723 -135786 61095 115389 11733
15613 -230727 78660 -261370 -109058 232085 -481232 -247781 -160730 248211 231968 235627
15603 235627 -18160 96511 -121360 164325 3748 32613 63159 165409 13201 -315821 -335
$$ packed form
15682e3120r7651F2626M169J40897D7023O532J47741B5168e065I2013c59697A60659
15669a21276D11394a3983B31775E4911a4287B10745l2964F3085b18888l1419B65830
15657a39404o4256k14527A19079E3589a41506j96134d9295j07312B50570e1978
15646a46887A18004a25244A16016b53426A05726d1773j96377R5626j65010k1576
15636c29110J49435d3051k71481D03414C9479c14678C52082A36314a60551B01784
15625a32926B04634c8672H9339a76378a395B67899A9723a35786F1095N4294A1733
15613b30727G8660b61370a09058B32085d81232K33451Q7051B48211j6243L659
15603B35627a8160I6511a21360A64325C748K8865L0546J02250A3201c15821c35
$$ plain form
15591 -190769 29910 -217360 80574 70973 -183819 52802 -142697 162469 -226296 -124815
15581 -124815 -97459 144251 82056 32417 -100676 80309 -174962 275136 -82305 251890
15570 189123 -312554 -429950 -202284 199526 -229570 -109719 -131992 -282747 189807 -242192
15559 -12484 -150015 1439 -189863 -148628 43258 53856 160570 -63436 147650 -177590 -199413
15548 -199413 53793 -291336 5410 146390 -78675 111030 -22806 -70035 -61962 -26951 -317529
15537 -317529 -123042 188754 -321132 -121668 51259 -3228 -5550 62376 -227291 2276 -43419
15525 -131075 46872 5839 -5207 39208 -29437 -206888 -138987 244253 291501 300474 307101 207119
15513 207119 -92662 -284268 45130 -536716 -437373 220903 207560 59226 -126604 76434 71880
$$ packed form
15591a90769B9910b17360H0574r601a83819E2802a42697A62469b26296J01481
15581a24815K7356A44251o2195C2417a00676H0309a74962B75136h2305B51890
15570A89123c12554j17396b02284A99526b29570a09719k2273j50755A89807b42192
15559a2484j37531A439a89863M1235D3258J0598J06714f3436A47650a77590k1823
15548a99413E3793b91336E410J40980g8675A11030b2806m7229Q073b6951k90578
15537c17529a23042A88754c21132a21668E1259c228k322F2376b27291B276d3419
15525a31075D6872E839e207C9208b9437j77451O7901B44253M7248Q973O627r9982
15513B07119i2662j91606D5130e36716R9343B20903j3343E9226a26604G6434m554
$$ plain form
15502 71880 -255878 33506 67432 -395854 -82633 -126728 20081 -15700 140088 -96768 15456
15490 110598 -15561 -97693 172564 342405 23354 33071 -78308 -185053 9444 263520 -84890
15478 -218006 43550 -53525 -33246 67628 214703 346368 -420483 -28534 -47690 -46007 -762
15466 2560 81400 297440 -58840 11265 115663 106335 26205 207174 -87140 -63317 63643
15454 -29531 184978 30776 277182 327643 177567 -260218 381411 54852 -225742 -40119
15443 105767 -299491 9943 311495 462086 201325 216410 -23050 12888 498914 321643
15433 321643 -153080 5832 -169854 126716 -132711 -193673 -5662 141085 -3404 110541 -214598
15421 77109 -112181 -59908 -78014 112252 212671 -93496 90615 118871 51962 37938 -247965
$$ packed form
15502G1880b55878C3506L3926c95854h2633m4095B0081a5700A40088i6768A5456
15490A10598a5561q2132A72564J69841B3354R717g8308j06745I444K54076h4890
15478b18006D3550e3525K0279F7628J47075J31665d20483b8534j9156J683g62
15466B560P8840K16040e8840A1265J04398r328B6205J80969h7140K3823F3643
15454b9531A84978C0776K46406N0461j50076b60218C81411E4852b25742d0119
15443A05767b99491I943L01552J50591B01325J5085b3050A2888M86026j77271
15433C21643a53080E832a69854A26716a32711o0962e662A41085c404A10541b14598
15421G7109a12181N2273j8106A12252J00419i3496I0615K8256E1962j4024b47965
$$ plain form
15409 52126 -30276 39301 -69766 94537 167938 -34198 -227116 -201086 -199236 -203386 -128892 59489
15396 -64286 -182216 26682 180138 52724 -46479 -1345 42286 -151686 299201 106652 -226987
15384 -2700 -165132 163849 -102226 52282 71733 -117211 -209011 32536 62927 291491 -118531
15372 -188876 -221336 -71938 212281 -109901 -103452 184019 -91081 -29137 168379 -45544 129497
15360 -8139 -61938 12542 -36632 -81693 500072 100399 -414013 -254355 -249011 -9605 427359
15348 77095 461475 114658 -30620 -233112 -279486 -89741 242326 -192831 67357 -262687
15337 74764 -217061 69089 -80105 156286 37606 22724 28136 -28619 17243 43954 37060 39273
15325 39273 26431 35153 -288954 74028 176546 39401 -39822 65099 -346031 -193727 -184884
$$ packed form
15409E2126c0276C9301f9766I4537P3401c4198j92918K6030J850m150P4494E9489
15396f4286j17930B6682J53456E2724d6479a345D2286a51686B99201A06652b26987
15384b700j62432A63849a02226E2282J9451a17211r1800C2536L0391K28564a18531
15372a88876l2460g1938B12281a09901O449A84019i1081b9137A68379d5544A29497
15360h139n3799A2542c6632m5061E00072A00399d14013J59658N344i605D27359
15348G7095L84380A14658c0620k02492m6374h9741B42326a92831F7357b62687
15337G4764b17061F9089h0105A56286C7606j4882N412b8619A7243K6711o894K213
15325C9273j2842Q722b88954G4028J02518C9401c9822F5099c46031J52304Q843
$$ plain form
15314 -184884 393423 206676 165035 191802 27370 -38679 105713 114440 -118733 -67693 169871
15302 309193 131800 -13141 260331 170206 -122068 100975 65926 181929 -188405 520261
15291 233365 187099 31355 169739 260962 76067 -34380 128294 -154055 221298 11194 71486
15280 71486 -109557 -19750 263461 368198 18607 22380 369767 20533 -65510 220207 -20370
15268 180252 -500810 165219 38249 -10484 107243 155985 147935 155562 152226 79701 72782 -198126
15255 -164284 106400 95729 197548 118918 -7130 490692 437798 383976 1109268 1417029 667766
15243 1502651 923081 556251 502432 -360070 90764 -15489 -71339 -193551 413926 37003
15232 -69629 29650 531634 -54955 -13156 -89494 376767 22624 -82852 61540 -302597 6482
$$ packed form
15314a84884C93423j86747m1641K6767B7370c8679A05713Q727a18733N1040A69871
15302C09193A31800a3141B60331r0125a22068A00975l5049J16003a88405E20261
15291B33365m6266C1355J38384R1223G6067c4380A28294a54055B21298A1194O0292
15280G1486a09557a9750B63461J04737A8607L773L47387B0533f5510B20207b0370
15268A80252e00810A65219C8249a0484A07243M8742q050P627l336p2525o919a98126
15255a64284A06400j0671J01819p8630g130D90692n2894n3822P25292L07761F67766
15243A502651n79570l66830n3819c60070I0764a5489n5850j22212D13926C7003
15232f9629B9650N01984e4955a3156p6338C76767B2624h2852F1540c02597F482
$$ plain form
15220 73877 49733 -31220 -27025 55403 -1943 -5048 301337 271265 -193543 -138096 149509 474737
15208 474737 310675 171418 14406 18366 205145 154380 -203382 -56766 20045 -113348 -252585
15197 -252585 49881 -72305 -48464 -46848 -223943 -25792 -73566 -104402 65769 168964 29989
15185 259366 147431 -131173 311447 89310 -84568 -66589 -225449 -109577 100929 50016
15174 61227 7423 -27739 11405 78747 -34895 -19637 228032 -113273 -234460 104571 22012
15162 -52754 40784 -52214 70847 263327 231762 34359 -114321 166897 -37161 -304546 39808
15150 293863 271734 -15731 -181168 167971 188941 384508 1485 -263502 15200 67906 -7029
15138 -71720 -293203 154249 51196 290746 397698 323876 214986 -48044 63012 -66177 223292
$$ packed form
15220G3877k4144c1220M195E5403a943l105C01337l0072a93543N5447A49509L25228
15208D74737j64062j39257A4406L960J86779n0765b03382e6766B0045a13348j39237
15197b52585D9881g2305K3841J616j77095b5792m7774l0836F5769J03195B9989
15185B59366j11935a31173C11447H9310h4568J7979j58860a09577A00929E0016
15174F1227G423b7739A1405O7342c4895J5258B28032a13273j21187A04571B2012
15162e2754D0784e2214G0847J92480l1565C4359a14321A66897c7161k67385C9808
15150B93863k2129a5731j65437A67971K0970J95567A485b63502A5200N2706g029
15138g1720k21483A54249E1196K39550J06952p3822j08890d8044F3012f6177B23292
$$ plain form
15126 364816 -75024 65797 61823 523498 103437 319584 4771 -36848 -185051 -102941 96226
15114 144667 -43599 167491 254901 543424 -52964 349776 214381 -146053 73564 -171123
15103 230557 177726 -76477 230066 226574 -7941 110341 577983 166750 88606 238872 149798
15092 149798 223069 19568 65875 466053 407452 238012 424478 36856 -175097 275181
15081 173607 250993 -34661 83425 295986 262463 168753 55102 126723 81647 291749 27529
15069 424793 170361 268042 94873 162948 19768 80064 -246872 -36676 540455 537400 230022
15057 -90957 212894 330439 135612 -39976 270492 152234 -39070 93439 -93440 72877 337629
15046 337629 29683 326813 144945 187134 55655 -2931 75373 -110790 -79458 -99646 356782
$$ packed form
15126C64816g5024F5797l974M61675A03437K16147D771c6848j48203Q2110I6226
15114A44667d3599A67491Q7410K88523e2964C49776j35395a46053G3564a71123
15103B30557n2831g6477B30066l492g941A10341M67642A66750p8144J50266q9074
15092A49798P3271A9568M6307M00178n8601j69440J86466C6856a75097B75181
15081A73607P7386c4661H3425K12561l3523r3710E5102P1621m5076K10102B7529
15069D24793A70361R7681I4873O8075A9768O0296b46872c6676E40455l055B30022
15057i0957B12894J17545A35612c9976B70492j18258c9070I3439i3440G2877K64752
15046C37629B9683K97130A44945M2189E5655b931G5373a10790L1332k0188C56782
$$ plain form
15034 -48559 -134867 -30710 238195 175313 149454 46817 262882 167087 251395 284072 124772
15022 625891 -14881 244807 296847 261403 151044 432867 400678 368172 41221 17432 -213032
15010 -83035 126245 -77462 351079 295480 210554 152120 432083 157065 64280 181612 302962
14999 302962 425777 124229 357854 426484 54994 329890 100089 46151 363749 234062
14989 234062 -150952 368981 516685 143681 339943 247412 541355 75463 159097 281624
14979 281624 261532 -130508 157238 299050 80674 457255 268017 -53858 -66150 181033
14968 411202 412910 222183 329170 43761 107009 147090 485950 489945 598538 174180 194502
14957 194502 32903 282644 -74685 146369 79170 35805 238545 600458 214937 341491
$$ packed form
15034d8559q6308c0710B38195o2882k5859D6817K16065r5795Q4308L2677A24772
15022F25891a4881B44807N2040l5444j10359K81823l2189l2506D1221A7432b13032
15010h3035A26245g7462C51079n5599q4926n8434K79963A57065F4280J17332J21350
14999C02962J22815A24229K33625O8630E4994K74896A00089D6151L17598j29687
14989B34062a50952C68981J47704A43681J96262r2531K93943G5463Q3634J22527
14979B81624k0092a30508A57238J41812H0674L76581j89238e3858j2292A81033
14968D11202J708j90727J06987D3761O3248M0081L38860L995J08593A74180K0322
14957A94502C2903K49741g4685A46369o7199C5805K02740L61913B14937J26554
$$ plain form
14947 341491 242029 318670 -118723 -104276 295993 422009 295779 573642 -23986 252092
14936 522205 226350 385274 177073 197226 183806 201525 -91988 157022 600133 629394
14926 629394 194861 450146 330078 374649 82133 319501 270603 123172 548827 327530
14916 327530 244533 564352 101682 311385 165345 -100268 271355 -30885 318924 91494
14905 49868 511454 65924 386975 344424 771620 126959 327168 710833 306726 451666
14895 451666 548589 290594 18037 163592 40161 49386 385573 391452 154098 509232 253593
14883 477846 422599 363078 138810 350125 268328 157815 381661 382235 282172 519660 519986
14872 519986 307768 573597 470028 314458 446371 308101 623273 309388 780785 365244
$$ packed form
14947C41491r9462P6641a18723J4447B95993J26016j26230K77863b3986B52092
14936E22205B26350J58924A77073K0153j3420J7719i1988A57022M43111K9261
14926F29394A94861K55285j20068M4571H2133K37368m8898A23172M25655k21297
14916C27530q2997L19819A01682K09703j46040a00268B71355c0885C18924I1494
14905D9868M61586F5924L21051m2551M27196A26959K00209L83665C06726J44940
14895D51666R6923k57995A8037J45555D0161R225L36187N879A54098L55134B53593
14883D77846n5247n9521A38810K11315q1797j10513K23846N74j00063K37488L26
14872E19986k12218K65829j03569j55570J31913j38270L15172C09388M71397C65244
$$ plain form
14861 456851 514045 457685 568042 30872 516239 663697 435954 616853 312906 708976
14851 708976 285698 63858 463834 458886 572812 507788 352023 210304 586030 327719
14841 327719 361053 381766 427455 421231 396256 288746 631381 125409 605434 399827 496094
14830 496094 522674 484655 649098 383305 517388 365070 724117 396262 912377 478939
14820 478939 556754 376386 387821 387959 488894 359823 667633 186635 328220 527228
14810 527228 346590 284332 637115 630609 556344 430684 538681 416524 380965 872093
14800 872093 809636 701244 327477 492021 510147 325643 683477 477825 310135 451760
14790 451760 554352 526074 661946 455088 237046 720048 767995 641098 580288 425820
$$ packed form
14861D56851N7194n6360J10357C0872M85367J47458k27743J80899l03947L96070
14851G08976B85698F3858L99976m948J13926o5024j55765j41719L75726k58311
14841C27719L3334K0713M5689o224k4975j07510L42635A25409M80025k05607R6267
14830D96094K6580l8019J64443k65793J34083j52318L59047l27855N16115m33438
14820D78939P7815j80368J1435J38J00935j29071L07810A86635J41585J99008
14810E27228j80638o2258L52783o506p4265j25660J07997j22157l5559M91128
14800H72093o2457j08392C27477J64544J8126j84504L57834k05652j67690J41625
14790D51760J02592k8278J35872k06858k18042M83002M7947j26897o0810j54468
$$ plain form
14780 425820 360947 693465 627777 917883 497850 747749 589203 740740 866856 502354
14770 502354 293127 582449 455989 309975 801255 589168 609411 576209 536117 843236
14760 843236 629446 1041511 328068 535165 574587 373570 843309 1047442 582867 569997
14750 569997 596010 571195 567566 490733 528678 609473 751701 248074 682304 709677 627716
14739 627716 884651 797282 438586 830388 797249 699142 333895 763319 697119 987846
14729 987846 665721 666624 789378 731724 583724 607280 747261 1086031 1073787 1088369 1206737
14718 1206737 776787 666360 949033 833085 544452 890181 664775 968942 914763 759852
14708 759852 779110 591337 808684 944948 1010375 911543 913800 1134058 1186812 947331 801995
$$ packed form
14780D25820o4873L32518o5688K90106m20033K49899j58546J51537J26116l64502
14770E02354k09227K89322j26460j46014M91280k12087K0243l3202m0092L07119
14760H43236k13790M12065C28068K07097L9422k01017M69739K04133m64575j2870
14750E69997K6013k4815l629p6833L7945Q0795J42228B48074M34230K7373q1961
14739F27716K56935q7369l58696L91802l3139r8107C33895M29424o6200K90727
14729I87846l22125R03J22754n7654j48000K3556J39981L38770j2244J4582J18368
14718A206737m29950j10427K82673j15948k88633L45729k25406L04167n4179j54911
14708G59852J9258j87773K17347J36264O5427r8832K257K20258N2754k39481j45336
$$ plain form
14697 801995 761470 1070215 967536 1124251 835905 533453 981819 1019164 782248 904847
14687 904847 558923 1048047 1204036 736819 1160963 1189849 631517 1196523 1228684 1036344
14677 1036344 1265048 853390 970290 960823 812446 1171052 1010514 1172240 881056 785297
14667 785297 1088143 1137053 1000292 1435142 1251033 1196950 1507138 925127 1086037 1112594
14657 1112594 1203558 1198669 932429 1323695 993978 1352742 1235454 1386409 1343306 1079168
14647 1079168 1273303 1391950 1147865 1042140 1360085 1017902 1056172 1173596 1550851 1206184
14637 1206184 1081231 1558989 1535722 1360604 1463441 1119082 1303410 1093565 1332565 917754
14627 917754 1349671 1658820 1444535 1363243 1506636 1328563 1411935 1825480 1538338 1422815
$$ packed form
14697H01995m0525L08745j02679J56715k88346l02452M48366L7345k36916J22599
14687I04847l45924M89124J55989m67217M24144K8886n58332N65006L2161j92340
14677A036344K28704m11658J16900r467j48377L58606j60538J61726k91184r5759
14667G85297L02846M8910j36761M34850j84109n4083L10188n82011J60910K6557
14657A112594R0964m889k66240L91266l29717L58764j17288J50955m3103k64138
14647A079168J94135J18647k44085j05725L17945l42183L8270J17424L77255l44667
14637A206184j24953M77758k3267j75118J02837l44359J84328k09845K39000m14811
14627I17754M31917L09149k14285q1292J43393j78073Q3372M13545k87142j15523
$$ plain form
14617 1422815 1576523 1386908 1606362 1280291 1355968 1350013 1227352 1532488 1881685 1676317
14607 1676317 1556953 1539054 1430502 1559487 1616315 1407651 1683497 1873160 1293551 1493449
14597 1493449 1797878 1574456 1723951 1647752 1617711 1987876 1962505 2020696 1649157 1591745
14587 1591745 1679312 2035296 1634582 1827756 2097443 1733646 2158881 2042733 2077502 1945369
14577 1945369 1882932 1993773 2036434 1995854 2022086 1855723 2386918 2238538 2234636 2215476 2503636
14566 2503636 2294264 2556623 2507263 2109062 2915102 2750638 2789748 2771245 2791172 3341196
14556 3341196 3493196 3330067 4023702 3588302 4366234 5349363 6597074 9723338 14949054
14547 14949054 21727493 33045592 39580325 23435478 12956314 6283361 3569145 2879605
$$ packed form
14617A422815J53708j89615K19454l26071P5677n955j22661L05136L49197k05368
14607A676317j19364j7899j08552J28985N6828k08664K75846J89663n79609J99898
14597A493449L04429k23422J49495p6199l0041L70165k5371N8191l71539n7412
14587A591745Q7567L55984m00714J93174K69687l63797M25235j16148L4769j32133
14577A945369o2437J10841M2661m0580K6232j66363N31195j48380l902j9160K88160
14566B503636k09372K62359m9360l98201Q06040j64464L9110j8503J9927N50024
14556C341196J52000j63129O93635m35400P77932R83129J247711L126264N225716
14547A4949054O778439J1318099O534733j6144847j0479164F283361k714216o89540
$$ plain form
14539 2879605 2268029 1904442 2225081 2104355 1995037 2233737 2120474 2287077 1876715
14530 1876715 1996809 2595448 1951170 2392336 2225618 2371899 2248765 2457665 2688815
14521 2688815 2216166 2834181 2457832 2754485 2874155 2636260 2654890 2578787 2378822 2463053
14511 2463053 2593636 2444447 2909406 3045557 2869121 2910426 3058247 2913205 3228562 2842735
14501 2842735 3324527 3345046 2987358 3116637 3104795 3057211 3419178 3480162 3658568 3294686
14491 3294686 3709232 3709776 3491178 3534013 3447197 3304376 3955224 3830682 4019887 4040924
14481 4040924 3923034 3979329 4228815 3968734 4001627 4208731 4405593 4363333 4186543 4264722
14471 4264722 4295387 4465226 4417204 4636653 4273100 4186602 4835837 4550756 4927019 5140497
$$ packed form
14539B879605o11576l63587L20639j20726j09318K38700j13263J66603m10362
14530A876715J20094N98639o44278M41166j66718J46281j23134K08900K31150
14521B688815m72649O18015l76349K96653J19670k37895J8630p6103j99965Q4231
14511B463053J30583j49189M64959J36151j76436M1305J47821j45042L15357l85827
14501B842735M81792K0519l57688J29279j1842m7584L61967O0984J78406l63882
14491C294686M14546N44k18598M2835q6816j42821O50848j24542J89205K1037
14481D040924j17890N6295K49486k60081L2893K07104J96862m2260j76790P8179
14471D264722L0665J69839m8022K19449l63553q6498O49235k85081L76263K13478
$$ plain form
14461 5140497 4938936 4905992 4992748 4806674 4986278 5228563 5497097 5055768 5481528 5567769
14451 5567769 5406725 5548714 5564826 5448230 5560170 5667798 5984944 6054007 5791629 6165341
14441 6165341 6278090 6172723 6318481 6149788 6587472 6699743 6583888 6630684 6672483 7236494
14431 7236494 7233504 6763779 7235616 7708881 7210977 7385708 7629444 7928910 8050482 7920418
14421 7920418 8050964 7927365 8261600 8209339 8775800 8651763 8982052 8850121 8944795 9382265
14411 9382265 9330410 9200204 9668261 9620761 9754910 9824681 9963379 10570395 10275344 10548552
14401 10548552 10807208 11003418 11105309 11361519 11177826 11684209 11924640 11703395 12012594
14392 12012594 12213829 12871084 12758663 12878980 13142271 13361298 13377073 13476993 14310727 14505063
$$ packed form
14461E140497k01561l2944Q6756j86074J79604K42285K68534m41329M25760Q6241
14451E567769j61044J41989J6112j16596J11940J07628L17146O9063k62378L73712
14441F165341J12749j05367J45758j68693M37684J12271j15855M6796M1799N64011
14431G236494k990m69725M71837M73265m97904J74731K43736K99466J21572j30064
14421G920418J30546j23599L34235n2261N66461j24037L30289j31931R4674M37470
14411I382265n1855j30206M68057m7500J34149O9771J38698O07016k95051K73208
14401A0548552K58656J96210J01891K56210j83693N06383K40431k21245L09199
14392A2012594K01235O57255j12421J20317K63291K19027J5775R9920Q33734J94336
$$ plain form
14382 14505063 14739949 14754016 15236309 15585115 15799228 15830096 16194041 16707151 17346089 17279047
14372 17279047 17504749 18055926 18305934 18986875 18978665 19318287 19636458 20209594 20674370 20958089
14362 20958089 21488119 22493257 22801376 22926395 23517958 24342086 24912051 25325632 25603919
14353 25603919 26188515 26758486 27959024 28673866 28983341 29637110 30971787 31370649 32081111
14344 32081111 33031633 33819608 34851521 35926804 36645450 37795677 38660138 39648195 40728636
14335 40728636 42284998 43241515 44593666 46095403 46983013 48570300 50319576 52173678
14327 52173678 53804575 55301366 57210749 58905715 60729609 63343746 65089363 67677932
14319 67677932 69834832 72819925 75281534 78244311 81273000 84210199 87454275 90639701
$$ packed form
14382A4505063K34886J4067M82293L48806K14113L0868L63945N13110O38938o7042
14372A7279047K25702N51177K50008O80941q210L39622L18171N73136M64776K83719
14362B0958089N30030J005138L08119J25019N91563Q24128N69965M13581K78287
14353B5603919N84596N69971J200538P14842L09475O53769J334677L98862P10462
14344C2081111R50522P87975J031913J075283P18646J150227Q64461R88057J080441
14335D0728636J556362R56517J352151J501737Q87610J587287J749276J854102
14327E2173678J630897J496791J909383J694966J823894K614137J745617K588569
14319F7677932K156900K985093K461609K962777L028689K937199L244076L185426
$$ plain form
14311 90639701 94562902 98555886 102746006 107394949 111729524 116659170 121660657 127346735
14303 127346735 133315739 139536375 146026064 152745432 160226004 168035040 176746815 184958674
14295 184958674 194417873 204100325 213968076 225011496 236069937 248011787 260470908
14288 260470908 273453585 286899468 300501449 315148585 329760342 344821913 359613657
14281 359613657 374400558 388685316 402277244 415561906 427223931 438056971 446955730
14274 446955730 453181084 454386911 452612440 451141812 453308887 455094122 451909235 447988242
14266 447988242 443297204 434932379 424687409 413282012 399949817 385983095 371526988
14259 371526988 356330000 340969591 325577966 310524973 295496418 282271750 268704435
$$ packed form
14311I0639701L923201L992984M190120M648943M334575M929646N001487N686078
14303A27346735N969004O220636O489689O719368P480572P809036Q711775Q211859
14295A84958674R459199R682452R867751J1043420J1058441J1941850J2459121
14288B60470908J2982677J3445883J3601981J4647136J4611757J5061571J4791744
14281C59613657J4786901J4284758J3591928J3284662J1662025J0833040Q898759
14274D46955730O225354J205827j774471j470628K167075J785235l184887l920993
14266D47988242m691038q364825j0244970j1405397j3332195j3966722j4456107
14259C71526988j5196988j5360409j5391625j5052993j5028555j3224668j3567315
$$ plain form
14252 268704435 255407996 243182804 231421251 219978044 209090843 199370760 189344986
14245 189344986 180541120 172256921 164393174 156447207 149302635 142412722 136166398 130423853
14237 130423853 124966803 119848290 114662181 109796017 104957261 101111162 97245570 93472237
14229 93472237 89591911 86351721 82974013 80025663 76795595 73934725 71465229 68832518
14221 68832518 66747910 64415126 62468237 60292047 58106509 56268916 54744238 53229144
14213 53229144 51503502 50334833 48148534 46695921 45485169 44269036 43286455 41986260
14205 41986260 41181569 39485570 38351584 37489157 36741286 36021958 34954779 33667798 32885566
14196 32885566 32093483 31044357 30538248 29813127 29187673 28668251 27793824 27120239 26000120
$$ packed form
14252B68704435j3296439j2225192j1761553j1443207j0887201r720083j0025774
14245A89344986q803866q284199p863747p945967p144572o889913o246324n742545
14237A30423853n457050n118513n186109m866164m838756l846099l865592l773333
14229I3472237l880326l240190l377708k948350l230068k860870k469496k632711
14221F8832518k084608k332784j946889k176190k185538j837593j524678j515094
14213E3229144j725642j168669k186299j452613j210752j216133r82581j300195
14205D1986260q04691j695999j133986q62427p47871p19328j067179j286981p82232
14196C2885566p92083j049126n06109p25121o25454n19422q74427o73585j120119
$$ plain form
14187 26000120 25691025 25459879 25227085 23982478 23562372 23059041 22573588 22018672 21846770
14178 21846770 20736224 20601136 20366897 20042088 19478094 19600548 19065265 18685607 18298704
14169 18298704 17798699 17645243 16938280 16720657 16417680 16026301 16060290 15848133 15082284
14160 15082284 15293129 14774091 14675074 14084855 14230898 13371201 13566884 13203369 13156894 12477503
14150 12477503 12593427 12493166 11799644 12147824 11879967 11445679 11655839 11698812 11567302
14141 11567302 10729630 10821561 10522728 10233632 10254505 10198807 10018252 9770158 9497162 9620959
14131 9620959 9514918 9704271 9443149 8880405 8822527 8648268 8676172 8663524 8411925 8394261
14121 8394261 8119917 8261332 7943562 7942149 7843973 7604665 7679952 7309079 7582350 7292583
$$ packed form
14187B6000120l09095k31146k32794j244607m20106n03331m85453n54916j71902
14178B1846770j110546j35088k34239l24809n63994J22454n35283l79658l86903
14169A8298704n00005j53456p06963k17623l02977l91379L3989k12157p65849
14160A5082284K10845n19038r9017n90219J46043q59697J95683l63515m6475o79391
14150A2477503J15924j00261o93522L48180k67857m34288K10160M2973j31510
14141A1567302q37672R1931k98833k89096K0873n5698j80555k48094k72996J23797
14131I620959j06041J89353k61122n62744n7878j74259K7904j2648k51599j7664
14121H394261k74344J41415l17770j413r8176k39308P5287l70873K73271k89767
$$ plain form
14111 7292583 6945461 6886486 7337056 6930998 6636082 6717311 6485150 6629408 6697879 6520553
14101 6520553 6544746 6443754 6384413 6536448 6087679 6149494 5840801 5901574 5698575 5838447
14091 5838447 5987902 5358913 5862709 5320947 5505111 5372977 5302075 5237514 4949582 5236310
14081 5236310 4919958 5201603 4899889 5160976 5131149 4926003 5052922 4843800 4836833 4596020
14071 4596020 4868719 4669221 4621171 4819662 4437874 4206246 4212658 4247296 4313782 4396882
14061 4396882 3959982 4191119 4153978 4341307 4085110 4148456 3913025 4082192 3729847 3647991
14051 3647991 3928966 3880724 3773841 3495705 3884500 3477640 3623366 3690486 3692061 3767220
14041 3767220 3387084 3504222 3400484 3357308 3406445 3686430 3250892 3292794 3203708 2976243
$$ packed form
14111G292583l47122n8975M50570m06058k94916Q1229k32161J44258O8471j77326
14101F520553K4193j00992n9341J52035m48769O1815l08693O0773k02999J39872
14091E838447J49455o28989N03796n41762J84164j32134p0902o4561k87932K86728
14081E236310l16352K81645l01714K61087k9827k05146J26919k09122o967k40813
14071D596020K72699j99498m8050J98491l81788k31628O412L4638O6486Q3100
14061D396882m36900K31137l7141J87329k56197O3346k35431J69167l52345q1856
14051C647991K80975m8242j06883k78136L88795m06860J45726O7120J575P5159
14041C767220l80136J17138j03738m3176M9137K79985m35538M1902q9086k27465
$$ plain form
14031 2976243 3258782 3145516 3110183 3116614 3084983 3067775 3105934 2903182 3098754 2718616
14021 2718616 2892225 2764849 2861940 2981270 2755299 2514093 2591124 2743187 2599297 2474556
14011 2474556 2678474 2571494 2486524 2542578 2463149 2681985 2193124 2204453 2211196 2319733
14001 2319733 2266627 2215086 2304541 2322226 2551259 2448767 1857980 2251856 2148450 2578429
13991 2578429 2866774 3548498 5409598 9676928 16615647 28116182 39874865 27714035
13983 27714035 15347760 8980000 6425811 5384296 4728634 4058314 3676776 3299759
13975 3299759 3547492 3140961 2604369 2699325 2851028 2512216 2642677 2407674 2462172 2493932
13965 2493932 2408938 2251806 2052849 2289151 2423648 2456078 2471740 2564508 2138451 2134834
$$ packed form
14031B976243K82539j13266l5333O431l1631j7208L8159k02752J95572l80138
14021B718616J73609j27376R7091J19330k25971k41206P7031J52063j43890j24741
14011B474556K03918j06980q4970N6054p9429K18836m88861J1329O743J08537
14001B319733n3106n1541Q9455J7685K29033j02492n90787L93876j03406M29979
13991B578429K88345O81724J861100M267330O938719J1500535J1758683j2160830
13983B7714035j2366275o367760k554189j041515o55662o70320l81538l77017
13975C299759K47733m06531n36592R4956J51703l38812J30461k35003N4498L1760
13965B493932q4994j57132j98957K36302J34497L2430J5662R2768m26057l617
$$ plain form
13955 2134834 2323802 2168766 2281969 1799564 2011235 2053906 2332198 2176483 2070614 2015938
13945 2015938 2075725 1835107 2031791 1713077 2158265 2201861 1600588 1719277 1912604 1864017
13935 1864017 1944556 1970062 1886831 1861612 1772933 1504558 1713881 1405864 1464878 1844238
13925 1844238 1726465 1640032 1549397 1771620 1556264 1898741 1378652 1231892 1570089 1209671
13915 1209671 1206668 1608389 1394296 1308556 1628617 1547596 1655791 1395095 1143806 1620604
13905 1620604 1589703 1497390 1611880 1197130 1789953 1287456 1403492 1662087 1293620 1320958
13895 1320958 1599741 1400594 1485781 1172594 1339044 1411146 1269694 1305918 1443450 1495509
13885 1495509 1331005 1351112 1183288 1124688 1744002 1158553 1299481 1390121 985171 1313773
$$ packed form
13955B134834J88968j55036J13203m82405K11671M2671K78292j55715j05869n4676
13945B015938N9787k40618J96684l18714M45188M3596o01273J18689J93327m8587
13935A864017Q0539K5506q3231k5219q8679k68375K09323l08017N9014L79360
13925A844238j17773q6433r0635K22223k15356L42477n20089j46760L38197l60418
13915A209671l003M01721k14093q5740L20061q1021J08195k60696k51289M76798
13905A620604l0901r2313J14490m14750N92823n02497J16036K58595l68467K7338
13895A320958K78783j99147Q5187l13187J66450P2102j41452L6224J37532N2059
13885A495509j64504K0107j67824n8600O19314n85449J40928R0640m04950L28602
$$ plain form
13875 1313773 1300471 824744 1037966 1037537 1161726 1131595 1500201 1086325 1291261 1371441
13865 1371441 1368550 1242435 1159511 1155207 1255829 997151 1119872 1091942 1308786 922934
13855 922934 1352771 1191322 1241982 851929 1074400 1283922 1281381 1023987 996191 949961
13845 949961 1216411 1024147 872080 897451 1044935 1051549 919262 1144280 1202176 1003565
13835 1003565 826842 609369 1006763 1192442 1056379 1092310 1206282 751095 875436 778726
13825 778726 990670 1050013 875680 1178849 758265 985802 998419 860036 757085 526689
13815 526689 745413 762533 983943 829993 643061 1005247 729165 914991 719279 872794
13805 872794 639034 472559 957103 927481 716290 645694 594188 878877 935832 454302
$$ packed form
13875A313773j3302m75727K13222m29J24189l0131L68606m13876K04936Q0180
13865A371441k891j26115q2924m304J00622k58678J22721k7930K16844l85852
13855I22934M29837j61449N0660l90053K22471K09522k541k57394k7796m6230
13845I49961K66450j92264j52067K5371J47484O614j32287K25018N7896j98611
13835A003565j76723k17473L97394J85679j36063L5931J13972m55187J24341r6710
13825G78726K11944N9343j74333L03169m20584K27537J2617j38383j02951k30396
13815E26689K18724J7120K21410j53950j86932L62186k76082J85826j95712J53515
13805H72794k33760j66475M84544k9622k11191p0596n1506K84689N6955D54302
$$ plain form
13794 1006061 768937 966046 822675 1020830 675546 861436 790323 799315 1107229 879606
13784 879606 632323 597526 949635 611619 968780 877208 885691 849458 732285 805468 878334
13773 878334 1064176 950693 642594 810549 594345 743787 828378 819174 691851 875106
13763 875106 359620 792164 682080 628345 1064954 608139 748469 504529 763854 205908
13752 436907 649288 747194 467971 646486 834009 501300 493590 880989 836098 689314
13742 689314 485234 728851 444270 720000 760710 635374 509098 551310 789568 624914
13732 624914 603053 684099 557740 643367 681995 673365 363605 610273 560004 365452 541777
13721 541777 619626 843754 536692 359906 394012 740013 723018 889398 489516 713359
$$ packed form
13794A006061k37124J97109j43371J98155l45284J85890p1113Q992L07914k27623
13784H79606k47283l4797L52109l38016L57161r1572Q483l6233j17173P3183P2866
13773H78334J85842j13483l08099J67955k16204J49442Q4591r204j27323J83255
13763H75106C59620M32544j10084n3735M36609m56815J40330k43940K59325B05908
13752D36907K12381R7906k79223J78515J87523l32709p710L87399m4891j46784
13742F89314k04080K43617k84581K75730M0710j25336j26276M2212K38258j64654
13732F24914k1861Q1046j26359Q5627L8628q630l09760K46668n0269j94552J76325
13721E41777P7849K24128l07062j76786L4106L46001j6995J66380l99882K23843
$$ plain form
13711 713359 596615 822121 559250 425718 855081 540323 749682 677661 484732 351190
13701 351190 221232 165544 728771 743217 494290 310542 575207 497544 179800 392100
13691 392100 288305 639576 627107 656075 399321 318910 500552 361878 508195 224911
13680 692402 554370 599035 472103 264537 559157 668132 362092 828473 580237 657497
13670 657497 497199 596429 393690 415582 577668 542073 541929 302632 353048 608136 297040
13658 406209 437788 410539 710209 504644 171584 661039 185059 358154 207484 406332
13648 406332 366568 175494 378797 353703 677030 397502 531426 113034 669034 323795
13637 417857 540006 381605 306638 174364 805670 562220 245541 690867 377408 490052
$$ packed form
13711G13359j16744K25506k62871j33532M29363l14758K09359p2021j92929j33542
13701C51190j29958n5688N63227J4446k48927j83748K64665p7663A79800K12300
13691C92100j03795L51271j2469K8968k56754q0411J81642j38674J46317B24911
13680F92402j38032M4665j26932k07566K94620J08975l06040M66381k48236P7260
13670F57497j60298R9230k02739K1892J62086l5595j44k39297N0416K55088B97040
13658D06209L1579k7249K99670k05565A71584M89455A85059J73095j50670J98848
13648D06332l9764A75494K03303k5094L23327k79528J33924A13034N56000C23795
13637D17857J22149j58401p4967j32274O31306k43450B45541M45326l13459J12644
$$ plain form
13627 490052 250187 593099 407291 392003 309785 493313 682310 488693 305486 562695
13617 562695 276345 631719 373271 582370 91502 442608 585963 175835 577387 428455
13607 428455 491393 78277 328781 213324 420608 233233 342656 174664 341718 216452
13597 216452 316101 420569 393105 249579 428384 246526 424895 411145 223985 260810
13587 260810 306741 152567 578351 149703 493180 302865 79985 538933 259507 195966
13577 195966 321499 513005 241517 368167 404930 501716 66289 110382 322065 203325
13567 203325 717230 535997 453601 329982 348678 350157 244735 574981 483235 475688 484749
13556 484749 487340 464616 257775 193040 245727 421637 530050 536911 313039 311658 156520
$$ packed form
13627D90052k39865L42912j85808j5288q2218J83528J88997j93617j83207K57209
13617E62695B76345L55374k58448K09099I1502L51106J43355A75835M01552j48932
13607D28455O2938G8277K50504j15457K07284j87375J09423j67992J67054j25266
13597B16452R9649J04468k7464j43526J78805j81858J78369j3750j87160L6825
13587B60810M5931A52567M25784A49703L43477j90315G9985M58948B59507o3541
13577A95966J25533J91506B41517J26650L6763R6786F6289M4093K11683j18740
13567B03325N13905j81233q2396j23619J8696J479j05422L30246r1746p547R061
13556D84749K591k2724k06841o4735N2687J75910J08413O861k23872j381j55138
$$ plain form
13545 156520 223374 286761 404920 301375 394581 135781 593454 447457 275738 457528
13535 457528 580885 381842 357704 80522 172506 262817 311813 212503 434402 419601 183609
13523 226159 615180 406448 212146 234201 355752 111230 170987 42397 311839 240625
13513 240625 265082 286293 374479 386498 184109 -183637 360426 124502 311297 448515
13503 448515 58122 331922 356332 367738 75867 -54693 591138 205733 181994 429410 115455
13491 75772 44276 197901 459853 -55106 -8463 288306 126073 427062 195675 170978 502195
13480 502195 168382 164422 366815 177999 333364 222063 169125 246559 487714 272729
13470 272729 500138 316742 189700 220278 499436 363071 292281 70315 88771 281262
$$ packed form
13545A56520O6854O3387J18159j03545R3206A35781M57673j45997j71719J81790
13535D57528J23357j99043k4138H0522R1984R0311M8996r9310K21899j4801A83609
13523B26159L89021k08732j94302K2055J21551A11230N9757D2397K69442p1214
13513B40625K4457K1211Q8186J2019A84109a83637C60426A24502J86795J37218
13503D48515E8122K73800K4410J1406G5867e4693E91138B05733k3739K47416A15455
13491G5772l1496J53625K61952e5106h463B88306A26073L00989A95675k4697L31217
13480E02195A68382l960K02393A77999J55365j11301n2938P7434K41155k14985
13470B72729K27409j83396j27042L0578K79158j36365p0790G0315J8456J92491
$$ plain form
13460 281262 117570 362884 607750 258195 191376 85234 9578 280343 390306 476759
13450 476759 242473 295204 42722 10081 101917 312450 193738 290857 268222 186149 266202
13439 266202 62885 634026 527729 200640 401584 428481 185234 446144 240794 272925
13429 272925 -161850 342363 483085 105011 372775 31458 509255 157070 99101 171313
13419 171313 211748 86130 60998 276144 36522 397757 111551 184094 337624 197644
13409 197644 245125 125132 315574 107388 415322 176768 498482 118785 185741 182966
13399 182966 60213 120325 -69974 120119 392742 179202 239483 -219760 -88572 -79383 -1223
13387 -39132 -149407 232547 134209 169165 -149819 -69164 190667 250377 323043 256321 -102615
$$ packed form
13460B81262A17570K45314K44866B58195o6819H5234I578K70765J09963Q6453
13450D76759k34286N2731D2722A0081R1836K10533j18712R7119k2635q2073Q0053
13439B66202F2885N71141j06297B00640K00944K6897A85234K60910k05350L2131
13429B72925a61850C42363J40722A05011K67764C1458M77797A57070n7969P2212
13419A71313M0435H6130k5132K15146C6522L61235A11551P2543J53530j39980
13409A97644M7481j19993J90442A07388L07934A76768L21714A18785O6956k775
13399A82966F0213O0112f9974A20119K72623A79202O0281b19760h8572R189a223
13387c9132j10275B32547r8338L4956a49819f9164A90667N9710P2666o6722a02615
$$ plain form
13375 264451 537793 116597 -16345 223774 148207 374073 379601 251973 310350 79550 455740
13364 455740 72904 166944 163157 322369 421450 646731 414224 127412 376530 174090
13353 165180 387751 13983 220882 164559 316816 -287877 305248 351302 276365 632081
13343 632081 353610 274779 455157 55689 57825 346669 311103 90658 339448 392878 107500
13331 47410 -99567 5900 -233315 266262 396466 233592 468146 253796 253524 281898 505653
13320 505653 -9684 312192 567828 349110 517078 164437 -51963 376793 179532 319701
13310 319701 116241 50012 46639 -77340 65568 -21779 204732 114570 105171 161556 237330
13299 237330 18836 220399 294967 -120405 200098 8645 337649 289591 346835 115095 105946
$$ packed form
13375B64451K73342A16597a6345B23774p5567K25866N528j27628N8377G9550L76190
13364D55740G2904R4040l787J59212R9081K25281k32507A27412K49118A74090
13353A65180K22571A3983K06899n6323J52257b87877C05248M6054p4937L55716
13343F32081k78471p8831J80378E5689K136K88844l5566I0658K48790N3430A07500
13331D7410i9567E900b33315B66262J30204j62874K34554k14350k72K8374K23755
13320E05653i684C12192K55636k18718J67968A64437e1963C76793A79532J40169
13310C19701A16241E0012l373g7340F5568b1779B04732r0162r399N6385P5774
13299B37330A8836K01563P4568a20405B00098H645L29004m8058N7244A15095r149
$$ plain form
13288 105946 136954 87286 372537 45699 -71356 115714 75291 -85716 293379 259533 105272
13276 -41248 -74272 443437 48382 98276 358306 -135788 -290238 107026 104214 -54588 341668
13264 8570 200964 -228856 191164 51726 -3327 7716 277371 240623 68414 -58713 336657
13252 280501 395096 17659 7349 76017 21326 22074 159661 207919 61227 165706 -68803
13240 250518 -86616 74684 170221 222201 192961 123894 -126099 -6012 84653 -80762 -43670
13229 -43670 -3982 272251 5227 155173 -238641 117384 188556 177205 144290 -156436 238116
13217 -29958 -26494 207357 -279092 -89359 193836 17519 190368 -32167 71028 256796 -322137
13205 329027 174978 16188 54710 -89957 447329 -183987 355490 212764 33537 226461
$$ packed form
13288A05946L1008m9668K85251D5699g1356A15714m0423h5716B93379l3846A05272
13276d1248l3024D43437D8382M9894K60030a35788j54450A07026k812e4588C41668
13264H570J92394b28856A91164E1726c327G716K69655l6748F8414e8713C36657
13252B80501J14595A7659G349O8668B1326P48J37587M8258F1227J04479f8803
13240B50518h6616G4684R5537N1980k9240o9067a26099f012H4653h0762L7092
13229d3670c982B72251E227J49946b38641A17384P1172j1351l2915a56436B38116
13217b9958L464B07357b79092h9359A93836A7519J72849c2167G1028J85768c22137
13205C29027j54049A6188L8522h9957D47329a83987C55490j42726C3537J92924
$$ plain form
13195 226461 -213438 -30095 -88082 140131 -38245 31034 132193 -15215 235400 -128519
13184 263802 290031 68875 -54406 74600 -4616 229700 233179 48665 165412 288839 310691
13173 310691 -19757 105699 -119529 189404 109272 20580 171670 297344 -119100 -26877
13162 162261 326584 -57551 242426 374634 4651 -31120 23081 194570 390612 127225
13151 -14606 -124885 151695 210408 399196 -85324 -107128 -25142 81607 453607 383096 252256
13140 252256 208753 -4307 -142550 31111 124920 345296 368833 -217879 103083 297997 145484
13128 255924 214993 260350 460175 125604 64565 -198008 49501 40357 -38291 389766 87180
13116 304352 392968 20928 -153350 186978 120904 84351 -82853 276904 -291632 227519
$$ packed form
13195B26461b13438c0095n7987A40131c8245C1034J01159a5215B35400a28519
13184B63802K6229F8875e4406G4600d616B29700L479D8665J16747J23427K1852
13173C10691a9757A05699a19529A89404q0132B0580J51090J25674a19100b6877
13162A62261J64323e7551B42426J32208D651c1120B3081J71489J96042A27225
13151a4606j10279A51695N8713J88788h5324k1804b5142H1607L72000p0511j30840
13140B52256m3503d307j38243C1111R3809K20376K3537b17879A03083J94914A45484
13128B55924m0931M5357J99825A25604o1039a98008D9501r144c8291C89766H7180
13116C04352Q8616B0928a53350A86978o6074l6553h2853B76904b91632B27519
$$ plain form
13105 344884 188495 175903 -196301 -125738 -37918 427199 -104955 255794 85794 -77365
13094 -22424 409704 215852 -93280 196219 166633 61230 -6679 177525 125683 30442 180716
13083 180716 -105185 -313859 -93056 -133105 205430 -129470 213690 -123774 153723 153289
13073 153289 163860 26339 232278 -189315 45043 138419 -7186 -76173 278589 44415 12083
13061 -13735 102467 -216533 116541 102766 221360 -116473 95330 -8412 46027 460696 143850
13049 -227616 234446 -2988 377210 -38284 48512 -4768 158308 89681 201885 11480 -35212
13037 113862 239466 67303 91502 60810 -8726 250425 159622 245043 348501 10085 168373
13026 168373 -17800 82140 163482 406687 202989 -9477 179073 -34467 -52136 140428 170439
$$ packed form
13105C44884j56389j2592a96301P0563c7918D27199a04955B55794H5794g7365
13094b2424D09704j93852i3280A96219k9586F1230f679A77525n1842C0442J50274
13083A80716a05185k08674i3056m0049B05430a29470B13690a23774A53723m34
13073A53289J0571B6339K05939a89315D5043R3376g186o8987B78589D4415A2083
13061a3735A02467b16533A16541j3775J18594a16473I5330h412D6027M14669A43850
13049b27616B34446b988C77210c8284D8512d768A58308o8627J12204A1480c5212
13037A13862J25604F7303K4199l0692h726B50425r0803Q5421J03458A0085J58288
13026A68373a7800H2140Q1342K43205B02989i477A79073c4467j7669A40428L0011
$$ plain form
13015 170439 -126559 233428 19006 380965 -5837 228496 488067 254126 550722 340617
13005 340617 209406 -6498 -184528 445640 186804 6356 308015 237878 62799 193726 -2273
12993 -77597 -106973 153174 197670 258104 94587 198903 56964 216556 204613 413441 278053
12982 278053 16676 359099 170167 324091 -148142 302940 -14392 332258 222170 145457
12972 145457 -108174 -174501 124475 133053 -8310 -222172 -61028 129103 152900 -263302 25561
12960 244983 12828 150901 121444 -102631 -3895 276682 363817 -160898 99945 521038 -43119
12948 88041 63977 222725 205668 221561 -221328 -136071 102690 -84145 23047 270696 151856
12937 151856 434188 -15448 107962 290997 -26986 208184 -259670 146630 65281 34417
$$ packed form
13015A70439a26559B33428A9006L61959e837B28496K59571k33941K96596k10105
13005C40617j31211f498j78030D45640A86804F356L01659p0137F2799J30927b273
12993g7597k9376A53174M4496O0434I4587J04316E6964J59592j1943K08828j35388
12982B78053A6676L42423A70167J53924a48142C02940a4392C32258j10088p6713
12972A45457a08174o6327A24475Q578h310k13862f1028A29103K3797b63302B5561
12960B44983A2828J38073k9457a02631c895B76682Q7135a60898I9945M21093d3119
12948H8041k4064J58748j7057J5893b21328Q5257A02690h4145B3047K47649j18840
12937A51856K82332a5448A07962J83035b6986B08184b59670A46630F5281l0864
$$ plain form
12927 34417 65192 -117793 29618 -164490 -18041 82052 222381 107066 8904 283874 10275
12915 227980 -22099 -134313 103918 87374 -71693 185789 133616 145534 -233047 74359 -234344
12903 5 22087 -87085 153631 -17198 -242035 -134897 244611 102858 74923 221558 196112
12892 196112 -368287 130550 -82560 171586 255463 187397 266093 -121667 34897 62556 145314
12881 145314 -108309 17526 210835 396606 330578 8438 38987 -189324 -25798 127577 -439821
12869 95726 135877 -217087 -70052 -86654 45269 422832 501066 49604 198963 -79265 94447
12857 -13384 29603 109877 215506 -197505 -229147 -184874 244910 296607 113045 131900 -246072
12845 -6515 119606 -54993 -118458 158602 224596 197291 -8014 -233983 227933 59964 79550
$$ packed form
12927C4417L0775a17793B9618a64490a8041H2052J40329A07066H904K74970A0275
12915B27980b2099j12214A03918j6544g1693A85789n2173J1918b33047G4359b34344
12903EK2082h7085A53631a7198k24837J07138B44611A02858k7935J46635k5446
12892A96112c68287A30550h2560A71586Q3877o8066P8696a21667C4897K7659Q2758
12881A45314a08309A7526J93309J85771o6028H438L0549a89324b5798A27577d39821
12869I5726M0151b17087g0052j6602D5269L77563P8234D9604J49359g9265I4447
12857a3384B9603Q0274J05629a97505l1642M4273B44910N1697A13045J8855b46072
12845f515A19606e4993o3465A58602O5994k7305h014k25969B27933E9964J9586
$$ plain form
12834 79550 -126541 216904 397215 -163498 196809 -138644 -126607 41557 82031 -205750
12823 -248944 274277 -154022 -300564 19446 -118557 133159 1705 -244080 19274 -104745
12812 136557 191573 -28365 217008 163754 667598 -115218 -116173 -111834 -208349 84877 505139
12801 505139 -72258 145081 242393 275674 158548 55842 -42251 -208252 219874 -81951 112229
12789 -76233 -256298 132834 378589 -156462 111064 -163469 67232 187260 182216 -209048
12778 76866 264333 -128142 49272 88301 34953 64201 19779 162252 -142247 269843 -85227
12766 40209 317247 226452 136960 193499 -380997 27301 31144 -65308 256448 389196 -69845
12754 481633 97637 -139322 -17326 127233 -45192 -231935 3011 126392 257693 187598 -12589
$$ packed form
12834G9550a26541B16904J80311a63498A96809a38644J2037D1557M0474b05750
12823b48944B74277a54022j46542A9446a18557A33159A705b44080A9274a04745
12812A36557N5016b8365B17008n3254N03844a15218r55M339r6515H4877M20262
12801E05139g2258A45081R7312L3281j17126E5842d2251j66001B19874h1951A12229
12789g6233j80065A32834K45755a56462A11064a63469F7232J20028n044b09048
12778G6866J87467a28142D9272L9029C4953K9248A9779J42473a42247B69843h5227
12766D0209K77038r0795q9492N6539c80997B7301L843f5308B56448J32748f9845
12754D81633I7637a39322a7326A27233d5192j86743C011J23381J31301p0095a2589
$$ plain form
12742 -163761 35045 -241788 231518 176837 77078 -41401 3940 -7764 -270268 355244 192751
12731 192751 117433 -81151 115956 256372 61810 13914 267883 314629 175530 215309 382986
12720 382986 74135 216766 -30177 221072 -136429 46950 -162123 47865 -134478 303009
12709 -65140 100806 -155284 205496 447423 133450 79189 205451 167408 297480 -233230
12698 163078 20827 194590 241093 124453 316108 182066 61570 467362 -75256 163159
12687 43607 125483 -32563 223068 142061 71739 -41537 70583 306645 71460 -81187 -178842
12676 -178842 -442 253836 263024 195917 94117 400705 292021 60384 64627 162398 16636 153475
12664 153475 193339 36086 86721 121802 327447 -451817 216024 112400 -142147 -50328
$$ packed form
12742a63761C5045b41788B31518n4681G7078d1401C940g764k62504C55244j62493
12731A92751p5318h1151A15956J40416F1810A3914K53969M6746j39099L9779J67677
12720C82986G4135J42631c0177B21072a36429D6950a62123D7865a34478C03009
12709f5140A00806a55284B05496K41927A33450n4261J26262l8043J30072b33230
12698A63078B0827J73763M6503j16640J91655j34042F1570M05792g5256A63159
12687D3607Q1876c2563B23068q1007p0322d1537G0583K36062G1460h1187r7655
12676a78842d42B53836R188o7107I4117L06588j08684F0384M243R7771A6636J36839
12664A53475L9864C6086N0635L5081K05645d51817B16024j03624a42147e0328
$$ plain form
12653 75082 135347 86697 -172239 27048 183400 324542 386371 -80321 26948 -218854 136349
12641 -170262 308970 64272 1902 206830 -53217 213219 289811 201365 -136151 385380 16652
12629 155992 -21861 19520 56694 73912 190185 -85037 90766 -10237 289473 153510 204821
12618 204821 139458 -119239 84292 335230 282853 36456 93533 231509 132380 319102 203613
12607 203613 304563 -90198 197415 205216 33861 -240657 23138 -31120 192721 388473 89957
12595 123682 156418 235868 -89474 226 180956 -218127 189297 -181124 105007 -222935 -210470
12584 -210470 -66133 312627 30386 -212098 116906 11117 -53796 -48408 -391789 260795 181850
12573 181850 36380 96053 130322 54106 -47489 -2251 -22529 -121929 -27098 476322 125086
$$ packed form
12653G5082O0265m8650a72239B7048J56352J41142O1829h0321B6948b18854A36349
12641a70262C08970F4272A902K04928e3217B13219P6592q8446a36151C85380A6652
12629A55992b1861A9520L7174J7218J16273h5037I0766a0237B89473j35963N1311
12618B04821o5363a19239H4292K50938n2377C6456N7077J37976r9129J86722j15489
12607B03613J00950i0198A97415P801C3861b40657B3138c1120A92721J95752H9957
12595A23682L2736P9450h9474B26J80730b18127A89297a81124A05007b22935J2465
12584b10470f6133C12627C0386b12098A16906A1117e3796N388l43381B60795p8945
12573A81850C6380N9673L4269E4106d7489b251k0278r9400b7098D76322A25086
$$ plain form
12561 165020 177242 -109056 -117526 -144407 120814 -209016 7897 -93575 -87797 147965 -336887
12549 155988 -18745 -218244 -30787 -174160 -259778 144823 131191 4449 139479 144292 139793
12538 139793 8915 363130 -218676 228938 -15366 -131413 -191116 45329 79070 20956 60525
12527 60525 121617 232552 -196179 141642 -32144 301400 219320 162381 127870 70348 89163
12516 89163 -264085 -291257 -123974 124715 -207530 349644 -168427 -183858 92430 249515
12506 249515 38471 -10975 50325 229849 42186 -146786 -25892 264068 175428 -309773 172896
12494 319500 -9126 300092 130238 -43513 306256 121742 -225707 -43879 75707 158997 60839
12482 283032 -115944 -170419 153238 -195719 -20108 440097 -161014 701635 -124884 206314
$$ packed form
12561A65020J2222a09056q470k6881A20814b09016G897i3575N778A47965c36887
12549A55988a8745j99499c0787j43373q5618A44823j3632D449J35030M813m499
12538A39793H915L54215b18676B28938a5366j16047n9703D5329L3741B0956L9569
12527F0525O1092J10935a96179A41642c2144C01400q2080n6939l4511n7522J8815
12516H9163b64085k7172a23974A24715b07530C49644a68427j5431I2430J57085
12506B49515C8471a0975E0325J79524D2186a46786b5892B64068q8640c09773A72896
12494C19500i126C00092A30238d3513C06256A21742b25707d3879G5707Q3290F0839
12482B83032a15944n4475A53238a95719b0108D40097a61014G01635a24884B06314
$$ plain form
12471 381439 -27982 307402 126264 -113746 350768 3299 13389 157749 -227280 142559
12460 -195529 520120 326677 -54347 46163 -28991 -119538 124569 364969 -78258 -275317
12450 -275317 81052 178326 -42583 62918 343322 276368 99174 157686 69868 26628 -42844
12438 -63695 -77426 -8231 -50516 -27734 113810 429036 128130 299534 -162003 166725 -282949
12426 214605 -104349 -11685 -142179 117794 -92964 -355726 -197749 41132 20886 7051 -44311
12414 29540 262522 -97438 261635 30002 227007 -82255 -133241 -128581 -61234 -73525 -66572
12403 -66572 -51966 -227712 134972 210349 38857 3658 -11152 -38225 236090 -66372 -262008
12392 -262008 -18409 -118479 -45402 -93705 -136325 -253804 -77175 275246 17336 152024 -80831
$$ packed form
12471C81439b7982C07402A26264a13746C50768C299J0090J44360b27280A42559
12460a95529E20120j93443e4347D6163b8991r0547A24569K40400g8258j97059
12450b75317H1052R7274d2583F2918K80404o6954I9174N8512F9868B6628d2844
12438f3695j3731h231m2285K2782A13810L15226A28130J71404a62003A66725b82949
12426B14605a04349a1685j30494A17794i2964k62762J57977D1132k0246G051d4311
12414B9540K32982i7438B61635C0002J97005h2255n0986M660f1234j2291O953
12403f6572J4606j75746A34972P5377C8857C658a1152k7073B36090f6372j95636
12392b62008a8409j00070d5402m8303m2620j17479g7175B75246A7336J34688h0831
$$ plain form
12380 10063 -156964 -49700 -107679 302128 -69429 122832 286310 327335 141177 -96602 255873
12368 121541 8372 -36945 34336 -84270 -18772 -26097 33469 234609 199558 102141 235579
12357 235579 287775 -7443 249556 65884 173354 93689 -95870 324708 -168642 47819 -86357
12345 300928 -29605 101287 69086 -294002 3295 130044 -306308 79872 -115306 -208564 197766
12333 -127205 -15834 -79637 -32266 360183 -201097 473999 211636 15368 -79840 -84034 207763
12321 -111098 142135 24023 135202 -32189 91993 -61391 159242 361620 125373 -145338
12310 65716 222326 -362190 -51536 -89092 -6022 -300764 -172704 -408230 -27861 419712 335410
12299 335410 40417 95442 161231 176219 -17772 118849 47059 118514 -140869 -387169 -407484
$$ packed form
12380A0063a56964d9700n7979C02128f9429A22832J63478M1025A41177i6602B55873
12368A21541H372c6945C4336h4270a8772p325C3469K01140l5051r7417J33438
12357B35579N2196g443B49556F5884J07470p9665i5870C24708a68642D7819h6357
12345C00928b9605A01287l2201b94002C295J26749c06308G9872a15306r3258A97766
12333a27205a5834o3803c2266C60183b01097D73999B11636A5368g9840m194B07763
12321a11098A42135B4023J11179c2189I1993f1391A59242K02378A25373a45338
12310F5716J56610c62190e1536l7556f022k94742J28060k35526b7861D19712q4302
12299C35410D0417N5025O5789J4988a7772A18849D7059P1455a40869k46300k0315
$$ plain form
12288 -407484 -84525 147260 146255 132388 -3224 14282 294885 -93140 -562246 -45048 -29511
12277 -29511 280298 -31218 106993 106710 354377 27120 132145 130657 42659 -57882 146754
12265 -15237 306922 123697 -36347 -142133 188786 225941 214965 39234 361460 183170
12255 183170 158381 351923 34044 100767 -536918 -66326 46558 -92019 -212664 257889 226392
12244 226392 343858 -46436 -375016 -122255 -179319 -38486 65302 44483 311552 4871 233702
12233 233702 -32652 359104 138660 96850 1521 367884 119735 144223 435131 185088
12222 347693 358136 175202 216067 390145 -101578 181780 151043 387094 534568 -211230
12211 294231 81172 107001 332944 175454 -176560 52560 126957 382335 51730 128594 -180953
$$ packed form
12288d07484h4525A47260j005j3867c224A4282K80603i3140m69106d5048J5537
12277b9511B80298c1218A06993k83K47667B7120J05025j488D2659e7882A46754
12265a5237C06922A23697c6347j05786A88786L7155j0976C9234L22226j78290
12255A83170k4789J93542C4044O6723e36918f6326D6558i2019j20645B57889l1497
12244B26392J17466d6436l28580a22255n7064c8486F5302k0819K67069D871K28831
12233B33702c2652C59104A38660m1810A521L66363A19735K4488K90908A85088
12222C47693J0443A75202M0865J74078a01578A81780l0737K36051J47474b11230
12211B94231H1172K5829K25943j57490a76560E2560P4397K55378E1730P6864a80953
$$ plain form
12199 381215 255206 389031 374205 823 205482 342485 457792 599042 119384 312692
12189 312692 244891 296981 -122481 244982 232620 -77353 192638 266598 156379 361556
12179 361556 310102 30443 182833 24500 220024 141568 457214 14425 -67335 128134 -145474
12167 -3513 -110980 -28069 115993 169236 187167 -30649 337170 13357 256700 82583 107802
12156 107802 204655 -77215 267661 -152238 28567 59013 154048 -52894 -216496 -367101 275588
12144 -130924 19791 174624 -28621 -84897 -127881 -26698 155181 69518 215750 11132 -251156
12132 68826 45360 98227 -139412 178460 41804 -26773 -152527 -49315 125123 -117762 79934
12120 -164426 100815 337177 -7870 10337 220792 17325 -11430 190139 -89808 214966 -38074
$$ packed form
12199C81215j26009J33825j4826H23K04659J37003J15307J41250A19384J93308
12189C12692o7801N2090a22481B44982j2362g7353A92638P3960j10219K05177
12179C61556n1454C0443J52390B4500J95524p8456L15646A4425f7335A28134a45474
12167c513j07467b8069A15993N3243J7931c0649C37170A3357K43343H2583K5219
12156A07802R6853g7215B67661a52238B8567L0446R5035e2894j63602j50605B75588
12144a30924A9791J54833b8621n6276m2984b6698A55181F9518J46232A1132b51156
12132F8826k3466N2867a39412A78460D1804b6773j25754d9315A25123a17762G9934
12120a64426A00815K36362g870A0337K10455A7325a1430A90139h9808B14966c8074
$$ plain form
12108 221469 93990 -327821 -273458 -10723 -96352 9410 8441 -1169 12259 166306 33082 81119
12096 81119 65908 -119118 128644 103688 -77530 312040 114794 354112 -174591 -112237
12086 -112237 -332036 40743 -80699 -18796 320305 115646 91518 278250 -158045 253851
12075 -110063 237573 -7249 -66850 -234625 11500 409673 87382 28549 92883 -138054 109213
12063 8268 -6577 -149073 782 154728 301 13407 -399719 75195 -90855 -30613 -120647 380374
12050 339801 -44118 -8590 -237528 79856 -206017 48082 -68001 -122603 2292 179300 157859
12039 157859 112280 90800 55342 150525 34101 175957 -123843 -154518 -124056 163319 118815
12028 118815 22660 -57666 -31276 172012 -198850 25510 -16510 599989 460290 221286
$$ packed form
12108B21469I3990c27821N4363a0723q5629I410r69a169A2259J54047C3082M8037
12096H1119j5211a19118A28644k4956g7530C12040A14794K39318a74591O2354
12086a12237k19799D0743h0699a8796C20305A15646k4128J86732a58045B53851
12075a10063B37573g249n9601j67775A1500L98173H7382B8549O4334a38054A09213
12063H268f577j42496G82J53946C01J3106c99719G5195i0855c0613r0034C80374
12050C39801d4118h590k28938G9856b06017D8082f8001n4602B292J77008k1441
12039A57859m5579k1480l5458R5183C4101J41856a23843l0675L0462A63319m4504
12028A18815B2660e7666K6390A72012a98850B5510a6510E99989j39699B21286
$$ plain form
12017 427802 517145 321270 -33589 9036 -170405 -81161 97981 120952 -233231 224712 -181198
12005 -21248 -165350 -38327 281355 114784 -48295 149405 272951 94800 290376 -240065
11994 197868 -249282 -305202 -152946 196150 -17567 137573 36677 175599 -51549 -96806
11984 -96806 162540 -27268 -135596 -243552 -200320 -196574 -196190 103341 -38359 -79990 59003
11972 38109 212788 44902 332219 -109977 -52427 -174834 104549 93198 -56875 116799
11961 65354 117700 195654 100214 438658 19693 -296739 -87047 329919 -222060 -313295 -112436
11949 126850 -361976 -244250 199097 214505 148672 -127131 -167438 -298172 -179925 150929
11938 -504886 -2653 -129801 -223099 -371022 -78986 -92584 123243 -41775 -214697 50716 1543
$$ packed form
12017D27802Q9343j95875c3589I036a70405h1161I7981K2971b33231B24712a81198
12005b1248j44102c8327B81355A14784d8295A49405J23546I4800J95576b40065
11994A97868b49282n5920J52256A96150a7567A37573C6677J38922e1549m5257
11984i6806A62540b7268j08328j07956M3232L746L84A03341c8359m1631E9003
11972C8109J74679D4902K87317a09977e2427j22407A04549j1351e6875A16799
11961F5354N2346P7954r5440L38444A9693b96739h7047C29919b22060r1235a12436
11949A26850c61976J17726A99097J5408o5833a27131m0307j30734J18247A50929
11938e04886b653j27148r3298j47923g8986j3598A23243d1775j72922E0716A543
$$ plain form
11926 194844 -29444 -13614 144324 82438 -60570 -229628 -16000 -89067 255685 282507 267489
11915 267489 58136 96361 -39477 112104 -265976 228063 103826 13800 -151972 -413967
11905 -413967 -204364 350098 -411727 261157 122244 112000 -159152 -351706 72677 -273835
11894 36125 31740 -144237 -7969 107466 39807 108820 120706 22470 -216188 -94241 -392078
11883 -392078 14130 -59961 -167777 -257559 64785 282096 105143 205749 167402 33593 -129950
11871 -212209 229423 -38286 -23063 -195858 -189686 -64086 6648 -98833 216420 -140859 180009
11859 -545152 -120387 187672 178269 -97402 162258 -40433 -271849 -100939 18091 -97588 -104208
11848 -104208 127314 9671 153741 -7779 -306756 -115508 122917 218215 148851 4773 25712
$$ packed form
11926A94844b9444a3614A44324o1886f0570j69058a6000p3067B55685K6822j5018
11915B67489E8136L8225c9477A12104b65976B28063A03826A3800a51972k61995
11905d13967b04364C50098d11727B61157A22244j0244a59152j92554G2677b73835
11894C6125m385a44237g969A07466C9807O9013J1886B2470b16188i4241k97837
11883c92078A4130e9961j07816q9782F4785K17311A05143J00606l8347C3593a29950
11871b12209B29423c8286J5223j72795O172f4086F648i8833B16420a40859A80009
11859e45152a20387A87672r403i7402A62258d0433k31416a00939A8091i7588o620
11848a04208A27314I671J44070g779k98977a15508A22917R5298o9364D773K0939
$$ plain form
11837 25712 -139176 -104326 -43167 -156730 34731 76206 8320 83359 93080 -259569 -176415
11826 -176415 -170967 270919 -85698 -74450 -91025 -269605 -233909 -103006 -25876 -315047 51290
11814 -90791 -250416 26877 -174486 -55729 53410 -166381 -42956 -115970 102318 -211150 -20325
11802 44184 -37731 117339 374714 45584 -144657 39538 17429 -23140 -245309 -171222 166146
11790 -39573 -42494 57259 -158751 255418 54935 -182488 -205268 27666 208263 43536 104624
11779 104624 267405 300568 -446123 -42185 -170523 196200 -186134 528628 -18554 -140380
11769 -140380 -247222 195030 -212271 24326 -105404 -151928 4183 -125881 -110519 149479
11758 -129799 -160895 245864 241517 -48236 67718 271554 -201218 45036 -223746 -288051 451409
$$ packed form
11837B5712a39176L4850d3167j13563C4731M1475H320P5039R721b59569Q3154
11826a76415N448B70919h5698J1248j6575j78580L5696a03006b5876k89171E1290
11814i0791j59625B6877a74486e5729E3410a66381d2956p3014A02318b11150b0325
11802D4184c7731A17339K57375D5584a44657C9538A7429b3140k22169P4087A66146
11790c9573k921E7259a58751B55418E4935a82488k2780B7666J80597D3536O1088
11779A04624J62781L3163d46123d2185j28338A96200a86134E28628a8554j21826
11769a40380j06842A95030b12271B4326a05404m6524D183a25881J5362A49479
11758a29799l1096B45864m347d8236F7718K03836b01218D5036b23746o4305D51409
$$ plain form
11746 249893 -265151 -320911 -127377 -4925 -167193 80022 161191 5918 -76784 52790 -233251
11734 29562 -271200 164898 25906 -249796 179851 -300584 -115530 17252 -67695 82225
11723 26648 -104264 -59674 297984 91693 88760 -173224 -275716 226040 5628 55279 51758
11712 51758 36609 342553 -38076 -312214 -31276 -76368 314827 67232 159797 -80673 -39617
11700 -439603 -188102 -67880 -222145 109979 212939 327328 7862 215875 319877 73748
11689 132126 232897 -219414 100200 275794 142145 -42642 49955 -226112 -344866 256414
11678 62009 -193765 232293 136725 -62470 -111596 192223 -45354 -26916 -125374 85567 220365
11667 220365 71773 321204 -335069 155089 -61872 -245056 -255067 -261190 126340 17872 46157
$$ packed form
11746B49893b65151n5760a27377d925j62268H0022Q1169E918g6784E2790b33251
11734B9562b71200A64898B5906b49796A79851c00584a15530A7252f7695H2225
11723B6648a04264M4590B97984I1693k933a73224j02492B26040E628M9651l521
11712E1758j5149L05944c8076k74138c1276m5092C14827F7232R2565h0673c9617
11700d39603a88102f7880j54265A09979J02960J14389G862K08013J04002G3748
11689A32126J00771b19414A00200J75594j33649d2642D9955b26112j18754B56414
11678F2009a93765B32293r5568f2470m9126A92223d5354J8438r8458H5567J34798
11667B20365G1773K49431c35069A55089f1872j83184j0011o123A26340A7872K8285
$$ plain form
11656 46157 -379358 214927 320099 -52900 54271 -154347 341727 -98141 272098 203984
11646 203984 -314670 123396 99923 -312819 -239627 -89409 -28913 -260714 78949 298894
11636 298894 -96611 -88151 7880 495874 112379 77810 -18495 50081 50576 195802 93939 -100525
11623 37179 95399 37083 -183695 9473 13541 -33047 -83314 198301 12884 -81087 -101556 -68200
11611 -68200 23452 -110133 138095 15605 206739 283975 -68419 -90980 121321 202231 -83598
11599 -90512 109225 -10282 99925 120466 256079 -63221 257707 -28308 -339643 295866 72192
11587 -135620 218902 96483 13802 93144 60368 33836 149077 60045 -127510 -214635 137302
11575 119648 155854 -198748 98762 -125221 -355978 199698 265167 -267557 -1490 -294911
$$ packed form
11656D6157c79358B14927J05172e2900E4271a54347C41727i8141B72098o8114
11646B03984c14670A23396k3473c12819P3192h9409b8913k31801G8949K19945
11636B98894i6611Q460G880M87994A12379l4569a8495E0081M95J45226I3939a00525
11623C7179N8220C7083a83695I473M068c3047n0267A98301A2884h1087k0469L3356
11611f8200B3452a10133A38095A5605J91134P7236f8419k2561A21321Q0910h3598
11599i0512A09225a0282I9925K0541J35613f3221B57707b8308l11335B95866G2192
11587a35620B18902I6483A3802P9342l2776k6532J15241F0045a27510q7125A37302
11575A19648L6206a98748I8762a25221k30757A99698O5469b67557a490k93421
$$ plain form
11565 -294911 -38536 21153 65821 -112219 299134 -261800 290524 153167 255648 33309
11554 -63919 -127765 9365 -397134 -34111 63810 27129 238512 -60148 -94194 -60015 -22084
11542 -177707 -140295 -179509 -268908 139022 -5415 172985 199001 11508 94265 -115801 77749
11530 -73722 271145 165448 -191488 106245 -25196 24155 93539 -110862 91534 262381
11520 262381 253497 -148056 357331 131102 -86417 193903 327096 52621 88543 40819 316343
11509 316343 -55166 -22896 125595 177497 420319 202297 389722 219661 166057 158475 74022
11497 292233 127869 -59055 -131365 464125 -6496 407413 -41848 20257 99134 -30974 261118
11485 152864 319083 122040 369754 246072 289089 -8537 -81366 234727 148826 207465 479087
$$ packed form
11565b94911c8536B1153M4668a12219B99134b61800B90524j37357J02481C3309
11554f3919o3846I365c97134c4111F3810B7129K11383f0148l4046L4179b2084
11542a77707L7412l9214q9399A39022e415A72985K6016A1508Q2757a15801G7749
11530g3722B71145j05697a91488A06245b5196B4155O9384a10862I1534J70847
11520B62381q884a48056C57331A31102h6417A93903J33193E2621L5922D0819K75524
11509C16343e5166b2896A25595N1902K42822B02297J87425j70061n3604p582G4022
11497B92233A27869e9055p2310D64125f496D07413d1848B0257P8877c0974B61118
11485A52864J66219A22040K47714j23682M3017h537p2829B34727q5901N8639K71622
$$ plain form
11474 479087 125463 17612 415200 303897 325218 46191 151697 346678 195019 174108
11464 174108 72423 154504 110178 -322984 255831 153948 103764 284059 510341 172618
11453 199700 10380 261822 -27041 381996 -82749 -22375 87763 229469 341824 -232272
11442 -66468 31446 -60307 368023 208487 135150 141706 118983 274040 141702 17771 -147141
11430 50017 68649 82959 -330685 29565 45345 477083 294579 -217880 -229110 87788 197364
11419 197364 137957 137545 278094 32744 -105426 69784 50328 -43051 -115440 -121728 58162 -95996
11406 -113362 197868 -368071 103468 -16347 171720 69296 156284 48190 -234839 -188591
11396 -188591 128643 -78090 101903 40092 152542 -372414 143624 165895 -21633 -202741
$$ packed form
11474D79087A25463A7612L97588j11303K1321D6191J05506J94981j51659k0911
11464A74108G2423Q2081m4326c22984B55831j01883n0184J80295K26282A72618
11453A99700A0380K51442b7041C81996h2749b2375H7763J41706J12355b32272
11442f6468C1446f0307C68023j59536p3337O556k2723J55057j32338A7771a47141
11430E0017J8632J4310c30685B9565J5780M31738j82504b17880j1230H7788J09576
11419A97364n9407m12J40549C2744a05426F9784j9456d3051p2389o288E8162i5996
11406a13362A97868c68071A03468a6347A71720F9296Q6988D8190b34839M6248
11396a88591A28643g8090A01903D0092J12450c72414A43624K2271b1633j81108
$$ plain form
11386 -202741 -243106 -121633 105908 -4133 -145004 130278 168405 -93493 -107785 151393 217264
11375 217264 24962 25633 -126287 -62251 -89784 60381 -108723 -101063 43422 447641 -93183
11363 199982 357223 -20078 -232499 529682 -106507 -439829 141105 -247939 -12794 132275
11352 223278 -124405 -188438 202436 -121614 125471 -132477 -119163 -286586 113669 13636
11341 49417 78434 106166 -230818 16933 70517 35159 -58077 88239 -165636 141479 320281
11330 320281 14544 85181 169195 81339 -253017 -214780 21843 256050 114468 -111008 236157
11318 -99634 111595 78617 182730 -159995 186734 -14162 -117557 -366567 149399 -13787
11307 411449 -363461 279441 -11369 -30104 -278472 -258972 -62813 -65085 -26852 77923 305770
$$ packed form
11386b02741m0365J21473A05908d133j40871A30278L8127i3493j4292A51393O5871
11375B17264B4962O71a26287f2251k7533F0381a08723P660D3422M04219i3183
11363A99982J57241b0078k12421E29682a06507l33322A41105b47939a2794A32275
11352B23278a24405o4033B02436a21614A25471a32477J3314j67423A13669A3636
11341D9417K9017K7732b30818A6933N3584C5159e8077H8239a65636A41479J78802
11330C20281A4544P0637Q4014H1339b53017L8237B1843K34207A14468a11008B36157
11318i9634A11595l2978J04113a59995A86734a4162j03395k49010A49399a3787
11307D11449c63461B79441a1369j8735k48368J9500f2813k272b6852G7923K27847
$$ plain form
11296 305770 108401 33453 -112644 62955 -14425 32655 -12091 -51180 -182496 -522760 57966
11284 -82258 -193387 114348 -84943 -168664 -294407 -208091 -154865 -103212 -178822 117933 107487
11273 107487 22680 127483 154078 -233833 -229200 196941 -39276 -93607 12841 165908 -112902
11261 -146770 136567 -61572 6436 -17461 -178704 -66225 35440 -262295 -126164 186763 107311
11250 107311 218286 -49847 -267666 -144792 -203313 -113317 -201464 -226330 25341 223653 -81769
11238 -75908 91900 83400 302269 113542 70485 80850 -110674 76851 80345 76166 298087
11227 298087 77627 -130400 166550 -60545 -130922 336159 34207 156181 -14158 115229
11216 288206 -216042 -122531 188955 -290357 -123620 24095 -68452 -114423 -136726 -43359 208885
$$ packed form
11296C05770A08401C3453a12644F2955a4425C2655a2091l9089j31316l40264E7966
11284h2258j11129A14348h4943q3721j25743Q6316N3226N1653p5610A17933j0446
11273A07487B2680J04803K6595b33833M633A96941c9276n4331A2841J53067a12902
11261a46770A36567f1572F436a7461j61243f6225C5440b62295a26164A86763p9452
11250A07311J10975d9847k17819J22874n8521Q9996q8147k4866B5341J98312h1769
11238g5908I1900q500K18869A13542m3057J0365a10674G6851L494m179K21921
11227B98087G7627a30400A66550f0545p0377C36159C4207J21974a4158A15229
11216B88206b16042R3511A88955b90357a23620B4095f8452m5971k2303d3359B08885
$$ plain form
11204 -373697 -98917 44980 -92566 52675 -107401 138073 41958 198737 -21764 33580 -339877
11192 -131310 -153639 -332710 159785 -329281 79045 -79006 -56195 90480 -189351 -69965 -108276
11181 -108276 -341947 -170885 28295 -181295 -106652 73825 110416 -214459 -56710 -164831
11171 -164831 -63598 -442311 -19883 320103 -296400 -83114 33517 350663 -176607 22340
11160 55808 245129 -81189 -44692 -103181 -141490 -28134 -123930 -214218 -49871 -449401 -86530
11148 268627 -279153 -372877 56495 -203782 142151 -177896 -8146 -32773 242656 -110730
11137 -63810 115015 -39942 -85164 -290453 -160177 -401230 2885 25355 281930 289022 -106612
11125 287991 64030 76385 197245 195800 -7914 -47167 67270 -41370 439524 111613 60144
$$ packed form
11204c73697i8917D4980i2566E2675a07401A38073D1958J56779b1764C3580c39877
11192a31310k2329j79071A59785c29281G9045g9006K2811I0480a89351f9965l8311
11181a08276k33671a70885B8295a81295P4643G3825L6591b14459e6710j08121
11171a64831f3598l78713a9883C20103b96400h3114C3517L17146a76607B2340
11160E5808J89321h1189L6497n8489l8309b8134r5796r0288d9871l99530h6530
11148B68627b79153r3724E6495b03782A42151a77896h146k4627B42656a10730
11137f3810A15015c9942m5222k05289J30276k41053B885K2470K56575P092a06612
11125B87991F4030J2355J20860j445g914l9253F7270d1370D39524A11613n1469
$$ plain form
11114 60144 252063 39211 -89469 228437 14516 207087 87926 -201246 148758 147680 254790
11103 254790 44752 338894 346454 146552 150122 -101221 12043 210303 176992 295934 25097
11091 85418 -222793 256754 398241 87283 -94674 363125 298010 464663 178321 134580
11081 134580 585020 233479 153401 192662 245627 -149709 240262 201273 185666 410276
11071 410276 511690 147103 257591 171806 251936 325929 338035 11622 466195 323556
11061 323556 480018 482248 435276 627540 215474 359497 244174 569463 473518 325582
11051 325582 696157 720998 1041627 595772 894619 1173096 845423 786169 594442 1184363
11041 1184363 935252 1057506 878342 909618 690468 797831 714787 669621 632156 709259
$$ packed form
11114F0144J91919C9211h9469B28437A4516J92571H7926b01246A48758j078J07110
11103B54790D4752K94142P560A46552L570a01221A2043J98260l3311J18942B5097
11091H5418b22793B56754J41487H7283i4674C63125o5115J66653A78321m3741
11081A34580M50440B33479q0078L9261N2965a49709B40262l8989j5607K24610
11071D10276J01414A47103J10488q5785Q0130P3993J2106A1622M54573j42639
11061C23556J56462K230m6972J92264B15474J44023j15323L25289r5945j47936
11051C25582L70575K4841L20629m45855K98847K78477l27673n9254j91727N89921
11041A184363k49111J22254j79164L1276k19150J07363q3044m5166l7465P7103
$$ plain form
11031 709259 853973 849810 628610 493104 951534 760988 641741 843996 448102 651716
11021 651716 624706 731174 665365 450223 573761 632002 309424 783130 681280 715501
11011 715501 883361 973978 479178 733892 218722 288989 736866 841404 837518 757442
11001 757442 967190 690113 558587 802852 721191 747522 713984 509345 794782 872274
10991 872274 721266 1158146 792620 1307554 993969 865885 1209713 925876 876365 1356088
10981 1356088 1178416 1328609 1532383 1907186 1328898 1970089 2260902 2484641 2585270
10972 2585270 3036794 3575959 3479781 3568112 3574744 3017101 3155923 2946932 2697052 2253620
10962 2253620 2247954 2039561 1961268 1909221 1669105 1668069 1673182 1849427 1217399 1127568 699240
$$ packed form
11031G09259J44714m163k21200j35506M58430j90546j19247K02255l95894K03614
11021F51716k7010J06468o5809k15142J23538N8241C09424M73706j01850L4221
11011G15501J67860R0617D79178K54714B18722P0267M47877J04538l886q0076
11001G57442K09748k77077j31526K44265q1661K6331l3538k04639K85437P7492
10991H72274j51008M36880l65526N14934l13585j28084L43828k83837m9511M79723
10981A356088j77672J50193K03774L74803n78288O41191K90813K23739J00629
10972B585270M51524N39165r6178Q8331O632n57643J38822k08991k49880m43432
10962B253620n666k08393p8293n2047k40116j036N113J76245o32028q9831m28328
$$ plain form
10951 699240 557477 732452 791473 486725 851712 242512 355630 449948 294626 321852
10941 321852 174483 -7179 91851 258899 238303 162675 144155 68061 -96523 195925 137552
10930 137552 246193 -20642 179330 181074 356324 -17143 -124097 558 -145218 -154880 41293
10918 95991 37799 258184 70243 66915 -80188 -158291 -73838 72417 -38700 -36975 -61669 -122341
10906 -122341 68426 91243 -31991 -125231 84023 52445 -51156 -109365 -50820 -205372 -102755
10895 -102755 -61645 -430059 -14393 -24823 41604 219993 -27366 322103 60937 250519 280180
10884 280180 -309088 -55714 22483 -92846 -392661 70807 -105885 89737 -23724 -47646 144982
10872 24582 104574 -11222 11887 344349 2845 -350775 -98459 258031 -47381 126565 67711
$$ packed form
10951F99240j41763J74975N9021l04748L64987B42512J13118R4318j55322K7226
10941C21852j47369g179I1851J67048k0596p5628j8520F8061i6523A95925n8373
10930A37552J08641b0642A79330J744J75250a7143j06954E58a45218r662D1293
10918I5991C7799K20385G0243l328h0188p8103g3838G2417c8700J725k4694o0672
10906a22341F8426K2817c1991r3240H4023l1578e1156n8209e0820j54552J02617
10895a02755M1110l68414a4393j0430D1604J78389b7366C22103F0937J89582K9661
10884B80180c09088e5714B2483i2846k99815G0807a05885H9737b3724k3922A44982
10872B4582P9992a1222A1887L32462B845c50775i8459B58031d7381A26565n8854
$$ plain form
10861 67711 148158 -154086 82327 -102396 -307976 -168548 -37800 71913 235697 166280 276780
10850 276780 -43125 37272 23297 94467 201125 -24832 149075 -143614 52134 -188628 204230
10838 -204248 200669 -157500 -317286 129781 -75838 -34619 94597 57146 -228667 -298099
10828 -298099 303422 -155223 -166484 -365077 -368906 -35216 -191579 -171155 100064 -31285 -445078
10817 -445078 -4128 -24808 -197987 -190502 64753 -235734 -80866 198592 74840 103460 -111114
10805 322543 177756 196940 162701 -93696 -96798 -7929 -258426 -10220 -86219 -170628 52986
10793 -22908 40210 -265162 61177 153875 153785 -304949 61802 -135841 -19105 -88561 5410 -123898
10780 146221 -117765 144066 -114253 -43895 -114348 -67986 -175571 -221842 -258197 -134479
$$ packed form
10861F7711Q0447a54086H2327a02396k05580J39428c7800G1913J63784o9417J10500
10850B76780d3125C7272j3975P1170J06658b4832A49075a43614E2134a88628B04230
10838b04248B00669a57500j59786A29781g5838c4619I4597l7451b28667o9432
10828b98099C03422a55223j1261j98593l829c5216j56363K0424A00064c1285m13793
10817d45078d128k0680j73179P485F4753b35734h0866A98592G4840K8620a11114
10805C22543j44787J9184l4239i3696l102g929k50497a0220p5999q4409E2986
10793b2908D0210b65162F1177R2698r0c04949F1802a35841a9105o9456E410a23898
10780A46221a17765A44066a14253d3895p0453M6362j07585m6271l6355J23718
$$ plain form
10770 -134479 53379 -40399 -166853 100653 -31979 -19877 -20464 57488 -184443 -241099 -3318
10758 -273937 -81689 243428 -81075 -84756 16250 -94102 -18877 -56274 -39042 324165 -441622
10746 -402312 100265 217789 -49715 167258 -184798 -47160 10526 -93983 19898 -233678
10735 4638 -131936 -52947 -116052 168437 -25515 135490 -157571 -294123 -118301 170576
10724 -338681 -155872 -37716 331945 256883 -176408 -479385 -118568 -252574 82909 -52822
10713 -36084 -224365 -209667 72586 -52239 -48706 -36400 161777 -196640 -29873 272164 -13358
10701 -51383 -571073 -308589 -272726 -218866 -131121 92663 39574 -86507 232227 228258 30627
10689 11988 -54204 146482 -77504 -368283 -447686 -2309 129460 104630 -49293 -3510 -181700
$$ packed form
10770a34479E3379d0399j26454A00653c1979J2102n87E7488a84443n6656c318
10758b73937h1689B43428h1075l681A6250i4102a8877l7397J7232C24165d41622
10746d02312A00265J17524d9715A67258a84798d7160A0526i3983A9898b33678
10735D638a31936e2947o3105A68437b5515A35490a57571j36552a18301A70576
10724c38681a55872c7716C31945p5062a76408l02977a18568j34006H2909e2822
10713c6084j88281J4698G2586e2239L533J2306A61777a96640b9873B72164a3358
10701e1383n19690K62484L5863N3860Q7745I2663C9574h6507B32227l969C0627
10689A1988e4204A46482g7504k90779p9403b309A29460k4830d9293c510j78190
$$ plain form
10678 -181700 -66861 18363 -194108 -183725 -296134 188304 -152428 112388 193533 103423
10668 103423 142978 -101374 -126966 128687 65182 -382166 167263 -216248 -36071 -145446
10658 -145446 -200700 -7965 26664 71764 -323452 367130 246877 52795 89314 -70952 -74731
10647 -74731 105368 -238805 -79256 139623 -111738 112984 58105 85127 191285 221027
10637 221027 22052 -163962 -115231 -81328 -234908 -192301 -156729 -179578 405266 -76686 185545
10625 209666 -227207 -56153 -294741 -155045 262229 -101745 163039 118067 -407286 46269
10614 -364068 44527 176867 -332219 129323 -162985 -107058 -138561 -192587 201476 -168162
10603 106057 165614 43045 -258612 67459 -298230 -181252 26922 146218 -172981 -29869
$$ packed form
10678a81700f6861A8363a94108J0383j12409A88304a52428A12388Q1145r0110
10668A03423L9555a01374k5592A28687o3505c82166A67263b16248c6071j09375
10658a45446n5254g965B6664M5100c23452C67130j20253E2795L6519g0952l779
10647g4731A05368b38805g9256A39623a11738A12984n4879K7022J06158K9742
10637B21027B2052a63962M8731L3903j53580M2607L5572k2849D05266g6686A85545
10625B09666b27207e6153k38588J39696B62229a01745A63039m4972d07286D6269
10614c64068D4527J32340c32219A29323a62985N5927l1503n4026B01476a68162
10603A06057N9557D3045b58612F7459b98230J16978B6922J19296a72981b9869
$$ plain form
10592 -308180 -371763 268547 -280795 -136262 -168679 -406680 -38213 50750 11480 75182 181512
10581 181512 -127947 118609 -187692 369588 -363038 -318789 -50653 -47072 -206004 -377574
10571 -377574 245921 -96903 40162 7759 21814 340919 108545 99947 76492 45081 123983
10560 123983 -97018 -238729 -169636 267428 138797 -253070 94697 91586 -151609 -404340
10550 -404340 -46830 63310 -65867 110371 185978 73259 -132930 17457 -200447 245375 -55919
10538 -115026 191064 161319 -38359 185342 86599 -67658 -192484 74584 -21710 -216028 178081
10526 -179483 -471642 -17607 81283 -201066 -193083 -12101 -133369 -74883 -14124 -73023 -131471
10515 -131471 176078 -248 300405 105341 181471 -367396 -159326 137703 -376053 34729
$$ packed form
10592c08180o3583B68547b80795a36262l2417k38001c8213E0750A1480O3702J06330
10581A81512a27947A18609a87692C69588c63038M4249e0653L581j58932j71570
10571c77574B45921i6903D0162G759J4055L19105A08545q598k3455l1411P8902
10560A23983i7018j41711O9093B67428j28631b53070I4697l111a51609k52731
10550d04340d6830F3310f5867A10371P5607G3259a32930A7457b00447B45375e5919
10538a15026A91064k9745c8359A85342H6599f7658j24826G4584b1710j94318A78081
10526a79483k92159a7607H1283b01066P983a2101j21268N8486a4124n8899n8448
10515a31471A76078b48C00405A05341P6130c67396a59326A37703c76053C4729
$$ plain form
10504 -72781 292634 -121179 -12909 -11679 78564 -406107 -3379 153638 31395 277885 -318565
10492 3934 -133628 -58165 -331959 -14044 129274 240565 -57580 35320 273784 -358866 265399
10480 260046 375202 303114 200666 -44010 50467 54014 -223447 73395 -85499 51281 -291130
10468 -209416 -339846 15147 -151083 10867 -433551 211518 55171 -131549 253960 287903
10458 287903 -376006 -130987 -114567 -155750 -169005 -17248 241311 -160209 88086 -36704 75149
10446 -115466 -351595 33963 55682 340054 34221 -348848 50827 41695 -148348 21936 151405
10435 151405 -66859 86687 -48617 -45023 240581 414440 2499 -37807 62918 39530 69816
10424 69816 -51184 -50391 205497 -221242 -186267 -248937 -49364 33528 15219 50406 40412 -191627
$$ packed form
10504g2781B92634a21179a2909J230G8564d06107c379A53638C1395K46490c18565
10492C934a33628e8165k73794a4044A29274J11291e7580C5320K38464c58866B65399
10480B60046J15156p2088j02448d4010E0467L547b23447G3395h5499E1281b91130
10468b09416j30430A5147a51083A0867d33551B11518E5171a31549B53960L3943
10458B87903c76006a30987J6420m1183j3255a7248B41311a60209H8086c6704G5149
10446a15466k36129C3963K1719K84372C4221c48848E0827r132a48348B1936J29469
10435A51405f6859H6687d8617L594B40581J73859B499c7807F2918k3388L0286
10424F9816e1184P93B05497b21242L4975o2670d9364C3528A5219L5187r994a91627
$$ plain form
10411 -121807 278174 -140629 -234142 54746 5822 362690 296362 -62757 -9850 122363 338917
10400 338917 -130352 -164493 -212116 143065 153005 352157 241660 -43380 744 -62885 -106563
10389 -106563 439610 76269 250025 116826 476991 142002 243669 -138110 28268 240297
10379 240297 473675 391337 141808 423010 346580 290828 402792 364251 635344 329870
10369 329870 226860 249093 680571 566699 606277 493739 319389 553863 241465 304176
10359 304176 114952 20363 -38298 22388 -208939 258711 460646 607076 519396 671187
10349 671187 530940 518803 302124 325450 507175 166717 304912 301754 160156 156648 475725
10338 475725 380149 236888 300406 57733 121901 39236 1079 228489 233435 159765 131738
$$ packed form
10411a21807B78174a40629r3513E4746E822L56868o6328f2757i850A22363K16554
10400C38917a30352l4141m7623A43065R940J99152j10497d3380G44f2885m3678
10389a06563D39610G6269J73756A16826L60165A42002J01667a38110B8268K12029
10379B40297K33378q2338A41808K81202p6430n5752J11964l8541K71093l05474
10369C29870j03010K2233M31478j13872L9578j12538j74350K34474B41465O2711
10359C04176A14952B0363c8298B2388b08939B58711K01935J46430q7680J51791
10349F71187j40247j2137k16679K3326J81725A66717J38195l158j41598l508L19077
10338D75725r5576j43261O3518E7733O4168C9236A079K27410M946p3670k8027
$$ plain form
10327 131738 94497 267201 39162 -15783 92347 296179 280640 285609 -98894 -142362 -107917
10316 -107917 393259 117301 -119835 -71383 -71397 85109 80935 -104206 145116 22795 1362
10304 -169978 199693 -158977 409711 -212390 72155 389599 112923 106717 215216 405842
10294 405842 29991 229194 152121 -205287 -251008 -133104 353770 -74749 -44936 -53530 -84641
10283 -84641 342319 54251 -263650 -64044 -298876 -62324 -47812 -25845 -112398 -277375 -329747
10272 -329747 -65668 -161366 -149987 -22440 45061 22405 191018 110551 116971 162335 151883
10261 151883 82417 217182 116878 300728 511370 105488 58416 285416 300785 103024
10250 194884 -143084 69304 -192290 -193790 -157148 -118612 -176868 112700 -169866 -90151 -20477
$$ packed form
10327A31738l7241J72704C9162a5783I2347K03832j5539M969i8894m3468L4445
10316a07917C93259A17301a19835M8452j4H5109m174a04206A45116B2795A362
10304a69978A99693a58977D09711b12390G2155L17444A12923o206J08499J90626
10294D05842B9991J99203p7073b05287m5721J17904C53770g4749K9813q594l1111
10283h4641C42319E4251b63650f4044k34832f2324J4512K1967q6553j64977n2372
10272c29747f5668r5698J1379b2440D5061B2405J68613q0467O420M5364j0452
10261A51883o9466J34765j00304J83850K10642A05488m7072K27000J5369A03024
10250A94884a43084F9304a92290j500L6642L8536n8256A12700a69866P9715b0477
$$ plain form
10238 42740 7760 -429551 -9439 46757 152513 103844 -322106 125929 55125 -34343 -223080
10227 -223080 40510 -196243 4370 -382123 30619 -221544 242351 -68931 110461 310676
10217 310676 -128700 -45148 148311 -272026 -167848 -282947 273831 13810 -90810 -210661
10207 -210661 -202525 -93414 -32616 384 -146177 -177837 110630 -184055 129770 -264803 248076
10195 226802 -125747 -240880 -342246 -4396 -56437 -128549 -168489 -73429 152562 -308435 298560
10183 -3100 303938 57228 -165575 54954 10198 -40972 -34071 -308253 183690 -200577 3449
10171 -32358 -5063 150129 -16977 -229923 -176443 -108611 7225 -182928 -34288 -66884 -130036
10160 -130036 -217939 -632078 -206362 -4077 -145107 -302023 -137498 156790 -95801 137660
$$ packed form
10238D2740G760d29551i439D6757J05756m8669c22106A25929E5125c4343j88737
10227b23080D0510a96243D370c82123C0619b21544B42351f8931A10461K00215
10217C10676a28700d5148A48311b72026J04178j15099B73831A3810i0810j19851
10207b10661Q136i3414c2616C84a46177l1660A10630a84055A29770b64803B48076
10195B26802a25747j15133j01366d396n2041p2112l9940g3429A52562c08435B98560
10183c100C03938E7228a65575E4954A0198d0972O901k74182A83690b00577C449
10171c2358e063A50129a6977k12946N3480O7832G225a82928c4288l2596o3152
10160a30036q7903m14139b06362d077j41030j56916a37498A56790i5801A37660
$$ plain form
10149 -108555 58498 -296416 -292781 229849 -58982 -620268 -234002 189231 -5311 35721 -182823
10137 199177 -189258 91073 -361821 -54345 -65090 -264674 -167611 138892 -307465 -38303
10126 -15746 64493 -130920 -351565 -123273 -153321 -172592 -290933 -122371 -145961 -109282 35297
10114 -45233 63428 -310951 -348576 41647 211079 -291702 -356716 -235946 -64822 59233 46198
10103 46198 231550 144959 -29227 114258 53239 88307 -320184 -62226 90705 70707 253885
10092 253885 -43751 -22095 252580 35748 355003 -247649 -65099 -153372 -110171 -50312 -123694
10081 -123694 -153949 -58622 -336017 -12888 -105617 18585 -154149 -51556 -177982 43155 55527
10070 55527 -273384 -59681 1057 -13607 136033 -92561 -130430 133247 -315679 -101658 589886
$$ packed form
10149a08555E8498b96416L635B29849e8982n61286b34002A89231e311C5721a82823
10137A99177a89258I1073c61821e4345j0745j99584R7063A38892c07465c8303
10126a5746F4493a30920k20645a23273l0048j9271j18341a22371k3590L6679C5297
10114d5233F3428c10951l7625D1647J69432b91702o5014J20770f4822E9233j3035
10103D6198J85352q6591b9227A14258E3239L5068c20184f2226I0705j9998J83178
10092B53885d3751K1656B52580C5748L19255b47649f5099q8273M3201e0312p3382
10081a23694l0255e8622k77395a2888r2729A8585a54149e1556j26426D3155J2372
10070E5527b73384e9681A057a3607A36033i2561l7869A33247c15679a01658E89886
$$ plain form
10058 -101265 39706 48908 -227248 30230 60177 445936 -99583 -1599 283072 -44140 -185211
10047 -185211 -201175 35183 130977 209441 -115579 59934 -299651 -220595 -13217 -357901 -176883
10035 -294277 -9877 -138249 -177311 80446 40835 -122340 156408 -329679 112799 55521 -39184
10023 -85791 -185242 -210539 -117342 -133011 37441 -332333 9269 6452 -114632 -261136 14049
10011 -155882 -95134 -521789 -89579 -2576 65425 10802 -18210 148993 189878 -127787 -190368
10000 -190368 -63446 -3952 -87761 -107191 29469 2983 -317394 -182693 -74478 255736 136250
9989 136250 -136782 66131 109558 32587 -93326 123609 -111019 -66284 -142602 -94496 342412
9977 25744 34302 51083 -295221 128240 -206802 -32626 34509 -285824 136437 439282 -334650
$$ packed form
10058a01265C9706R202b27248C0230K9947L85759i9583a599B83072d4140j41071
10047a85211j5964C5183R5794P8464a15579E9934b99651P9056a3217l44684a76883
10035b94277i877j28372l9062H0446l9611a22340A56408c29679A12799E5521c9184
10023h5791r9451k5297R3197j5669C7441c32333I269k817a14632j46504A4049
10011a55882O0748m26655h9579b576F5425A0802a8210A48993M0885a27787o2581
10000a90368f3446c952q3809j9430B9469B983c17394J34701g4478B55736j19486
9989A36250a36782F6131M3427C2587i3326A23609a11019M4735p6318M8106C42412
9977B5744Q558J6781b95221A28240b06802c2626C4509b85824A36437L02845c34650
$$ plain form
9965 -233525 97357 -218830 12070 -418901 -68006 199143 284429 -216873 114771 80564 16407
9953 105511 -231838 -29140 81797 90111 85456 -354625 396403 -126771 61608 190338 321585
9942 321585 -75290 254524 -110100 -268987 149309 -344574 -87011 -221331 -161564 -610215
9932 -610215 -200812 -94842 98539 -113770 -65015 -105086 81558 -322671 -259423 -178584 -13699
9920 -211982 -168009 94759 -78878 -116884 -96077 137935 -7679 -23628 -9814 206585 -140296
9908 -345711 -30055 -63696 -20506 144869 149683 -241825 -366250 115456 84736 -103155 36931
9896 47582 -419005 85977 -525003 -329581 145525 35138 -293496 -237862 225886 -287984
9885 -146324 34101 -122132 13790 -184829 121247 8823 -114554 -32916 -218206 11553 -135389
$$ packed form
9965b33525I7357b18830A2070d18901f8006A99143Q5286b16873A14771l4207A6407
9953A05511b31838b9140H1797Q314m655c54625C96403a26771F1608J28730J31247
9942C21585g5290B54524a10100j58887A49309c44574h7011j34320N9767m48651
9932f10215b00812i4842I8539a13770M8755m0071H1558c22671O3248Q0839a3699
9920b11982M3973I4759g8878l8006K0807A37935g679j5949i814B06585a40296
9908c45711c0055l3641b0506A44869M814b41825j24425A15456l0720a03155C6931
9896D7582d19005H5977e25003J95422A45525C5138b93496N5634B25886b87984
9885a46324C4101a22132A3790a84829A21247H823a14554c2916j85290A1553a35389
$$ plain form
9873 -100562 -22532 -91931 -224363 -304789 99078 -98854 -80292 -119477 -300687 -113907 -224279
9862 -224279 -322665 164884 -286810 -238353 -49576 18543 -175612 -2213 137690 -1704 68356
9850 -111777 -113566 -107658 350383 -10559 -106675 -258171 -137710 -11899 -425832 -193800 -82395
9838 -329451 -226959 -50351 -172201 -94655 -349095 -267729 -92706 49462 -91202 -138407 -542464
9827 -542464 -259800 -188686 107333 -27237 74983 -126328 189986 5245 64039 -55440 -199576
9816 -199576 -137624 38702 -62821 -274831 -148818 -113197 -22726 -241344 11864 167826 85949
9805 85949 25302 144163 61808 14993 -389496 -58717 -141324 -139387 -90823 -41719 -82214 -229248
9793 -229248 -255204 134604 301415 -66921 -142402 66656 184661 -482650 -93560 122922 8932
$$ packed form
9873a00562b2532o9399j32432q0426I9078i8854J8562l9185j81210a13907j10372
9862b24279r8386A64884b86810M8457d9576A8543a75612b213A37690a704F8356
9850a11777j789N908C50383a0559r6116j51496J20461a1899m13933a93800h2395
9838c29451J02492e0351j21850P7546k54440Q1366i2706D9462i1202m7205m04057
9827e42464b59800P1114A07333b7237G4983a26328A89986E245N8794e5440j44136
9816a99576O1952C8702f2821k12010J26013L5621b2726k18618A1864J55962q1877
9805H5949B5302J18861F1808A4993c89496e8717q2607J937M8564d1719m0495j47034
9793b29248k5956A34604J66811f6921p5481F6656J18005d82650i3560A22922H932
$$ plain form
9781 2648 309073 -293924 -221781 -123338 45451 11427 -220 -142872 147219 125199 157301 295093
9769 295093 -15596 -50906 -35725 223160 -118735 -6420 -59484 193790 293147 111941 352985
9758 352985 138365 -208216 16686 -164690 -101119 -278011 -160761 -51249 -33368 98229 76989
9747 76989 -242026 -342510 -81153 95203 -44412 9730 278772 76101 -100491 107910 -187903
9735 -249731 92628 84942 -167335 -82774 -113776 -152808 -340687 -367530 -342724 46436 -109197
9723 -188293 83687 -204341 171001 -102358 73614 -73665 323716 99576 122780 -404358 -114778
9711 -99325 -129482 -126046 257095 -261304 -161148 54326 -39384 373235 -44571 -132806 -206476
9700 -206476 -386348 -18837 -194957 -320593 -454700 -150805 -87890 -81906 -399275 69532 111972
$$ packed form
9781B648L06425b93924P2143R8443D5451A1427b20j42652A47219k2020L2102J37792
9769B95093a5596l5310J5181B23160a18735f420n3064A93790R9357A11941K41044
9758C52985A38365b08216A6686a64690O3571j76892J17250e1249J7881I8229k1240
9747G6989b42026j00484h1153I5203d4412I730K69042G6101a00491A07910a87903
9735b49731I2628p686a67335h2774l1002l9032j87879k6843K4806D6436a09197
9723a88293H3687b04341A71001a02358G3614g3665C23716I9576K3204d04358a14778
9711i9325l0157L436B57095b61304J00156E4326c9384C73235d4571q8235p3670
9700b06476j79872a8837j76120j25636j34107a50805O2915N984l17369F9532M2440
$$ plain form
9689 111972 -96286 -50167 -157018 -145704 213148 54302 15168 202661 -214984 18211 140690
9678 140690 -384607 -360778 -244834 22075 -34206 -199334 -103262 -81822 -68649 40966 -222198
9666 -133110 -333154 -128719 435954 415493 -18617 -233085 -421907 -126666 179614 70770
9655 -17602 165603 148897 118625 872 -142546 -161749 183564 251607 162777 -186293 230939
9643 75111 14792 7904 26799 23970 -95782 -108510 80044 -142996 -53802 -166779 -164288 126607
9630 -64783 -155240 -330271 15023 3314 102892 -69790 15159 -40013 66703 -148784 -292771
9619 -292771 26108 65723 -338752 92870 4420 -168730 66896 372375 78240 -30638 172816
9607 267065 -23331 -194123 -185020 -361046 105995 -269221 52218 -177568 58772 -496418 -343107
$$ packed form
9689A11972i6286M6119j06851J1314B13148E4302A5168J87493b14984A8211J22479
9678A40690c84607K3829J15944B2075c4206j65128R6072K1440J3173D0966b22198
9666a33110k00044a28719D35954k0461a8617k14468j88822a26666A79614G0770
9655a7602A65603j6706l0272H72a42546j9203A83564O8043q8830a86293B30939
9643G5111A4792o888J8895k829i5782j2728H0044a42996e3802j12977K491A26607
9630f4783r0457j75031A5023C314R9578f9790A5159d0013F6703a48784j43987
9619b92771B6108L9615c38752I2870D420a68730F6896L05479G8240c0638A72816
9607B67065b3331j70792R103j76026A05995b69221E2218a77568E8772d96418J53311
$$ plain form
9596 -343107 111985 -92781 -124821 26965 -17462 58109 -215678 66781 39429 59291 -87570
9584 -191433 -104485 81932 -68205 24037 273508 179509 -26857 -175403 -89844 -166936 5197
9572 -98296 160045 -90636 -406049 -298711 -109393 -2432 64085 -47308 116811 201517 -24957
9560 94501 -407627 49114 -296782 308879 49188 -55557 -302914 26195 -73491 225429 -82035
9548 23796 -262275 -88463 -331211 -209020 -294437 -243333 17607 214924 -25120 -227868 -102894
9536 -196308 -287107 -162643 -16499 212459 -141951 -413962 -119742 -54609 149797 -51880
9525 -143546 -92287 61734 -252608 111721 109178 197890 227761 43095 -120588 -251525 -292561
9514 -292561 62027 90987 -63630 13745 -85130 -83927 140249 5694 -354069 -7624 94596 32456
$$ packed form
9596c43107A11985i2781l2040B6965a7462E8109b15678F6781k7352J9862h7570
9584a91433Q6948H1932f8205B4037K49471r3999b6857j48546Q5559p7092E197
9572i8296A60045i0636l15413J07338a09393b432F4085d7308A16811Q4706b4957
9560I4501d07627D9114b96782C08879D9188e5557k47357B6195g3491B25429h2035
9548B3796b62275h8463k42748J22191q5417N1104A7607J97317b5120k02748a02894
9536a96308r0799J24464a6499B12459a41951k72011a19742e4609A49797e1880
9525a43546N1259F1734b52608A11721k543Q8712K9871D3095a20588j30937m1036
9514b92561F2027K8960f3630A3745h5130J203A40249E694c54069g624I4596C2456
$$ plain form
9501 -360895 120326 -251014 133286 -300530 20663 236786 -300477 -227694 40339 -104222
9490 -147417 -82055 -381646 31531 -58314 -11251 -120967 49108 -111820 -172780 -559196 63321
9478 -281471 94926 -160219 -153098 -363019 -148870 -73777 -20105 158049 -314257 -29613 392651
9466 -201144 -132340 57176 -299778 -82715 -169404 -88956 39850 -68274 93904 -28636 176558
9454 -263378 -58351 -41698 253904 -24824 -157547 98478 -218434 -177237 -113941 -260332 56596
9442 -292970 -79899 -27526 128677 234156 -50645 -106558 -5515 -64586 -214031 -204326 80425
9430 82439 374894 158916 265886 -15267 -188874 -400684 -72456 23523 -72863 147908 -3362
9418 289497 -1078 226832 49968 -122709 -9375 -94686 43326 -441085 -283736 -26165 -345640
$$ packed form
9501c60895A20326b51014A33286c00530B0663K16123c00477P2783D0339a04222
9490a47417O5362k99591C1531e8314a1251j09716D9108a11820o0960l86416F3321
9478b81471I4926a60219P121k09921a48870g3777b0105A58049c14257b9613C92651
9466b01144O8804E7176b99778h2715q6689Q0448C9850f8274I3904b8636A76558
9454b63378e8351J6653B53904b4824j32723I8478b18434M1197O3296j46391E6596
9442b92970g9899b7526A28677J05479e0645n5913e515n9071j49445R705H0425
9430H2439K92455A58916J06970a5267j73607k11810g2456B3523g2863A47908c362
9418B89497a078B26832D9968a22709i375q5311D3326d41085J57349b6165l19475
$$ plain form
9407 -345640 -39153 -272379 90804 154405 155349 121865 -185691 29066 -223129 -13003 -163728
9396 -163728 -41035 65541 -136178 180522 -30723 73190 -88611 63544 -414655 -367430 69916
9384 -382138 -50432 -66369 41421 101100 -90625 165146 -53102 -358929 -145374 -161326 -159875
9373 -159875 155611 7523 -363642 -321635 -28030 -245989 -86330 -161270 -117335 165348 -535435
9361 -233323 203871 -252755 40636 245613 116140 165791 -105424 -45353 163166 -240967
9350 -189818 54336 -281694 144007 -62298 -208538 117034 -96643 145713 -111906 -228023
9340 -228023 230155 54978 -132037 19158 -259045 365386 -199965 -317505 -98240 -21420
9329 -217813 59358 29011 -319030 -50188 -227041 -190670 -60401 -297315 -83141 15586 34831
$$ packed form
9407c45640c9153k33226I0804O3601R44l3484a85691B9066b23129a3003j50725
9396a63728d1035F5541a36178A80522c0723G3190h8611F3544d14655M7225F9916
9384c82138e0432j5937D1421N9679i0625A65146e3102l05827a45374j5952J451
9373a59875A55611G523c63642M2007b8030k17959h6330p4940M3935A65348e35435
9361b33323B03871b52755D0636K04977A16140M9651a05424d5353A63166b40967
9350a89818E4336b81694A44007f2298j46240A17034i6643A45713a11906j16117
9340b28023B30155E4978a32037A9158b59045C65386a99965j17540i8240b1420
9329b17813E9358B9011c19030e0188j76853L6371f0401k36914h3141A5586J9245
$$ plain form
9318 34831 -139607 -227669 70141 77390 37885 -79869 15095 101476 -24189 -158972 -263577
9307 -263577 60034 175734 206675 131056 -282399 118345 54868 -188694 174787 -61862 -108512
9296 -108512 223602 -530107 -7016 -22914 -188001 -283817 66723 -183841 227323 88070 -182341
9284 16317 -274954 -205535 215458 -192998 55511 6591 -16796 351818 -229281 56035 -98497
9272 150827 -3028 -533275 63748 -211344 -330645 119046 250173 -42051 222927 -120661
9261 50714 207289 -109043 99456 154100 25616 -130366 -263747 -69709 27309 93599 -79760
9249 -203513 -225926 -114086 56140 308763 -182405 -98003 -9808 -38554 -194420 -114562 -147466
9238 -147466 -101006 217405 120751 51728 11127 -458615 -62939 166886 -14660 172276 -159839
$$ packed form
9318C4831a39607q8062G0141P249C7885g9869A5095Q6381b4189j34783j04605
9307b63577F0034J15700L0941p5619b82399A18345E4868a88694A74787f1862m6650
9296a08512B23602e30107g016j5898j65087r5816F6723a83841B27323H8070a82341
9284A6317b74954O9419B15458a92998E5511F591a6796C51818b29281E6035i8497
9272A50827c028n30247F3748b11344j19301A19046J31127d2051B22927a20661
9261E0714J56575a09043I9456N4644B5616a30366j33381f9709B7309O6290g9760
9249b03513k2413J11840E6140K52623a82405Q4402i808k8746j55866P9858l2904
9238a47466M6460B17405r6654E1728A1127d58615f2939A66886a4660A72276a59839
$$ plain form
9226 -312844 -111198 -3589 -173043 53470 233404 96086 -249083 -181597 -74158 -184306 -7278
9214 151793 -212750 -263019 -153954 86411 75333 -249124 -19701 -65088 -362031 142254 -135859
9202 -13217 106515 -382772 -408507 -97399 62209 -302102 -31386 -296019 -5129 209575 -118589
9190 -140266 139107 -175325 -322037 -246558 -80305 -267283 -186155 29439 -211962 266212
9179 -81069 -55684 44293 -196407 75145 -141837 -74563 -250886 -435025 -8910 207743 27539
9167 57353 73697 -251645 25373 -43129 -73497 34131 -26292 -45752 -300868 75965 -148313
9155 57140 -153880 103831 64456 75070 20178 -124392 -404348 -28764 -128385 -13065 130760
9143 66814 -108198 -406585 -145608 -424401 15509 -6907 -337805 162248 -12260 143956 20166
$$ packed form
9226c12844a11198c589j69454E3470J79934I6086b49083O7486g4158j10148g278
9214A51793b12750n0269J09065H6411j1078b49124a9701m5387k96943A42254a35859
9202a3217A06515c82772k5735i7399F2209c02102c1386k64633e129B09575a18589
9190a40266A39107a75325j46712P5479h0305j86978Q1128B9439b11962B66212
9179h1069K5385D4293a96407G5145a41837O7274j76323j84139h910B07743B7539
9167E7353J6344b51645B5373d3129l0368C4131b6292j9460k55116G5965a48313
9155E7140a53880A03831l9375J0614B0178a24392k79956b8764r9621a3065A30760
9143F6814a08198k98387a45608k78793A5509f907l30898A62248a2260A43956B0166
$$ plain form
9131 222744 257635 -263721 24435 -366707 -394034 -162991 -49803 313507 291184 164023 -162134
9119 204848 -383712 -135090 195950 -299243 -188453 -243676 24018 -48194 -215686 18506
9108 -356424 -21445 -408742 -249376 -156632 -48156 40137 -18366 -360289 -359130 129424 -116230
9096 26351 304240 -224328 -187719 389598 -242038 216290 -146775 -20491 315373 -228848
9085 93101 145017 -289695 65357 13286 -114153 -51484 -84043 115099 -69596 -207048 70885
9073 -181889 6470 -67357 -408176 -73224 -52039 48777 -43283 58640 -142132 -299943 -243698
9062 -243698 -188785 -117146 101893 -62668 5720 -84037 -237693 166033 -23415 -45910 -2155
9050 -235875 66635 202358 -151524 158835 85375 -11890 -72185 -97636 -261880 -13397 -176092
$$ packed form
9131B22744L4891b63721B4435c66707k7327a62991d9803C13507k2323j27161a62134
9119B04848c83712a35090A95950b99243J10790n5223B4018d8194j67492A8506
9108c56424b1445l87297J59366R2744d8156D0137a8366l41923J159A29424a16230
9096B6351K77889b24328L6609C89598b42038B16290a46775b0491C15373b28848
9085I3101N1916b89695F5357A3286a14153e1484l2559A15099f9596j37452G0885
9073a81889F470f7357l40819g3224K1185D8777d3283E8640a42132j57811N6245
9062b43698N4913P1639A01893f2668E720h4037j53656A66033b3415k2495b155
9050b35875F6635J35723a51524A58835p3460a1890o0295k5451j64244a3397j62695
$$ plain form
9039 -176092 -41083 10777 44277 -345473 -200714 -12347 255131 4728 -101451 -18344 22396
9027 37754 -114742 -278994 186760 -27283 263764 -293026 -196290 113889 -104673 124131
9016 120783 -31027 260643 -285834 -149651 -335045 88397 46990 -160998 3366 -289361 -149738
9005 -149738 -231653 80241 -142453 -202872 -280524 -76367 -168262 -98243 159152 119264 74389
8994 74389 110546 -112316 -217656 -222607 79557 -227607 -54891 15448 114141 35424 -41619
8982 -15838 251061 33084 21744 -44275 -118922 -57356 -211995 -417476 -77808 -95856 -265563
8971 -265563 -139162 -316459 164213 -23892 7207 94087 -112587 31302 -152612 145157 -431893
8959 -337270 -199645 208659 81999 -83545 105676 64950 -75262 128025 -186566 -192051 -32015
$$ packed form
9039a76092d1083A0777L3500c45473J44759a2347B55131D728a01451a8344B2396
9027C7754a14742j64252A86760b7283B63764b93026R6736A13889a04673A24131
9016A20783c1027B60643b85834J36183j85394H8397m1407a60998C366b89361J39623
9005a49738q1915H0241a42453o0419p7652g6367r1895P0019A59152l9888m4875
8994G4389L6157a12316j05340m951G9557b27607e4891A5448R8693C5424d1619
8982a5838B51061C3084j1340d4275p4647e7356j54639k05481g7808j8048j69707
8971b65563J26401j77297A64213b3892G207Q6880a12587C1302a52612A45157d31893
8959c37270J37625B08659H1999h3545A05676m0726g5262A28025a86566n485c2015
$$ plain form
8947 -236081 163158 6670 -103357 -88601 -193130 -135285 408161 -140681 -14265 179693 -189624
8935 -221520 64629 159768 302473 238541 28039 -413588 176309 413484 277642 276758 1251613
8924 1251613 3212856 5492931 12637702 9023353 3235746 1054039 445048 339781 -107756
8914 162179 -322374 162926 122610 147361 -243914 392296 362199 126592 315849 -309270
8903 -360588 -113650 -44281 -31841 -333757 -35743 -140636 -206413 -111558 -226438 -14264 -303243
$$ packed form
8947b36081A63158F670a03357J4756j04529N7845D08161a40681a4265A79693a89624
8935b21520F4629R5139J42705o3932B8039d13588A76309K37175j35842q84R74855
8924A251613J961243K280075P144771l614349C235746A054039D45048j05267a07756
8914A62179c22374A62926m0316K4751b43914C92296l0097A26592J89257c09270
8903c60588a13650d4281J2440l01916c5743j04893o5777R4855j14880a4264k88979
$$ [...]
##END NTUPLES=NMR SPECTRUM
##END=
