##TITLE=AC1545_ROEFFECT0013_8268682_Mjor2CYA9B
##JCAMPDX= 6.0         $$ Bruker NMR JCAMP-DX V2.0
##DATA TYPE= NMR SPECTRUM
##DATA CLASS= NTUPLES
##ORIGIN= BRUKER
##OWNER= Administrator
$$ 1.72 TOPSPIN		Version 2.1
$$ 2013-10-11 21:05:44.124 -0700  Administrator@X
$$ Compression mode = diff/dup
##.OBSERVE FREQUENCY= 400.02188249412
##.OBSERVE NUCLEUS= ^1H
##.ACQUISITION MODE= SIMULTANEOUS (DQD)
##.ACQUISITION SCHEME= undefined
##.AVERAGES= 64
##.DIGITISER RES= 22
##SPECTROMETER/DATA SYSTEM= spect
##.PULSE SEQUENCE= noesygpps1d.comp
##.SOLVENT NAME= COFFEE_meoh
##.SHIFT REFERENCE= INTERNAL, COFFEE_meoh, 1, 14.96085
##AUDIT TRAIL= $$ (NUMBER, WHEN, WHO, WHERE, PROCESS, VERSION, WHAT)
$$ ##TITLE= Audit trail, TOPSPIN		Version 2.1
$$ ##JCAMPDX= 5.01
$$ ##ORIGIN= Bruker BioSpin GmbH
$$ ##OWNER= Administrator
$$ $$ E:\/data/COFFEE/nmr/AC1545_ROEFFECT0013_8268682_Mjor2CYA9B/12/pdata/1/auditp.txt
$$ ##AUDIT TRAIL=  $$ (NUMBER, WHEN, WHO, WHERE, PROCESS, VERSION, WHAT)
(   1,<2013-10-11 21:05:39.187 -0700>,<Administrator>,<X>,<go>,<TOPSPIN 2.1>,
      <created by zg
	started at 2013-10-11 20:54:09.668 -0700,
	POWCHK enabled, PULCHK disabled,
       configuration hash MD5:
       C8 4E 4E 5D D3 5C D8 9E 9F 52 82 E0 59 8A DE 15
       data hash MD5: 64K
       6B 6F E3 0F C3 08 A7 BE D7 91 1C F6 83 05 F8 AE>)
(   2,<2013-10-11 21:05:42.171 -0700>,<Administrator>,<X>,<proc1d>,<TOPSPIN 2.1>,
      <Start of raw data processing
       efp LB = 0.3 FT_mod = 6 PKNL = 1 PHC0 = 0 PHC1 = 0 SI = 128K 
       data hash MD5: 128K
       AB 99 C7 3D B0 80 ED 27 F0 50 11 E5 60 02 30 5C>)
(   3,<2013-10-11 21:05:43.187 -0700>,<Administrator>,<X>,<proc1d>,<TOPSPIN 2.1>,
      <pk PHC0 = -82.89185 PHC1 = 0 
       data hash MD5: 128K
       2D 47 5D 47 7D FC 0A E6 25 77 E2 6B FA 3E 1C 62>)
(   4,<2013-10-11 21:05:43.546 -0700>,<Administrator>,<X>,<proc1d>,<TOPSPIN 2.1>,
      <abs ABSG = 1 
       data hash MD5: 128K
       71 1B EA D6 14 64 1C D4 D4 33 DE E4 A3 1B DA CE>)
(   5,<2013-10-11 21:05:43.687 -0700>,<Administrator>,<X>,<proc1d>,<TOPSPIN 2.1>,
      <abs ABSG = 2 
       data hash MD5: 128K
       8D B9 4C 35 14 84 21 89 4C 46 36 78 00 3B 88 C0>)
(   6,<2013-10-11 21:05:43.765 -0700>,<Administrator>,<X>,<proc1d>,<TOPSPIN 2.1>,
      <abs ABSG = 3 
       data hash MD5: 128K
       0D 04 0F E7 91 F0 4C 20 6B 08 56 13 3C D7 18 F4>)
(   7,<2013-10-11 21:05:43.859 -0700>,<Administrator>,<X>,<proc1d>,<TOPSPIN 2.1>,
      <abs ABSG = 4 
       data hash MD5: 128K
       38 8C 0B B9 AC FB 7D 4F 66 AC 68 C4 08 2E F1 DB>)
(   8,<2013-10-11 21:05:43.968 -0700>,<Administrator>,<X>,<proc1d>,<TOPSPIN 2.1>,
      <abs ABSG = 5 
       data hash MD5: 128K
       CC 1D 1F B6 01 66 42 50 B3 1F 86 60 03 0E 75 BF>)
$$ ##END=
$$ 
$$ $$ hash MD5
$$ $$ 2E D3 5C 43 D3 B5 C9 59 91 FB A6 75 7A F8 0F 0A
##$RELAX= 
##$RELAX= 
##$RELAX= 
##$RELAX= 
##$RELAX= 
##$RELAX= 
##$RELAX= 
##$RELAX= 
$$ Bruker specific parameters
$$ --------------------------
##$DU= <E:\>
##$EXPNO= 12
$$ [...]
##$TP07= 0
##$TPNAME0= <>
##$TPNAME1= <>
##$TPNAME2= <>
##$TPNAME3= <>
##$TPNAME4= <>
##$TPNAME5= <>
##$TPNAME6= <>
##$TPNAME7= <>
##$TPOAL= (0..7)
0.5 0.5 0.5 0.5 0.5 0.5 0.5 0.5
##$TPOFFS= (0..7)
0 0 0 0 0 0 0 0
##$TUNHIN= 0
##$TUNHOUT= 0
##$TUNXOUT= 0
##$USERA1= <user>
##$USERA2= <user>
##$USERA3= <user>
##$USERA4= <user>
##$USERA5= <user>
##$V9= 5
##$VALIST= <valist>
##$VCLIST= <CCCCCCCCCCCCCCC>
##$VD= 0
##$VDLIST= <DDDDDDDDDDDDDDD>
##$VPLIST= <PPPPPPPPPPPPPPP>
##$VTLIST= <TTTTTTTTTTTTTTT>
##$WBST= 1024
##$WBSW= 4
##$XGAIN= (0..3)
0 0 0 0
##$XL= 0
##$YL= 0
##$YMAX_a= 6696459
##$YMIN_a= -13512483
##$ZGOPTNS= <>
##$ZL1= 120
##$ZL2= 120
##$ZL3= 120
##$ZL4= 120
##$ABSF1= 14.96085
##$ABSF2= -5.597332
##$ABSG= 5
##$ABSL= 3
##$ALPHA= 0
##$AQORDER= 0
##$ASSFAC= 0
##$ASSFACI= 0
##$ASSFACX= 0
##$ASSWID= 0
##$AUNMP= <proc_prof1d_extract.lims>
##$AXLEFT= 0
##$AXNAME= <>
##$AXNUC= <1H>
##$AXRIGHT= 0
##$AXTYPE= 0
##$AXUNIT= <>
##$AZFE= 0.1
##$AZFW= 0.1
##$BCFW= 0
##$BC_mod= 0
##$BYTORDP= 0
##$COROFFS= 0
##$CY= 15
##$DATMOD= 1
##$DC= 0
##$DFILT= <>
##$DTYPP= 0
##$F1P= 0
##$F2P= 0
##$FCOR= 0.5
##$FTSIZE= 131072
##$FT_mod= 6
##$GAMMA= 0
##$GB= 0
##$INTBC= 1
##$INTSCL= 1
##$ISEN= 128
##$LB= 0.3
##$LEV0= 0
##$LPBIN= 0
##$MAXI= 10000
##$MC2= 0
##$MEAN= 0
##$ME_mod= 0
##$MI= 0
##$NCOEF= 0
##$NC_proc= -2
##$NLEV= 6
##$NOISF1= 0
##$NOISF2= 0
##$NSP= 0
##$NTH_PI= 0
##$NZP= 0
##$OFFSET= 14.96085
##$PC= 1
##$PHC0= -82.89185
##$PHC1= 0
##$PH_mod= 1
##$PKNL= yes
##$PPARMOD= 0
##$PPDIAG= 0
##$PPIPTYP= 0
##$PPMPNUM= 2147483647
##$PPRESOL= 1
##$PSCAL= 4
##$PSIGN= 0
##$PYNMP= <proc.py>
##$REVERSE= no
##$SF= 400.020009697515
##$SI= 131072
##$SIGF1= 0
##$SIGF2= 0
##$SINO= 400
##$SIOLD= 131072
##$SPECTYP= <>
##$SREGLST= <1H.CDCl3>
##$SSB= 0
##$STSI= 131072
##$STSR= 0
##$SW_p= 8223.68421052631
##$SYMM= 0
##$S_DEV= 0
##$TDeff= 65536
##$TDoff= 0
##$TI= <>
##$TILT= no
##$TM1= 0
##$TM2= 0
##$TOPLEV= 0
##$USERP1= <user>
##$USERP2= <user>
##$USERP3= <user>
##$USERP4= <user>
##$USERP5= <user>
##$WDW= 1
##$XDIM= 131072
##$YMAX_p= 314511975
##$YMIN_p= -11678
##$CURPLOT= <Network HP LaserJet P1505>
##$CURPRIN= <$Network HP LaserJet P1505>
##$DFORMAT= <normdp>
##$LAYOUT= <+/1D_H.xwp>
##$LFORMAT= <normlp>
##$PFORMAT= <normpl>
##$SURQMSG= 1
$$ End of Bruker specific parameters
$$ ---------------------------------
##NTUPLES= NMR SPECTRUM
##VAR_NAME=  FREQUENCY,     SPECTRUM/REAL,   SPECTRUM/IMAG
##SYMBOL=    X,             R,               I
##VAR_TYPE=  INDEPENDENT,   DEPENDENT,       DEPENDENT
##VAR_FORM=  AFFN,          ASDF,            ASDF
##VAR_DIM=   131072,        131072,          131072
##UNITS=     HZ,            ARBITRARY UNITS, ARBITRARY UNITS
##FACTOR=    0.0627417313425164, 1,          1
##FIRST=     8223.62146879497, -456,         -68072
##LAST=      0,             916,             -68690
##MIN=       0,             -11678,          0
##MAX=       8223.62146879497, 314511975,    0
$$ Real data points
##PAGE= N=1
##DATA TABLE= (X++(R..R)), XYDATA
$$ [...]
67618 77686 76039 74364 73409 73186 73538 74368 75236 75419 74696 73623 72854 72625 73084 74495 76679 78663 79459
67601 79459 79002 77950 76803 75624 74347 72856 70957 68786 67121 66711 67286 67800 67627 66990 66194 65140
67585 65140 63833 62700 62000 61424 60777 60605 61576 63450 65193 65975 65655 64475 62880 61562 61063 61207 61369
67568 61369 61417 61906 63118 64434 65054 64955 64635 64171 63159 61621 60370 60131 60653 61060 60922 60628 60771 61520
67550 61520 62669 63954 65102 65753 65641 64852 63785 62833 62189 61882 61873 62080 62452 63034 63851 64702 65188 65014
67532 65014 64302 63580 63416 63947 64701 65014 64684 64114 63737 63525 63251 62989 62952 62896 62172 60526 58551 57112 56561
67513 56561 56658 57016 57403 57723 57998 58329 58753 59171 59472 59625 59591 59334 59030 59060 59609 60362 60788 60633 60070 59464
67493 59464 59174 59391 59967 60456 60531 60283 59995 59751 59445 59099 58927 59128 59727 60530 61110 60987 60057 58765 57667
67474 57667 56871 56062 54974 53660 52440 51832 52338 53947 55903 57325 58077 58733 59690 60674 61186 61112 60737
67457 60737 60395 60259 60277 60223 59937 59574 59457 59705 60158 60646 61038 61064 60451 59316 58101 57034 55938 54728
67439 54728 53697 53143 53019 53222 53878 55043 56407 57593 58491 58997 58811 57986 57402 57976 59440 60543 60564
67422 60564 59995 59546 59160 58552 58219 59095 61239 63491 64623 64407 63430 62275 61240 60531 60241 60151 59858 59201
67404 59201 58324 57344 56244 55151 54399 54081 53782 53032 51937 51108 51034 51674 52566 53098 52777 51620 50319 49759
67386 49759 50236 51309 52380 53169 53652 53904 54188 54854 55851 56546 56332 55351 54354 53867 53707 53401 52877 52620
67368 52620 53119 54283 55515 56370 56912 57327 57450 57063 56497 56404 56847 57143 56838 56384 56466 57062 57605 57860 58143
67349 58143 58762 59674 60657 61408 61508 60708 59372 58269 57848 57925 58170 58543 59146 59895 60557 60949 60977 60595 59900
67330 59900 59215 58917 59120 59536 59700 59441 59101 59119 59367 59219 58440 57653 57574 58012 58081 57353 56291 55563 55359 55411
67310 55411 55280 54547 53191 51932 51764 52892 54529 55963 57396 59353 61646 63427 64168 64198 64260 64811 65706
67293 65706 66341 66133 65019 63423 61751 60164 58923 58551 59269 60494 61294 61241 60547 59553 58494 57642 57256
67276 57256 57361 57871 58851 60286 61665 62339 62404 62750 63950 65480 66360 66325 66009 66048 66342 66266 65459 64319 63697
67257 63697 64078 65099 65898 65891 65131 64072 63260 63161 63845 64738 64985 64306 63288 62659 62511 62472 62412 62620 63392 64755
67237 64755 66575 68622 70447 71465 71402 70604 69765 69383 69503 69890 70268 70356 69838 68572 66871 65365 64484
67220 64484 64188 64375 65295 67172 69491 71170 71636 71376 71190 71222 71106 70763 70551 70612 70581 70127 69471 69098 69099 69072
67200 69072 68694 68259 68441 69502 70867 71680 71747 71640 71794 71879 71375 70444 69770 69666 69866 70173 70711 71371 71575
67181 71575 71013 70240 70041 70439 70814 70899 71126 71958 73311 74842 76394 77953 79378 80427 80940 80804 79973
67164 79973 78727 77741 77509 77754 77726 77183 76771 77257 78596 80005 80802 80923 80631 80032 79115 78142 77757 78493
67146 78493 80112 81586 81987 81516 81434 82781 85266 87680 89233 90134 90834 91251 91067 90428 89848 89520 89173
67129 89173 88694 88482 88987 90088 91118 91408 90740 89450 88236 87721 88005 88682 89366 90111 91206 92666 94118
67112 94118 95167 95687 95782 95656 95614 95950 96647 97311 97626 97882 98783 100614 102822 104580 105593 106109 106293 106087
67094 106087 105728 105916 107082 108705 109774 109878 109507 109294 109258 108929 107993 106741 105937 106268 107757 109709 111384
67077 111384 112667 113926 115345 116736 117964 119119 120177 120931 121496 122525 124487 126917 128789 129627 129938
67062 129938 130585 132013 134090 136419 138590 140235 141027 140858 140151 139893 140997 143404 146040 147923 149152
67047 149152 150492 152208 153774 154755 155499 156662 158380 160238 161922 163535 165237 166854 168082 168953 169880
67032 169880 171157 172582 173715 174463 175270 176732 179087 182066 185078 187614 189634 191599 193958 196627 199168
67017 199168 201387 203407 205155 206319 207022 208038 209936 212385 214792 217296 220515 224466 228434 231942
67003 231942 235223 238566 241749 244400 246488 248168 249554 250989 253208 256784 261486 266471 271056 275089
66989 275089 278720 282117 285455 288976 292931 297510 302744 308357 313760 318377 322108 325455 329141 333500
66975 333500 338262 343016 347865 353397 359924 366994 373930 380645 387637 395261 403364 411572 419582 427200
66961 427200 434446 441655 449145 456786 464250 471649 479447 487736 496160 504658 513647 523209 532753 541960
66947 541960 551546 562486 574823 587836 601079 614657 628613 642690 656712 670740 684802 698876
66935 698876 713136 727872 743175 759063 775806 793698 812523 831730 851174 871239 892098
66924 892098 913350 934664 956439 979478 1004146 1030097 1056756 1083860 1111532 1139971 1169192
66913 1169192 1199066 1229560 1260738 1292557 1324889 1357865 1391840 1426796 1462184 1497732 1534067
66902 1534067 1571931 1611060 1650510 1690028 1730269 1771539 1813140 1854394 1895681 1937854 1980950
66891 1980950 2024058 2066243 2107161 2146922 2185846 2224329 2262594 2300449 2337438 2373149 2407248
66880 2407248 2439375 2469281 2496951 2522323 2544977 2564389 2580531 2593955 2605242 2614478 2621252 2624997
66868 2624997 2625338 2622296 2616213 2607412 2595914 2581510 2563991 2543218 2519165 2492181 2463153 2433034
66856 2433034 2402059 2369642 2335240 2299181 2262402 2225410 2187760 2148718 2108224 2066981 2025589
66845 2025589 1983900 1941427 1898166 1854769 1811949 1770022 1729006 1688804 1649064 1609122 1568518
66834 1568518 1527607 1487503 1449270 1413151 1378522 1344529 1310754 1277389 1244857 1213398 1183007
66823 1183007 1153635 1125229 1097613 1070535 1043882 1017723 992115 967055 942682 919329 897136
66812 897136 875758 854637 833609 813050 793433 774870 757133 740006 723458 707476 691902
66801 691902 676578 661592 647181 633352 619824 606480 593681 581908 571175 560971 550714
66790 550714 540098 529149 518209 507817 498297 489459 480888 472385 463889 455128 445861 436446 427658
66777 427658 419784 412310 404672 396949 389602 382907 376880 371402 366106 360438 354154 347565 341053 334641
66763 334641 328285 322211 316531 310837 304710 298520 293239 289459 286920 284955 283003 280694 277846 274500
66749 274500 270748 266535 261804 256796 251925 247420 243320 239696 236547 233587 230559 227738 225700 224492
66735 224492 223399 221692 219318 216717 214258 212024 209936 207870 205740 203546 201302 198969 196614 194487
66721 194487 192677 190783 188349 185600 183295 181704 180213 178178 175708 173215 170591 167429 163943 161113
66707 161113 159729 159567 159724 159539 159019 158487 158073 157680 157296 157042 156768 155829 153619 150384 147161 144733 142887
66690 142887 140885 138455 136040 134205 133156 132775 132785 132707 131941 130244 128147 126700 126614 127597 128601 128782 128227
66673 128227 127688 127604 127521 126492 124023 120533 116922 113850 111429 109533 108222 107773 108269 109268 110021 110136 109929
66656 109929 109996 110432 110667 110161 109091 108080 107315 106326 104766 103038 101833 101309 101136 101185 101606 102179 102141 100941
66638 100941 98834 96540 94616 93339 92825 92892 93102 93219 93417 93751 93804 93255 92507 92178 92193 91938 91226 90537
66620 90537 90242 90131 89814 89195 88425 87708 87236 86988 86576 85658 84476 83649 83422 83562 83953 84727 85718 86374 86441
66601 86441 86227 85970 85486 84746 84300 84591 85209 85211 84032 81790 79078 76784 75728 75972 76646 76889 76786 76963
66583 76963 77462 77592 76900 75815 75133 75147 75439 75414 74921 74397 74395 74997 75781 76300 76400 76067 75272 74097 72763
66564 72763 71405 70122 69307 69511 70719 72104 72819 72806 72585 72544 72658 72637 72078 70822 69389 68691 69044 69837
66546 69837 70457 71027 71836 72606 72943 73061 73357 73644 73488 73089 73056 73464 73799 73670 72981 71679 70075 69131 69524
66527 69524 70553 70894 70364 69929 70050 70197 70164 70609 71782 72816 72950 72564 72284 71864 70770 69278 68194
66510 68194 67881 68189 68909 69679 69870 69236 68369 67962 67979 68089 68450 69409 70781 72040 72902 73130 72254 70232
66492 70232 68017 66614 65871 65009 64053 63774 64354 65159 65856 66717 67591 67595 66306 64555 63551 63692 64506 65292
66474 65292 65527 65168 64831 65225 66202 66824 66579 66012 65909 66367 66981 67381 67283 66540 65566 65195 65637 65997 65368
66455 65368 64040 63091 63053 63562 64119 64624 65135 65538 65566 64960 63742 62432 61766 61927 62293 62219 61785 61507 61611
66436 61611 61998 62595 63260 63604 63433 63234 63664 64669 65603 66144 66473 66592 66103 64841 63288 62193 62075 63050
66418 63050 64675 65994 66326 66139 66584 67987 69353 69623 68878 67987 67645 68112 69319 70630 70977 69996 68804
66401 68804 68898 70322 71633 71707 70919 70317 70228 70100 69346 67891 66074 64368 63188 62660 62519 62381 62150 62066
66383 62066 62299 62591 62418 61601 60670 60496 61496 63305 65211 66720 67580 67612 66886 65962 65506 65569 65529 64810 63456
66364 63456 61943 60769 60306 60728 61797 62950 63792 64387 64945 65481 65997 66646 67379 67671 67063 65917 65173
66347 65173 65353 66202 67250 68288 69168 69641 69675 69607 69733 70010 70351 70851 71449 71742 71525 71256 71494 72093 72385
66328 72385 72042 71266 70276 69200 68437 68471 69163 69811 70120 70549 71395 72137 72193 71797 71601 71790 72212 72974 74097
66309 74097 74812 74179 72549 71546 72160 73566 74308 74131 73996 74644 75819 76872 77540 77959 78263 78417 78350 78152
66291 78152 78113 78425 78774 78475 77275 75874 75297 75802 76747 77509 78136 78875 79517 79612 79238 79059 79484 80049 79919
66272 79919 78845 77370 76144 75372 75033 75230 75978 76855 77334 77460 77786 78577 79450 79977 80203 80292 80043 79197
66254 79197 78020 77103 76669 76495 76504 76929 77817 78776 79470 80036 80786 81709 82539 83078 83201 82729 81678 80603 80334
66235 80334 81153 82403 83074 82712 81698 80718 80135 79866 79678 79439 79102 78564 77677 76449 75211 74485 74523 75006
66217 75006 75348 75384 75553 76228 77068 77381 77046 76671 76757 77072 77089 76711 76298 76192 76529 77335 78473 79549 80181
66198 80181 80345 80289 80176 80053 80039 80285 80755 81265 81692 81977 82050 81974 82045 82447 82914 83038 82830 82698 83003 83943 85676
66177 85676 88079 90454 91957 92417 92348 92232 92210 92369 92774 93160 93163 92934 92913 92961 92415 91185 90012 89343 88759
66158 88759 87986 87595 87985 88397 87913 86987 86970 88328 90188 91551 92140 92094 91682 91382 91504 91611 90975 89712
66140 89712 88768 88676 88992 89206 89436 89910 90458 90991 91881 93322 94723 95352 95288 95212 95439 95664 95562 95160 94626
66121 94626 94036 93413 92812 92365 92342 92963 93971 94658 94630 94415 94909 96272 97683 98240 97819 97019 96560 96825 97805
66102 97805 99204 100603 101607 101950 101598 100813 100066 99793 100180 101072 101992 102334 101840 100986 100661 101279 102322 102898
66084 102898 102553 101417 99818 98119 96825 96445 97082 98345 99693 100718 101084 100541 99252 97974 97627 98558
66068 98558 100275 101927 102983 103458 103671 103928 104370 104891 105106 104593 103351 101953 101050 100738 100588 100300 100086
66051 100086 100342 101126 102121 103000 103634 103951 103777 103021 101940 101020 100441 99808 98715 97489 96951 97301 97741 97571
66033 97571 97228 97664 98948 100204 100832 101024 100956 100365 99356 98870 99619 100982 101703 101475 101124 101323 101855 102224
66015 102224 102395 102616 102962 103398 104005 104819 105599 106004 106013 105998 106410 107398 108676 109765 110491 111235 112512 114263
65997 114263 115749 116341 116252 116305 117065 118388 119828 121155 122367 123412 124183 124743 125272 125703 125704 125170 124533 124325
65979 124325 124620 125116 125667 126369 127199 127928 128419 128673 128500 127572 125996 124513 123788 123674 123440 122596 121278 119921
65961 119921 118765 117727 116624 115600 115244 116116 118110 120519 122757 124788 126796 128870 131165 133934 137087
65946 137087 140058 142476 144678 147206 150092 153108 156428 160441 164938 169007 171852 173418 174228 174884 175635
65931 175635 176136 175741 174405 173160 173251 174830 176947 178764 180252 181654 182865 183668 184211 184950 186287 188328
65915 188328 190764 192963 194496 195658 197148 199163 201181 202738 204004 205407 207018 208521 209526 209715
65901 209715 209030 207936 207245 207419 208210 209096 209837 210483 211144 211943 212861 213414 212825 210834 208139 205745 204017
65884 204017 202564 200835 198606 196121 193952 192478 191318 189578 186966 184346 182841 182630 183029 183493 184040
65869 184040 184812 185758 186772 187738 188438 188714 188699 188530 187965 186702 185072 183809 183043 182046 180259 178082 176281
65852 176281 174976 173701 172250 170938 170030 169373 168698 167922 167005 165767 164154 162550 161521 161238 161339 161416
65836 161416 161449 161678 162213 162909 163555 164014 164279 164520 165061 166111 167465 168602 169136 169189 169362 170396 172652 175732
65818 175732 178705 180950 182714 184626 186848 189087 191293 193747 196326 198345 199499 200477 202126 204313
65804 204313 206162 207223 207931 208987 210750 213200 216047 218819 221224 223480 225960 228493 230425 231433
65790 231433 231908 232385 232975 233527 234048 234706 235667 237106 239198 241834 244592 247225 250053 253593 257902 262480
65774 262480 266733 270347 273365 276248 279744 284312 289570 294581 298783 302282 305151 306933 307270 306726 306424
65759 306424 306978 308316 310562 314387 320175 327446 335623 344956 356096 369088 383481 399270 416852
65746 416852 436019 455843 475878 496752 519057 542270 565320 587669 609090 628742 645349
65735 645349 658354 668176 675138 678623 677493 671077 659664 644283 626065 605562 582744 557863
65723 557863 532151 507171 483497 460448 437242 414077 391996 372064 354729 339599 325718
65712 325718 312391 299862 288858 279475 270981 262875 255626 250043 246280 243822 242072 240547 238761
65699 238761 236408 233649 230942 228642 226993 226244 226441 227214 228116 229096 230278 231420 232023 232076 232312 233579
65683 233579 236234 240253 245634 252404 260379 269161 278477 288443 299516 312132 326377 342071 359220
65670 359220 378266 399668 423282 448412 474565 501921 530887 561341 592546 623692 654239
65659 654239 683693 711384 736692 759364 779332 796325 809962 820255 827699 832747 835538 836373
65647 836373 836046 835232 833742 830942 826884 822415 817972 812843 805901 796642 785083 771046 754123 734174
65633 734174 711373 685863 657846 627954 597041 565581 533786 502341 472409 444630 418620
65622 418620 393784 370221 348450 328732 311193 296269 284240 274425 265544 257051 249429 242982
65610 242982 237031 230872 225017 220735 218462 217322 216285 215237 214636 214507 214225 213216 211648 210321 209925
65595 209925 210435 211315 212288 213676 215840 218607 221623 225024 229180 233863 238333 242412 246881 252463 259014
65580 259014 266185 274438 284777 297680 312818 329642 347800 367208 388187 411369 436859 463650
65568 463650 490466 517063 543949 570847 596271 618869 638336 654498 666250 672241 672365 667882
65556 667882 660005 648805 633560 613911 590577 565052 538624 511679 484027 455784 427696 400697
65544 400697 375495 352563 332030 313514 296543 281321 268615 258655 250645 243633 237376 232046
65532 232046 227698 224499 222880 222734 222882 222031 220092 217915 216043 214409 212994 211926 210951 209643 208188
65517 208188 207192 206607 205657 204044 202461 201547 201034 200418 199830 199699 199990 200369 200824 201573 202588 203676 204831
65500 204831 206045 206948 207150 206905 206938 207557 208387 209060 209764 210880 212395 214035 215896 218569 222483 227256
65484 227256 231895 235648 238568 241275 244357 247993 251854 255131 256906 256812 255263 252855 249793 246172 242430
65469 242430 238902 235086 230171 224407 219149 215272 212247 209192 206093 203349 200751 197864 195103 193471
65455 193471 193183 193382 193368 193340 193625 193829 193314 192222 191480 191899 193482 195542 197258 198287 199111 200753 203884
65438 203884 208135 212407 215861 218492 220750 222821 224487 225644 226653 227966 229530 230847 231662 232299 233137
65423 233137 233979 234214 233513 232189 230989 230675 231652 233724 236205 238490 240461 242240 243729 244754 245496 246315
65407 246315 247081 247136 246154 244680 243538 242905 242251 241098 239550 238109 237126 236479 235744 234749 234025 234493 236511
65390 236511 239282 241484 242504 242893 243544 244581 245263 244889 243537 241762 239786 237323 234180 230686 227339
65375 227339 224305 221592 219474 218321 218021 217995 217861 217791 218181 219350 221642 225331 230038 234640 238228 241096
65359 241096 244415 249011 254748 261029 267499 274147 281036 288152 295464 303036 311048 319585 328313 336509
65345 336509 343567 349391 354123 357651 359677 360116 359111 356721 353025 348468 343611 338423 332306 325071
65331 325071 317477 310451 304144 298086 292018 286130 280648 275666 271314 267736 264864 262545 260800 259650
65317 259650 258755 257607 256034 254139 251842 248983 245863 243035 240380 237033 232569 227702 223363 219606
65303 219606 216030 212779 210364 208700 207198 205815 205155 205331 205466 204796 203786 203631 204916 207141 209360
65288 209360 210906 211615 211725 211670 211779 212086 212419 212587 212536 212517 213014 214271 215905 217366 218716 220486 222686
65271 222686 224589 225829 227100 229338 232689 236810 241671 247297 253101 258330 263070 267961 273006 277544
65257 277544 281517 285746 290552 294953 297831 299267 300034 300242 299237 296581 292451 287128 280693 273295 265311
65242 265311 257186 249352 242252 236133 230871 226312 222660 220194 218682 217433 215974 214372 212941 211968
65228 211968 211708 212259 213341 214491 215521 216535 217466 217955 217794 217223 216665 216404 216540 216971 217304 217118 216521
65211 216521 216221 216853 218381 220250 221795 222422 221833 220481 219542 219910 221250 222368 222498 221903 221189 220443 219221
65194 219221 217210 214717 212554 211423 211262 211178 210264 208566 207052 206539 206878 207422 208008 209115 210985 213033
65178 213033 214343 214602 214335 214275 214750 215645 216676 217565 218054 217990 217401 216439 215216 213773 212154 210512 209106
65161 209106 208195 207874 207963 208099 207966 207455 206689 206045 206081 207166 209029 210898 212315 213645 215572 218261 221285
65144 221285 224297 227439 231128 235699 241239 247440 253643 259471 265478 272757 281674 291401 300916 310130
65130 310130 319725 330224 341615 353608 365788 377683 389187 400841 413213 425947 437859 448055
65118 448055 456557 463688 469268 472690 473475 471457 466580 458847 448478 435994 422212 408113 394446
65105 394446 381216 367779 353659 339278 325740 314052 304560 296863 289952 282722 274835 267096 260637
65092 260637 255660 251351 247041 242917 239375 236235 233117 230291 228454 227751 227604 227588 227820 228258 228302 227586
65076 227586 226657 226159 225700 224421 222616 221842 223054 225392 227351 228652 230263 232900 236260 239716 243112
65061 243112 246641 250393 254303 258290 262189 265710 268625 270989 273067 275077 276972 278433 279129 279127 278944
65046 278944 279026 279231 279100 278564 278088 277990 277942 277297 275813 273891 272181 271056 270322 269362 267623 265017 261825
65029 261825 258314 254648 251073 247784 244486 240473 235404 229803 224526 219945 215988 212802 210857 210272
65015 210272 210431 210533 210430 210727 212162 215030 219119 223940 228944 233727 238260 242931 248225 254283 260829
65000 260829 267446 273820 279721 284940 289373 293052 296068 298547 300731 302840 304793 306342 307669 309536
64986 309536 312543 316458 320678 325101 329993 335111 339558 342672 344568 345603 345713 344513 341751 337422
64972 337422 331711 325030 317898 310654 303460 296567 290229 284331 278595 273280 269171 266601 264997 263756
64958 263756 263095 263562 265121 267207 269359 271350 273026 274545 276447 278875 281046 282141 282452 282926 283794
64943 283794 284411 284384 283966 283296 282169 280760 279812 279704 280051 280589 281772 283967 286630 288889 290495 291571
64927 291571 291771 290468 287682 284188 280664 277261 274079 271484 269548 267537 264506 260500 256798 254674
64913 254674 254064 253835 253283 252809 252921 253281 253436 254005 256175 260102 264768 269558 275002 281589 288846 296246
64897 296246 304284 313876 325157 337579 350680 363946 376356 387105 396679 406402 416899 427732
64885 427732 438484 449377 460711 472365 483963 494829 503686 509203 511150 510416 507660 502666 495333
64872 495333 486485 477115 467471 457550 447947 439349 431459 423278 414446 405622 397492 390045 382935 375931
64858 375931 368662 360383 350551 339564 328572 318491 309312 300439 291593 283204 275820 269297 262923
64845 262923 256433 250520 246019 242845 240134 237338 234706 232692 231319 230335 229679 229572 230266 231778 233690
64830 233690 235188 235616 235116 234503 234385 234709 235305 236437 238404 240836 242961 244520 246030 248115 251012 254752
64814 254752 259339 264462 269451 273935 278367 283459 289176 294726 299607 304278 309522 315409 321229 326389
64800 326389 330950 335121 338540 340487 340729 339758 338062 335579 332172 328312 324816 322019 319701 317810 316695
64785 316695 316437 316460 316170 315614 315202 315180 315755 317390 320379 324311 328517 332934 337942 343436 348760 353697
64769 353697 358865 364864 371600 378815 386754 395802 405781 416178 426871 438144 450017 461977 473440
64756 473440 484274 494835 505656 516991 528492 539447 549480 558927 568361 577954 587472 596606
64744 596606 604920 611618 615715 616534 613851 607789 598798 587542 574487 559773 543856 528037 513769
64731 513769 501495 490694 481040 472864 466308 460695 455237 449989 445710 443009 441970 442428 444224 447246
64717 447246 451469 456960 463713 471515 479993 488614 496687 503781 510245 516850 523547 528993 531762 531647
64703 531647 529149 524019 515242 502633 487592 471800 455761 439192 422397 406405 391848 378467
64691 378467 365918 354476 344539 335905 328062 321029 315408 311598 309354 308235 308091 308909 310491 312646
64677 312646 315532 319407 324019 328579 332518 336079 339964 344565 349741 355240 361013 366940 372458 376780
64663 376780 379483 380668 380488 378843 375765 371861 367927 364173 360257 356195 352760 350646 349622 348953 348471
64648 348471 348760 350304 352893 355953 359136 362454 366131 370542 376076 382856 390662 399273 408783 419504
64634 419504 431563 444612 457916 470798 483159 495449 507924 519972 530439 538598 544408 547726
64622 547726 547745 543666 535716 525045 512572 498383 482399 465301 448428 432769 418405 405010
64610 405010 392632 381700 372428 364611 358091 353076 349724 347630 345997 344198 341955 339168 335998 333096
64596 333096 331306 330936 331525 332437 333478 334939 337260 340817 345797 352125 359593 368113 377752 388584 400712
64581 400712 414366 429632 446022 462661 479032 495245 511384 526947 541230 554076 565956
64570 565956 577288 587782 596334 601540 602549 599556 593336 584278 572156 556861 539010 519716 500142
64557 500142 481436 464497 449317 434867 420212 405665 392446 381355 372246 364710 358733 354562
64545 354562 352302 351791 352680 354543 357025 359943 363158 366543 370164 374218 378448 381841 383286 382491 379917
64530 379917 376004 370937 365030 358736 352220 345437 338731 332839 328045 323895 320057 316994 315309 314710
64516 314710 314152 312967 311475 310509 310590 311515 312544 313011 312992 313393 315184 318538 322818 327323 331799 336286
64500 336286 340864 345771 351531 358596 366751 375123 382917 390029 396809 403418 409701 415604 421249 426477
64486 426477 430744 433827 436342 439147 442341 445275 447447 448984 450250 451476 452818 454295 455371 455017
64472 455017 452586 448492 443788 439235 434979 430933 427136 423755 420979 418912 417496 416603 416262 416630 417627
64457 417627 418775 419514 419510 418494 416068 412015 406675 400685 394390 387779 380991 374512 368764 363722 359113
64442 359113 354873 351345 349065 348384 349185 350982 353479 357024 362321 369679 378768 389213 401239 415560
64428 415560 432832 453369 477180 503948 533087 564232 597748 634466 674808 718469 765077
64417 765077 814769 867712 923286 980211 1037306 1093648 1147990 1198740 1244890 1286462 1323541
64406 1323541 1355093 1379321 1395106 1402615 1402430 1394586 1378711 1354813 1323566 1285882 1242354 1193153
64394 1193153 1138417 1078858 1016062 952121 888935 827873 770007 716381 667853 624707 586585
64383 586585 552847 523034 497024 474845 456391 441355 429312 419788 412307 406600 402696 400534
64371 400534 399426 398290 396580 394600 392631 390172 386437 381229 374820 367367 359184 351327 344941 339900
64357 339900 334947 329413 324012 319625 316203 313404 311541 311034 311448 311972 312536 313638 315234 316690 317827
64342 317827 319150 320802 322006 321907 320467 318208 315463 312255 308641 304828 301083 297741 295139 293382 292319
64327 292319 291905 292372 293868 296122 298710 301543 304902 309015 313786 318983 324576 330774 337702 345023 352057
64312 352057 358358 364068 369471 374272 377562 378593 377411 374614 370671 365621 359376 352189 344687 337394
64298 337394 330281 322990 315591 308833 303424 299216 295472 291786 288344 285341 282703 280504 279192 279161 280400
64283 280400 282718 285904 289457 292683 295445 298422 302111 305897 308719 310479 312188 314810 318572 323366
64269 323366 329019 334933 340129 344098 347165 349675 351319 351715 351163 350226 348958 347263 345694 345002 344934 344484
64253 344484 343457 342799 342889 342455 340042 335903 331419 326967 321484 314158 305555 296838 288775 281948 277077
64238 277077 274365 272921 271583 270111 269056 268712 268810 269143 269811 270740 271511 271886 272051 272118 271790 270819 269493
64221 269493 268309 267347 266311 265104 263992 263193 262578 261895 261038 259941 258389 256167 253408 250555 247961
64206 247961 245679 243695 242173 241231 240676 240220 239935 240251 241491 243691 246854 251027 255983 261177 266269
64191 266269 271462 277113 283258 289773 296758 304401 312703 321658 331477 342161 352980 362884 371379 378533
64177 378533 384151 387612 388639 387623 384889 380185 373328 364977 356234 347635 338984 330037 320970 312192
64163 312192 304057 296785 290413 284778 279685 275075 270977 267448 264704 263150 263007 264025 265758 267999
64149 267999 270701 273645 276561 279501 282722 286198 289592 292761 295966 299442 303057 306474 309378 311382
64135 311382 312045 311239 309385 307097 304688 302157 299502 296842 294368 292334 291016 290465 290365 290330 290322 290652 291641
64118 291641 293442 296091 299505 303423 307628 312246 317659 323975 330771 337443 343733 349877 356374 363590
64104 363590 371346 378783 384853 389192 392393 395253 397945 400189 402076 404273 407369 411319 415688 420102
64090 420102 424178 427260 428629 428053 425918 422762 418814 414005 408284 401797 394843 387766 380906 374495
64076 374495 368499 362554 356215 349431 342747 336867 332001 327817 324037 320855 318555 316908 315315 313569
64062 313569 312194 311862 312627 313876 314893 315312 315091 314361 313416 312681 312470 312696 312879 312412 310837 308062 304570
64045 304570 301414 299592 299187 299295 299074 298735 299206 300944 303454 306030 308566 311452 314921 318702 322172
64030 322172 324841 326909 329325 332930 337449 341722 345005 347608 350082 352464 354744 357449 360991 364830
64016 364830 368064 370598 372921 374849 375419 374078 371184 367220 362387 357231 352722 349122 345518 341097
64002 341097 336297 332063 328530 325203 321956 318997 316157 313170 310536 309172 309103 309364 309373 309585 310477 311618
63986 311618 312331 312739 313539 314970 316552 317715 318295 318468 318620 319283 320922 323633 327035 330394 332959 334483
63970 334483 335542 337006 338936 340297 340114 338739 337560 337570 338616 340042 341572 343439 346011 349560 354149
63955 354149 359529 365240 370981 376810 382954 389627 397098 405646 415268 425673 436859 449512 464568
63942 464568 482437 502912 525620 550277 576623 604636 634762 667435 702264 738150 774386
63931 774386 811090 848240 884789 919256 950879 979632 1005289 1027135 1044521 1057115 1064495 1066066
63919 1066066 1061700 1052050 1037890 1019370 996191 968423 936958 903255 868724 834154 799643 765152
63907 765152 731123 698372 667464 638539 611798 587685 566303 546991 528938 512129 497388
63896 497388 485498 476420 469313 463223 457851 453739 451535 451045 451293 451615 452309 453962 456533 459517 462736
63881 462736 466477 471039 476646 483642 492197 501837 511869 522403 534392 548403 563890 580114 597351
63868 597351 616677 638755 663458 690669 720770 754040 790009 827931 867812 910416 956213
63857 956213 1004793 1055611 1108784 1164535 1222026 1279539 1336021 1391823 1447526 1502492 1555109
63846 1555109 1604185 1649444 1690723 1727236 1757833 1781689 1798588 1808705 1812183 1808807 1798123 1780022
63834 1780022 1755011 1723752 1686540 1643591 1595622 1543710 1488621 1430834 1371213 1311097 1251505
63823 1251505 1192696 1134737 1078115 1023481 971116 921011 873309 828373 786530 747958 712713
63812 712713 680728 651825 625808 602424 581219 561728 543899 528018 514045 501349 489418
63801 489418 478525 469340 462030 456090 450963 446364 442017 437505 432634 427680 423056 418848 414866 411083
63787 411083 407733 404902 402196 399084 395541 392099 389158 386526 383849 381233 379045 377243 375439 373629
63773 373629 372330 371731 371225 370186 368813 367757 367140 366538 365858 365668 366472 368084 369979 371986 374340 377166
63757 377166 380260 383416 386707 390240 393769 396713 398605 399310 398801 396983 393916 389954 385368 380024 373864
63742 373864 367624 362506 358971 356257 353340 350060 347087 345137 344520 345164 346665 348490 350460 352916 356157
63727 356157 359936 363841 368001 372955 378832 385040 390817 395824 400185 404223 408181 411966 415151 417478
63713 417478 419276 421079 422804 423657 423016 421138 418851 416741 414846 413029 411366 410041 408910 407373 404888
63698 404888 401641 398570 396623 396084 396529 397089 396720 394751 391607 388714 387306 387434 388369 389474 390258 390112
63682 390112 388904 387617 387430 388071 388023 386611 384969 384530 385453 387173 389686 393318 397662 401792 405453 409227
63666 409227 413484 417873 422000 425915 429695 433030 435588 437419 438699 439333 439082 437913 435965 433321 430066
63651 430066 426469 422891 419553 416611 414498 413953 415510 418922 423269 427729 432202 437140 442961 449886
63637 449886 458195 468065 478968 489667 499234 507876 516379 524944 533010 540033 545925 550753 554597 557808
63623 557808 560921 564094 567026 569615 572331 575740 580138 585863 593514 603389 615092 628195 643002
63610 643002 660046 679031 698915 719019 739474 760556 782224 804455 827364 850591 873153
63599 873153 894335 914268 933072 949705 962370 970064 973293 973285 971007 966933 961225 953816 944635 933976
63585 933976 922473 910506 897770 883546 867246 848744 828489 807432 786552 766286 746610
63574 746610 727742 710403 695206 682142 671000 661906 654942 649523 644822 640853 638523 638430 640087
63561 640087 642559 645481 649127 653897 660165 668519 679653 693891 710970 730325 751481 774258 798713
63548 798713 824888 852514 881138 910764 942362 977446 1017050 1061075 1108403 1157184 1204754
63537 1204754 1247543 1281709 1304523 1315501 1316338 1309676 1297781 1282201 1264279 1245476 1226901 1208724
63525 1208724 1190416 1171623 1152534 1133279 1113215 1091155 1066340 1039049 1010285 981057 952044
63514 952044 923681 896300 870144 845449 822535 801700 782969 766044 750532 736041 722027
63503 722027 707837 693171 678396 664148 650694 637900 625677 614037 602735 591388 580222
63492 580222 570244 562254 555918 550280 544970 540354 536620 533460 530914 529818 530805 533263 535998 538822
63478 538822 542768 548569 555619 562792 569770 577030 584878 593167 601779 610601 618883 625436 629894 633372
63464 633372 637348 642196 647266 652073 656715 661227 665294 668792 672026 675030 677100 677429 676036 673681
63450 673681 671003 668101 664911 661688 659032 657663 658256 661401 667573 676988 689342 703755 719270 735542
63436 735542 752937 771947 792832 815918 841953 871838 906153 944963 987564 1031881 1074355
63425 1074355 1111161 1139857 1159831 1171479 1175529 1173170 1166234 1156787 1146727 1137744 1131238 1127960 1127981
63412 1127981 1131255 1137979 1148172 1161121 1175541 1190105 1203598 1214799 1222698 1226876 1227366 1224213 1217481
63399 1217481 1207773 1196292 1184069 1171201 1157010 1140820 1122449 1102057 1079744 1055371 1028734
63388 1028734 999915 969528 938522 907703 877495 848270 820656 795276 772204 751069 731745
63377 731745 714568 699792 687236 676905 669562 666006 665876 667791 670863 675515 682598 692300 704375
63364 704375 718995 736668 757448 780732 805838 832414 860425 890230 922606 958109 996268
63353 996268 1035740 1075380 1114859 1154178 1193005 1230580 1265903 1297869 1325567 1348541 1366493
63342 1366493 1378838 1385173 1386298 1384081 1379896 1373701 1365038 1354297 1342342 1329279 1314338 1296793
63330 1296793 1276373 1253021 1226968 1199056 1170283 1140904 1110515 1079030 1047037 1015206 984150
63319 984150 955180 930418 911515 898499 890162 885045 881357 876332 866673 850228 827107 799134
63307 799134 768482 736858 705460 675122 646280 619114 593982 571646 552764 537109 523596
63296 523596 511254 499907 489698 480344 471356 462839 455391 449184 443714 438623 434204 430772 427966
63283 427966 425168 422322 419968 418555 418055 418072 418020 417327 415791 413803 412060 411135 411267 412313 413708 414814
63267 414814 415583 416688 418700 421354 423901 426005 427890 429848 431958 434174 436320 438146 439784 441966
63253 441966 445301 449434 453411 456872 460314 464207 468471 472956 477753 482714 487190 490776 494012 497883
63239 497883 502798 508389 514109 519683 525035 530176 535253 540550 546380 552969 560286 567906 575298 582426
63225 582426 589927 598497 608181 618422 628666 638723 648688 658724 668906 679108 689068 698660 708036
63212 708036 717444 726956 736380 745270 752955 758736 762249 763547 762856 760428 756623 751794 745891 738491
63198 738491 729495 719645 710099 701650 694510 688598 683802 680195 678257 678721 681936 687552 695052 704333
63184 704333 715489 728395 742958 759471 778073 798048 818309 838622 859706 882018 904951
63173 904951 927355 948267 966953 982865 995975 1006807 1015794 1022787 1027410 1029598 1029542 1027327 1022770
63160 1022770 1015374 1004435 989669 971874 952416 931721 908839 882906 854475 824855 794664
63149 794664 763931 733267 703925 676634 651242 627678 606428 587676 570701 554726 539923
63138 539923 526999 516087 506626 498184 490813 484610 479429 475119 471630 468670 465641 462241 458963 456611
63124 456611 455283 454122 452262 449801 447576 446026 444632 442628 439988 437397 435396 433929 432789 432114
63110 432114 432278 433493 435771 439023 442967 447097 451066 455131 459948 465880 472731 480202 488223 496640
63096 496640 504907 512588 520155 528874 539623 552064 565134 578147 591063 603769 615470 624962
63084 624962 631275 633953 632902 628238 620261 609524 596915 583659 570989 559636 549637 540712 532687
63071 532687 525593 519580 514951 512118 511321 512410 514992 518629 522877 527496 532956 540343 550232 561773
63057 561773 573460 584831 596897 610839 626858 644451 663236 683104 704013 726068 749467
63046 749467 774001 798896 823630 848620 874641 901724 929147 956333 983202 1009713 1035708
63035 1035708 1061348 1087139 1113275 1139314 1164638 1188839 1211457 1231816 1249449 1264401 1276731
63024 1276731 1285960 1291298 1292315 1289108 1281925 1270942 1256415 1238883 1219207 1198469 1177730 1157780
63012 1157780 1139188 1122519 1108290 1096715 1087911 1082504 1081628 1085996 1095264 1108635 1125806 1146911
63000 1146911 1171746 1199577 1229658 1261566 1295000 1329548 1364568 1398979 1431384 1460923 1487958
62989 1487958 1513484 1537825 1560382 1580656 1598888 1615491 1630341 1642930 1652793 1659415 1661984 1659583
62977 1659583 1651530 1637451 1617313 1591507 1560573 1524668 1483622 1437769 1388384 1337060 1284957
62966 1284957 1232823 1181277 1130702 1081255 1033396 988064 945911 906711 869964 835759 804483
62955 804483 776041 750112 726900 706814 689374 673235 657412 641860 626825 612409 598986
62944 598986 587208 577065 567556 557800 548010 538875 530436 522254 514440 507794 502874 499363 496466 493622
62930 493622 490764 488097 485744 483533 481254 479115 477671 477123 476932 476434 475645 475174 475530 476823 478995 481988
62914 481988 485720 490213 495661 502034 508687 514832 520439 526288 532941 539971 546390 551523 555202 557381
62900 557381 557993 557187 555359 552826 549719 546310 543203 540877 539121 537244 534915 532470 530224 527858 524889
62885 524889 521517 518570 516657 515814 515856 516560 517426 517871 517896 518053 518503 518673 518198 517563 517202 516485 514385 510881
62867 510881 506931 503145 499282 495059 490685 486378 482044 477746 473983 471198 469371 468319 468014 468301 468673
62852 468673 468673 468299 467853 467635 467959 469117 471038 473227 475300 477344 479543 481743 483617 485088 486301 487417
62836 487417 488630 490201 492232 494608 497288 500381 503798 507227 510690 514688 519392 524140 528256 532015
62822 532015 536205 541008 546008 551099 556533 562006 566512 569424 571062 571922 571871 570552 568135 565231 562407
62807 562407 560162 559000 559015 559546 559762 559620 559950 561616 564770 568850 573099 577220 581728 587520 594857 603045
62791 603045 611388 620222 630518 642629 656041 670358 685891 703073 721888 742272 764682 789768
62779 789768 817648 847916 880228 914531 950716 988400 1027080 1066262 1105405 1143896 1181155
62768 1181155 1216633 1249762 1280040 1307080 1330494 1349793 1364537 1374396 1378844 1377056 1368553 1353873
62756 1353873 1334127 1309881 1280997 1247688 1211156 1172791 1133147 1092207 1050432 1009014 969128
62745 969128 931343 895777 862458 831421 802732 776528 752906 731725 712707 695738 680875
62734 680875 668021 656832 647041 638694 631970 626899 623334 621008 619502 618282 616989 615776 615293 616226
62720 616226 618711 622196 625990 630008 634794 640745 647619 655095 663595 674072 687034 702215 719282
62707 719282 738417 759990 783986 810050 837891 867467 899023 933208 970882 1012500 1057699
62696 1057699 1105647 1155598 1206959 1259172 1311939 1365392 1419578 1473772 1526717 1577511 1625782
62685 1625782 1670854 1711207 1745087 1771390 1789608 1799131 1799132 1789191 1769650 1741244 1704695 1660974
62673 1660974 1611648 1558471 1502481 1443915 1383232 1321969 1262197 1205222 1151144 1099612 1050586
62662 1050586 1004287 960837 920302 882876 848711 817697 789614 764376 741903 721888 703953
62651 703953 687878 673394 659881 646734 634076 622736 613289 605401 598238 591355 584915 579188 574111
62638 574111 569362 564778 560626 557436 555507 554640 554437 554735 555463 556160 556056 554920 553481 552664 552528 552319
62622 552319 551528 550452 549612 548959 548006 546581 545088 544015 543416 543051 542897 543296 544546 546485 548606 550592
62606 550592 552571 554828 557419 560257 563465 567405 572282 578012 584572 592279 601422 611805 622987 634892
62592 634892 647804 661716 676092 690471 704990 720049 735752 751920 768365 784678 799936
62581 799936 813170 824163 833300 840521 844900 845490 842221 835695 826402 814555 800489 784809 768108
62568 768108 750762 733018 715095 697204 679590 662532 646248 630825 616287 602616 589731
62557 589731 577647 566733 557549 550271 544450 539496 535104 531057 527016 522958 519545 517502 516679 516247
62543 516247 515816 515852 516858 518655 520722 522861 525184 527650 529969 531926 533620 535397 537599 540330 543474
62528 543474 547049 551438 556977 563367 569961 576773 584795 594983 607274 620916 635512 651371 669071
62515 669071 689104 711821 737203 764684 793595 823816 855596 888629 921808 954120 985417
62504 985417 1016019 1045859 1074331 1100650 1123905 1142967 1157017 1166294 1171829 1174139 1172568 1166266
62492 1166266 1155558 1141963 1126960 1111176 1094743 1077968 1061379 1045447 1030634 1017610 1007065
62481 1007065 999160 993353 988822 985024 981841 979302 977252 975232 972587 968691 963145 955799 946596 935316
62467 935316 921512 904775 885186 863494 840757 817749 794679 771359 747571 723385 699384
62456 699384 676534 655548 636254 617845 599951 583321 569263 558500 550666 544725 539664 534958
62444 534958 530710 527396 525280 524027 522983 521844 520899 520610 521067 521868 522465 522602 522470 522397 522388 522117 521382 520348
62426 520348 519236 517999 516560 515103 513847 512631 511119 509370 507900 507120 507014 507329 507765 507946 507559 506700
62410 506700 505903 505703 506237 507195 507979 507998 507171 506157 505840 506590 508247 510675 513842 517430 520935 524341 528122
62393 528122 532305 536048 538616 540416 542630 545994 550334 555067 559742 564175 568407 572541 576521 580196
62379 580196 583767 587900 593113 599288 606080 613519 621793 630661 639659 648898 659133 670917 684040
62366 684040 697982 712731 729001 747745 769445 793772 819989 847753 877385 909312 943544
62355 943544 979929 1018568 1059553 1102499 1146790 1192121 1238293 1284570 1329724 1372612 1412172
62344 1412172 1446930 1475280 1496438 1510626 1518290 1519712 1515467 1506356 1492450 1472898 1447222 1416283
62332 1416283 1381467 1343516 1302847 1260457 1217611 1174908 1132552 1091381 1052620 1016532 982266
62321 982266 949351 918496 890388 864426 839376 814877 791605 770152 750480 732509 716563
62310 716563 702864 690898 679731 668997 659297 651473 645582 640834 636607 633174 631148 630435 630210 629860
62296 629860 629434 629101 628757 628384 628274 628510 628737 628898 629735 631907 634967 637900 640489 643378 646859 650472
62280 650472 653883 657288 660663 663436 665414 667334 669823 672304 673658 673723 673517 674101 675828 678601 682399
62265 682399 687592 695085 705973 720580 738057 757514 779361 804862 834374 866811 901070 937260
62253 937260 976136 1017833 1061676 1106950 1153377 1200809 1248549 1294872 1337292 1373679 1403199
62242 1403199 1425868 1441378 1449096 1449341 1443753 1433719 1418930 1398165 1371169 1339079 1303191 1264119
62230 1264119 1222228 1178250 1133214 1088149 1044134 1002418 964197 930191 900362 874002 850267
62219 850267 828754 809486 792275 776478 761597 747862 735856 725751 717187 709612 702331 694529
62207 694529 685861 676973 668899 661925 655472 649084 642976 637562 632941 629113 626328 624965 625225 626944
62193 626944 629536 632244 634895 638339 643578 650491 657991 665473 673349 681903 690463 698307 705738 713588
62179 713588 722042 730701 739464 748543 757654 766002 773219 779771 786329 793272 800996 810174 821348 834573
62165 834573 849749 867046 886768 909062 934042 961988 992948 1026135 1059993 1092982 1124160
62154 1124160 1152982 1178748 1200420 1216961 1227787 1232941 1232969 1228631 1220562 1209032 1194011 1175559
62142 1175559 1154120 1130339 1104620 1077170 1048560 1020029 992983 968331 946546 928150 913635
62131 913635 902901 895346 890855 890291 894483 902952 914233 927473 943127 961825 983159 1006054 1029871
62118 1029871 1054510 1079603 1104417 1128641 1152545 1175990 1197836 1216826 1232674 1245809 1256322
62107 1256322 1263761 1267865 1269011 1267975 1265755 1263610 1262721 1263613 1266205 1270497 1276824 1285395 1296074 1308850
62093 1308850 1324054 1341883 1362078 1384445 1409350 1437276 1468074 1501050 1535644 1571679 1609089
62082 1609089 1647860 1688245 1730651 1775156 1821336 1868568 1916293 1964024 2011470 2058785 2106413
62071 2106413 2154371 2201714 2246846 2288383 2325661 2358474 2386516 2409306 2426739 2439536 2448928
62060 2448928 2455935 2461173 2465361 2469664 2475236 2482635 2491896 2503015 2516051 2530832 2546884 2563645 2580505
62047 2580505 2596599 2610792 2621861 2628472 2628972 2621551 2604951 2578970 2544132 2500857 2449089 2388741
62035 2388741 2320406 2245496 2165643 2082108 1995909 1908400 1821259 1735748 1652286 1571114 1493181
62024 1493181 1419864 1351796 1288444 1229049 1173641 1122791 1076595 1034341 995139 958543 924435
62013 924435 892695 863306 836669 813330 793276 775785 760272 747076 737045 730389 726310 723772
62001 723772 722233 721505 721367 721709 722719 724439 726309 727575 728048 727981 727228 725010 720671 714272 706295 697132
61985 697132 686995 675984 664022 651068 637648 624823 613299 602779 592561 582570 573471 565872
61973 565872 559845 555124 551370 548154 545076 542019 539080 536307 533820 532155 531923 532960 534300 535311
61959 535311 536475 538585 541552 544610 547530 550934 555284 560252 565424 571128 578121 586717 596702 607904
61945 607904 620470 634609 650425 667964 687145 707642 729142 751675 775419 800254 825874
61934 825874 852332 879966 908524 936775 963268 987288 1008832 1027926 1044390 1058201 1069692
61923 1069692 1079244 1086927 1092523 1095843 1097033 1096535 1094746 1091781 1087699 1082885 1077947 1073276 1069100 1066030
61909 1066030 1065101 1066947 1071332 1077789 1086390 1097384 1110376 1124441 1138894 1153326 1166864 1178040
61897 1178040 1185633 1189198 1188636 1183737 1174475 1161343 1145064 1126110 1104735 1081215 1055875 1029124
61885 1029124 1001687 974539 948258 922689 897578 873425 851325 832012 815284 800286 786099
61874 786099 772243 758956 747021 736968 728460 720846 714236 709571 707457 707435 708761 711516 716389 723547
61860 723547 732316 742181 753597 767504 784355 803953 826107 850994 878877 909782 943575 980012
61848 980012 1018542 1058269 1098370 1138452 1178315 1217546 1255624 1292341 1327698 1361276 1391932
61837 1391932 1418241 1439085 1453873 1462584 1465923 1465238 1461960 1457004 1450831 1444019 1437593 1432820 1430779
61824 1430779 1432039 1436587 1443975 1453674 1465292 1478325 1491735 1503968 1513567 1519677 1521814 1519237 1510800
61811 1510800 1495552 1473405 1445101 1411668 1374126 1333656 1291666 1249335 1207195 1165396 1124403
61800 1124403 1085128 1048263 1013758 981144 950280 921532 895256 871312 849202 828624 809822
61789 809822 793315 779246 766993 755571 744489 734055 724727 716355 708308 700272 692507 685247 678203
61776 678203 670905 663295 655653 648088 640462 632821 625507 618746 612394 606361 601028 596920 594007 591611
61762 591611 589004 585941 582595 579221 576010 573122 570722 568998 568133 568207 569075 570424 571937 573336 574364
61747 574364 574979 575629 577042 579526 582596 585463 587854 590241 593323 597458 602489 607956 613457 618985 624942
61732 624942 631747 639489 648075 657651 668548 680710 693428 705915 718131 730766 744317 758363
61720 758363 771924 784412 795962 806821 816769 825320 832279 837819 842127 845292 847375 848259 847454 844479
61706 844479 839487 833170 825948 817619 807920 797072 785634 774265 763793 754989 747844 741490 735239
61693 735239 729380 724533 720677 717423 714902 713629 713570 714054 714591 715141 715582 715613 715306 715120 715182 715142 714936 715097
61675 715097 715990 717262 718327 718926 718933 718129 716566 714697 712747 710342 707126 703322 699244 694766 689866 685257
61659 685257 681730 679026 676045 672157 667738 663475 659792 656983 655305 654621 654346 653952 653304 652442 651386
61644 651386 650238 649177 648169 646947 645335 643436 641465 639638 638176 637119 636108 634746 633121 631500
61630 631500 629441 625883 620538 614700 610047 606833 603825 599927 595297 590813 587026 583957 581487 579545
61616 579545 578074 577177 577214 578391 580199 581488 581237 579200 575907 572241 568947 566160 563286 559580 555042
61601 555042 550520 546813 543929 541480 539442 538103 537499 537391 537743 538777 540577 543093 546492 550960 556128
61586 556128 561275 566270 571674 577664 583404 587912 591039 593129 594192 594009 592705 590642 587918 584532
61572 584532 580826 577177 573333 568650 562940 556550 549712 542389 534808 527505 520642 513813 506685 499415
61558 499415 492259 485262 478584 472750 468190 464735 461751 458598 454916 450796 446822 443585 441031 438595
61544 438595 436132 434225 433281 432780 431880 430491 429223 428454 427956 427397 426767 426243 426066 426667 428462 431176 433594
61527 433594 434368 433129 430648 427851 424954 421669 417976 414303 410899 407505 403882 400408 397750 396073
61513 396073 394945 393936 392883 391543 389514 386811 384207 382596 382028 381585 380242 377835 375216 373431 372715
61498 372715 372367 371708 370902 370544 370687 370829 370792 370966 371506 371878 371560 370760 370034 369615 369512 369834 370516 370986 370743
61479 370743 370134 370041 370867 372294 373958 375770 377555 378992 380096 381288 382783 384287 385530 386663 387882
61464 387882 389019 389882 390644 391493 392122 392088 391593 391416 391975 392910 393738 394535 395659 397080 398371 399296 400031 400755
61446 400755 401299 401413 401173 400979 401251 402220 403939 406279 409008 412026 415427 419116 422508 424970 426671 428622
61430 428622 431646 435496 439220 442199 444534 446536 448237 449574 450793 452368 454474 456733 458659 460303
61416 460303 462241 464813 467635 470121 472306 474737 477507 479901 481176 481272 480438 478551 475282 470733 465416
61401 465416 459683 453690 447873 442843 438641 434609 430333 426304 423285 421333 419884 418526 417165 415556
61387 415556 413362 410885 409133 408712 408937 408522 407014 405106 403585 402562 401887 401771 402522 403907 405284 406311
61371 406311 407133 407895 408545 409198 410228 411759 413395 414805 416312 418541 421621 425069 428349 431208 433565
61356 433565 435595 438009 441770 447186 453532 459886 466186 473135 481159 489916 498974 508576 519345 531318
61342 531318 543651 555442 566538 577354 588137 598735 608963 618659 627211 633555 637170 638937
61330 638937 640494 642567 644271 644143 641606 637279 632210 627138 622319 617609 612574 606814 600394 593910
61316 593910 588047 583166 579300 576389 574338 572960 572015 571286 570535 569590 568646 568294 568905 570037 570920 571627
61300 571627 573281 576738 581421 585948 589735 593463 597931 602982 607752 611581 614367 616215 617044 616529 614363
61285 614363 610657 606147 601836 598308 595436 592827 590361 588222 586661 585943 586376 588062 590589 593166 595256
61270 595256 597050 599278 602544 606862 611816 617048 622475 628123 634116 640916 649186 659034 669619 679933
61256 679933 689881 700150 711152 722694 734700 747537 761310 775373 788964 801824 813697 823601
61244 823601 830262 833183 832797 829592 823638 814980 804123 791939 779285 766735 754477 742426 730620
61231 730620 719473 709550 701188 694461 689315 685482 682429 679733 677518 676275 676311 677619 680159 683901
61217 683901 688618 693931 699599 705556 711679 717783 723790 729645 735088 739787 743702 747160 750562 754235
61203 754235 758493 763597 769720 777151 786357 797514 810058 823175 836809 851929 869742 890842
61191 890842 915014 941495 969438 998486 1028946 1061127 1094553 1128144 1161127 1193308 1224459
61180 1224459 1253906 1280868 1304845 1325653 1343515 1359169 1373303 1385588 1394704 1399563 1400176 1397129
61168 1397129 1390749 1381145 1368654 1353620 1335851 1314751 1290064 1262288 1232391 1201240 1169247 1136497
61156 1136497 1103267 1070316 1038365 1007439 977184 947913 920750 896513 874953 855394 837662
61145 837662 821962 808362 796870 787763 781285 777267 775426 775752 778086 781614 785404 789330 793940 799526
61131 799526 805887 812901 820780 829759 840119 852529 867843 886479 908453 933967 963343 996306
61119 996306 1031992 1069849 1109956 1152303 1196504 1242590 1291260 1342610 1395188 1447163 1498110
61108 1498110 1548744 1599011 1647471 1692807 1735053 1774701 1811142 1842707 1868082 1887078 1900058
61097 1900058 1907226 1908715 1904859 1895917 1881692 1861846 1836546 1806475 1772133 1733503 1690646 1644317
61085 1644317 1595625 1545177 1493031 1439556 1385977 1333763 1283683 1235735 1189899 1146566 1106215
61074 1106215 1069037 1035077 1004516 977467 953567 932091 912571 895105 879951 866985 855759
61063 855759 846030 838067 832357 829093 827943 828322 829879 832732 837196 843310 850809 859560 869872 882276
61049 882276 897102 914364 933901 955475 978869 1004016 1030907 1059324 1088973 1120075 1153449
61038 1153449 1189556 1227668 1266540 1305804 1346160 1388103 1431037 1473848 1515926 1557355 1598426
61027 1598426 1639242 1679585 1718986 1757137 1794348 1831374 1868716 1906388 1944423 1983278 2023638
61016 2023638 2066208 2111900 2162098 2218790 2284880 2364325 2461441 2580203 2725236 2903904 3126609
61005 3126609 3404291 3745471 4154610 4630685 5165889 5747600 6364964 7015477 7706578
60996 7706578 8453962 9280952 10216521 11285720 12494467 13819502 15208543 16583725 17844284
60987 17844284 18879796 19604988 20001187 20128941 20094790 19997371 19894123 19800759 19700409 19542904
60977 19542904 19246385 18723912 17928716 16882148 15659836 14351036 13026371 11731150
60969 11731150 10494144 9335458 8268932 7302653 6439761 5679191 5016667 4446106 3960220
60960 3960220 3550067 3205337 2916009 2673375 2469301 2295669 2145612 2014763 1900499
60951 1900499 1800361 1711916 1633548 1564357 1503293 1449013 1400332 1356174 1315309 1276800 1240531
60940 1240531 1206651 1174630 1143450 1112542 1081920 1051623 1021791 993154 966575 942011 918694
60929 918694 896436 875963 857715 841073 825227 810186 796453 784127 772830 762194 752021
60918 752021 742215 733001 724990 718536 713138 707817 702070 696149 690565 685683 681760 678952 677031 675363
60904 675363 673381 671088 668992 667561 666729 665814 663818 659968 654227 647408 640640 634526 628796 622832 616421
60889 616421 609842 603400 597171 591205 585529 579771 573202 565587 557744 550879 545418 540898 536868 533448
60875 533448 530894 529078 527631 526331 525161 524111 523040 521697 519905 517938 516670 516945 518676 520853
60861 520853 522633 524136 525968 528315 530889 533610 536870 541005 545822 550782 555430 559510 562880 565597
60847 565597 568062 570733 573482 575459 575891 575030 573921 573054 571603 568452 563730 558716 554200 549586 543973
60832 543973 537556 531332 525698 520139 514334 508895 504577 501208 497914 494219 490437 487018 484008 481328
60818 481328 479231 478140 478177 479069 480467 482143 483934 485676 487239 488536 489553 490457 491586 493185 495240
60803 495240 497716 500814 504663 508861 512739 516154 519556 523140 526393 528847 530884 533270 536074 538576
60789 538576 540197 541044 541483 541629 541424 540902 540130 539184 538331 537957 538028 537773 536199 532961 528589 523986 519885
60772 519885 516698 514556 513226 512112 510567 508380 505872 503431 500994 498187 494953 491850 489586 488399
60758 488399 487981 487833 487558 486987 486298 485915 486067 486509 486856 487098 487480 488019 488498 488954 489798 491355 493582 496277
60740 496277 499231 502093 504451 506208 507555 508421 508336 507176 505701 504997 505556 507177 509464 511995 514227
60725 514227 515850 517266 519192 521635 523694 524555 524373 523934 523777 523972 524519 525512 526847 528082 528757 528765 528384
60708 528384 528021 527948 528115 528144 527568 526233 524467 522818 521602 520722 519858 518712 517086 514919 512423 510038
60692 510038 508085 506434 504755 503059 501762 501107 500794 500401 499952 499796 500056 500498 500901 501185 501113 500307 498785
60675 498785 497301 496867 498058 500853 504832 509189 512822 515001 516091 517225 519095 521378 523467 525378
60661 525378 527579 530238 533015 535513 537542 539061 540248 541623 543688 546305 548725 550335 551160 551627 552214
60646 552214 553343 555188 557290 558768 559215 559102 559001 558781 558006 556789 555653 554707 553613 552386 551575 551447
60630 551447 551601 551662 551942 552992 554849 557126 559668 562664 566192 570020 573837 577410 580533 583159 585626
60615 585626 588485 591970 595787 599472 602717 605244 606651 606737 605977 605391 605794 607219 609094 610811 612088
60600 612088 612946 613621 614457 615698 617242 618659 619465 619406 618616 617668 617386 618311 620254 622511 624561 626379 628121
60583 628121 629787 631295 632586 633494 633735 633220 632189 630926 629562 628256 627262 626624 626181 626061 626733 628231
60567 628231 629838 631009 632156 633916 636125 638339 641060 645424 651581 658300 664334 669473 674074 678309
60553 678309 682191 685738 688834 691495 694392 698372 703206 707542 710519 712721 715185 718310 722212 727259
60539 727259 733359 739401 744357 748549 752956 757676 762006 765781 769621 773846 778041 781803 785249 788730
60525 788730 792683 797705 804078 811206 818182 824975 832366 840659 849210 857420 865472 873797 882461 891444
60511 891444 900959 911108 921643 932440 943829 956057 968732 981167 993060 1004569 1015929 1027274
60499 1027274 1038710 1050366 1062367 1074811 1087611 1100419 1112873 1124801 1135939 1145691 1153675 1160348
60487 1160348 1166480 1171938 1175581 1176415 1174264 1169234 1161316 1150810 1138446 1124631 1109108 1091788 1073311
60474 1073311 1054356 1034944 1015047 995391 976891 959584 942777 926081 909677 893747 878303
60463 878303 863546 849777 836912 824575 812713 801612 791262 781140 770758 760074 749274
60452 749274 738525 728059 718231 709243 700934 692855 684524 675697 666656 658101 650486 643496 636403 628891
60438 628891 621272 613978 607121 600571 594184 587925 581968 576618 571957 567663 563419 559332 555621 552027
60424 552027 548090 543988 540564 538345 536970 535796 534611 533392 531784 529404 526548 524077 522503 521525
60410 521525 520616 519724 519155 518978 518954 519052 519563 520510 521262 521221 520736 520781 521692 522749 523222 523325 523674 524229 524380 523910
60390 523910 523324 523192 523665 524652 525989 527297 528064 528078 527543 526683 525599 524605 524266 524750 525412 525409 524625 523729 523402
60371 523402 523773 524534 525315 525788 525628 524602 522790 520717 519098 518301 517985 517325 515691 513190 510645 509019
60355 509019 508740 509390 510114 510413 510517 510920 511716 512613 513494 514675 516515 518961 521531 523688 525259 526673
60339 526673 528714 531811 535559 539150 542287 545436 549139 553363 557663 561705 565435 568968 572558 576550
60325 576550 581043 585500 588895 590389 589954 588344 586475 584754 582953 580708 578092 575649 573888 572822
60311 572822 572017 571142 570533 571152 573767 578058 582774 587006 591157 596413 603389 611613 620198 628568 636485
60296 636485 643786 650295 655743 659607 661237 660323 657024 651621 644364 635827 627055 618966 611688 604776
60282 604776 598045 591966 587184 583753 580892 577545 573287 568731 564887 562117 559866 557426 554629 551706
60268 551706 548865 546372 544775 544469 544978 545067 543891 541932 540618 541024 542957 545255 546872 547673 548265 549288
60252 549288 551018 553563 557045 561357 565919 569954 573070 575495 577767 580225 582767 584907 586030 585696
60238 585696 583843 580748 576868 572743 568972 566131 564531 563993 563920 563766 563523 563738 565022 567534 570898 574467
60222 574467 577689 580490 583439 587326 592354 597894 603190 608167 613256 618649 624101 629372 634487 639556
60208 639556 644682 650037 655669 661298 666652 671971 677717 683777 689455 694392 698960 703537 707902 711661
60194 711661 714818 717538 719672 720932 721289 720940 720099 719116 718427 718054 717429 716077 714173 712097 709797 707071
60178 707071 704169 701512 699025 696326 693455 690830 688529 686274 684166 682809 682469 682618 682588 682349 682325 682752
60162 682752 683513 684464 685652 687202 689098 691142 693253 695773 699251 703707 708350 712346 715689 719031 722818
60147 722818 727038 731704 737096 743505 751087 759940 769862 780076 789706 798642 807467 816525 825616 834686
60133 834686 844087 853765 862815 870372 876543 881886 886240 888653 888356 885347 880170 873615 866654 860130
60119 860130 854320 849126 844798 842030 841112 841231 841049 840027 838937 838919 840191 841854 842849 842783 841783 839953
60103 839953 837373 834461 831834 829702 827660 825159 821989 818331 814686 811787 810240 810012 810504 811253 812340
60088 812340 814089 816684 820281 825087 831015 837447 843684 849540 855237 860807 865825 869686 872031 872926
60074 872926 872655 871285 868472 863872 857611 850012 841008 830404 818732 807195 796477 786289 776427
60061 776427 767473 759868 752994 746125 739780 735087 732025 729359 726267 723000 719846 716579 713281 710700
60047 710700 709199 708171 707122 706640 707612 710029 713296 717218 721865 726806 731294 735149 738814 742622 746559
60032 746559 750532 754233 756847 757596 756527 754141 750316 744383 736300 726922 716884 705997 694103 681763
60018 681763 669602 657593 645571 633948 623242 613306 603687 594501 586312 579278 573087 567643 563185
60005 563185 559657 556538 553491 550802 549032 548505 549185 550758 552777 554991 557517 560475 563611 566635 569763
59990 569763 573412 577470 581443 585323 589653 594645 599865 604968 610021 614785 618395 620301 621073 621693 622438
59975 622438 622927 622905 622405 621389 619786 617749 615476 613022 610621 608768 607462 605770 602896 599384 596496
59960 596496 594533 592596 589945 586763 583537 580520 577989 576216 574873 573155 570845 568657 567213 566360
59946 566360 565853 566015 567062 568344 568916 568556 567638 566276 564263 561666 558884 556135 553360 550604 548067
59931 548067 545793 543646 541572 539639 537858 536221 534815 533665 532579 531425 530379 529646 529109 528626 528464
59916 528464 529022 530178 531351 532260 533302 535133 538068 541887 546019 549961 553691 557566 561714 565793 569579
59901 569579 573382 577425 581159 583861 585795 588095 591496 595802 600618 605895 611539 617189 622765 628728
59887 628728 635443 642684 650058 657430 664557 670850 676082 680916 686078 691300 695742 699308 702775 706523
59873 706523 709815 711626 711664 710290 707803 704223 699544 693832 687150 679642 671689 663862 656743 650794 646218
59858 646218 642725 639612 636377 633294 631226 630822 632026 634300 637114 640126 643176 646346 649951 654279
59844 654279 659359 665113 671708 679490 688403 697579 705662 711633 715435 717907 720213 723173 726957 731242
59830 731242 735597 739688 743187 745651 746610 745797 743296 739459 734633 728844 721799 713274 703508 693072
59816 693072 682396 671639 661039 651077 642106 634015 626491 619513 613360 608219 603985 600416 597309
59803 597309 594584 592388 591014 590477 590223 589584 588495 587416 586502 585175 582737 579158 575121 571489 568844
59788 568844 567177 565700 563209 559132 554252 550086 547565 546572 546659 547614 549169 550721 551915 553268 555675
59773 555675 559330 563505 567370 570569 573005 574662 575904 577433 579552 581805 583693 585371 587203 589003
59759 589003 590451 591973 594344 597357 599800 601048 601890 603294 605045 606296 606975 607810 609197 610823 612375
59744 612375 613931 615529 616885 617729 618054 617966 617677 617650 618277 619285 619905 619839 619639 619954 620806 621860 622988 624190
59726 624190 625294 626203 627275 628984 631256 633489 635239 636605 637990 639800 642322 645490 648607 650699
59712 650699 651456 651659 652380 653888 655635 657194 658747 660474 661917 662377 661811 660882 660106 659356 658316 657034
59696 657034 655727 654386 652963 651804 651437 651905 652660 653226 653718 654520 655623 656462 656409 655375 653944 652901
59680 652901 652603 652809 653072 653143 652956 652445 651569 650335 648690 646545 644125 642040 640668 639629 638199 636153
59664 636153 633866 631778 630260 629882 631184 633946 637231 640355 643361 646302 648640 649878 650445 651302 652758
59649 652758 654194 655016 655456 656260 657835 659883 661744 662918 663281 662942 662048 660785 659440 658274 657271 656197
59633 656197 654995 654013 653786 654668 656666 659430 662358 664942 667216 669745 673058 677191 681847 686825 692028
59618 692028 697179 701744 705199 707281 708049 707803 706986 705976 704912 703734 702465 701445 701209 702033 703517
59603 703517 704779 705235 705193 705515 706643 708062 708722 707915 705732 702761 699364 695298 690144 684102 678076 672834
59587 672834 668346 664173 660195 656547 653071 649432 645741 642497 639784 637056 633924 630725 628066 626211
59573 626211 625140 624794 624934 625084 624993 624954 625401 626411 627908 630089 633178 636823 640122 642409 643958 645847
59557 645847 649045 653434 657784 660915 662937 665039 668076 671807 675642 679590 684146 689627 695903 702468
59543 702468 708509 713382 717477 722283 729145 738164 748645 760253 773243 787886 804210 822026 840583
59530 840583 858364 873922 886968 898223 908333 917487 925982 934465 943413 952870 962753 972904 982728
59517 982728 991260 997797 1002143 1004180 1003587 1000105 993691 984360 972327 958432 943912 929515 915214
59504 915214 901000 887482 875456 865236 856775 850100 845205 841765 839417 838352 839309 842854 848769
59491 848769 856117 863916 871878 880627 891158 904055 919268 936477 955371 975592 996812 1019024
59479 1019024 1042482 1067224 1092864 1119051 1145867 1173632 1202537 1232596 1263550 1294374 1323078
59468 1323078 1347553 1366879 1381655 1393033 1401704 1408152 1413801 1421530 1434651 1455308 1483972 1520354
59456 1520354 1564296 1615519 1672897 1734608 1799000 1864925 1931370 1997460 2063149 2129524 2197969
59445 2197969 2268803 2340281 2408151 2465803 2505447 2520197 2505970 2462323 2392395 2302334 2199932
59434 2199932 2092543 1985383 1881341 1781952 1688326 1601417 1521941 1450326 1386781 1331431 1284362
59423 1284362 1245509 1214619 1191510 1176259 1168663 1167447 1170425 1175781 1182978 1192152 1202931 1214243
59411 1214243 1225084 1235014 1243899 1251486 1257183 1259826 1257592 1248608 1232115 1209122 1181890 1152834 1123852
59398 1123852 1096302 1071179 1049129 1030375 1014610 1000844 987361 972186 954043 933134 910911
59387 910911 889005 868363 849234 831618 815381 800164 785611 771852 759518 749200 741008 734673
59375 734673 729886 726405 723970 722294 721109 720217 719505 718949 718602 718673 719644 722074 726125 731386 737355 744023
59359 744023 751781 761001 771999 785257 801185 819678 840280 862752 887076 912940 939800 967596
59347 967596 996800 1027446 1058625 1089317 1119302 1148729 1177076 1203118 1225807 1244689 1259475
59336 1259475 1269686 1274791 1274365 1267952 1255129 1235963 1211359 1182751 1151413 1118046 1083025 1046902
59324 1046902 1010518 974618 939624 905956 874322 845340 819024 795120 773875 755870 741043
59313 741043 728483 717480 708192 700896 695177 690472 687037 685646 686481 688888 692151 695986 700316 705146
59299 705146 710705 717233 724518 732052 739772 748270 758059 768872 779650 788833 794697 796086 793361 788472
59285 788472 783668 780071 777542 775672 774590 774882 777110 781594 788536 798043 809917 823576 838443 854472
59271 854472 872083 891481 912186 933340 954258 974417 993059 1009176 1021945 1031055 1036584 1038718
59259 1038718 1037539 1032955 1024851 1013391 999124 982707 964704 945809 927015 909250 892919 878117
59247 878117 865192 854768 847226 842428 839989 839524 840676 843249 847471 853838 862584 873379 885519
59234 885519 898162 910471 921924 932561 942548 951350 957695 960602 960098 956629 950071 939815 925754
59221 925754 908767 890119 870669 850788 830774 811081 792206 774535 758306 743532 729908
59210 729908 716995 704713 693588 684313 677032 671241 666354 662075 658153 654217 650180 646500 643616
59197 643616 641275 638905 636570 634976 634420 634316 633983 633475 633213 633156 632867 632342 632296 633489 636094 639803 644296
59180 644296 649319 654484 659409 664289 670102 677901 687837 699080 710790 722896 735835 749881 765060
59167 765060 781484 799209 817794 836468 854794 872780 890218 906404 920664 932713 942175 948202
59155 948202 950130 948257 943492 936291 926422 913753 898822 882493 865365 847720 829861 812343
59143 812343 795882 780975 767455 754562 741710 729142 717550 707108 697326 687857 678949 670894
59131 670894 663599 657140 652287 649768 649159 649145 649012 649348 651154 654780 659943 666285 673435 680981 688962
59116 688962 698193 709473 722421 735617 748010 759744 771448 783234 794748 805816 816540 826895
59104 826895 836772 846326 855886 865432 874572 883195 891724 900415 908669 915381 919863 922134 922478 921187
59090 921187 918766 915990 913460 911312 909420 907640 905646 902831 898706 893232 886521 878424 868802 857981
59076 857981 846493 834485 821926 809312 797460 786488 775723 764853 754447 744927 735831 726780
59064 726780 718544 712279 708040 704940 702511 700957 700181 699542 698730 697966 697171 695773 693627 691290 689026
59049 689026 686315 682780 678833 674940 670958 666829 663174 660419 657904 654729 651122 648102 646079 644678
59035 644678 643815 643975 645322 647381 649887 653290 658094 664162 670982 678274 686039 694319 703175 712751 723185
59020 723185 734510 746705 759677 773142 786656 799774 812147 823532 833846 843125 851279 858073
59008 858073 863529 868205 872882 878074 883996 890763 898444 907154 917336 929583 943867 959250 974830
58995 974830 990726 1007658 1025715 1044015 1061365 1076816 1089801 1100303 1108797 1115433 1119347 1119365 1115330
58982 1115330 1108159 1098666 1087041 1073520 1058885 1044108 1030077 1017793 1008147 1001216 996335 993143
58970 993143 992023 993252 996376 1000867 1006884 1014802 1024323 1034565 1044853 1055036 1065148 1075154 1084896
58957 1084896 1093923 1101324 1105961 1106964 1104084 1097721 1088656 1077565 1064705 1050154 1034242 1017513 1000438
58944 1000438 983513 967533 953214 940535 929040 918892 911047 906117 903566 902318 901596 900795 899004
58931 899004 895285 889272 881134 871139 859617 847148 834417 821923 809974 798730 788094 777873
58919 777873 768342 760378 754766 751527 750155 750224 751515 753897 757477 762622 769464 777539 786281 795634 805891
58904 805891 817179 829612 843770 860551 880534 903756 929994 958795 989253 1020254 1051126
58893 1051126 1081911 1112973 1144631 1177179 1211007 1246482 1283787 1322797 1362920 1403066 1442020
58882 1442020 1478950 1513446 1545014 1572686 1595183 1611333 1620286 1621512 1614845 1600555 1579144 1550893
58870 1550893 1515713 1473831 1426719 1377025 1327272 1278717 1231598 1186170 1143114 1103131 1066701
58859 1066701 1034217 1005828 981014 958719 938095 918900 901124 884594 869087 854551 841096
58848 841096 828924 818198 808667 799568 790323 781291 773249 766162 759077 751342 743249 735360 727927 721255
58834 721255 715880 711809 708157 704087 699735 695731 692275 689220 686655 684766 683348 682063 681100 681161 682785
58819 682785 685917 689985 694211 698179 702271 707216 713021 718798 723814 728087 731632 733864 734380 733730 732694
58804 732694 731265 729037 726125 722921 719327 715141 710923 707587 705287 703553 702362 702140 702724 703266 703390
58789 703390 703719 705043 707602 711327 716110 721670 727713 734387 741984 750073 757603 764073 770032 776135
58775 776135 782313 788176 793638 798711 803098 806470 808922 810823 812390 813694 814895 816223 817809 819619
58761 819619 821371 822525 822623 821750 820470 819363 818891 819661 822286 826768 832387 838429 844812 851811 859388
58746 859388 867014 874078 880450 886750 893962 902522 911784 920638 928597 936030 943458 951069 958822 966491
58732 966491 973500 979267 984029 988972 995257 1003143 1012206 1022124 1032847 1044196 1055635 1066513 1076412
58719 1076412 1085275 1093271 1100572 1107285 1113621 1119974 1126668 1133722 1140901 1147855 1154035 1158718 1161469 1162469
58705 1162469 1162085 1160204 1156294 1149986 1141235 1129934 1115776 1098627 1078831 1057112 1034278 1010903
58693 1010903 987149 963116 939535 917765 898682 881839 866172 851288 837509 824932 813187
58682 813187 802038 791461 781016 769989 758531 748058 740016 734547 730735 727852 725982 725558 726738
58669 726738 729373 733411 739051 746335 754787 763865 773818 785591 799590 814985 830541 845581 859617
58656 859617 871670 880857 887344 891854 894416 894554 892612 889856 886993 883488 878651 872715 866531 860832
58642 860832 856074 852446 849731 847615 846267 846125 847084 848557 850445 853259 857103 861327 865577 870402 876295
58627 876295 882740 888710 893750 898174 902600 907560 913147 918825 924073 929406 936167 945145 956124 969004
58613 969004 984394 1002519 1022305 1042286 1061767 1080367 1096980 1110116 1119018 1123848 1125063 1123257
58601 1123257 1119276 1113805 1106963 1098796 1089904 1081111 1072786 1065047 1058317 1053145 1049767 1048346 1049292 1052688
58587 1052688 1057748 1063644 1070667 1079829 1091424 1104780 1119395 1135451 1152992 1171348 1189755 1208001
58575 1208001 1226083 1243565 1259699 1274017 1286580 1297693 1307534 1316070 1323331 1329789 1336337 1343753
58563 1343753 1352294 1361893 1372521 1384084 1396188 1408353 1420385 1432214 1443367 1452852 1459544 1462527
58551 1462527 1461254 1455741 1446715 1435309 1422489 1408778 1394384 1379394 1363900 1348111 1332375 1316929
58539 1316929 1301640 1286038 1269576 1251904 1233131 1213970 1195506 1178628 1163711 1150890 1140485
58528 1140485 1133004 1128742 1127458 1128399 1130720 1134019 1138466 1144356 1151613 1159830 1168589 1177524 1186266 1194616
58514 1194616 1202518 1209539 1214719 1217578 1219008 1220412 1222001 1222750 1222074 1220663 1219439 1218603 1218186 1218747 1220837
58499 1220837 1224260 1228375 1232714 1236899 1240480 1243426 1246310 1249521 1252702 1255423 1257879 1260309 1262264 1263251
58485 1263251 1263764 1264812 1266566 1268324 1269798 1271593 1274238 1277521 1281208 1285827 1292066 1299565 1306831 1312438
58471 1312438 1315906 1317202 1315805 1310879 1302391 1291447 1279232 1266041 1251745 1236641 1221204 1205453
58459 1205453 1189480 1174357 1161502 1151094 1142075 1133878 1127255 1123114 1121450 1121703 1123290 1125280 1126348
58446 1126348 1125719 1123596 1120345 1115918 1110476 1104756 1099254 1093748 1088205 1083497 1080574 1079519 1080033 1082238
58432 1082238 1086310 1091855 1098357 1105825 1114442 1123977 1134145 1145085 1157031 1169998 1184197 1200048
58420 1200048 1217159 1233953 1248950 1261815 1272534 1280440 1285051 1287268 1288589 1289390 1288809 1286053 1280983
58407 1280983 1273730 1264592 1254205 1243100 1231244 1218516 1205374 1192578 1180642 1170003 1161203 1154340
58395 1154340 1148907 1144720 1142328 1141822 1142013 1141708 1141112 1140975 1140995 1140243 1138720 1137300 1136301 1135187 1133568 1131640
58379 1131640 1129775 1128445 1128248 1129236 1130565 1131626 1133097 1136021 1140301 1145037 1149912 1155179 1160705 1166164
58365 1166164 1171993 1178992 1187150 1195837 1204974 1215000 1225862 1237053 1248474 1260260 1271884 1282431
58353 1282431 1291589 1299421 1305344 1308497 1309101 1308405 1307275 1305739 1303921 1302461 1301913 1302528 1304671 1308777 1314898
58338 1314898 1322823 1332428 1343402 1355109 1367397 1380999 1396290 1412252 1427645 1442659 1458312 1474686
58326 1474686 1490908 1506359 1520727 1533312 1543567 1552120 1560096 1567749 1574871 1582045 1590114 1598747 1607002
58313 1607002 1615196 1624879 1636973 1651078 1666509 1682893 1699914 1717504 1736107 1755883 1776103 1796201
58301 1796201 1816661 1837743 1858309 1877363 1895844 1915129 1934545 1952405 1968917 1986030 2004708
58290 2004708 2024365 2044728 2066208 2088516 2110908 2133835 2158542 2185057 2212301 2239989 2268594
58279 2268594 2297694 2326330 2354890 2384738 2416068 2448036 2480741 2515054 2550779 2587175 2625127
58268 2625127 2666538 2711630 2759005 2808242 2860192 2914879 2971483 3030314 3092435 3157404 3223809
58257 3223809 3291851 3362863 3436482 3510965 3586129 3663169 3741816 3820775 3900943 3984965 4073513
58246 4073513 4165296 4260910 4363202 4473417 4590384 4713960 4845792 4986202 5133998 5290047
58236 5290047 5457433 5637362 5828606 6031711 6249894 6484811 6735347 7001690 7286874
58227 7286874 7593339 7921935 8275364 8658699 9075459 9527153 10017488 10552861 11138173
58218 11138173 11776970 12476566 13248095 14100905 15042661 16086332 17251685 18559266 20029909
58209 20029909 21692800 23589313 25769684 28295733 31252330 34753626 38940503 43979821
58201 43979821 50058902 57351182 65954888 75843378 86857498 98738888 111197925 124008150
58193 124008150 137086117 150505505 164455301 179197521 195021302 212127157 230448303
58186 230448303 249526057 268499724 286127503 300804227 310749388 314511975 311566468
58179 311566468 302527612 288793339 271931378 253251110 233688164 213853935 194131812
58172 194131812 174808410 156192796 138629763 122410489 107697360 94534784 82897666
58165 82897666 72714033 63870631 56231374 49657858 44013089 39161938 34983402 31380029
58157 31380029 28270444 25579426 23240709 21202015 19419797 17852874 16465462 15231133
58149 15231133 14128578 13137022 12239133 11423839 10682207 10003953 9380720 8808702 8284854
58140 8284854 7803924 7361659 6957016 6588355 6250823 5939899 5654004 5391214 5146913
58131 5146913 4917321 4702192 4501608 4313186 4134808 3967038 3810385 3662897 3522891
58122 3522891 3391291 3268877 3153682 3043500 2938721 2840436 2747818 2659491 2575526 2496086
58112 2496086 2419986 2346414 2276262 2210141 2146954 2085991 2028350 1974601 1923089 1872386 1823522
58101 1823522 1777934 1734934 1693092 1652547 1614128 1577523 1542023 1507909 1475626 1444756 1415034
58090 1415034 1387070 1360952 1335523 1310162 1285785 1262976 1240740 1218348 1196814 1177165 1158785
58079 1158785 1140861 1123921 1108438 1093265 1077026 1059966 1043021 1026250 1009520 993582 979066
58068 979066 965342 951585 938003 924988 912190 899550 888022 878153 869070 859952 851257 843361
58056 843361 835313 826295 817061 808489 799847 790083 779893 770915 763528 756824 750138 743402 736573 729828
58042 729828 723715 718155 712064 704887 697659 691534 686164 680637 675037 669868 664765 659119 653310 648065
58028 648065 643178 638074 633075 628917 625432 621820 617815 613670 609431 605142 601309 598294 595676 592923
58014 592923 590104 587248 583738 579251 574645 571067 568709 567098 565848 564374 561784 557993 554198 551343
58000 551343 548960 546424 544390 543814 544352 544909 545128 545224 545071 544625 544613 545595 546949 547921 548962 550703 552355
57983 552355 552657 551911 551507 551718 551574 550759 550088 549923 549518 548216 546218 543930 541571 539579 538438 537878 537104
57966 537104 536017 535459 535984 537080 537810 537731 537015 536099 535246 534162 532111 528759 524697 520814 517451 514502
57950 514502 511838 509154 505913 502031 498182 494890 491853 488786 486253 484831 484051 483163 482430 482645 483652
57935 483652 484482 484724 484856 485310 486165 487643 489973 492738 495171 497071 498770 500321 501420 502026 502319 502146
57919 502146 501156 499356 496887 493507 489038 484096 479628 475891 472539 469449 466670 463825 460473 456909
57905 456909 453779 451079 448378 445830 443997 442704 441039 438467 435074 430782 425374 419506 414698 411867
57891 411867 410502 409563 408586 407633 406758 405877 404920 403984 403494 403992 405344 406402 405997 404146 401820 399829 398473
57874 398473 397870 397748 397156 395311 392641 390163 388010 385480 382444 379625 377348 375086 372546 370267 368724
57859 368724 367642 366662 366006 365956 366214 366305 366351 367004 368801 371726 375256 378741 381928 385146 388790 392832 397044
57842 397044 401380 405678 409305 411782 413572 415557 417789 419395 419688 418744 416923 414466 411635 408624 405291
57827 405291 401497 397726 394732 392512 390164 386872 382598 377889 373482 369963 367271 364657 361724 359294
57813 359294 358508 359244 360236 360639 360609 360324 359405 357525 354768 351154 346561 341243 335753 330197 324289 318237
57797 318237 312713 307823 302963 297955 293397 289557 285814 281669 277545 274037 271024 268097 265334 263162
57783 263162 261845 261423 261725 262237 262507 262924 264409 267099 270064 272676 275440 278938 282724 285992 288784
57768 288784 291737 295063 298443 301653 304668 307358 309580 311344 312505 312640 311720 310512 309744 309172 308045
57753 308045 306253 304382 302785 301296 299874 298856 298439 298364 298322 298278 298231 298009 297539 297041 296659 296073 294850 293122
57735 293122 291543 290442 289421 288159 287261 287636 289068 290181 290155 289786 290316 291695 292698 292452 291209 289789
57719 289789 288902 288897 289541 290066 289841 288913 287548 285657 283230 280918 279309 277943 275912 273262 270828 268801
57703 268801 266516 263719 260995 258752 256798 255108 254005 253338 252539 251801 252084 253462 254580 254423 253667 253513
57687 253513 254092 254841 255698 257105 259481 263545 270564 281329 295285 311371 329229 348833 369461
57674 369461 390072 410472 431318 453256 476839 503013 532663 565624 600731 636595 671331
57663 671331 701412 721847 728376 719707 697818 666468 629414 589419 548388 508028 470064 435803
57651 435803 405803 380074 358268 339589 323098 308470 296070 286087 278040 271443 266325 262605
57639 262605 259553 256488 253538 251122 249125 247251 245764 245091 244972 244867 244954 245845 247367 248488 248623 248246
57623 248246 247948 247541 246430 244425 241836 239013 236134 233366 231049 229543 228785 228073 226624 224440 222285
57608 222285 220760 219887 219765 220879 223204 225542 226498 225861 224368 222449 219928 216816 213655 211003 209071
57593 209071 207777 206636 204768 201658 197897 194552 191841 189018 185603 182069 179142 176917 174880 172477
57579 172477 169559 166513 163912 161793 159497 156633 153911 152413 152220 152454 152513 152393 151828 150190 147688 145762
57563 145762 145604 146730 147609 147347 146188 144681 143027 141266 139607 138377 137826 138075 139071 140539 142056 143269
57547 143269 144118 144841 145714 146737 147676 148420 149125 149874 150427 150577 150565 150880 151712 152862 154024 154969 155569 155906
57529 155906 156188 156331 155947 155097 154693 155530 157115 158141 158033 157387 156924 156755 156888 157623 159026 160518 161488
57512 161488 161942 162154 162079 161593 161049 161100 162063 163774 165877 167933 169403 169984 169980 169898 169648 168497 166039 162878
57494 162878 160031 157849 155852 153631 151451 149753 148335 146463 143718 140398 137053 133998 131399 129455
57480 129455 128191 127288 126408 125573 125021 124868 125085 125569 125955 125578 124080 122045 120613 120391 120959 121446 121353 120797
57462 120797 120196 119919 120151 120899 121984 122954 123180 122416 121265 120753 121255 122166 122792 123129 123533 124012 124296 124269
57444 124269 123887 122963 121568 120419 120290 121080 121956 122348 122360 122224 121926 121399 120666 119733 118745 118213 118582 119480
57426 119480 119912 119423 118680 118667 119585 120807 121697 122196 122610 122990 122852 121668 119556 117245 115244 113381 111422
57409 111422 109736 108935 109047 109492 109704 109422 108594 107483 106695 106619 106955 107254 107693 108704 110008 110756 110667 110326
57391 110326 110267 110413 110582 110879 111308 111512 111234 110673 110150 109796 109763 110283 111271 112219 112733 112918 113086 113364 113764
57372 113764 114334 115058 115770 116294 116543 116575 116739 117572 119158 120784 121702 122064 122521 123090 123175 122712 122428 122767 123327
57353 123327 123604 123627 123558 123404 123476 124432 126359 128393 129777 130747 131900 133224 134347 135276 136251 137162 137738 138034
57335 138034 138203 137989 137015 135463 134016 133222 133233 133951 135038 136028 136873 138206 140601 143710 146557 148664
57319 148664 150405 152284 154244 155844 156871 157611 158564 159906 161309 162382 163236 164332 165833 167443 168906
57304 168906 170279 171614 172846 174119 175797 177909 180009 181805 183496 185306 187139 188944 190894 192950
57290 192950 194845 196779 199425 202793 205764 207422 208229 209223 210698 212498 214990 218567 222479 225285 226523
57275 226523 227037 227591 228031 227875 226932 225186 222854 220721 219680 219709 219988 220193 220920 222513 224322 225697 227055
57258 227055 229368 232919 237116 241222 244913 248418 252560 258280 265575 273105 279355 284141 288549 293581
57244 293581 299311 305315 311295 317083 322480 327482 332513 338156 344646 351806 359390 367327 375636 384216
57230 384216 392875 401516 410291 419584 429775 440920 452562 463985 474714 484772 494448 503983 513567
57217 513567 523406 533512 543567 553370 563390 574531 587317 601621 617182 633961 651913 670846
57205 670846 690805 712219 735415 760241 786254 812828 838891 863173 885216 905800 925901
57194 925901 945600 964496 982714 1000740 1018440 1035132 1050704 1066006 1081919 1098514 1115230
57183 1115230 1131466 1146950 1162017 1177684 1194969 1213904 1233523 1252902 1271827 1290503 1309274
57172 1309274 1328904 1350578 1375042 1402010 1430723 1460850 1492468 1525425 1559239 1593611 1628600
57161 1628600 1664215 1700111 1735860 1771413 1807123 1843351 1880096 1917055 1954016 1991112 2028580
57150 2028580 2066288 2103557 2139545 2173869 2206959 2239825 2273337 2307579 2341916 2375660 2408514
57139 2408514 2440359 2470992 2500348 2528774 2556677 2584035 2610589 2636539 2662686 2689912 2718782
57128 2718782 2749603 2782495 2817303 2853862 2892489 2934000 2979034 3027544 3079005 3132869 3188616
57117 3188616 3245582 3303042 3360551 3418300 3477341 3539554 3607171 3682120 3765657 3858445 3960867
57106 3960867 4073803 4200232 4346983 4525025 4747765 5029089 5383085 5825147 6372270
57097 6372270 7041409 7846934 8798606 9900367 11150036 12540807 14063718 15706168 17441607
57088 17441607 19214658 20936871 22506660 23849294 24954689 25889693 26777677 27756152
57080 27756152 28930840 30342290 31953720 33660015 35311543 36745605 37820028 38441563
57072 38441563 38578527 38251750 37511159 36414039 35015067 33365528 31514492 29509602
57064 29509602 27398867 25232769 23063768 20942632 18914055 17013565 15265789 13683914
57056 13683914 12270655 11020507 9922244 8961126 8121041 7386334 6742654 6176786 5676491
57047 5676491 5231005 4831729 4472206 4147279 3852218 3582565 3334693 3106228 2895749
57038 2895749 2702190 2524665 2362758 2216562 2086169 1971065 1869903 1780795 1702040 1632883
57028 1632883 1573599 1524660 1485956 1457012 1437600 1427518 1425868 1431044 1441138 1453213 1461909 1460062
57016 1460062 1442088 1407041 1358182 1300078 1236511 1170353 1103959 1039065 976684 917364 861470
57005 861470 809419 762005 720386 685245 655944 630907 608853 589355 572287 557307 544078
56994 544078 532552 522762 514568 507663 501569 495555 489097 482665 477638 475039 474560 475144 476180 477600
56980 477600 479011 479388 477797 473925 467676 458831 447624 435415 424142 414971 407826 402201 397884 394682
56966 394682 392018 389474 387516 387081 388429 391000 394524 399669 407187 416782 427181 437030 445251 450828
56952 450828 452941 451432 446768 439492 430133 419645 409300 399798 390912 382426 375059 369938 367390 366808
56938 366808 367615 369705 372886 376641 380869 386373 394082 404028 415463 427632 439731 450219 456893
56925 456893 458009 453051 442488 427372 409372 390497 372081 354190 336339 318613 301708 286179
56913 286179 272209 260019 249893 241617 234335 227286 220524 214697 210187 206662 203462 200363 197853
56900 197853 196589 196672 197697 199539 202668 207446 213425 219800 226357 233542 241657 250529 260020 270317
56886 270317 281444 292905 304127 315018 325659 335504 343290 347967 349650 349516 348746 347728 346467
56873 346467 345598 346590 350653 357709 366669 376532 386980 398182 410561 424738 441302 460445 481993
56860 481993 505670 531024 557104 582489 605589 624660 637738 643211 640819 631934 618861 604042
56848 604042 589680 577470 568332 562665 560915 563621 570921 582409 597605 616208 637830 662034
56836 662034 688893 719106 753236 790940 830856 870647 906815 935036 951460 954007 942665 919165
56824 919165 886664 849171 810346 772573 737215 705489 678639 657288 641074 629215 621403 618060
56812 618060 619710 626196 636755 650973 669342 692366 719046 746525 771160 789574 798988 797567
56800 797567 785182 763595 735523 703571 669944 636474 604323 573924 545587 520070 498326
56789 498326 480962 468098 459456 454364 452061 452324 455522 461762 470341 480238 490660 500646 508597 512773
56775 512773 512041 505779 493583 475864 454407 431452 408127 384374 360334 337049 315582 296140
56763 296140 278409 262331 248162 236088 226106 218130 211942 207057 202798 198533 193881 188878 184032
56750 184032 180061 177361 175591 173801 171151 167679 164250 161565 159368 157042 154731 153174 152341 151178
56736 151178 149181 147411 147166 148176 149017 148950 148367 147635 146602 145446 144957 145514 146468 147020 147185 147370 147590
56719 147590 147689 148013 149158 151061 152924 154118 154760 155195 155304 154719 153590 152728 152781 153541 154382 155164 156220
56702 156220 157479 158185 157815 156852 156207 156161 156316 156409 156642 157248 158149 159077 159761 159989 159774 159474 159503 159896 160324
56683 160324 160472 160242 159707 159061 158498 158023 157524 157152 157271 157762 157840 156990 155739 154990 154930 155158 155575 156374 157358
56664 157358 158121 158850 160067 161496 162156 161854 161711 162673 164220 165171 165185 164847 164719 165071 166225 168342 170776
56647 170776 172290 172194 171013 169936 169831 170815 172496 174343 175874 176702 176638 175876 175010 174658 175051 176066 177579
56630 177579 179508 181466 182711 182664 181440 179789 178558 178150 178225 177887 176384 173838 171194 169326 168306 167615
56614 167615 166955 166630 167053 168037 168768 168640 167974 167691 168288 169401 170401 171055 171435 171562 171490 171508 171916 172700 173654
56595 173654 174634 175451 175855 175941 176241 176981 177545 177223 176272 175646 175815 176472 177336 178527 180046 181487 182478 183008
56577 183008 183219 183265 183473 184210 185556 187420 189878 192932 196033 198461 200238 202046 204184 206252 208067
56562 208067 210183 213168 216854 220678 224381 228045 231745 235428 238893 241825 244121 246148 248294 250326
56548 250326 251774 252856 254288 256099 257494 258103 258511 259123 259403 258827 257831 257053 256198 254493 251886 249018
56532 249018 246307 243776 241595 240028 238859 237494 235676 233692 231890 230365 229051 227763 226248 224523
56518 224523 223075 222310 221947 221359 220516 220122 220649 221458 221166 218967 215649 213134 212758 214052 215493 216287 216880
56501 216880 217767 218625 218985 219082 219381 219712 219500 218579 217250 215786 214364 213236 212437 211531 210201 208927 208506
56484 208506 208993 209739 210425 211498 213415 215918 218301 220098 221343 222313 223121 223587 223545 223308 223512 224322 225073
56467 225073 225048 224416 224032 224371 225025 225286 224946 224515 224763 225998 227672 228828 229073 228973 229429 230823 232813
56450 232813 234626 235436 234843 233283 231728 230778 230317 230134 230369 231020 231527 231377 230827 230569 230892 231587 232418 233253
56432 233253 233956 234563 235351 236364 237148 237335 237198 237147 236984 236309 235399 235050 235574 236576 237728 239225 241319
56415 241319 243852 246343 248257 249147 248905 247965 247043 246642 246871 247591 248476 249140 249487 249833 250463 251222 251777 252078
56397 252078 252266 252380 252361 252128 251435 250078 248538 247928 248822 250468 251634 251888 251575 251027 250519 250639 251878
56380 251878 253937 256051 257859 259335 260175 260088 259616 259833 261095 262710 263979 264903 265858 267147 268974 271252
56364 271252 273357 274668 275439 276537 278183 279584 280065 279935 279861 279868 279439 278414 277420 277383 278685 280779 282654
56347 282654 283722 284132 284212 284027 283737 283940 285069 286705 288009 288649 288883 289071 289634 291157 293738 296456 298228
56330 298228 299101 299934 300969 301613 301648 301718 302388 303474 304594 305735 306959 308115 309112 310055 310974 311847 312923
56313 312923 314481 316247 317638 318622 319718 321114 322498 323914 325972 328915 332146 335083 337899 341044
56299 341044 344511 347941 351091 353830 356062 357913 359769 361931 364370 366839 368955 370370 371325 372860
56285 372860 375816 379677 383098 385652 388359 392295 397350 402583 407231 411139 414722 418725 423670 429440
56271 429440 435716 442562 449933 456975 462786 467826 473482 480138 486809 492923 499251 506534 514320 521955
56257 521955 529824 538774 548972 560140 572389 586037 601046 617298 635133 655088 677445 702434
56245 702434 730362 760990 793175 825768 858547 891851 925555 958864 990812 1020689 1048243
56234 1048243 1073696 1097159 1117827 1134252 1145597 1152034 1153653 1149807 1140043 1125045 1106070 1083927
56222 1083927 1059055 1032006 1003241 972836 941068 908975 877841 848352 820570 794348 769370
56211 769370 745309 722405 701489 682943 666087 650106 635217 622287 611602 602513 594199 586298
56199 586298 578923 572372 566784 561988 557792 554289 551534 549117 546612 544303 542722 541633 540450 539630
56185 539630 540412 542875 545452 546879 547533 548246 548956 549371 549965 551290 553047 554702 556354 558196 559846 561113
56169 561113 562731 565458 568943 572323 575387 578424 581581 585114 589591 594987 600261 604750 609315 615166
56155 615166 622162 629292 636183 643115 650100 657134 664975 674563 685958 698760 713171 729700 748281
56142 748281 768678 791365 816972 845366 876324 910676 949599 993127 1040456 1091299 1145753
56131 1145753 1203246 1263043 1325526 1391536 1460345 1529569 1597191 1662499 1724947 1783299 1836229
56120 1836229 1882899 1922788 1955877 1982968 2004741 2020358 2027992 2027035 2018917 2005552 1987861 1966103
56108 1966103 1940726 1912291 1880922 1846221 1807535 1764374 1716928 1666153 1613141 1558681 1503786
56097 1503786 1450171 1399552 1352805 1310289 1272551 1239982 1212263 1188891 1169909 1155386 1144600
56086 1144600 1136492 1130560 1126677 1124577 1124279 1126394 1131053 1137072 1143096 1149088 1155771 1163234 1171101 1179449
56072 1179449 1188451 1197699 1207087 1217707 1230577 1245019 1259669 1274546 1290639 1307880 1325139 1342059
56060 1342059 1359407 1377663 1396592 1416114 1436305 1456665 1476588 1496371 1516617 1536911 1556343
56049 1556343 1575012 1593765 1612809 1631950 1651819 1673390 1696545 1720461 1745092 1770986 1798077
56038 1798077 1826082 1855596 1887314 1920585 1954225 1988222 2023197 2058970 2095370 2133665 2175140
56027 2175140 2218912 2263227 2308327 2355908 2406321 2458551 2512461 2568719 2627041 2686868 2749280
56016 2749280 2815691 2885208 2956001 3028748 3105736 3186886 3269980 3354839 3444034 3539148 3639482
56005 3639482 3744745 3855898 3972823 4094264 4220673 4354260 4495807 4644407 4800709
55996 4800709 4967259 5145140 5333385 5532126 5743177 5967311 6204512 6457278 6729947
55987 6729947 7024251 7339320 7676578 8040707 8435319 8862050 9324713 9829930 10382808
55978 10382808 10986564 11647491 12375753 13180495 14069380 15054378 16153303 17385124 18770013
55969 18770013 20336290 22123041 24176944 26555748 29339795 32637517 36582451 41333743
55961 41333743 47074943 53986052 62186231 71680899 82343301 93934068 106158190 118756135
55953 118756135 131590556 144675217 158150424 172258521 187317145 203615443 221221800
55946 221221800 239816383 258634267 276460657 291634811 302218281 306500020 303662985
55939 303662985 294125469 279268114 260791544 240200403 218648247 197005939 175941877
55932 175941877 155954267 137390371 120465414 105276435 91824186 80047530 69847686
55925 69847686 61091825 53617802 47254476 41840657 37228098 33280763 29882262 26941381
55917 26941381 24386032 22155301 20199101 18478465 16960171 15613235 14412312 13339534
55909 13339534 12379479 11515638 10733899 10025193 9381739 8794089 8254292 7758376 7303060
55900 7303060 6883098 6494234 6135633 5806749 5504386 5225003 4967269 4730099 4510628
55891 4510628 4306318 4116783 3941552 3778203 3624696 3481383 3348689 3224794 3107573
55882 3107573 2997035 2893898 2797410 2706436 2621140 2541708 2466592 2393640 2321900 2251115 2180779
55871 2180779 2111011 2043115 1978004 1915136 1854010 1795293 1739382 1685291 1632277 1581404 1534197
55860 1534197 1490729 1450139 1412019 1376210 1342169 1309600 1278915 1250205 1222553 1195117 1168022
55849 1168022 1141581 1115641 1090248 1065954 1042778 1019911 997055 975029 954463 934876 915654
55838 915654 896907 878862 861438 844900 829840 816082 802733 789663 777669 766797 755976
55827 755976 744858 734511 725534 717004 708103 699373 691438 683774 675747 667642 659671 651124 641548 631794
55813 631794 622955 615209 608440 602897 598407 594055 589550 585809 583389 581478 579398 577885 577861 579058 580916
55798 580916 583739 587784 592276 596453 600517 604374 606539 605723 602586 598498 593368 586268 577532 568627
55784 568627 560317 552338 544642 537589 531040 524378 517370 510132 502503 494306 485839 477244 467891 457409
55770 457409 446975 438477 432599 428585 425549 423053 420654 417984 415223 412691 410099 406885 403030 398820
55756 398820 394112 388671 382906 377457 372281 367012 361982 357946 354878 351847 348098 343618 338763 333991
55742 333991 329905 326894 324742 323005 321563 320393 319130 317416 315386 313302 311063 308631 306491 305015
55728 305015 303725 301842 299252 296335 293239 289970 286810 283949 281057 277854 274667 271819 269035 266226
55714 266226 264238 263805 264191 263929 262638 261120 259997 259309 259243 260094 261551 262951 264163 265318 265898 265218
55698 265218 263719 262472 261304 258671 253893 248461 244511 242760 242443 242562 242605 242469 242282 242207 242269 242547 243431
55681 243431 245226 247548 249635 251257 252826 254630 256515 258325 259996 261134 261169 260138 258813 257903 257585
55666 257585 257870 258840 260323 261868 263239 264516 265673 266577 267537 269310 272296 276087 279940 283339 286065
55651 286065 288221 290332 292917 295774 298087 299420 300083 300325 299680 297542 294012 289743 285129 280076 274556
55636 274556 268998 263938 259383 254721 249354 243360 237410 232089 227544 223700 220395 217237 213793 210159
55622 210159 206935 204431 202428 200934 200475 201104 201778 201454 200300 199064 197730 195769 193388 191413 189983
55607 189983 188379 186261 184130 182361 180639 178674 176761 175250 174044 172967 172101 171439 170673 169667 168791
55592 168791 168458 168581 168699 168506 168136 168048 168609 169634 170513 170964 171336 171892 172288 172281 172508 173695 175492 177028
55574 177028 178460 180857 184439 187977 190279 191442 192259 193206 194420 196007 197827 199400 200340 200537 199855
55559 199855 198270 196435 195356 195115 194548 192535 189090 184935 180765 177311 175370 175015 175191 174719 173425
55544 173425 171806 169984 167627 164751 162017 160151 159250 158719 157853 156620 155796 156040 157007 157870 158591 159925
55528 159925 162081 164209 165524 166163 166495 166360 165572 164589 163956 163523 162855 162035 161414 160885 160061 159023 158286
55511 158286 158084 158111 157906 157148 155736 153920 152211 150857 149642 148451 147725 147966 149036 150385 151683 152845
55495 152845 153697 154085 154130 153921 153187 151783 150287 149530 149562 149632 149222 148599 148224 148095 147915 147649 147606 148044 148889
55476 148889 149847 150715 151449 151862 151541 150326 148787 147768 147428 147144 146496 145812 145577 145842 146524 147731 149277
55459 149277 150305 150056 148804 147510 146745 146497 146794 147839 149455 151013 152072 152703 153095 153172 152763 151880 150700
55442 150700 149460 148424 147792 147602 147835 148542 149685 150891 151670 151924 152126 152881 154332 155935 156852 156709 156061
55425 156061 155934 156794 158135 159172 159701 160121 160837 161881 162944 163601 163650 163415 163519 164166 164826 164875 164353 163817
55407 163817 163626 163637 163511 163048 162213 161023 159481 157560 155339 153113 151246 149909 149110 148908 149311 150054 150778
55390 150778 151373 151720 151300 149737 147701 146463 146333 146384 145998 145718 145979 146043 145183 144164 144315 145512 146349 146196
55372 146196 145894 146265 147041 147653 148186 148992 149913 150449 150396 149984 149559 149309 149101 148563 147612 146832 146939 147894 148987
55353 148987 149791 150502 151257 151721 151598 151105 150662 150444 150456 150705 151049 151152 150858 150383 149979 149660 149445 149590 150246
55334 150246 151064 151451 151213 150770 150718 151284 152230 153194 153947 154257 153687 151977 149731 148318 148706 150553 152663
55317 152663 154078 154492 154002 152985 151999 151280 150468 149280 148208 147960 148354 148513 148161 147982 148542 149540 150410
55300 150410 151026 151512 151883 152262 152922 153729 154001 153400 152599 152567 153386 154229 154410 154071 153892 154391 155481 156550
55282 156550 156989 156747 156269 155871 155466 154957 154551 154460 154536 154435 153977 153128 151941 150760 150276 151020 152799 154829
55264 154829 156351 157047 156994 156469 155724 154852 153920 153212 153115 153670 154461 155098 155581 156045 156387 156360 155868 154952 153646
55245 153646 152085 150601 149523 148919 148668 148666 148838 149010 148937 148440 147562 146711 146587 147628 149480 151247 152364
55228 152364 152974 153387 153582 153438 153070 152607 151916 150896 149867 149312 149377 149839 150401 150792 150779 150399 150079 150252 150993
55209 150993 152167 153667 155205 156201 156401 156345 156708 157286 157288 156623 156181 156608 157396 157640 157250 156887 156935 157055 156796
55190 156796 156215 155765 155818 156350 156931 156967 156202 155095 154498 154798 155497 155867 155891 156281 157534 159281 160712 161402
55172 161402 161510 161361 161148 160973 160842 160561 159947 159250 159135 160025 161583 163062 164078 164898 166017 167570 169225
55155 169225 170525 171235 171304 170608 168962 166553 164234 163014 163184 164099 164893 165209 165133 164625 163398 161386 159153
55138 159153 157562 156954 156759 156113 154826 153579 153078 153318 153854 154478 155248 156021 156432 156398 156243 156297 156666 157382
55120 157382 158364 159140 159085 158166 157143 156839 157467 158742 160234 161380 161583 160767 159616 158956 159077 159848 161163
55103 161163 162839 164341 165102 165111 164886 164900 165265 165811 166214 166167 165746 165427 165393 165051 163753 161950 160986 161613 163180
55084 163180 164576 165534 166586 167949 168996 168980 167993 166925 166475 166447 166203 165647 165394 165879 166712 167240 167495 168114
55066 168114 169385 170777 171525 171377 170642 169789 169175 168970 169115 169376 169557 169671 169867 170268 170894 171624 172192 172292
55048 172292 171831 171083 170516 170372 170399 170094 169256 168181 167230 166371 165420 164579 164339 164808 165541 166136 166628 167097 167351
55029 167351 167349 167562 168423 169637 170468 170612 170438 170436 170866 171819 173203 174646 175763 176515 177090 177539 177849 178218 178787
55010 178787 179263 179312 179257 179832 181168 182656 183888 185127 186603 187893 188385 187969 186969 185811 185003 184965 185462
54993 185462 185648 185123 184593 184937 185930 186486 186026 185031 184253 183908 183724 183358 182664 181866 181486 181848 182628 183207 183428
54974 183428 183627 183951 184100 183890 183597 183534 183597 183526 183338 183201 183092 182869 182575 182363 182173 181743 181038 180449 180487 181314
54954 181314 182585 183708 184307 184485 184625 184874 184922 184436 183650 183313 183981 185470 187139 188635 190109 191707 193127
54937 193127 193957 194290 194673 195437 196380 197228 198020 198841 199524 200062 201031 203086 206076 209243 212251 215478 219178
54920 219178 223050 226939 231314 236507 241915 246631 250542 254161 257528 260022 261243 261385 260626 258783 255820
54905 255820 252138 248079 243584 238681 233867 229600 225764 222050 218621 215932 213999 212257 210153 207684
54891 207684 205427 204183 204421 205800 207420 208708 209893 211453 213456 215730 218328 221323 224328 226780
54877 226780 228728 230934 234102 238231 242676 246640 249752 252394 255271 258365 260637 261140 260067 258191
54863 258191 255674 252258 248291 244479 240618 235716 229752 224248 220469 217903 215289 212504 210527 209889
54849 209889 210033 210079 209556 208410 206856 205286 203942 202700 201408 200259 199475 198879 198186 197552 197393 197774 198402
54832 198402 199059 199636 199847 199411 198481 197554 196960 196726 196807 197084 197265 197173 197021 197065 197139 197007 196941 197380 198093 198337
54812 198337 197900 197441 197623 198385 199216 199761 200037 200330 200958 201818 202267 201877 201203 201189 201844 202205 201726 200958 200527
54793 200527 200219 199645 199173 199506 200615 201717 202164 201855 200969 199846 199104 199344 200585 202215 203605 204604 205488
54776 205488 206638 208295 210470 213058 216037 219497 223448 227744 232230 236786 241256 245581 250064 255158
54762 255158 260811 266290 270818 274164 276503 278054 279043 279599 279411 277823 274657 270621 266558 262574 258280
54747 258280 253578 248680 243687 238707 234288 231028 228720 226433 223594 220551 217992 216286 215502 215646 216590
54732 216590 218044 219791 221728 223692 225629 227907 230973 234521 237543 239536 241173 243409 246339 249491
54718 249491 252882 257020 261849 266360 269513 271126 271606 271128 269411 266185 261647 256479 251508 247263 243660
54703 243660 240145 236226 231910 227648 223956 221092 218951 217123 215184 213101 211301 210204 209700 209282 208705
54688 208705 208280 208364 208730 208712 207963 206800 205728 204859 204021 203250 202823 202755 202589 201918 200935 200205 199988 200106 200369
54669 200369 200745 201073 201047 200711 200546 200721 200645 199772 198613 198239 198859 199635 200073 200789 202417 204386 205518 205494
54651 205494 205025 204798 204900 205251 205793 206148 205746 204632 203625 203338 203453 203341 202996 202900 203207 203552 203578 203220 202518
54632 202518 201559 200704 200467 200980 201777 202306 202542 202880 203531 204188 204409 204173 203907 203976 204299 204555 204594 204497 204312 203971
54612 203971 203496 203087 202934 203100 203620 204598 206073 207884 209665 210895 211052 209965 208128 206467 205602 205398
54596 205398 205290 204912 204314 203689 203091 202418 201647 201002 200779 200933 201049 200893 200775 200964 200944 199871 197880 196279
54578 196279 196087 196877 197543 197766 198070 198673 199113 199078 198923 199046 199219 198975 198386 198066 198448 199358 200297 200953 201390
54559 201390 201858 202489 203107 203354 203058 202501 202179 202249 202279 201725 200646 199751 199647 200231 200951 201493 201947 202438 203008
54540 203008 203824 205097 206608 207748 208242 208551 209171 209825 209776 208857 207749 207218 207424 208106 209061 210178 211211
54523 211211 211837 211972 211843 211746 211828 212055 212230 212015 211217 210233 209979 211077 213142 215173 216600 217504 217856 217200
54505 217200 215526 213845 213185 213301 213069 212067 211013 210651 210975 211700 212728 213782 214214 213688 212682 211938
54489 211938 211727 211889 212143 212038 211165 209834 209118 209706 211077 212285 213135 214068 215252 216404 217321 217986 218338
54472 218338 218444 218609 218831 218485 217209 215784 215340 215849 216209 215787 215067 214674 214563 214370 213921 213198 212334 211773
54454 211773 211865 212202 211991 211155 210417 210191 210190 210337 211159 212767 214213 214586 214215 214109 214563 215000 214979 214670 214443
54435 214443 214483 214860 215608 216629 217670 218366 218334 217457 216192 215241 214797 214453 214006 213870 214398 215285 216072 216826
54417 216826 217823 218912 219722 220269 220804 221228 221215 220800 220329 219899 219317 218584 217907 217263 216413 215428 214726 214502 214541
54398 214541 214684 215057 215594 215839 215572 215382 216147 218005 220172 221834 222943 223998 225230 226303 226796 226769 226685
54381 226685 226982 227822 229095 230407 231239 231438 231452 231745 232110 232036 231684 231853 232753 233420 232780 230931 229028 228230
54363 228230 229005 231015 233246 234561 234627 234102 233711 233457 233049 232599 232404 232498 232990 234372 236738 239003 239789
54346 239789 239016 237833 237078 236571 235956 235341 234896 234532 234270 234264 234256 233602 232157 230561 229319 228181 226782 225337
54328 225337 224280 223646 223284 223309 223902 224921 226097 227326 228444 229042 228908 228398 227994 227715 227269 226556 225654
54311 225654 224623 223655 223212 223640 224774 226195 227631 228848 229612 230184 231509 234248 237768 240652 242124
54296 242124 242477 242282 241759 240974 240085 239215 238433 237876 237579 237274 236738 236304 236528 237395 238329 238966 239364 239443 238955
54277 238955 238183 237915 238360 238696 238232 237453 237319 237960 238724 239198 239405 239117 237849 235771 233940 233200 233244 233202
54259 233202 232841 232736 233289 234038 234177 233481 232496 231853 231680 231803 232220 233017 233900 234246 233808 233057 232586 232437 232316
54240 232316 232271 232696 233669 234697 235262 235375 235482 235981 236939 238115 239151 239807 240046 239852 239118 237968 237060 237150
54222 237150 238174 239148 239275 238913 239113 240306 241793 242481 241853 240230 238377 237004 236390 236297 236258 236044 235855
54205 235855 236021 236602 237331 237906 238238 238388 238317 237816 236795 235576 234721 234454 234368 233866 232799 231534 230538 230089
54187 230089 230351 231337 232679 233721 234114 234199 234588 235439 236315 236778 236883 237007 237377 237860 238111 237848 237058 236060
54169 236060 235358 235316 235931 236898 237863 238585 238962 239053 239060 239130 239108 238634 237594 236413 235742 235885 236601 237439 238121 238625
54149 238625 239065 239550 240041 240275 239902 238797 237203 235549 234237 233642 234139 235855 238361 240720 242025 242032 241327
54132 241327 240891 241350 242594 244042 245211 246051 246927 248406 250889 254129 257199 259309 260670 262137 263956
54117 263956 265402 265945 266180 267067 268605 269894 270368 270256 269843 269017 267807 266769 266420 266575 266581 266038 265089 264177
54099 264177 263679 263573 263329 262420 261038 259988 259644 259434 258741 257958 258079 259313 260683 261140 260636 259850 259210
54082 259210 258520 257501 256301 255352 254872 254746 254848 255163 255468 255230 254251 253267 253401 254914 256916 258489 259662
54065 259662 260972 262475 263680 264265 264429 264561 264883 265377 265826 266019 266143 266791 268308 270287 272132 273916
54049 273916 276187 278906 281200 282388 282883 283798 285893 289152 293119 297439 302118 307394 313322 319442 325101
54034 325101 330150 335145 340738 346975 353281 359006 363888 368159 372253 376276 379789 382296 383960 385523
54020 385523 387462 389515 391201 392389 393098 393109 392236 390795 389292 387669 385355 382118 378440 374823 371084
54005 371084 366687 361537 356146 351056 346426 342184 338329 334924 331930 329146 326350 323539 321073 319423
53991 319423 318559 317692 315958 313505 311510 310847 310995 310688 309420 307826 306588 305597 304405 303036 301940 301386
53975 301386 301251 301266 301191 300856 300294 299716 299141 298202 296604 294628 292826 291326 289772 287958 286169 284887 284415
53958 284415 284794 285795 286972 288014 289110 290712 292877 295058 296649 297524 298041 298752 300081 302034 304156
53943 304156 305987 307583 309378 311611 314257 317468 321559 326413 331379 336017 340551 345322 350190 354858
53929 354858 359473 364406 369590 374565 379214 384185 390506 398783 408538 418221 426267 432586 438778 446427
53915 446427 455319 463831 470970 477323 483895 490744 497259 503235 508942 514253 518467 521196 522876 523998
53901 523998 524185 522578 519069 514658 510516 507011 503782 500280 496005 490622 484312 477819 471692 465586
53887 465586 458781 451238 443642 436433 429454 422605 416191 410305 404426 398055 391372 384892 378849 373310
53873 373310 368528 364684 361514 358633 355995 353601 351001 347651 343638 339536 335633 331843 328285 325289
53859 325289 322769 320236 317613 315498 314293 313570 312644 311430 310276 309245 308030 306554 305202 304346 303884
53844 303884 303413 302734 301998 301380 300755 299911 299042 298770 299493 300831 301894 302073 301452 300584 300095 300337 301120 301816
53826 301816 302020 302128 302965 304817 307077 308914 310085 311003 312253 314099 316322 318466 320308 322036 323836
53811 323836 325556 327067 328737 331066 333909 336635 339078 341762 345038 348621 352260 356260 360870 365625
53797 365625 369894 373792 378005 382877 388207 393747 399305 404328 407981 409851 410270 409851 409022 408081 407316
53782 407316 406799 406278 405416 404035 402049 399403 396186 392630 388795 384464 379508 374263 369281 364788 360573
53767 360573 356463 352660 349439 346642 343696 340219 336403 332659 329088 325615 322583 320741 320353 320655 320575
53752 320575 319913 319365 319388 319465 318762 317171 315379 314020 313173 312733 312894 313918 315583 317235 318418 319198 319817
53735 319817 320350 320904 321759 322944 323971 324480 325011 326463 328753 330679 331420 331513 331987 333058 334283 335528
53719 335528 336998 338550 339815 341028 342956 345802 348811 351237 353232 355440 358155 361208 364327 367243
53705 367243 369726 371888 374217 376955 379658 381723 383164 384539 386265 388438 391152 394456 397933 400841
53691 400841 402841 404261 405497 406557 407365 408149 409115 410015 410495 410787 411603 413186 414823 415496 414916 413695
53675 413695 412642 412051 411668 411207 410812 411016 412139 413752 414932 415246 415311 416065 417590 419053 419877 420530 421812
53658 421812 423707 425476 426830 428571 431870 437173 443947 451394 459333 468487 479948 494216 510706
53645 510706 528277 546196 564548 583836 604476 626587 649867 673590 696985 719677 741338
53634 741338 760689 775282 782751 782322 774978 762399 746001 726744 705342 682552 659371 636884
53622 636884 615791 596264 578519 563257 551091 541698 534082 527722 522922 519846 517815 515974 514354
53609 514354 513713 514469 516205 518245 520313 522515 524930 527408 529652 531343 532283 532588 532709 533134 533952 534755
53593 534755 534972 534344 533037 531378 529548 527562 525468 523521 522106 521451 521304 520964 519748 517544 514811
53578 514811 512083 509591 507324 505147 502749 499845 496640 493785 491585 489599 487399 485331 483811 482162
53564 482162 479136 474738 470615 468184 467175 466567 466171 466332 466640 466176 465061 464657 465869 468011 469774 470674
53548 470674 471074 471352 471753 472778 474932 477982 480937 483040 484588 486666 490233 495503 502018 509150 516518
53533 516518 524050 531823 539976 548732 558282 568522 579010 589266 599076 608597 618446 629693 643338
53520 643338 659422 676846 694415 711977 730264 749796 770371 791564 813163 834989 856822
53509 856822 878863 901908 926594 952634 979165 1005683 1032220 1058725 1084841 1110427 1135864
53498 1135864 1161586 1187556 1213360 1238598 1262974 1286288 1308625 1330416 1352096 1373841 1395796
53487 1395796 1418258 1441255 1464141 1486081 1506895 1526992 1546485 1564902 1581840 1597396 1611701
53476 1611701 1624549 1635852 1646013 1655296 1663096 1668502 1671539 1673245 1674343 1674295 1671920 1666570 1658434 1647991
53462 1647991 1635640 1621764 1606836 1591260 1575219 1558709 1541612 1523777 1505128 1485810 1466145
53451 1466145 1446388 1426508 1406262 1385534 1364581 1343863 1323605 1303589 1283446 1263110 1242938
53440 1242938 1223436 1204957 1187677 1171804 1157702 1145685 1135619 1126829 1118698 1111453 1106171 1103761
53428 1103761 1104022 1105852 1108416 1111943 1117393 1125492 1136205 1149109 1164156 1181894 1202795 1226541 1252391
53415 1252391 1280304 1311265 1346157 1384604 1425407 1467990 1512915 1560977 1612206 1665968 1721708
53404 1721708 1779354 1839180 1901416 1965821 2031377 2096403 2159114 2218239 2273356 2324857 2373532
53393 2373532 2420000 2464464 2507082 2548451 2589471 2630798 2672571 2714606 2756597 2798187 2839137
53382 2839137 2879428 2919038 2957703 2995106 3031045 3064994 3095636 3121471 3141953 3157539 3168643
53371 3168643 3175161 3177125 3175068 3169284 3159284 3144373 3124322 3099129 3068718 3033418 2994231 2951939
53359 2951939 2906330 2856975 2804380 2749552 2692581 2632707 2569984 2506108 2443212 2382263 2322893
53348 2322893 2264354 2206314 2148986 2092812 2037992 1984309 1931536 1879909 1829923 1781782 1735423
53337 1735423 1690971 1648635 1608136 1568877 1530875 1494957 1461667 1430436 1400356 1371517 1345022
53326 1345022 1321710 1301218 1282339 1264053 1246197 1229440 1214775 1202886 1193749 1186634 1180523 1174756
53314 1174756 1169515 1165649 1163907 1164326 1166395 1169591 1173645 1178543 1184694 1192891 1203632 1216449 1230394
53301 1230394 1245215 1261595 1280056 1300166 1321111 1342712 1365497 1390024 1416407 1444367 1473431
53290 1473431 1503158 1533295 1563550 1593289 1621816 1649075 1675632 1701695 1726600 1749573 1770554
53279 1770554 1789767 1806847 1821026 1831989 1839961 1845050 1847150 1846516 1843780 1839240 1832604 1823653 1812735
53266 1812735 1800385 1786796 1771854 1755368 1737113 1716991 1695322 1672630 1648968 1623848 1597017
53255 1597017 1568818 1539408 1508143 1474371 1438496 1401542 1363821 1324866 1284712 1244408 1204947
53244 1204947 1166427 1128727 1092337 1057869 1025172 993657 963263 934385 907026 880793 855703
53233 855703 832145 809959 788422 767487 748163 731072 715397 700001 684948 670986 657970
53222 657970 644951 631734 619195 607820 597005 586208 575874 566517 557657 548483 539127 530402
53210 530402 522456 514540 506139 497689 489973 483317 477575 472530 468070 464142 460661 457293 453424 448682
53196 448682 443520 438875 435083 431477 427312 422722 418443 414834 411683 408853 406535 404678 402739 400410
53182 400410 398233 396945 396315 395296 393439 391570 390703 390751 390779 390247 389453 388951 389107 390096 391695 393008 393039
53165 393039 391783 390264 389301 388789 388378 388158 388158 387760 386392 384512 383225 382981 383244 383338 383012 382192 380858 379335
53147 379335 378198 377667 377430 377207 377039 376887 376397 375380 374204 373355 372840 372287 371482 370526 369592 368772 368156 367909
53129 367909 368277 369485 371403 373273 374154 373855 373223 373200 373817 374433 374709 374844 374919 374604 373788 373032 373031 373810 374823
53110 374823 375655 376208 376277 375472 373757 371737 370117 369100 368541 368382 368509 368430 367690 366705 366604 367950 370000
53093 370000 371558 372243 372587 373143 373938 374694 375245 375773 376927 379494 383536 387938 391283 393213 394466 395648
53077 395648 396594 397145 397889 399545 401995 404529 406848 409275 411938 414302 415633 415584 414225 411951 409610
53062 409610 408286 408450 409417 410011 409667 408563 406840 404397 401608 399558 398983 399347 399565 399453 399742 400704 401582
53045 401582 401653 401171 400841 400938 401496 402834 405127 407729 409657 410666 411177 411277 410593 409274 408214 407927 407793
53028 407793 406853 404866 402170 398965 395291 391389 387578 383936 380582 378040 376778 376482 376274 375595 374446
53013 374446 372884 370861 368677 367031 366330 366285 366378 366387 366275 365973 365663 365945 367216 368932 370010 370006 369582 369652 370351
52994 370351 371077 371328 371217 371134 371197 371181 370917 370592 370590 371076 371862 372666 373455 374433 375739 377275 378872 380522 382333
52975 382333 384297 386219 387920 389439 390975 392664 394441 396093 397478 398664 399893 401382 403184 405164
52961 405164 407033 408371 408851 408586 408172 408135 408374 408314 407551 406088 404006 401349 398501 396215 394881 393969 392587
52944 392587 390452 387998 385701 383718 382144 381138 380657 380408 380157 379806 379114 377738 375751 373815 372562
52929 372562 371992 371693 371473 371463 371704 371929 371780 371173 370429 370112 370580 371572 372324 372250 371531 370965 371255 372473 374071
52910 374071 375302 375695 375294 374575 374133 374378 375327 376561 377510 378051 378722 380067 381818 383085 383354 382871 381946
52893 381946 380471 378486 376680 375793 375751 375939 376113 376463 376899 376968 376598 376272 376200 375832 374577 372656 370825 369473
52875 369473 368356 367123 365743 364434 363431 362834 362455 361806 360455 358519 356701 355725 355738 356269 356718 356852
52859 356852 356834 356873 356970 357081 357283 357607 357820 357720 357626 358106 359083 359612 358926 357454 356389 356363 356955 357401 357326 356780
52839 356780 356041 355571 355782 356530 357113 356994 356328 355586 354956 354425 354196 354557 355394 356269 357030 358019 359580 361607
52821 361607 363696 365503 366891 367943 368935 370094 371318 372295 372989 373769 374948 376445 378050 379804 381896
52806 381896 384443 387631 391838 397189 402989 407953 411090 412194 411486 409129 405288 400401 395069 389615
52792 389615 383953 377988 372069 366852 362661 359109 355562 351864 348426 345634 343523 342080 341428 341430 341475 341051
52776 341051 340292 339520 338468 336553 333980 331985 331673 332943 334797 336402 337600 338609 339575 340425 340990 341244
52760 341244 341463 341997 342846 343604 343884 343622 342941 341984 341039 340561 340767 341393 342127 343111 344632 346390 347558 347753
52742 347753 347603 348024 349046 349672 348923 346821 344307 342422 341648 341841 342479 343023 343312 343734 344873 346893 349326
52725 349326 351517 353136 354191 354724 354631 353733 351967 349646 347506 346225 345707 345127 343910 342437 341501 341326
52709 341326 341474 341539 341461 341264 340985 340893 341304 342015 342273 341554 340212 339277 339669 341498 343795 345085 344647 343306
52691 343306 342619 343313 344834 346348 347553 348459 349053 349504 350257 351543 353153 354892 356787 358594 359701 360019
52675 360019 360485 362027 364319 366176 367032 367433 368098 369097 370101 371005 372041 373434 375075 376550 377528 378127
52659 378127 378724 379392 379834 379956 380047 380170 379833 378712 377360 376692 377006 377960 379235 380663 381881 382536 382813
52642 382813 383173 383551 383342 382294 380901 379794 379187 379101 379693 381039 382825 384464 385463 385728 385727 386316 388100
52625 388100 390876 393863 396391 398168 399127 399458 399675 400139 400518 400210 399287 398382 397606 396292 394139 391960
52609 391960 390776 390571 390559 390384 390452 391153 392333 393664 395109 396737 398291 399251 399349 398928 398708 399247 400630
52592 400630 402585 404695 406544 407952 409206 410804 412741 414332 415016 415078 415182 415456 415542 415394 415368 415499 415418
52575 415418 415215 415708 417374 419473 420748 420776 420142 419507 419048 418844 419237 420398 421711 422054 420973 419385 418746
52558 418746 419436 420390 420563 420267 420543 421590 422630 423198 423714 424624 425729 426705 427564 428191 428122 427418 427233 428739
52540 428739 431653 434491 436186 436887 437233 437453 437373 436916 436317 436020 436450 437807 439981 442669 445510 448082
52524 448082 449952 450896 451058 450899 451076 452190 454264 456482 457897 458489 459086 460154 461271 462069 462980 464525
52508 464525 466440 468187 469889 471959 474057 475209 474899 473340 470825 467634 464528 462384 461045 459312
52494 459312 456495 453314 450841 449152 447595 445904 444349 443058 441888 440929 440540 440782 441232 441501 441643 441943
52478 441943 442550 443447 444626 446122 447940 450049 452325 454489 456192 457286 457992 458672 459470 460263 461014 462034
52462 462034 463780 466360 469361 472127 474100 474945 474590 473298 471516 469449 466850 463450 459488 455597 452179
52447 452179 449114 446136 443261 440726 438642 436850 435056 433091 431135 429730 429401 430060 430872 430940 430228 429685
52431 429685 430289 432024 433982 435452 436628 438044 439547 440304 439856 438787 438088 438156 438695 439377 440233 441372
52415 441372 442665 443867 444906 446017 447646 450254 454051 458841 464121 469314 473990 478085 482082 486851
52401 486851 493012 500343 507830 514275 518887 521498 522440 522164 520766 517918 513398 507621 501481 495749 490823
52386 490823 486921 484093 481983 479960 477777 475969 475389 476435 478832 482001 485354 488258 490141 490948 491465
52371 491465 492861 495787 499965 504685 509444 513970 517907 520957 523285 525257 526669 526690 524915 522102 519467
52356 519467 517533 516109 515084 514595 514438 514021 513130 512247 511846 511824 511993 512795 514973 518628 523066 527595 532176
52339 532176 537165 542704 548577 554535 560544 566799 573677 581676 591100 601608 612267 622406 632402
52326 632402 643303 655565 668514 681275 693882 707002 720742 734330 747061 759055 770854
52315 770854 782634 794192 805419 816357 826910 836959 846896 857641 869846 883156 896501 909078
52303 909078 920958 932745 944906 957469 970114 982260 993096 1001913 1008593 1013682 1017796 1020960
52291 1020960 1022606 1022195 1019816 1016227 1012408 1009000 1006097 1003447 1000767 997780 994270 990437 987219 985811
52277 985811 986631 988972 991849 994938 998482 1002590 1007032 1011600 1016322 1021379 1027122 1034030 1042223 1051083
52263 1051083 1059754 1068083 1076702 1086084 1095954 1105831 1115770 1126235 1137465 1149268 1161299 1173211 1184649
52250 1184649 1195412 1205657 1215671 1225328 1233973 1241055 1246708 1251537 1255864 1259437 1261976 1263767 1265551
52237 1265551 1268000 1271432 1275768 1280423 1284475 1287503 1290270 1294048 1299137 1304623 1309750 1314832 1320412 1326199
52223 1326199 1331558 1336495 1341346 1345831 1349434 1352586 1356528 1361843 1368018 1374571 1381644 1389080 1395930 1401641
52209 1401641 1407129 1413834 1422038 1430843 1439619 1448782 1459112 1470787 1483147 1495137 1506079 1516319
52197 1516319 1526965 1538648 1550707 1561960 1572090 1581830 1591858 1602100 1612118 1621593 1630141 1637096
52185 1637096 1641942 1644841 1646445 1647190 1646864 1644787 1640384 1633712 1625526 1616697 1607502 1597601 1586781 1575540
52171 1575540 1564736 1554816 1545676 1537310 1530188 1524729 1520624 1517091 1513832 1511417 1510590 1511523 1513957 1517743
52157 1517743 1522770 1528477 1533891 1538219 1541105 1542336 1541849 1540235 1538759 1538392 1538880 1539123 1538427 1537126 1535968
52142 1535968 1535166 1534222 1532592 1530284 1527701 1524960 1521649 1517385 1512392 1507271 1502345 1497618 1493358 1490248
52128 1490248 1488794 1488876 1490086 1492285 1495669 1500570 1507334 1516230 1527312 1540514 1555906 1573558 1593090
52115 1593090 1613748 1635085 1657197 1680103 1703313 1726337 1749194 1772027 1794535 1816213 1836860
52104 1836860 1856442 1874784 1891942 1908638 1925628 1942786 1959465 1975688 1992202 2009160 2025469
52093 2025469 2039815 2051856 2062119 2071223 2079555 2087155 2093336 2096685 2096071 2091773 2085316 2078306 2071684
52080 2071684 2065968 2061688 2059412 2059586 2062419 2067592 2074025 2080368 2086158 2092323 2100207 2110104 2121119 2132483
52066 2132483 2144491 2157762 2171918 2185623 2197921 2209004 2219407 2228953 2236942 2243158 2248183 2252641
52054 2252641 2256529 2259414 2260991 2261260 2260288 2258034 2254456 2249623 2243621 2236338 2227495 2217043 2205478 2193585
52040 2193585 2181884 2170550 2159818 2150142 2141781 2134566 2128339 2123309 2119586 2116579 2113334 2109493 2105585
52027 2105585 2102288 2099683 2097301 2094650 2091552 2088072 2084190 2079591 2073943 2067449 2060844 2054565 2048200 2041117
52013 2041117 2033358 2025358 2016961 2007530 1997130 1986812 1977265 1967789 1957214 1945355 1932816 1919529
52001 1919529 1904331 1886155 1865068 1841830 1816849 1790056 1761641 1732451 1703554 1675652 1649129
51990 1649129 1624435 1602081 1582113 1563789 1546003 1527950 1509351 1490247 1470962 1452153 1434445
51979 1434445 1417808 1401572 1385214 1368878 1352872 1336996 1320756 1304128 1287700 1272012 1257059
51968 1257059 1242599 1228729 1216013 1205114 1196378 1189748 1185051 1182327 1181739 1183082 1185557 1188185 1190397
51955 1190397 1192000 1192663 1191766 1188753 1183389 1175552 1165163 1152534 1138602 1124545 1111203 1098978 1088047
51942 1088047 1078448 1070123 1063243 1058399 1056076 1055878 1056607 1057232 1057466 1057307 1056439 1054327 1050655 1045345 1038343
51927 1038343 1029669 1019539 1008129 995402 981481 966937 952271 937248 921376 905074 889785
51916 889785 876701 865859 856690 848920 842555 837469 833568 831130 830556 831913 835065 839948 846247 853076
51902 853076 859628 866154 873753 883202 894421 907031 920652 934388 946608 955701 960757 961324 956986
51889 956986 947759 934647 919294 903104 886987 871750 858199 846820 837799 831515 828628 829469 833570
51876 833570 840050 848405 858701 871114 885513 901599 919133 937695 956100 972363 984564 991866
51864 991866 994546 993092 987545 977893 964798 949523 933178 916357 899562 883687 869825 858699
51852 858699 850350 844235 839578 835839 833078 831730 831842 832644 833122 832818 831731 829631 826115 821507 817052
51837 817052 813717 811110 808047 803966 799354 794996 791420 789011 787987 788125 788996 790642 793439 797089 800255
51822 800255 801573 800594 797476 792379 785793 779035 773550 769653 766527 763462 760633 758670 758063 759114 761906
51807 761906 765988 770327 773862 775936 776080 773722 768421 760343 750327 739534 729015 719457 711152 704207
51793 704207 698716 694617 691495 688736 685952 683174 680672 678746 677598 677254 677638 678845 681150 684531 688397
51778 688397 692097 695568 699121 702827 706607 710705 715389 720213 724357 727925 732193 738314 746433 756351
51764 756351 768208 781822 796025 809560 822306 834717 846214 855037 859831 860673 858406 853676 846924
51751 846924 838747 829677 819871 809307 798188 786985 776267 766572 758225 751101 744865 739559 735708
51738 735708 733682 733291 734311 737117 742290 749673 758162 766492 773959 780335 785417 788839 790259 789573 786985
51723 786985 782854 777386 770500 762190 752985 743792 735163 726968 719025 711872 706548 703657 702960 703954 706447
51708 706447 710281 714778 718969 722453 725853 730306 736681 745262 755940 768426 782235 796573 810267
51695 810267 821948 830572 836010 839177 841429 843746 846463 849728 853941 859506 866134 872599 877339 879255
51681 879255 877918 873300 865727 856151 846057 836751 828777 822169 817073 813772 812094 811125 809689 807030
51667 807030 803002 797845 791990 786021 780500 775679 771472 767834 765063 763545 763197 763395 763528 763397 762990
51652 762990 762190 761050 760054 759657 759736 759982 760738 762688 765504 767490 766896 763109 756343 746918 735458 723171
51636 723171 711072 699203 687289 675836 665774 657208 649412 642001 635274 629346 623837 618618 614128
51623 614128 610670 608095 606358 605595 605358 604680 603355 602354 602294 602267 601018 598785 597069 596929 598296 600684
51607 600684 603582 606190 607779 608592 609721 611774 614164 616003 617249 618609 620680 623597 627396 632320
51593 632320 638655 646368 654999 664025 673349 683366 694410 706268 718345 730184 741635 752721
51581 752721 763714 775388 788859 804996 824054 845975 870943 899562 932529 970150 1012294
51570 1012294 1058936 1110640 1168131 1231269 1298846 1369752 1444048 1522341 1604154 1687354 1769288
51559 1769288 1848119 1923087 1994094 2061500 2125897 2187302 2244213 2293714 2332626 2358406 2368953
51548 2368953 2362155 2336461 2291997 2230714 2155278 2068213 1972312 1871154 1768446 1666840 1567912
51537 1567912 1473144 1384378 1303299 1230892 1167363 1112039 1063421 1020071 981672 948703 920954
51526 920954 897045 875644 856479 839817 825626 813715 804040 796221 789304 782672 776840 772704 770296
51513 770296 768874 767896 767287 766984 766829 766755 766527 765530 763322 760179 756471 751874 745905 739025 732383 726549
51497 726549 721241 716265 711923 708421 705623 703618 702891 703723 705947 709412 714134 719849 725915 731787 737154
51482 737154 741582 744549 745911 745841 744286 741016 736205 730353 723670 716218 708650 701949 696162 690237 683427
51467 683427 676164 669255 662980 657434 652966 649711 647277 645428 644471 644408 644354 643569 642653 642941 645041 648644
51451 648644 653457 659496 666515 673912 681353 689052 697380 706565 716786 728274 741370 756657 774745
51438 774745 795490 817536 838913 857951 873405 884224 889983 891596 891011 889976 889249 888743 887852 885516
51424 885516 880504 872101 860604 847202 833461 820784 810035 801529 795294 791207 788944 788205 789133
51411 789133 792112 796867 802183 806951 811162 815428 819858 824039 827930 832025 836602 841422 846341 851698
51397 851698 857954 865412 874500 885919 900304 918060 939747 966269 998421 1036460 1080330 1130136
51385 1130136 1186234 1249012 1318728 1395339 1478334 1566898 1660350 1758292 1860214 1965103 2071511
51374 2071511 2177645 2281096 2378591 2466381 2541008 2599720 2640282 2660720 2659460 2635788 2590268
51363 2590268 2524786 2442185 2345780 2239061 2125634 2009124 1892886 1779688 1671639 1570328
51353 1570328 1476910 1391988 1315517 1246980 1185817 1131668 1084177 1042675 1006111 973285 943102
51342 943102 914771 888002 862983 840014 819095 799936 782230 765749 750333 736117 723627
51331 723627 713250 704582 696738 689351 682816 677360 672467 667573 662942 659376 657267 656343 656148 656380 656896
51316 656896 657775 659314 661672 664601 667795 671343 675502 680065 684323 687639 689879 691336 692500 693800
51302 693800 695322 696802 698045 699139 700058 700302 699283 696865 693225 688462 682858 677258 672544 668761 665337
51287 665337 662177 659893 658841 658633 658932 660189 663112 667760 673597 680249 687675 695654 703486 710442 716372
51272 716372 721805 727376 733149 738569 743102 746691 749402 750939 751079 750524 750685 752263 754480 756025 756478
51257 756478 756388 756163 755403 753306 749371 743642 736601 729080 722064 716227 711566 707600 703994 700945 698862
51242 698862 697822 697469 697377 697280 697035 696708 696701 697346 698233 698406 697642 697127 698357 701669 706316 711682 717614 723695
51224 723695 729179 734012 739220 745775 753517 761561 769342 776710 783241 788090 790538 790374 787713 782796
51210 782796 776096 768399 760555 753077 745984 739102 732530 726665 721731 717498 713763 710862 709261 708778
51196 708778 708773 709158 710547 713181 716266 718836 720827 722882 725451 728650 732644 737438 742380 746517 749641
51181 749641 752498 755789 759359 762572 765103 767038 768456 769299 769557 769228 768079 765752 762254 758156 754096
51166 754096 750260 746515 742890 739548 736301 732620 728354 724072 720406 717383 714772 712780 711779 711422
51152 711422 710595 708352 704489 699268 693149 686835 680960 675462 669769 663792 658244 653661 649684 645679
51138 645679 641577 637722 634373 631819 630497 630427 630919 631504 632787 635662 639967 644650 649135 653732 658774
51123 658774 664175 669962 676483 683766 691173 697895 703351 707121 709181 710303 711488 712635 712438 710014
51109 710014 705998 701536 696810 691254 684823 678222 672046 666438 661566 657778 655091 653036 651305 650283
51095 650283 650780 653290 657496 662292 666354 668986 670564 672074 674272 677339 681120 685375 689872 694515
51081 694515 699341 704200 708561 711918 714262 715824 716606 716722 717072 718946 722735 727629 732835 738515 745115
51066 745115 752381 759673 766932 774647 782954 791347 799240 806307 812256 816801 819943 821857 822407 821121
51052 821121 817835 813046 807566 802161 797519 794061 791537 789259 787028 785479 785177 785774 786504 787221 788459
51037 788459 790605 793573 797298 802020 807874 814540 821578 828912 836747 844942 852627 858568 862074 863542
51023 863542 863938 863715 862490 859826 855957 851486 846728 841821 837311 834155 833132 834539 838269 843747 849947
51008 849947 856122 862606 870414 879874 890199 900565 910993 921778 932499 942154 950078 956197 960524
50995 960524 962925 963442 962483 960482 957542 953505 948340 942442 936599 931637 928021 925831 925058 925868 928558
50980 928558 933419 940678 950469 962772 977485 994512 1013643 1034496 1056832 1080822 1106552 1133285
50968 1133285 1159735 1185266 1210285 1235273 1260033 1284404 1309111 1335151 1362528 1390350 1418125
50957 1418125 1446264 1475265 1505068 1535437 1566432 1598102 1630074 1661811 1693070 1723807 1753776
50946 1753776 1782470 1809409 1834446 1857933 1880678 1903511 1926712 1949919 1972581 1994208 2014082
50935 2014082 2031154 2044604 2054331 2060468 2062504 2059352 2050389 2036081 2017335 1994503 1967293 1935545
50923 1935545 1899746 1860777 1819401 1776067 1731004 1684438 1636777 1588658 1540657 1492989 1445781
50912 1445781 1399704 1355978 1315427 1277806 1242396 1209087 1178446 1150885 1126289 1104374 1084837
50901 1084837 1067091 1050568 1035507 1022837 1012851 1004523 996655 989252 983156 978629 974965 971401 967781
50888 967781 964288 961165 958785 957555 957455 957963 958519 958919 959313 960111 961836 964680 968210 971795 975275 978835
50872 978835 982377 985646 988965 993255 999103 1006346 1014714 1024285 1034978 1046343 1058425 1072285 1088918
50859 1088918 1107927 1128059 1148877 1171180 1195829 1223005 1252862 1286038 1322993 1363375 1406691
50848 1406691 1453304 1504048 1559066 1617740 1679792 1745606 1815071 1886791 1959229 2032317 2107125
50837 2107125 2183956 2261505 2338093 2413041 2486368 2557619 2625591 2689024 2747196 2800092 2848452
50826 2848452 2893428 2935704 2974975 3010701 3043197 3073521 3102472 3130287 3157243 3183776 3209797
50815 3209797 3234351 3256079 3273523 3284934 3288541 3283364 3269222 3245675 3211627 3166426 3110749 3045811
50803 3045811 2972293 2890832 2803151 2711833 2619068 2526302 2434984 2346876 2263574 2186352 2116514
50792 2116514 2055136 2002244 1956826 1917974 1885663 1860285 1841912 1830135 1824092 1822363 1823361 1826221
50780 1826221 1830897 1837065 1843348 1848050 1850294 1849925 1846645 1839967 1829923 1817167 1802251 1785258 1766293
50767 1766293 1745806 1724139 1701076 1676195 1649483 1621330 1592034 1561718 1530751 1499964 1470189
50756 1470189 1441697 1414285 1387901 1362933 1339827 1318672 1299471 1282685 1269081 1258925 1251686
50745 1251686 1246748 1244150 1244339 1247395 1252961 1260875 1271461 1285117 1301895 1321596 1343947 1368556 1395044
50732 1395044 1423540 1454879 1489913 1528621 1570069 1613212 1657555 1703014 1749428 1796334 1843098
50721 1843098 1889101 1933838 1976903 2017996 2056998 2094053 2129401 2162944 2194022 2221809 2246038
50710 2246038 2267240 2286298 2303957 2320825 2337642 2355269 2374232 2394304 2414555 2433951 2452041
50699 2452041 2469038 2485117 2499736 2511793 2520404 2525119 2525285 2519648 2506973 2486863 2459623 2425535
50687 2425535 2384809 2338349 2288132 2236575 2185708 2137045 2091939 2051748 2017714 1990757 1971261
50676 1971261 1959019 1953696 1955536 1965356 1983612 2009651 2042165 2080183 2123201 2170438 2220498 2271951
50664 2271951 2323882 2375585 2425936 2473402 2516644 2554964 2588265 2616770 2640861 2661004 2677751
50653 2677751 2691734 2703524 2713414 2721396 2727440 2731749 2734660 2736404 2737192 2737614 2738811 2742081 2748250 2757444
50639 2757444 2769473 2784328 2802206 2823090 2846476 2871697 2898401 2926445 2955216 2983367 3009513
50628 3009513 3033113 3054386 3073263 3088615 3098565 3101384 3096100 3082600 3061621 3034707 3003829 2970738
50616 2970738 2936616 2902389 2869234 2838626 2811862 2789667 2772169 2758990 2749132 2741010 2733101 2724817
50604 2724817 2716501 2708299 2699045 2686483 2668592 2644556 2614565 2578975 2537856 2491124 2438947 2382036
50592 2382036 2321600 2258929 2194966 2130430 2066275 2003705 1943540 1885931 1831050 1779854 1733648
50581 1733648 1692923 1657004 1624939 1596368 1571412 1550131 1532398 1518113 1507286 1500043 1496724 1497807
50569 1497807 1503445 1513173 1526269 1542313 1561146 1582446 1605686 1630569 1657207 1685822 1716530 1749613
50557 1749613 1785694 1825349 1868529 1914616 1963036 2013602 2066137 2119967 2174036 2227518 2280024
50546 2280024 2331112 2379804 2424897 2465776 2502764 2536752 2568731 2599668 2630493 2661967 2694768
50535 2694768 2729854 2768571 2812108 2860852 2914432 2972346 3034410 3100773 3171788 3247822 3328927
50524 3328927 3414550 3503706 3595453 3689092 3783930 3878984 3972886 4063908 4150060 4229382 4300252
50513 4300252 4361300 4411066 4447962 4470707 4478652 4471635 4449764 4413551 4364182 4303452 4233397 4156071
50501 4156071 4073576 3988145 3902087 3817689 3737146 3662535 3595794 3538615 3492219 3457112 3433064
50490 3433064 3419351 3415035 3418950 3429428 3444021 3459493 3472072 3477804 3473001 3454793 3421692 3373779
50478 3373779 3312217 3238503 3154182 3061202 2962196 2860061 2757235 2655524 2556574 2462194 2373980
50467 2373980 2292700 2218216 2150097 2088220 2032741 1983579 1940189 1901903 1868262 1838860 1813066
50456 1813066 1790241 1770096 1752336 1735883 1719011 1700541 1680548 1659623 1637859 1615027 1591349
50445 1591349 1567495 1544016 1521428 1500735 1483082 1468678 1456637 1446148 1437374 1430980 1427287 1426147
50433 1426147 1427222 1429998 1433930 1439016 1445944 1455312 1466904 1480214 1495382 1513089 1533598 1556464
50421 1556464 1581228 1607945 1636875 1668115 1701787 1738297 1778084 1821230 1867490 1916583 1968324
50410 1968324 2022631 2079635 2139661 2202743 2268013 2333833 2398758 2462254 2524277 2584157 2640218
50399 2640218 2690585 2734165 2770788 2800670 2823967 2840521 2849625 2850184 2841538 2824111 2798957 2766749
50387 2766749 2727748 2682823 2633849 2582772 2530748 2478650 2428063 2381213 2339983 2305349 2277722
50376 2277722 2257370 2244362 2238337 2238448 2243535 2252308 2263369 2274921 2284473 2289247 2287215 2277656 2260539
50363 2260539 2235675 2202764 2162038 2114416 2061076 2003229 1942161 1879039 1814637 1749677 1685471
50352 1685471 1623773 1565764 1511476 1460363 1412139 1366884 1324742 1285900 1250735 1219624 1192570
50341 1192570 1169142 1148695 1130572 1114256 1099628 1087016 1076736 1068504 1061571 1055584 1051153 1049294
50329 1049294 1050256 1053056 1056303 1059366 1062636 1066774 1071995 1078097 1084839 1092068 1099577 1107160 1114749 1122379
50315 1122379 1130021 1137545 1144794 1151549 1157558 1162828 1167878 1173470 1179934 1186864 1193545 1199654 1205515 1211705
50301 1211705 1218337 1224718 1229809 1233154 1235275 1237051 1238830 1240409 1241770 1243458 1245939 1248754 1250574 1250206
50287 1250206 1247495 1243173 1237938 1231852 1224714 1216756 1208631 1200769 1193183 1186006 1179830 1175227 1172265 1170793
50273 1170793 1170845 1172300 1174435 1176439 1178396 1181209 1185545 1191275 1198014 1205627 1213934 1222309 1229963 1236382
50259 1236382 1241348 1244814 1247034 1248526 1249607 1250112 1249808 1248831 1247415 1245418 1242504 1238690 1234317 1229515 1224086
50244 1224086 1218007 1211717 1205671 1199807 1193654 1187045 1180605 1175529 1172750 1172264 1173286 1175164 1178021 1182379
50230 1182379 1188233 1194796 1201290 1207793 1215058 1223529 1232685 1241465 1249294 1256636 1264527 1273508 1282985 1291591
50216 1291591 1298170 1302393 1304467 1304513 1302467 1298509 1293140 1286551 1278174 1267260 1253842 1238727 1222567
50203 1222567 1205369 1187086 1168227 1149523 1131316 1113704 1097106 1082204 1069297 1058084 1048050
50192 1048050 1038815 1030198 1022354 1015918 1011652 1009808 1010027 1011861 1015090 1019485 1024643 1030236 1036198 1042533
50178 1042533 1049200 1056308 1064158 1072878 1082193 1091720 1101327 1111125 1121275 1131903 1142912 1153727 1163507
50165 1163507 1171863 1179217 1186234 1193047 1199285 1204731 1209691 1214699 1220011 1225365 1230216 1234306 1238028 1242020
50151 1242020 1246332 1250277 1253268 1255522 1257685 1259964 1261896 1262754 1261870 1258769 1253406 1246276 1237952 1228446
50137 1228446 1217316 1204449 1190532 1176730 1164055 1153063 1143898 1136490 1130804 1126948 1125001 1124758 1125727
50124 1125727 1127318 1128981 1130327 1131326 1132319 1133624 1135131 1136439 1137383 1138222 1139334 1140943 1143197 1146350 1150668
50109 1150668 1156076 1161847 1166755 1169796 1170917 1170921 1170569 1169955 1168840 1167219 1165218 1162663 1159195 1154776 1149726
50094 1149726 1144309 1138678 1133259 1128764 1125712 1124140 1123844 1124552 1125862 1127398 1129258 1132000 1135987 1140908
50080 1140908 1146119 1151225 1156227 1161311 1166680 1172339 1177960 1183211 1188404 1194391 1201519 1209016 1215913 1222386
50066 1222386 1229654 1238508 1248502 1258800 1269407 1281102 1294264 1308164 1321606 1334162 1346634 1360319
50054 1360319 1375972 1393550 1412764 1433580 1456198 1480922 1508279 1539005 1573497 1611353 1651780
50043 1651780 1694573 1740494 1790610 1845375 1904342 1966542 2030955 2096709 2163088 2229536 2295740
50032 2295740 2361600 2426930 2491152 2553502 2613583 2671375 2726384 2776997 2821098 2857166 2884268
50021 2884268 2901023 2905363 2895851 2872886 2838224 2793569 2740098 2679026 2611864 2539954 2464304 2386247
50009 2386247 2307944 2231920 2160195 2093904 2033423 1978576 1928944 1884407 1845390 1812429 1785590
49998 1785590 1764561 1749232 1739874 1736726 1739644 1748119 1761233 1777450 1794765 1811478 1826796 1840563
49986 1840563 1852568 1862378 1869700 1874543 1876883 1876419 1872879 1866401 1857477 1846585 1834180 1821111 1808741
49973 1808741 1798335 1790315 1784247 1779639 1776583 1775566 1776846 1780248 1785468 1792385 1800964 1811115 1822758
49960 1822758 1836014 1851223 1868719 1888534 1910288 1933519 1958256 1985171 2014944 2047580 2082623
49949 2082623 2119892 2159399 2200365 2240888 2279054 2314072 2345879 2374077 2397963 2417469 2433311
49938 2433311 2446082 2455883 2462978 2468097 2471693 2473544 2473680 2473240 2473746 2475900 2479890 2486779 2498769 2517828
49924 2517828 2544510 2578211 2618046 2663272 2713340 2767923 2826701 2889020 2954073 3021538 3091624
49913 3091624 3164189 3238202 3312286 3385433 3456774 3524935 3588053 3644299 3692035 3729675 3755801
49902 3755801 3769375 3769711 3756598 3730816 3694197 3648585 3594844 3533301 3464809 3390664 3311587 3227634
49890 3227634 3139179 3047247 2952734 2856099 2758138 2660247 2563426 2467655 2372863 2279956 2190273
49879 2190273 2104544 2023082 1946594 1875868 1810711 1749987 1692824 1639310 1590041 1545539 1506108
49868 1506108 1471630 1441447 1414868 1391871 1372748 1357051 1343568 1331614 1321856 1315539 1313235 1314565
49856 1314565 1318761 1325217 1333791 1344836 1358792 1375599 1394697 1415487 1437257 1458525 1477173 1491764
49844 1491764 1502436 1510080 1514918 1516392 1514185 1508703 1500432 1489290 1474875 1457215 1437149 1416066
49832 1416066 1395342 1375988 1358761 1344390 1333506 1326389 1323111 1323954 1329378 1339501 1353962 1372530
49820 1372530 1395603 1423825 1457426 1496110 1539391 1586795 1637952 1692687 1750734 1811154 1872341
49809 1872341 1933018 1993091 2053146 2113311 2173003 2231676 2289252 2345635 2400108 2451522 2499021
49798 2499021 2542547 2582583 2619387 2652584 2681754 2707365 2730645 2752328 2771933 2788635 2802435
49787 2802435 2813939 2823175 2829079 2829990 2824153 2809885 2785890 2751592 2706971 2652244 2588160 2516470
49775 2516470 2439481 2359070 2276566 2193593 2112450 2035450 1964273 1899986 1843131 1793554 1750554
49764 1750554 1713446 1681657 1654228 1629721 1606852 1584825 1562945 1540588 1517812 1495348 1473360
49753 1473360 1450670 1425780 1398307 1368826 1337708 1304938 1270958 1236894 1203780 1172096 1142141
49742 1142141 1114186 1088054 1063172 1039514 1018146 1000363 986413 975420 966444 959294 954267 951394
49730 951394 950118 949756 950240 952288 956682 963375 971497 980295 989839 1000661 1012929 1026269 1040346 1055283
49716 1055283 1071389 1088601 1106323 1123695 1139853 1153992 1165421 1173793 1179247 1182142 1182537 1180060
49704 1180060 1174341 1165453 1153785 1139635 1123258 1105287 1086722 1068324 1050277 1032679 1016087 1001220
49692 1001220 988282 976977 967188 959250 953499 949935 948470 949163 952028 956903 963705 972516 983150
49679 983150 994883 1006939 1019019 1031130 1043213 1055401 1068401 1083023 1099357 1116878 1135166
49668 1135166 1153873 1171935 1187660 1199978 1209102 1215664 1219776 1221362 1220883 1219084 1216198 1211817 1205272
49655 1205272 1195698 1182099 1164107 1142615 1119144 1094600 1069120 1042988 1017053 992128 968493
49644 968493 946196 925363 906019 888054 871590 857103 844911 834840 826586 820072 815160 811218
49632 811218 807362 803105 798601 794261 790306 786631 782987 779305 775815 772814 770302 767980 765564 762936
49618 762936 760024 756819 753643 751204 750153 750580 751955 753520 754759 755660 756631 758103 760136 762422 764628
49603 764628 766721 769050 772101 775995 780098 783363 785195 785825 785638 784564 782519 780117 778279 777159 776066
49588 776066 774505 772695 770999 769507 768453 768390 769446 770880 771955 772929 774641 777380 780791 784733 789591
49573 789591 795610 802484 809907 818194 828070 840007 853863 868942 884230 898795 912338 925388
49561 925388 938650 952012 964312 974202 981065 984947 985926 984071 980066 975285 970760 966334 961154 954927
49547 954927 948342 942498 938251 935946 935241 935179 934849 934090 933211 932149 930382 927757 924903 922637 921352 921181
49531 921181 922367 925197 929757 935856 943021 950676 958644 967370 977107 987067 996173 1004793 1014771 1027283
49517 1027283 1041369 1055083 1067321 1077856 1086384 1092704 1097556 1102130 1106607 1110032 1111808 1112642 1113727
49504 1113727 1115486 1117331 1118260 1117458 1114597 1109809 1103315 1095123 1085287 1074324 1063039 1051977 1041315
49491 1041315 1031141 1021458 1011964 1002324 992739 983889 976194 969481 963398 957784 952470 947079 941301 935279
49477 935279 929599 924960 921763 919801 918375 916952 915737 915365 916068 917467 919262 921826 925864 931661 938738
49462 938738 946185 953307 960153 967498 976150 986138 996652 1006769 1016148 1024953 1033199 1040361 1045676 1048852
49448 1048852 1050294 1050533 1049575 1047111 1043276 1038715 1033784 1028181 1021646 1014620 1007807 1001401 995157 988961
49434 988961 982950 977355 972709 969968 969889 972413 977133 984067 993402 1004701 1017062 1030052 1043821 1058374
49420 1058374 1073499 1089493 1107210 1127046 1148302 1169527 1188707 1203140 1210370 1210179 1205302 1199487
49408 1199487 1195043 1192487 1191898 1193815 1198973 1207858 1220576 1236712 1255305 1275261 1295913 1317046 1338557
49395 1338557 1360248 1381800 1402621 1421815 1438505 1452152 1462504 1469411 1472818 1472767 1469258 1462338 1452405
49382 1452405 1440095 1425734 1409276 1391100 1372469 1354766 1338492 1323399 1309390 1296830 1286064
49371 1286064 1277069 1269672 1263833 1259651 1257187 1256151 1255602 1254167 1250891 1245749 1239130 1231062 1221378 1210392
49357 1210392 1198838 1187129 1175120 1162654 1149894 1137008 1123965 1110911 1098381 1086890 1076581
49346 1076581 1067461 1059641 1053033 1047081 1041261 1035772 1031248 1027668 1023986 1019138 1013234 1007425 1002690 999102
49332 999102 996272 994104 992813 992431 992749 993825 996199 1000328 1005888 1011829 1017192 1021869 1026656 1032582 1040163
49317 1040163 1049144 1058850 1068705 1078441 1088006 1097456 1106924 1116579 1126555 1136878 1147357 1157575 1167140
49304 1167140 1176085 1184834 1193695 1202563 1211222 1219605 1227496 1234309 1239600 1243564 1246592 1248620 1249563 1250160
49290 1250160 1251508 1253618 1255265 1255575 1255008 1254361 1253530 1251979 1249916 1248208 1247320 1246967 1246755 1246653 1246915 1248025
49274 1248025 1250659 1255226 1261431 1268584 1276303 1284585 1293384 1302513 1311897 1321489 1331020 1340224 1349191 1357968
49260 1357968 1365866 1371694 1374807 1375497 1374271 1371312 1366922 1361985 1357553 1354192 1352031 1351227 1351997 1354233 1357372
49245 1357372 1360719 1363796 1366388 1368325 1369288 1368859 1366874 1363724 1360197 1357046 1354742 1353483 1353214 1353690 1354879
49230 1354879 1357371 1362114 1369556 1379248 1390454 1402946 1416957 1432470 1448876 1465398 1481706 1497945
49218 1497945 1514232 1530348 1545993 1561130 1575766 1589415 1601185 1610725 1618875 1627079 1636174 1645983
49206 1645983 1655977 1665992 1676353 1687543 1699834 1713013 1726507 1739955 1753521 1767301 1780569
49195 1780569 1792135 1801501 1809068 1815007 1818507 1818631 1815500 1810139 1803389 1795537 1786827 1777693 1768443 1759229
49181 1759229 1750500 1743003 1737228 1733260 1731390 1732272 1736045 1741706 1748045 1755107 1764168 1776279 1791438 1809296
49167 1809296 1829903 1853151 1877792 1901678 1922999 1940913 1955137 1965600 1972919 1978727 1984971 1992745
49155 1992745 2002017 2012419 2023964 2036860 2050954 2065718 2080763 2096103 2111824 2127778 2143854
49144 2143854 2160315 2177413 2194667 2210957 2225499 2238396 2250001 2260158 2268479 2275079 2280545 2285314
49132 2285314 2289591 2293753 2298300 2303303 2308398 2313362 2318201 2322572 2325713 2327302 2328034 2329051 2331161 2334836
49118 2334836 2340554 2348746 2359677 2373675 2391193 2412327 2436573 2463398 2492845 2525252 2560661 2598903
49106 2598903 2639978 2683893 2730216 2778147 2826790 2874936 2920740 2962262 2998513 3029831 3057183
49095 3057183 3080969 3099879 3110555 3109135 3094272 3068744 3037460 3003732 2967795 2928565 2885870
49084 2885870 2840916 2795691 2752446 2713064 2678171 2647077 2618980 2593938 2572419 2554314 2538889
49073 2538889 2525484 2513809 2503702 2494960 2487417 2480897 2475197 2470324 2466621 2464344 2463171 2462414 2461798 2461852
49059 2461852 2463355 2466410 2470152 2473474 2475995 2478170 2480448 2482702 2484743 2486996 2490102 2493981 2497890 2501479
49045 2501479 2505235 2509762 2515213 2521689 2529677 2539689 2551824 2566081 2582753 2602121 2624031 2648180
49033 2648180 2674596 2703447 2734534 2767363 2801522 2836577 2871691 2905752 2937879 2967458 2993744
49022 2993744 3015736 3032437 3042945 3046459 3042702 3032539 3017802 3000329 2981341 2961794 2942836 2925454
49010 2925454 2909784 2895227 2881424 2868897 2858491 2850271 2843300 2836600 2830123 2824574 2820437 2817466 2815127
48997 2815127 2813209 2811854 2811160 2810954 2810883 2810625 2810051 2809117 2807552 2804797 2800432 2794593 2787748 2780179 2772088 2764036
48981 2764036 2756738 2750282 2744080 2737784 2731736 2726228 2720862 2715035 2708696 2702254 2696133 2690913 2687495 2686416
48967 2686416 2687184 2688831 2691051 2694236 2698624 2704062 2710630 2718794 2728763 2740197 2752756 2766500 2781564
48954 2781564 2797890 2815463 2834453 2854871 2876366 2898454 2920640 2942292 2962917 2982824 3003065
48943 3003065 3024425 3046797 3069824 3093656 3118623 3144606 3171426 3199754 3231011 3266177 3305142
48932 3305142 3347312 3392512 3441071 3493288 3548983 3607423 3667494 3728135 3788824 3849730 3911406
48921 3911406 3974389 4039016 4105395 4173413 4242813 4313294 4384320 4454672 4522350 4585312 4642537
48910 4642537 4694395 4742017 4786556 4829053 4870573 4911872 4952803 4992401 5029832 5065102 5098664
48899 5098664 5130551 5160251 5187446 5212466 5235838 5257620 5277415 5294956 5310458 5324398 5337138
48888 5337138 5348850 5359649 5369623 5378659 5386353 5392155 5395633 5396581 5394944 5390793 5384370 5376035 5366060 5354462
48874 5354462 5340968 5324914 5305016 5279382 5245991 5203357 5150914 5089119 5019405 4943839 4864480
48863 4864480 4782903 4700421 4618569 4539041 4463052 4391001 4322834 4258527 4198152 4141707 4089196
48852 4089196 4040826 3996969 3957879 3923440 3893233 3866861 3844298 3825816 3811386 3800256 3791352
48841 3791352 3784162 3778992 3776280 3775961 3777568 3780505 3783860 3786267 3786534 3784487 3780906 3776718 3772616 3769422
48827 3769422 3768187 3769586 3773575 3779997 3789240 3801876 3817808 3836322 3856967 3879931 3905362 3932806
48815 3932806 3961666 3991919 4023935 4057636 4092267 4127082 4162060 4197863 4235289 4274730 4315922
48804 4315922 4358082 4400524 4443319 4487255 4533079 4580905 4630335 4680840 4731784 4782253 4831143
48793 4831143 4877359 4919793 4957343 4989318 5015854 5037751 5055998 5071552 5085325 5097825 5108702
48782 5108702 5116962 5121768 5122764 5119648 5111793 5098521 5079471 5054593 5024130 4988840 4949901 4908213
$$ [...]
##END NTUPLES=NMR SPECTRUM
##END=
