##TITLE=AC1546_ROEFFECT0013_8268638_p2KN6tGBTQ
##JCAMPDX= 6.0         $$ Bruker NMR JCAMP-DX V2.0
##DATA TYPE= NMR SPECTRUM
##DATA CLASS= NTUPLES
##ORIGIN= BRUKER
##OWNER= Administrator
$$ 1.72 TOPSPIN		Version 2.1
$$ 2013-10-11 21:27:55.907 -0700  Administrator@X
$$ Compression mode = diff/dup
##.OBSERVE FREQUENCY= 400.02188249412
##.OBSERVE NUCLEUS= ^1H
##.ACQUISITION MODE= SIMULTANEOUS (DQD)
##.ACQUISITION SCHEME= undefined
##.AVERAGES= 8
##.DIGITISER RES= 22
##SPECTROMETER/DATA SYSTEM= spect
##.PULSE SEQUENCE= zg30
##.SOLVENT NAME= COFFEE_meoh
##.SHIFT REFERENCE= INTERNAL, COFFEE_meoh, 1, 14.98509
##AUDIT TRAIL= $$ (NUMBER, WHEN, WHO, WHERE, PROCESS, VERSION, WHAT)
$$ ##TITLE= Audit trail, TOPSPIN		Version 2.1
$$ ##JCAMPDX= 5.01
$$ ##ORIGIN= Bruker BioSpin GmbH
$$ ##OWNER= Administrator
$$ $$ E:\/data/COFFEE/nmr/AC1546_ROEFFECT0013_8268638_p2KN6tGBTQ/10/pdata/1/auditp.txt
$$ ##AUDIT TRAIL=  $$ (NUMBER, WHEN, WHO, WHERE, PROCESS, VERSION, WHAT)
(   1,<2013-10-11 21:27:49.126 -0700>,<Administrator>,<X>,<go>,<TOPSPIN 2.1>,
      <created by zg
	started at 2013-10-11 21:26:43.392 -0700,
	POWCHK enabled, PULCHK disabled,
       configuration hash MD5:
       C8 4E 4E 5D D3 5C D8 9E 9F 52 82 E0 59 8A DE 15
       data hash MD5: 64K
       5E CB D7 2F E4 84 37 8A A4 52 5F FA E0 35 97 76>)
(   2,<2013-10-11 21:27:52.142 -0700>,<Administrator>,<X>,<proc1d>,<TOPSPIN 2.1>,
      <Start of raw data processing
       efp LB = 0 FT_mod = 6 PKNL = 1 PHC0 = 0 PHC1 = 0 SI = 32K 
       data hash MD5: 32K
       C4 0B 31 B3 17 A5 32 33 93 76 1A 7B 07 04 D5 FD>)
(   3,<2013-10-11 21:27:52.485 -0700>,<Administrator>,<X>,<proc1d>,<TOPSPIN 2.1>,
      <pk PHC0 = 95.19104 PHC1 = 0 
       data hash MD5: 32K
       64 DA 19 9F E8 CC 40 2D 6D B8 B2 90 2D 0C 19 62>)
(   4,<2013-10-11 21:27:52.579 -0700>,<Administrator>,<X>,<proc1d>,<TOPSPIN 2.1>,
      <abs ABSG = 1 
       data hash MD5: 32K
       FB DD C1 C9 DC 1E 6B 89 7B C4 AE 5B CF 89 16 FB>)
(   5,<2013-10-11 21:27:52.642 -0700>,<Administrator>,<X>,<proc1d>,<TOPSPIN 2.1>,
      <abs ABSG = 2 
       data hash MD5: 32K
       B7 7D 24 FD F3 1F 9B 5B 65 EA B6 7E C3 CC 2E 71>)
(   6,<2013-10-11 21:27:52.704 -0700>,<Administrator>,<X>,<proc1d>,<TOPSPIN 2.1>,
      <abs ABSG = 3 
       data hash MD5: 32K
       EB DF 83 15 50 D4 49 69 09 A9 1F 6F 73 20 0E 6C>)
(   7,<2013-10-11 21:27:52.751 -0700>,<Administrator>,<X>,<proc1d>,<TOPSPIN 2.1>,
      <abs ABSG = 4 
       data hash MD5: 32K
       9F BE 50 79 AF C9 E8 AF 3C 08 8B E5 0E 04 73 B6>)
(   8,<2013-10-11 21:27:52.798 -0700>,<Administrator>,<X>,<proc1d>,<TOPSPIN 2.1>,
      <abs ABSG = 5 
       data hash MD5: 32K
       05 B2 D6 76 45 87 9E 34 E0 2E 09 A8 75 1F C0 AC>)
$$ ##END=
$$ 
$$ $$ hash MD5
$$ $$ 7D 67 86 30 2E 12 B2 CF B8 BA 7F 86 E9 A2 6A FF
##$RELAX= 
##$RELAX= 
##$RELAX= 
##$RELAX= 
##$RELAX= 
##$RELAX= 
##$RELAX= 
$$ Bruker specific parameters
$$ --------------------------
##$DU= <E:\>
##$EXPNO= 10
$$ [...]
##$TP= (0..7)
150 150 150 150 150 150 150 150
##$TP07= 0
##$TPNAME0= <>
##$TPNAME1= <>
##$TPNAME2= <>
##$TPNAME3= <>
##$TPNAME4= <>
##$TPNAME5= <>
##$TPNAME6= <>
##$TPNAME7= <>
##$TPOAL= (0..7)
0.5 0.5 0.5 0.5 0.5 0.5 0.5 0.5
##$TPOFFS= (0..7)
0 0 0 0 0 0 0 0
##$TUNHIN= 0
##$TUNHOUT= 0
##$TUNXOUT= 0
##$USERA1= <user>
##$USERA2= <user>
##$USERA3= <user>
##$USERA4= <user>
##$USERA5= <user>
##$V9= 5
##$VALIST= <valist>
##$VCLIST= <CCCCCCCCCCCCCCC>
##$VD= 0
##$VDLIST= <DDDDDDDDDDDDDDD>
##$VPLIST= <PPPPPPPPPPPPPPP>
##$VTLIST= <TTTTTTTTTTTTTTT>
##$WBST= 1024
##$WBSW= 4
##$XGAIN= (0..3)
0 0 0 0
##$XL= 0
##$YL= 0
##$YMAX_a= 646278
##$YMIN_a= -548440
##$ZGOPTNS= <>
##$ZL1= 120
##$ZL2= 120
##$ZL3= 120
##$ZL4= 120
##$ABSF1= 14.98509
##$ABSF2= -5.573092
##$ABSG= 5
##$ABSL= 3
##$ALPHA= 0
##$AQORDER= 0
##$ASSFAC= 0
##$ASSFACI= 0
##$ASSFACX= 0
##$ASSWID= 0
##$AUNMP= <proc_prof1d_extract_pilot.lims>
##$AXLEFT= 0
##$AXNAME= <>
##$AXNUC= <1H>
##$AXRIGHT= 0
##$AXTYPE= 0
##$AXUNIT= <>
##$AZFE= 0.1
##$AZFW= 0.1
##$BCFW= 0
##$BC_mod= 0
##$BYTORDP= 0
##$COROFFS= 0
##$CY= 15
##$DATMOD= 1
##$DC= 0
##$DFILT= <>
##$DTYPP= 0
##$F1P= 0
##$F2P= 0
##$FCOR= 0.5
##$FTSIZE= 32768
##$FT_mod= 6
##$GAMMA= 0
##$GB= 0
##$INTBC= 1
##$INTSCL= 1
##$ISEN= 128
##$LB= 0
##$LEV0= 0
##$LPBIN= 0
##$MAXI= 10000
##$MC2= 0
##$MEAN= 0
##$ME_mod= 0
##$MI= 0
##$NCOEF= 0
##$NC_proc= -8
##$NLEV= 6
##$NOISF1= 0
##$NOISF2= 0
##$NSP= 0
##$NTH_PI= 0
##$NZP= 0
##$OFFSET= 14.98509
##$PC= 1
##$PHC0= 95.19104
##$PHC1= 0
##$PH_mod= 1
##$PKNL= yes
##$PPARMOD= 0
##$PPDIAG= 0
##$PPIPTYP= 0
##$PPMPNUM= 2147483647
##$PPRESOL= 1
##$PSCAL= 4
##$PSIGN= 0
##$PYNMP= <proc.py>
##$REVERSE= no
##$SF= 400.02
##$SI= 32768
##$SIGF1= 0
##$SIGF2= 0
##$SINO= 400
##$SIOLD= 32768
##$SPECTYP= <>
##$SREGLST= <1H.CDCl3>
##$SSB= 0
##$STSI= 32768
##$STSR= 0
##$SW_p= 8223.68421052631
##$SYMM= 0
##$S_DEV= 0
##$TDeff= 65536
##$TDoff= 0
##$TI= <>
##$TILT= no
##$TM1= 0
##$TM2= 0
##$TOPLEV= 0
##$USERP1= <user>
##$USERP2= <user>
##$USERP3= <user>
##$USERP4= <user>
##$USERP5= <user>
##$WDW= 1
##$XDIM= 32768
##$YMAX_p= 454887389
##$YMIN_p= -709278
##$CURPLOT= <Network HP LaserJet P1505>
##$CURPRIN= <$Network HP LaserJet P1505>
##$DFORMAT= <normdp>
##$LAYOUT= <+/1D_H.xwp>
##$LFORMAT= <normlp>
##$PFORMAT= <normpl>
##$SURQMSG= 1
$$ End of Bruker specific parameters
$$ ---------------------------------
##NTUPLES= NMR SPECTRUM
##VAR_NAME=  FREQUENCY,     SPECTRUM/REAL,   SPECTRUM/IMAG
##SYMBOL=    X,             R,               I
##VAR_TYPE=  INDEPENDENT,   DEPENDENT,       DEPENDENT
##VAR_FORM=  AFFN,          ASDF,            ASDF
##VAR_DIM=   32768,         32768,           32768
##UNITS=     HZ,            ARBITRARY UNITS, ARBITRARY UNITS
##FACTOR=    0.250966925370066, 1,           1
##FIRST=     8223.43324360094, 26760,        24555
##LAST=      0,             -120412,         -48018
##MIN=       0,             -709278,         0
##MAX=       8223.43324360094, 454887389,    0
$$ Real data points
##PAGE= N=1
##DATA TABLE= (X++(R..R)), XYDATA
$$ [...]
19574b4903p3816m8397k42811G0052a1101C35282a35356j14086P5784D492L18745
$$ -24903 -98719 -147116 -389927 70052 -11101 335282 -135356 -249442 -173658 4492 323237
19563C23237b32707g1425B11d30965B80557e8833j18472B8133b30495A76542a25437
$$ 323237 -232707 -71425 211 -430965 280557 -58833 -177305 28133 -230495 176542 -125437
19551A9753b47690a194A54919D7190b95073a43003d9056p8149D5290K79027j40773
$$ 19753 -247690 -1194 154919 47190 -295073 -143003 -49056 -127205 45290 324317 183544
19540A83544P6811A5607J2973r149b60636K8702H8190b50422A00885a79849B2317
$$ 183544 260355 15607 28580 19431 -260636 -231934 88190 -250422 100885 -179849 22317
19528A39236b2674n9027c7138k90440a42570I0069h2939A97595K7723F6924f3247
$$ 139236 -22674 -81701 -37138 -327578 -142570 90069 -82939 197595 225318 66924 -63247
19516c88330J63161i6295B17817B0688a79721a8649C14128b36338b191j58881
$$ -388330 -225169 -96295 217817 20688 -179721 -18649 314128 -236338 -2191 -161072
19506a61072b6366E4484a02653j70495B74301G876J20100J8201a61135j2175g5225
$$ -161072 -26366 54484 -102653 -273148 274301 7876 127976 146177 -161135 -173310 -75225
19494A5708d46116J50282i8539a3422j07949p6714A81859K1685a42558A36091
$$ 15708 -446116 -295834 -98539 -13422 -121371 -198085 181859 203544 -142558 136091
19483B8351E358P7268i952M049C47402b73367a8863l20684C1811J07248a01904
$$ 28351 5358 82626 -9952 -5903 347402 -273367 -18863 -339547 31811 139059 -101904
19471b62173C03931C3988a33833p692e3633p2899b7634j54749i0678A45764a37037
$$ -262173 303931 33988 -133833 -141525 -53633 -126532 -27634 -182383 -90678 145764 -137037
19459f4922F6924a81729B40378a91462A19970d24164A36957a75600l8542C16621
$$ -64922 66924 -181729 240378 -191462 119970 -424164 136957 -175600 -214142 316621
19448a09757F8746O5403a13441r7550K3311H4228c4780l58599C9841g7774q4621
$$ -109757 68746 134149 -113441 -210991 -187680 84228 -34780 -393379 39841 -77774 -162395
19437a62395L2938k34281J27937l8244C0703a75751C3180c5002o0695j82497a6467
$$ -162395 -129457 -363738 -235801 -274045 30703 -175751 33180 -35002 -95697 -278194 -16467
19425D2179N9005a16713m3134j90092a15270B05660R0368a16471n0952j18955
$$ 42179 101184 -116713 -159847 -349939 -115270 205660 296028 -116471 -167423 -286378
19415b86378e655j4075A80965a9350A41714l8084i8659q1551m4642H0933c2471
$$ -286378 -5655 -19730 180965 -19350 141714 103630 -98659 -180210 -224852 80933 -32471
19403a29776K8897p9678C9496b61605N7047g1887B65772a88977G4543J58473b58846
$$ -129776 -100879 -180557 39496 -261605 -204558 -71887 265772 -188977 74543 233016 -258846
19391a75668F2841a02182C76376g6506l4195B121f4653k09538a01585M1679K804
$$ -175668 62841 -102182 376376 -76506 -110701 2121 -64653 -274191 -101585 -59906 -57102
19380e7102j51867n7453J25843n2345G4803a24688j75643J45537N0505r5771a176
$$ -57102 -208969 -266422 -140579 -192924 74803 -124688 -300331 -154794 -104289 -200060 -1176
19368d3661r4167M0219d6887j09627I3331a09644A18641d6003B11180i3627D26549
$$ -43661 -137828 -97609 -46887 -156514 93331 -109644 118641 -46003 211180 -93627 426549
19356A5543a8947l7881J6761j03861B08914a70225M0822C69199B215c05356A42627
$$ 15543 -18947 -56828 -40067 -143928 208914 -170225 -129403 369199 2215 -305356 142627
19344b15658C87339d71471B8421i2844a434j36377l7966A3869K2650L6950a09901
$$ -215658 387339 -471471 28421 -92844 -1434 -137811 -175777 13869 36519 73469 -109901
19332b20898L0659F7649K07092c5566A19374a74024A19691a64660j22346h8801
$$ -220898 -190239 67649 274741 -35566 119374 -174024 119691 -164660 -287006 -88801
19321b06013A91362c19830d4364l52473J55007A37162i8516c7622k6784j99463
$$ -206013 191362 -319830 -44364 -396837 -241830 137162 -98516 -37622 -64406 -263869
19311b63869B4848a25821j9017A51495m9523c60938O5985J44385J8819O0895j02342
$$ -263869 24848 -125821 -144838 151495 101972 -360938 -294953 -150568 -131749 -70854 -173196
19300a73196N8209r1712c9510j05036j18265k91182b65771D3659b31908B15b16170
$$ -173196 -114987 -206699 -39510 -144546 -262811 -553993 -265771 43659 -231908 215 -216170
19288g251H6548b84971M8977A90549g6240I2424a09359j73802R3514P8699G9267
$$ -7251 86548 -284971 -235994 190549 -76240 92424 -109359 -283161 -189647 -110948 79267
19276i8255j64064J25532D3688b82739J41079j52645g9761K2981C8551a49971
$$ -98255 -262319 -136787 43688 -282739 -141660 -294305 -79761 -56780 38551 -149971
19265G6369b85326M2325B31823a15903g000k05197C17125i6426H7700b02085K5838
$$ 76369 -285326 -243001 231823 -115903 -7000 -212197 317125 -96426 87700 -202085 -176247
19254a76247B9038N5201e3850b4891I0843B5420J10666b51801A7460a18247k97836
$$ -176247 29038 84239 -53850 -24891 90843 25420 136086 -251801 17460 -118247 -416083
19243d16083a35343k2595d4500j74597h0053o5717d375G9690B1958P8847f6792
$$ -416083 -135343 -157938 -44500 -219097 -80053 -145770 -4375 79690 21958 100805 -66792
19231a30425n2961J3967b0687D0803L1623g4093B88760j27931C0925R0681a95434
$$ -130425 -183386 -169419 -20687 40803 72426 -74093 288760 160829 30925 121606 -195434
19219F1637J52371C474J77954G4944e5066o3734A41426o2015a96568G9658a55806
$$ 61637 214008 3474 181428 74944 -55066 -118800 141426 79411 -196568 79658 -155806
19207B44902B1367a72830I2035b80446A16536a03404M0150j25024I5496a30562
$$ 244902 21367 -172830 92035 -280446 116536 -103404 -63254 -188278 95496 -130562
19196G1907a12950A99664I2628d54630K02033B1166e9563j85854A94519P5259
$$ 71907 -112950 199664 92628 -454630 -252597 21166 -59563 -245417 194519 269778
19186B69778A4477g371A13557b19261H7662P3135h3967j37079B2050b93277A05425
$$ 269778 14477 -7371 113557 -219261 87662 160797 -83967 -221046 22050 -293277 105425
19174E6507r732K24628C6857e37968f0027F0202a36745m4207m1730h7171j85678
$$ 56507 46775 271403 36857 -537968 -60027 60202 -136745 -180952 -222682 -87171 -272849
19163b72849E2129d34851J41714i8875A11053C9225a68862H0658a44027k62040
$$ -272849 52129 -434851 -293137 -98875 111053 39225 -168862 80658 -144027 -406067
19153d06067A10422g7898D9527a01152L4806j09276B67693I4477c2437K738C7628
$$ -406067 110422 -77898 49527 -101152 -66346 -175622 267693 94477 -32437 -29699 37628
19141c26659d5327D59388c17037J40149A18865n0754J38524b15105i6304I9807
$$ -326659 -45327 459388 -317037 -176888 118865 68111 206635 -215105 -96304 99807
19130A03329a10099B27426b3882j03852A5174M4159P3916C1982O1417a85375I2004
$$ 103329 -110099 227426 -23882 -127734 15174 59333 133249 31982 93399 -185375 92004
19118H8363a56766A48997a28108m674C8944c03003p987k6756e0319B0183d5099
$$ 88363 -156766 148997 -128108 -132782 38944 -303003 -310990 -337746 -50319 20183 -45099
19106I6557e0099I2211a9656k34704H8974k3526M8510Q4961J05656a34648A87069
$$ 96557 -50099 92211 -19656 -254360 88974 65448 113958 198919 304575 -134648 187069
19094B84780b44244K942g2799H1669b24641E3404g5938A03596b03045c8725A65416
$$ 284780 -244244 -241302 -72799 81669 -224641 53404 -75938 103596 -203045 -38725 165416
19082d02885e5190r8676d9735j37600Q7898r4317D391a5564A0280b08307A81175
$$ -402885 -55190 -153866 -49735 -187335 -99437 -193754 4391 -15564 10280 -208307 181175
19070f25533B06746q2075j3051g2379R382q7801f028B86043c8617G0190a65837
$$ -625533 206746 124671 111620 -72379 -62997 -150798 -6028 286043 -38617 70190 -165837
19058h954C1217K2593b09783K3958j11311k5652a56690a3747r5525k2158A08108
$$ -8954 31217 53810 -209783 -185825 -297136 -322788 -156690 -13747 -109272 -131430 108108
19046d18038i3730B7214b3450m29419H1646J40594B916P4704a50962H0095B2482
$$ -418038 -93730 27214 -23450 -452869 81646 222240 2916 77620 -150962 80095 22482
19034E8869J79135b77221J22577i995j00427A78717F7993a58567A75425M7557
$$ 58869 238004 -277221 -154644 -9995 -110422 178717 67993 -158567 175425 222982
19024B22982b47622I7375c23103J05656B5011Q2878h6485j58667F9675R0095b68368
$$ 222982 -247622 97375 -323103 -217447 25011 107889 -86485 -245152 69675 159770 -268368
19012c00816J4707p3190B99307A07518b05280k90467b6685A08074j3225b43151
$$ -300816 -286109 -359299 299307 107518 -205280 -495747 -26685 108074 94849 -243151
19001c14731J167i1026E978a61732k23068g0205q9096p3288Q3811j43456A29656
$$ -314731 -313564 -91026 5978 -161732 -384800 -70205 -159301 -232589 -148778 -292234 129656
18989B03482F0009g5866a1830j23907H7532d295k35090C4905e7791A14962a70400
$$ 203482 60009 -75866 -11830 -135737 87532 -4295 -239385 34905 -57791 114962 -170400
18977A09437c39843a07492B87704b64614g2993k06380a29169j42944a32344m17558
$$ 109437 -339843 -107492 287704 -264614 -72993 -279373 -129169 -272113 -132344 -549902
18967e49902d9580a4699l14782J59808A03469c41315a43105a5720M714j14600
$$ -549902 -49580 -14699 -329481 -169673 103469 -341315 -143105 -15720 -11006 -125606
18957a25606d2783A2558c6453j61315h2006c6116k65761i9139n354b9081H3303
$$ -125606 -42783 12558 -36453 -197768 -82006 -36116 -301877 -99139 -104493 -29081 83303
18945a35310B02712c32465a7178A53306b14888C6785j5919J16067f3332l5756
$$ -135310 202712 -332465 -17178 153306 -214888 36785 20866 136933 -63332 -99088
18935i9088o5449O8689B60334E6346J69883D6179M5536A1974b72622F4846O8895
$$ -99088 -164537 -95848 260334 56346 226229 46179 91715 11974 -272622 64846 133741
18924A33741c3976k06540B11913C0854J14430e8089E02394i473a926B11365E0322
$$ 133741 -33976 -240516 211913 30854 145284 -58089 502394 -9473 -1926 211365 50322
18912F887a54706r2754P0858r472C2673a22637C00410d13516J28644e9959A1459
$$ 6887 -154706 -247460 -176602 -186074 32673 -122637 300410 -413516 -284872 -59959 11459
18900f1874K4236j59574P3370o8763B33421a81415d4141k81803K061D2068a02684
$$ -61874 -37638 -197212 -123842 -192605 233421 -181415 -44141 -325944 -323883 42068 -102684
18888C6317a24000A88179b30229E5757b67529k33569a52703A55489a85025E031
$$ 36317 -124000 188179 -230229 55757 -267529 -501098 -152703 155489 -185025 5031
18877I6644J2347i53F3115a57081p9368J13093B84249F7790f0186A47461b62888
$$ 96644 108991 -953 63115 -157081 -236449 -123356 284249 67790 -60186 147461 -262888
18865a4215k34789p2124B5675K817b37666b9638j2921A10782d79957A77165a82173
$$ -14215 -249004 -321128 25675 28492 -237666 -29638 -42559 110782 -479957 177165 -182173
18853I6891B8138R0125a57882l8930b7263J385j65298m1714A94628o7843a06575
$$ 96891 28138 118263 -157882 -196812 -27263 -25878 -191176 -232890 194628 126785 -106575
18841B0829a36800c5254D7400a48906a3613p3071j40674L7708p422C7246a30615
$$ 20829 -136800 -35254 47400 -148906 -13613 -86684 -227358 -189650 -197072 37246 -130615
18829d3551J9587l4981A43954a58234c3458k5167C0350Q5494b9069A5008J7192
$$ -43551 -23964 -58945 143954 -158234 -33458 -58625 30350 115844 -29069 15008 32200
18818C2200L2116O7321C0078a61997e7936A54068L38434C0118Q5923b1599B48539
$$ 32200 64316 131637 30078 -161997 -57936 154068 492502 30118 116041 -21599 248539
18806D3394L276g5433F7885K10750B5186b46959Q8594E5505b01114f2603G3855
$$ 43394 46670 -75433 67885 278635 25186 -246959 -158365 55505 -201114 -62603 73855
18794A38797b3691O971k90057F1892P5951c04695M5888B74149H7445a43270a2182
$$ 138797 -23691 -16720 -306777 61892 137843 -304695 -258807 274149 87445 -143270 -12182
18782c3107l928N574m04915A31337N7113a77518N7002k06086J36953B73364a7324
$$ -33107 -37035 -31461 -436376 131337 188450 -177518 -120516 -326602 -189649 273364 -17324
18770H9556a53512J8276j3406j44846J06984A19812c99034D7027c93819A26371
$$ 89556 -153512 -135236 -148642 -293488 -186504 119812 -399034 47027 -393819 126371
18759b51149A5922K1556a71867H7325b20851O1161O5023j28900B3603R6551c4593
$$ -251149 15922 37478 -171867 87325 -220851 -159690 -94667 -223567 23603 120154 -34593
18747c86523A09225a21055q8561f2086l84188A15108a13200P608A6447c6449k09563
$$ -386523 109225 -121055 -209616 -62086 -446274 115108 -113200 -105592 16447 -36449 -246012
18736b46012F9910e16335A40264c6919G9767c8452A13466c08208a51920A4732
$$ -246012 69910 -516335 140264 -36919 79767 -38452 113466 -308208 -151920 14732
18725a3971j46458O2789j79310J22492H899J95971G7520K23233A7670b97595G0912
$$ -13971 -160429 -97640 -276950 -154458 8899 204870 77520 300753 17670 -297595 70912
18713a77058a4181j03040G5655a3524m6677p9583D72098A49649a93088B67164
$$ -177058 -14181 -117221 75655 -13524 -60201 -139784 472098 149649 -193088 267164
18702c20008a25007M5759a345k5282j91604j72826J88410A6393f6448D6784b4265
$$ -320008 -125007 -79248 -1345 -26627 -218231 -391057 -202647 16393 -66448 46784 -24265
18690a91476O1585j86324g3022K0248G3145J1047F731i8041A04971a56889j81486
$$ -191476 -129891 -316215 -73022 -52774 73145 84192 6731 -98041 104971 -156889 -338375
18679c38375M6160a33547K7803j00590P359D3308a57073m879j23684I9640e0890
$$ -338375 -292215 -133547 -105744 -206334 -198975 43308 -157073 -161952 -285636 99640 -50890
18667A84707a53264D4630b45768O9402B21810a6538l4971a3935n8751j11605L7092
$$ 184707 -153264 44630 -245768 -176366 221810 -16538 -51509 -13935 -72686 -184291 -147199
18656a47199j9723k7392b6418A42186m4334d4649j22631N6800E5954J62823a97727
$$ -147199 -166922 -194314 -26418 142186 97852 -44649 -167280 -110480 55954 218777 -197727
18644b48084a16868A13964l6778O123e4734B4312L292K09718d6883H51h1650r7879
$$ -248084 -116868 113964 77186 83309 -54734 24312 27604 237322 -46883 851 -81650 -179529
18632a79529B81509b15536b6826k91498g5965B06376I4421B0012h1785p3395H6105
$$ -179529 281509 -215536 -26826 -318324 -75965 206376 94421 20012 -81785 -155180 86105
18620b32171b4290j04304F8063K11209h8956G6180a6498D4556e1936j57144r0540
$$ -232171 -24290 -128594 68063 279272 -88956 76180 -16498 44556 -51936 -209080 -299620
18609b99620J46114G861a11761A85385E69J93936E1495b78845a21747d3109F5257
$$ -299620 -153506 7861 -111761 185385 569 194505 51495 -278845 -121747 -43109 65257
18597c61511H9048a33877n3834L6593D747c5339m5482C58923b20620f8670k98855
$$ -361511 89048 -133877 -187711 -151118 4747 -35339 -80821 358923 -220620 -68670 -367525
18586c67525F2543F262a83341p2705a4502B41164D8580f0255K7079k03n7460A18494
$$ -367525 62543 6262 -183341 -256046 -14502 241164 48580 -60255 -33176 -33379 -90839 118494
18573g4458J6091o9339i971r4839K4624J0701N354B46685L6217A34138D9541a26670
$$ -74458 -58367 -127706 -9971 -104810 -80186 -69485 -64131 246685 282902 134138 49541 -126670
18560I1709a97172C3331a73598e2635m32o6825N3264k87964M7858J19245b4999
$$ 91709 -197172 33331 -173598 -52635 -53067 -119892 -66628 -354592 -306734 -187489 -24999
18548D8748d3014c538G8696a22167k09152a13032a3586B0985N0410g3255h467
$$ 48748 -43014 -3538 78696 -122167 -331319 -113032 -13586 20985 71395 -73255 -8467
18536a75728A9733h8931L1342j43186M9943L4969A24872a11922D1545a30629n1892
$$ -175728 19733 -88931 -57589 -200775 -150832 -115863 124872 -111922 41545 -130629 -182521
18525a82521d4292I3758C3115Q334c1919B0610c5406B42054l3518F2724K74808
$$ -182521 -44292 93758 33115 41449 -31919 20610 -35406 242054 208536 62724 337532
18514C37532j46026A6913b46246r728i032B93004l4483L06587c89971f8853F6994
$$ 337532 191506 16913 -246246 -255974 -9032 293004 258521 565108 -389971 -68853 66994
18502D08181d0099k1796O700B10925b31981Q2226G0974a27152j36344N7001A05673
$$ 408181 -40099 -61895 -55195 210925 -231981 -149755 70974 -127152 -263496 -206495 105673
18490d19923C2417a7092k91528b9741j49152A05173C945R2804c63797a80774c3926
$$ -419923 32417 -17092 -308620 -29741 -178893 105173 3945 96749 -363797 -180774 -33926
18478f7980q4353A36895a98486e0123B23582A6976a50165B8530a0431D2501a94091
$$ -67980 -152333 136895 -198486 -50123 223582 16976 -150165 28530 -10431 42501 -194091
18466b96677J24504A81079b3194j50474j13586N660b6037D3921Q122M3832J65530
$$ -296677 -172173 181079 -23194 -173668 -287254 -281594 -26037 43921 52043 95875 261405
18455B61405g704D6205F236a28019q7871a3107j32275i357C4238J46653b8463
$$ 261405 -7704 46205 6236 -128019 -215890 -13107 -145382 -9357 34238 180891 -28463
18443a7347j70879m8908i8977m0823B13904a28745j83548C57722A69906M825a9366
$$ -17347 -188226 -237134 -98977 -139800 213904 -128745 -312293 357722 169906 174731 -19366
18431b15333g0256A0165J86238b44926J10191C5917A3489J35200Q0758i4780c6143
$$ -215333 -70256 10165 196403 -244926 -134735 35917 13489 148689 229447 -94780 -36143
18419a3312k34355I7886O7698d01705a44372L4564c6940B07845h7869A34228a37395
$$ -13312 -247667 97886 165584 -401705 -144372 -109808 -36940 207845 -87869 134228 -137395
18407b38545A46522c44593a30669A20689J77788b70976d9865k35678A7380e40157
$$ -238545 146522 -344593 -130669 120689 298477 -270976 -49865 -285543 17380 -540157
18396b90695g1899k4870j23485B74261p9574p4633J80434A21973k5958d8683a9528
$$ -290695 -71899 -96769 -220254 274261 194687 120054 300488 121973 96015 -48683 -19528
18384f6802k1251m6445N9537n8269G4827a73480h4970L4513A87018D1126b93284
$$ -66802 -88053 -134498 -74961 -133230 74827 -173480 -84970 -50457 187018 41126 -293284
18372d0562j34330L7440m3265D67371q2718A68364a98731g6695j7971p6878q5360
$$ -40562 -174892 -137452 -180717 467371 384653 168364 -198731 -76695 -94666 -171544 -256904
18361b56904A893J82107k2548a5094k39936q1294A7428b2751C5436a60320l5170
$$ -256904 1893 184000 161452 -15094 -255030 -336324 17428 -22751 35436 -160320 -195490
18350a95490C64963Q4636A35462a22093j7256H6787a74098L0414a9884j65820
$$ -195490 364963 449599 135462 -122093 -139349 86787 -174098 -143684 -19884 -185704
18340a85704g0875b9252k6516l38282a6848k96029A17827a24161c6020H0149a71066
$$ -185704 -70875 -29252 -55768 -394050 -16848 -312877 117827 -124161 -36020 80149 -171066
18328G8500k5773K9260A3213a94864A14812O8131c6007j03618C47180g4638j69553
$$ 78500 52727 81987 13213 -194864 114812 182943 -36007 -139625 347180 -74638 -244191
18317b44191A16368C9280b23355d2168k86227J48422n1079k5131C4810b82685
$$ -244191 116368 39280 -223355 -42168 -328395 -179973 -231052 -256183 34810 -282685
18306A5373a03156I3486J7236c30152a11250p8393d6620A79225h4567l56296B38951
$$ 15373 -103156 93486 110722 -330152 -111250 -189643 -46620 179225 -84567 -440863 238951
18294a69547M143G7199f504j5243j90899R3218k94484J63648I7817A3862J72925
$$ -169547 -165404 77199 -6504 -21747 -212646 -119428 -413912 -250264 97817 13862 186787
18283A86787i3538d5463E4570J284e583k79395B3253a45885A46187F7743g9219
$$ 186787 -93538 -45463 54570 55854 -5583 -284978 23253 -145885 146187 67743 -79219
18271A56766n6342a04187j0659d112j75826N5488K06a4879o5351j53590B2109
$$ 156766 100424 -104187 -114846 -4112 -179938 -124450 -124244 -14879 -80230 -233820 22109
18259A27075d7611k3021D5021a1326j05994c5956H8372a05758B20532f9650H2351
$$ 127075 -47611 -70632 45021 -11326 -117320 -35956 88372 -105758 220532 -69650 82351
18247f2243j5732A43432c16220A79929G0700J346K2115a94524f1165l0536D4889
$$ -62243 -77975 143432 -316220 179929 70700 72046 94161 -194524 -61165 -91701 44889
18235d79207B52842d5578A96954I547L5734i7287d4591r1361A695O5236d92615
$$ -479207 252842 -45578 196954 9547 45281 -97287 -44591 -135952 1695 66931 -492615
18223G5461L7033b59204A03107a63434K5538J5182k04253J41177B39218a7190
$$ 75461 112494 -259204 103107 -163434 -137896 -122714 -326967 -185790 239218 -17190
18212B6450c84184a37886I9659j1160b2949l53860A52796b43051C5759b18900
$$ 26450 -384184 -137886 99659 88499 -22949 -376809 152796 -243051 35759 -218900
18201A1568J05944k0195a47278l938C5588K04622c59394b4071B34711B2289b82714
$$ 11568 117512 97317 -147278 -151216 35588 240210 -359394 -24071 234711 22289 -282714
18189A73851f9004A82179k6762R4018F8348f0076B17368a25085A16237h1804E9606
$$ 173851 -69004 182179 155417 249435 68348 -60076 217368 -125085 116237 -81804 59606
18177A79177i6875B81456b36766p8669g2275l983A42148N6931e478A63409m3033
$$ 179177 -96875 281456 -236766 -315435 -72275 -76258 142148 199079 -5478 163409 120376
18166A20376a01710L649B3216J2743b54672H171a6510A28854b88310j1441J00945
$$ 120376 -101710 -98061 23216 35959 -254672 8171 -16510 128854 -288310 -299751 -198806
18155a98806P7751D8988a01345k52582B25623h5297E0401A8223a69693a2674q204
$$ -198806 -121055 48988 -101345 -353927 225623 -85297 50401 18223 -169693 -12674 -20878
18144b0878A27614k5033d43849a17521A76605b12586A05343C888b06273n9767
$$ -20878 127614 102581 -443849 -117521 176605 -212586 105343 3888 -206273 -266040
18134b66040J00242G3484b06783A00696f417j69308A02177M503e1278C13474j52919
$$ -266040 -165798 73484 -206783 100696 -6417 -175725 102177 106680 -51278 313474 160555
18123A60555g1198k631B70501g9795C85398a84010a2473m09608J88840i1123q1324
$$ 160555 -71198 -73829 270501 -79795 385398 -184010 -12473 -422081 -233241 -91123 -172447
18112a72447N059A127Q2772a7798G7733b37549A49201C9377L6396j4612a20738
$$ -172447 -167388 1127 83899 -17798 77733 -237549 149201 39377 75773 61161 -120738
18100a73274g4859p7303E8508a01394A30637A2749J95526c5495B6918o386h7179
$$ -173274 -74859 -152162 58508 -101394 130637 12749 208275 -35495 26918 20532 -87179
18088b22087A66915e1804B52250A23978b75909J34704b8223l4617k36437a31246
$$ -222087 166915 -51804 252250 123978 -275909 -141205 -28223 -62840 -299277 -131246
18077a55683N9346m79759a36072I4910l6771e9398D9531L2154c96902A56970c9704
$$ -155683 -96337 -576096 -136072 94910 58139 -59398 49531 81685 -396902 156970 -39704
18065A6589g8802k8569C6410A4878P135l297J03737a66867A39486a65579B5953
$$ 16589 -78802 -107371 36410 14878 22013 18716 122453 -166867 139486 -165579 25953
18053I7994a40748J4501H256a16707o1445b7351j59193A40517o1351K2547a11482
$$ 97994 -140748 -126247 8256 -116707 -178152 -27351 -186544 140517 79166 101713 -111482
18041B31455a60617j5608h1302A24358b72468h7900H6928f2254k6011j44012A76107
$$ 231455 -160617 -176225 -81302 124358 -272468 -87900 86928 -62254 -88265 -232277 176107
18029a11010c0497Q526q4452B4198b53284P6705K359B47812h9546j44184N8437
$$ -111010 -30497 -21971 -106423 24198 -253284 -176579 -174220 247812 -89546 -233730 -175293
18018a75293E23001b93208d3228C8740b31904F9810k5321N2213b86751h6209j6836
$$ -175293 523001 -293208 -43228 38740 -231904 69810 44489 96702 -286751 -86209 -103045
18007a03045Q604A72964a40740A00266e0510j88731R4883B30641n8559d1670A88611
$$ -103045 -94441 172964 -140740 100266 -50510 -239241 -144358 230641 172082 -41670 188611
17995d02981A16317L3478a12694q579b7803A84420R4252b68611A94624D8912d6015
$$ -402981 116317 149795 -112694 -121273 -27803 184420 278672 -268611 194624 48912 -46015
17983d9280D73174e1974B8494b58901M9290P8521A6194d7075j73795j8294K4382
$$ -49280 473174 -51974 28494 -258901 -209611 -131090 16194 -47075 -220870 -239164 -214782
17972b14782f4687B7359e231C01749h1676m1555K9093n7916O9608F2676J36378
$$ -214782 -64687 27359 -5231 301749 -81676 -123231 -94138 -152054 -82446 62676 199054
17961A99054a89552H2271O698A6260P6438P0550i8262B39857c3061I2835a36516
$$ 199054 -189552 82271 88969 16260 92698 163248 -98262 239857 -33061 92835 -136516
17949D5436h3347L7171j51804j20828C03297A09241e2939j29759p7695B87025
$$ 45436 -83347 -46176 -197980 -318808 303297 109241 -52939 -182698 -260393 287025
17938A7270a79900F3425J75560G4727f1478A1067M479c24B9805J48605E1829a3748
$$ 17270 -179900 63425 238985 74727 -61478 11067 15546 -324 29805 178410 51829 -13748
17925c207l4501k39461C9787b6866n4682A39366c06173a35374D4357J55442b36591
$$ -3207 -37708 -277169 39787 -26866 -81548 139366 -306173 -135374 44357 199799 -236591
17913b06676a0232C2832a28342k34821e1402j88378A14396a64107k68755a28043
$$ -206676 -10232 32832 -128342 -363163 -51402 -239780 114396 -164107 -432862 -128043
17902c58017J19407e528F7578k9569d46454A37121o4502a62193j39701j43525
$$ -358017 -238610 -5528 67578 38009 -446454 137121 72619 -162193 -301894 -445419
17892d45419a19845A8561J55816A1530a6210A03960a44719A6796c6708A41648
$$ -445419 -119845 18561 174377 11530 -16210 103960 -144719 16796 -36708 141648
17881A91217a16759n405A31989f649p6969a3875D1220a49376k08787A35977i116
$$ 191217 -116759 -122164 131989 -6649 -83618 -13875 41220 -149376 -358163 135977 -9116
17869G2980N0410i0236B214K51430l5366P9077j00167a21220d0856j24765O7565
$$ 72980 123390 -90236 2214 253644 218278 297355 197188 -121220 -40856 -165621 -98056
17858i8056E3062J28160b64614A32830O8273e7697A09481O3750a4692H5019a16858
$$ -98056 53062 181222 -264614 132830 201103 -57697 109481 173231 -14692 85019 -116858
17846B4396J34088B7945a47362E3655g2445C24558a9430A7274a81962M8752B3870
$$ 24396 158484 27945 -147362 53655 -72445 324558 -19430 17274 -181962 -133210 23870
17834B2163f1990o5142B44176c3217p9014B67728b06481h8256B3644N4948C6695
$$ 22163 -61990 -127132 244176 -33217 -112231 267728 -206481 -88256 23644 78592 36695
17822F6516J51894E4908a3303a200F6494b2947B85860b3130D16118F7941d49197
$$ 66516 218410 54908 -13303 -1200 66494 -22947 285860 -23130 416118 67941 -449197
17810b54860j72826J99852C9374J31382f1248j84963r3725G9507k6212J37168
$$ -254860 -427686 -227834 39374 170756 -61248 -246211 -339936 79507 53295 190463
17800A90463k3645o8229i1078J9458B25555A8444a61868k0490A27912L05341e4640
$$ 190463 166818 98589 -91078 -71620 225555 18444 -161868 -182358 127912 433253 -54640
17788e10323A23606k1874c8612j77123M9437A8265a29202A65844a5252H0962a09114
$$ -510323 123606 101732 -38612 -215735 -166298 18265 -129202 165844 -15252 80962 -109114
17776d5028A77397a32532l67761a16495c48m2377n3262b5826O702A31026a76218
$$ -45028 177397 -132532 -500293 -116495 -348 -42725 -95987 -25826 -19124 131026 -176218
17764i4844I9972K1938f450j00884B49620h8748B45009h5426B48269m4613K4186
$$ -94844 99972 121910 -6450 -107334 249620 -88748 245009 -85426 248269 203656 227842
17753B27842a01143j11253d5444j24278A33295d7045l6762A67857a30674e5089
$$ 227842 -101143 -212396 -45444 -169722 133295 -47045 -83807 167857 -130674 -55089
17742A18563a79804G5267c0467k29138C1041a08787K6612r7543c6384D16985A24362
$$ 118563 -179804 75267 -30467 -259605 31041 -108787 -82175 -179718 -36384 416985 124362
17730a84446g5732D6752Q0178h9516j56633d6413C45131f9409j04861m6689o642
$$ -184446 -75732 46752 126930 -89516 -246149 -46413 345131 -69409 -174270 -220959 -227601
17719b27601d2228A40941O4654c4308n5202B64505e2522j23752L6136o4515P8091
$$ -227601 -42228 140941 205595 -34308 -89510 264505 -52522 -176274 -140138 -204653 -126562
17708a26562j39546r196A57312a83591r1607N5857M4071m5074g0953C2339a06690
$$ -126562 -266108 -275304 157312 -183591 -275198 -219341 -175270 -220344 -70953 32339 -106690
17696A58151M4203K40898c45915g6923A79893Q9761a23666B73054E9770P8473
$$ 158151 202354 443252 -345915 -76923 179893 269654 -123666 273054 59770 138243
17686A38243a86566A24962b82144a1857G2130c366j51689C44815a54254j7194
$$ 138243 -186566 124962 -282144 -11857 72130 -3366 -155055 344815 -154254 -171448
17676a71448A65287a22574B6686i1412D2419K75527F3806c3605o0522D81736b47985
$$ -171448 165287 -122574 26686 -91412 42419 317946 63806 -33605 -94127 481736 -247985
17664b5676j43067O7157A06049m7041K50177d9090H9311b4140B37406d13j75373
$$ -25676 -168743 -101586 106049 59008 309185 -49090 89311 -24140 237406 -413 -175786
17653a75786i240D771a54486q2014C59825a52888b525p5039j18653D4378a7875
$$ -175786 -9240 4771 -154486 -236500 359825 -152888 -2525 -77564 -196217 44378 -17875
17641A65189M29444B23135b08552A94878c8486D8705k3037L50653b423A13459
$$ 165189 594633 223135 -208552 194878 -38486 48705 25668 376321 -2423 113459
17630d8208B74543a07435K7483B79645F2573c4385A02339b16774B27741j9008
$$ -48208 274543 -107435 -79952 279645 62573 -34385 102339 -216774 227741 208733
17620B08733p6642o4962i2154k34464b8446I0975d8767h90n2506A55621f5130
$$ 208733 132091 67129 -92154 -326618 -28446 90975 -48767 -890 -53396 155621 -65130
17608b9597q73j89544K1819A20136n3207d4186d220k48399A1628a74563C41083
$$ -29597 -30470 -220014 -198195 120136 66929 -44186 -4220 -252619 11628 -174563 341083
17596a27255A17487n3619P9510b3829c458p8130o1660O8466A3401K49708I1598
$$ -127255 117487 63868 143378 -23829 -3458 -81588 -143248 -74782 13401 263109 91598
17584A3129K71381A007J66608B7596a7550H1226e9938F4625N2879c140j25926
$$ 13129 284510 1007 167615 27596 -17550 81226 -59938 64625 117504 -3140 -129066
17573a29066K4985M7990j71368P7318B0379B856N7334B3846e6518o1342N427A34065
$$ -129066 -104081 -56091 -227459 -150141 20379 2856 60190 23846 -56518 -117860 -112433 134065
17560a32935A08603a8905j69666d0960J1778F1238O8474n1118k489a668r8310
$$ -132935 108603 -18905 -188571 -40960 -29182 61238 129712 78594 76105 -1668 -99978
17549i9978M1528m1158A50552O6540i1926B80383c9299A11635k8443J72466a0713
$$ -99978 -58450 -99608 150552 217092 -91926 280383 -39299 111635 83192 255658 -10713
17537A7101b9776B61701a63835E9278M2711J72698G4983a00536B16331H2619O1311
$$ 17101 -29776 261701 -163835 59278 101989 274687 74983 -100536 216331 82619 143930
17526A43930i1619A23537c38286B05539a38534C45684a23071A1886K64493d2808
$$ 143930 -91619 123537 -338286 205539 -138534 345684 -123071 11886 276379 -42808
17515B50772J37427a59410B8680i8709A90412g7874K8401B74524c4262B32010
$$ 250772 388199 -159410 28680 -98709 190412 -77874 -49473 274524 -34262 232010
17504A37547a83632G0145e8349A21940m8175J15413g7136C37460A41431N1679
$$ 137547 -183632 70145 -58349 121940 73765 189178 -77136 337460 141431 193110
17494A93110L5660H0108J99204C7343P1683J74956i0007A66826L7406a45597B04654
$$ 193110 228770 80108 279312 37343 109026 283982 -90007 166826 204232 -145597 204654
17482b61441A11033K07270j16736l0998K06245A86744J60989b1045E70510A11342
$$ -261441 111033 318303 201567 170569 376814 186744 347733 -21045 570510 111342
17471B54817l4878i2960C47431j11592i2074A26268a16707k20892c6101p5274
$$ 254817 219939 -92960 347431 235839 -92074 126268 -116707 -337599 -36101 -111375
17461a11375L7474E5138a28321f3982C15299j29190a6433B16443L51719k01366
$$ -111375 -73901 55138 -128321 -63982 315299 186109 -16433 216443 568162 366796
17451C66796j08817A26279J35750R7440p4373K46243A49285J59741r9991R9233
$$ 366796 257979 126279 262029 359469 285096 531339 149285 309026 209035 308268
17441C08268P0804A15266Q8178J76202a45609C07542J38337j40797a45588B11173
$$ 308268 379072 115266 203444 379646 -145609 307542 445879 305082 -145588 211173
17430A41571J30080d422A00928K84790A91334O8835J63576G2203L72101G4621
$$ 141571 271651 -4422 100928 385718 191334 260169 423745 72203 444304 74621
17419B95680j37233K02735N2972k02024J28016r8110J15609A8538a82209E35325
$$ 295680 158447 361182 414154 212130 340146 242036 357645 18538 -182209 535325
17408C35438q5651J3916q7889L8798D9891b29449B24122i8671A77071c38599B11577
$$ 335438 249787 263703 175814 214612 49891 -229449 224122 -98671 177071 -338599 211577
17396D63532G5801K4226D2620K3543a99836D26837i6525C15003E2590J08309K0476
$$ 463532 75801 100027 42620 66163 -199836 426837 -96525 315003 52590 160899 181375
17385A81375P0265A17363K24482B9460J11977a06946B32371c26342m7138D03806
$$ 181375 251640 117363 341845 29460 141437 -106946 232371 -326342 -373480 403806
17374a77048I4527f5638r2004B48415I9056l2084L24197k3411c63167A4233J785
$$ -177048 94527 -65638 -157642 248415 99056 66972 391169 367758 -363167 14233 16018
17363A6018a6484A01080A8547J36252J14714j21463d2732r1179C54472F7062a6416
$$ 16018 -16484 101080 18547 154799 269513 148050 -42732 -133911 354472 67062 -16416
17351C90137B7994J54415I038K11311J38317g7999A8371O08824B76263J98392
$$ 390137 27994 182409 9038 220349 358666 -77999 18371 627195 276263 474655
17341D74655A59967c6646l6044B77554A1076J09468d2923J5617D31462c0168q719
$$ 474655 159967 -36646 -72690 277554 11076 120544 -42923 -27306 431462 -30168 -38887
17330c8887C34193r7579F738L73174b1042A69258P732p6657K45314g2318j26954
$$ -38887 334193 236614 6738 379912 -21042 169258 176990 100333 345647 -72318 -199272
17319a99272j9728j09303D65512H0033J95007a45899A07903M4a38931G9714K55846
$$ -199272 -219000 -328303 465512 80033 275040 -145899 107903 107947 -138931 79714 335560
17308C35560J41011A71808b41138A60362J16469p3775a56104A08629J55936a0046
$$ 335560 476571 171808 -241138 160362 276831 203056 -156104 108629 264565 -10046
17297C71459G4220I436O7981B3882J02068m0539K18237p5412D0162K85640A0824
$$ 371459 74220 9436 77417 23882 125950 85411 303648 228236 40162 325802 10824
17285A91998L1976k8812E1323K00166q997H5546J89352F7030M89106A79564a84239
$$ 191998 223974 195162 51323 251489 242492 85546 274898 67030 556136 179564 -184239
17273F0027M75037G4413M8776E9995J23236K72453a01589A06191J1692N8266O9454
$$ 60027 535064 74413 123189 59995 183231 455684 -101589 106191 117883 176149 245603
17262B45603O6511M5118j69093L349l5252J69726J02599j63223a86978B85237
$$ 245603 312114 357232 188139 191488 156236 325962 428561 265338 -186978 285237
17251A35729J14143d272B15894p1702g2143D36369j30473J25017d4284E42796
$$ 135729 249872 -4272 215894 144192 -72143 436369 305896 430913 -44284 542796
17240A52514g6043A20591a1687C86086p1410c575A9973J01367L8996K20713C6461
$$ 152514 -76043 120591 -11687 386086 314676 -3575 19973 121340 160336 381049 36461
17228C38112A64851c0679C0059K44326B1806K74254A12711K76094A83498p6858
$$ 338112 164851 -30679 30059 274385 21806 296060 112711 388805 183498 106640
17218A06640L8592L3061H7207J66490j20379D3290K472K69720A32728K64775F7973
$$ 106640 145232 178293 87207 253697 133318 43290 45762 315482 132728 397503 67973
17206E2148e0069B84274k4352J27365A14326j7130m634C0891J71261p9617a3632
$$ 52148 -50069 284274 259922 387287 114326 97196 92562 30891 202152 122535 -13632
17194E2272K47813d4648B18381K9782J18552F6506K3427P2603c244o9371A03292
$$ 52272 300085 -44648 218381 248163 366715 66506 89933 162536 -3244 -72615 103292
17182C60833g1639B64418A25594P911Q3666J25474o9755J99854B8250L12994K50353
$$ 360833 -71639 264418 125594 133505 217171 342645 272890 472744 28250 341244 591597
17171E91597G5420d9643B84321A14011K20444A12295K87006P0738A27077J069
$$ 591597 75420 -49643 284321 114011 334455 112295 399301 470039 127077 128146
17161A28146K7633J54899C4621L12546D3713J46855J92472a31609C44866d8906
$$ 128146 155779 310678 34621 347167 43713 190568 383040 -131609 344866 -48906
17150f0385B64697N6507k1264J28805G948a08035A24554K80982A57197J5526L91155
$$ -60385 264697 321204 299940 428745 7948 -108035 124554 405536 157197 172723 563878
17139E63878B59464E4201J41219M34573C12027P1607m7867K46936B76793o4942
$$ 563878 259464 54201 195420 629993 312027 383634 335767 582703 276793 211851
17129B11851H0505J31814n4413j107K95547j75432n5691J60796j59345n5263J16933
$$ 211851 80505 212319 157906 156799 452346 276914 221223 382019 222674 167411 284344
17118B84344j15422K49533q1473J34606j72010J2523K48370k27104r8679n30J89571
$$ 284344 168922 418455 336982 471588 299578 312101 560471 333367 234688 234158 423729
17107D23729D8713J89145K85210B19305J27110Q0120J87874e9555D00445n7387
$$ 423729 48713 237858 523068 219305 346415 426535 614409 -59555 400445 343058
17097C43058Q724J24687o2299j1724J58340B09267M67125A50958K87108K2526
$$ 343058 351782 476469 414170 402446 560786 209267 676392 150958 438066 460592
17087D60592r7168A06161R1288P9002P4150Q8511q2045j13459L80981K61544k65792
$$ 460592 363424 106161 197449 276451 350601 439112 357067 243608 624589 886133 620341
17076F20341n5404J5036k8589j46599J67852j04999N0089p4998P1786j5247k05780
$$ 620341 564937 579973 551384 404785 572637 467638 517727 442729 514515 499268 293488
17065B93488K15266j84820J21167k5069j65927R2908j43440K12646j41756Q9508
$$ 293488 508754 323934 445101 420032 254105 347013 203573 416219 274463 363971
17055C63971M08257l67734m5260L74999j33365A42542M29543K9710k85386r5965
$$ 363971 772228 404494 359234 734233 600868 142542 572085 601795 316409 220444
17045B20444M88201B52481l0433k4070M74766k96895L8431K02193B03677K78992
$$ 220444 708645 252481 222048 197978 672744 375849 414280 616473 203677 482669
17035D82669r4557O3262m0801J75878k40987n8894K29101j24652j7734j70343
$$ 482669 388112 451374 410573 586451 345464 286570 515671 391019 373285 202942
17025B02942K29257L3375B02320l8354M85153p5739m458q6260o7421N9709q0009
$$ 202942 432199 465574 202320 163966 649119 573380 568922 482662 415241 474950 394941
17014C94941K05074K02251K1735l17245q5480J53298m6332j0538M1395k63595
$$ 394941 600015 802266 824001 506756 421276 574574 528242 517704 559099 295504
17004B95504L77034p3158l2465l0388m78q65P2291o5188q837j10285L04512M1763
$$ 295504 672538 599380 566915 536527 536049 535184 607475 542287 533450 423165 727677 769440
16992G69440L7623j39663J12867o5702M0683k87520P06158n81274J24241J31530
$$ 769440 807063 667400 780267 714565 755248 467728 1173886 592612 716853 848383
16982H48383j32757m4522J76198j26265J15020j55940l1086K49840J56486l45517
$$ 848383 715626 671104 847302 721037 836057 680117 649031 898871 1055357 709840
16972G09840j10242L29168j88442O6253k86618L86703J3450L3519K32259m95777
$$ 709840 599598 928766 740324 806577 519959 906662 920112 953631 1185890 690113
16962F90113K08334n8536J68058l59489J98880M36564l71000K8475j16606m9447
$$ 690113 898447 839911 1007969 648480 847360 1283924 912924 941399 824793 775346
16952G75346J57893J09339K35244l95461Q2596L6144N1005j82925M8481R5192
$$ 775346 933239 1042578 1277822 882361 964957 1001101 1052106 869181 917662 1012854
16942A012854m8481J59936K8652k0296r9006j16015J63338R3985K78136k67034
$$ 1012854 964373 1124309 1152961 1132665 1033659 917644 1080982 1174967 1453103 1186069
16932A186069o6029K6112N0652O544R7917k59813K91589j54101J09194l72855
$$ 1186069 1120040 1146152 1196804 1203348 1301265 1041452 1333041 1178940 1288134 915279
16922I15279L45713j8267j59256J98987K12665j20403r3747j16588K84532j25170
$$ 915279 1260992 1242725 1083469 1282456 1495121 1374718 1280971 1164383 1448915 1323745
16912A323745J45133J65473j91745r7678J61821O9753l32781K49113k39445J09774
$$ 1323745 1468878 1634351 1442606 1344928 1506749 1576502 1243721 1492834 1253389 1363163
16902A363163J01574O2591Q3748p1245M8976P2162j76310K37657m24143J06519
$$ 1363163 1464737 1527328 1611076 1539831 1588807 1660969 1484659 1722316 1298173 1404692
16892A404692R3755J97402m15962N66382k32030J55075n0704Q9221k49177K25631
$$ 1404692 1498447 1695849 1279887 1846269 1614239 1769314 1718610 1807831 1558654 1784285
16882A784285O3237K0904J47242J25211m30972K92038O2217l1372k70067K77609
$$ 1784285 1847522 1868426 2015668 2140879 1709907 2001945 2064162 2032790 1762723 2040332
16872B040332J37538J63850k26133L05680j17090K11133k90170K76711J28031
$$ 2040332 2177870 2341720 2115587 2421267 2304177 2515310 2225140 2501851 2629882
16863B629882o8649q0270l1297K92042l37592M33067j42513L41284m51370K41881
$$ 2629882 2561233 2480963 2449666 2741708 2404116 2837183 2694670 3035954 2584584 2826465
16853B826465j51436J60923k75970L97590j17064q395L00220L8583K31634m14486
$$ 2826465 2675029 2835952 2559982 2957572 2840508 2832113 3132333 3170916 3402550 2988064
16843B988064J31182K88056k20049j11456k3436M94136j70816K32347o4827k35447
$$ 2988064 3119246 3407302 3187253 3075797 3052361 3546497 3375681 3608028 3543201 3307754
16833C307754N14284J33782l08471L26416J85929J85772j31753J39821j575N06848
$$ 3307754 3822038 3955820 3647349 3973765 4159694 4345466 4213713 4353534 4351959 4858807
16823D858807k48646M2442Q8518P0802L09532n84444O64619m5285K82149r4817
$$ 4858807 4610161 4652603 4741121 4811923 5121455 4537011 5201630 5156345 5438494 5343677
16813E343677l3097J3500N64447j95847L79171J8503L28986K31024l79588L10400
$$ 5343677 5310580 5324080 5888527 5692680 6071851 6090354 6419340 6650364 6270776 6581176
16803F581176J45572K96685J68707K34884k91439M83032M77683r3239M67736k08885
$$ 6581176 6726748 7023433 7192140 7427024 7135585 7618617 8096300 8003061 8470797 8261912
16793H261912L09476M74150J83812j30429M22309L09869K25206L70580R0940L74121
$$ 8261912 8571388 9045538 9229350 9098921 9521230 9831099 10056305 10426885 10517825 10891946
16783A0891946N05560L957Q68611N9982N77409n260N09250P04789l6919P07918
$$ 10891946 11397506 11401463 12270074 12330056 12907465 12902205 13411455 14116244 14079325 14787243
16773A4787243K05798N38584R54279k6214O80720R14871M09125P27142J117059
$$ 14787243 14993041 15531625 16485904 16459690 17140410 18055281 18464406 19191548 20308607
16764B0308607L20480J095210J011249O08058J058850J310969Q85639J193197
$$ 20308607 20629087 21724297 22735546 23343604 24402454 25713423 26599062 27792259
16756B7792259R38092J632818J354292J320458J568985K176927J241628J992840
$$ 27792259 28730351 30363169 31717461 33037919 34606904 36783831 38025459 40018299
16748D0018299K294104J905278K529206K808887K507437L089206L348233L107652
$$ 40018299 42312403 44217681 46746887 49555774 52063211 55152417 58500650 61608302
16740F1608302L685517M272702M407560M683534N151327N213040N546671O734379
$$ 61608302 65293819 69566521 73974081 78657615 83808942 89021982 94568653 101303032
16732A01303032O432776P001333P689531P822116Q099534Q667947Q419168Q927270
$$ 101303032 107735808 114737141 122426672 130248788 138348322 147016269 155435437 164362707
16724A64362707Q322335Q023602P872685O801987N090678M644089K645244J151132
$$ 164362707 172685042 180708644 188581329 195383316 200473994 205118083 207763327 208914459
16716B08914459k55177j973953l555054m640977o090111p230046p692300q506890
$$ 208914459 208659282 206685329 203130275 198489298 192399187 185169141 177476841 168969951
16708A68969951q289488r374328q830858q692014p930292p979776p377403p101912
$$ 168969951 160680463 151306135 142475277 133783263 125852971 117873195 110495792 103393880
16700A03393880o543144o480161n498840n361123m942197m556857m469975l622533
$$ 103393880 96850736 90370575 84871735 79510612 74568415 70011558 65541583 61919050
16692F1919050l792522l470097k975703k613870k730084k807483j952195k310299
$$ 61919050 58126528 54656431 51680728 49066858 46336774 43529291 41577096 39266797
16684C9266797j995884j779358j722914j653103j310889j709060j346124j055687
$$ 39266797 37270913 35491555 33768641 32115538 30804649 29095589 27749465 26693778
16676B6693778j338720j200050q60346j060274n60975j118162r12576n96649n84166
$$ 26693778 25355058 24155008 23294662 22234388 21673413 20555251 19642675 19046026 18461860
16667A8461860r27554o90906n77485n55527n04261m93191m18804n46963m39699
$$ 18461860 17534306 16843400 16265915 15710388 15206127 14712936 14294132 13747169 13307470
16658A3307470M7668n64089p18751m69993m10800l47586j91506m99668q3739k58498
$$ 13307470 13355138 12791049 12072298 11602305 11191505 10843919 10652413 10152745 10069006 9810508
16648I810508o36561p0732j40114j36300l24062m67711j05836J00098m72018p1328
$$ 9810508 9173947 9103215 8963101 8826801 8502739 8035028 7929192 8029290 7557272 7485944
16638G485944o20117J43936m36888o142j88966k56156j52045q3200K01787l64751
$$ 7485944 6865827 7009763 6572875 6566733 6377767 6121611 5969566 5886366 6088153 5723402
16628E723402j58557k00421j37956p7446K63563n16018k65021J82005j87905L23052
$$ 5723402 5564845 5364424 5226468 5149022 5412585 4896567 4631546 4813551 4625646 4948698
16618D948698q74744K35760J79904l44902J95858j5648l86150K28594j83001j90877
$$ 4948698 4073954 4309714 4489618 4144716 4340574 4324926 3938776 4167370 3984369 3793492
16608C793492n4232l10835K3003J40735j79374k3914o2540p1511r2439j6551L1764
$$ 3793492 3739260 3428425 3451428 3592163 3412789 3388875 3326335 3254824 3162385 3145834 3177598
16597C177598k0629k13176P4086K1042k32164j6520k59607j22778L52963J49036
$$ 3177598 3156969 2943793 3017879 3038921 2806757 2790237 2530630 2407852 2760815 2909851
16587B909851j13614k97761k0179j76308P9129P0478m2251k79715M34158m64134
$$ 2909851 2796237 2498476 2478297 2301989 2381118 2451596 2409345 2129630 2563788 2099654
16577B099654K81636l08314K76745J52773m27106L20809r5220k56711q6601J54879
$$ 2099654 2381290 2072976 2349721 2502494 2075388 2396197 2300977 2044266 1957665 2112544
16567B112544l24996K80685l74349J21358l46132O24090m61818R8894R467J51824
$$ 2112544 1787548 2068233 1693884 1815242 1469110 2093200 1631382 1730276 1739743 1891567
16557A891567q7869j25215K15927o8623m48760J12399M51325k85960q3269Q0445
$$ 1891567 1803698 1678483 1894410 1825787 1377027 1489426 1940751 1654791 1571522 1651967
16547A651967m33620N4699j59179N45920l84106L1024j4637R0079k4056k89327
$$ 1651967 1218347 1273046 1113867 1659787 1275681 1306705 1292068 1382147 1358091 1068764
16537A068764M96154l47636o8787O2532J70526k83568j62171K92730j00336K4587
$$ 1068764 1564918 1217282 1148495 1211027 1381553 1097985 935814 1228544 1128208 1152795
16527A152795l637J54203l57543q7901L16399q3011N6369j26405O8596L95011
$$ 1152795 1149158 1303361 945818 857917 1174316 1091305 1147674 1021269 1089865 1484876
16517A484876m71891J79343o6104J40177k60989J01927j59862N0033m1725M7638
$$ 1484876 1012985 1192328 1126224 1266401 1005412 1107339 947477 997510 955785 1003423
16507A003423K1835M2633L5032m17346p0895K45631J17906O7834k46116M56975
$$ 1003423 1025258 1067891 1102923 685577 614682 860313 978219 1046053 799937 1256912
16497A256912j56271J31031m03108L73953l60095K40282k89246L14971k6261j39445
$$ 1256912 1100641 1231672 828564 1202517 842422 1082704 793458 1108429 1082168 942723
16487I42723l48096L95386k25738j95551J13244j6562j4837K34691K65517m55481
$$ 942723 594627 990013 764275 568724 681968 665406 650569 885260 1150777 695296
16477F95296K01474j8049l97751M59804l98616j32335L82564k03142J50018p5738
$$ 695296 896770 878721 480970 940774 542158 409823 792387 589245 739263 663525
16467F63525M3316K65851o7541n2741k39634K37791l89375j38129J20299L09508
$$ 663525 706841 972692 905151 852410 612776 850567 461192 323063 443362 752870
16457G52870L0368K27502j13754l94546M90798j56632O6458m49432J53918k182
$$ 752870 783238 1010740 896986 502440 993238 836606 903064 453632 607550 605368
16447F05368o1003K61525j17024p6023j34107J88265j96079K93120B50173m3464
$$ 605368 544365 805890 688866 612843 478736 667001 470922 764042 250173 206709
16437B06709E9400L26178K39582J103L3199n9511k8012p8516j44175K59967k72852
$$ 206709 59400 385578 625160 626263 659462 599951 571939 493423 349248 609215 336363
16426C36363L9594L00741C27686K07216j70604R3286J89850A80569K09701l4188
$$ 336363 375957 676698 327686 534902 364298 457584 647434 180569 390270 356082
16416C56082J00486j04638M82161q2519l02434M7323K06633C49924J72317B01476
$$ 356082 456568 351930 834091 751572 449138 496461 703094 349924 522241 201476
16405D60139l3308j80084N03229C35108Q7233q9887J35756j46226A56568M56138
$$ 460139 426831 246747 749976 335108 422341 332454 468210 321984 156568 612706
16395F12706k61503J07422j27804b8112C71157J26541M8670j26508j74574J44971
$$ 612706 351203 458625 330821 -28112 371157 497698 546368 419860 245286 390257
16385C90257K50789B59670J45225K3379O800q4513K2440F8335J88517n4181P78
$$ 390257 641046 259670 404895 428274 435074 350561 373001 68335 256852 202671 203449
16374B03449o888K43981j81803K81835o5071J18874r6659m7530B15511J926J25606
$$ 203449 196561 440542 258739 540574 475503 594377 497718 450188 215511 217437 343043
16363C43043J78749j92686L9863j15824n8453J28562j55086J11529J23237R7874
$$ 343043 521792 329106 368969 253145 194692 323254 168168 279697 402934 500808
16353E00808k21461K83065j87349n9450a07302B67956J34638J9626r6359e256
$$ 500808 279347 562412 375063 315613 -107302 267956 402594 422220 325861 -5256
16342A54004C4866K22002b03713C74960j74173K01579P8392B00200J08302k9155
$$ 154004 34866 256868 -203713 374960 200787 402366 480758 200200 308502 279347
16332B79347J34410j00119J0923A1791K49736R0614p3831p5989b34151A65567
$$ 279347 413757 313638 324561 11791 261527 352141 278310 202321 -234151 165567
16321f856p006C08357A5308M38013B13757K0072J77812j93220J53549p7766J36445
$$ -6856 -13862 308357 15308 453321 213757 233829 411641 218421 371970 294204 430649
16310D30649B10561M32059A52139n8385L36309J05572B54516J1195K40223r9606
$$ 430649 210561 642620 152139 93754 430063 535635 254516 265711 505934 406328
16300D06328A93587C1278K19254n478J21349j65623P5665A23605M75675g1789
$$ 406328 193587 31278 250532 245054 366403 200780 276445 123605 599280 -71789
16289i3145B18991N57435C55457a05810E1723K70042J20849b18563B51531o273
$$ -93145 218991 776426 355457 -105810 51723 321765 442614 -218563 251531 245258
16279B45258K44028A57155L28717j65603J15636D0030O86279E3201N08635A71419
$$ 245258 489286 157155 485872 320269 435905 40030 726309 53201 561836 171419
16268B39342n177r3914J84980g3475B5010L11450q7092h7659B5950a7671E806
$$ 239342 234165 140251 325231 -73475 25010 336460 249368 -87659 25950 -17671 5806
16256H8553L05106j8662A31950P204J11764M712n0702H0388J68708j11151K90725
$$ 88553 393659 374997 131950 139154 250918 255630 204928 80388 249096 137945 428670
16245D28670j00165L6786m1491J487J2498f3719C17605G724R2565J16992I6770
$$ 428670 328505 365291 323800 325287 337785 -63719 317605 7724 100289 217281 96770
16233C63838A32354d7312A38616M20814A76502K60372n8886H9916J58396b5743
$$ 363838 132354 -47312 138616 559430 176502 436874 377988 89916 248312 -25743
16222A67141m6038H102K27287e6819C83544C0076J11815J43093D633g8441r3718
$$ 167141 121103 8102 235389 -56819 383544 30076 141891 284984 4633 -78441 -172159
16211a72159A69892l8861B0298M9502J35874A1189K02451a1275l5167r6480C58971
$$ -172159 169892 131031 20298 69800 205674 11189 213640 -11275 -46442 -142922 358971
16199B24864N5394f7245G3990L17993A67414J77849j05411l1946O0601Q9446A1352
$$ 224864 280258 -67245 73990 391983 167414 345263 239852 207906 268507 357953 11352
16187a0309E531c766A50297f2078I4128h388I866K14328a32674A74330M5616p0531
$$ -10309 5531 -3766 150297 -62078 94128 -8388 9866 224194 -132674 174330 219946 149415
16175A49415b23339C43772A08027a0140j30233A57784j2800K44413b01205G4027
$$ 149415 -223339 343772 108027 -10140 -140373 157784 144984 389397 -201205 74027
16164F4391j6119N05202G1628K52393b98960C15632j51220H1241j7157L3034b4056
$$ 64391 48272 553474 71628 324021 -298960 315632 164412 81241 64084 97118 -24056
16152B16595K83963g2620A65386b83203L2898C00810a13361d0678A54035l7532
$$ 216595 500558 -72620 165386 -283203 -250305 300810 -113361 -40678 154035 116503
16142A16503L38358b12150B04870q1639R1104D1858K15502L0759A10194P9182
$$ 116503 454861 -212150 204870 123231 214335 41858 257360 288119 110194 189376
16132A89376o1538J9700j2781a69020A61882D364J10813L434i9073E7314i8707
$$ 189376 127838 147538 134757 -169020 161882 4364 115177 118611 -99073 57314 -98707
16120b06514G6284d964m9330B180a56481J1840d457I2045i6050L5096j52855k06214
$$ -206514 76284 -4964 -54294 2180 -156481 -144641 -4457 92045 -96050 -60954 -213809 -420023
16108d20023O5417A11783C157b58416b8853A573P0176J70084P5081d1115G7121
$$ -420023 -354606 111783 3157 -258416 -28853 1573 71749 241833 316914 -41115 77121
16096A77195P9312E7773J40622a7613B8697h5453j55646l7514C1926b4841A59616
$$ 177195 256507 57773 198395 -17613 28697 -85453 -241099 -278613 31926 -24841 159616
16084B41277G0456O1690a04986M5384l1229A1858a84522B77407C4940L19211f5372
$$ 241277 70456 132146 -104986 -59602 -90831 11858 -184522 277407 34940 354151 -65372
16072g9368G1076f1368A16176A019d4834A03342k9665J02092a71014C67380d45047
$$ -79368 71076 -61368 116176 1019 -44834 103342 73677 175769 -171014 367380 -445047
16060B88456e7605F6537b19813I7777O2918k6533a07730m0105j52271h8336k00642
$$ 288456 -57605 66537 -219813 97777 160695 134162 -107730 -147835 -300106 -88336 -288978
16049b88978B15819o8268m7696j7033M3720n8101e0008o671r3805q407c5111B2987
$$ -288978 215819 147551 99855 82822 126542 68441 -50008 -56679 -150484 -158891 -35111 22987
16036B2447i7576j5622o2083e2982j32641N4724b9468A59626b5314q1161E3565
$$ 22447 -97576 -113198 -175281 -52982 -185623 -130899 -29468 159626 -25314 -106475 53565
16024B68357e239j87388Q1702l99199F3425A9209Q0550j924e7128k785A62967
$$ 268357 -5239 -192627 -110925 -510124 63425 19209 99759 97835 -57128 -59913 162967
16012A9604K16342c17330R8032I0748b34275D17957a25107A06040c2086l27756
$$ 19604 235946 -317330 -219298 90748 -234275 417957 -125107 106040 -32086 -359842
16002c59842j74350A9040J25166M1088a03111q506j14116h4901n155a2104k82738
$$ -359842 -534192 19040 144206 185294 -103111 -111617 -225733 -84901 -90056 -12104 -294842
15991b94842g5097B17382a76161B8497P7029l6075b60705A02125a54744B20553
$$ -294842 -75097 217382 -176161 28497 105526 69451 -260705 102125 -154744 220553
15980I1002m65b69472B03852K26380E7415b55179I8992l4184N9988n4775i52A62187
$$ 91002 90537 -269472 203852 430232 57415 -255179 98992 64808 124796 70021 -952 162187
15967A14158g8010H4192a87737H7861b06147B65409O8569a23532D0395l778B708
$$ 114158 -78010 84192 -187737 87861 -206147 265409 333978 -123532 40395 36617 2708
15955A02492a22344c5177B09178Q1335a73558B1393b76216B77923h3648o6524
$$ 102492 -122344 -35177 209178 290513 -173558 21393 -276216 277923 -83648 -150172
15945a50172d6440j50706b2846m9364G5243a20116j64705A53464b5152j30747
$$ -150172 -46440 -197146 -22846 -72210 75243 -120116 -284821 153464 -25152 -155899
15935a55899c8115l20421N4903A904a60823b7031C12177e1193k960A57058a89472
$$ -155899 -38115 -358536 -303633 1904 -160823 -27031 312177 -51193 -54153 157058 -189472
15923b77238B05077c18455a35231F8317l266f5216m1927p9199A81347a3345D4474
$$ -277238 205077 -318455 -135231 68317 65051 -65216 -107143 -186342 181347 -13345 44474
15911c34646b8750j22675M6187L4811A07914N4186O2629g472l2590A15956P165
$$ -334646 -28750 -151425 -105238 -70427 107914 162100 224729 -7472 -40062 115956 123121
15900A23121l3677J11954i8893H7937P7836c3109Q682j26529F969J45897l6315
$$ 123121 89444 201398 -98893 87937 165773 -33109 -24427 -150956 6969 152866 116551
15889A16551b06844A22045a49375f0521A09584b4862A7389L35233F1195c7418
$$ 116551 -206844 122045 -149375 -60521 109584 -24862 17389 352622 61195 -37418
15878h3107p903A7290c7175r5112I5414f1116F0548B3759J4209L7661h7610j58261
$$ -83107 -91010 17290 -37175 -132287 95414 -61116 60548 23759 37968 75629 -87610 -245871
15866b45871C6106J22237i5116B1181J0845h9212B14709I564b88441J00560E9843
$$ -245871 36106 158343 -95116 21181 32026 -89212 214709 9564 -288441 -187881 59843
15854I0861B0520M4353K4438A4988b05846A5010K55425c6602p2047h789C04719
$$ 90861 20520 64873 89311 14988 -205846 15010 270435 -36602 -108649 -8789 304719
15842B1510K84946m0350j07696c12218e5253A88504H7266A0457M8133O357b6446
$$ 21510 306456 266106 158410 -312218 -55253 188504 87266 10457 58590 64947 -26446
15830a61711k539b704j91525j70032e3632j298K0418B8022J4600a1346B33418
$$ -161711 -164250 -2704 -194229 -364261 -53632 -54930 -34512 28022 42622 -11346 233418
15818A0348a25312n63851c5918J1920r0016L2339j1491I7020a60103A15779a46160
$$ 10348 -125312 -689163 -35918 -23998 -114014 -81675 -93166 97020 -160103 115779 -146160
15806b41904e6858A12272a59225L0557d4735A85332H2020a02301A05430a59007
$$ -241904 -56858 112272 -159225 -128668 -44735 185332 82020 -102301 105430 -159007
15795a51116n7732G4936d17647D4179f476I2673Q3180a97262C9697K12186A15564
$$ -151116 -208848 74936 -417647 44179 -6476 92673 175853 -197262 39697 251883 115564
15783A53419a481k55986C34855d72872E1197n900d97l77476a53265j5369C45860
$$ 153419 -1481 -257467 334855 -472872 51197 45297 -497 -377973 -153265 -168634 345860
15771b02581B61744C2685c31835A96738p7067h9702G423a60008j14108L0764I5068
$$ -202581 261744 32685 -331835 196738 119671 -89702 7423 -160008 -274116 -243352 95068
15759e0134C01038i098A20822M8498C2888J31359b6495C8266J53511D8587h4267
$$ -50134 301038 -9098 120822 169320 32888 164247 -26495 38266 191777 48587 -84267
15747A37396i3980F4293f073m3278r9028E2854J02153f9215p5735j48670p1425
$$ 137396 -93980 64293 -6073 -49351 -148379 52854 155007 -69215 -144950 -293620 -365045
15736c65045a21186H1958J8595a30678l49815A9048L54913d33075B09297I7213
$$ -365045 -121186 81958 100553 -130678 -480493 19048 373961 -433075 209297 97213
15725B1250a2236C0043b02442A58926g6133A00772J10814o9931k3464m4119N707
$$ 21250 -12236 30043 -202442 158926 -76133 100772 211586 141655 118191 74072 79779
15714G9779c28720B36786o6668e1828F914c37097e1988D3740b16558q970K7198
$$ 79779 -328720 236786 170118 -51828 6914 -337097 -51988 43740 -216558 -225528 -198330
15703a98330d0916C19018A01400i5268o7928l3008M7726k8703b1781q1020C1325
$$ -198330 -40916 319018 101400 -95268 -163196 -196204 -148478 -177181 -21781 -102801 31325
15691a61407j22898J30000C42240e5012b4378B15381N5263B9174a55790G9821
$$ -161407 -284305 -154305 342240 -55012 -24378 215381 270644 29174 -155790 79821
15680d6021f235H7443a8618j10815o4359A41408K42722a01055A51755a58965P4934
$$ -46021 -6235 87443 -18618 -129433 -193792 141408 384130 -101055 151755 -158965 -84031
15669h4031F9733J97a28473C20078H8916b3894G5776a91136b5416o335j95922
$$ -84031 69733 69930 -128473 320078 88916 -23894 75776 -191136 -25416 -31751 -227673
15658b27673O1182g6909J6266j16437J3627d9541A36489D6323n070i8345j42744
$$ -227673 -166491 -76909 -60643 -177080 -163453 -49541 136489 46323 41253 -98345 -241089
15647b41089A5941D263a3404K714k87971c2700r0267B88983a2317j65833l1470
$$ -241089 15941 4263 -13404 -10690 -298661 -32700 -122967 288983 -12317 -178150 -209620
15636b09620M854B33579g7496G095b29578h0770K6834j1003m8683C7627L2251
$$ -209620 -204766 233579 -77496 7095 -229578 -80770 -53936 -64939 -113622 37627 69878
15625F9878c9364J7826j27054j12227g6076B67782a02505F8132B6561a28865A38559
$$ 69878 -39364 -21538 -148592 -260819 -76076 267782 -102505 68132 26561 -128865 138559
15613c51005a22299A73046E5976c69338E6897a40566g0182r4302A24147a74238
$$ -351005 -122299 173046 55976 -369338 56897 -140566 -70182 -164484 124147 -174238
15602a35349m60659A44675L1412J27802a25176A79577a4544A03623a35987d7166
$$ -135349 -596008 144675 176087 303889 -125176 179577 -14544 103623 -135987 -47166
15591a7904G186N5966J14498b53653A45260b28991D1858J405J63589K5238g9883
$$ -17904 7186 63152 177650 -253653 145260 -228991 41858 43263 206852 232090 -79883
15579c24136H7569B9759b32338A02837a68118r1125D9071c03228J05280B41686
$$ -324136 87569 29759 -232338 102837 -168118 -259243 49071 -303228 -197948 241686
15568a40173k7176D1112f513G4720a38357N3252K8890l38562h3625C57955A2574
$$ -140173 -167349 41112 -6513 74720 -138357 -85105 -56215 -394777 -83625 357955 12574
15556c37370d072F1691a05348l626G4477Q4277e3605k35211A2104M617a2891q3914
$$ -337370 -4072 61691 -105348 -108974 74477 158754 -53605 -288816 12104 16721 -12891 -96805
15544i6805B0025e4926j26344D1705g3300b4579C98524g4351I7027l253j4596
$$ -96805 20025 -54926 -181270 41705 -73300 -24579 398524 -74351 97027 93774 79178
15533G9178d3850j38688J0034a1150k54873A19299k8563d8697A48086B4374f9660
$$ 79178 -43850 -182538 -172504 -11150 -266023 119299 90736 -48697 148086 24374 -69660
15521a57443O2137B41595K37441C9578b1379E0388J67786j5540a14333C96172
$$ -157443 -95306 241595 479036 39578 -21379 50388 218174 202634 -114333 396172
15510A83551K2480e815j04700B05479o2054d93A67817J87330c3646n9987H4208
$$ 183551 206031 -5815 -110515 205479 143425 -493 167817 355147 -33646 -93633 84208
15498g254C9496a54611p3086n9700A53614J66551o3356m6941b11752i0781m9067
$$ -7254 39496 -154611 -227697 -287397 153614 320165 256809 209868 -211752 -90781 -139848
15487a39848E5018a18049B1864b63058A47539F6689k8848M1026j572b13034a3457
$$ -139848 55018 -118049 21864 -263058 147539 66689 37841 78867 77295 -213034 -13457
15475g3844n139k7705j16354Q8550B02251J06143n4159H9716a73240j10893f8540
$$ -73844 -78983 -106688 -223042 -134492 202251 308394 254235 89716 -173240 -284133 -68540
15463D4118J39882I979b39971D19272i2607K2410B16801R3862q629j35658K850
$$ 44118 184000 9979 -239971 419272 -92607 -70197 216801 310663 302034 166376 169226
15452A69226k7124A4374a24588j1028A06795N4131g9184k40613F1b96805q2377
$$ 169226 142102 14374 -124588 -135616 106795 160926 -79184 -319797 61 -296805 -379182
15441c79182f3969j83664G1947b97893g3246H3359a18031B23283j05028d60865
$$ -379182 -63969 -247633 71947 -297893 -73246 83359 -118031 223283 118255 -460865
15430a20432p4020L1509L6606A57620a85182f9518j00301D8978K6149g7937b954
$$ -120432 -194452 -162943 -126337 157620 -185182 -69518 -169819 48978 75127 -77937 -2954
15418a39731A00568b32608A58651e0103A14787D7223J01667a22397N3610H9136
$$ -139731 100568 -232608 158651 -50103 114787 47223 148890 -122397 -68787 89136
15407G6230N9734a97671b7006l74259J27421g6277B8650d0965H1686l3892b15532
$$ 76230 135964 -197671 -27006 -401265 -273844 -76277 28650 -40965 81686 47794 -215532
15395c7305k5266K8614j0655p2324A06140R3176c06362h593o8194l63446a0478
$$ -37305 -62571 -33957 -44612 -116936 106140 199316 -306362 -8593 -76787 -440233 -10478
15383C24813C6207h2818B10403q297a58287D99507a32923A74578J24295G8085
$$ 324813 36207 -82818 210403 202106 -158287 499507 -132923 174578 298873 78085
15372A51079L68744A4780J55619K2919G9351M0857Q4678a2130j2116B9669a27497
$$ 151079 519823 14780 170399 193318 79351 120208 204886 -12130 -24246 29669 -127497
15360g248j69235H0459k6399A7320P8117a33095K525n3063C1806L39396a20256
$$ -7248 -176483 80459 54060 17320 95437 -133095 -130570 -183633 31806 371202 -120256
15348b33251B6090K56833j18614b58966L5464A02242O9103g9909A10801d6689
$$ -233251 26090 282923 164309 -258966 -223502 102242 171345 -79909 110801 -46689
15337f740k02196B1972J72178r6416a23015A47573D4921L9140a77310L0848F3155
$$ -6740 -208936 21972 194150 97734 -123015 147573 44921 84061 -177310 -146462 63155
15325A309J31858K74415a61474f929E8718a45033d8229B52847L2037b7262K611
$$ 1309 133167 407582 -161474 -6929 58718 -145033 -48229 252847 284884 -27262 -24651
15314b4651j24259b0450B80792c7317a6185j42675C25518A24932a32429A00671
$$ -24651 -148910 -20450 280792 -37317 -16185 -158860 325518 124932 -132429 100671
15303F9109b01599I8633c5663j0140l31901E7250a54230A91478e387C15698G6018
$$ 69109 -201599 98633 -35663 -45803 -377704 57250 -154230 191478 -5387 315698 76018
15291I1538L96631C3793J43165l405J51462b31083C9334J78114H5024C7999J1839
$$ 91538 488169 33793 176958 173553 325015 -231083 39334 217448 85024 37999 49838
15280D9838c66361B71879d4716G0552J35503k5443q1080b4899F324K96837e3971
$$ 49838 -366361 271879 -44716 70552 206055 180612 99532 -24899 6324 303161 -53971
15268A03239k0599O996J46868q0588a46675E5727P5519a64301d1045j90626h2490
$$ 103239 82640 89636 236504 155916 -146675 55727 131246 -164301 -41045 -231671 -82490
15256f5356l0241o4243C06022E0058K6068L27473A94715q3006N28024O76895j91079
$$ -65356 -95597 -159840 306022 50058 76126 403599 194715 111709 639733 1316628 1125549
15245A125549m1252r0603q0012H1377d3677A37855K96842i4627E7686K7377b57328
$$ 1125549 1084297 993694 913682 81377 -43677 137855 434697 -94627 57686 85063 -257328
15233A10924j7510a41129q1863A53630a27550p3947e5853j38713A96842a62155
$$ 110924 93414 -141129 -222992 153630 -127550 -201497 -55853 -194566 196842 -162155
15222g2464A948L0459b60229G6231c1235m42974h0729E8160j9769N9084A1952
$$ -72464 1948 32407 -260229 76231 -31235 -474209 -80729 58160 38391 97475 11952
15210A47158N80738B6160J07958a74499o411Q3474A4579J4582J36587J88176r8317
$$ 147158 727896 26160 134118 -174499 -180910 -97436 14579 29161 165748 353924 255607
15199B55607c6334A59170P9923A1496K35925a9439j48091G1129J38706O5425C8233
$$ 255607 -36334 159170 239093 11496 247421 -19439 -167530 71129 209835 275260 38233
15187d5389A38877a14197c3952A13134a72402A65268j8848R4271n6655a62938
$$ -45389 138877 -114197 -33952 113134 -172402 165268 146420 240691 184036 -162938
15176A00571C5264a21812B6641K08507k5891b06665F0578h3817B72674K75224
$$ 100571 35264 -121812 26641 235148 209257 -206665 60578 -83817 272674 547898
15166E47898a89995A26719b2081A61787M1362E024M9118K30157n9718G6952O0663
$$ 547898 -189995 126719 -22081 161787 203149 5024 54142 284299 224581 76952 137615
15155A37615a62631e3215d57m740A40569J20280n7970E0409K04972F9417K67997
$$ 137615 -162631 -53215 -457 -5197 140569 260849 202879 50409 255381 69417 337414
15144C37414b25205L1345A94725b5461j44260C3507E291Q2834L27853A19664a17418
$$ 337414 -225205 -193860 194725 -25461 -169721 33507 5291 88125 415978 119664 -117418
15132A10166M05640a03547A84917G9237C502K2714A2564J73511P1168K5992m0856
$$ 110166 515806 -103547 184917 79237 3502 26216 12564 186075 257243 283235 242379
15121B42379B5790O0130h1993E51152a67519b9439a3648B21105f8264C35731a42667
$$ 242379 25790 85920 -81993 551152 -167519 -29439 -13648 221105 -68264 335731 -142667
15109C39730a88094q399B36118a22238A62787p2235O6605b8900g569B47528C8793
$$ 339730 -188094 -196493 236118 -122238 162787 90552 157157 -28900 -7569 247528 38793
15097F6035a9173I2581L1508o0075A3078K08892J82565B01894k5278J14671a02805
$$ 66035 -19173 92581 124089 64014 13078 221970 404535 201894 176616 291287 -102805
15085F483K88954a05312G3093L1614l585c66512E9357c9558A20465E6493d661
$$ 6483 295437 -105312 73093 104707 101122 -366512 59357 -39558 120465 56493 -4661
15073B4093K46985A17845b42860c0116E04059k49146A09753d6520D45741k11188
$$ 24093 271078 117845 -242860 -30116 504059 254913 109753 -46520 445741 234553
15063B34553G2881Q5131A217J52383d0865G5817J24717L9886G3621K03079C0047
$$ 234553 72881 158012 1217 153600 -40865 75817 200534 240420 73621 276700 30047
15051D8115c883B39344E3547P7040D1202L0704K51914a62507D48712A96151D0634
$$ 48115 -3883 239344 53547 130587 41202 71906 323820 -162507 448712 196151 40634
15039A50494J04055m2402L58605a71722B17689b3676A60038K02338n6562q7669
$$ 150494 254549 212147 570752 -171722 217689 -23676 160038 362376 305814 218145
15029B18145n333a23676C77130A27424a64503f7278B43528M7065j42886K0856
$$ 218145 212812 -123676 377130 127424 -164503 -67278 243528 290593 147707 168563
15019A68563p0076m2257n611P8662j7591Q8985J12028b07629a3180E3270K0998
$$ 168563 98487 56230 50619 129281 111690 200675 312703 -207629 -13180 53270 74268
15008G4268L14920A41175o4178J24672A5862K52943N8247A31013j0430J62316
$$ 74268 389188 141175 76997 201669 15862 268805 327052 131013 120583 282899
14998B82899j17193m1843N2706J31787J63192E246K66434K22889f23E52628k41207
$$ 282899 165706 123863 176569 308356 471548 5246 271680 494569 -623 552628 311421
14987C11421H3634Q3207J95914h9278B98455j48801K39310b29083C76242l8261
$$ 311421 83634 166841 362755 -89278 298455 149654 388964 -229083 376242 337981
14977C37981j30860G5959M48299A87501J37350m7665n1031K0178J30515q1136
$$ 337981 207121 75959 524258 187501 324851 277186 226155 246333 376848 295712
14967B95712K11451B13340O6127M3448H3862R2336K53853p3937E6306L22216j41685
$$ 295712 507163 213340 279467 322915 83862 176198 430051 356114 56306 378522 236837
14956B36837M0312r3230L22919j89041o1232J28833j5514j28340d8016A33552
$$ 236837 277149 183919 506838 317797 256565 385398 369884 241544 -48016 133552
14945B6492P0446L55614A07357K99969r3669j1927j5786J9948K68333J02906D1796
$$ 26492 96938 452552 107357 407326 313657 301730 285944 305892 574225 677131 41796
14933B38368m501Q8250M2166J22984A30843J82284p5180I3883K8547Q6549G8177
$$ 238368 233867 322117 364283 487267 130843 313127 237947 93883 122430 208979 78177
14921D24260J89742A60058r266L16662j61022m0013o4690K81645B32322m6212
$$ 424260 614002 160058 150792 467454 306432 266419 201729 483374 232322 186110
14911A86110J46377G6970J21037Q5651O4645j18747j12570a02931B12844q2594
$$ 186110 332487 76970 198007 283658 348303 229556 116986 -102931 212844 130250
14901A30250L84073M5877k04105M1878I7105L36062J13029g3563F5113K77153
$$ 130250 514323 560200 356095 397973 97105 433167 546196 -73563 65113 342266
14891C42266R4200J55716B20624F034L55068j47740m8452j7029L86542o3521J8056
$$ 342266 436466 592182 220624 6034 361102 213362 164910 147881 534423 470902 488958
14880D88958a11134C82938j02263O3465M6219j76580K92624k53156H0632N168
$$ 488958 -111134 382938 280675 344140 390359 213779 506403 253247 80632 85800
14870H5800J98164K7765J66601J7207j62990q9713L81528j8453B24612K65290
$$ 85800 283964 311729 478330 495537 332547 242834 624362 605909 224612 489902
14860D89902J64044B55007K05172J68846B60142J32843A91639M17221j39286B23240
$$ 489902 653946 255007 460179 629025 260142 392985 191639 608860 469574 223240
14849A94376m8185N9986L39282l3554Q7528A9567N12187A08591M95603B59380
$$ 194376 146191 206177 545459 511905 599433 19567 531754 108591 604194 259380
14838F16233j05662k41799L50187k1231j59436M0690M47748D30430K68601B55892
$$ 616233 510571 268772 618959 597728 438292 478982 926730 430430 699031 255892
14827C05456M6697k9401j18315n2099J03567L58244r0298j40304J02212j79622
$$ 305456 352153 322752 204437 152338 255905 614149 523851 383547 485759 306137
14817C06137L18633M9236k79675j26496K79828k35459O2249J5658J90681j66520
$$ 306137 624770 674006 394331 267835 547663 312204 374453 390111 580792 414272
14807D14272K96434l03368K07508J77670k70555J47932A96778M04138B13863J06251
$$ 414272 710706 407338 614846 792516 521961 669893 196778 600916 213863 320114
14797C20114r711j3794K56208M07074l49269k05306J56860K37001B77812J22996
$$ 320114 310403 296609 552817 959891 610622 405316 562176 799177 277812 400808
14787D00808J73309j86115K5706J47914M4849n9168K79001p4227j17689J2517
$$ 400808 574117 388002 413708 561622 606471 547303 826304 752077 634388 646905
14777F46905j40595K77426B25347K66541L23038k95977p4650K37393k70837J09690
$$ 646905 506310 783736 225347 491888 814926 518949 444299 681692 410855 520545
14767E20545K36065j13086j00006N653J45949C02995L56165N3523k19983O1162
$$ 520545 756610 643524 543518 549171 695120 302995 659160 712683 492700 553862
14757E53862Q736J24201J1019K47846C72624j60079K34563J84069J23094l39660
$$ 553862 562598 686799 697818 945664 372624 212545 447108 631177 754271 414611
14747D14611M42967k01276J04177n5349o2058J25980k254j9094p912C62242M23437
$$ 414611 857578 656302 760479 705130 643072 769052 766798 747704 739792 362242 785679
14736G85679m4297L8912q5561j87477M3682j7829K09138n8358o7960J80350K2778
$$ 785679 741382 780294 694733 507256 550938 533109 742247 683889 615929 796279 819057
14725H19057l56J73537j97741l52474L98828J57038l92986J87163J20317m9948
$$ 819057 818701 992238 794497 442023 840851 997889 604903 792066 912383 862435
14715H62435j08005j55155M20477K32578F01150J98500K29967j36041k99543J51881
$$ 862435 754430 599275 1019752 1252330 601150 799650 1029617 893576 594033 745914
14705G45914K53352l82582J13848Q1068J52300j37462k36589k74281J77057M68541
$$ 745914 999266 616684 730532 811600 963900 826438 589849 315568 492625 961166
14695I61166o0698R1468j37846J28267r6108o6575K80872j11925D26327J98197
$$ 961166 900468 991936 854090 982357 886249 819674 1100546 988621 426327 624524
14685F24524M05041k75810m9668o134M29892N5156l39270K32139p7762n0395J36500
$$ 624524 1029565 753755 704087 697953 1127845 1183001 843731 1075870 998108 947713 1084213
14674A084213m8048k67222K45679J56240p3926J5640k80274J84275l79595M28484
$$ 1084213 1036165 768943 1014622 1170862 1096936 1112576 832302 1016577 636982 1065466
14664A065466l19016K31986j1234J14335J00798J1713j37035r2955K97002j23235
$$ 1065466 746450 978436 967202 1081537 1182335 1194048 1057013 964058 1261060 1137825
14654A137825J07560R5079l98826J07605k5407j03985M37999l10032J36929J88452
$$ 1137825 1245385 1340464 941638 1049243 1023836 919851 1357850 1047818 1184747 1373199
14644A373199j20330j34784N9183o7396k01264J14989L33149l6003J62910l99197
$$ 1373199 1252869 1118085 1177268 1109872 908608 1023597 1356746 1320743 1483653 1084456
14634A084456K6551k0288K23913k15750K13879l50105J61710M29219j92971J98625
$$ 1084456 1111007 1090719 1314632 1098882 1312761 962656 1124366 1553585 1360614 1559239
14624A559239p847l56462K55297M3589j87928K8352r8008q4431M54810q3266k05235
$$ 1559239 1551392 1194930 1450227 1493816 1305888 1334240 1236232 1151801 1606611 1523345 1318110
14613A318110K93854j08852J26658k03896J49084O4174k7865J44593j89405K23711
$$ 1318110 1611964 1503112 1629770 1425874 1574958 1639132 1611267 1755860 1566455 1790166
14603A790166l22770J71266P1477k5831o4864J54558m0607r6044R8641k1628m467
$$ 1790166 1467396 1638662 1710139 1684308 1619444 1774002 1733395 1637351 1735992 1714364 1709897
14592A709897K53554p3609Q6694k89879k2370J05116M4049j49548L60002L7824
$$ 1709897 1963451 1889842 1976536 1686657 1664287 1769403 1813452 1663904 2023906 2061730
14582B061730k91028L19407L8452n40295M28173k32465J12303L40507j36293p2908
$$ 2061730 1770702 2090109 2128561 1588266 2016439 1783974 1896277 2236784 2100491 2027583
14572B027583M06166n19350N64872k3758m42776K23972K84065p5316Q7616K75682
$$ 2027583 2433749 1914399 2479271 2455513 2012737 2236709 2520774 2445458 2533074 2808756
14562B808756j92759m4292M29991k70038M38796l4382J60836j51174M94467L70533
$$ 2808756 2615997 2571705 3001696 2731658 3170454 3136072 3296908 3145734 3640201 4010734
14552D010734M96424J51084J795359K332214N438394R623892J0809915J415682
$$ 4010734 4507158 4658242 6453601 8785815 14224209 23848101 34658016 36073698
14544C6073698j2331543j1072882E686646k558715r30669N4148j69151J02604
$$ 36073698 23742155 12669273 5686646 3127931 2197262 2251410 2082259 2184863
14536B184863k24094j69218K96276M8069j24867O0355L29856l70795M59260j15559
$$ 2184863 1960769 1791551 2087827 2135896 2011029 2071384 2401240 2030445 2489705 2374146
14526B374146j9988l30146M87864J6173l74700L2261M00087N9204K58946k23951
$$ 2374146 2354158 2024012 2511876 2528049 2153349 2185610 2585697 2644901 2903847 2679896
14516B679896L5713m55631M90839q8690j56500L24961j57974J434K82627j89087
$$ 2679896 2715609 2259978 2750817 2662127 2505627 2830588 2672614 2674048 2956675 2767588
14506B767588O6147L31604p6105j67044M98646l31764n5569j0560n5912L39379
$$ 2767588 2833735 3165339 3089234 2922190 3420836 3089072 3033503 3022943 2967031 3306410
14496C306410J37849J43079l39197k76072J73895J00573L95890P6636l19521O1227
$$ 3306410 3444259 3587338 3248141 2972069 3145964 3246537 3642427 3719063 3399542 3460769
14486C460769J75691k5008r9602M52659m3518k70041K54536J04503q1731K04435
$$ 3460769 3636460 3611452 3511850 3964509 3920991 3650950 3905486 4009989 3928258 4132693
14476D132693K1172K01459o59296M07011q9984l7150K53900l4572K08474J46193
$$ 4132693 4153865 4355324 3696028 4103039 4013055 3975905 4229805 4195233 4403707 4549900
14466D549900j01731R4331K00088k51786L46204l12197Q3381L43058j03913L16408
$$ 4549900 4448169 4542500 4742588 4490802 4837006 4524809 4608190 4951248 4847335 5163743
14456E163743J40492J95699n56027K73106J27787l01861L67491O4091J42520q9167
$$ 5163743 5304235 5499934 4943907 5217013 5344800 5042939 5410430 5474521 5617041 5527874
14446E527874L04981j1040R6010J74176k67022K61512J86045l41360J75803J19025
$$ 5527874 5832855 5821815 5917825 6092001 5824979 6086491 6272536 5931176 6106979 6226004
14436F226004K84268J61893J23355j40355K28722o44036L78942N22162n2702k97980
$$ 6226004 6510272 6672165 6795520 6655165 6883887 6239851 6618793 7140955 7088253 6790273
14426F790273P97103l52466L05220m1005K47391K03304j97592J99530J80876J93184
$$ 6790273 7587376 7234910 7540130 7499125 7746516 7949820 7752228 7951758 8132634 8325818
14416H325818j8048M01325J22517k76859K08560L27620J18085J31769k2904M29818
$$ 8325818 8307770 8709095 8831612 8554753 8763313 9090933 9209018 9340787 9317883 9747701
14406I747701K59236j60642J85781L90054J22737J26711k52085N39877r1991N33681
$$ 9747701 10006937 9846295 10032076 10422130 10544867 10671578 10419493 10959370 10867379 11401060
14396A1401060k15486M20096O7004j2643N15620L77217l14856P41021j74044M60111
$$ 11401060 11185574 11605670 11672674 11660031 12175651 12552868 12238012 12979033 12804989 13265100
14386A3265100L50408n7037N65821J69837K36821j0624P22800j10922L24308N04783
$$ 13265100 13615508 13558471 14124292 14294129 14530950 14520326 15243126 15132204 15456512 15961295
14376A5961295R671O11163J41700M17041n0298N17069P25303L01381N05582p8115
$$ 15961295 15970966 16582129 16723829 17140870 17090572 17607641 18332944 18634325 19139907 19061792
14366A9061792M76290N58754K92118O48859M60114K73934N97647L07663N91687
$$ 19061792 19538082 20096836 20388954 21037813 21497927 21771861 22369508 22677171 23268858
14357B3268858M04143N95224P35323M66929N29075O17483R46116O94361P18156
$$ 23268858 23673001 24268225 25003548 25470477 25999552 26617035 27563151 28257512 28975668
14348B8975668O78622O11562M37709J487071J55798J015840J093551R40017P84215
$$ 28975668 29654290 30265852 30703561 32190632 32346430 33362270 34455821 35395838 36180053
14339C6180053J056894J186731P76133J393093Q56958J458741J312727J266083
$$ 36180053 37236947 38423678 39199811 40592904 41449862 42908603 44221330 45487413
14331D5487413J247796J526508J934873J558163J323904J742581J590156J743842
$$ 45487413 46735209 48261717 50196590 51754753 53078657 54821238 56411394 58155236
14323E8155236K588309K042670K291873K005797K588099K613482K505837K902243
$$ 58155236 60743545 62786215 65078088 67083885 69671984 72285466 74791303 77693546
14315G7693546K762886K999592L363075L613933L686420L513365M266942M172715
$$ 77693546 80456432 83456024 86819099 90433032 94119452 97632817 101899759 106072474
14307A06072474M567023M646368N003826N594502N414281O080244O389272O983012
$$ 106072474 110639497 115285865 120289691 125884193 131298474 137378718 143767990 150751002
14299A50751002O963365P576149Q416892Q290822Q706338R540917R986797J0499335
$$ 150751002 157714367 165290516 173707408 181998230 190704568 200245485 210232282 220731617
14291B20731617J1012411J1819116J2125375J2886295J3384155J3832138J3966789
$$ 220731617 231744028 243563144 255688519 268574814 281958969 295791107 309757896
14284C09757896J4676271J4990037J4876043J4455512J4404248J4103962J3527825
$$ 309757896 324434167 339424204 354300247 368755759 383160007 397263969 410791794
14277D10791794J2096043J1157247R740661P119836L981808k60476k991233l219791
$$ 410791794 422887837 434045084 443785745 450905581 454887389 454626913 451635680 448415889
14269D48415889K35362n18292j513091m075111p454445j0639225j2498978j3462093
$$ 448415889 448651251 448132959 446619868 442544757 435090312 424451087 411952109 398490016
14261C98490016j4807687j4901653j5711919j5177678j5121712j5046883j4250786
$$ 398490016 383682329 368780676 353068757 337891079 322769367 307722484 293471698
14254B93471698j3684436j3531080j2866922j2421976j1674331j1480881j0674736
$$ 293471698 279787262 266256182 253389260 240967284 229292953 217812072 207137336
14247B07137336r692535r610603r080671p902355q197736p711469p022693o673274
$$ 207137336 197444801 187834198 178753527 170851172 162653436 154941967 147919274 141246000
14239A41246000o250161n855080n492397n391339n118157m468086m776300l992680
$$ 141246000 134995839 129140759 123648362 118257023 113138866 108670780 103894480 99901800
14231I9901800l876415l222183m049690l470396l379463l244140k695814k930933
$$ 99901800 96025385 92803202 88753512 85283116 81903653 78659513 75963699 73032766
14223G3032766k453798k462479k352757j996406k215050k257177j878504j835022
$$ 73032766 70578968 68116489 65763732 63767326 61552276 59295099 57416595 55581573
14215E5581573j606480j736529j256479j719912j809041j217781j223177j168039
$$ 55581573 53975093 52238564 50982085 49262173 47453132 46235351 45012174 43844135
14207D3844135j046332r08284j302382j178813j278266j009856o96503j177266
$$ 43844135 42797803 41889519 40587137 39408324 38130058 37120202 36423699 35246433
14199C5246433q12412r96331q65724j075280q45007n51205l89642j170749o38345
$$ 35246433 34434021 33437690 32571966 31496686 30651679 30100474 29710832 28540083 27901738
14190B7901738o91797p36871p96386j50183q45209l80573o60628n82732o18884
$$ 27901738 27209941 26473070 25676684 25526501 24681292 24300719 23640091 23057359 22438475
14181B2438475j63951l70455p46983k3513q49531m39483j39688n05088k78045
$$ 22438475 22274524 21904069 21157086 21133573 20284042 19844559 19704871 19199783 18921738
14172A8921738n79411l07094j03411o07611j42131m02901l60161j80100p41623
$$ 18921738 18342327 18035233 17931822 17324211 17182080 16779179 16419018 16238918 15497295
14163A5497295L87389m81744l01539j39145l89244j31625m82889k34223l37865
$$ 15497295 15884684 15402940 15101401 14962256 14573012 14441387 13958498 13724275 13386410
14154A3386410j44570P1258l82082n29188j51330k53586K15884l15024l65412
$$ 13386410 13241840 13313098 12931016 12401828 12250498 11996912 12212796 11897772 11532360
14145A1532360k16207j7908j45251l2077l02139k5698o5034m16439j14989P6506
$$ 11532360 11316153 11298245 11152994 11120917 10818778 10793080 10728046 10311607 10196618 10273124
14135A0273124m26693m4702j23211k38054k7548l61618j51442l2885k37215m7373
$$ 10273124 9846431 9801729 9678518 9440464 9412916 9051298 8899856 8866971 8629756 8582383
14125H582383J32408k42352k30736Q510k47758j59363J11397j57741o2646j93554
$$ 8582383 8714791 8472439 8241703 8250213 8002455 7843092 7954489 7796748 7734102 7540548
14115G540548Q2377j82424j84980K96018j67949l44541J88261m97741j9272K88700
$$ 7540548 7622925 7440501 7255521 7551539 7383590 7039049 7227310 6729569 6710297 6998997
14105F998997k89639j22315J98190k89650k23397J06819J14759m26627L2344k42483
$$ 6998997 6709358 6587043 6785233 6495583 6272186 6379005 6493764 6067137 6099481 5856998
14095E856998L17024l40851J39957j87075l9040k55294L8982l50212J79091J79251
$$ 5856998 6174022 5833171 5973128 5786053 5747013 5491719 5530701 5180489 5359580 5538831
14085E538831k95218j02651k02963K14776J09110j1927j28974k72898J60301q1327
$$ 5538831 5243613 5140962 4937999 5152775 5261885 5249958 5120984 4848086 5008387 4927060
14075D927060o98r6401j91024K74862m65313L94000m04216j8254N8806K0906j13692
$$ 4927060 4926362 4829961 4638937 4913799 4448486 4842486 4438270 4420016 4478822 4499728 4386036
14064D386036q7614j61719j20358k31259L94414J13742l39927j34277J46732N1045
$$ 4386036 4298422 4136703 4016345 3785086 4179500 4293242 3953315 3819038 3965770 4016815
14054D016815k69544K70596l28910J32433R2757j50439m17533J46631r3637J34411
$$ 4016815 3747271 4017867 3688957 3821390 3914147 3763708 3346175 3492806 3399169 3533580
14044C533580J12458j65459j85607K39160k30690j1472j34885L16183r2530L4002
$$ 3533580 3646038 3480579 3294972 3534132 3303442 3291970 3157085 3473268 3380738 3414740
14034C414740k36909l6060j33103L96652j52188o7636K02500k21142k97163j806
$$ 3414740 3177831 3141771 3008668 3405320 3253132 3185496 3387996 3166854 2869691 2867885
14024B867885J79148l82561L73211p1999k99495K43313j63129j45674Q5218k94404
$$ 2867885 3047033 2664472 3037683 2965684 2666189 2909502 2746373 2600699 2685917 2391513
14014B391513r1640L44362j10329L21104k72562L5803r0738k06478L27281l77240
$$ 2391513 2299873 2644235 2533906 2855010 2582448 2618251 2527513 2321035 2648316 2271076
14004B271076J06916K91009n30706N86860l92289J04583j12453q0595q7342L4218
$$ 2271076 2377992 2669001 2138295 2725155 2332866 2437449 2324996 2244401 2157059 2191277
13994B191277N057o4920J10355M63926L32948J729837M262576R342526J2120437
$$ 2191277 2196334 2131414 2241769 2705695 3038643 4768480 9031056 18373582 30494019
13985C0494019O141805r815441j1029923o359833l374667r09719r05657m21035
$$ 30494019 36635824 26820383 15790460 9430627 6055960 5146241 4240584 3819549
13977C819549m32264l78958L09705o8743p5874j81422j90886p8753j79851J14556
$$ 3819549 3387285 3008327 3318032 3249289 3173415 2991993 2801107 2722354 2542503 2657059
13967B657059p4759o1295N0516q4987J45513o22538L13051j43821L71905k60301
$$ 2657059 2582300 2521005 2571521 2486534 2632047 2009509 2322560 2178739 2550644 2290343
13957B290343k0907k13415P8517K3843M0430O7274n71327L43025k16437J67923
$$ 2290343 2269436 2056021 2134538 2158381 2198811 2266085 1694758 2037783 1821346 1989269
13947A989269m3196k28340L31572j4345j81811L14629m57082K54351p7246J40546
$$ 1989269 1946073 1717733 2049305 2034960 1853149 2167778 1710696 1965047 1887801 2028347
13937B028347j29547l30627L74306J96295k96765J50871j44696l78304K14117
$$ 2028347 1898800 1568173 1942479 2138774 1842009 1992880 1848184 1469880 1683997
13928A683997N2199J13487k26267K72177k25186m90870N20512j89290j5633J26603
$$ 1683997 1736196 1849683 1623416 1895593 1670407 1179537 1700049 1510759 1495126 1621729
13918A621729m4476J47494k84483P0639J95453M1968l64158P0481R6318m6508
$$ 1621729 1577253 1724747 1440264 1510903 1706356 1748324 1384166 1454647 1550965 1504457
13908A504457J86789l20283K1178J1288J03802r519l28534J46957J85277M4067
$$ 1504457 1691246 1370963 1392141 1403429 1507231 1497712 1169178 1316135 1501412 1545479
13898A545479r8590l6357j20198k89396K86823k50309J57185n0606p47J38934
$$ 1545479 1446889 1410532 1290334 1000938 1287761 1037452 1194637 1144031 1143284 1282218
13888A282218L2412J79278j5290o8952L4549k64557m6782K42273J92431l05301
$$ 1282218 1314630 1493908 1478618 1409666 1444215 1179658 1132876 1375149 1567580 1262279
13878A262279o0479P2576q3258L70919m26145m0068o2708K01483j20845L21952
$$ 1262279 1201800 1274376 1191118 1562037 1135892 1095824 1033116 1234599 1113754 1435706
13868A435706m30505J59689r5484k7533m6385M23605k43824m6495k40933L88811
$$ 1435706 1005201 1164890 1069406 1041873 995488 1419093 1175269 1128774 887841 1276652
13858A276652m0721l3335r5236K0127N1283m2750l24973J25325j28818K68972
$$ 1276652 1235931 1202596 1107360 1127487 1178770 1136020 811047 936372 807554 1076526
13848A076526q2942J48946o6954J22675k1263k29502J6869K19897p8893N0512
$$ 1076526 993584 1142530 1075576 1198251 1176988 947486 964355 1184252 1105359 1155871
13838A155871r0132L45314m32013P3941J52078j92433J28981L4108j65521N47
$$ 1155871 1065739 1411053 979040 1052981 1205059 1012626 1141607 1175715 1010194 1010741
13828A010741M1884o3414l55816M28627k46705L51986q8737j53771J16784k28488
$$ 1010741 1052625 989211 633395 1062022 815317 1167303 1078566 924795 1041579 813091
13818H13091J31448P9780l618k21124J02544N6479q5397k01030l500K29342j29070
$$ 813091 944539 1024319 1020701 799577 902121 958600 873203 672173 668673 898015 768945
13807G68945K18091k21779j24009L69597O0697k81179k65579K07168j69700L10542
$$ 768945 987036 765257 641248 1010845 1071542 790363 524784 731952 562252 872794
13797H72794p8519J14477J561k72229L29626D43288L99463M22856l65116j70572
$$ 872794 794275 908752 910313 638084 967710 443288 842751 1265607 900491 729919
13787G29919P9588L67569m67828J18198k09151L12671j57941K22997J0602l61204
$$ 729919 809507 1177076 709248 827446 618295 930966 773025 996022 1006624 645420
13777F45420R9288R2409k28010J14450r0878O2030J89794j59199m7492j16768
$$ 645420 744708 837117 609107 723557 632679 694709 884503 725304 677812 561044
13767E61044K44768J44561k55487j45822k1526J83282l08156L10451J5645j86059
$$ 561044 805812 950373 694886 549064 527538 710820 402664 713115 728760 542701
13757E42701L67547R9201l58197Q9225K60667k70150J11461k31395j50597Q9451
$$ 542701 910248 1009449 651252 740477 1001144 730994 842455 611060 460463 549914
13747E49914K48040k26351J47r5370L76522B78232j640N86925j2944j45764R6077
$$ 549914 797954 571603 571750 476380 852902 278232 276592 863517 850573 704809 800886
13736H00886J69053j73862k49557B20072L41742r8913M01766q8176j58623l8629
$$ 800886 969939 796077 546520 220072 561814 462901 864667 776491 617868 579239
13726E79239r6295J45380J43887j10737k92940J52634N3001j76843M65235k64471
$$ 579239 482944 628324 772211 661474 368534 521168 574169 397326 862561 598090
13716E98090L7980j7067J7708L19785j95840j63931l0799j8924M8785l0834j47925
$$ 598090 636070 619003 636711 956496 760656 596725 565926 547002 595787 564953 417028
13705D17028j38262J91344o991q6923J34563L02A44407L33614K28436j08718j03604
$$ 417028 278766 470110 463119 376196 510759 511061 144407 478021 706457 597739 494135
13694D94135M1758L38084j5964k65967J76225C72709J32329K80608k57280M3093
$$ 494135 535893 873977 858013 592046 768271 372709 505038 785646 528366 571459
13684E71459j73680K89617j44359o2041j30278K68523b4924E58205J09943J03137
$$ 571459 397779 687396 543037 480996 350718 619241 -24924 558205 668148 771285
13674G71285j59523m0118J52996l38299J48287k30576L44296p3502j16186l1424
$$ 771285 611762 571644 724640 386341 534628 304052 648348 574846 458660 427236
13664D27236q0600L19548p2907B05470J57686N52328j17403B63314J47390N0353
$$ 427236 346636 666184 593277 205470 363156 915484 798081 263314 410704 461057
13654D61057R6049j92640L31631A54501R5579L38832k24054Q5480o4960K7885
$$ 461057 557106 364466 696097 154501 250080 588912 364858 450338 385378 413263
13644D13263A27719L92248k27560K95M05441B97768j35814K25837L52659k82634
$$ 413263 127719 519967 292407 292702 698143 297768 161954 387791 740450 457816
13634D57816j42727k1620M1829K48232B48847P1247K35388l7896p9080p9360O6072
$$ 457816 315089 293469 335298 583530 248847 320094 555482 517586 438506 359146 425218
13623D25218A66405J45639j09244O6019L00197j84338M5376K18007B29845J57657
$$ 425218 166405 312044 202800 268819 569016 384678 430054 648061 229845 387502
13613C87502q3p2468M9444P9763K42217B98165P5296r4460L10512k3438k41451
$$ 387502 387419 314951 364395 444158 686375 298165 373461 279001 589513 566075 324624
13602C24624J0357J67216B31825m9728C8296J22506L00050l3888K7295M6440k48505
$$ 324624 334981 502197 231825 182097 38296 160802 460852 426964 454259 500699 252194
13591B52194l1952M22735B98085L71811j97945j69159Q4748L2588A72909L79699
$$ 252194 220242 642977 298085 669896 471951 302792 387540 420128 172909 552608
13581E52608k74958L12996j30007n5517p0624J17490k17645N62J06375m8732J91989
$$ 552608 277650 590646 460639 405122 334498 451988 234343 234905 341280 292548 484537
13570D84537J18294A60433J17573A11034P4892k9859K83745D8453J87590n9765
$$ 484537 602831 160433 278006 111034 185926 156067 439812 48453 236043 176278
13560A76278L1386J3336M80856C14905J24826j82879K1193N2459M0858o2654k908
$$ 176278 207664 221000 701856 314905 439731 256852 278045 330504 371362 308708 305800
13549C05800p7015J86376k2985A15506K19295P2073A93654Q4514J45970l8826
$$ 305800 228785 415161 392176 115506 334801 406874 193654 278168 424138 385312
13539C85312k1023J8906I3396M30380J81058B76537J563a1580A37056n9578K50710
$$ 385312 364289 383195 93396 523776 704834 276537 278100 -11580 137056 77478 328188
13528C28188J16514j38175R0866m9978a06311C45879q1233j09510P0429J67238
$$ 328188 444702 306527 397393 347415 -106311 345879 264646 155136 225565 392803
13518C92803P1195J89016p2431k55097b0331D66800j03545A01485K14966j45657
$$ 392803 463998 653014 580583 325486 -20331 466800 363255 101485 316451 170794
13508A70794D4803N22010k11762A9502L30079k348m1137A09447K23246J48480
$$ 170794 44803 566813 355051 19502 349581 347233 306096 109447 332693 481173
13498D81173M0631B0174J61384M626J84514K51695A35042C4745L29844q3596R1110
$$ 481173 521804 20174 181558 186184 370698 622393 135042 34745 364589 280993 372103
13487C72103A26178Q4773l8702E6954a43904E51305B66365e633B70063j16683
$$ 372103 126178 210951 172249 56954 -143904 551305 266365 -5633 270063 153380
13477A53380K55565J33738j67668j27376A23637L76327j49542j17350O3862j48397
$$ 153380 408945 542683 375015 247639 123637 499964 350422 233072 296934 148537
13467A48537J99610j2240n2832J19047A71397J64779j945C3535J01596K38362
$$ 148537 348147 335907 283075 402122 171397 336176 334231 33535 135131 373493
13457C73493p4360J49071i3944A38136o6275N0231B5704a03997A20179e756A49555
$$ 373493 299133 448204 -93944 138136 71861 122092 25704 -103997 120179 -5756 149555
13445B49697l9678R2931b0805B81714m6316J66557d3531B76876j1897L1472q3299
$$ 249697 210019 302950 -20805 281714 235398 401955 -43531 276876 264979 296451 213152
13434B13152M8010q1937J35190F1877J22762A6034M62688A74483J83458j0453
$$ 213152 261162 179225 314415 61877 184639 16034 478722 174483 357941 347488
13424C47488m8936m4133b45066C41311B7160K06810J49918n5874p4327Q2628l628
$$ 347488 298552 254419 -245066 341311 27160 233970 383888 328014 253687 336315 332687
13413C32687J56570B42321J05817B2546J0961O3184L48210E5386L85173I8131
$$ 332687 489257 242321 348138 22546 33507 96691 444901 55386 440559 98131
13402C8396L38521A15920M37739A75124a39487C04341a31111B30221J21183m2842
$$ 38396 376917 115920 553659 175124 -139487 304341 -131111 230221 351404 308562
13392C08562P1834A88723H7500m0887K45671K10355F4205K8588a643n0156B94415
$$ 308562 380396 188723 87500 46613 292284 502639 64205 92793 -1643 -51799 294415
13380C38923J10005H6083L69525A09271N40653k79942m2671N9753A39781N6955
$$ 338923 448928 86083 455608 109271 649924 369982 327311 387064 139781 196736
13370A96736I4132N01679A10111J73022j40480J12419c02848A66337J95766p0017
$$ 196736 94132 595811 110111 283133 142653 255072 -302848 166337 362103 292086
13360B92086a84226B96855j17016R6907e5498B72274k1789J2076o6947E6288L13814
$$ 292086 -184226 296855 179839 276746 -55498 272274 250485 262561 195614 56288 370102
13349C70102A77958J77604p2893M1941K44712k02451j81449R9660A21149K48221
$$ 370102 177958 355562 282669 324610 569322 366871 185422 285082 121149 369370
13339C69370K0884l0309j58387g4300E04986c3316A77370R3285r5065R8203j33959
$$ 369370 390254 359945 201558 -74300 504986 -33316 177370 270655 175590 273793 139834
13328A39834J84693j59287K01787A66488p9535J03561J07641O1552j20912c0446
$$ 139834 324527 165240 367027 166488 86953 190514 298155 359707 238795 -30446
13317C78316P511j50432a1956B45534K1877l6791B2436J87879J31123j41156R494
$$ 378316 385827 235395 -11956 245534 267411 230620 22436 210315 341438 200282 209776
13306B09776L4662l4501n7967J96235K188A39488K6355J29649j13635K30417j55182
$$ 209776 244438 209937 151970 348205 350393 139488 165843 295492 181857 412274 257092
13295B57092A06757E398J59561M3635m9725o4144J00722a14404g48A27109P5456
$$ 257092 106757 5398 164959 208594 158869 94725 195447 -114404 -748 127109 202565
13284B02565I1225K03659f0244b0705j5474A47537P6464j9612F5314J17092J15319
$$ 202565 91225 294884 -60244 -20705 -36179 147537 224001 204389 65314 182406 297725
13273B97725g30j31386F8136L71580F5807k7041f5109B27821L82608d0424G9084
$$ 297725 -730 -132116 68136 439716 65807 38766 -65109 227821 610429 -40424 79084
13261A52833P056P6727q1018R5000q3390a80343C6479J52724J56033j22378N22
$$ 152833 159889 236616 155598 250598 167208 -180343 36479 189203 345236 222858 223380
13250B23380e4477D9174K49045j09557m9311o4051L0931j8051g8326B29720P5825
$$ 223380 -54477 49174 298219 188662 139351 75300 106231 88180 -78326 229720 305545
13239C05545K28266k32822b84611D9140K29574N653p6152d1660B32138m7490J70658
$$ 305545 533811 300989 -284611 49140 278714 284367 208215 -41660 232138 184648 355306
13228C55306m9485q1051j07554N18514f693C66802n4688J22378A41957O0194a91664
$$ 355306 305821 224770 117216 635730 -6693 366802 312114 434492 141957 202151 -191664
13216b5968B26176i5895E74634j14809j78229i9161b8952A10547N2024F4471b75255
$$ -25968 226176 -95895 574634 459825 281596 -99161 -28952 110547 162571 64471 -275255
13204c3410j17699G5427b3769k10851i962j27472A29730n2302M2088P20J5250
$$ -33410 -151109 75427 -23769 -234620 -9962 -137434 129730 77428 119516 120236 135486
13193A35486C3377O0885J23866G6855K18120a5255o5195D21077B7772L15326a26932
$$ 135486 33377 94262 218128 76855 294975 -15255 -80450 421077 27772 343098 -126932
13181B37209A03803m7014J98537D703b90475M6739m4385a38847B98859A09536
$$ 237209 103803 56789 255326 4703 -290475 -243736 -288121 -138847 298859 109536
13170B6364a09692A26282i8456L0104B43161b02622g5648C150a18813b8282a3169
$$ 26364 -109692 126282 -98456 -68352 243161 -202622 -75648 3150 -118813 -28282 -13169
13158E4772R4054j6698a05697A72136a63622D0674e1213j35075N8832c9818A24912
$$ 54772 148826 132128 -105697 172136 -163622 40674 -51213 -186288 -127456 -39818 124912
13146c2228D14992H2329M6414P3563A00034J55594J97170F9347J22839m5746G0732
$$ -32228 414992 82329 128743 202306 100034 255628 452798 69347 192186 146440 70732
13134A83381b34688B55410k6489k7609i7853C66586h6004A61270K71083g7774
$$ 183381 -234688 255410 228921 201312 -97853 366586 -86004 161270 432353 -77774
13123A52191B156L68646H4205a55343A61587K37919c12370A11254J06788b5634
$$ 152191 2156 370802 84205 -155343 161587 399506 -312370 111254 218042 -25634
13112A6299J86404r6130K07797a35400L6860r4670C86725b12327B74493L501Q6774
$$ 16299 202703 106573 314370 -135400 -98540 -193210 386725 -212327 274493 277994 364768
13101C64768A78885a03842A21515Q2714O0931G1363L26609l0045b01675h4753
$$ 364768 178885 -103842 121515 204229 265160 71363 397972 367927 -201675 -84753
13090A64175j0767L4440a10714B31349f3897B44132a42448F1222K59894j7397
$$ 164175 153408 187848 -110714 231349 -63897 244132 -142448 61222 321116 303719
13080C03719A1620K2825J55825r4958a1725A67006J3208n3380e52526b02167a7483
$$ 303719 11620 34445 190270 95312 -11725 167006 180214 126834 -552526 -202167 -17483
13068A46836j0738o4072J36262c90339C43159C0312M28355k25701e40B60940J37214
$$ 146836 136098 72026 208288 -390339 343159 30312 458667 232966 -540 260940 398154
13057C98154d7078C63466K3913A49089m5451Q6117H5781b12476A19581b57178
$$ 398154 -47078 363466 387379 149089 103638 189755 85781 -212476 119581 -257178
13046C06682j19916j7908h9747a6959k07535C48355C3418Q0345M7733J28137n7047
$$ 306682 186766 168858 -89747 -16959 -224494 348355 33418 113763 161496 289633 232586
13035B32586e6993C19099N1107A79555o9893D1762J66751N9187D7501M24317F8209
$$ 232586 -56993 319099 370206 179555 109662 41762 208513 267700 47501 471818 68209
13023h1835B21163b6646m22245f7426B65873A0800K19687H0537K21559c9063A21156
$$ -81835 221163 -26646 -448891 -67426 265873 10800 230487 80537 302096 -39063 121156
13011c8815l513I1755e3303B69725j16000F7917P3069B9317L90948d632B31816
$$ -38815 -42328 91755 -53303 269725 153725 67917 140986 29317 420265 -4632 231816
12999i207o4119A10731d43D02685p0415A01811n0840Q7962M1107m7200a29867
$$ -9207 -73326 110731 -443 402685 332270 101811 50971 138933 180040 132840 -129867
12987A96059k0416j8568a84998B17102g7937J0424F407K25720b85437G9816J27362
$$ 196059 175643 157075 -184998 217102 -77937 -67513 6407 232127 -285437 79816 207178
12976B07178H4419r98J10921M3830d0455A44576p1648g0156I8327a22497I672
$$ 207178 84419 83421 194342 238172 -40455 144576 72928 -70156 98327 -122497 9672
12964g1213F9312b8821j846F4339A7898a77154f169n7243B66433a003F4787Q24
$$ -71213 69312 -28821 -30667 64339 17898 -177154 -6169 -63412 266433 -1003 64787 65611
12952F5611J91136E9836f3721D6159a63545B2383g3474E8703b78358J17073G3231
$$ 65611 256747 59836 -63721 46159 -163545 22383 -73474 58703 -278358 -161285 73231
12940A47127B6796M3254e4266j47515F1596J27808C954b32121c9525B55612n447
$$ 147127 26796 70050 -54266 -201781 61596 189404 3954 -232121 -39525 255612 250165
12929B50165h1947A08241K1519J21262r3124b76659I2424a5620H9755J0570l5943
$$ 250165 -81947 108241 129760 251022 157898 -276659 92424 -15620 89755 100325 64382
12918F4382K91963F0827P510K57d5885A14570J03135G6309A1814J71445J2054
$$ 64382 356345 60827 68337 68594 -45885 114570 217705 76309 11814 183259 195313
12907A95313N9647a30641n3802m9414C46591h3942j80483h4900p3269B32483b07734
$$ 195313 254960 -130641 -184443 -233857 346591 -83942 -264425 -84900 -158169 232483 -207734
12895I9985J3911m3375J64265K3728a8647E2084k142J8033a32333N0474D32297
$$ 99985 113896 70521 234786 258514 -18647 52084 49942 67975 -132333 -81859 432297
12883a18917A73842D2123D029a25356I8266d5702A15192J07519m8234R4827p0762
$$ -118917 173842 42123 4029 -125356 98266 -45702 115192 222711 174477 269304 198542
12872A98542b10036B56754n9958b0399l67711A37544j8093Q4669g3779A9339O4070
$$ 198542 -210036 256754 196796 -20399 -388110 137544 119451 204120 -73779 19339 83409
12861H3409a95597g214k0933B29901I8233J00612Q8789a01633F0655P2741b3201
$$ 83409 -195597 -7214 -28147 229901 98233 198845 287634 -101633 60655 133396 -23201
12849b76510H4680K4162C2659b2568k40647I4780B8732M33131a69003C7822J85373
$$ -276510 84680 108842 32659 -22568 -263215 94780 28732 461863 -169003 37822 223195
12838B23195g9582l1434I5287a42925j57150A22919C9275d2933A32502B91b15617
$$ 223195 -79582 -111016 95287 -142925 -300075 122919 39275 -42933 132502 291 -215617
12826G8696a0542A339J16480K11620c07026A32470L5202k1711J03743K10003C8487
$$ 78696 -10542 1339 117819 329439 -307026 132470 167672 145961 249704 459707 38487
12814a79195A58833c43837F9364g2669L0591A92371b33524j11323J60485B6390
$$ -179195 158833 -343837 69364 -72669 -42078 192371 -233524 -344847 -184362 26390
12803A46061i7466C7295a82443A99366L09029h3791B16463c4670j02604D4304
$$ 146061 -97466 37295 -182443 199366 508395 -83791 216463 -34670 -137274 44304
12792B32459m8190D8403A1134N7724a82443A06176h4900I265L05046a10807A78870
$$ 232459 184269 48403 11134 68858 -182443 106176 -84900 9265 314311 -110807 178870
12780c4907j96780B48118b4454A23109b37930N2462F8180a51890d4406A62643
$$ -34907 -231687 248118 -24454 123109 -237930 -185468 68180 -151890 -44406 162643
12769h8566k9075m5079a8142g118k12409D006g9781C92219E3055O1491i2409C33660
$$ -88566 -117641 -162720 -18142 -7118 -219527 4006 -79781 392219 53055 114546 -92409 333660
12756d441k19910J2662n4330E2750h8039j29039d5733k01781d9696A15189J46361
$$ -4441 -224351 -211689 -266019 52750 -88039 -217078 -45733 -247514 -49696 115189 261550
12745B61550i8771C15663i4458q480B14125C4906R8748L392c76900a1075B47349
$$ 261550 -98771 315663 -94458 -102938 214125 34906 133654 137046 -376900 -11075 247349
12733a17895D02529D7760J69010m7233K07268o7773b37717d3854J1709B12517
$$ -117895 402529 47760 216770 169537 376805 309032 -237717 -43854 -32145 212517
12722a07159B79956l1443b11770A10792B8541i3405H4201K3815R9882J07193a1767
$$ -107159 279956 248513 -211770 110792 28541 -93405 84201 108016 207898 315091 -11767
12710a24713B99886a49528A04379M2663J72931j42185K3299J12811j16387L00038
$$ -124713 299886 -149528 104379 147042 319973 177788 201087 313898 197511 497549
12700D97549k11786o8525p1546F0493h0082j9493N718i039C28448A10905a39245
$$ 497549 285763 217238 145692 60493 -80082 -99575 -93857 -9039 328448 110905 -139245
12688A33122a99162a8337j90637B60461F2240d9236H4714a19958A67020G8111
$$ 133122 -199162 -18337 -208974 260461 62240 -49236 84714 -119958 167020 78111
12677b20590A46602J23337R373E3813D381c20027d9288A10193e9872p1616f5361
$$ -220590 146602 269939 279312 53813 4381 -320027 -49288 110193 -59872 -131488 -65361
12665B70462I9541C8022b51975A85653q9089a09725D14653j89980a83064A73643
$$ 270462 99541 38022 -251975 185653 96564 -109725 414653 224673 -183064 173643
12654C8039L60421f9397B12900B1609K12480c0638k6169C13080A42895a75058
$$ 38039 398460 -69397 212900 21609 234089 -30638 -56807 313080 142895 -175058
12643A8510J40084C4771J02809c0166A62780m5364b96061c2701B97718a00382
$$ 18510 158594 34771 137580 -30166 162780 117416 -296061 -32701 297718 -100382
12632a58989j9954A18234K7679K10211o0092H4333j3864j7647a05171r6872A87334
$$ -158989 -178943 118234 145913 356124 296032 84333 70469 52822 -105171 -202043 187334
12620C90665p3401J30354d1402B622J78276D1139L35511A09154L18283j62324
$$ 390665 317264 447618 -41402 2622 180898 41139 376650 109154 427437 265113
12610B65113a32599B01294G2334a49098m78O2129n4658B77353p9386i5420B36910
$$ 265113 -132599 201294 72334 -149098 -149576 -87447 -142105 277353 197967 -95420 236910
12598A4276Q9567b613D6012g7255A79101I275J95572J23839a84262P9179I470
$$ 14276 103843 -2613 46012 -77255 179101 9275 204847 328686 -184262 -105083 9470
12586A20935B1093a65240A15155f4582a414k18958A44825a58150L5701B44810
$$ 120935 21093 -165240 115155 -64582 -1414 -220372 144825 -158150 -122449 244810
12575C03595a52501e5612g059g57j4265B4561b54830C3955J80975A00086K50661
$$ 303595 -152501 -55612 -7059 -757 -15022 24561 -254830 33955 214930 100086 350747
12564C50747E4877J08206N6139c6087A51498J1657K06133I3658K29567O5690A73971
$$ 350747 54877 163083 219222 -36087 151498 163155 369288 93658 323225 388915 173971
12552A53293o7271b87379A35810K9378a84478K7282p567j847l36419B07692a49422
$$ 153293 86022 -287379 135810 165188 -184478 -157196 -164763 -166610 -503029 207692 -149422
12540F7891i8559A6927N9793M7581L4862a6395B13430o3233l4956D9495M6283
$$ 67891 -98559 16927 76720 124301 159163 -16395 213430 150197 115241 49495 95778
12529I5778J63951I2247K856l7452b12824A4011b24241A03763J00816d14020h0593
$$ 95778 259729 92247 95103 57651 -212824 14011 -224241 103763 204579 -414020 -80593
12517g7029l8784C2294a10967A20603a97303J0714D116d06912A51802j3261d9193
$$ -77029 -115813 32294 -110967 120603 -197303 -186589 4116 -406912 151802 138541 -49193
12505a7860A1971L56957A25372J36600A4774a9337A2599K6809J09666K50931j10007
$$ -17860 11971 368928 125372 261972 14774 -19337 12599 39408 149074 400005 289998
12494B89998A7214K88841j47136K32148a0740B65374J13803a5194D86073h7325
$$ 289998 17214 306055 158919 391067 -10740 265374 379177 -15194 486073 -87325
12483C40267O9385A12921K48597D9161J59855m0441L8414J2044J1284j14525J4667
$$ 340267 409652 112921 361518 49161 209016 168575 206989 219033 230317 115792 130459
12472A30459B2636K95861j03289R3194a86974A56108C9193a81409a7209p7554
$$ 130459 22636 318497 215208 308402 -186974 156108 39193 -181409 -17209 -94763
12462i4763i511E1412d3723B16238J79625a23276J5059B30080b02089Q7446b3863
$$ -94763 -9511 51412 -43723 216238 395863 -123276 -108217 230080 -202089 -114643 -23863
12450d02499A23331M5700A3998L35386G7986L2327K30156f9346B149c8228E4950
$$ -402499 123331 169031 13998 349384 77986 110313 340469 -69346 2149 -38228 54950
12438B03022G2623a83165A79049a43197f2012k60240I1519R893c57428J62287
$$ 203022 72623 -183165 179049 -143197 -62012 -322252 91519 101412 -357428 -195141
12428a95141E1322K06808q5063M8802b612B93444d6984A1122a08446j05074B63859
$$ -195141 51322 258130 173067 221869 -2612 293444 -46984 11122 -108446 -213520 263859
12416g7558G3744b25938D3970J62322q4229J26280a35361E9875c5676j94414e9598
$$ -77558 73744 -225938 43970 206292 122063 248343 -135361 59875 -35676 -230090 -59598
12404H9772B2166J04204G309a49236c4628l7539B47410E9134a67716A98338A678
$$ 89772 22166 126370 7309 -149236 -34628 -72167 247410 59134 -167716 198338 1678
12392a46259B79827i6047B08896B2728J01125a69672n4543A83925a44920F5169
$$ -146259 279827 -96047 208896 22728 123853 -169672 -224215 183925 -144920 65169
12381c6321A2512J83536p986A9806J81747e7189B20043R2506a70196O8577K3247
$$ -36321 12512 196048 188062 19806 201553 -57189 220043 312549 -170196 -101619 -78372
12370g8372m3491B5838K35997p426A08421J08705J02019l9113a15323H1911k1449
$$ -78372 -121863 25838 261835 254409 108421 217126 319145 280032 -115323 81911 60462
12359F0462K03937A7814a30501p1828n4141A69342b84089a32530f3608B54723
$$ 60462 264399 17814 -130501 -202329 -256470 169342 -284089 -132530 -63608 254723
12348b30875J00738O4351b2199q3520g784F4092r550Q8457b14661E5735I542b9155
$$ -230875 -130137 -65786 -22199 -105719 -7784 64092 54542 142999 -214661 55735 9542 -29155
12335b53767B4953g2929J3609A22620b69312H6118k7752P4618N4284a33838I7664
$$ -253767 24953 -72929 -59320 122620 -269312 86118 58366 132984 187268 -133838 97664
12323A06861a16517C81740c74p0743b6694q7398K861q9462D5420L50106c36254
$$ 106861 -116517 381740 -374 -71117 -26694 -114092 -111231 -200693 45420 395526 -336254
12311a21651C63759G3441O1605A3395d9955m36121g4998q292j15422Q7275p6168
$$ -121651 363759 73441 135046 13395 -49955 -486076 -74998 -83290 -198712 -111437 -187605
12300a87605C19797F3684A9809O3701M4633e8012l8761C76498C2328J46950K72468
$$ -187605 319797 63684 19809 83510 128143 -58012 -96773 376498 32328 179278 451746
12289D51746c29250C95925g8583E6542M8442A8341J88278i7791A82379m7564J68348
$$ 451746 -329250 395925 -78583 56542 104984 18341 206619 -97791 182379 134815 303163
12278C03163E9966B1911K01516l575J00698L85150G0468b08331b4435r7487C6860
$$ 303163 59966 21911 223427 219852 320550 705700 70468 -208331 -24435 -121922 36860
12266E47241k53607b6994F0907d2268A4239h7870C23219A7410g3590I2922I855
$$ 547241 293634 -26994 60907 -42268 14239 -87870 323219 17410 -73590 92922 9855
12254a29050B87077p1819K00252j69834c02134B35090G5468K75824j51467i86
$$ -129050 287077 215258 415510 245676 -302134 235090 75468 351292 199825 -986
12243A78780a25246m9119A08627J37630H5557a73037A97767c9187j64633C71617
$$ 178780 -125246 -174365 108627 246257 85557 -173037 197767 -39187 -203820 371617
12232c14955B25907H9703N4738K37434G7571K34580g3480A95385k6207J84024
$$ -314955 225907 89703 144441 381875 77571 312151 -73480 195385 169178 353202
12222C53202a3062B9873R7973b10991A52099K19678j0076a05276b9560B18174
$$ 353202 -13062 29873 127846 -210991 152099 371777 361701 -105276 -29560 218174
12211A87962M4012A08605Q7859p0695c9681A5155O1049l864J81791j16576a20372
$$ 187962 231974 108605 196464 125769 -39681 15155 76204 72340 254131 137555 -120372
12199B95858Q8417d6779E3356J24272M108N2471Q5076q106r5710J8054b52249
$$ 295858 384275 -46779 53356 177628 181736 234207 319283 311177 215467 233521 -252249
12187I9147a16982A36154a6103A71385F3742r725e4204A33825i5594q0067A02071
$$ 99147 -116982 136154 -16103 171385 63742 54017 -54204 133825 -95594 -175661 102071
12175C23164p5607F2442K5420d8485A01834b03585a8519A87744B160d7450C55963
$$ 323164 247557 62442 87862 -48485 101834 -203585 -18519 187744 2160 -47450 355963
12163a60635d4142p585B40853J12261a71915A61568m2267c3321j59628B42441
$$ -160635 -44142 -51727 240853 353114 -171915 161568 119301 -33321 -192949 242441
12152E2070g6659c6227A14322c2929B67568F298L3995Q584a0780C9108J41131
$$ 52070 -76659 -36227 114322 -32929 267568 6298 40293 48877 -10780 39108 180239
12141A80239a86193B18730I7815a79549C1205J84516b7781J3282p1748j06724
$$ 180239 -186193 218730 97815 -179549 31205 215721 -27781 -14499 -86247 -192971
12131a92971j11006a0306k13764D34798A8841a07207k49047A49087d844n5982
$$ -192971 -303977 -10306 -224070 434798 18841 -107207 -356254 149087 -4844 -60826
12121f0826B5112b52448B8126b62403A2815J2186J9116a57923a0466A49408G4582
$$ -60826 25112 -252448 28126 -262403 12815 25001 44117 -157923 -10466 149408 74582
12109A2179K45109j10685d606j17512E9695a16544e6418o0058A76798a71169B58940
$$ 12179 257288 146603 -4606 -122118 59695 -116544 -56418 -116476 176798 -171169 258940
12097c59547B53155a21029B3822J6338a98736d596A24029K1475a36362M3971I7877
$$ -359547 253155 -121029 23822 40160 -198736 -4596 124029 145504 -136362 -92391 97877
12085g6132A82674K8855e6360l9199A03966K7337J12472b1526F0330e3632k10000
$$ -76132 182674 211529 -56360 -95559 103966 131303 243775 -21526 60330 -53632 -263632
12074b63632H6338B6982J11907c1574n7363o8771k26420C53342j34503d748m0318
$$ -263632 86338 26982 138889 -31574 -88937 -157708 -384128 353342 218839 -4748 -45066
12063d5066B03359G812L4681Q6123d4837B67381i7819l1926L3866r1805A5554
$$ -45066 203359 7812 42493 128616 -44837 267381 -97819 -129745 -95879 -187684 15554
12051d8421A21097i099B01221K74203h520H5332b83209J23061B82521A25609n2099
$$ -48421 121097 -9099 201221 475424 -8520 85332 -283209 -160148 282521 125609 73510
12040G3510g2309m0883b0466E7637c8995j02053A28318a24564I9305M229d31594
$$ 73510 -72309 -113192 -20466 57637 -38995 -141048 128318 -124564 99305 103534 -431594
12028a2307A83186l366c63540a11180B30439j7326r2711J92862K43213k17691
$$ -12307 183186 179820 -363540 -111180 230439 213113 120402 313264 556477 338786
12018C38786K69988I9307P6427a03109K6046C9384d785A0975J87270b8646j70419
$$ 338786 608774 99307 175734 -103109 -77063 39384 -4785 10975 198245 -28646 -199065
12007a99065A80964b25244A97486O6896b12479L2487N7282j00469G2684l6152
$$ -199065 180964 -225244 197486 264382 -212479 -179992 -122710 -223179 72684 36532
11997C6532J17759N5342a33987j11405d5012k58355d9593J8723m5632A84287E5667
$$ 36532 154291 209633 -133987 -245392 -45012 -303367 -49593 -30870 -76502 184287 55667
11985g566j46720B29298j01940A5883N5329i0561q0269H5945N8805K16421C4380
$$ -7566 -154286 229298 127358 15883 71212 -90561 -170830 85945 144750 361171 34380
11973a01949K0498k45135H4773B5341Q9013d4380J7592d200A07887L588e5633
$$ -101949 -81451 -326586 84773 25341 114354 -44380 -26788 -4200 107887 111475 -55633
11961A06966N525c41341d2256n4766E678f1206A35740F7187c5524j71301A8996
$$ 106966 112491 -341341 -42256 -97022 5678 -61206 135740 67187 -35524 -206825 18996
11949b16707E5761K4102k4560K35778b16825A18593a38623r8397H2855R8559a06240
$$ -216707 55761 79863 55303 291081 -216825 118593 -138623 -237020 82855 181414 -106240
11937C49268b24556d3814b252j3792G2797N8507J25697H8886b13359a00725E3374
$$ 349268 -224556 -43814 -2252 -16044 72797 131304 257001 88886 -213359 -100725 53374
11925B8807a87347C23410o5597a29349e5374j04077P2613J6570c4969l22876A28844
$$ 28807 -187347 323410 257813 -129349 -55374 -159451 -86838 -70268 -34969 -357845 128844
11913b8572n33747b16819A58821E5799a9344A48961C0252J10930J99172h2249
$$ -28572 -562319 -216819 158821 55799 -19344 148961 30252 141182 340354 -82249
11902C41520g291C09207f2765n7151G8521B2868a53283g3566g348B1209N5710
$$ 341520 -7291 309207 -62765 -119916 78521 22868 -153283 -73566 -7348 21209 76919
11891G6919a08650A612d1102B8578m390b05150l14987f4826B228J9173H348h2242
$$ 76919 -108650 1612 -41102 28578 24188 -205150 -520137 -64826 2228 21401 8348 -82242
11878h6757j6252A73317J6313D149Q3500M1147g97A46988J3734m9555q378a45237
$$ -86757 -103009 173317 189630 4149 87649 128796 -797 146988 160722 111167 102789 -145237
11865a12813k07327i7515D580Q7041a14519J5671o3555k61148G8600j0712a54605
$$ -112813 -320140 -97515 4580 91621 -114519 -98848 -162403 -423551 78600 67888 -154605
11853B06645J56551d0954k22682L274b4645j32500j52608O5507B01174J12681
$$ 206645 363196 -40954 -263636 -260362 -24645 -157145 -309753 -244246 201174 313855
11843C13855c8949h305A03185a63871J0390A33080a57942j94412g4545j71910
$$ 313855 -38949 -8305 103185 -163871 -153481 133080 -157942 -352354 -74545 -246455
11833b46455M1774I713b59773C78235i5794j06811q8655A21038J40210A4794b32855
$$ -246455 -204681 9713 -259773 378235 -95794 -202605 -291260 121038 261248 14794 -232855
11821i6980M7024B09186r2634b53749G3039i5313p9890B84940J1339A15288A354
$$ -96980 -49956 209186 116552 -253749 73039 -95313 -175203 284940 296279 115288 1354
11809H289b70180Q5963B4200a36091k84112A25882L0262a93551B16165b10189
$$ 8289 -270180 -184217 24200 -136091 -420203 125882 156144 -193551 216165 -210189
11798B21186b24813a04848A36733a59603A08345R2702N5779A1581K09421e1043
$$ 221186 -224813 -104848 136733 -159603 108345 201047 256826 11581 221002 -51043
11787a17273J592A17544c84907a25904b538C9114M0689c64964D82693a99999d4776
$$ -117273 -115681 117544 -384907 -125904 -2538 39114 79803 -364964 482693 -199999 -44776
11775b04523j45164C64562f7989a3574A47115B7093e4313a4382j48122C94797
$$ -204523 -349687 364562 -67989 -13574 147115 27093 -54313 -14382 -162504 394797
11764b30020a4300B56136a60994C66782c4502j57598C38162J6515a94755d3651
$$ -230020 -14300 256136 -160994 366782 -34502 -192100 338162 354677 -194755 -43651
11753b23214N8973p9784M5925G5770d7831k54390J35648N8062C5419b68920C7274
$$ -223214 -164241 -244025 -198100 75770 -47831 -302221 -166573 -108511 35419 -268920 37274
11741d9432B16525p8585K45554j89596E8262O185b6933D3185J59858J0600e1804
$$ -49432 216525 137940 383494 193898 58262 64447 -26933 43185 203043 213643 -51804
11729a10922B8335a5402k05029H2614a76942Q2719K4273A77619B7845d3810o1175
$$ -110922 28335 -15402 -220431 82614 -176942 -94223 -69950 177619 27845 -43810 -104985
11718a04985E8474a38229c3363k38230C53571C4122Q5860E8506a91631f7418l7416
$$ -104985 58474 -138229 -33363 -271593 353571 34122 119982 58506 -191631 -67418 -104834
11707a04834M2287A89003d6973C348c354j50526e0600a8257q2006n4098A46784
$$ -104834 -62547 189003 -46973 3348 -3354 -153880 -50600 -18257 -100263 -154361 146784
11695a6456o1928B48038A5302K30382B0904d7800q5370C85355A47320J5000c1908
$$ -16456 -78384 248038 15302 245684 20904 -47800 -133170 385355 147320 162320 -31908
11683B53487c0264C533b48081G4808a1594D166d0638A02112j0315l9487O6026
$$ 253487 -30264 3533 -248081 74808 -11594 4166 -40638 102112 91797 52310 118336
11672A18336J93172a11918D06843j91277c2466k14855Q1453D9207a42663A60736
$$ 118336 311508 -111918 406843 215566 -32466 -247321 -165868 49207 -142663 160736
11661c32442a39318j18519A48472b13171j67340J05689M0812H3067a19798A05089
$$ -332442 -139318 -257837 148472 -213171 -380511 -274822 -234010 83067 -119798 105089
11650A26630a64278A86736a0559m9288K2107m8994G0344K81621j33387a89750
$$ 126630 -164278 186736 -10559 -59847 -37740 -86734 70344 351965 218578 -189750
11639h376k67225a582F5895g3420n9545A47809j1995d4189m37837B39493H2341
$$ -8376 -275601 -1582 65895 -73420 -132965 147809 135814 -44189 -482026 239493 82341
11627b12266B18517K9893M7894k9837e3937b394k7365A11501b276C624K61744
$$ -212266 218517 248410 296304 266467 -53937 -2394 -29759 111501 -2276 3624 265368
11616B65368q9758c6726C27008F045a20342d5802A32215f8275A91567q2194b31635
$$ 265368 175610 -36726 327008 6045 -120342 -45802 132215 -68275 191567 109373 -231635
11604A49693l7639J67238a93438c5335A55577d05568A32742L17267A06568C08
$$ 149693 112054 279292 -193438 -35335 155577 -405568 132742 450009 106568 308
11593A34310J03366e0619R516p6783A20376j0421m1287e6411D06107j96370q0428
$$ 134310 237676 -50619 -41103 -117886 120376 109955 68668 -56411 406107 209737 129309
11582A29309o0236R2307B6538K1835J1125B1763O1140a66654H3151M7493H532
$$ 129309 69073 161380 26538 48373 59498 21763 82903 -166654 83151 130644 8532
11570A25872K46666G8415b95666A22199l9957b38019G9766K04564j35111N9992
$$ 125872 372538 78415 -295666 122199 82242 -238019 79766 284330 149219 209211
11560B09211K900M4263b7512E4410b0083B38379r5798Q5317L12788A86914f0807
$$ 209211 212111 256374 -27512 54410 -20083 238379 142581 227898 540686 186914 -60807
11548I8184L86442A73401k9178m7192i794k19704A8632K6006b13937b718D688
$$ 98184 484626 173401 144223 97031 -9794 -229498 18632 44638 -213937 -2718 4688
11536B2321c69956J08681I9343J8424C7623K63341C5804f32k25630J00982A95471
$$ 22321 -369956 -261275 99343 117767 37623 300964 35804 -632 -226262 -125280 195471
11524a06700C2650e8732C48085A27973J28920a83696B1913L38221A05612C0036
$$ -106700 32650 -58732 348085 127973 256893 -183696 21913 360134 105612 30036
11513a4717j17797A89713C3485j2631K32461e4001E0969K10563c2132p5225A05995
$$ -14717 -132514 189713 33485 20854 253315 -54001 50969 261532 -32132 -107357 105995
11501A48687L8510r1511J35704f7367G0560B6346e4219A0368b371A62781h8459
$$ 148687 187197 95686 231390 -67367 70560 26346 -54219 10368 -2371 162781 -88459
11489A07541O8370K27519A96563m8764l6490J13485J28966c90805H4755K6276
$$ 107541 175911 403430 196563 147799 111309 224794 353760 -390805 84755 111031
11479A11031O4623K75705P697j17223n1580f931H803M36490H8303J37323m789
$$ 111031 175654 451359 459056 341833 290253 -6931 8803 445293 88303 225626 220837
11468B20837K14403c8458A58551C6909M32925A06494P7254a9112j82411B44940
$$ 220837 435240 -38458 158551 36909 469834 106494 183748 -19112 -201523 244940
11457H9946J79646N0525H8160c3223j24546M4339F6252M7455K03555H15K63807
$$ 89946 269592 320117 88160 -33223 -157769 -113430 66252 113707 317262 815 264622
11446B64622q6805b04884I1483e3143A48740J52621a69632A05680a76895A18769
$$ 264622 177817 -204884 91483 -53143 148740 301361 -169632 105680 -176895 118769
11435C33368j07872K56089k23532c22604A28166B904c0272J4511n4189B57386
$$ 333368 225496 481585 258053 -322604 128166 2904 -30272 -15761 -69950 257386
11424A51384l9418f2199A02481K59988I5679J01391D9999Q1188k2254a93562g6162
$$ 151384 111966 -62199 102481 362469 95679 197070 49999 131187 108933 -193562 -76162
11412f608q6944A83002b4494A91485D7112C542d4215E1670P7549n9184q911A0515
$$ -6608 -93552 183002 -24494 191485 47112 3542 -44215 51670 129219 70035 61124 10515
11399a3265k17611I0650c16285b8055F6635L67808A67335A0332J05982e2776A27280
$$ -13265 -230876 90650 -316285 -28055 66635 434443 167335 10332 116314 -52776 127280
11387b16889B19938b05665Q8086D3298J54707d0979j18576B14874l5150c11149
$$ -216889 219938 -205665 -117579 43298 198005 -40979 -159555 214874 179724 -311149
11376g862B16a97982e0491O64A1509L17471H005J73943a44084M9594B46335b20036
$$ -7862 216 -197982 -50491 -49827 11509 328980 8005 181948 -144084 -94490 246335 -220036
11363B84853j06079b5359B72095i5963A4441a68448B18845a28554A68754a21870
$$ 284853 178774 -25359 272095 -95963 14441 -168448 218845 -128554 168754 -121870
11352h3412D09392i3542B7222e1628j07986d3925A85269A6344g8071k58074l157
$$ -83412 409392 -93542 27222 -51628 -159614 -43925 185269 16344 -78071 -336145 -339302
11341c39302k8906J81965k23066B5081b04813C8934a76588B4063K15696a78298
$$ -339302 -368208 -186243 -409309 25081 -204813 38934 -176588 24063 239759 -178298
11330i5120k43237J64424B42267a77957f384p3480A46149c7633n595k2305B8500
$$ -95120 -338357 -173933 242267 -177957 -6384 -79864 146149 -37633 -43228 -65533 28500
11318B2348c65141a18222B24638c6623a2906n2163K666q3911A79988b57329L1582
$$ 22348 -365141 -118222 224638 -36623 -12906 -65069 -62403 -146314 179988 -257329 -225747
11307b25747C09091r9088I3121Q198h8172E5512h2727A78512m5215D0242b18155
$$ -225747 309091 210003 93121 101319 -88172 55512 -82727 178512 133297 40242 -218155
11295g8948B04502d23727A93197i8425i345A37756l4015Q9036b55819N0445k8897
$$ -78948 204502 -423727 193197 -98425 -9345 137756 103741 192777 -255819 -205374 -234271
11284b34271a10588q9388C102J93351i9381N508B86461d3440j48719C74316b20695
$$ -234271 -110588 -199976 3102 196453 -99381 -93873 286461 -43440 -192159 374316 -220695
11272C22182n5772a14408E9046k579i2283A46290a66877c9691p9558j51535J01572
$$ 322182 266410 -114408 59046 56467 -92283 146290 -166877 -39691 -119249 -270784 -169212
11261a69212j34155A32716k5995a20071p6788G0317a71584D4408e5940A26252
$$ -169212 -303367 132716 106721 -120071 -196859 70317 -171584 44408 -55940 126252
11250b21595j4403F12760d4891j10611f5904o7221B06255J6028N6675a70720n8012
$$ -221595 -235998 612760 -44891 -155502 -65904 -133125 206255 222283 278958 -170720 -228732
11239b28732i5664J1923b0403B31587a97630A07728f963p0769l22655G1434b30375
$$ -228732 -95664 -83741 -20403 231587 -197630 107728 -6963 -77732 -400387 71434 -230375
11227d4071E2727a30250l121A83769a66703A13729D1839Q4329E9993M4501C9401
$$ -44071 52727 -130250 -133371 183769 -166703 113729 41839 126168 59993 104494 39401
11215A72676q780a122k83637l9818D6221b90164N0637A52964c31257a8366o4190
$$ 172676 163896 -1122 -284759 -324577 46221 -290164 -239527 152964 -331257 -18366 -82556
11204h2556F469K68865a41979a9774j17149A23432a60553A55992o435a05335J4010
$$ -82556 6469 275334 -141979 -19774 -136923 123432 -160553 155992 149557 -105335 -91325
11193i1325B46653c24521E5026P7818d3939D611d26895h2115k3911A11425a72568
$$ -91325 246653 -324521 55026 132844 -43939 4611 -426895 -82115 -106026 111425 -172568
11181B7978b04081C19417a61260f3636j32429N4971q9907H5321O4684A1726K3457
$$ 27978 -204081 319417 -161260 -63636 -196065 -141094 -231001 85321 150005 11726 35183
11170C5183f8219A55093b34365L4430A17988B6222i931B96513I6819a7235j09839
$$ 35183 -68219 155093 -234365 -199935 117988 26222 -9931 296513 96819 -17235 -127074
11159a27074r715q7667R8832A06576K0685b28695A87352a67829A09066c7703p0507
$$ -127074 -136789 -224456 -125624 106576 127261 -228695 187352 -167829 109066 -37703 -108210
11148a08210K5444J2318I3306J80121a33056f2286k2100k0621l7898r9571E4277
$$ -108210 -82766 -70448 93306 273427 -133056 -62286 -84386 -105007 -142905 -242476 54277
11136g2180D90057h1641A53510A1012c20186A0290h497B74495O2028c158C36095
$$ -72180 490057 -81641 153510 11012 -320186 10290 -8497 274495 336523 -3158 336095
11124A33525a43960A25007b73082I4818b2129A09262c4272j061j56600K8631g911
$$ 133525 -143960 125007 -273082 94818 -22129 109262 -34272 -35333 -191933 -163302 -7911
11112B95220m7872k1789A9180i966A39709J31a69592I4901K35368j22894a49741
$$ 295220 247348 225559 19180 -9966 139709 139840 -169592 94901 330269 207375 -149741
11100a7512C8388N8999J81900k3333F5798N00196A17360D3870J28403O1245j09143
$$ -17512 38388 97387 279287 255954 65798 565994 117360 43870 172273 233518 124375
11089A24375M27343A78055K11133A11871J56810k8692K24784b0768m118I2692
$$ 124375 551718 178055 389188 111871 268681 239989 464773 -20768 -24886 92692
11078a07838A22817J50411k5469B5897O12b931B01678K77531k14305g580C43041
$$ -107838 122817 273228 247759 25897 26509 -2931 201678 479209 264904 -7580 343041
11066A79290K96928q9131A89261K85255k28354K27891j72067L16727K33782l75851
$$ 179290 476218 387087 189261 474516 246162 474053 301986 618713 852495 476644
11056D76644J93299q5840K9706L20749n2664l42204J4938L89964j08263l87957
$$ 476644 669943 584103 613809 934558 881894 539690 554628 944592 836329 448372
11046D48372J12822j7015L30245J80237E23761J73240n7435j20438L55091J2125
$$ 448372 561194 544179 874424 1054661 523761 697001 639566 519128 874219 886344
11036H86344P0197k36559m7486j2365L67599j59482o6372k9132j75793J08524
$$ 886344 956541 719982 672496 660131 1027730 868248 801876 772744 596951 705475
11026G05475L96346B00560N50697k27279J77361O084Q6253q7384J96037k04701
$$ 705475 1101821 200560 751257 523978 701339 707423 793676 706292 902329 697628
11016F97628r2999k34730P0040J76702L97959E03235L23643B14937O10152p0572
$$ 697628 604629 369899 439939 616641 1014600 503235 826878 214937 825089 754517
11006G54517j43559q820m0478m1797J23007J1589p043K0692M3079J92358n6833
$$ 754517 610958 602138 561660 519863 642870 654459 647416 668108 711187 903545 846712
10995H46712k30186j09640J33779j21465M97523k09998K94301m84483J39452C52831
$$ 846712 616526 506886 640665 519200 1016723 806725 1101026 616543 755995 352831
10984I13352L00346L40766n14804K0694j91462Q13639O2457p4614L27970M49381
$$ 913352 1213698 1554464 1039660 1060354 868892 1682531 1744988 1670374 1998344 2447725
10974B447725K19525L48025K97671m20955N39245P9257k36273j57648Q3755n21324
$$ 2447725 2667250 3015275 3312946 2891991 3431236 3510493 3274220 3116572 3200327 2679003
10964B679003k42917n67657J11903j17939Q4713o9144k21255J5049o7894k45671
$$ 2679003 2436086 1868429 1980332 1862393 1947106 1877962 1656707 1671756 1603862 1358191
10954A358191k77587j23868j19476Q5815C24878J82703M3280L5703A82108A6781
$$ 1358191 1080604 956736 837260 923075 324878 507581 550861 586564 182108 16781
10943H5632J59881L03229e9589H6167J1558j5358J96706g6098A67065J02240A4274
$$ 85632 245513 548742 -59589 86167 97725 82367 279073 -76098 167065 269305 14274
10931E4718P7633J08235o0331e2928G1588O3155K0661c5543A29687h6676F3078
$$ 54718 132351 240586 180255 -52928 71588 134743 155404 -35543 129687 -86676 63078
10919F387M9325h4713C60217j5140a29802d9691A20410Q7797k4186O0916e8776
$$ 6387 55712 -84713 360217 345077 -129802 -49691 120410 208207 184021 244937 -58776
10907A94004B1633R9651h910j84992A0332J31488l3841N4949n7374d75270H3234
$$ 194004 21633 121284 -8910 -193902 10332 141820 107979 162928 105554 -475270 83234
10895b27248E4981R7787a39078O5084C00209j23977a38786e2547o1409E3669N3061
$$ -227248 54981 152768 -139078 -73994 300209 176232 -138786 -52547 -113956 53669 106730
10884A06730J58198f1801j01500M0808j64396L2418J21326B35612N3103N3699
$$ 106730 264928 -61801 -163301 -122493 -286889 -254471 -133145 235612 288715 342414
10874C42414a08851k2769n789A26371J45665b14073G290O5399J41387c49584B31886
$$ 342414 -108851 -131620 -137409 126371 272036 -214073 7290 72689 214076 -349584 231886
10862I0939b30100F8565M5756f1874C06577E0437a19125G0416d33178e933k02865
$$ 90939 -230100 68565 114321 -61874 306577 50437 -119125 70416 -433178 -5933 -208798
10851b08798i9146A4903J25956a59918k6323k9999F5653c3487j14712b2432j32601
$$ -208798 -99146 14903 140859 -159918 -186241 -216240 65653 -33487 -148199 -22432 -155033
10840a55033A06424b58277G0239a53078C6655c08001M3591G4805J18304c4727
$$ -155033 106424 -258277 70239 -153078 36655 -308001 -264410 74805 193109 -34727
10829f5733A01738O38K5537f24r0424E9808e7880A63438a15461l1479k22598A80732
$$ -65733 101738 102376 127913 -624 -91048 59808 -57880 163438 -115461 -146940 -369538 180732
10816A67099b3639l76689A01311b90777H4814a17564D16504A80333i9341G9807
$$ 167099 -23639 -400328 101311 -290777 84814 -117564 416504 180333 -99341 79807
10805a33289A03823e8523j24505c1271l28325a08722A44991c21787A77603b1873
$$ -133289 103823 -58523 -183028 -31271 -359596 -108722 144991 -321787 177603 -21873
10794e877A38092J8420o243l7069d50686c0366p1213I6908b9559B39492a45336
$$ -5877 138092 156512 150269 113200 -450686 -30366 -101579 96908 -29559 239492 -145336
10782A33460a57576j1584B23135l7609e41347b12718r4101J50422n2644g0415
$$ 133460 -157576 -169160 223135 185526 -541347 -212718 -306819 -156397 -209041 -70415
10771A2084a67589E3541P0747d20704D5208m402g1466A78259b75182B36468D2398
$$ 12084 -167589 53541 124288 -420704 45208 40806 -71466 178259 -275182 236468 42398
10759C023b6797m7515A67366J93052a7013B01689A8781a70425k30147J02096J08724
$$ 3023 -26797 -74312 167366 360418 -17013 201689 18781 -170425 -400572 -298476 -189752
10748a89752b2240k2803J3058k83366A80982c3637o2029j62307p4272g644B10199
$$ -189752 -22240 -45043 -31985 -315351 180982 -33637 -95666 -257973 -332245 -7644 210199
10736b83411A80736a67618A72756L6913F2584a09531K7946D07073H3862f8797
$$ -283411 180736 -167618 172756 209669 62584 -109531 -81585 407073 83862 -68797
10725E1389J1816b91074a29987e2886C43147F5068b06390l3999A02638e3177C3558
$$ 51389 63205 -291074 -129987 -52886 343147 65068 -206390 -240389 102638 -53177 33558
10713D0471I194K4908O5103f8800B83116j22051e1435A09907b96196O6501F6570
$$ 40471 9194 34102 99205 -68800 283116 161065 -51435 109907 -296196 -229695 66570
10701A50130a09066E5089a21097K7183n9133A02151n0884i6622j84135B1221c94036
$$ 150130 -109066 55089 -121097 -93914 -153047 102151 51267 -96622 -280757 21221 -394036
10689b24984A6618a84864d2304c715j31484k863A9647P0610a18297G120a84998
$$ -224984 16618 -184864 -42304 -3715 -135199 -138062 19647 90257 -118297 7120 -184998
10677c3830j719j48729o4461C6414J82780b05632n8255O7538A69602D7728a26229
$$ -33830 -35549 -184278 -248739 36414 219194 -205632 -263887 -196349 169602 47728 -126229
10665c3482k81634c8065j29439A28357J93085e128K245B18751b62323E4278i5938
$$ -33482 -315116 -38065 -167504 128357 321442 -5128 -2883 218751 -262323 54278 -95938
10653b20121R3355C46447a69536d3471j07824O186L4976I4230M2512c9162A45064
$$ -220121 -126766 346447 -169536 -43471 -151295 -145109 -110133 94230 136742 -39162 145064
10641a30987j32433m5876g5344j7556L0202A95686E0000b97485C9022a35785G4921
$$ -130987 -263420 -309296 -75344 -92900 -62698 195686 50000 -297485 39022 -135785 74921
10629A4711L5194b8786p6560A12540a80191l6633A3389J74883C2143d41044B26859
$$ 14711 49905 -28786 -105346 112540 -180191 -216824 13389 188272 32143 -441044 226859
10617a38792j38962N5713B78291b0095B50801F1986j724c0734m67391a65673k51855
$$ -138792 -277754 -222041 278291 -20095 250801 61986 60262 -30734 -498125 -165673 -417528
10606d17528J34665A25111i6380j39186R9318a9560A87835G2363c78465Q4964
$$ -417528 -282863 125111 -96380 -235566 -136248 -19560 187835 72363 -378465 -293501
10596b93501B29007B9793g1163D2937a6613j6605p8570j12214i134j72218I2150
$$ -293501 229007 29793 -71163 42937 -16613 -33218 -111788 -224002 -9134 -181352 92150
10584a8861k68771j05352A11572K1901a77537d5866D6684J07860Q2004G5194J78140
$$ -18861 -287632 -392984 111572 133473 -177537 -45866 46684 154544 236548 75194 253334
10573B53334i0104j41804C0802a03849e335A04413k1442b27949g2556j12912g562
$$ 253334 -90104 -231908 30802 -103849 -5335 104413 82971 -227949 -72556 -185468 -7562
10561b86835a03491A40843F8402R4808b18594J4735P8050l16233a22251A631d79370
$$ -286835 -103491 140843 68402 163210 -218594 -203859 -125809 -442042 -122251 1631 -479370
10549B66589b76868H4802e8438a0413m0315E9120a02626A88542j8060F5375K1319
$$ 266589 -276868 84802 -58438 -10413 -50728 59120 -102626 188542 170482 65375 86694
10538H6694a71043l3395i026B76468d3970D4527e8311H007h8707J7041m79166
$$ 86694 -171043 -204438 -9026 276468 -43970 44527 -58311 8007 -88707 -71666 -550832
10527e50832a30357m3492A76405b18162F9778h275j45129D01350A92747a94985
$$ -550832 -130357 -173849 176405 -218162 69778 -8275 -153404 401350 192747 -194985
10516a51589a5792A01910i923A64919O9622a06216i741B47734c09565d0039I8573
$$ -151589 -15792 101910 -9923 164919 234541 -106216 -9741 247734 -309565 -40039 98573
10504a35520N8997m3487b5230H807J66929q4552b28354A62666d3502E1973J63176
$$ -135520 -76523 -120010 -25230 8807 175736 91184 -228354 162666 -43502 51973 215149
10493B15149H2928k2511J04015d1220l8393j86538A93142p3122J97516e5468K2923
$$ 215149 82928 60417 164432 -41220 -79613 -266151 193142 120020 317536 -55468 -32545
10482c2545C7655Q425M32784A18134K12105A50845o7786a01832A16571c73330
$$ -32545 37655 46080 478864 118134 330239 150845 83059 -101832 116571 -373330
10471E5987N5543J06699a42379K6402c8567j0506j72394H0604N5855A4608Q9646
$$ 55987 111530 218229 -142379 -115977 -38567 -49073 -221467 80604 136459 14608 104254
10460A04254J7194b13297h9130B1610M8874a40463A80371c78682a25692j38048
$$ 104254 121448 -213297 -89130 21610 70484 -140463 180371 -378682 -125692 -263740
10450b63740f8101j18377c3405A39106a26334A8687a95373j42745b2071E6424
$$ -263740 -68101 -186478 -33405 139106 -126334 18687 -195373 -338118 -22071 56424
10439B05771K5620n9343d70q9857a9764C21703b06209e1962B59360D6614r979
$$ 205771 231391 172048 -470 -90327 -19764 321703 -206209 -51962 259360 46614 36635
10428C6635J59977d289m59458g5969A72903h9144j37243b1313A60872d4324A04422
$$ 36635 196612 -4289 -463747 -75969 172903 -89144 -226387 -21313 160872 -44324 104422
10416A1617g4503b4371j01331e3490H4015b98253G6923g460o2044j08497A78540
$$ 11617 -74503 -24371 -125702 -53490 84015 -298253 76923 -7460 -69504 -178001 178540
10404i9427k18533J57818B60150b5996G67a03670a7357H8727B5843h5976B4177
$$ -99427 -317960 -160142 260150 -25996 767 -103670 -17357 88727 25843 -85976 24177
10392D45745o8675G393J84095j3679a04555C7815K13476K14647A02824N4052E6159
$$ 445745 377070 7393 191488 177809 -104555 37815 251291 465938 102824 156876 56159
10380a81670A10258R2880K09865j80067J28041A089K16808p8075K35556h4302
$$ -181670 110258 203138 413003 232936 360977 1089 217897 139822 375378 -84302
10369A43989J63025E9303M59891A09638L49488p4359q6362D3600L92553A91174
$$ 143989 307014 59303 519194 109638 459126 384767 298405 43600 436153 191174
10358A75504J96659j77986J37165a09341E26793j26623j2123Q7783K19904k82917
$$ 175504 372163 194177 331342 -109341 526793 400170 388047 475830 695734 412817
10348D12817K11855k78095N9484G1962M38980j78732A32629A3832a8901A37014
$$ 412817 624672 346577 406061 71962 510942 332210 132629 13832 -18901 137014
10337c0513A28592J33208O9990n6975b6015A5163c3366k71004H9032C9845L44264
$$ -30513 128592 261800 331790 274815 -26015 15163 -33366 -304370 89032 39845 384109
10326C84109J88820D8828f670p4699C50400Q0284B05986I4201J72884k7887G4823
$$ 384109 572929 48828 -6670 -81369 350400 430684 205986 94201 267085 239198 74823
10314A60645p1858b9029r8201H4160a72347C01688d24270C87748I1156g3410B01135
$$ 160645 88787 -29029 -127230 84160 -172347 301688 -424270 387748 91156 -73410 201135
10302I5478a92358c8018E0839a68219A98504A5187R7536J39637A0846K7287j4342
$$ 95478 -192358 -38018 50839 -168219 198504 15187 112723 252360 10846 38133 23791
10291B3791L6233J5966l7556J2843a44395M6953j06693c563k69153O2504A22938
$$ 23791 60024 75990 38434 51277 -144395 -97442 -204135 -3563 -272716 -210212 122938
10279h3409L4972A57468b60360B97966F1976a91208B61929G4178A7599J34449
$$ -83409 -48437 157468 -260360 297966 61976 -191208 261929 74178 17599 152048
10269A52048D6726A9959J46598b701k04985A27189M4797L378m1918N120J86645
$$ 152048 46726 19959 166557 -2701 -207686 127189 171986 175364 133446 138566 325211
10258C25211f8461B48816k2269N3139j3201c9178r2834a7160j94475I51P5091
$$ 325211 -68461 248816 226547 279686 266485 -39178 -132012 -17160 -211635 951 76042
10247G6042K4289a88223A7123a05510k71824a35873c7707B25772a6412B74009
$$ 76042 100331 -188223 17123 -105510 -377334 -135873 -37707 225772 -16412 274009
10236E2717e1523A91521a7242j06924L8541I6771a07922j19755A60311D9063K55069
$$ 52717 -51523 191521 -17242 -124166 -85625 96771 -107922 -227677 160311 49063 304132
10225C04132H255J3782a81864D5502b21231k7722J24053K513G57L22626F4287
$$ 304132 8255 22037 -181864 45502 -221231 -248953 -124900 -122387 757 323383 64287
10213b63257j46795h173j82797q2032B3640a2123D9966i5841J9953q5478n6836
$$ -263257 -410052 -8173 -190970 -273002 23640 -12123 49966 -95841 -75888 -161366 -218202
10202b18202h9351j614k34898b1560D5204b09706F5723d6218D2946b9569B28973
$$ -218202 -89351 -90965 -325863 -21560 45204 -209706 65723 -46218 42946 -29569 228973
10190f3679D9039a42108G0420J71138M2889b16726C13561O5843b07960B18430
$$ -63679 49039 -142108 70420 241558 284447 -216726 313561 379404 -207960 218430
10179E6746d39471E3105o069a78143d9934C32538e1266j98015A12524b82569A84020
$$ 56746 -439471 53105 47036 -178143 -49934 332538 -51266 -249281 112524 -282569 184020
10167c1597m4768q0185N0824J8867o22419a24774A71296N2479c23431B7089L8097
$$ -31597 -76365 -156550 -105726 -86859 -709278 -124774 171296 223775 -323431 27089 65186
10156F5186l1139f2035A30977g4787D3306a92698D8697A3564e126j63955l29713
$$ 65186 34047 -62035 130977 -74787 43306 -192698 48697 13564 -5126 -169081 -498794
10145d98794I7145a11280b6856j01725n9005e9467A52317d1716k13026M5349f9212
$$ -498794 97145 -111280 -26856 -128581 -187586 -59467 152317 -41716 -254742 -209393 -69212
10133a07504j69097f4792B81848D4002d4232C25349a94220I1076e6845r7050b6860
$$ -107504 -276601 -64792 281848 44002 -44232 325349 -194220 91076 -56845 -153895 -26860
10121A91062h5074J3532l03796b1453j01227A312g7201C8098g6435j46566O6949
$$ 191062 -85074 -71542 -375338 -21453 -122680 1312 -77201 38098 -76435 -223001 -156052
10110a56052p834j21145A91976a29959o057B95751g3211D123J85484a42038k1736
$$ -156052 -163886 -285031 191976 -129959 -136016 295751 -73211 4123 189607 -142038 -163774
10099a63774B08070c434l59145Q7782A42598f8572l5686B88462e8951j24369P7413
$$ -163774 208070 -3434 -362579 -274797 142598 -68572 -104258 288462 -58951 -183320 -105907
10088a05907j28873A78473A1484h8858M3393k32921n6771k31015b35552g978B48437
$$ -105907 -234780 178473 11484 -88858 -45465 -278386 -335157 -566172 -235552 -7978 248437
10076b16059B4812d0946A93654D8023a4486D7083b67350F2819h5301F7927b19979
$$ -216059 24812 -40946 193654 48023 -14486 47083 -267350 62819 -85301 67927 -219979
10064B9239P5383Q4477m4112j2331a50707q832k23450A00389a60171l63458h4846
$$ 29239 104622 189099 144987 132656 -150707 -159539 -382989 100389 -160171 -523629 -84846
10052a20288p2184B5099K49500c01486A12704a17928d4401j86343N3043F9983
$$ -120288 -192472 25099 274599 -301486 112704 -117928 -44401 -230744 -177701 69983
10041a37085A06411c374k07750G2083c56211A7978a49869e8049l5424C78296d10570
$$ -137085 106411 -3374 -211124 72083 -356211 17978 -149869 -58049 -93473 378296 -410570
10029b65981b8351j16278j11947C349h959j94758B26345a46185l77089b27517
$$ -265981 -28351 -144629 -256576 3349 -8959 -203717 226345 -146185 -523274 -227517
10018a96990L4034d1484B71320D5409M7654b02295R003c4132l9108A83610e1739
$$ -196990 -162956 -41484 271320 45409 93063 -202295 -193292 -34132 -73240 183610 -51739
10006A01297h5908l4299l7639g2698j39837a652r0580A04257m925b24208B6469
$$ 101297 -85908 -120207 -157846 -72698 -212535 -1652 -92232 104257 99332 -224208 26469
9994b40814f5325A07513l1416b84674O1355b0514A12423Q5571d7293m3290a9703
$$ -240814 -65325 107513 76097 -284674 -223319 -20514 112423 197994 -47293 -90583 -19703
9982a39324j12741J01421A78955b92694e1269C5628J78858D1138a80287A73759
$$ -139324 -252065 -150644 178955 -292694 -51269 35628 214486 41138 -180287 173759
9971G9438a60905k18884a8120n0520p7704B4483L916K2458N1043h3948k44809
$$ 79438 -160905 -379789 -18120 -68640 -146344 24483 28399 50857 101900 -83948 -328757
9960c28757E8954J84920d17737e4754J6480j84225A47095c73040N9939L41a52685
$$ -328757 58954 243874 -417737 -54754 -38274 -222499 147095 -373040 -313101 -312760 -152685
9948G2016b6582I707b32330R3152e0918j62844H7642c90071A71827f0976k6918
$$ 72016 -26582 9707 -232330 -139178 -50918 -213762 87642 -390071 171827 -60976 -87894
9937h7894k7395k76430J44472J7841a7683m56016a68218o456m8110J02604j7368
$$ -87894 -115289 -391719 -247247 -229406 -17683 -473699 -168218 -174674 -222784 -120180 -137548
9926a37548j14309E1981g0933k26422I7885J6759b85589o3133A43216k0674G916
$$ -137548 -251857 51981 -70933 -297355 97885 114644 -285589 -348722 143216 122542 7916
9914A9194G518c38788J21537A91277i2103C9372K6895f1226A30774i2941b0696
$$ 19194 7518 -338788 -217251 191277 -92103 39372 66267 -61226 130774 -92941 -20696
9902A53686A4784M2467K7604C557a70801D0706J80821C1578c4555l22608a72641
$$ 153686 14784 57251 84855 3557 -170801 40706 221527 31578 -34555 -357163 -172641
9890h871I2023f6963j0569k5173D9159f9245C9020K3702c6271m25600b04606f038
$$ -8871 92023 -66963 -77532 -102705 49159 -69245 39020 62722 -36271 -461871 -204606 -6038
9877C5323h5083k52029j9584A8624a42566r8834A65209A8589a66487K4582M0420
$$ 35323 -85083 -337112 -356696 18624 -142566 -241400 165209 18589 -166487 -141905 -101485
9866a01485j57740A94241G7258a96284d6203j23464a4737E7757J12643O8952F1766
$$ -101485 -259225 194241 77258 -196284 -46203 -169667 -14737 57757 170400 239352 61766
9854a43707d6152j8921H2958e0951A95182D4466p834c2072l64891B8049a4118
$$ -143707 -46152 -65073 82958 -50951 195182 44466 36632 -32072 -396963 28049 -14118
9842C9429h0728g234k64849B38572a16847A56426k591h742r9954r5309A15407
$$ 39429 -80728 -7234 -272083 238572 -116847 156426 153835 -8742 -108696 -204005 115407
9830b29784I603D282g8745K3037B43073a67756k29059I91c5485F9593a81644B2594
$$ -229784 9603 4282 -78745 -55708 243073 -167756 -396815 991 -35485 69593 -181644 22594
9817a26081C1841h9932J8323B73949F6327c39213B25872E6115b29339d6471k82219
$$ -126081 31841 -89932 -71609 273949 66327 -339213 225872 56115 -229339 -46471 -328690
9806c28690J05199g2006C4186A3300a09882E571K02076q9042O000c69938D0738
$$ -328690 -223491 -72006 34186 13300 -109882 5571 207647 118605 124605 -369938 40738
9794B75492d7379A91764a96752A96990c24980a60213E4366K31023c83426a62554
$$ 275492 -47379 191764 -196752 196990 -324980 -160213 54366 285389 -383426 -162554
9783A37843c03246R3210M5638j8878Q2751H8256A4119a81930E7902h3682b4293
$$ 137843 -303246 -210036 -164398 -183276 -100525 88256 14119 -181930 57902 -83682 -24293
9771c9755j1836B37639H6179b12198m4529C972J1406b15722a06069p7613J6766
$$ -39755 -51591 237639 86179 -212198 -256727 3972 15378 -215722 -106069 -183682 -166916
9760a66916o0373f7825j04201j24926h2704L2222A04254K08371a98188c9044j44733
$$ -166916 -227289 -67825 -172026 -296952 -82704 -50482 104254 312625 -198188 -39044 -183777
9749a83777h51j10665o95M9527H0631R1206b82223i813m3580D6447L6117C1979
$$ -183777 -851 -111516 -112211 -62684 80631 171837 -282223 -9813 -53393 46447 82564 31979
9736A40189O2356a46544O4878j417j0981b4646D38165d23772b08346e4352n3191
$$ 140189 202545 -146544 -81666 -83083 -94064 -24646 438165 -423772 -208346 -54352 -107543
9725a07543L2085k81188M360a23871B412b06022O9799j16049Q9666P005q9677
$$ -107543 -75458 -356646 -352286 -123871 2412 -206022 -136223 -252272 -162606 -155601 -245278
9714b45278A6733a66465m7134M2410e6588E0916a3708k03186l9248H0592C6262
$$ -245278 16733 -166465 -213599 -171189 -56588 50916 -13708 -216894 -256142 80592 36262
9702b37174e9524k02633O3271j56979J37621l7099d3060j19598O5502j62471i3460
$$ -237174 -59524 -262157 -198886 -355865 -218244 -255343 -43060 -162658 -97156 -259627 -93460
9690A39007b02016g4745B64994a77991o5296m9469f4326A24052c66439J58990
$$ 139007 -202016 -74745 264994 -177991 -243287 -292756 -64326 124052 -366439 -207449
9680b07449B65198q2438B424K98033C6219g2063k5225j07794Q2432G2131A3056
$$ -207449 265198 182760 2424 300457 36219 -72063 -97288 -205082 -122650 72131 13056
9668A72348h998H6419a43298j0F6299a04182r1786D2690b970E909a19037A0727
$$ 172348 -8998 86419 -143298 -143308 66299 -104182 -195968 42690 -2970 5909 -119037 10727
9655a93537g6840j06283B08829A7812b74457j34395a34588K2033Q567E0135L1767
$$ -193537 -76840 -183123 208829 17812 -274457 -408852 -134588 -112555 -103988 50135 81902
9644H1902a53333f156k95158J25048K7555g4204k89444J04821j61630A99585D947
$$ 81902 -153333 -6156 -301314 -176266 -148711 -74204 -363648 -258827 -420457 199585 4947
9632g0504p3513N8325c8305C5693c07247i2065j79498A01305q134N1738c6567
$$ -70504 -144017 -85692 -38305 35693 -307247 -92065 -271563 101305 93171 144909 -36567
9620b41206c9754A93767G8659a14031l9277A09842J31579d4269j69453B89864
$$ -241206 -39754 193767 78659 -114031 -153308 109842 241421 -44269 -213722 289864
9609D845b207D7441a91701C7459M0779a63445Q0260j14411H8427h6628j19860
$$ 4845 -2207 47441 -191701 37459 78238 -163445 -83185 -197596 88427 -86628 -206488
9598b06488D1557N89364b13113m216E8559K81610a58374F5091b8178a4027o6020
$$ -206488 41557 630921 -213113 -217329 58559 340169 -158374 65091 -28178 -14027 -80047
9587h0047D3576f4312H0663a4396p7860b1592k542j12880j09642O0498A00868
$$ -80047 43576 -64312 80663 -14396 -92256 -21592 -24134 -137014 -246656 -186158 100868
9575a96547l20079I6606A4471e385k16257b8920j11756o3156b1723k44973P4503
$$ -196547 -516626 96606 14471 -5385 -221642 -28920 -140676 -203832 -21723 -266696 -192193
9564a92193f1910a9750l33328I0718a32325E5368i8235Q06l1224b7917A15851
$$ -192193 -61910 -19750 -353078 90718 -132325 55368 -98235 -97429 -128653 -27917 115851
9552a10323M2379A1400b07754A7630a84749M5818I7845B5254R7838a14575I299
$$ -110323 -67944 11400 -207754 17630 -184749 -138931 97845 25254 123092 -114575 9299
9540c8921l16012J33861f8443k4670E0477h4586k81592A59430A6698a34068l589
$$ -38921 -354933 -221072 -68443 -93113 50477 -84586 -366178 159430 16698 -134068 -137657
9529a37657M4016n1798A949J85164C6088e2238A24176f6653B2122g8630c4085
$$ -137657 -93641 -145439 1949 187113 36088 -52238 124176 -66653 22122 -78630 -34085
9517b73205J05608p8409J05065B36074e5934A29771E6099N4482B1196M4573B4183
$$ -273205 -167597 -246006 -140941 236074 -55934 129771 56099 110581 21196 65769 24183
9505B13983d48425c4007p4907q0728g9889j39371E3798K16971I0295a07824G8685
$$ 213983 -448425 -34007 -108914 -189642 -79889 -219260 53798 270769 90295 -107824 78685
9493a98129j17343L5653A69080c0959I9622Q4833F2010j8105a75140q8321J06041
$$ -198129 -315472 -279819 169080 -30959 99622 184455 62010 43905 -175140 -263461 -157420
9482a57420O4225j88427A89322p5608a67862B0989a76311O0084M2647o0053I3400
$$ -157420 -93195 -281622 189322 113714 -167862 20989 -176311 -116227 -73580 -133633 93400
9470a15643m1106p5167D5152a21350K9641K333K6001j79774B02253a48478B97592
$$ -115643 -156749 -231916 45152 -121350 -91709 -89376 -63375 -243149 202253 -148478 297592
9458A07312B0611K0949d2217j28661P7915j95994e5014K2529j79232h7911a324
$$ 107312 20611 41560 -42217 -170878 -92963 -288957 -55014 -32485 -211717 -87911 -1324
9446b5702F779M71450A40637e1881j9380j36728d9622j95384C6949j1291a92280
$$ -25702 6779 478229 140637 -51881 -71261 -207989 -49622 -245006 36949 25658 -192280
9434b48863B70761c86834C4113a9766B45530q4219C706P7393l3254a2641n5605
$$ -248863 270761 -386834 34113 -19766 245530 161311 3706 81099 47845 -12641 -68246
9423f8246a026B18950a55455r8953O1436o2400J23203l49135a03847j2904A70477
$$ -68246 -1026 218950 -155455 -254408 -192972 -255372 -132169 -481304 -103847 -116751 170477
9411a73396k47470n1059d1431J1420D1087c76992A03675e70935a57761L8160A02857
$$ -173396 -420866 -471925 -41431 -30011 41087 -376992 103675 -570935 -157761 -119601 102857
9399C3600d0352n5286j32913D7J6135b42326d093B96038b94392A57934m0680k779
$$ 33600 -40352 -95638 -228551 47 16182 -242326 -4093 296038 -294392 157934 117254 114475
9387A14475b1570B51500c08816C3224c07314G5707J0848h9167J8901q7322b3134
$$ 114475 -21570 251500 -308816 33224 -307314 75707 86555 -89167 -70266 -157588 -23134
9375A5974K74062e8794E0170a4915B32946c4301l9481I6230e3724H4784A6138
$$ 15974 290036 -58794 50170 -14915 232946 -34301 -73782 96230 -53724 84784 16138
9363a73868n825f789k6900A22958a13417A06691L5811m2455A3014J320a77056
$$ -173868 -179693 -6789 -33689 122958 -113417 106691 142502 100047 13014 14334 -177056
9351B7091e0264p9391A41773f9823j33277R3867m1110B04114E3436J71484b4765
$$ 27091 -50264 -129655 141773 -69823 -203100 -109233 -150343 204114 53436 224920 -24765
9339a2774j24612A01895j7682c40247a02014c087k3351j38689j7708j74714G2795
$$ -12774 -137386 101895 84213 -340247 -102014 -3087 -26438 -165127 -182835 -357549 72795
9327c180A00063a63641o0588j517e1936q9606F0789b30998D5544a86967J8396
$$ -3180 100063 -163641 -224229 -225746 -51936 -141542 60789 -230998 45544 -186967 -168571
9316a68571k62323a23636k9720D076a1265l9003j01626H6131c01869P5386P6684
$$ -168571 -430894 -123636 -153356 4076 -11265 -50268 -151894 86131 -301869 -226483 -149799
9305a49799F6734b14319N7736O501k5326k91565b8569A50428b28693B03066i1839
$$ -149799 66734 -214319 -156583 -150082 -175408 -466973 -28569 150428 -228693 203066 -91839
9293D11046a15857a3003D7162b72312B37743g6353A96350a0928j56962O2485d4713
$$ 411046 -115857 -13003 47162 -272312 237743 -76353 196350 -10928 -167890 -105405 -44713
9281f0564r500C85678I0707k1345k8907a52590j79410J53677B09998a54242F5056
$$ -60564 -70064 385678 90707 69362 40455 -152590 -332000 -178323 209998 -154242 65056
9269e54629C04920b18487g3305l58655B26144a83020f8990j34205g7557j61309
$$ -554629 304920 -218487 -73305 -431960 226144 -183020 -68990 -203195 -77557 -238866
9259b38866B44500J60048F8474a53599J4331k57867B386d25613e523j53003C05526
$$ -238866 244500 404548 68474 -153599 -139268 -397135 2386 -425613 -5523 -158526 305526
9247A49725o1329K78487A67651g3571j24824G5452e1286j61764G9833N37h4236
$$ 149725 88396 366883 167651 -73571 -198395 75452 -51286 -213050 79833 80370 -84236
9235A7509c46914B57258b68621F3437a68595M4949r860D2573A3621O2910C258
$$ 17509 -346914 257258 -268621 63437 -168595 -123646 -133506 42573 13621 76531 3258
9223A61634a86081A52879C5027K46601j05942d36776J61205e4823j39080A40356
$$ 161634 -186081 152879 35027 281628 175686 -436776 -275571 -54823 -193903 140356
9212A67557j1782h3748j50619j72835a98911I9479d1665j44248A24908a45555
$$ 167557 155775 -83748 -234367 -407202 -198911 99479 -41665 -185913 124908 -145555
9201G4149b13657P45l1066a03012K4779F0930O8180d0021B959a63386B3721a14126
$$ 74149 -213657 -212912 -243978 -103012 -78233 60930 129110 -40021 2959 -163386 23721 -114126
9188A91385B3139i9994k66062J46020C69698H9030f2783j09609C7691a16194k01727
$$ 191385 23139 -99994 -366056 -220036 369698 89030 -62783 -172392 37691 -116194 -317921
9177c17921g0493C2092d1837D180a51022l5393N5041e0975B14540I293b84478
$$ -317921 -70493 32092 -41837 4180 -151022 -186415 -131374 -50975 214540 9293 -284478
9165a89437B280b02983A19298a0120n4747l37315J78871h9772B7383b1437A3357
$$ -189437 2280 -202983 119298 -10120 -64867 -402182 -223311 -89772 27383 -21437 13357
9153B10118I4211c2317A45190b05317A8484h7729B0189c26676A58101c85033J5735
$$ 210118 94211 -32317 145190 -205317 18484 -87729 20189 -326676 158101 -385033 -369298
9142c69298a32696q0532C81003C5718a75932B75578r2971c4728o4236k73991a60090
$$ -369298 -132696 -213228 381003 35718 -175932 275578 182607 -34728 -98964 -372955 -160090
9130C7816b01815J4670B42424a5759g655j71295a8709j26497A6919L61532c06163
$$ 37816 -201815 -187145 242424 -15759 -7655 -178950 -18709 -145206 16919 378451 -306163
9118b07609R8348G9690o531c56368B55242e0504P595B65337f3153K3679o0916
$$ -207609 -109261 79690 73159 -356368 255242 -50504 -42909 265337 -63153 -39474 -100390
9107a00390l20628Q2519M0339J42836k900l9090C5097c13814i8233L4637B26756
$$ -100390 -421018 -338499 -298160 -155324 -158224 -197314 35097 -313814 -98233 -63596 226756
9095E8557q152k0517b42967A80023f159D034f5592k30342j7068R7570B5705a8098
$$ 58557 50405 29888 -242967 180023 -6159 4034 -65592 -295934 -313002 -215432 25705 -18098
9082e64641a36680m7287B3751c2909m06629a21364o3830H9581a05781B21724b88297
$$ -564641 -136680 -183967 23751 -32909 -439538 -121364 -185194 89581 -105781 221724 -288297
9070a23918L3597B24584f2541j24759E2758f2582j00868d3419j14862F6235e4827
$$ -123918 -90321 224584 -62541 -187300 52758 -62582 -163450 -43419 -158281 66235 -54827
9058a36476A02279a79147j57233E4922a57326A17249a04866j96649h593o392j56730
$$ -136476 102279 -179147 -336380 54922 -157326 117249 -104866 -301515 -8593 -14985 -171715
9047a71715g4062b0511b896j88352N6082a6706H9214a22413j06009O1050K4281
$$ -171715 -74062 -20511 -2896 -191248 -135166 -16706 89214 -122413 -228422 -167372 -143091
9036a43091A76674l6057j7135b30515R0182D6095A9174K35736J83120j70805a71194
$$ -143091 176674 140617 123482 -230515 -140333 46095 19174 254910 438030 267225 -171194
9024a84680e3057k84117h3734j77821g2061j19606m18574d4631k53755f954k21752
$$ -184680 -53057 -337174 -83734 -261555 -72061 -191667 -610241 -44631 -298386 -6954 -228706
9013b28706P9084B8452a38631B31440F7617o537J09834e1279I1514a15810l8806
$$ -228706 -149622 28452 -138631 231440 67617 61080 170914 -51279 91514 -115810 -154616
9002a54616A90292a10769G931a37970B29655a5566k7510j96000e622j64279M2358
$$ -154616 190292 -110769 7931 -137970 229655 -15566 -43076 -239076 -5622 -169901 -127543
8991a27543B48881i3107B1472a67974G0331l3854K73182a62644A37993a26584
$$ -127543 248881 -93107 21472 -167974 70331 36477 309659 -162644 137993 -126584
8980B7807c42955d2608j57281b0206C11608C6003a2209k59961O8672G1186a95337
$$ 27807 -342955 -42608 -199889 -20206 311608 36003 -12209 -272170 -203498 71186 -195337
8968b51447c3395B81163A26238D1227a34881K9469B33316a12391c608G2442b58435
$$ -251447 -33395 281163 126238 41227 -134881 -105412 233316 -112391 -3608 72442 -258435
8956I2472R332a32706j5849d4624F260J6003b7510k47201A13656b3471o8078k40138
$$ 92472 101804 -132706 -148555 -44624 6260 22263 -27510 -274711 113656 -23471 -91549 -331687
8944c31687J21415g882I895a84452k81118C49119j28147l0126l8775M52101B88112
$$ -331687 -210272 -7882 9895 -184452 -465570 349119 220972 190846 152071 604172 288112
8932I2394d817A92545n0263n6249Q6741K72619R9196O27334J893555M102540O127276
$$ 92394 -4817 192545 142282 86033 172774 445393 544589 1171923 3065478 7168018 13295294
8921A3295294m528707D113022A174435D94542B16317K28015a06525G3102H449
$$ 13295294 8766587 4113022 1174435 494542 216317 444332 -106525 73102 8449
8911I0520B1785a4686B81673J62065B04696G7482K06296a06284d0284m2680k9416
$$ 90520 21785 -14686 281673 443738 204696 77482 283778 -106284 -40284 -82964 -112380
8900a12380a7257j20117F1798a34152A05846a02152A32856O6389c5561j39740
$$ -112380 -17257 -137374 61798 -134152 105846 -102152 132856 199245 -35561 -175301
8890a75301A90841b56080f9804A62802h122j82135C57463b47774A41570A1610
$$ -175301 190841 -256080 -69804 162802 -8122 -190257 357463 -247774 141570 11610
8879b15087a05187I4464b06281j36025A07091b47798i50n2802m55862D7961e2022
$$ -215087 -105187 94464 -206281 -342306 107091 -247798 -950 -53752 -509614 47961 -52022
8867E5674K17642a9600n0974b834D6211J25658d07277b4219A14328m7196K63881
$$ 55674 273316 -19600 -70574 -2834 46211 171869 -407277 -24219 114328 67132 331013
8856C31013g5002F3335L5678j7419K58827a45520j53213K0718M2104q5201a41418
$$ 331013 -75002 63335 99013 81594 340421 -145520 -298733 -278015 -235911 -321112 -141418
$$ [...]
##END NTUPLES=NMR SPECTRUM
##END=
