##TITLE=AC1546_ROEFFECT0013_8268638_p2KN6tGBTQ
##JCAMPDX= 6.0         $$ Bruker NMR JCAMP-DX V2.0
##DATA TYPE= NMR SPECTRUM
##DATA CLASS= NTUPLES
##ORIGIN= BRUKER
##OWNER= Administrator
$$ 1.72 TOPSPIN		Version 2.1
$$ 2013-10-11 21:40:54.518 -0700  Administrator@X
$$ Compression mode = diff/dup
##.OBSERVE FREQUENCY= 400.02188249412
##.OBSERVE NUCLEUS= ^1H
##.ACQUISITION MODE= SIMULTANEOUS (DQD)
##.ACQUISITION SCHEME= undefined
##.AVERAGES= 64
##.DIGITISER RES= 22
##SPECTROMETER/DATA SYSTEM= spect
##.PULSE SEQUENCE= noesygpps1d.comp
##.SOLVENT NAME= COFFEE_meoh
##.SHIFT REFERENCE= INTERNAL, COFFEE_meoh, 1, 14.9606
##AUDIT TRAIL= $$ (NUMBER, WHEN, WHO, WHERE, PROCESS, VERSION, WHAT)
$$ ##TITLE= Audit trail, TOPSPIN		Version 2.1
$$ ##JCAMPDX= 5.01
$$ ##ORIGIN= Bruker BioSpin GmbH
$$ ##OWNER= Administrator
$$ $$ E:\/data/COFFEE/nmr/AC1546_ROEFFECT0013_8268638_p2KN6tGBTQ/12/pdata/1/auditp.txt
$$ ##AUDIT TRAIL=  $$ (NUMBER, WHEN, WHO, WHERE, PROCESS, VERSION, WHAT)
(   1,<2013-10-11 21:40:49.440 -0700>,<Administrator>,<X>,<go>,<TOPSPIN 2.1>,
      <created by zg
	started at 2013-10-11 21:29:19.970 -0700,
	POWCHK enabled, PULCHK disabled,
       configuration hash MD5:
       C8 4E 4E 5D D3 5C D8 9E 9F 52 82 E0 59 8A DE 15
       data hash MD5: 64K
       19 AC 0E B3 DD BE 41 0E 45 D2 04 8C EB 2F FD B3>)
(   2,<2013-10-11 21:40:52.503 -0700>,<Administrator>,<X>,<proc1d>,<TOPSPIN 2.1>,
      <Start of raw data processing
       efp LB = 0.3 FT_mod = 6 PKNL = 1 PHC0 = 0 PHC1 = 0 SI = 128K 
       data hash MD5: 128K
       DB 53 A4 E5 3E AE 16 F8 75 31 F8 53 12 2D 11 72>)
(   3,<2013-10-11 21:40:53.518 -0700>,<Administrator>,<X>,<proc1d>,<TOPSPIN 2.1>,
      <pk PHC0 = -82.78748 PHC1 = 0 
       data hash MD5: 128K
       0B 30 1F 8F 62 8E D0 5C 89 51 10 65 30 E9 F7 81>)
(   4,<2013-10-11 21:40:53.940 -0700>,<Administrator>,<X>,<proc1d>,<TOPSPIN 2.1>,
      <abs ABSG = 1 
       data hash MD5: 128K
       15 DD 4A 2C D7 0E AF B3 E7 3E 97 DA 44 60 9E 3C>)
(   5,<2013-10-11 21:40:54.065 -0700>,<Administrator>,<X>,<proc1d>,<TOPSPIN 2.1>,
      <abs ABSG = 2 
       data hash MD5: 128K
       82 05 8D 5D F7 8B CA 62 A2 25 27 57 6B 8A FC A8>)
(   6,<2013-10-11 21:40:54.143 -0700>,<Administrator>,<X>,<proc1d>,<TOPSPIN 2.1>,
      <abs ABSG = 3 
       data hash MD5: 128K
       26 C9 4B DE 2C 0D 8B B7 04 A3 14 58 A7 1E D2 86>)
(   7,<2013-10-11 21:40:54.237 -0700>,<Administrator>,<X>,<proc1d>,<TOPSPIN 2.1>,
      <abs ABSG = 4 
       data hash MD5: 128K
       59 90 90 D5 FE 84 20 15 44 DB A0 19 EB 53 13 33>)
(   8,<2013-10-11 21:40:54.315 -0700>,<Administrator>,<X>,<proc1d>,<TOPSPIN 2.1>,
      <abs ABSG = 5 
       data hash MD5: 128K
       34 BB DE 77 73 56 8F 88 66 54 55 DC 04 1F D8 2D>)
$$ ##END=
$$ 
$$ $$ hash MD5
$$ $$ 10 C3 AA B9 80 B2 CD A0 F8 8E F9 D2 8C 0E A2 6A
##$RELAX= 
##$RELAX= 
##$RELAX= 
##$RELAX= 
##$RELAX= 
##$RELAX= 
##$RELAX= 
##$RELAX= 
$$ Bruker specific parameters
$$ --------------------------
##$DU= <E:\>
##$EXPNO= 12
$$ [...]
150 150 150 150 150 150 150 150
##$TP07= 0
##$TPNAME0= <>
##$TPNAME1= <>
##$TPNAME2= <>
##$TPNAME3= <>
##$TPNAME4= <>
##$TPNAME5= <>
##$TPNAME6= <>
##$TPNAME7= <>
##$TPOAL= (0..7)
0.5 0.5 0.5 0.5 0.5 0.5 0.5 0.5
##$TPOFFS= (0..7)
0 0 0 0 0 0 0 0
##$TUNHIN= 0
##$TUNHOUT= 0
##$TUNXOUT= 0
##$USERA1= <user>
##$USERA2= <user>
##$USERA3= <user>
##$USERA4= <user>
##$USERA5= <user>
##$V9= 5
##$VALIST= <valist>
##$VCLIST= <CCCCCCCCCCCCCCC>
##$VD= 0
##$VDLIST= <DDDDDDDDDDDDDDD>
##$VPLIST= <PPPPPPPPPPPPPPP>
##$VTLIST= <TTTTTTTTTTTTTTT>
##$WBST= 1024
##$WBSW= 4
##$XGAIN= (0..3)
0 0 0 0
##$XL= 0
##$YL= 0
##$YMAX_a= 6890380
##$YMIN_a= -13363854
##$ZGOPTNS= <>
##$ZL1= 120
##$ZL2= 120
##$ZL3= 120
##$ZL4= 120
##$ABSF1= 14.9606
##$ABSF2= -5.597582
##$ABSG= 5
##$ABSL= 3
##$ALPHA= 0
##$AQORDER= 0
##$ASSFAC= 0
##$ASSFACI= 0
##$ASSFACX= 0
##$ASSWID= 0
##$AUNMP= <proc_prof1d_extract.lims>
##$AXLEFT= 0
##$AXNAME= <>
##$AXNUC= <1H>
##$AXRIGHT= 0
##$AXTYPE= 0
##$AXUNIT= <>
##$AZFE= 0.1
##$AZFW= 0.1
##$BCFW= 0
##$BC_mod= 0
##$BYTORDP= 0
##$COROFFS= 0
##$CY= 15
##$DATMOD= 1
##$DC= 0
##$DFILT= <>
##$DTYPP= 0
##$F1P= 0
##$F2P= 0
##$FCOR= 0.5
##$FTSIZE= 131072
##$FT_mod= 6
##$GAMMA= 0
##$GB= 0
##$INTBC= 1
##$INTSCL= 1
##$ISEN= 128
##$LB= 0.3
##$LEV0= 0
##$LPBIN= 0
##$MAXI= 10000
##$MC2= 0
##$MEAN= 0
##$ME_mod= 0
##$MI= 0
##$NCOEF= 0
##$NC_proc= -2
##$NLEV= 6
##$NOISF1= 0
##$NOISF2= 0
##$NSP= 0
##$NTH_PI= 0
##$NZP= 0
##$OFFSET= 14.9606
##$PC= 1
##$PHC0= -82.78748
##$PHC1= 0
##$PH_mod= 1
##$PKNL= yes
##$PPARMOD= 0
##$PPDIAG= 0
##$PPIPTYP= 0
##$PPMPNUM= 2147483647
##$PPRESOL= 1
##$PSCAL= 4
##$PSIGN= 0
##$PYNMP= <proc.py>
##$REVERSE= no
##$SF= 400.020009796529
##$SI= 131072
##$SIGF1= 0
##$SIGF2= 0
##$SINO= 400
##$SIOLD= 131072
##$SPECTYP= <>
##$SREGLST= <1H.CDCl3>
##$SSB= 0
##$STSI= 131072
##$STSR= 0
##$SW_p= 8223.68421052631
##$SYMM= 0
##$S_DEV= 0
##$TDeff= 65536
##$TDoff= 0
##$TI= <>
##$TILT= no
##$TM1= 0
##$TM2= 0
##$TOPLEV= 0
##$USERP1= <user>
##$USERP2= <user>
##$USERP3= <user>
##$USERP4= <user>
##$USERP5= <user>
##$WDW= 1
##$XDIM= 131072
##$YMAX_p= 396521624
##$YMIN_p= -13519
##$CURPLOT= <Network HP LaserJet P1505>
##$CURPRIN= <$Network HP LaserJet P1505>
##$DFORMAT= <normdp>
##$LAYOUT= <+/1D_H.xwp>
##$LFORMAT= <normlp>
##$PFORMAT= <normpl>
##$SURQMSG= 1
$$ End of Bruker specific parameters
$$ ---------------------------------
##NTUPLES= NMR SPECTRUM
##VAR_NAME=  FREQUENCY,     SPECTRUM/REAL,   SPECTRUM/IMAG
##SYMBOL=    X,             R,               I
##VAR_TYPE=  INDEPENDENT,   DEPENDENT,       DEPENDENT
##VAR_FORM=  AFFN,          ASDF,            ASDF
##VAR_DIM=   131072,        131072,          131072
##UNITS=     HZ,            ARBITRARY UNITS, ARBITRARY UNITS
##FACTOR=    0.0627417313425164, 1,          1
##FIRST=     8223.62146879497, 3532,         -69771
##LAST=      0,             4411,            -70071
##MIN=       0,             -13519,          0
##MAX=       8223.62146879497, 396521624,    0
$$ Real data points
##PAGE= N=1
##DATA TABLE= (X++(R..R)), XYDATA
$$ [...]
63749D37787k827o151q232q828q769q992r430r315q433p423o727n895m373k487
$$ 437787 434960 428809 420577 411749 402980 393988 384558 375243 366810 359387 352660 346765 342392 339905
63735C39905j026j02R37K379L549L655K893K318K709L865N011N653N911O126O386
$$ 339905 338879 338777 339714 342093 345642 349297 352190 354508 357217 361082 366093 371746 377657 383783 390169
63720C90169O540O587O759P078P058O134M373K513J169K44p50j940k949l373l204
$$ 390169 396709 403296 410055 417133 424191 430325 434698 437211 438380 438624 437874 435934 432985 429612 426408
63705D26408k697k142j837k027k563k805k269j354j026j642k458k615k204j901
$$ 426408 423711 421569 419732 417705 415142 412337 410068 408714 407688 406046 403588 400973 398769 396868
63691C96868j829j423m37N99J140J288J336J075J49j173k091k156j626r73m14
$$ 396868 395039 393616 393179 393778 394918 396206 397542 398617 398766 397593 395502 393346 391720 390747 390333
63676C90333L1L80P33J237J885K531L142L821M535N052N307N528N819N851N235
$$ 390333 390364 390744 391477 392714 394599 397130 400272 404093 408628 413680 418987 424515 430334 436185 441420
63661D41420M125L108K464J760L70j736l874n311n847n773n447n053m583l845
$$ 441420 445545 448653 451117 452877 453247 451511 447637 442326 436479 430706 425259 420206 415623 411778
63647D11778k596r16O06J399J678K314L808N806P734R489J1149J2460J3147J3446
$$ 411778 409182 408266 408872 410271 411949 414263 418071 423877 431611 441100 452249 464709 477856 491302
63633D91302J3711J3622J2525J0526Q578P299O304M931L130J295l07j533k194
$$ 491302 505013 518635 531160 541686 550264 557563 563867 568798 571928 573223 572916 571383 569189
63620E69189k290k127j801q82R75L378N631P671J0008J2823J5589J7767J9453
$$ 569189 566899 564772 562971 562089 563064 566442 572073 579744 589752 602575 618164 635931 655384
63607F55384K1184K3286K5572K7541K8849K9570K9914K9658K8118K4804J9901
$$ 655384 676568 699854 725426 752967 781816 811386 841300 870958 899076 923880 943781
63596I43781J4020P834K246j608l275l764m699o550q301q964q877r201j0617j2924
$$ 943781 957801 965635 967881 966273 962998 959234 954535 947985 939684 930720 921843 912642 902025 889101
63582H89101j5586j8195k0517k2366k3508k3611k2479k0435j8248j6450j4898
$$ 889101 873515 855320 834803 812437 788929 765318 742839 722404 704156 687706 672808
63571F72808j3127j1006q808o819n092l479j749K01K061L266L595L488L538L850
$$ 672808 659681 648675 639867 633048 627956 624477 622728 622929 624990 628256 631851 635339 638877 642727
63557F42727M217M737N792P434R247J0984J2909J5321J8080K1063K4817L0225
$$ 642727 646944 651681 657473 664907 674154 685138 698047 713368 731448 752511 777328 807553
63545H07553L7563M6220N5390O4295P1448P4201P0043N8550M1908K3531O580o623
$$ 807553 845116 891336 946726 1011021 1082469 1156670 1226713 1285263 1327171 1350702 1357282 1350659
63533A350659j4845j8461j9277j9147j8718j7771j6365j5061j4294j4224j5271
$$ 1350659 1335814 1317353 1298076 1278929 1260211 1242440 1226075 1211014 1196720 1182496 1167225
63522A167225j7991k2262k7008l0989l3491l4284l3512l1854l0161k8583k6532
$$ 1167225 1149234 1126972 1099964 1068975 1035484 1001200 967688 935834 905673 877090 850558
63511H50558k3758k0928j8700j6848j4861j2964j1793j1344j1050j0785j1054
$$ 850558 826800 805872 787172 770324 755463 742499 730706 719362 708312 697527 686473
63500F86473j2059j3259j4046j4365j4397j4147j3575j2838j2036j0965r449p737
$$ 686473 674414 661155 647109 632744 618347 604200 590625 577787 565751 554786 545337 537600
63488E37600o278n074l590j492P13K074K285K163K718L972N071N573N973O797
$$ 537600 531322 526248 522658 521166 521879 523953 526238 528401 531119 535091 540162 545735 551708 558505
63474E58505P761Q327Q586Q946R217Q768P593O539O274O517O482N800M882M564
$$ 558505 566266 574593 583179 592125 601342 610110 617703 624242 630516 637033 643515 649315 654197 658761
63460F58761N333O681P369O724N444M554L746J665k014n669p427p182o344o029
$$ 658761 664094 670775 678144 684868 690312 694866 698612 700277 698263 692594 685167 677985 671641 665612
63446F65612o125n854m633k473kJ925L082M307O704J0437J4759J9274K4681L2072
$$ 665612 659487 653633 649000 646527 646525 648450 651532 655839 662543 672980 687739 707013 731694 763766
63432G63766M1702N2594O2948P0483P2674O7525N4860L6985J7719M80j2944k2208
$$ 763766 805468 858062 921010 991493 1064167 1131692 1186552 1223537 1241256 1241736 1228792 1206584
63420A206584k7638k9803k9295k6417k1191j3929n635K535R960J6287K0776K2561
$$ 1206584 1178946 1149143 1119848 1093431 1072240 1058311 1052676 1055211 1065171 1081458 1102234 1124795
63408A124795K1648J9014J5514J1203O007N47m022o849p847p618p150p298q398
$$ 1124795 1146443 1165457 1180971 1192174 1198181 1198728 1194706 1187857 1180010 1172392 1165242 1157944 1149546
63395A149546j0352j3060j6425k0082k3596k7020l0612l3878l5580l5071l3144
$$ 1149546 1139194 1126134 1109709 1089627 1066031 1039011 1008399 974521 938941 903870 870726
63384H70726l1099k9442k7847k5951k3637k0900j7991j5405j3288j1114q400n541
$$ 870726 839627 810185 782338 756387 732750 711850 693859 678454 665166 654052 645652 640111
63372F40111l351k029j080l7J235K848M935P437J0249J3469J7109K0705K3731
$$ 640111 636760 634731 633651 633614 634849 637697 642632 650069 660318 673787 690896 711601 735332
63359G35332K6336K9170L2518L6031L9286M2226M4935M7353M9183M9858M8653
$$ 735332 761668 790838 823356 859387 898673 940899 985834 1033187 1082370 1132228 1180881
63348A180881M5215L9880L3302K5991J8456J1488N739J276j996l769l823k866
$$ 1180881 1226096 1265976 1299278 1325269 1343725 1355213 1360952 1362228 1360232 1356463 1352640 1349774
63336A349774k167k459l826o482j0812j6564k2801k8767l4156l8451m0868m1286
$$ 1349774 1347607 1345148 1341322 1334840 1324028 1307464 1284663 1255896 1221740 1183289 1142421 1101135
63324A101135m0458l8848l5894l0896k4102j6316p943Q71R147J4552J4318P056
$$ 1101135 1060677 1021829 985935 955039 930937 914621 906678 907549 916696 931248 945566 952622
63312I52622n752k0062l1680l8805m2161m2939m1455l7966l3649k9875k6865k3847
$$ 952622 946870 926808 895128 856323 814162 771223 729768 691802 658153 628278 601413 577566
63300E77566k0402j7006j4280j2267j0584q975p548o515n870n384m987m876n029
$$ 577566 557164 540158 525878 513611 503027 494052 486504 479989 474119 468735 463748 458872 453843
63287D53843m912m153l273l109l554l669l100k545k554k651k145j148k60K83N95
$$ 453843 448931 444778 441505 438396 434842 431173 428073 425528 422974 420323 418178 417030 416770 417053 417648
63272D17648P60R18J275J673J598R88M16J58k61r75j130o7J438K154K095K280
$$ 417648 418408 419326 420601 422274 423872 424860 425276 425434 425173 424198 423068 423001 424439 426593 428688 430968
63256D30968L085L871M120M063M170M697N673O680O906O082N052M640M374L398
$$ 430968 434053 437924 442044 446107 450277 454974 460647 467327 474233 480315 485367 490007 494381 497779
63242D97779K221K226L490M506M422M173M823N958O489O178N523M903M578M968
$$ 497779 500000 502226 505716 510222 514644 518817 523640 529598 536087 542265 547788 552691 557269 562237
63228E62237O122P308P833P935Q229Q722R008R174R716J0719J1705J2352J2784
$$ 562237 568359 575667 583500 591435 599664 608386 617394 626568 636284 647003 658708 671060 683844
63215F83844J3199J3572J3761J3611J2964J1827J0406Q751O516L396k84l666o028
$$ 683844 697043 710615 724376 737987 750951 762778 773184 781935 788451 791847 791563 787897 781869
63202G81869p316q133r312j1195j3139j4001j3288j1628r947q502p024n386l674
$$ 781869 774553 766420 757108 745913 732774 718773 705485 693857 683910 675408 668384 662998 659324
63189F59324j774O57L731P107J0222J2690J4598J6496J8902K1728K4392K6464
$$ 659324 657550 658207 661938 669045 679267 691957 706555 723051 741953 763681 788073 814537
63177H14537K7866K8444K7910K6424K4623K2745K0317J7134J3949J1577R806P913
$$ 814537 842403 870847 898757 925181 949804 972549 992866 1010000 1023949 1035526 1045332 1053245
63165A053245N811L929K260L46k004m782q375j3141j8468k3174k6957l0487l3917
$$ 1053245 1059056 1062985 1065245 1065591 1063587 1058805 1050430 1037289 1018821 995647 968690 938203 904286
63152I04286l6314l6992l6475l5556l4140l1809k8901k6221k3946k1621j9050
$$ 904286 867972 830980 794505 758949 724809 693000 664099 637878 613932 592311 573261
63141E73261j6608j4639j3092j1697j0183q407o597n370n050n152m919m278l775
$$ 573261 556653 542014 528922 517225 507042 498635 492038 486668 481618 476466 471547 467269 463494
63128D63494l626l414k804k049j566j367j292j452k060k854l086k251p25N21Q51
$$ 463494 459868 456454 453650 451601 450035 448668 447376 445924 443864 441010 437924 435673 434948 435469 436320
63113D36320N20K07J72J53QN3N53J267J798K118K409K663K894L545M997O778P951
$$ 436320 436840 437047 437219 437372 437380 437433 437986 439253 441051 443169 445578 448241 451135 454680 459677 466455 474406
63096D74406Q471R499J1996J5511J8841K1403K3337K4545K4357K2219J8183J2646
$$ 474406 482877 492376 504372 519883 538724 560127 583464 608009 632366 654585 672768 685414
63084F85414O032j044p748j3343j7419j9763k0347j9591j8307j7024j5515j3195
$$ 685414 691446 690402 682654 669311 651892 632129 611782 592191 573884 556860 541345 528150
63072E28150r970o492l637j856r48k94O54K034L599N019O064O639O897P340Q485
$$ 528150 518180 511688 508051 506195 505247 504953 505607 507641 511240 516259 522323 528962 535859 543199 551684
63057E51684J0262J2046J3425J4616J5942J7293J8457J9707K1375K3058K3907
$$ 551684 561946 573992 587417 602033 617975 635268 653725 673432 694807 717865 741772
63046G41772K3863K3938K4990K6662K7919K8301K8190K8104K8172K8243K8201
$$ 741772 765635 789573 814563 841225 869144 897445 925635 953739 981911 1010154 1038355
63035A038355K8159K8501K9498L0734L1192L0296K8617K7012K5313K2425J7770
$$ 1038355 1066514 1095015 1124513 1155247 1186439 1216735 1245352 1272364 1297677 1320102 1337872
63024A337872J1963N885k30o413j2282j7389k1853k5999k9466l1451l1829l1305
$$ 1337872 1349835 1355720 1355490 1349077 1336795 1319406 1297553 1271554 1242088 1210637 1178808 1147503
63012A147503l0233k7956k3819j8377j2842p584j841M939J2161J8792K4519K9748
$$ 1147503 1117270 1089314 1065495 1047118 1034276 1026692 1024851 1029790 1041951 1060743 1085262 1115010
63000A115010L4641L8624M0865M0984L9318L6753L4216L2155L0440K8892K7702
$$ 1115010 1149651 1188275 1229140 1270124 1309442 1346195 1380411 1412566 1443006 1471898 1499600
62989A499600K7081K6726K6157K5541K5438K5611K4710K1717J7159J2256P243
$$ 1499600 1526681 1553407 1579564 1605105 1630543 1656154 1680864 1702581 1719740 1731996 1739239
62978A739239J261o246j4785k3502l1844l9428m5937n1515n6556o0743o2907o2419
$$ 1739239 1740500 1734254 1719469 1695967 1664123 1624695 1578758 1527243 1470687 1409944 1347037 1284618
62966A284618o0247n7951n5977n3590n0263m6371m2521l8925l5543l2334k9153
$$ 1284618 1224371 1166420 1110443 1056853 1006590 960219 917698 878773 843230 810896 781743
62955G81743k5905k2853k0396j8505j6845j5464j4685j4224j3270j1750j0751
$$ 781743 755838 732985 712589 694084 677239 661775 647090 632866 619596 607846 597095
62944E97095j1001j1659j1372j0094q888q238p540o377n308m993n203n161m520
$$ 597095 586094 574435 563063 552969 544081 535843 528303 521926 516618 511625 506422 501261 496741
62931D96741l574k782k361k239k164j940j690j675j867j913j544q66j70L18N66
$$ 496741 493167 490385 488024 485785 483621 481681 479991 478316 476449 474536 472992 472126 471956 472274 472840
62916D72840R02J949L937O104P355P614P927Q988J0129J0267R254P762O149M146
$$ 472840 473742 475691 479628 485732 493087 500701 508628 517616 527745 538012 547266 555028 561177 565323
62902E65323J552j248l544m739m696l894l093k564j901r65m99j240k676l534l421
$$ 565323 566875 565627 562083 557344 552648 548754 545661 543097 541196 540231 539732 538492 535816 532282 528861
62887E28861l182l487l881l639k862k161j720j206m28M82J428K421L269L552L061
$$ 528861 525679 522192 518311 514672 511810 509649 507929 506723 506295 506777 508205 510626 513895 517447 520508
62872E20508K024P95n23k028l644m978n673n763n550n199m718m323m327m507m061
$$ 520508 522532 523327 522804 520776 517132 512154 506481 500718 495168 489969 485251 480928 476601 472094 468033
62857D68033k684j210n95n63j31P53J106O52N18J598L070L503K798K116K094K225
$$ 468033 465349 464139 463544 462981 462850 463603 464709 465361 465879 467477 470547 474050 476848 478964 481058 483283
62841D83283K021J809J986K208J918J286R92J230J395R63L36M79J766L415M347
$$ 483283 485304 487113 489099 491307 493225 494511 495503 496733 498128 499091 499427 499906 501672 505087 509434
62826E09434M423M549N466O847P803Q040Q008Q084P972P159N564L537J424o25
$$ 509434 513857 518406 523872 530719 538522 546562 554570 562654 570626 577785 583349 586886 588310 587685
62812E87685k436l684m187m160l999l811l391k705k113j861j570p15N86J728K576
$$ 587685 585249 581565 577378 573218 569219 565408 562017 559312 557199 555338 553768 553053 553639 555367 557943
62797E57943L583M835N662N682N602O260P336P868P827Q288R845J1840J3454J4883
$$ 557943 561526 566361 572023 577705 583307 589567 596903 604771 612598 620886 630731 642571 656025 670908
62783F70908J6808J9272K1759K4156K6871L0087L3471L6740L9985M3174M5755
$$ 670908 687716 706988 728747 752903 779774 809861 843332 880072 920057 963231 1008986
62772A008986M7111M7234M6632M5666M4264M2185L9254L5272L0117K4024J7555
$$ 1008986 1056097 1103331 1149963 1195629 1239893 1282078 1321332 1356604 1386721 1410745 1428300
62761A428300J1053M343k801j0155j7262k3956l0309l6166m1128m4943m7539m8691
$$ 1428300 1439353 1443696 1440895 1430740 1413478 1389522 1359213 1323047 1281919 1236976 1189437 1140746
62749A140746m8238m6668m4891m3226m1153l8324l5213l2296k9257k5732k2382
$$ 1140746 1092508 1045840 1000949 957723 916570 878246 843033 810737 781480 755748 733366
62738G33366k0206j8971j7348j4722j1965j0044q727p238n552m255l422k475j159
$$ 733366 713160 694189 676841 662119 650154 640110 631383 624145 618593 614338 610916 608441 607282
62725F07282NM46L38L58R02J802K666L280L659L979M494N358O441P403Q164R184
$$ 607282 607287 607733 608071 608429 609331 611133 613799 617079 620738 624717 629211 634569 641010 648413 656577 665761
62709F65761J1052J3762J6613J8985K0942K2969K5380K8252L1612L5361L9082
$$ 665761 676813 690575 707188 726173 747115 770084 795464 823716 855328 890689 929771
62698I29771M2363M5275M8170N1057N3660N6094N9009O2731O6583O9322P0044
$$ 929771 972134 1017409 1065579 1116636 1170296 1226390 1285399 1348130 1414713 1484035 1554079
62687A554079O8485O4720N8988N1761M3580L4617K4480J2679o39j4424k7343l8694
$$ 1554079 1622564 1687284 1746272 1798033 1841613 1876230 1900710 1913389 1912750 1898326 1870983 1832289
62675A832289m8556n7045o3711o8055p0292p1110p0760o8954o5767o2054n8567
$$ 1832289 1783733 1726688 1662977 1594922 1524630 1453520 1382760 1313806 1248039 1185985 1127418
62664A127418n5167n1316m7077m3106l9730l6582l3160k9460k5874k2710j9986
$$ 1127418 1072251 1020935 973858 930752 891022 854440 821280 791820 765946 743236 723250
62653G23250j7569j5378j3493j2104j1311j0925j0542r900r191q813q729q244
$$ 723250 705681 690303 676810 664706 653395 642470 631928 622028 612837 604024 595295 587051
62641E87051o796m871l669l658l987l672k837k143j489k72J225J793R64k75r18
$$ 587051 580255 575384 571715 568057 564070 560398 557561 555418 553929 553657 554882 556675 557639 557364 556446
62626E56446j206j754k240j971j282j234j969k412j772n46L03M84L51K14J48J61
$$ 556446 555240 553486 551246 549275 547993 546759 544790 542378 540606 540060 540363 540847 541198 541412 541560 541721
62610E41721K08J94K03N05J138J720J908J935K368L362M422M986N139N596O916
$$ 541721 541929 542123 542326 542831 543969 545689 547597 549532 551900 555262 559684 564670 569809 575405 582321
62595E82321Q826J0570J1865J3256J5317J7760J9721K0798K1365K1927K2453K2565
$$ 582321 591147 601717 613582 626838 642155 659915 679636 700434 721799 743726 766179 788744
62583G88744K1936K0379J7803J4360J0535O783L111q89n455j0185j4218j6988
$$ 788744 810680 831059 848862 863222 873757 880540 883651 882762 877307 867122 852904 835916
62571H35916j8754k0205k1526k2213k1932k1143k0506j9941j8860j7214j5696
$$ 835916 817162 796957 775431 753218 731286 710143 689637 669696 650836 633622 617926
62560F17926j4840j4365j3573j2022r763p336n535m710m279l430k349k002k593
$$ 617926 603086 588721 575148 563126 553363 546027 540492 535782 531503 528073 525724 523722 521129
62547E21129l094k703j916j402p75N90K022K193J128L68R37K224L191L682L931
$$ 521129 518035 515332 513416 512014 511239 511829 513851 516044 517172 517540 518477 520701 523892 527574 531505
62532E31505L702K744J673J452K200L057L285K968K753L263M779P091R669J2160
$$ 531505 535207 537951 539624 541076 543276 546333 549618 552586 555339 558602 563381 570472 580141 592301
62518E92301J4613J7092J9253K0732K1829K3405K5999K9336L2731L5687L8059
$$ 592301 606914 624006 643259 663991 685820 709225 735224 764560 797291 832978 871037
62507H71037L9860M1051M1405M0665L8892L6493L3609K9665K4003J6866R339K256
$$ 871037 910897 951948 993353 1034018 1072910 1109403 1143012 1172677 1196680 1213546 1222885 1225141
62495A225141m325j0420j5544j9227k1686k3435k4438k4207k2667k0428j8110
$$ 1225141 1220816 1210396 1194852 1175625 1153939 1130504 1106066 1081859 1059192 1038764 1020654
62484A020654j5824j3427j0920q313n330j635K561O296Q374Q233O355L831J483
$$ 1020654 1004830 991403 980483 972170 966840 965205 967766 974062 982436 990669 997024 1000855 1002338
62471A002338o42k977n850r240j2973j6855k0598k3826k6325k8183k9610l0629
$$ 1002338 1001696 998719 992869 983629 970656 953801 933203 909377 883052 854869 825259 794630
62459G94630l1011l0533k9261k7521k5576k3417k0964j8351j5823j3346j0700
$$ 794630 763619 733086 703825 676304 650728 627311 606347 587996 572173 558827 548127
62448E48127p989n820m637m112l531k602j587p65j61K59M88O76J079J623J884
$$ 548127 540138 534318 529681 525569 522038 519436 517849 517084 516923 517182 517670 518346 519425 521048 522932
62433E22932J552P88l1o52r86j091j197j542j997k128j700r51k16L42N82L33k57
$$ 522932 524484 525272 525241 524589 523603 522512 521315 519773 517776 515648 513948 512997 512781 513123 513705 514038 513781
62416E13781p32r70j385k109k438j690l42M68M69M86J081J713J684J174Q32P82
$$ 513781 513049 512079 510694 508585 506147 504457 504115 504583 505052 505538 506619 508332 510016 511190 512022 512804
62400E12804P36Q16J508K695L428L011J969J517K183L399M361M886N216N341N007
$$ 512804 513540 514356 515864 518559 521987 524998 526967 528484 530667 534066 538427 543313 548529 553870 558877
62385E58877M313L773L658L627L298K888K864L225L586L888M534N671O832P510
$$ 558877 563190 566963 570621 574248 577546 580434 583298 586523 590109 593997 598531 604202 611034 618544
62371F18544P805Q195Q899R683J0229J0458J0657J1331J2790J4785J6817J8854
$$ 618544 626349 634544 643443 653126 663355 673813 684470 695801 708591 723376 740193 759047
62359G59047K1445K4895K8768L2483L6133M0159M4477M8477N1760N4318N5931
$$ 759047 780492 805387 834155 866638 902771 942930 987407 1035884 1087644 1141962 1197893
62348A197893N5980N4045N0228M4787L7916L0180K2584J5746R325K664m225j0815
$$ 1197893 1253873 1307918 1358146 1402933 1440849 1471029 1493613 1509359 1518684 1521348 1517123 1506308
62336A506308j6886k2669k8243l3357l7833m1629m4429m5694m5349m4018m2310
$$ 1506308 1489422 1466753 1438510 1405153 1367320 1325691 1281262 1235568 1190219 1146201 1103891
62325A103891m0267l7735l5008l2610l0665k8876k7052k5326k3843k2532k1275
$$ 1103891 1063624 1025889 990881 958271 927606 898730 871678 846352 822509 799977 778702
62314G78702k0074j8912j7651j6199j4666j3277j2062j0749r085p185n522m409
$$ 778702 758628 739716 722065 705866 691200 677923 665861 655112 646027 638842 633320 628911
62302F28911l608k643j441m90k28n07p50n49RN26O94N84N88R74J568K037K491
$$ 628911 625303 622660 621219 620729 620501 619994 619244 618695 618704 619230 619924 620508 621096 622070 623638 625675 628166
62285F28166L405M836O097O494O064N297M387L253K025J065M52j00p95j510k004
$$ 628166 631571 636407 642504 648998 655062 660359 664746 667999 670024 671089 671541 671441 670646 669136 667132
62270F67132k091j657q18O5Q36J900L724O036Q098R781J1853J4970J8930K3078
$$ 667132 665041 663384 662566 662631 663467 665367 669091 675127 683225 693006 704859 719829 738759 761837
62256G61837K7093L1062L5200L9759M4883N0204N4849N8065N9586N9229N6521
$$ 761837 788930 819992 855192 894951 939834 990038 1044887 1102952 1162538 1221767 1278288
62245A278288N1193M3730L5175K6389J7724R184P13p522j5023k1436k7156l2992
$$ 1278288 1329481 1373211 1408386 1434775 1452499 1461683 1462396 1454874 1439851 1418415 1391259 1358267
62233A358267l9038m4307m7810m9470m9642m8348m5622m2102l8581l5189l1707
$$ 1358267 1319229 1274922 1227112 1177642 1128000 1079652 1034030 991928 953347 918158 886451
62222H86451k8341k5404k2519j9068j5442j2856j1711j1041r952q791q323q394
$$ 886451 858110 832706 810187 791119 775677 762821 751110 740069 730117 721326 713003 704609
62210G04609q202p520o938o865o925o535n786n373n683o213o140n344m463l864
$$ 704609 696407 688887 681949 675084 668159 661624 655838 650465 644782 638569 632429 627085 622622 618758
62196F18758l058j563J94J430K167L052M198N067N572O384P821R233R956J0255
$$ 618758 615700 614137 614331 615761 617928 620980 625178 630245 635817 642201 650022 659255 669211 679466
62182F79466J0751J1436J1809J1620J0977R938Q512O812M856K532J18j481j531
$$ 679466 690217 701653 713462 725082 736059 745997 754509 761321 766177 768709 768827 767346 765815
62169G65815k93J494L638O522J0266J4486J8863K3412K8158L2914L7407M1152
$$ 765815 765522 767016 770654 777176 787442 801928 820791 844203 872361 905275 942682 983834
62157I83834M3256M2844L9857L5166K9771K4200J8594J3003P380J668l990r346
$$ 983834 1027090 1069934 1109791 1144957 1174728 1198928 1217522 1230525 1237905 1239573 1235583 1226237
62145A226237j4408j9446k4462k8966l2340l4308l4907l4271l2575l0058k6889
$$ 1226237 1211829 1192383 1167921 1138955 1106615 1072307 1037400 1003129 970554 940496 913607
62134I13607k3129j8904j4442r946n537j393K307N663R080J2839J6752K0437K3741
$$ 913607 890478 871574 857132 847186 841649 840256 842563 848226 857306 870145 886897 907334 931075
62121I31075K6705K9202L0937L1871L2406L2926L3248L2774L1077K8146K4000
$$ 931075 957780 986982 1017919 1049790 1082196 1115122 1148370 1181144 1212221 1240367 1264367
62110A264367J8556J2127N774N68l343o464q752r368p917n342l085j625k97J723
$$ 1264367 1282923 1295050 1300824 1301392 1298049 1291585 1282833 1273465 1265548 1260206 1257121 1255496 1255199 1256922
62096A256922M761Q685J3026J7038K0184K2634K4946K7280K9303L0780L1807L2475
$$ 1256922 1261683 1270368 1283394 1300432 1320616 1343250 1368196 1395476 1424779 1455559 1487366 1519841
62084A519841L2815L3177L4146L5961L8442M1565M5561N0227N4708N8361O1323
$$ 1519841 1552656 1585833 1619979 1655940 1694382 1735947 1781508 1831735 1886443 1944804 2006127
62073B006127O3776O5051O4144O0864N5866M9571M1695L2031K1284J0831J900
$$ 2006127 2069903 2134954 2199098 2259962 2315828 2365399 2407094 2439125 2460409 2471240 2473140
62062B473140m912r522j2094j2839j1866r138m755P70O635J2333J7986K3902K9752
$$ 2473140 2468228 2458706 2446612 2433773 2421907 2412769 2408014 2408784 2415419 2427752 2445738 2469640 2499392
62049B499392L4482L7121L7399L5347L0679K3102J3051J561j0608k3178l5719
$$ 2499392 2533874 2570995 2608394 2643741 2674420 2697522 2710573 2712134 2701526 2678348 2642629
62038B642629m7513n8333o8701p8803q7677r4028r7615r9187r9289r7794r4669
$$ 2642629 2595116 2536783 2468082 2389279 2301602 2207574 2109959 2010772 1911483 1813689 1719020
62027A719020r0489q5932q1159p5918p0095o3970n8109n3038m8939m5586m2618
$$ 1719020 1628531 1542599 1461440 1385522 1315427 1251457 1193348 1140310 1091371 1045785 1003167
62016A003167l9832l7096l4225l1152k8086k5179k2270j9264j6588j4732j3369
$$ 1003167 963335 926239 892014 860862 832776 807597 785327 766063 749475 734743 721374
62005G21374j1517q672n376k432n2K043M033N844P267P915P316N412K837M21j495
$$ 721374 709857 701185 695809 693377 693325 695368 699401 705245 712512 720427 727743 733155 735992 736413 734918
61990G34918l149m877o761q570r948j0753j1338j2208j3344j4115j4083j3535
$$ 734918 731769 726892 720131 711561 701613 690860 679522 667314 653970 639855 625772 612237
61978F12237j2934j2188j0899r164p620o716o272n766m812l400j939r88p57q70
$$ 612237 599303 587115 576216 567052 559432 552716 546444 540678 535866 532466 530527 529539 528782 527912
61964E27912q21m72M9O70J237J350Q55L43O27J752L009L934M677N368N793N940
$$ 527912 527091 526619 526668 527338 528575 529925 530780 531123 531750 533502 536511 540445 545122 550490 556283 562223
61948E62223O311P345Q908J0643J2434J4278J6106J8020K0326K3037K5714K8096
$$ 562223 568534 575879 584787 595430 607864 622142 638248 656268 676594 699631 725345 753441
61936G53441L0385L2534L3765L3420L1947L0376K9080K7668K5916K4017K1970
$$ 753441 783826 816360 850125 883545 915492 945868 974948 1002616 1028532 1052549 1074519
61925A074519J9509J6676J3792J0662O555J320m066q442j1526j3642j4881j5031
$$ 1074519 1094028 1110704 1124496 1135158 1141713 1143033 1138967 1130525 1118999 1105357 1090476 1075445
61913A075445j4082j2273r746o520k743J405N960J1015J6225K0769K3862K5217
$$ 1075445 1061363 1049090 1039344 1032824 1030081 1031486 1037446 1048461 1064686 1085455 1109317 1134534
61901A134534K4990K3406K0522J6336J1114N497k7n561j1430j7275k2041k5118
$$ 1134534 1159524 1182930 1203452 1219788 1230902 1236399 1236372 1230811 1219381 1202106 1180065 1154947
61889A154947k7019k8579k9839l0267k9773k8801k7583k6050k4483k3472k2951
$$ 1154947 1127928 1099349 1069510 1039243 1009470 980669 953086 927036 902553 879081 856130
61878H56130k2094k0552j9094j8337j7544j5603j2850j0775r900r078p271m983
$$ 856130 834036 813484 794390 776053 758509 742906 730056 719281 709381 700303 693032 688049
61866F88049l220j867j24J963L512M267N035O457Q322J0390J3077J6697K0655
$$ 688049 684829 682962 682838 684801 688313 692580 697615 704072 712394 722784 735861 752558 773213
61853G73213K4152K7290L0835L5065L9498M3608M7197N0101N2084N3090N3199
$$ 773213 797365 824655 855490 890555 930053 973661 1020858 1070959 1123043 1176133 1229332
61842A229332N2280N0071M6576M1924L5926K8282J9322R995J062p185j4292j9349
$$ 1229332 1281612 1331683 1378259 1420183 1456109 1484391 1503713 1513708 1514770 1507585 1493293 1473944
61830A473944k1712k1596j9497j5515r664k595M616J1320J7532K3257K7945L0682
$$ 1473944 1452232 1430636 1411139 1395624 1385960 1383365 1387981 1399301 1416833 1440090 1468035 1498717
61818A498717L0803K8228K3330J6527Q139j362j1242k0949l0352l9119m6049m9913
$$ 1498717 1529520 1557748 1581078 1597605 1605744 1604382 1593140 1572191 1541839 1502720 1456671 1406758
61806A406758n1007n0987n0830m9864m7317m3946m1118l8921l6387l3259l0319
$$ 1406758 1355751 1304764 1253934 1204070 1156753 1112807 1071689 1032768 996381 963122 932803
61795I32803k7953k5560k2765k0230j8636j7585j6127j3995j1776j0076q979q205
$$ 932803 904850 879290 856525 836295 817659 800074 783947 769952 758176 748100 739121 730916
61783G30916p473o743o247o267o796p602q507r348r770r498q841q415q321q060
$$ 730916 723443 716700 710453 704186 697390 689788 681281 671933 662163 652665 643824 635409 627088 619028
61769F19028p374o614o018n311m354l632l546l709l483k903k463k266j979j437
$$ 619028 611654 605040 599022 593711 589357 585725 582179 578470 574987 572084 569621 567355 565376 563939
61755E63939p34J03R98J564J574J500J914K423K074Q54n3J56Q68J059O84M60P34
$$ 563939 563205 563308 564306 565870 567444 568944 570858 573281 575355 576209 576156 576312 577180 578239 578923 579383 580117
61738E80117J308K081L198M562N812O833P836Q839R574J0072J0887J2414J4229
$$ 580117 581425 583506 586704 591266 597078 603911 611747 620586 630160 640232 651119 663533 677762
61725F77762J5472J5837J5767J5731J5609J5016J3982J2992J2341J1807J1049
$$ 677762 693234 709071 724838 740569 756178 771194 785176 798168 810509 822316 833365
61714H33365J0071R014P726N877L435O51k331n502q579j1079j2895j4351j5441
$$ 833365 843436 852450 860176 866053 869488 870139 867808 862306 853727 842648 829753 815402 799961
61701G99961j5528j4230j2199j0467r289q176o831n446m138k815j676j191j367
$$ 799961 784433 770203 758004 747537 738248 730072 723241 717795 713657 710842 709166 707975 706608
61688G06608j531j163n05k3L12Q30J541K084K162J806J319J139J496K013K002
$$ 706608 705077 703914 703409 703386 703698 704528 706069 708153 710315 712121 713440 714579 716075 718088 720090
61673G20090J307N90M40N88L03o66j951l103l879m212m293m577n237n835n854
$$ 720090 721397 721987 722427 723015 723318 722652 720701 717598 713719 709507 705214 700637 695400 689565 683711
61658F83711n411m982m630m074l385k966k888k706k119j243k87O28J218J143N20
$$ 683711 678300 673318 668688 664614 661229 658263 655375 652669 650550 649307 649020 649648 650866 652009 652529
61643F52529j21m22l71L8P87J384J131kj295k268l127m026m661m939n375o239
$$ 652529 652408 651986 651615 651653 652440 653824 654955 654953 653658 651390 648263 644237 639576 634637 629262 623023
61627F23023o969o941o408n992n669m954l800k634j662p19K64J182K072L054L933
$$ 623023 616054 609113 602705 596713 591044 586090 582290 579656 577994 577275 577539 578721 580793 583847 587780
61612E87780M240L575J799r00l763n692o198n944n887o217o514o556o297n433
$$ 587780 592020 595595 597394 596494 592731 587039 580841 574897 569010 562793 556279 549723 543426 537993
61598E37993l802k065j128r06m92N20J621K462L368M528N477N882O218P059Q131
$$ 537993 534191 532126 530998 530092 529600 530120 531741 534203 537571 542099 547576 553458 559676 566735 574866
61583E74866Q611Q056O576M396J831m41j652j695j310j371k125l167m054m790
$$ 574866 583477 591533 598109 602505 604336 603895 602243 600548 599238 597867 595742 592575 588521 583731
61569E83731n630o629p583q371r037r434r245q501p686p042o257n254m721n116
$$ 583731 578101 571472 563889 555518 546481 537047 527802 519301 511615 504573 498316 493062 488341 483225
61555D83225n638n111l739k905l224l809l763l388l406l765l897l575k992k284
$$ 483225 477587 472476 468737 465832 462608 458799 455036 451648 448242 444477 440580 437005 434013 431729
61541D31729j523r33o61n77n25m95l69J46J048J897K349K462K257J525L32q07
$$ 431729 430206 429273 428612 428035 427510 427015 426646 426792 427840 429737 432086 434548 436805 438330 438662 437855
61525D37855j692k705l922m548m009l072k987l795m287l641k312j258j000j510
$$ 437855 436163 433458 429536 424988 420979 417907 414920 411125 406838 403197 400885 399627 398627 397117
61511C97117k397k965k630j628q94r68j340j222p17p15j635k721k832j792n54
$$ 397117 394720 391755 389125 387497 386603 385635 384295 383073 382356 381641 380006 377285 374453 372661 372107
61496C72107p2l52p64r39r40q55p29p50r98j081o13O3K76J63N13J303J418K88
$$ 372107 372035 371683 370919 369980 369040 368185 367456 366706 365708 364627 364014 364077 364353 364516 365029 366332 367750 368038
61478C68038j035j178j44J048J799K177K154J661J167J255J675J615R58M29N24
$$ 368038 367003 365825 365681 366729 368528 370705 372859 374520 375687 376942 378617 380232 381190 381619 382143
61463C82143R48J259J352J158N62j28k44L80J121J391J301J168Q33Rr58j201k94
$$ 382143 383091 384350 385702 386860 387422 387294 387050 387430 388551 389942 391243 392411 393244 393253 392295 391094 390800
61446C90800J145J992J669O32j69j53O25J818L038L797L760L269L156L737M383
$$ 390800 391945 393937 395606 396238 396069 395916 396541 398359 401397 405194 408954 412223 415379 419116 423499
61431D23499M417L897L121J977N04m14L9J261J759J104M20P67J913L033L833M478
$$ 423499 427916 431813 434934 436911 437415 437001 437040 438301 440060 441164 441584 442351 444264 447297 451130 455608
61415D55608M980N265N497N870O190N943M729K560n0k304l693m427n080n904o799
$$ 455608 460588 465853 471350 477220 483410 489353 494082 496642 496592 494288 490595 486168 481088 475184 468385
61400D68385p708q499q591p430n437l769l026k746k376j995j838j822j879k160
$$ 468385 460677 452178 443587 436157 430720 426951 423925 421179 418803 416808 414970 413148 411269 409109
61386D09109k435j992o92M56M70l03p98p40p13r20p52K10J465K136J895J147N19
$$ 409109 406674 404682 403990 404446 404916 404613 403815 403075 402362 401442 400690 400900 402365 404501 406396 407543 408062
61369D08062L84P30J300J849K195K159J697J189J222J816K296K220K155K905M240
$$ 408062 408446 409176 410476 412325 414520 416679 418376 419565 420787 422603 424899 427119 429274 432179 436419
61354D36419N079M951M623M915N572N804N627N895P052Q467R368R953J1092J3082
$$ 436419 441498 446449 451072 455987 461559 467363 472990 478885 485937 494404 503772 513725 524817 537899
61340E37899J5249J6758J7333J7088J6120J4574J2707J0572P917M771J802l49
$$ 537899 553148 569906 587239 604327 620447 635021 647728 658300 666217 670988 672790 672441
61328F72441j849l324m945o367p371q010q238p994p582p301o899n949m787m194
$$ 672441 670592 667268 662323 655956 648585 640575 632337 624343 616761 609460 602561 596612 591825 587631
61314E87631m165l920l296l048l423l450k388r62l33m49l64K87J151K133L523
$$ 587631 583466 579546 576250 573202 569779 566329 563941 562979 562646 562197 561833 562120 563271 565404 568927
61299E68927N221O667P616Q258Q525Q006O671N091L738K502J035q00k842m667
$$ 568927 574148 580815 588431 596689 605214 613220 619891 624982 628720 631222 632257 631457 628615 623948
61285F23948n718n813n448n224n114m789m437m478m519l461r95J753L479M021
$$ 623948 618230 612417 606969 601745 596631 591842 587405 582927 578408 574947 573952 575705 579184 583205
61271E83205M002L791L460L352L890M865N568N649N368N072M931N239O377Q128
$$ 583205 587207 590998 594458 597810 601700 606565 612133 617782 623150 628222 633153 638392 644769 652897
61257F52897R532R952R994J0935J3256J6188J8706K0457K1508K1645K0380J7575
$$ 652897 662429 672381 682375 693310 706566 722754 741460 761917 783425 805070 825450 843025
61245H43025J3620R011M082q01n120q528j1170j3490j5686j7416j8048j7269j5490
$$ 843025 856645 865656 869738 868937 863817 855289 844119 830629 814943 797527 779479 762210 746720
61232G46720j3592j2192j1276j0497r588q368o675m665k912j772q35N07K195L717
$$ 746720 733128 720936 709660 699163 689575 681207 674532 669867 666955 665183 664348 664855 667050 670767
61218F70767N059O594Q099Q738Q337P794P717P450O134M121K467J512P68O8j32
$$ 670767 675826 682420 690519 699257 707594 715388 723105 730555 736689 740810 743277 744789 745557 745625 745493
61203G45493L66J123J776K603M076O218Q626J0936J3120J5471J8288K1475K4530
$$ 745493 745859 746982 748758 751361 755437 761655 770281 781217 794337 809808 828096 849571 874101
61190H74101K7052K9128L1056L2894L4609L6310L7954L8981L8721L7116L4628
$$ 874101 901153 930281 961337 994231 1028840 1065150 1103104 1142085 1180806 1217922 1252550
61179A252550L1572K8058K4480K1476J9235J7210J4737J1657Q221M687J118k588
$$ 1252550 1284122 1312180 1336660 1358136 1377371 1394581 1409318 1420975 1429196 1433883 1435001 1432413
61167A432413o545j0668j4651j8313k1823k5409k8976l2265l5170l7585l9160
$$ 1432413 1425868 1415200 1400549 1382236 1360413 1335004 1306028 1273763 1238593 1201008 1161848
61156A161848l9612l9120l8021l6334l4071l1725k9776k7789k4800k0753j6847
$$ 1161848 1122236 1083116 1045095 1008761 974690 942965 913189 885400 860600 839847 823000
61145H23000j4152j2457j0801q635o105l616j568k21M88R06J262J548J847K363
$$ 823000 808848 796391 785590 776955 770850 767234 765666 765445 765933 766839 768101 769649 771496 773859
61131G73859L025L538M087N376P636J0060J1927J3802J6894K1332K5906K9610
$$ 773859 776884 780422 784509 789885 797521 807581 819508 833310 850204 871536 897442 927052
61119I27052L2762L6205L9983M3388M6117M8746N1883N5296N8106N9746O0302
$$ 927052 959814 996019 1036002 1079390 1125507 1174253 1226136 1281432 1339538 1399284 1459586
61108A459586O0022N8849N6698N3811N0527M6806M2401L7434L2427K7591K2493
$$ 1459586 1519608 1578457 1635155 1688966 1739493 1786299 1828700 1866134 1898561 1926152 1948645
61097A948645J6587R869K810m185j1039j7893k4880l1950l8717m4602m9265n2863
$$ 1948645 1965232 1975101 1977911 1973726 1962687 1944794 1919914 1887964 1849247 1804645 1755380 1702517
61085A702517n5725n7871n9018n9059n8285n7068n5446n3195n0227m6767m3121
$$ 1702517 1646792 1588921 1529903 1470844 1412559 1355491 1300045 1246850 1196623 1149856 1106735
61074A106735l9537l6322l3783l1723k9269k5675k1334j7480j4859j3066j1284
$$ 1106735 1067198 1030876 997093 965370 936101 910426 889092 871612 856753 843687 832403
61063H32403r119o576l806j313J63N22O66J493K884M290N818P968J0562J2820
$$ 832403 823284 816708 812902 811589 811752 812274 812940 814433 817317 821607 827425 835393 845955 858775
61049H58775J4403J5632J6743J7803J9323K1994K5563K8771L0865L2454L4542
$$ 858775 873178 888810 905553 923356 942679 964673 990236 1019007 1049872 1082326 1116868
61038A116868L7270M0076M2473M4251M5316M5760M5819M5575M5015M4506M4578
$$ 1116868 1154138 1194214 1236687 1280938 1326254 1372014 1417833 1463408 1508423 1552929 1597507
61027A597507M5030M4936M3921M2763M2199M1720M0261L7708L5048L3310L2958
$$ 1597507 1642537 1687473 1731394 1774157 1816356 1858076 1898337 1936045 1971093 2004403 2037361
61016B037361L4199L7168M1751M7631N4622O2735P1963Q2302R4164J08904J28928
$$ 2037361 2071560 2108728 2150479 2198110 2252732 2315467 2387430 2469732 2563896 2672800 2801728
61005B801728J56788J93609K38559K90633L50992M23015N10563O18008P52592
$$ 2801728 2958516 3152125 3390684 3681317 4032309 4455324 4965887 5583895 6336487
60996F336487R25045J144951J411494J701574J959119K097268K028457J717981
$$ 6336487 7261532 8406483 9817977 11519551 13478670 15575938 17604395 19322376
60988A9322376J224191O83968K45062l257n1558N3398K35098L94354M20212K31664
$$ 19322376 20546567 21230535 21475597 21472340 21420782 21474180 21709278 22103632 22523844 22755508
60978B2755508j69250o85612j177872j540586j742228j808166j779523j688131
$$ 22755508 22586258 21900646 20722774 19182188 17439960 15631794 13852271 12164140
60970A2164140j555626j399583j234557j070760r15083p72629o46268n36263m41871
$$ 12164140 10608514 9208931 7974374 6903614 5988531 5215902 4569634 4033371 3591500
60961C591500l62942k99225k48986k09411j78081j53357j33664j17250j02834
$$ 3591500 3228558 2929333 2680347 2470936 2292855 2139498 2005834 1888584 1785750
60952A785750q9973p8623o8626n9666n1610m4662l9098l4848l1622k9512k9039
$$ 1785750 1695777 1617154 1548528 1488862 1437252 1392590 1353492 1318644 1287022 1257510 1228471
60941A228471l0193l1759l2192l1079k9215k7433k5980k4968k4543k4412k3881
$$ 1228471 1198278 1166519 1134327 1103248 1074033 1046600 1020620 995652 971109 946697 922816
60930I22816k2671k1184j9785j8374j6924j5757j4912j3845j2281j0824j0185
$$ 922816 900145 878961 859176 840802 823878 808121 793209 779364 767083 756259 746074
60919G46074j0147r830q765p250n892n103m891m785m224l209k327j898j591j129
$$ 746074 735927 726097 717332 710082 704190 699087 694196 689411 685187 681978 679651 677753 676162 675033
60905F75033q50j113j655k035k309k678k946k994l357m493n742n994n259m725
$$ 675033 674183 673070 671415 669380 667071 664393 661447 658453 655096 650603 644861 638867 633608 628883
60891F28883n125n971o555o824o967o891o575o380o523o705o590o242n784n077
$$ 628883 623758 617787 611232 604408 597441 590550 583975 577595 571072 564367 557777 551535 545751 540674
60877E40674m134l395l147l056k733k354k164j817r06J06K35o99j713j751o59
$$ 540674 536540 533145 529998 526942 524209 521855 519691 517874 516968 517074 517309 516610 514897 513146 512487
60862E12487R87K536L619M245M726N247N508N170M578M415M590M171K783J391
$$ 512487 513474 516010 519629 523874 528600 533847 539355 544525 549103 553518 558108 562279 565062 566453
60848E66453J096J684K068J861J637J721J601P80m69j657k803m103n245n736n773
$$ 566453 567549 569233 571301 573162 574799 576520 578121 578901 578432 576775 573972 569869 564624 558888 553115
60833E53115o127p049p829p707o841n966n358m631l548k528k167k470k816k546
$$ 553115 546988 539939 532110 524403 517562 511596 506238 501607 498059 495531 493364 490894 488078 485532
60819D85532j490j11O71J27j437k657k400r96K61P22Q99J268J463J193J126K033
$$ 485532 484042 483931 484602 484729 483292 480635 478235 477239 477500 478222 479121 480389 481852 483045 484171 486204
60803D86204L434M107L812L485L663L757L251K694K833L447L779L633L281K687
$$ 486204 489638 493745 497557 501042 504705 508462 511713 514407 517240 520687 524466 528099 531380 534067
60789E34067J638N40K10Q09J558J674J090K01o02j035j108j319k176l338l794
$$ 534067 535705 536245 536455 537264 538822 540496 541586 541787 541185 540150 539042 537723 535547 532209 528415
60774E28415l182k415k555l490m241m224l678k975k211j522j242j536k116k554
$$ 528415 525233 522818 520263 516773 512532 508308 504630 501655 499444 497922 496680 495144 493028 490474
60760D90474k646k374j824j263j033j183j343j202q75o42m69k9Q22J836K624K922
$$ 490474 487828 485454 483630 482367 481334 480151 478808 477606 476731 476089 475620 475591 476413 478249 480873 483795
60744D83795K683K100J593J502J755J945J808J478J183R14N35O5k68k03L65J234
$$ 483795 486478 488578 490171 491673 493428 495373 497181 498659 499842 500756 501291 501356 501088 500885 501250 502484
60728E02484J873J858J444J402K050K728K577J675R45J006J564J961J848J313
$$ 502484 504357 506215 507659 509061 511111 513839 516416 518091 519036 520042 521606 523567 525415 526728
60714E26728O57K65L30N73M91L9k85j57P6r3o48j149j324j285j222j179j121j099
$$ 526728 527385 527650 527980 528553 529044 529083 528798 528641 528717 528624 527976 526827 525503 524218 522996 521817 520696 519597
60696E19597j355k147l322m137l892k778j709j309j414j661j942k106j816j124
$$ 519597 518242 516095 512773 508636 504744 501966 500257 498948 497534 495873 493931 491825 490009 488885
60682D88885o37o33n76j4N86O38N16R40J692J976J902K371L452M014L387K308
$$ 488885 488248 487615 487039 487025 487611 488249 488765 489705 491397 493373 495275 497646 501098 505112 508499 510807
60666E10807J654J214N11QN42J977L343M122M461M303L246J559M20O72J733K236
$$ 510807 512461 513675 514186 514194 514736 516713 520056 524178 528639 532942 536188 537747 538167 538839 540572 542808
60650E42808J532K56m22J36J520K617K518J348J89n8L71M91j71j023j224o65Q8
$$ 542808 544340 544596 544174 544310 545830 548447 550965 552313 552502 552444 552815 553306 553135 552112 550888 550223 550311
60633E50311N46N77K15k94l33N74K008K973L178L267L562L369K249J217J516K651
$$ 550311 550857 551434 551649 551355 551022 551596 553604 556577 559755 563022 566584 569953 572202 573419 574935 577586
60617E77586K906J872J028J384J889J157j96l21J164K633K721J992J799K357K723
$$ 577586 580492 582364 583392 584776 586665 587822 587626 587305 588469 591102 593823 595815 597614 599971 602694
60602F02694K278J378O39K37J14L61R95J663J908J700J336R80O43N32R41J690
$$ 602694 604972 606350 606989 607226 607340 607701 608696 610359 612267 613967 615303 616283 616926 617458 618399 620089
60586F20089K120J913J512J374J260O88j74o90o39m18l72m22m54n92r29j299j462
$$ 620089 622209 624122 625634 627008 628268 628956 628782 628092 627453 627035 626663 626241 625787 625195 624266 622967 621505
60569F21505j291p88j25M58J005J932L439N049O133O616O684O151M823L332K642
$$ 621505 620214 619426 619301 619759 620764 622696 626135 631184 637317 643933 650617 656768 661591 664923 667565
60554F67565K721K636K033J557J576J543J168J166K137L449M141M250M414M662
$$ 667565 670286 672922 674955 676512 678088 679631 680799 681965 684102 687551 691692 695942 700356 705018
60540G05018M572M286M412M977N329N080M456L749L029K426K141K101K071K052
$$ 705018 709590 713876 718288 723265 728594 733674 738130 741879 744908 747334 749475 751576 753647 755699
60526G55699K191K442K718L286M440N897O988P439P529P548P574P712Q099Q698
$$ 755699 757890 760332 763050 766336 770776 776673 783661 791100 798629 806177 813751 821463 829562 838260
60512H38260R455J0516J1816J2733J2749J2221J1912J1830J1387J0567J0104J0365
$$ 838260 847715 858231 870047 882780 895529 907750 919662 931492 942879 953446 963550 973915
60500I73915J0870J1153J1351J1729J2323J3369J5250J7638J9348J9631J8999
$$ 973915 984785 995938 1007289 1019018 1031341 1044710 1059960 1077598 1096946 1116577 1135576
60489A135576J8240J7144J4954J1596P748L870j70m507q908j2998j6434j8887
$$ 1135576 1153816 1170960 1185914 1197510 1205258 1209128 1208958 1204451 1195543 1182545 1166111 1147224
60477A147224k0217k0661k0563j9992j8945j7740j6864j6443j6208j5972j5722
$$ 1147224 1127007 1106346 1085783 1065791 1046846 1029106 1012242 995799 979591 963619 947897
60466I47897j5332j4601j3658j2943j2634j2421j1986j1504j1378j1693j2098
$$ 947897 932565 917964 904306 891363 878729 866308 854322 842818 831440 819747 807649
60455H07649j2127j1541j0516r613r362r731j0136j0150j0019j0142j0306r864
$$ 807649 795522 783981 773465 763852 754490 744759 734623 724473 714454 704312 694006 684142
60443F84142q770p856p849q484q915q722q092p301o531o082o196o577o624o237
$$ 684142 675372 667516 659667 651183 642268 633546 625454 618153 611622 605540 599344 592767 586143 579906
60429E79906n903n895n899n664n435n366n061m223l302k906k871k588k002j639
$$ 579906 574003 568108 562209 556545 551110 545744 540683 536460 533158 530252 527381 524793 522791 521152
60415E21152j689j714j342p02j12K27J63l39r73j324j304j068n89J68Q12Q44M29
$$ 521152 519463 517749 516407 515705 515593 515820 515983 515644 514671 513347 512043 510975 510386 510554 511366 512210 512639
60398E12639K40M74O56N59N91R80J295J170R59J136J511J547J203Q65O83M65J16
$$ 512639 512879 513353 514009 514568 515159 516139 517434 518604 519563 520699 522210 523757 524960 525825 526508 526973 527089
60381E27089k32n36q56j020o58K63J098J030J2r77r01Q8Q04N44o1j20J70J6n51
$$ 527089 526857 526321 525465 524445 523787 524050 525148 526178 526190 525213 524312 524400 525204 525748 525687 525567 525737 525753 525202
60362E25202p14l21j72p23j460j881k147k321j895p48K54L73M6M5K75J87j09r8
$$ 525202 524488 524167 523995 523272 521812 519931 517784 515463 513568 512820 513074 513447 513493 513538 513813 514000 513891 513793
60344E13793K20N68J183K416L786M393M169L839L699L352K737K516L182M455N730
$$ 513793 514013 514581 515764 518180 521966 526359 530528 534367 538066 541418 544155 546671 549853 554308 560038
60329E60038O608O913O701O328N952N132L510J681N78M0r86k776m358m957m880
$$ 560038 566646 573559 580260 586588 592540 597672 601182 602863 603441 603481 602495 599719 595361 590404 585524
60314E85524m607m045l246k850l062k977j780K5J499K780M713P335R819J1800
$$ 585524 580917 576872 573626 570776 567714 564737 562957 562982 564481 567261 571974 579309 589128 600928
60300F00928J3622J5227J5797J4844J2832J0258O772J931l621q368j1280j2485
$$ 600928 614550 629777 645574 660418 673250 683508 690280 692211 688590 680222 668942 656457
60288F56457j2640j2162j1253j0156r012p608n791m089l374l729m178l896l248
$$ 656457 643817 631655 620402 610246 601234 593626 587835 583746 580372 576643 572465 568569 565321
60275E65321l023l081k663j830j575k262k941k753k148k059k497k782k671k393
$$ 565321 562298 559217 556554 554724 553149 550887 547946 545193 543045 540986 538489 535707 533036 530643
60261E30643j874q10N69J598K044K190K141J831J714K533M153N497O001O305O980
$$ 530643 528769 527959 528528 530126 532170 534360 536501 538332 540046 542579 546732 552229 558230 564535 571515
60246E71515P369O475M546K794J758P80q14k794m481n504n822n445m561l667l140
$$ 571515 578884 585359 589905 592699 594457 595237 594423 591629 587148 581644 575822 570377 565816 562149 559009
60231E59009k785k062p65P45J951K599K731K507K158J987K243K892L560L895L950
$$ 559009 556224 554162 553397 554142 556093 558692 561423 563930 566088 568075 570318 573210 576770 580665 584615
60216E84615M165M843N705O139N855N179M739M949N837P056Q040Q302P810O953
$$ 584615 588780 593623 599328 605467 611322 616501 621240 626189 632026 639082 647122 655424 663234 670187
60202F70187O123N454N008M893M968M796M199L629L539L634L313K657K302K276
$$ 670187 676310 681764 686772 691665 696633 701429 705628 709257 712796 716430 719743 722400 724702 726978
60188G26978J784M61r58j618j654j709j920k059k242k776l527m112m538m901m768
$$ 726978 728762 729223 728265 726647 724993 723284 721364 719305 717063 714287 710760 706648 702110 697209 692441
60173F92441l769k614k512l436m046l543k597j964j268O2J506K131K031K089K594
$$ 692441 688672 686058 683546 680110 676064 672521 669924 667960 666692 666754 668260 670391 672422 674511 677105
60158F77105L001K995K883K897K847K633K518K683L005L386L918M527M914N052
$$ 677105 680106 683101 685984 688881 691728 694361 696879 699562 702567 705953 709871 714398 719312 724364
60144G24364N436O542Q262R974J1142J1747J2254J3091J4153J4883J4943J4486
$$ 724364 729800 736342 744604 754578 765720 777467 789721 802812 816965 831848 846791 861277
60132H61277J3646J2105R577O435L296K13l167o657r394j0753j0881j0245r096
$$ 861277 874923 887028 896605 903040 906336 906549 903382 896725 887331 876578 865697 855452 846356
60119H46356p507n592l470j365K65J065J286J477J757J802J584J483J518J150
$$ 846356 838849 833257 829787 828422 828687 829752 831038 832515 834272 836074 837658 839141 840659 841809
60105H41809J32j009j680j977k333k887l502m059m342m066l378k848k662k259
$$ 841809 841941 840932 839252 837275 834942 832055 828553 824494 820152 816086 812708 809860 807198 804939
60091H04939j186J83J257K058K906L753M481N456O978Q505R255R289R203Q863
$$ 804939 803753 803936 805193 807251 810157 813910 818391 823847 830825 839330 848585 857874 867077 875940
60077H75940P443M782J790o76k599m264n759p315r336j1641j3297j3727j3384
$$ 875940 883383 888165 889955 889279 886680 882416 876657 869342 860006 848365 835068 821341 807957
60064H07957j2848j1946j0416q891q257q277p769o230m529l737l892m241m271
$$ 807957 795109 783163 772747 763856 755599 747322 739553 733323 728794 725057 721165 716924 712653
60051G12653m089m001m077m124l875l151j933l73J253K634L563M113M610N401
$$ 712653 708564 704563 700486 696362 692487 689336 687403 687030 688283 690917 694480 698593 703203 708604
60037G08604O516P586Q042P525O216M747L653K904K108J104L2j176l000n672q626
$$ 708604 715120 722706 730748 738273 744489 749236 752889 755793 757901 759005 759037 757861 754861 749189 740563
60022G40563j0966j2462j3694j5147j6463j6810j5836j4124j2608j1695j0973
$$ 740563 729597 717135 703441 688294 671831 655021 639185 625061 612453 600758 589785
60011E89785r836q229o676n560m725l819k867k178j838j528q96L9Q86J235J053
$$ 589785 579949 571720 565044 559484 554759 550940 548073 545895 544057 542529 541633 541672 542558 543793 544846
59996E44846Q35J230K337L467L829L447L132L509M360N012N197N223N369N417
$$ 544846 545681 546911 549248 552715 556544 559991 563123 566632 570992 576004 581201 586424 591793 597210
59982E97210M982M180L686L905M281L768K072J15j001j204j279j621j749j213
$$ 597210 602192 606372 610058 613963 618244 622012 624084 624199 623198 621994 620715 619094 617345 616132
59968F16132m37k50q76j837k743l664m633n280n219m564l762l096k591k278k189
$$ 616132 615695 615445 614569 612732 609989 606325 601692 596412 591193 586629 582867 579771 577180 574902 572713
59953E72713k143j867j338q08l86O7N30O10L9p73j034m29N10R48N11m93j473k114
$$ 572713 570570 568703 567365 566557 566171 566238 566768 567378 567417 566644 565610 565181 565691 566639 567150 566657 565184 563070
59935E63070k587l177l778l985l735l544l752l865l135j709n84l50n05l30O5M2
$$ 563070 560483 557306 553528 549543 545808 542264 538512 534647 531512 529803 529219 528869 528364 528034 528099 528141
59919E28141n14j017r43l42M51J216J846K258K497K726L020L252L270L098K920
$$ 528141 527627 526610 525667 525325 525776 526992 528838 531096 533593 536319 539339 542591 545861 548959 551879
59904E51879K887L029L291L617L989M326M404L963L048K174J989K702L903M966
$$ 551879 554766 557795 561086 564703 568692 573018 577422 581385 584433 586607 588596 591298 595201 600167
59890F00167N585N857O027O225O470O804P243P674P894P877P822P903Q066Q205
$$ 600167 605752 611609 617636 623861 630331 637135 644378 652052 659946 667823 675645 683548 691614 699819
59876F99819Q323Q291P614N874L350Q16j370l509n773p727q962r812j0830j1827
$$ 699819 708142 716433 724047 729921 733271 734087 732717 729208 723435 715708 706746 696934 686104 674277
59862F74277j2033j1154r715q353p176n992m723l406k050o96N61J697K708L468
$$ 674277 662244 651090 641375 633022 625846 619854 615131 611725 609675 608979 609540 611237 613945 617413
59848F17413L929M519N931Q310J0901J2763J3464J2942J1093Q051M667K020N06
$$ 617413 621342 625861 631792 640102 651003 663766 677230 690172 701265 709316 713983 716003 716509
59835G16509j42J09J753M633P270Q032O836N002L547K220L79j916m110n968p612
$$ 716509 716367 716476 718229 722862 730132 738164 745000 750002 753549 755769 756148 754232 750122 744154 736542
59820G36542r032j0111j0990j1887j2575j2600j1969j1154j0339r249p876o787
$$ 736542 727510 717399 706409 694522 681947 669347 657378 646224 635885 626636 618760 611973
59808F11973o350o171n625m553l119j471J4P07N20L07P72J322Q01p88k242k796
$$ 611973 605623 599452 593827 589274 586155 584684 584698 585405 585925 586232 587004 588326 589127 588339 586097 583301
59792E83301k887l093l236l027k813k991l164k633j485n56l01l47k32j36n41j361
$$ 583301 580414 577321 574085 571058 568245 565254 562090 559457 557972 557416 557115 556768 556536 556400 555859 554498
59776E54498j770j031N98K043K497K167J811J776J907K112K508K982L185L108
$$ 554498 552728 551697 552295 554338 556835 559002 560813 562589 564496 566608 569116 572098 575283 578391
59762E78391L103L207K985K352J912K064K303K003J427J234J288Q77L2k53N84
$$ 578391 581494 584701 587686 590038 591950 594014 596317 598320 599747 600981 602269 603146 603178 602925 603509
59747F03509J861K554K438J936J277M55k55l50K67J046J323R14J81l17k86P7K92
$$ 603509 605370 607924 610362 612298 613575 614030 613775 613425 613692 614738 616061 616975 617156 616839 616553 616630 616922
59730F16922J72R8N15J246J624J386J055J208J638J668J217J061J820L035L613
$$ 616922 617094 617192 617707 618953 620577 621963 623018 624226 625864 627532 628749 629810 631630 634665 638278
59715F38278L095K159J739J948K090J606Q13N78J326K495L060K537J388L87k24
$$ 638278 641373 643532 645271 647219 649309 650915 651728 652306 653632 656127 659187 661724 663112 663499 663275
59700F63275p64j458k056k139j639q76k72q9k72m65k97J55L23k17j175j762j515
$$ 663275 662511 661053 658997 656858 655219 654343 654071 653982 653710 653245 652948 653103 653426 653209 652034 650272 648757
59683F48757o56L34J252K116K784K931K376J215l17j970l396m223m342m066l795
$$ 648757 648101 648435 649687 651803 654587 657518 659894 661109 660792 658822 655426 651203 646861 642795 639000
59668F39000l645l515l329l028k398j295O2J265K170K880L292L125K499K025K044
$$ 639000 635355 631840 628511 625483 623085 621790 621852 623117 625287 628167 631459 634584 637083 639108 641152
59653F41152K143J768J072P49J234K357L579M235L764K213L73r57j753k515l383
$$ 641152 643295 645063 646135 646884 648118 650475 654054 658289 662053 664266 664639 663682 661929 659414 656031
59638F56031l978m011l544k687j498k56O89J411K275L219L722L614L463L835M553
$$ 656031 652053 648042 644498 641811 640313 640057 640746 642157 644432 647651 651373 654987 658450 662285 666838
59623F66838N137N632O567Q065R316R151P084L800N00k202m493o477p517o948
$$ 666838 671975 677607 684174 692239 701555 710706 717790 721590 722090 719888 715395 708918 701401 694453
59609F94453n056k827q64Q66K371L472M222M829N059M434L097J746N55j013l045
$$ 694453 689397 686570 685706 686572 688943 692415 696637 701466 706525 710959 714056 715802 716357 715344 712299
59594G12299m674n201m954m571m151l741l888m912o114o566o291n941n618m908
$$ 712299 707625 702424 697470 692899 688748 685007 681119 676207 670093 663527 657236 651295 645677 640769
59580F40769l888l223l222l475l523l317k939k354j569o93K03J052J690K048K248
$$ 640769 636881 633658 630436 626961 623438 620121 617182 614828 613259 612566 612769 613821 615511 617559 619807
59565F19807K371K380K466L108M273N099M875L993L338L075K752K315K151K234
$$ 619807 622178 624558 627024 630132 634405 639504 644379 648372 651710 654785 657537 659852 662003 664237
59551F64237K070J600J442K028L006L716L817L367K712K394K851M137O149Q956
$$ 664237 666307 667907 669349 671377 674383 678099 681916 685283 687995 690389 693240 697377 703526 712482
59537G12482J2566J6536K0208K3041K4312K2925J8477J2445P476N311N779P658
$$ 712482 725048 741584 761792 784833 809145 832070 850547 862992 870468 875779 881558 889216
59525H89216R846J1703J3142J4555J6148J7282J7051J5459J3291J0860P757L872
$$ 889216 899062 910765 923907 938462 954610 971892 988943 1004402 1017693 1028553 1036310 1040182
59513A040182k57m274q341j2288j5329j7120j8238j9156j9399j8316j6118j3586
$$ 1040182 1039925 1035651 1027310 1015022 999693 982573 964335 945179 925780 907464 891346 877760
59501H77760j1303r516q237o951m815j717J319L312M466N582O878Q010Q874R687
$$ 877760 866457 856941 848704 841753 836938 835221 836540 839852 844318 849900 856778 864788 873662 883349
59487H83349J0494J1221J2040J3192J4626J6198J8096K0662K3992K7998L2554
$$ 883349 893843 905064 917104 930296 944922 961120 979216 999878 1023870 1051868 1084422
59476A084422L7313M1705M5394M8242M9498M7555M1282L1262J9307P164l778j2059
$$ 1084422 1121735 1163440 1208834 1257076 1306574 1354129 1395411 1426673 1445980 1453144 1449366 1437307
59464A437307j6456j6748j3603p819r3Q788J8252K8302L8934M9372N8557O6345
$$ 1437307 1420851 1404103 1390500 1382681 1382588 1391376 1409628 1437930 1476864 1526236 1584793 1651138
59452A651138P3575Q1072Q9393R9463J12443J28122J43540J53301J51376J33319
$$ 1651138 1724713 1805785 1895178 1994641 2107084 2235206 2378746 2532047 2683423 2816742
59442B816742R8244M9616n654n9350j04120j35176j51501j55696j52012j44006
$$ 2816742 2914986 2964602 2958948 2899598 2795478 2660302 2508801 2353105 2201093 2057087
59432B057087j33826j22939j12458j02687r3161q3477p3691o3804n3560m2941
$$ 2057087 1923261 1800322 1687864 1585177 1492016 1408539 1334848 1271044 1217484 1174543
59422A174543l2372k2248j2701l926L809J0568J6539K1273K3905K4453K4289K4792
$$ 1174543 1142171 1119923 1107222 1103296 1107105 1117673 1134212 1155485 1179390 1203843 1228132 1252924
59410A252924K5868K6051K3418J6305M215j0962k5164l4749l9002l9587l7912
$$ 1252924 1278792 1304843 1328261 1344566 1348781 1337819 1312655 1277906 1238904 1199317 1161405
59399A161405l3917k7298j8902j0645m748l189o858j4472k2784k8708l1277l1364
$$ 1161405 1127488 1100190 1081288 1070643 1065895 1062706 1055848 1041376 1018592 989884 958607 927243
59387I27243l0001k7591k4473k1313j8595j6232j4034j2163j0787r586q066o255
$$ 927243 897242 869651 845178 823865 805270 789038 775004 762841 752054 742468 734402 728147
59375G28147m657l564k807k258k049k153k166j800j267q33k68Q18K229L268L638
$$ 728147 723490 719926 717119 714861 712812 710659 708493 706693 705426 704593 704325 705143 707372 710640 714278
59360G14278L849M628O222Q324J0424J2193J3747J5602J8163K1243K4406K7664
$$ 714278 718127 722755 728977 737301 747725 759918 773665 789267 807430 828673 853079 880743
59348H80743L1325L5073L7868L9133L9568M0163M0801M0444L8532L5420L1369
$$ 880743 912068 947141 985009 1024142 1063710 1103873 1144674 1185118 1223650 1259070 1290439
59337A290439K5919J8658J0089J226p325j5450k2918k9227l4105l7691m0217m1784
$$ 1290439 1316358 1335016 1345105 1346331 1339006 1323556 1300638 1271411 1237306 1199615 1159398 1117614
59325A117614m2534m2693m2284m1003l8596l5205l1277k7325k3803k1034j8964
$$ 1117614 1075080 1032387 990103 949100 910504 875299 844022 816697 792894 771860 752896
59314G52896j7131j5032j2584j0180q314p153o280m928k704j66J593K190K445
$$ 752896 735765 720733 708149 697969 689655 682502 676222 671294 668590 668424 670017 672207 674652
59301F74652L472N440P642R627J1800J4759J8200K0654K0360J6641J0556M055
$$ 674652 678124 683564 691206 700833 712633 727392 745592 766246 786606 803247 813803 817858
59289H17858j530o015r474j1501j1765j0708r041o906m219j504N33K177M492P775
$$ 817858 816328 810313 800839 789338 777573 766865 757824 750918 746699 745195 745728 747905 752397 760172
59275G60172J1135J3914J6594J9811K3204K5949K7837K9098K9574K8838K6902
$$ 760172 771307 785221 801815 821626 844830 870779 898616 927714 957288 986126 1013028
59264A013028K4115K0470J5695J0047M378p37n552j0636j6033k1036k4636k6233
$$ 1013028 1037143 1057613 1073308 1083355 1087733 1086996 1081444 1070808 1054775 1033739 1009103 982870
59252I82870k6037k4772k3002k0885j8548j6264j4077j1640q757n754k923J3L388
$$ 982870 956833 932061 909059 888174 869626 853362 839285 827645 818888 813134 810211 810224 813612
59239H13612O842R647J1771J3937J6634J9451K1556K2380K1749J9655J6181J1543
$$ 813612 820454 830101 841872 855809 872443 891894 913450 935830 957579 977234 993415 1004958
59227A004958O150N93m527q983j2981j6719j9989k2429k3984k4842k4999k4229
$$ 1004958 1011108 1011701 1007174 998191 985210 968491 948502 926073 902089 877247 852248 828019
59215H28019k2510k0283j8189j6649j5513j4202j2356j0380q950q000o790n210
$$ 828019 805509 785226 767037 750388 734875 720673 708317 697937 688987 680987 674197 668987
59203F68987m316m864n950n899m319k405j288r32p73o77q20j189j577j810j763
$$ 668987 664671 659807 653857 647958 643639 641234 639946 639014 638241 637564 636744 635555 633978 632168 630405
59188F30405j373q45n30m91l74J66J144K363L571M451M773M716M862N686P102
$$ 630405 629032 628187 627657 627166 626792 626958 628102 630465 634036 638487 643260 647976 652838 658524 665626
59173F65626Q620R918J1210J3032J5578J8307K0485K2045K3537K5128K6190K6120
$$ 665626 674246 684164 695374 708406 723984 742291 762776 784821 808358 833486 859676 885796
59161H85796K4944K2848J9687J5613J1487P877M076r02o619j1549j5014j7691
$$ 885796 910740 933588 953275 968888 980375 988252 992328 991426 984807 973258 958244 940553
59149I40553k0098k1707k1931k1093j9856j8390j6646j4934j3706j3054j2802
$$ 940553 920455 898748 876817 855724 835868 817478 800832 785898 772192 759138 746336
59138G46336j2745j2592j2018j1084j0215r613q998q150p188o206n057l701k338
$$ 746336 733591 720999 708981 697897 687682 678069 669071 660921 653733 647527 642470 638769 636431
59125F36431r79O04K322L667M451N129O163P525R078J0833J2477J3347J3292J3091
$$ 636431 635452 636056 638378 642045 646496 651625 657788 665313 674391 685224 697701 711048 724340 737431
59111G37431J3426J3950J3895J3167J2238J1351J0479R825R692R947J0139J0007
$$ 737431 750857 764807 778702 791869 804107 815458 825937 835762 845454 855401 865540 875547
59099H75547R559Q769P660O447N259L935K491J398R34O37M8l51J40R74O39j342
$$ 875547 885106 893875 901535 907982 913241 917176 919667 921065 921999 922636 922684 922333 922473 923447 924086 922744
59083I22744l615m723m949n783p956j0720j2998j4518j5614j6455j6830j6562
$$ 922744 919129 914406 909457 903674 895718 884998 872000 857482 841868 825413 808583 792021
59071G92021j5725j4424j2720j0887r460q740q382p790o827n790m750l429j829
$$ 792021 776296 761872 749152 738265 728805 720065 711683 703893 697066 691276 686526 683097 681268
59058F81268n51j97p14j565k358l029l638m193m627m818m643m142l537l077k961
$$ 681268 680717 680520 679806 678241 675883 672854 669216 665023 660396 655578 650935 646793 643256 640179 637218
59043F37218l291l788l721k521o17Q23J121O86L30M42J033K024L079L636L531
$$ 637218 633927 630139 626418 623897 623280 624103 625224 625910 626240 626682 627715 629739 632818 636454 639985
59028F39985L446M193N797P545Q835R694J0603J2051J4075J6054J7236J7526J7425
$$ 639985 643431 647624 653421 660966 669801 679495 690098 702149 716224 732278 749514 767040 784465
59015G84465J7071J5918J3680J0973Q468O004L239P48m31j80O12J315K194L692
$$ 784465 801536 817454 831134 842107 850575 856579 859818 860566 860135 859955 860567 861882 864076 867768
59001H67768N857Q676J2259J6319K0010K2605K4029K4555K4403K3891K3368K2641
$$ 867768 873625 882301 894560 910879 930889 953494 977523 1002078 1026481 1050372 1073740 1096381
58989A096381K0906J7706J3584R226M435j313p486j2642j6145j8824k1435k3222
$$ 1096381 1117287 1134993 1148577 1157803 1162238 1160925 1153439 1140797 1124652 1105828 1084393 1061171
58977A061171k2916k0640j7828j5319j2565r019n191j864J077M158P251R794J1783
$$ 1061171 1038255 1017615 999787 984468 971903 962884 957693 955829 956906 961064 968315 978109 989892
58964I89892J3678J5515J6908J7784J8390J8574J7804J5956J3321R865N249k93
$$ 989892 1003570 1019085 1035993 1053777 1072167 1090741 1108545 1124501 1137822 1147687 1152936 1152643
58952A152643n947j1240j6235k0615k3580k4931k5415k5473k4558k2153j8633
$$ 1152643 1146696 1135456 1119221 1098606 1075026 1050095 1024680 999207 974649 952496 933863
58941I33863j4549r939m998o46K348M155N074M669K567o10m038p750j1858j5371
$$ 933863 919314 909375 904377 903731 906079 910234 915308 919977 922544 921934 917896 910146 898288 882917
58927H82917j7049j7095j6757j6443j5543j3902j2226j0840r344p709o532n848
$$ 882917 865868 848773 832016 815573 800030 786128 773902 763062 753718 746009 739477 733629
58915G33629m728k630k62J489K735M103N684P087Q131Q982R941J1429J3856J7056
$$ 733629 728901 726271 726009 727498 730233 734336 740020 747107 755238 764220 774161 785590 799446 816502
58901H16502K0166K2417K3841K4917K5813K6241K5970K5193K4505K4557K5637
$$ 816502 836668 859085 882926 907843 933656 959897 985867 1011060 1035565 1060122 1085759
58890A085759K7662L0682L5065M0798M6842N1817N5180N7096N7347N5181N0434
$$ 1085759 1113421 1144103 1179168 1219966 1266808 1318625 1373805 1430901 1488248 1543429 1593863
58879A593863M3848L6040K6908J6478N462n577j6921k8794m0219m9549n5954n9705
$$ 1593863 1637711 1673751 1700659 1717137 1722599 1717022 1700101 1671307 1631088 1581539 1525585 1465880
58867A465880o1244o0634n7998n3811m8719m3376l8461l4409l1064k7951k4968
$$ 1465880 1404636 1344002 1286004 1232193 1183474 1140098 1101637 1067228 1036164 1008213 983245
58856I83245k2502k0771j9452j8131j6862j5920j5244j4425j3272j2036j0924
$$ 983245 960743 939972 920520 902389 885527 869607 854363 839938 826666 814630 803706
58845H03706r721q177o636n793n814o070n995n756n800o047o064n805n675n845
$$ 803706 793985 785808 779172 773379 767565 761495 755500 749744 743944 737897 731833 726028 720353 714508
58831G14508o050o096o101o089n784n059m188l390k413q97R76K668M031N427O972
$$ 714508 708458 702362 696261 690172 684388 679329 675141 671751 669338 668441 669417 672085 676116 681543 688515
58816F88515Q041P928O889O053O126O576O408N363L860K028l09k703m100m209
$$ 688515 696556 704484 711373 717426 723552 730128 736536 741899 745759 747787 747478 744775 740675 736466
58802G36466m073m648n428n282m161l071k631k550k449k284j934j174k47K58L52
$$ 736466 732393 727745 722317 717035 712874 709803 707172 704622 702173 699889 697955 696781 696534 696792 697144
58787F97144P87K055L855N761P729R556J0552J0335R505Q948Q742Q325P460O498
$$ 697144 697931 699986 703841 709602 717331 726887 737439 747774 757279 766227 774969 783294 790754 797252
58773G97252N728N019M145L148K239J609J375J508J761J783J412P47j07j214k577
$$ 797252 802980 807999 812144 815292 817531 819140 820515 822023 823784 825567 826979 827726 827619 826405 823828
58758H23828l770m069l133j417L11J859L677N987Q188R341R096P954O760O140
$$ 823828 820058 815989 812856 811439 811750 813609 817286 823273 831461 840802 849898 857852 864612 870752
58744H70752O242O848P723Q750R656R840Q948P534O507N932N116L987L433L893
$$ 870752 876994 883842 891565 900315 909971 919811 928759 936293 942800 948732 953848 957835 961268 965161
58730I65161M632N059N896Q021J0847J2915J3683J3648J3057J1607R398P150N436
$$ 965161 969793 974852 980748 988769 999616 1012531 1026214 1039862 1052919 1064526 1073924 1081074 1086510
58717A086510M455M467N555P094Q315R300J0577J1823J2082J1156R737Q085N675
$$ 1086510 1090965 1095432 1100987 1108081 1116396 1125696 1136273 1148096 1160178 1171334 1181071 1189156 1194831
58704A194831K346j272m780q488j2555j6587k0358k3966k7030k8798k9303k9380
$$ 1194831 1197177 1195905 1191125 1182637 1170082 1153495 1133137 1109171 1082141 1053343 1024040 994660
58692I94660k9108k7398k3781j9490j6023j3569j1652j0408j0243j0881j1695
$$ 994660 965552 938154 914373 894883 878860 865291 853639 843231 832988 822107 810412
58681H10412j2518j3334j3732j3354j2461j1320r630p294n166m035l282j539J489
$$ 810412 797894 784560 770828 757474 745013 733693 724063 716769 711603 707568 704286 702747 704236
58668G04236M732P225R125J1214J3945J7079J9848K1492K1789K0900J8709J4914
$$ 704236 708968 716193 725318 736532 750477 767556 787404 808896 830685 851585 870294 885208
58656H85208J0049N644K781J078l59j616k398l105m423o127p272p500p313p115
$$ 885208 895257 900901 903682 904760 904401 902785 900387 897282 892859 886732 879460 871960 864647 857532
58642H57532o823o372n797m760k787j70K121L598M721N943P019P530P547P274
$$ 857532 850709 844337 838540 833780 830993 830823 832944 836542 841263 847206 854225 861755 869302 876576
58628H76576O430M636K209Q1j143j625j692j232L4J885L789N775Q527J2340J6534
$$ 876576 883006 887642 889851 889932 888789 887164 885472 884240 884274 886159 889948 895723 904250 916590 933124
58613I33124K0368K4008K7730L0488L0468K7175K2045J6633J1149N310k75m560
$$ 933124 953492 977500 1005230 1035718 1066186 1093361 1115406 1132039 1143188 1148498 1148223 1143663
58601A143663p406r589j1573j2874j2777j1284r336q131p999p929o649m219j920
$$ 1143663 1136257 1126668 1115095 1102221 1089444 1078160 1068824 1060693 1052694 1044765 1038116 1033897 1031977
58588A031977l49J458M499Q199J1242J3536J6250J9965K3691K5923K6110K4786
$$ 1031977 1031628 1033086 1037585 1045784 1057026 1070562 1086812 1106777 1130468 1156391 1182501 1207287
58576A207287K2696K0181J7277J4100J0922P933N174K899J671J776K728L963N752
$$ 1207287 1229983 1250164 1267441 1281541 1292463 1300396 1305570 1308469 1310140 1311916 1314644 1318607 1324359
58563A324359Q733J2622J6220J8814K0632K1668K1099J8350J4030R215M413k55
$$ 1324359 1333092 1345714 1361934 1380748 1401380 1423048 1444147 1462497 1476527 1485742 1490155 1489900
58551A489900m481p979j0763j2793j3813j3927j3801j3931j4276j4815j5696j6558
$$ 1489900 1485419 1477440 1466677 1453884 1440071 1426144 1412343 1398412 1384136 1369321 1353625 1337067
58539A337067j6728j6535j7335j9504k1544k2070k1640k1425k0984j8874j4910
$$ 1337067 1320339 1303804 1286469 1266965 1245421 1223351 1201711 1180286 1159302 1140428 1125518
58528A125518j0426o435k915J85K491M046N672Q141J1352J4407J6136J5806J3767
$$ 1125518 1115092 1108657 1105742 1105927 1108418 1112464 1118136 1126277 1137629 1152036 1168172 1183978 1197745
58515A197745J1173Q733O174L291Q01n63j154j738k340k578k639k849k755j654
$$ 1197745 1208918 1217651 1223825 1227116 1227917 1227354 1226200 1224462 1222122 1219544 1216905 1214056 1211301 1209647
58501A209647K59K177L825N395O674P288P493P710P582O510M917L860L445K717
$$ 1209647 1209906 1212083 1215908 1221303 1227977 1235265 1242758 1250468 1258050 1264560 1269477 1273337 1276782 1279499
58487A279499J130q30k493l529l541k138L64L010N164O916Q617J0487J2498J4052
$$ 1279499 1280629 1279799 1277306 1273777 1270236 1268098 1268462 1271472 1276636 1283552 1292169 1302656 1315154 1329206
58473A329206J4073J1983Q320L853j364p279j2831j6729j8855j9950k0364k0121
$$ 1329206 1343279 1355262 1363582 1367435 1366071 1358792 1345961 1329232 1310377 1290427 1270063 1249942
58461A249942j9726j9623j9204j7577j5089j2800j0784q211m966j762J147L897
$$ 1249942 1230216 1210593 1191389 1173812 1158723 1145923 1135139 1126928 1121962 1120200 1121347 1125244
58449A125244N736N458L228N14j986m784p751r537r533q873q596q097o353l682
$$ 1125244 1130980 1136438 1139666 1140180 1138194 1133410 1125659 1116122 1106589 1097716 1089120 1081023 1074670 1070988
58435A070988j246N17K024L597N094O209O812P239Q328J0623J3520J5886J7491
$$ 1070988 1069742 1070259 1072283 1075880 1080974 1087183 1093995 1101234 1109562 1120185 1133705 1149591 1167082
58422A167082J8979K0427K1008K0291J8832J7071J4656J1389P972N254L310J648
$$ 1167082 1186061 1206488 1227496 1247787 1266619 1283690 1298346 1309735 1317707 1322961 1326271 1327919
58410A327919k01k592n616q746j1258j3130j4892j6445j6934j6043j4508j2980
$$ 1327919 1327718 1325126 1319510 1310764 1299506 1286376 1271484 1255039 1238105 1222062 1207554 1194574
58398A194574j1138q470n226k076O83L140N268O793P378O902N694M420L390K306
$$ 1194574 1183436 1174966 1169740 1167664 1168347 1171487 1176755 1183548 1190926 1197828 1203522 1207942 1211332 1213638
58384A213638J057K65M00Q28O19j21p05j280k634m816p049q868j0235j0716r792
$$ 1213638 1214695 1214960 1215360 1216188 1216807 1216686 1215981 1214701 1212067 1207251 1200202 1191334 1181099 1170383 1160591
58369A160591p945o194m572k287O64L371N566P919J0588J2861J4446J5884J7223
$$ 1160591 1152646 1146452 1141880 1139593 1140257 1143628 1149194 1157113 1167701 1180562 1195008 1210892 1228115
58356A228115J7603J6530J4474J1830Q432M504R79j595l479m804n168m570l779
$$ 1228115 1245718 1262248 1276722 1288552 1296984 1301488 1302467 1300872 1297393 1292589 1287421 1282851 1279072
58343A279072l302k727j329J247M860Q745J1742J3485J4978J7031J8792J9103
$$ 1279072 1275770 1273043 1271714 1272961 1277821 1286566 1298308 1311793 1326771 1343802 1362594 1381697
58331A381697J8639J8974J9966K0008J8664J7056J5662J3801J1502R813Q919P815
$$ 1381697 1400336 1419310 1439276 1459284 1477948 1495004 1510666 1524467 1535969 1545782 1554701 1562516
58319A562516O318N455N519N652N798P055R541J1827J3175J4445J6227J7886J9197
$$ 1562516 1568834 1574289 1579808 1585460 1591258 1598313 1607854 1619681 1632856 1647301 1663528 1681414 1700611
58306A700611K0978K3388K5360K6315K6706K6431K4726K2208K0805K0850K0493
$$ 1700611 1721589 1744977 1770337 1796652 1823358 1849789 1874515 1896723 1917528 1938378 1958871
58295A958871J8816J7310J7271J7945J8378J9015K0215K1287K2103K3670K5996
$$ 1958871 1977687 1994997 2012268 2030213 2048591 2067606 2087821 2109108 2131211 2154881 2180877
58284B180877K7502K7702K8216K9874L1111L0720K9939L0120L0519L0155K9918
$$ 2180877 2208379 2236081 2264297 2294171 2325282 2356002 2385941 2416061 2446580 2476735 2506653
58273B506653L0968L2808L4659L6996M0114M2899M4656M6563M9753N3600N7252
$$ 2506653 2537621 2570429 2605088 2642084 2682198 2725097 2769753 2816316 2866069 2919669 2976921
58262B976921O1076O5153O8269O9867P1301P3684P6208P7836P8805P9330P8968
$$ 2976921 3037997 3103150 3171419 3241286 3312587 3386271 3462479 3540315 3619120 3698450 3777418
58251C777418P8360P9435Q2715Q6659R0572R5548J01586J06911J11344J17094
$$ 3777418 3855778 3935213 4017928 4104587 4195159 4290707 4392293 4499204 4610548 4727642
58241D727642J24735J31939J37913J45351J55797J66879J76623J86896J99775
$$ 4727642 4852377 4984316 5122229 5267580 5423377 5590256 5766879 5953775 6153550
58232F153550K13959K27718K42149K58738K76840K96158L18317L43509L69258
$$ 6153550 6367509 6595227 6837376 7096114 7372954 7669112 7987429 8330938 8700196
58223H700196L95135M24511M59007M95799N33521N75915O26084O82253P43319
$$ 8700196 9095331 9519842 9978849 10474648 11008169 11584084 12210168 12892421 13635740
58214A3635740Q13276Q95649R88877J092242J211233J351981J515957J705703
$$ 13635740 14449016 15344665 16333542 17425784 18637017 19988998 21504955 23210658
58206B3210658J930188K198853K516733K891926L341554L883308M527848N287026
$$ 23210658 25140846 27339699 29856432 32748358 36089912 39973220 44501068 49788094
58198D9788094O182818P241647Q491035R974530J1763812J3947337J6616769J9866549
$$ 49788094 55970912 63212559 71703594 81678124 93441936 107389273 124006042 143872591
58190A43872591K3757605K8186536L2696004L6358108L7868851L5925074K9821100
$$ 143872591 167630196 195816732 228512736 264870844 302739695 338664769 368485869
58183C68485869J9986411Q049344l768207j3597540k0573328k4826835k7022605
$$ 368485869 388472280 396521624 392753417 379155877 358582549 333755714 306733109
58176C06733109k7877954k7899661k7320353k6174102k4463607k2303252j9916237
$$ 306733109 278855155 250955494 223635141 197461039 172997432 150694180 130777943
58169A30777943j7516746j5228662j3108736j1196145r515321q061592o814971
$$ 130777943 113261197 98032535 84923799 73727654 64212333 56150741 49335770
58162D9335770n760468m882358m152560l540963l029721k606909k255199j957787
$$ 49335770 43575302 38692944 34540384 30999421 27969700 25362791 23107592 21149805
58154B1149805j708024j502911j332974j187247j062457r58887q71884p94815
$$ 21149805 19441781 17938870 16605896 15418649 14356192 13397305 12525421 11730606
58146A1730606p25890o65265o09710n56383n07726m66436m29430l92489l57110
$$ 11730606 11004716 10339451 9729741 9173358 8665632 8199196 7769766 7377277 7020167
58137G020167l27149l02145k79583k60382k46527k35848k24598k12957k03196
$$ 7020167 6693018 6390873 6111290 5850908 5604381 5368533 5143935 4930978 4727782
58128D727782j94507j84394j73359j63723j55298j46149j36357j27418j19303
$$ 4727782 4533275 4348881 4175522 4011799 3856501 3710352 3573995 3446577 3327274
58119C327274j11298j04269r9152r4721q9636q4906q1741p8901p4914p0846o8049
$$ 3327274 3215976 3111707 3012555 2917834 2828198 2743292 2661551 2582650 2507736 2436890 2368841
58108B368841o5317o1250n7303n5362n4198n1550m8100m6108m5556m4766m3572
$$ 2368841 2303524 2242274 2184971 2129609 2075411 2023861 1975761 1929653 1884097 1839331 1795759
58097A795759m2820m1887l9684l7126l5760l4867l2643k9424k7123k6114k5129
$$ 1795759 1752939 1711052 1671368 1634242 1598482 1563615 1530972 1501548 1474425 1448311 1423182
58086A423182k3627k2063k0460j8775j7962j8716j9929k0215j9955k0126k0200
$$ 1423182 1399555 1377492 1357032 1338257 1320295 1301579 1281650 1261435 1241480 1221354 1201154
58075A201154j9227j7918j7543j7766j7487j6862j6596j6283j5300j4344j4112
$$ 1201154 1181927 1164009 1146466 1128700 1111213 1094351 1077755 1061472 1046172 1031828 1017716
58064A017716j3678j2114j0504j0211j0353r299p654p299q254q950r034r504j0451
$$ 1017716 1004038 991924 981420 971209 960856 951557 943903 936604 928350 919400 910366 900862 890411
58051H90411j0870j0535j0098r612q713p834p534p152n824m270l824m276m468
$$ 890411 879541 869006 858908 849296 840583 832749 825215 818063 812239 807969 804145 799869 795401
58038G95401m336m541m746m224l581l933m874n163m930n227n978o316o454p137
$$ 795401 791065 786524 781778 777554 773973 770040 765166 760003 755073 749846 743868 737552 731098 723961
58024G23961p710o918n276m425m373l641k082j252j810k699l159l604m075l862
$$ 723961 716251 709333 704057 699632 695259 691618 689536 688284 686474 683775 680616 677012 672937 669075
58010F69075l071k822l325l484k844k385k743l141k756j931j483j797k952m772
$$ 669075 666004 663182 659857 656373 653529 651144 648401 645260 642504 640573 639090 637293 634341 629569
57996F29569o549p661q494r685j0600r906p619n199l483j968l40P66R97R83J184
$$ 629569 623020 615359 606865 597180 586580 576674 569055 563856 560373 558405 558065 558831 559828 560811 561995
57981E61995J162N00m31j111j494j595j225m34K49L67j19q93j302o77P10J504
$$ 561995 563157 563657 563226 562115 560621 559026 557801 557367 557616 557983 557864 556971 555669 554992 555702 557206
57965E57206Q80k10l52L22O21K57n6j17l86q25r88j194k220l760m616m477m194
$$ 557206 558086 557876 557524 557846 558467 558724 558668 558551 558165 557340 556352 555158 552938 549178 544562 540085 535891
57948E35891m213m039l412k736k229j814j847k640l294k509o83L66L7k47O56K075
$$ 535891 531678 527639 524227 521491 519262 517448 515601 512961 509667 507158 506475 506841 506878 506631 507287 509362
57932E09362K985L548M251M733M447L683L078K695K196J409K84j164k477l019
$$ 509362 512347 515895 520146 524879 529326 533009 536087 538782 540978 542387 542671 541507 539030 536011
57918E36011k862k870l629m862n946o456o196n427m913m962m677l102q70N00O62
$$ 536011 533149 530279 526650 521788 515842 509386 503190 497763 492850 487888 483211 480109 479239 479739 480401
57903D80401N03K32q87k748l982l920l452l437l548l411l452l878l969l349k794
$$ 480401 480904 481136 480249 477501 473519 469599 466147 462710 459162 455751 452299 448421 444452 441103 438309
57888D38309k943l187k692j627n57M54J373J652J052K98O9O4k02m49l31l76j288
$$ 438309 435366 432179 429487 427860 427303 427757 429130 430782 431834 432132 432201 432265 432063 431614 431283 430907 429619
57871D29619k809m096m821n220n473n592n584n158l898k111q97p47q50l27M85
$$ 429619 426810 422714 417893 412673 407200 401608 396024 390866 386968 384857 383960 383213 382363 382036 382521
57856C82521Q00O76P06R60J168J551K543L904M886N216N277N424N647N755N559
$$ 382521 383321 383997 384703 385663 386831 388382 390925 394829 399715 404931 410208 415632 421279 427034 432593
57841D32593M992M296L768L180J986L58p15p45n01r51j990k959l749m686n727
$$ 432593 437585 441881 445649 448829 450815 451173 450458 449713 449212 448261 446271 443312 439563 434877 429150
57826D29150o553p074p281o879n776m520l600k655j134N95J578J609J413J601
$$ 429150 422597 415523 408242 401363 395587 391067 387467 384812 383678 384273 385851 387460 388873 390474
57812C90474K066K429K442J837M34j462l199m539n877p450q710q817p729o428
$$ 390474 392540 394969 397411 399248 399682 398220 395021 390482 384605 377155 368445 359628 351899 345471
57798C45471n870n872n441m201l076l129m193n151n277m722l888l076k585k421
$$ 345471 339601 333729 328288 324087 321011 317882 313689 308538 303261 298539 294651 291575 288990 286569
57784B86569j995r13J21M6q59j236o14R3M42J342L360N332N792M970M263M314
$$ 286569 284574 283661 283782 283828 282969 281733 281119 281212 281654 282996 286356 291688 297480 302450 306713 311027
57768C11027M626M758M774M678M200L264K142J130L16m07j291k316k885k447j531
$$ 311027 315653 320411 325185 329863 334063 337327 339469 340599 340915 340508 339217 336901 334016 331569 330038
57753C30038j359k158k759k241j038J24J298K532K991K039N19k46k14l51r62j443
$$ 330038 328679 326521 323762 321521 320483 320607 321905 324437 327428 329467 329986 329740 329526 329175 328213 326770
57737C26770j504j576j918k178j931j238o26p46j663k334j496M86J631R20j98
$$ 326770 325266 323690 321772 319594 317663 316425 315799 315053 313390 311056 309560 310046 311677 312597 312399
57722C12399R7J382J887J250O46N43J28r76k019k431k527k585k404k188k665l888
$$ 312399 312496 313878 315765 317015 317661 318204 318332 317356 315337 312906 310379 307794 305390 303202 300537 296649
57706B96649m840m695l685k437j277n12m62q58r55o07n07j030j648j759j395p94
$$ 296649 291809 287114 283429 280992 279715 279203 278741 277883 276928 276321 275814 274784 273136 271377 269982 269188
57690B69188j02K58j92j059j182j66J073J730K147K998M234N610P425R882J2450
$$ 269188 269086 269344 269152 268093 266911 266745 267818 269548 271695 274693 278927 284537 291962 301844 314294
57675C14294J4685J7199K1014K6357L2892M0656M9783N9345O7157P0554O6987
$$ 314294 328979 346178 367192 393549 426441 467097 516880 576225 643382 713936 780923
57664G80923N4683L4111Q944j5468l5088m8518n5904n7798n5412n0871m6129m1727
$$ 780923 835606 869717 878661 863193 828105 779587 723683 665885 610473 559602 513473 471746
57652D71746l7065l1787k6435k1843j8263j5287j2450r760p569o064m979l877
$$ 471746 434681 402894 376459 354616 336353 321066 308616 298856 291287 285223 280244 276367
57640B76367k625j484p82n47m72k25J82L83J16l91o57m77l5M73J008J443J468
$$ 276367 273742 272258 271476 270929 270457 270232 270414 270797 270913 270522 269865 269388 269353 269826 270834 272277 273745
57623B73745R13n3j135k140k884l181l061k753k385j963j727j978k404k134r50
$$ 273745 274658 274605 273470 271330 268446 265265 262204 259451 257066 255103 253376 251398 248994 246860 245910
57608B45910N4k65j551k419k288j833j658j451q52k57j98n00p29j038j832k866
$$ 245910 245964 245699 244148 241729 239441 237608 235950 234499 233647 233390 233192 232692 231963 230925 229093 226227
57592B26227l418l312l080l075l063k767k308j906j665j763k324k896k694j698
$$ 226227 222809 219497 216417 213342 210279 207512 205204 203298 201633 199870 197546 194650 191956 190258
57578A90258r50j297k359l237l699l939l681k477q39m4o03j628j977j471o74q9
$$ 190258 189308 188011 185652 182415 178716 174777 171096 168619 167780 167736 167133 165505 163528 162057 161383 161294
57562A61294Q4j29m08l14J74N42L61k20p87j111j127q26l60N8M72R95J315R05
$$ 161294 161378 161249 160841 160527 160701 161243 161604 161384 160597 159486 158359 157533 157173 157231 157703 158698 160013 160918
57544A60918n9o81n33j88j23J22J024J988K096J560J475K167K726K269R81k78
$$ 160918 160859 160178 159645 159457 159334 159456 160480 162468 164564 166124 167599 169766 172492 174761 175742 175464
57528A75464q58o22J51Q64R32K56p06j286r96J38J429J933J423P00O56J225J744
$$ 175464 174606 173984 174135 174999 175931 176187 175481 174195 173199 173337 174766 176699 178122 178822 179478 180703 182447
57511A82447J919J915J753J329R42J064J562J759J329N32m00j475k406k654k221
$$ 182447 184366 186281 188034 189363 190305 191369 192931 194690 196019 196551 196151 194676 192270 189616 187395
57496A87395j877k209k940l489l702l710l407k566j312j65L73J70m91j154j592
$$ 187395 185518 183309 180369 176880 173178 169468 166061 163495 162183 162018 162391 162561 162070 160916 159324
57481A59324j917k206k222j780j164p94o24l49j7J1l33q34j408j935j865p84O64
$$ 159324 157407 155201 152979 151199 150035 149241 148617 148268 148251 148262 147929 147095 145687 143752 141887 141103 141767
57464A41767J312R75N66N49L48m00j023q89m61m65p95r89j150j465j395m12Q76
$$ 141767 143079 144054 144620 145169 145517 145117 144094 143205 142744 142279 141484 140495 139345 137880 136485 136073 136949
57447A36949J386J182J287J893J945Q71l37m33L76Q28L48l64m53k8J96n3k94o2
$$ 136949 138335 139517 140804 142697 144642 145513 145176 144743 145119 145947 146295 145931 145478 145450 145646 145593 145299 145237
57429A45237M07M88L8m12l32J92O31N14k79j368j971j500l48L98K53o6L24J293
$$ 145237 145644 146132 146170 145758 145426 145618 146249 146763 146484 145116 143145 141645 141297 141695 141948 141882 142206 143499
57411A43499K088K442K576K396J592N08L9M38R23P98L56K18L22J67k87n35k27
$$ 143499 145587 148029 150605 153001 154593 155101 155140 155578 156501 157299 157655 157873 158195 158362 158075 157540 157313
57394A57313M92J238J638J428P19J47K99R56J340J134Q79J104J544J581J154P98
$$ 157313 157805 159043 160681 162109 162828 162975 163274 164230 165570 166704 167583 168687 170231 171812 172966 173764
57378A73764Q45J120J413J787K251K526K444K262K253K146J459L54k82J83J346
$$ 173764 174609 175729 177142 178929 181180 183706 186150 188412 190665 192811 194270 194624 194342 194525 195871
57363A95871K186K111J437Q93Q47J141J489J857K299K641K602K277K151K487K915
$$ 195871 198057 200168 201605 202498 203345 204486 205975 207832 210131 212772 215374 217651 219802 222289 225204
57348B25204K932K563K216K075J991J974K331L151M000M324L969L212K460K002
$$ 225204 228136 230699 232915 234990 236981 238955 241286 244437 248437 252761 256730 259942 262402 264404
57334B64404J936K125K371K609K882L154L366L592L987M503M959N358N815O180
$$ 264404 266340 268465 270836 273445 276327 279481 282847 286439 290426 294929 299888 305246 311061 317241
57320C17241O088N539N035M965N096M998M702M641M993N442N595N452N364N621
$$ 317241 323329 328868 333903 338868 343964 348962 353664 358305 363298 368740 374335 379787 385151 390772
57306C90772O161O715P187P724Q340Q665Q377P810P759Q532R456R549Q563P314
$$ 390772 396933 403648 410835 418559 426899 435564 443941 451751 459510 468042 477498 487047 495610 502924
57292E02924O946P902R556J0830J1209J1030J0851J0877J1168J1853J2700J2951
$$ 502924 509870 517772 527328 538158 549367 560397 571248 582125 593293 605146 617846 630797
57280F30797J2274J1606J2159J3654J4519J3998J3034J2704J2651J1847J0215
$$ 630797 643071 654677 666836 680490 695009 709007 722041 734745 747396 759243 769458
57269G69458Q683P990Q154Q845R624R928R458Q619Q222Q728R964J1317J2016J1562
$$ 769458 778141 786131 794285 803130 812754 822682 832140 840759 848981 857709 867673 878990 891006 902568
57255I02568J0337R447R598J0363J0952J1228J1488J1722J1793J2011J2664J3206
$$ 902568 912905 922352 931950 942313 953265 964493 975981 987703 999496 1011507 1024171 1037377
57243A037377J2832J1804J1284J1735J2446J2800J3155J3984J4967J5596J6088
$$ 1037377 1050209 1062013 1073297 1085032 1097478 1110278 1123433 1137417 1152384 1167980 1184068
57232A184068J7001J8210J8974J8920J8452J8175J8252J8451J8555J8624J8912
$$ 1184068 1201069 1219279 1238253 1257173 1275625 1293800 1312052 1330503 1349058 1367682 1386594
57221A386594J9479K0020K0198K0171K0574K1928K4232K7150L0256L3056L5143
$$ 1386594 1406073 1426093 1446291 1466462 1487036 1508964 1533196 1560346 1590602 1623658 1658801
57210A658801L6522L7486L8067L7859L6630L4721L2636L0395K7749K4704K1613
$$ 1658801 1695323 1732809 1770876 1808735 1845365 1880086 1912722 1943117 1970866 1995570 2017183
57199B017183J8928J7095J6468J6924J7739J8273J8731J9784K1560K3522K5354
$$ 2017183 2036111 2053206 2069674 2086598 2104337 2122610 2141341 2161125 2182685 2206207 2231561
57188B231561K7376K9820L2255L4056L5115L5645L5615L4868L3586L2110L0386
$$ 2231561 2258937 2288757 2321012 2355068 2390183 2425828 2461443 2496311 2529897 2562007 2592393
57177B592393K8155K5762K4158K3803K4079K4051K3457K2570K1502K0178J8787
$$ 2592393 2620548 2646310 2670468 2694271 2718350 2742401 2765858 2788428 2809930 2830108 2848895
57166B848895J7707J6918J6010J4746J3212J1425R291P076N503N072N548O265
$$ 2848895 2866602 2883520 2899530 2914276 2927488 2938913 2948204 2955280 2960783 2965855 2971403 2977668
57154B977668O682O571N983N277M886M827M652M027L085K021P15r17k617m178
$$ 2977668 2984350 2990921 2996904 3002181 3007067 3011894 3016546 3020573 3023658 3025679 3026394 3025477 3022860 3018682
57140C018682n920q213j0721j2631j3615j4129j4574j4594j3516j1273q553n877
$$ 3018682 3012762 3004549 2993828 2981197 2967582 2953453 2938879 2924285 2910769 2899496 2890943 2885066
57128B885066k774J760P877J4230J9095K1900K3262K3772K3521K2870K2652K3153
$$ 2885066 2882292 2884052 2891929 2906159 2925254 2947154 2970416 2994188 3017709 3040579 3063231 3086384
57116C086384K3555K3116K2310K2086K2500K2955K3497K4985K8154L3315M0875
$$ 3086384 3109939 3133055 3155365 3177451 3199951 3222906 3246403 3271388 3299542 3332857 3373732
57105C373732N1147O3762P8218R5143J16107J42090J73286K10723K56768L13003
$$ 3373732 3424879 3488641 3566859 3662002 3778109 3920199 4093485 4304208 4560976 4873979
57095D873979L78396M50324N26744O06486O88159P69725Q48441R20021R78507
$$ 4873979 5252375 5702699 6229443 6835929 7524088 8293813 9142254 10062275 11040782
57086A1040782J018322J035578J025199R77769Q84298P47882N88591M31784K89091
$$ 11040782 12059104 13094682 14119881 15097650 15981948 16729830 17318421 17750205 18039296
57077A8039296J51937M318j59341l28611m85566o15929p14075p82507q29229q63792
$$ 18039296 18191233 18195551 18036210 17707599 17222033 16606104 15892029 15109522 14280293 13416501
57067A3416501q92596r16466r32310r36357r25620q97843q52376p91643p21000
$$ 13416501 12523905 11607439 10675129 9738772 8813152 7915309 7062933 6271290 5550290
57058E550290o46440n72612n02587m38446l81245l30865k86616k48116k15376
$$ 5550290 4903850 4331238 3828651 3390205 3008960 2678095 2391479 2143363 1927987
57049A927987j88117j65282j45405j27405j11040r6630q4448p4344o5871n8577
$$ 1927987 1739870 1574588 1429183 1301778 1190738 1094108 1009660 935316 869445 810868
57039H10868n2206m6743m2168l8055l3532k8037k2056j6747j2684r312n591p46
$$ 810868 758662 711919 669751 631696 598164 570127 548071 531324 518640 509328 503737 502991
57027E02991N723J4031K3902L4608M5178N3596N5749M6989K6384r67k7076m6510
$$ 502991 508714 522745 546647 581255 626433 680029 735778 782767 809151 808184 781108 734598
57015G34598n8308o3781o4400o1742n7514n2574m6820m0467l4542k9650k5289
$$ 734598 676290 612509 548109 486367 428853 376279 329459 288992 254450 224800 199511
57004A99511k0956j7013j3881j1249q818p020o204n775m959l842k867j847m07
$$ 199511 178555 161542 147661 136412 127594 120574 114370 108595 103636 99794 96927 95080 94673
56991I4673J073J891K165K669L753N231P020R057J0658J0932R781P758N077J645
$$ 94673 95746 97637 99802 102471 106224 111455 118475 127532 138190 149122 158903 166661 171738 173383
56977A73383j989m734o273p287q099q036o653m736l398k691j821l71J339K943
$$ 173383 171394 166660 160387 153100 145001 136965 130312 125576 122178 119487 117666 117295 118634 121577
56963A21577M461O166Q401J1403J4929J8111J9975K0007J8056J4059Q354K025
$$ 121577 126038 132204 140605 152008 166937 185048 205023 225030 243086 257145 265499 267524
56951B67524l656q181j1749j4373j5574j5166j3704j1828r608o949m269k175n41
$$ 267524 263868 255687 243938 229565 213991 198825 185121 173293 163685 156736 152467 150292 149751
56938A49751J416M080P009R785J2762J6496K0656K3972K5147K3501J8927J1788
$$ 149751 151167 155247 162256 172041 184803 201299 221955 245927 271074 294575 313502 325290
56926C25290L176n171j1671j5800j8174j9747k0864k1049j9737j7202j4505j2454
$$ 325290 328466 323295 311624 295824 277650 257903 237039 215990 196253 179051 164546 152092
56914A52092j0882r221p484o183n411m621l439k196j374r12l61M91J409K071K443
$$ 152092 141210 131989 124505 118322 112911 108290 104851 102655 101281 100369 100008 100499 101908 103979 106422
56899A06422K917L974N552O900P429P596Q428J0110J1734J2641J3300J4514J6253
$$ 106422 109339 113313 118865 125765 133194 140790 149218 159328 171062 183703 197003 211517 227770
56886B27770J7773J8415J7704J5168J0732N197k35m759q012r721r952r398q721
$$ 227770 245543 263958 281662 296830 307562 312759 312524 307765 299753 290032 280080 270682 261961
56873B61961p721n834l215n86J901M851Q526J2351J5810J9199K3145K7858L3038
$$ 261961 254240 248406 245191 244605 246506 251357 259883 272234 288044 307243 330388 358246 391284
56860C91284L8020M1586M2081L8210K9767J7761M223q233j7498k3145k6193k7468
$$ 391284 429304 470890 512971 551181 580948 598709 602932 594699 577201 554056 527863 500395
56848E00395k6758k3773j9251j4392r642m638R02O936J3530K0894K8982L7556
$$ 500395 473637 449864 430613 416221 406579 401941 402843 409779 423309 444203 473185 510741
56836E10741M6567N5858O4362P0049P0717O4662N1022L0570O516j6368l4298m6247
$$ 510741 557308 613166 677528 747577 818294 882956 933978 964548 971064 954696 920398 874151
56824H74151n3249n6458n6423n3637m8910m2983l6260k9013k1479j3687n570K583
$$ 874151 820902 764444 708021 654384 605474 562491 526231 497218 475739 462052 456482 459065
56812D59065J0206J7223K4481L2878M2049M9919N3580N0662M0396K4098M843j3703
$$ 459065 469271 486494 510975 543853 585902 635821 689401 740063 780459 804557 809400 795697
56800G95697k8740l9162m5303m8067m8218m6283m2804l8422l3577k8263k2421
$$ 795697 766957 727795 682492 634425 586207 539924 497120 458698 425121 396858 374437
56789C74437j6500j1199o490j402M748J1233J6594K0319K3059K5049K4992K1093
$$ 374437 357937 346738 340248 338846 343594 354827 371421 391740 414799 439848 464840 485933
56777D85933J3035K521p962j6676k3146k7659l0490l1603l0982k9074k6603k3954
$$ 485933 498968 501489 493527 476851 453705 426046 395556 363953 332971 303897 277294 253340
56765B53340k1051j7913j5007j2828j1304r939q372o659n117m087l754l936m139
$$ 253340 232289 214376 199369 186541 175237 165298 156926 150267 145150 141063 137309 133373 129234
56752A29234l991l527k979k469k022j756j779k000k182k162j832j094m7Q64J097
$$ 129234 125243 121716 118737 116268 114246 112490 110711 108711 106529 104367 102535 101441 101394 102258 103355
56737A03355N40l49r35r62p16o40p91q01m62p2K3jK09N17M66J26O2M28P59Q45
$$ 103355 103895 103546 102611 101649 100933 100293 99502 98701 98239 98167 98190 98189 98398 98915 99381 99507 99569 99997 100756 101601
56717A01601J109J763K279K164J718J484J511J611J785J875J340J48p05l52O60
$$ 101601 102710 104473 106752 108916 110634 112118 113629 115240 117025 118900 120240 120388 119683 119331 119991
56702A19991J157R55P68Q02N46j12o66r39j310j802j835j170l42R4R5j91o33q37
$$ 119991 121148 122103 122871 123673 124219 124107 123441 122502 121192 119390 117555 116385 116043 116137 116232 116041 115408 114571
56684A14571m23K25K88k07k54O65J762K016J377M79j65k61K79R92J115O02K62
$$ 114571 114148 114373 114661 114454 114200 114865 116627 118643 120020 120499 120334 120073 120352 121344 122459 123061 123323
56667A23323M79N12l12j435j798j235l86K53N57M45J54L75J417K445K357J228
$$ 123323 123802 124314 124002 122567 120769 119534 119148 119401 119958 120403 120557 120932 122349 124794 127151 128379
56651A28379J44j74Q1M81Q18R02O83O18J227K178K456J622M63M7N53J213J256
$$ 128379 128523 128349 128430 128911 129729 130631 131314 131932 133159 135337 137793 139415 139878 139925 140478 141691 142947
56634A42947O77J92L92R35Q28l02j565j821j055k71k12p23j257j465j212n39K77
$$ 142947 143624 143816 144208 145143 145971 145669 144104 142283 141228 140957 140745 140022 138765 137300 136088 135549 135826
56617A35826R08J304J532J430P38l74j343j780j736j424j002n95k47Q1K37q5p24
$$ 135826 136734 138038 139570 141000 141738 141364 140021 138241 136505 135081 134079 133484 133237 133318 133555 133470 132746
56600A32746p61M48K172K954K375J379P60K06p00j337p32R38K304K302J297N30
$$ 132746 131985 132433 134605 137559 139934 141313 142073 142279 141579 140242 139510 140448 142752 145054 146351 146881
56584A46881P36J447J627Q55k58p99n39l4J52J6k9L39J046J656J786J595J672
$$ 146881 147617 149064 150691 151546 151288 150489 149950 149916 150068 150084 150055 150394 151440 153096 154882 156477 158149
56567A58149K227K672K399J738J631K457L749M946N751N867N115M053L638L928
$$ 158149 160376 163048 165447 167185 168816 171273 175022 179968 185719 191586 196701 200754 204392 208320
56553B08320L884K858J566R75R37P40M58P12J393J657J240P08L05m40j562k112
$$ 208320 212204 215062 216628 217603 218540 219280 219738 220450 221843 223500 224740 225448 225753 225313 223751 221639
56537B21639j446l58o0n38q82q83j259k215k909k735k279k312k510j997q60j97
$$ 221639 220193 219835 219775 219237 218355 217472 216213 213998 211089 208354 206075 203763 201253 199256 198396 198199
56521A98199o29j488j706j053j63K39q0q71j685k181k196j640n32P55J539J507
$$ 198199 197570 196082 194376 193323 193160 193399 193319 192448 190763 188582 186386 184746 184214 184969 186508 188015
56505A88015J113Q70N33m24j650k055j197J24R15R42M29m08j192j395j042q02
$$ 188015 189128 189998 190531 190107 188457 186402 185205 185329 186244 187186 187615 187207 186015 184620 183578 182776
56489A82776r50q94k42L99L48n6j82k30p14j243r39J38J057J369J433J422J049
$$ 182776 181826 180932 180690 181089 181437 181381 181199 180969 180255 179012 178073 178211 179268 180637 182070 183492 184541
56472A84541L92L3J67M08N76R07J286J145M04k98n25m76l32ML01N6n04m07O20
$$ 184541 184933 184966 185133 185541 186117 187024 188310 189455 189859 189561 189036 188560 188228 188232 188533 188589 188085 187678 188298
56453A88298J640J928J931K169K153J266J4o88q58j076j250q09R4O88P58Q19J084
$$ 188298 189938 191866 193797 195966 198119 199385 199399 198711 197853 196777 195527 194718 194812 195500 196258 197077 198161
56436A98161J159Q86O40O24N50L03K24N08P65N77P3l25m43l89k50J8M71J020J390
$$ 198161 199320 200206 200846 201470 202020 202323 202547 203055 203820 204397 204470 204145 203702 203313 203063 203081 203552 204572 205962
56417B05962J291Q04M13M84Q28J007Q88O26L32J32K92Q20J147P43l3k98J34N44
$$ 205962 207253 208057 208470 208954 209782 210789 211677 212303 212635 212767 213059 213879 215026 215769 215736 215438 215572 216116
56399B16116M03Jk18l08m41l91O7O29P98N64L51M15O61Q71Q05K76n25r28m39N53
$$ 216116 216519 216520 216302 215994 215553 215162 215229 215858 216656 217220 217571 217986 218647 219518 220323 220599 220074 219146 218707 219260
56379B19260J155J050P66Q03R94Q79M09o1k25j0N02J094J467J519J472J511J453
$$ 219260 220415 221465 222231 223034 224028 224907 225316 225255 225030 225020 225522 226616 228083 229602 231074 232585 234038
56362B34038J072N57L57N68Q44R45J000J212J573J916J983J442K77q07r00PR18
$$ 234038 235110 235667 236024 236592 237436 238381 239381 240593 242166 244082 246065 247507 247784 246977 246077 246084 247002
56345B47002J109R93J301J948K293K163J923J724J425J134J186J466J441R66N18
$$ 247002 248111 249104 250405 252353 254646 256809 258732 260456 261881 263015 264201 265667 267108 268074 268592
56330B68592M07L32Qk30J90J263K310K594J957R62M11N85J032J183J009Q21P42
$$ 268592 268999 269331 269339 269109 269299 270562 272872 275466 277423 278385 278796 279381 280413 281596 282605 283426 284168
56313B84168P88J182J943K381J760M96j19M63J437J909J989K176K403K319K070
$$ 284168 284956 286138 288081 290462 292222 292718 292599 293062 294499 296408 298397 300573 302976 305295 307365
56298C07365K121K510K830K844K716K617K455K023J338Q32J092K164L265L570
$$ 307365 309486 311996 314826 317670 320386 323003 325458 327481 328819 329651 330743 332907 336172 339742
56284C39742L198K913K966K908K598K564L128L912M571N337O370P192P298O896
$$ 339742 342940 345853 348819 351727 354325 356889 360017 363929 368500 373837 380207 387399 394697 401593
56270D01593O537O404O374O360O247N889N453N258N067M263L062K703L822N471
$$ 401593 408130 414534 420908 427268 433515 439404 444857 450115 455182 459445 462507 465210 469032 474503
56256D74503O468P001P980R540J1216J3095J5617J8480K0901K2799K4793K7074
$$ 474503 480971 487972 495952 505492 516708 529803 545420 563900 584801 607600 632393 659467
56244F59467K9289L1513L4254L7341L9717M0752M0908M0786M0052L7840L3883
$$ 659467 688756 720269 754523 791864 831581 872333 913241 954027 994079 1031919 1065802
56233A065802K8896K3877J9131J3936P455l9p236j3356j8914k4423k9086l1803
$$ 1065802 1094698 1118575 1137706 1151642 1159097 1159058 1151822 1138466 1119552 1095129 1066043 1034240
56221A034240l2958l3990l5334l5988l5213l3550l1823l0146k8358k6604k4948
$$ 1034240 1001282 967292 931958 895970 860757 827207 795384 765238 736880 710276 685328
56210F85328k3089k0951j8983j7436j5863j3880j1944j0745j0164r359p849o009
$$ 685328 662239 641288 622305 604869 589006 575126 563182 552437 542273 532914 525065 519056
56198E19056m488l543l055k838k697k280j301J0R13Q94L02q1N9M74R30J327J317
$$ 519056 514568 511025 507970 505132 502435 500155 498854 498864 499777 500671 500973 500892 500951 501425 502355 503682 504999
56181E04999O45j32q7P06J181R45Q38J372J774J428J115J748K832L416L694M335
$$ 504999 505644 505512 505425 506131 507312 508257 509095 510467 512241 513669 514784 516532 519364 522780 526474 530809
56165E30809M912M643M090M470N542N904N319N095N929P036P730Q379R322J0155
$$ 530809 535721 540364 544454 548924 554466 560370 565689 570784 576713 583749 591479 599858 609180 619335
56151F19335J0619J1135J1913J2587J3067J3800J4844J5792J6845J8739K1241
$$ 619335 629954 641089 653002 665589 678656 692456 707300 723092 739937 758676 779917
56140G79917K2975K3322K3279K3828K4679K5421K6889L0404L6422M4605N4358
$$ 779917 802892 826214 849493 873321 898000 923421 950310 980714 1017136 1061741 1116099
56129A116099O4444P2900P8167P9920P8295P3262O5483N6928M9588M3956L9384
$$ 1116099 1180543 1253443 1331610 1411530 1489825 1563087 1628570 1685498 1735086 1779042 1818426
56118A818426L5210L0725K4768J6646P359j066p444j2082j5721j8706k1334k4482
$$ 1818426 1853636 1884361 1909129 1925775 1933134 1932068 1924624 1912542 1896821 1878115 1856781 1832299
56106A832299k9356l6555m5371n4077o1047o5590o7670o7293o4581o0131n4596
$$ 1832299 1802943 1766388 1721017 1666940 1605893 1540303 1472633 1405340 1340759 1280628 1226032
56095A226032m8115m0820l3615k7585k2730j8185j3580r333n673k444R1J428J882
$$ 1226032 1177917 1137097 1103482 1075897 1053167 1034982 1021402 1012069 1006396 1003952 1004043 1005471 1007353
56082A007353K435L373M121M584N440O908Q319R309J0264J1288J1884J2017J2384
$$ 1007353 1009788 1013161 1017282 1021866 1027306 1034214 1042533 1051842 1062106 1073394 1085278 1097295 1109679
56069A109679J3216J3956J4402J5073J6039J6667J6929J7628J8917J9829J9901
$$ 1109679 1122895 1136851 1151253 1166326 1182365 1199032 1215961 1233589 1252506 1272335 1292236
56058A292236J9877K0311K0700K0611K0404K0241J9635J8631J8115J8387J8644
$$ 1292236 1312113 1332424 1353124 1373735 1394139 1414380 1434015 1452646 1470761 1489148 1507792
56047A507792J8464J8460J9015J9740K0650K2335K4513K6062K6946K8304L0143
$$ 1507792 1526256 1544716 1563731 1583471 1604121 1626456 1650969 1677031 1703977 1732281 1762424
56036A762424L1080L1038L1768L3791L5299L5414L5979L8388M1075M2271M3055
$$ 1762424 1793504 1824542 1856310 1890101 1925400 1960814 1996793 2035181 2076256 2118527 2161582
56025B161582M5312M8487N0784N2125N3650N5487N7192N9187O1807O4162O5729
$$ 2161582 2206894 2255381 2306165 2358290 2411940 2467427 2524619 2583806 2645613 2709775 2775504
56014B775504O7752P1218P4994P7920Q1085Q5841R1163R5263R8471J02110J05970
$$ 2775504 2843256 2914474 2989468 3067388 3148473 3234314 3325477 3420740 3519211 3621321 3727291
56003C727291J09251J12754J17703J23668J29858J37117J46328J56270J65430
$$ 3727291 3836542 3949296 4066999 4190667 4320525 4457642 4603970 4760240 4925670
55994D925670J74495J84730J95631K06592K19094K34458K51312K68124K86275
$$ 4925670 5100165 5284895 5480526 5687118 5906212 6140670 6391982 6660106 6946381
55985F946381L07674L31328L55669L82161M13052M47515M83845N23487N68938
$$ 6946381 7254055 7585383 7941052 8323213 8736265 9183780 9667625 10191112 10760050
55976A0760050O19617O74196P35186Q06764Q89810R83718J091344J217520J364649
$$ 10760050 11379667 12053863 12789049 13595813 14485623 15469341 16560685 17778205 19142854
55967A9142854J535001J735560J975477K261071K599228L003812L492552M079850
$$ 19142854 20677855 22413415 24388892 26649963 29249191 32253003 35745555 39825405
55959C9825405M778853N608086O589915P748120R118524J0761533J2756656J5189257
$$ 39825405 44604258 50212344 56802259 64550379 73668903 84430436 97187092 112376349
55951A12376349J8147832K1701456K5796816L0077429L3734254L5542178L4184101
$$ 112376349 130524181 152225637 178022453 208099882 241834136 277376314 311560415
55944C11560415K8820858J9652495Q073606l811296j4075056k1660789k6458255
$$ 311560415 340381273 360033768 368107374 364296078 350221022 328560233 302101978
55937C02101978k8894739k9503793k8752799k7050742k4757809k2162090j9478064
$$ 302101978 273207239 243703446 214950647 187899905 163142096 140980006 121501942
55930A21501942j6867996j4446901j2275107j0369697q729050p341935o183503
$$ 121501942 104633946 90187045 77911938 67542241 58813191 51471256 45287753
55923D5287753n220730m424733l771478l234614k787830k413469k101307j840171
$$ 45287753 40067023 35642290 31870812 28636198 25848368 23434899 21333592 19493421
55915A9493421j617636j426371j263628j124922j003965q97943q07157p29665
$$ 19493421 17875785 16449414 15185786 14060864 13056899 12158956 11351799 10622134
55907A0622134o61188n99886n46595n00616m59440m22296l90088l62025l35912
$$ 10622134 9960946 9361060 8814465 8313849 7854409 7432113 7042025 6680000 6344088
55898F344088l11526k90276k71770k53912k36209k19936k05244j91076j77775
$$ 6344088 6032562 5742286 5470516 5216604 4980395 4760459 4555215 4364139 4186364
55889D186364j66984j58789j51413j43670j35612j26915j16850j05866r5375q6100
$$ 4186364 4019380 3860591 3709178 3565508 3429896 3302981 3186131 3080265 2984890 2898790
55879B898790p8236p2673p0202o9927p0162p0483p1310p2158p2089p1250p0307
$$ 2898790 2820554 2747881 2677679 2607752 2537590 2467107 2395797 2323639 2251550 2180300 2109993
55868B109993o8871o6169o2655n9341n6221n2941n0103m8192m6043m2364l8031
$$ 2109993 2041122 1974953 1912298 1852957 1796736 1743795 1693692 1645500 1599457 1557093 1519062
55857A519062l4985l3421l2071l0614k9732k9224k8183k6823k6199k6248k5904
$$ 1519062 1484077 1450656 1418585 1387971 1358239 1329015 1300832 1274009 1247810 1221562 1195658
55846A195658k5034k4508k4482k4258k3740k3413k3006k1816k0216j9250j8852
$$ 1195658 1170624 1146116 1121634 1097376 1073636 1050223 1027217 1005401 985185 965935 947083
55835I47083j8031j6737j5836j5312j4163j2210j0425r274q239p204o857p396
$$ 947083 929052 912315 896479 881167 867004 854794 844369 835095 826856 819652 812795 805399
55823H05399q113q570r058r696j0162j0471j1010j1616j1599j0815r802q876q010
$$ 805399 797286 788716 779658 769962 759800 749329 738319 726703 715104 704289 694487 685611 677601
55810F77601p466p498p538o728n224l835k575p20J608L297L853M081M771N668
$$ 677601 670135 662637 655099 648371 643147 639312 636737 636017 637625 640922 644775 648856 653627 659295
55796F59295O026N484M138K419J016K64m16j897m163o257p268o956n725m584m722
$$ 659295 665321 670805 674943 677362 678378 678642 678226 676329 672166 665909 658641 651685 645960 641376 636654
55781F36654o348q372r768j0757j1932j3014j3472j3615j3838j3420j1465q559
$$ 636654 630306 621934 612166 601409 589477 576463 562991 549376 535538 522118 510653 502094
55769E02094o122m476k976j686j352j858k260k374k855l693m104m181n123p475
$$ 502094 495972 491496 488520 486834 485482 483624 481364 478990 476135 472442 468338 464157 459034 451559
55755D51559j0314j2536j3807j3993j2879j0850q830p171n451l537j936r11k37
$$ 451559 441245 428709 414902 400909 388030 377180 368350 361179 355728 352191 350255 349344 349107
55742C49107N6k86r25j101p87n85m87J40J140J431N22q65j992k777l125k800k352
$$ 349107 349163 348877 347952 346851 346064 345479 344992 345132 346272 347703 348225 347360 345368 342591 339466 336666 334314
55725C34314k866m269n122m615l698l581m127m507m475m247l789l028k244j643
$$ 334314 331448 327179 322057 317442 313744 310163 306036 301529 297054 292807 289018 285990 283746 282103
55711B82103r81j7J075K065K917L504L575L198K693K000Q21o50j810k567l312
$$ 282103 281122 281105 282180 284245 287162 290666 294241 297439 300132 302132 302953 302303 300493 297926 294614
55696B94614m035m332m308m469m583l821k270j144j072j257p62L56J650K969M020
$$ 294614 290579 286247 281939 277470 272887 269066 266796 265652 264580 263323 262561 262917 264567 267536 271556
55681B71556M175L342K353J935J988K101J970J142o43k494k957j932r47j007j407
$$ 271556 275731 279073 281426 283361 285349 287450 289420 290562 289919 287425 284468 282536 281589 280582 279175
55666B79175j279r85j074j032j96R90J713K060K550L085L289L359L693M123M312
$$ 279175 277896 276911 275837 274805 274609 275599 277312 279372 281922 285007 288296 291655 295348 299471 303783
55651C03783M386M509M415L963L534L182K209L28j529k494l054m085n315n873
$$ 303783 308169 312678 317093 321056 324590 327772 329981 330309 328780 326286 323232 319147 313832 307959
55637C07959n832n973o378o438o054n796n958o254o395o182n289l729k300j805
$$ 307959 302127 296154 289776 283338 277284 271488 265530 259276 252881 246699 241410 237681 235381 233576
55623B33576j974j925j497j300j604j967j949j544r41l69j78n04r89j221j296
$$ 233576 231602 229677 228180 226880 225276 223309 221360 219816 218875 218506 218328 217824 216835 215614 214318
55608B14318j521j860k066k104k015j748j472j575j906j742j033r19k123l539
$$ 214318 212797 210937 208871 206767 204752 203004 201532 199957 198051 196309 195276 194357 192234 188695
55594A88695l518k106q05m16l29N7M47L96O2j23L8M34O80L27m64o83L77J994K838
$$ 188695 185177 183071 182266 181850 181521 181578 182025 182421 182483 182360 182398 182832 183512 183839 183375 182692 183069 185063 187901
55575A87901K671K418K641K969L062L191L551L778L467K660J607N38k31m47k90
$$ 187901 190572 192990 195631 198600 201662 204853 208404 212182 215649 218309 219916 220454 220223 219776 219486
55560B19486j61k15m85j264k679m069m543m093l425k822k001j071o21p31q24p48
$$ 219486 219325 219110 218625 217361 214682 210613 206070 201977 198552 195730 193729 192658 192037 191306 190482 189734
55544A89734j137k253l297l316k302r51Q7M30kp25r93o24r8L40R88J827K123J428
$$ 189734 188597 186344 183047 179731 177429 176478 176565 176995 176993 176268 175275 174651 174553 174893 175881 177708 179831 181259
55526A81259L68j83k14k67m81n89n21l50R5Q61J289O22q00j688j368o03m71r78
$$ 181259 181627 181444 181230 180963 180482 179893 179372 179022 179117 179978 181267 181889 181089 179401 178033 177430 176959 175981
55508A75981j229p72j49r6n96j090j315j519j856j966j459n67L4l7m71o35j57
$$ 175981 174752 173980 173831 173735 173139 172049 170734 169215 167359 165393 163934 163367 163401 163364 162893 162258 162101
55491A62101P69J455J238J10j151j718j452q03k04K01L67L23K61L36L72J26k45
$$ 162101 162870 164325 165563 165673 164522 162804 161352 160549 160345 160546 160913 161236 161497 161833 162205 162331 162086
55474A62086l90l45n15r71j247r68l62R3K27K04J92K67M51P39J108J548J969K073
$$ 162086 161696 161351 160836 159865 158618 157650 157288 157381 157608 157812 158004 158271 158722 159461 160569 162117 164086 166159
55456A66159J594O73k25p52q70o73l09r5l70j095j785j947j437m93L48M93j43
$$ 166159 167753 168426 168201 167449 166579 165906 165597 165502 165132 164037 162252 160305 158868 158375 158723 159216 159073
55439A59073q42p98j24L18J49p1J49M06J34l67k59O74J761K322K253J750J019
$$ 159073 158231 157433 157309 157627 157776 157705 157854 158260 158394 158027 157768 158442 160203 162525 164778 166528 167547
55422A67547L58J43M96J119J629J811J591J048N69N92J009J128N32l04o47m98
$$ 167547 167905 168048 168544 169663 171292 173103 174694 175742 176311 176903 177912 179040 179572 179268 178621 178123
55406A78123m27n89n77l25m77j457k725l397l270k754k111j416j029j382k198
$$ 178123 177696 177107 176530 176205 175728 174271 171546 168149 164879 162125 160014 158598 157569 156187 153989
55391A53989k554j912p31J19K07k62p37o72J6P73R07L88j75l40k32q9R5L45N72
$$ 153989 151435 149523 148792 148911 149118 148856 148119 147447 147463 148236 149143 149531 149356 149016 148784 148695 148790 149135 149707
55372A49707P61R19Q04K46k86l6Q89J486J228P67Q52J236J208O36q8p02j100j140
$$ 149707 150468 151387 152191 152437 152151 152115 153004 154490 155718 156485 157337 158573 159781 160417 160329 159627 158527 157387
55354A57387r46r41j087o74N85J742J670N08o30j077r43m68J05K52l35j097j175
$$ 157387 156441 155500 154413 153739 154324 156066 157736 158244 157614 156537 155594 155126 155231 155483 155148 154051 152876
55337A52876n37J19M23N64O14M17J02NO2k9j64p3L1k01l76J89J210J588R76K44
$$ 152876 152339 152458 152881 153445 154059 154476 154578 154583 154645 154616 154452 154379 154410 154209 153833 154022 155232 156820 157796 158040
55317A58040J72N17P33P29N67J26m64p05l55K33O59Q41O60m4q98j128n64Rm8m22
$$ 158040 158212 158729 159462 160191 160758 160884 160420 159715 159360 159593 160252 161093 161753 161709 160811 159683 159119 159128 159080 158658
55297A58658m92k68k01m59p71p78k93M88R88Q66N57O96J016O22n73j538j554j051
$$ 158658 158166 157898 157697 157238 156467 155689 155396 155884 156872 157738 158295 158991 160007 160629 160056 158518 156964 155913
55279A55913o08p9O85J113P57K20L59R57J123O79L19M34N73J75p07j550j884j595
$$ 155913 155305 155226 155911 157024 157781 158001 158360 159317 160440 161119 161438 161872 162445 162620 161913 160363 158479 156884
55261A56884r41l32R4M83Q93J116J003O64J98l77p91o18P1N91N37L19M40P06O25
$$ 156884 155943 155611 155705 156188 157081 158197 159200 159864 160062 159685 158894 158276 158347 158938 159475 159794 160234 160940 161565
55242A61565J60l30o26o25j79O01J140R76L10l56q37j091q98k02M75N52J77l6
$$ 161565 161725 161395 160769 160144 159965 160566 161706 162682 162992 162636 161799 160708 159810 159608 160083 160635 160812 160776
55224A60776J25L15K34o5l81m93j76M58Q50N64j13n14l87m2J49O2j74k43P9M98
$$ 160776 160901 161216 161450 161385 161004 160511 160335 160793 161643 162207 162094 161580 161193 161151 161300 161362 161188 160945 161024 161522
55204A61522L86l18p58k15R13J645J601J104M38k62o68n05j25j94p70j218j051
$$ 161522 161908 161590 160832 160617 161530 163175 164776 165880 166318 166056 165388 164883 164758 164564 163794 162576 161525
55187A61525l91L25O73M41r5k28K65N72j83j582k358k110j625j455j093J5J431
$$ 161525 161134 161459 162132 162573 162478 162250 162515 163087 162904 161322 158964 156854 155229 153774 152681 152696 154127
55170A54127K273K237J626Q17J98J60O69J073Q61M61Q13K159L629M079L167J578
$$ 154127 156400 158637 160263 161080 161278 161438 162107 163180 164041 164502 165315 167474 171103 175182 178349 179927
55154A79927K59m61r76j627k103j904j247r66j469k200k369j784q05J54P77P85
$$ 179927 180186 179725 178749 177122 175019 173115 171868 170902 169433 167233 164864 163080 162275 162429 163206 163991
55138A63991K06n06r12j052j146j038l47P76J550J399O73K33M91J006J064M12
$$ 163991 164197 163691 162779 161727 160581 159543 159196 159972 161522 162921 163594 163827 164318 165324 166388 166800
55122A66800n57j227j276r16o29o76p66l67O26J647K020J608Q35J53k73m38l77
$$ 166800 166243 165016 163740 162824 162195 161519 160753 160386 161012 162659 164679 166287 167122 167275 167002 166564 166187
55105A66187j45J83N29O78L64k50m52K30J229J511R51M42N37P37M33j21l45k12
$$ 166187 166042 166225 166754 167432 167796 167546 167094 167324 168553 170064 171015 171457 171994 172731 173164 173043 172698 172486
55087A72486m7J71N64P68K90p13j581j990k077j854j190l21K06K47J71J85P5k49
$$ 172486 172439 172610 173174 173942 174232 173519 171938 169948 167871 166017 164827 164506 164712 164959 165130 165315 165390 165141
55069A65141l94L1Q97J691J976J636Q95J51l50o68q35o03K10J235J819J706J115
$$ 165141 164747 164778 165675 167366 169342 170978 171873 172024 171674 171006 170171 169568 169778 171013 172832 174538 175653
55052A75653K96n72j185j297j067p94m41R4M06J7o61n96M29J383J331N52j10l68
$$ 175653 175949 175377 174192 172895 171828 171034 170593 170687 171093 171110 170449 169853 170282 171665 172996 173548 173438 173070
55034A73070m56m60l17j78k00j55L00J072J730J961J635O75o46j526j317l74K94
$$ 173070 172614 172154 171837 171659 171459 171304 171604 172676 174406 176367 178002 178677 178031 176505 175188 174814 175108
55017A75108K17j41j88Q9L68M80L74m8o78j070q91m35k92n30n66M0R41J381J019
$$ 175108 175325 175184 174996 175085 175453 175933 176307 176259 175581 174511 173620 173185 172893 172363 171797 171837 172778 174159 175178
54998A75178J67o52j056q38p4P55J077R04Q86J444K139K230J652J020P27N59K23
$$ 175178 175345 174693 173637 172799 172725 173480 174557 175461 176347 177791 179930 182160 183812 184832 185559 186118 186341
54981A86341j49k69j46k6p1k87o52j108j523j730j588r28K75J578K136J490K36
$$ 186341 186192 185923 185777 185751 185680 185393 184741 183633 182110 180380 178792 177864 178139 179717 181853 183343 183579
54964A83579l74L18J673K429J949O68n20j047r02m19o0j00k99p0P32J381J082
$$ 183579 183205 183523 185196 187625 189574 190242 189722 188675 187773 187354 187294 187194 186895 186825 187557 188938 190020
54947A90020R7m94j64M53N68K26m2r5q3R9O84J379J540J040M92M76Q98J250J212
$$ 190020 190117 189623 189459 189912 190480 190706 190664 190569 190486 190585 191269 192648 194188 195228 195720 196196 197094 198344 199556
54928A99556Q46M45L72Q30J675K542L230L835M516N287O108O924P514P463O560
$$ 199556 200402 200847 201219 202049 203724 206266 209496 213331 217847 223134 229242 236166 243680 251143 257703
54913B57703N135L776K635J240p96l042m574n067n107n252n336n062m791m938
$$ 257703 262838 266614 269249 270489 269693 266651 262077 257010 251903 246651 241315 236253 231462 226524
54899B26524m983m123k780k316l004l443k499q26L13P38R71J008O42M43J163K342
$$ 226524 221541 217418 214638 212322 209318 205875 203376 202550 202863 203601 204572 205580 206222 206665 207828 210170
54883B10170K731K001J075P89J159J979L173M376N063N287N573O003O071N508
$$ 210170 212901 214902 215977 216766 217925 219904 223077 227453 232516 237803 243376 249379 255450 260958
54869B60958M489L026R90j202k795l691m413n011n004m495m293m563m480l659
$$ 260958 265447 268473 269463 268261 265466 261775 257362 252351 247347 242852 238559 233996 229516 225857
54855B25857k890k854l055k770k193j856j627j128n23j82k5Q3j66r18j531j337
$$ 225857 222967 220113 217058 214288 212095 210239 208612 207484 206961 206779 206754 206837 206671 205753 204222 202885
54839B02885o02j09j26m08q00j137j042m80j01l23n47p0P54J096R72R87J040M76
$$ 202885 202283 202174 202048 201640 200840 199703 198661 198181 198080 197757 197210 197140 197894 198990 199962 200949 201989 202465
54821B02465o51j459j468j052o29k42l4k42n89n04p2N7j42R4J009J691J302K25
$$ 202465 201814 200355 198887 197835 197206 196964 196930 196688 196099 195595 195523 195580 195438 195532 196541 198232 199534 199759
54803A99759n44o20l17M8L61M59K01k62n24k59M81J102P91o32k138k401j316j18
$$ 199759 199215 198595 198278 198326 198687 199146 199347 199085 198561 198302 198783 199885 200676 200044 197906 195505 194189 194071
54785A94071J52k26l08L29J357K193K356J792J131J190J888K189J529P54J024
$$ 194071 194223 193997 193689 194018 195375 197568 199924 201716 202847 204037 205925 208114 209643 210397 211421
54770B11421K298L622M534N340O166O722P058P659Q485Q591P285N173L544K948
$$ 211421 213719 217341 221875 227215 233381 240103 247161 254820 263305 271896 279181 284354 287898 290846
54756B90846K690J649o63l653o037o822o196n294n011n224n313n117m948m924
$$ 290846 293536 295185 294522 290869 284832 278010 271814 266520 261509 256285 250972 245855 240907 235983
54742B35983m723m028k927j804j059r31j233j367q53Q1P19O88L04M0N2L46R66
$$ 235983 231260 227232 224305 222501 221442 220511 219278 217911 217058 217139 217858 218546 218850 218890 218942 219288 220254
54725B20254J817K587L119L646M354N035N376N360N107M549L711K986K675K369
$$ 220254 222071 224658 227777 231423 235777 240812 246188 251548 256655 261204 264915 267901 270576 272945
54711B72945J324n60k577m092n107n830o142n789m877l882l266l179l418l637
$$ 272945 274269 273709 271132 267040 261933 256103 249961 244172 239295 235413 232147 228968 225550 221913
54697B21913l600l285k706j823p51J02L93K39rk84p83j465j910j714q82J78Q97
$$ 221913 218313 215028 212322 210499 209748 209850 210243 210482 210473 210189 209406 207941 206031 204317 203435 203613 204510
54680B04510R45N75L29K83m3p62j100m75M61N93n7m62j80K26L95P13J271J288
$$ 204510 205455 206030 206359 206642 206599 205837 204737 204262 204723 205316 205259 204797 204617 204843 205238 205951 207222 208510
54662B08510K67j072j570r85k0N97O41L60K08M25O52L58l20p16o55o23p69n88
$$ 208510 208777 207705 206135 205150 205130 205727 206368 206728 206936 207361 208013 208371 208051 207335 206680 206057 205288 204700
54644B04700JK63j70n35j19N81O47J25k60k77k66l80m73n13m61r6M55N05k69j087
$$ 204700 204701 204964 204794 204259 204140 204721 205368 205493 205233 204956 204690 204310 203837 203324 202863 202767 203222 203727 203458 202371
54624B02371j041l19K53M39N09M15K8j85K45P99O62J64L88J404K036J536M09n83
$$ 202371 201330 201011 201264 201703 202212 202627 202655 202470 202715 203514 204176 204340 204728 206132 208168 209704 210113 209530
54606B09530j260j589j353o80j18J39M09P34O52Q3l10o5L54K43m41j193j581j448
$$ 209530 208270 206681 205328 204648 204530 204669 205078 205812 206464 206547 206237 206172 206526 206769 206328 205135 203554 202106
54588B02106q28K1O86Q51M15m50j149r86n2N51J02o08l82N12P48M3n10l17p2l30
$$ 202106 201278 201299 201985 202836 203251 202801 201652 200666 200614 201165 201267 200659 200277 200789 201537 201580 201070 200753 200681 200351
54568B00351n54k88j01n19r51o22J33M56K85J95L15K72L6j5K43M99M79K20m9n2
$$ 200351 199797 199509 199408 198889 197938 197316 197449 197905 198190 198385 198700 198972 199008 198993 199236 199735 200214 200434 200385 200333
54548B00333L15P47P49K76k27m76o04o37l41K23O41Q36J151J444J024p7o89p9
$$ 200333 200648 201395 202144 202420 202193 201717 201113 200476 200135 200358 200999 201835 202986 204430 205454 205377 204688 204609
54530B04609Q86R95M27J85M27M46L2k00J24O25Q02N32L0k58J21R81J447J091O89
$$ 204609 205495 206490 206917 207102 207529 207975 208007 207807 207931 208556 209358 209890 209920 209662 209783 210764 212211 213302 213991
54511B13991J068J673J317Q7p46n75j49j64l43l03k81n02n67j76K13M2n01r07
$$ 213991 215059 216732 218049 218136 217390 216815 216666 216502 216159 215856 215575 215073 214506 214330 214543 214585 214084 213177
54493B13177j177j549j707j019L82J401J134q5j067j075m62j6J8mJ16J04j67l13
$$ 213177 212000 210451 208744 207725 208107 209508 210642 210557 209490 208415 207953 207937 207955 207951 208067 208171 208004 207691
54475B07691m3K54R7k15K0P73J272J141Q57Q24P18J67m55n09l4L10J60j37m9N04
$$ 207691 207648 207902 207999 207784 207804 208577 209849 210990 211847 212671 213389 213556 213101 212592 212558 212868 213028 212891 212842 213346
54455B13346J063J015O4j399k438k311j163J22Q27R76R81R31N39k60r72j051n78
$$ 213346 214409 215424 215488 214089 211651 209340 208177 208299 209126 210102 211083 212014 212553 212293 211321 210270 209692
54438B09692j59j79m04l75O4O94J141J085M71k68n03r9M12N47M96P21J182J354
$$ 209692 209533 209354 208950 208575 208639 209333 210474 211559 212030 211762 211259 211160 211572 212119 212615 213336 214518 215872
54420B15872R84M51L11P12J266J387P74k73j087j284j068q05n61k57K2J70K99
$$ 215872 216856 217307 217618 218330 219596 220983 221757 221484 220397 219113 218045 217240 216679 216422 216444 216614 216913
54403B16913M81M45q6q28j161q60k65K34N07M88J74j83j92K02O90J102J519J861
$$ 216913 217394 217839 217753 216925 215764 214904 214639 214873 215380 215868 216042 215859 215667 215869 216559 217661 219180 221041
54385B21041J762J071K14k29q5L94Q67J101J014P17M44L17K73K76M08O91R34R10
$$ 221041 222803 223874 224088 223859 223774 224168 225035 226136 227150 227867 228311 228628 228901 229177 229585 230276 231210 232120
54367B32120N79J06k56k79O8N02O52M14Q8N4M08R09J181J046O24J42l63r95j567
$$ 232120 232699 232805 232549 232270 232338 232840 233492 233906 233994 234048 234456 235365 236546 237592 238216 238358 237995 237000 235433
54348B35433j531o27N45J024N01m01r00q15n51n80r90j416j380q49k97r1K2M01
$$ 235433 233902 233275 233820 234844 235345 234944 234044 233229 232678 232098 231108 229692 228312 227463 227166 227075 227097 227498
54330B27498P09K37r52j824j582n95J76K62j62p88j315j319n76M87J108J092R68
$$ 227498 228207 228444 227492 225668 224086 223491 223667 223929 223767 222979 221664 220345 219769 220256 221364 222456 223424
54313B23424J195J544J592J406J412J710J927J816J567J395J128N10k50o41n27
$$ 223424 224619 226163 227755 229161 230573 232283 234210 236026 237593 238988 240116 240626 240376 239735 239208
54298B39208l47n43j024j345j229p76l10j00j35q6L15Q84J130Q67L77Lj07K03
$$ 239208 238861 238318 237294 235949 234720 233944 233634 233534 233399 233313 233628 234512 235642 236509 236886 236889 236782 236985
54280B36985J105K255K729J920K63j218j924j921j497r84p92j072j370j094k66
$$ 236985 238090 240345 243074 244994 245257 244039 242115 240194 238697 237713 236921 235849 234479 233385 233119
54265B33119N19Q25O72K27l51p76q85r16j171j343q09L75J323J343O36j90q18
$$ 233119 233638 234463 235135 235362 235011 234235 233350 232434 231263 229920 229111 229486 230809 232152 232788 232598 231780
54248B31780j201j224q01r0O43J191J367J036L31m04r59j280j179m43O40J307
$$ 231780 230579 229355 228554 228464 229107 230298 231665 232701 233032 232628 231669 230389 229210 228767 229407 230714
54232B30714J108L91k07l91k28J36M82O19O82R93J391J176J42q15o98K03O19j4
$$ 230714 231822 232213 232006 231615 231387 231523 232005 232624 233306 234299 235690 236866 237008 236193 235495 235698 236317 236303
54214B36303q45p44L73J686K486K591J942M72j398k634k511j507p62o64n64p6
$$ 236303 235458 234714 235087 236773 239259 241850 243792 244264 242866 240232 237721 236214 235452 234788 234224 234148
54198B34148J97k61p43k44Q78J184K02r38j170q07o76p45m37J92M49N6m80o00
$$ 234148 234345 234084 233341 233097 233975 235159 235361 234423 233253 232446 231770 231025 230588 230780 231229 231285 230805 230205
54180B30205l39j54l41p05p35j85N27P93O28N59P37P02K45j16J00O15Q79Q28O76
$$ 230205 229866 229712 229371 228666 227931 227746 228273 229066 229694 230253 230990 231692 231937 231821 231921 232536 233415 234243 234919
54161B34919M34Q6j45k08m33q57r27n12m52j246j778o73J456K545J880R06R48
$$ 234919 235353 235439 235294 235086 234653 233796 232869 232357 231905 230659 228881 228208 229664 232209 234089 234995 235943
54144B35943J482J451J002R33J146Q44p8q25p77j08O61J137J172R30P86Q29O45
$$ 235943 237425 238876 239878 240811 241957 242801 242723 241898 241121 241013 241674 242811 243983 244913 245699 246528 247173
54127B47173Qm88l2J310K635L242L165K708K024J290P55M25P3l01l70QN09P22
$$ 247173 247181 246693 246661 247971 250606 253848 257013 259721 261745 263035 263790 264215 264288 263987 263617 263625 264134 264856
54109B64856N31j1p57j277j049j57O60R48J167J824K420K013O40n76q57o12o21
$$ 264856 265387 265376 264619 263342 262293 262136 262796 263744 264911 266735 269155 271168 271808 271232 270375 269763 269142
54092B69142j018j421j561j344p49j13r6q63j611j511q18m07m85n05k36j09l32
$$ 269142 268124 266703 265142 263798 263049 262936 262840 261977 260366 258855 258037 257630 257145 256640 256404 256295 255963
54075B55963n09m08l65n64n24J30R57J314J271J328J529J498J128O94L32J2j16
$$ 255963 255454 255046 254681 254117 253593 253723 254680 255994 257265 258593 260122 261620 262748 263442 263774 263786 263670
54058B63670J65O75R39P89M78K77L42Q48J779K640K901K659K409K176J637J051
$$ 263670 263835 264510 265449 266238 266716 266993 267335 268183 269962 272602 275503 278162 280571 282747 284384 285435
54042B85435J252K402L564L987M150M845N846O270N986N741O004O481O906P473
$$ 285435 286687 289089 292653 296640 300790 305635 311481 317751 323737 329478 335482 341963 348869 356342
54028C56342Q136Q179P062N332M077L641L328K398R36l74r81q38l33q4o16j919
$$ 356342 364478 372657 379719 385051 389128 392769 396097 398495 399431 399057 398076 397238 396905 396821 396205 394286
54012C94286l332m138m200l978l947m244m784n411n860n900n590n186m696l857
$$ 394286 390954 386816 382616 378638 374691 370447 365663 360252 354392 348492 342902 337716 333020 329163
53998C29163k773k056k039k172j771j093r88j553j884j340m26m3k83n00k59J86
$$ 329163 326390 324334 322295 320123 318352 317259 316271 314718 312834 311494 311068 311025 310742 310242 309983 310169
53982C10169K57m08j640k780l113k610k025k022k385k384j792j077o98o06o26
$$ 310169 310426 310018 308378 305598 302485 299875 297850 295828 293443 291059 289267 288190 287492 286886 286260
53967B86260p91j134j313q49L05J541K089J695Q77M55P69J370J590J273Q40O35
$$ 286260 285469 284335 283022 282173 282478 284019 286108 287803 288680 289135 289904 291274 292864 294137 294977 295612
53951B95612N37L10J58N79J663K778L120K586J910J847K322K651K471K170K277
$$ 295612 296149 296459 296617 297196 298859 301637 304757 307343 309253 311100 313422 316073 318544 320714 322991
53936C22991K707K922K692K437K745L743M990N883O175O201O547P451Q530R161
$$ 322991 325698 328620 331312 333749 336494 340237 345227 351110 357285 363486 370033 377484 386014 395175
53922C95175R077Q475P745P207P019P150P390P573P685P693P473P036O668O476
$$ 395175 404252 412727 420472 427679 434698 441848 449238 456811 464496 472189 479662 486698 493366 499842
53908D99842O122N324M472M133M049L286J568k21j204j643k381l540m456m705
$$ 499842 505964 511288 515760 519893 523942 527228 528796 528575 527371 525728 523347 519807 515351 510646
53894E10646m589m658n110n865o787p705q474r109r709j0195j0300r828q921p982
$$ 510646 506057 501399 496289 490424 483637 475932 467458 458349 448640 438445 428145 418317 409396 401414
53880D01414p414p271p129o439n132l677k508j749j559k208l419m137l636k555
$$ 401414 394000 386729 379600 373161 368029 364352 361844 360095 358536 356328 352909 348772 345136 342581
53866C42581k127k570l035l065l121l507l690l227k599k480k733k730k316j768
$$ 342581 340454 337884 334849 331784 328663 325156 321466 318239 315640 313160 310427 307697 305381 303613
53852C03613j160m39R9J03j55p3L59N58L28K00N54R73Q85L43j47l87n84q71j100
$$ 303613 302453 302014 302113 302216 302061 301988 302347 302905 303233 303433 303987 304960 305845 306188 306041 305654 305070 304199 303099
53833C03099j140j059r13n87l4M57N22K32J32O10J365J712J328N28j51l80r4M69
$$ 303099 301959 300900 299987 299400 299366 299823 300345 300577 300709 301319 302684 304396 305724 306252 306101 305721 305627 306096
53815C06096Q30O52K22J93P29J328J636J976K677L424L755L900M443N403O211
$$ 306096 306926 307578 307800 307993 308722 310050 311686 313662 316339 319763 323518 327418 331861 337264 343475
53800C43475O596O788O892O603N827N036M709M721M624M239L797L521L255K574
$$ 343475 350071 356859 363751 370354 376181 381217 385926 390647 395271 399510 403307 406828 410083 412657
53786D12657J265k95j403j784j853k062k293k225k040k239k905l759m731n917
$$ 412657 413922 413627 412224 410440 408587 406525 404232 402007 399967 397728 394823 391064 386333 380416
53772C80416o900o930n929m807m363m416m319l843l186k469j702j012n79m10m48
$$ 380416 373516 366586 360657 355850 351487 347071 342752 338909 335723 333254 331552 330540 329961 329551 329103
53757C29103p28j214j664j855j788j573j264r71q65r34r46p95o26n27l44k5J94
$$ 329103 328375 327161 325497 323642 321854 320281 319017 318046 317181 316247 315301 314506 313880 313353 313009 312984 313178
53740C13178J45n6k70n41p26l45P89K021K393J754R38P95J310J782J707J324J227
$$ 313178 313323 313267 312997 312456 311730 311385 312174 314195 316588 318342 319280 320075 321385 323167 324874 326198 327425
53723C27425J533J731J490J249J603K312K546K029J364J098J190J475J988K537
$$ 327425 328958 330689 332179 333428 335031 337343 339889 341918 343282 344380 345570 347045 349033 351570
53709C51570K614K148J731J735J804J680J819K491K975K517J672J678K713L732
$$ 351570 354184 356332 358063 359798 361602 363282 365101 367592 370567 373084 374756 376434 379147 382879
53695C82879M004L857L775L587K973K141J596J521J641J554J016J41o74j106j175
$$ 382879 386883 390740 394515 398102 401075 403216 404812 406333 407974 409528 410544 410685 410011 408905 407730
53680D07730j041p31l03%M4P5L18N94O36N55N22L32j79n43j30Q53J455J095N9
$$ 407730 406689 405958 405655 405655 405699 405774 406092 406686 407322 407877 408399 408731 408552 408009 407879 408732 410187 411282 411341
53661D11341r41j283o63N76J519J659J590K086K840L038K954L733N592P438Q613
$$ 411341 410400 409117 408454 409030 410549 412208 413798 415884 418724 421762 424716 428449 434041 441479 450092
53646D50092R756J1493J3422J5211J7634K1643K7071L3145L9458M5266M8390M6305
$$ 450092 459848 471341 484763 499974 517608 539251 566322 599467 638925 684191 732581 778886
53634G78886L8459K6667J3296q3j2257k1894k8170l1445l2766l2912l2086l0198
$$ 778886 817345 844012 857308 857225 844968 823074 794904 763459 730693 697781 665695 635497
53622F35497k7206k3341j9188j5415j2352r956q092o687n521m268k768j183K46
$$ 635497 608291 584950 565762 550347 537995 528039 519947 513260 507739 503471 500703 499520 499766
53609D99766J426K349K961L191L078K822K626K470K113J487R46Q17P99K52q15
$$ 499766 501192 503541 506502 509693 512771 515593 518219 520689 522802 524289 525235 526052 526851 527103 526288
53594E26288j561j399p76m53n28o71q83j316j636j458j251j896l145l592k585
$$ 526288 524727 523328 522552 522099 521571 520900 520017 518701 517065 515607 514356 512460 509315 505723 503138
53579E03138j280j092j837k290k106k124k812l486l334k428j391o40m15j008k335
$$ 503138 501858 500766 498929 496639 494533 492409 489597 486111 482777 480349 478958 478318 477903 476895 474560
53564D74560l575l836l124k200j567j085n33k5K45K67L7n02j161j442j000k9R99
$$ 474560 470985 467149 464025 461825 460258 459173 458640 458615 458860 459127 459164 458662 457501 456059 455059 455030 456029
53547D56029J769K204K348K354K401K486K472K426K624L135L685M084M458M861
$$ 456029 457798 460002 462350 464704 467105 469591 472063 474489 477113 480248 483933 488017 492475 497336
53533D97336N084N189N780P279R187J0564J1089J1165J1235J1454J1933J2712
$$ 497336 502420 507609 513389 520668 529855 540419 551508 562673 573908 585362 597295 610007
53521F10007J3479J3853J3953J4283J4989J5779J6521J7492J8817K0191K1287
$$ 610007 623486 637339 651292 665575 680564 696343 712864 730356 749173 769364 790651
53510G90651K2182K3132K4219K5291K6043K6216K6008K6117K6936K7754K7408
$$ 790651 812833 835965 860184 885475 911518 937734 963742 989859 1016795 1044549 1071957
53499A071957K5785K4066K3275K3168K2857K2074K1330K1112K1412K1932K2479
$$ 1071957 1097742 1121808 1145083 1168251 1191108 1213182 1234512 1255624 1277036 1298968 1321447
53488A321447K3009K3351K3054K1838K0254J9432J9732K0140J9620J8561J7929
$$ 1321447 1344456 1367807 1390861 1412699 1432953 1452385 1472117 1492257 1511877 1530438 1548367
53477A548367J7410J5713J2772J0194R022Q350O876M647K390M5k791n670p761
$$ 1548367 1565777 1581490 1594262 1604456 1613478 1621828 1628704 1633351 1635741 1635786 1632995 1627325 1619564
53464A619564r119j0422j1788j2874j3877j5297j6823j7585j7536j7595j8298
$$ 1619564 1610445 1600023 1588235 1575361 1561484 1546187 1529364 1511779 1494243 1476648 1458350
53453A458350j9193j9782k0103k0178j9803j9265j9405k0475k1570k1819k1472
$$ 1458350 1439157 1419375 1399272 1379094 1359291 1340026 1320621 1300146 1278576 1256757 1235285
53442A235285k1276k1200k0529j8987j7104j5475j4109j2640j0898r134p734o766
$$ 1235285 1214009 1192809 1172280 1153293 1136189 1120714 1106605 1093965 1083067 1073933 1066199 1059433
53430A059433n815m394k455l43J715L795N969Q135J0227J2351J4521J6564J8384
$$ 1059433 1053618 1049224 1046769 1046426 1048141 1051936 1057905 1066040 1076267 1088618 1103139 1119703 1138087
53417A138087K0144K1991K3864K5718K7749L0201L3100L6294L9649M3098M6679
$$ 1138087 1158231 1180222 1204086 1229804 1257553 1287754 1320854 1357148 1396797 1439895 1486574
53406A486574N0670N5588O1821O9195P6820Q3145Q6241Q4518P7690O7234N5705
$$ 1486574 1537244 1592832 1654653 1723848 1800668 1883813 1970054 2054572 2132262 2199496 2255201
53395B255201M5529L8122L3818L2198L2392L3355L4232L4766L5434L6999L9645
$$ 2255201 2300730 2338852 2372670 2404868 2437260 2470615 2504847 2539613 2575047 2612046 2651691
53384B651691M2538M4376M4480M3253M1556L9737L7411L4090K9824K5168K0653
$$ 2651691 2694229 2738605 2783085 2826338 2867894 2907631 2945042 2979132 3008956 3034124 3054777
53373C054777J6417J2340Q327M317R2m654j0036j5783k1406k6552l1204l5601
$$ 3054777 3071194 3083534 3091861 3096178 3096270 3091616 3081580 3065797 3044391 3017839 2986635 2951034
53361B951034l9923m4055m7751n1095n4548n8254o1536o3417o3580o2549o1026
$$ 2951034 2911111 2867056 2819305 2768210 2713662 2655408 2593872 2530455 2466875 2404326 2343300
53350B343300n9475n8228n7432n6772n5713n4231n2854n1906n1140n0261m9252
$$ 2343300 2283825 2225597 2168165 2111393 2055680 2001449 1948595 1896689 1845549 1795288 1746036
53339A746036m8000m6227m4112m2355m1139l9622l7029l3740l0698k8163k5795
$$ 1746036 1698036 1651809 1607697 1565342 1524203 1484581 1447552 1413812 1383114 1354951 1329156
53328A329156k3577k1825k0477j9193j8049j7392j6965j5956j4034j1755r770
$$ 1329156 1305579 1283754 1263277 1244084 1226035 1208643 1191678 1175722 1161688 1149933 1140163
53317A140163q184o790n463m124k704j254J66J631L128M358N219O162P487Q661
$$ 1140163 1131979 1125189 1119726 1115602 1112898 1111644 1111810 1113441 1116569 1120927 1126146 1132308 1139795 1148456
53303A148456R140R615J1382J4430J7311J9127K0551K2339K4061K5090K6000K7773
$$ 1148456 1157596 1167211 1178593 1193023 1210334 1229461 1250012 1272351 1296412 1321502 1347502 1375275
53291A375275L0197L2122L3035L3356L3271L2356L0544K8587K7088K5689K3672
$$ 1375275 1405472 1437594 1470629 1503985 1537256 1569612 1600156 1628743 1655831 1681520 1705192
53280A705192K0938J7943J5014J2174R479O972M301J003k633n472o822p501q948
$$ 1705192 1726130 1744073 1759087 1771261 1780740 1787712 1792013 1793016 1790383 1784911 1778089 1770588 1761640
53267A761640j1316j3258j3876j4072j5243j7209j8421j8180j7670j8459k0726
$$ 1761640 1750324 1737066 1723190 1709118 1693875 1676666 1658245 1640065 1622395 1603936 1583210
53256A583210k3481k6009k8527l1524l4957l8213m0655m2063m2574m2304m1264
$$ 1583210 1559729 1533720 1505193 1473669 1438712 1400499 1359844 1317781 1275207 1232903 1191639
53245A191639l9672l8016l6579l5172l3609l2115l0833k9366k7397k5485k4426
$$ 1191639 1151967 1113951 1077372 1042200 1008591 976476 945643 916277 888880 863395 838969
53234H38969k3960k3024k1344j9799j8997j8397j7295j5826j4397j2895j1213
$$ 838969 815009 791985 770641 750842 731845 713448 696153 680327 665930 653035 641822
53223F41822r959r739j0126j0165r774r790j0621j1601j1845j1218j0174r109
$$ 641822 631863 622124 611998 601833 592059 582269 571648 560047 548202 536984 526810 517701
53211E17701q191p558p257o998o298n045l891l710m591n601n830n459n354n824
$$ 517701 509510 501952 494695 487697 481399 476354 472463 468753 464162 458561 452731 447272 441918 436094
53197D36094o286o146n443m541l678k985k489j952j194o02q10j697k361k263j780
$$ 436094 429808 423662 418219 413678 410000 407015 404526 402574 401380 400778 399968 398271 395910 393647 391867
53182C91867j353q82l18n8k49l76j11J07n6n9N34J035N10p58j716k023k148k209
$$ 391867 390514 389632 389314 389256 389007 388631 388520 388627 388571 388512 389046 390081 390591 389833 388117 386094 383946 381737
53164C81737j878j308j108j288j255r18q67j225j285o69K8J37k25o00q81j092
$$ 381737 379859 378551 377443 376155 374900 373982 373115 371890 370605 369936 369964 370101 369876 369276 368395 367303
53148C67303j060p19l20jM24R16R76L84l04m26n5K96M20M29K79j61o77q07m03
$$ 367303 366243 365524 365204 365203 365627 366543 367519 367903 367599 367173 367118 367414 367834 368263 368542 368381 367704 366897 366494
53129C66494J65L74l4q54j500j479q95k91P1M43R53J189Q05J57j72k45n47j045
$$ 366494 366659 367033 366999 366145 364645 363166 362271 361980 362051 362494 363447 364636 365441 365598 365426 365181 364634 363589
53111C63589j128n59Q2K31J24L59R55J341J139N84R7j75k28NM66P75N92J34p3
$$ 363589 362461 361902 361984 362215 362339 362698 363653 364994 366133 366717 366814 366639 366411 366416 366882 367657 368249 368383 368310
53092C68310J09L09L05M27R47J506J522J058P66J022J452J501J126P92Q84J362
$$ 368310 368419 368728 369033 369460 370407 371913 373435 374493 375259 376281 377733 379234 380360 381152 382036 383398
53076C83398J890K221K372K480K591K703K853K930K502J275k11q98n38j90q40
$$ 383398 385288 387509 389881 392361 394952 397655 400508 403438 405940 407215 407004 406106 405568 405378 404538
53061D04538k008k389j662q33p88j290j594j469j230j260j736k470k847k314j102
$$ 404538 402530 400141 398479 397646 396858 395568 393974 392505 391275 390015 388279 385809 382962 380648 379546
53046C79546n6M59R27J739K531K867L025L493M065M149L752L386L126K456J186
$$ 379546 379490 379949 380876 382615 385146 388013 391038 394531 398596 402745 406497 409883 413009 415465 416651
53031D16651j01q07j062j458k316l472m554n231n333m950m347l721l121k644k442
$$ 416651 416550 415743 414681 413223 410907 407435 402881 397650 392317 387367 383020 379299 376178 373534 371092
53016C71092k488k556k516k445k293j740o73M30R78R77R17J003R20M54j14m41
$$ 371092 368604 366048 363532 361087 358794 357054 356381 356811 357789 358766 359683 360686 361606 362060 361946 361505
53000C61505n90p83r44q34m18J33O84J085J068O09J75K11N21O53P23J201J911
$$ 361505 360915 360132 359188 358354 357936 358069 358753 359838 360906 361515 361690 361901 362422 363075 363798 364999 366910
52983C66910K005J249N33O59J271J526J324J189J305J469J721K299K986L248L000
$$ 366910 368915 370164 370697 371356 372627 374153 375477 376666 377971 379440 381161 383460 386446 389694 392694
52968C92694K685K488K123J457Q13N09N37P84J092J060L52o70j195j008p96j152
$$ 392694 395379 397867 399990 401447 402260 402769 403306 404090 405182 406242 406594 405924 404729 403721 402925 401773
52952D01773j869k429k729k907k920k733k607k744k951k913k592k074j401q58
$$ 401773 399904 397475 394746 391839 388919 386186 383579 380835 377884 374971 372379 370305 368904 368046
52938C68046r47j651k066j363J17J244J366P18j92r94j336j051n41m27o64n40
$$ 368046 367099 365448 363382 362019 362136 363380 364746 365464 365272 364278 362942 361891 361350 360923 360259 359719
52922C59719K62J044R07j17j095j245o42J34P44J321J957K274J768O21k77l18
$$ 359719 359981 361025 361932 361815 360720 359475 358833 358967 359711 361032 362989 365263 367031 367652 367375 367057
52906C67057J24L32K40K44L12k3o62p73M5J065J402J209J224J462J210L97M6Q79
$$ 367057 367181 367513 367753 367997 368309 368286 367624 366851 366896 367961 369363 370572 371796 373258 374468 374865 374911 375790
52888C75790K045J975L05j724k801k859k597k318j849j263r62j014j025q54r16
$$ 375790 377835 379810 380115 378391 375590 372731 370134 367816 365967 364704 363742 362728 361703 360849 359933
52873C59933j484k080k006j211k78L50P04R61J108J025O88K48KJ00K47q8r14j496
$$ 359933 358449 356369 354363 353152 352874 353224 353928 354889 355997 357022 357710 357958 357960 358060 358307 358219 357305 355809
52855C55809j259o39m91q43r06l17L19L52p3m40o51r32j321j657j891j985j763
$$ 355809 354550 353911 353420 352577 351671 351354 351673 352025 351952 351512 350861 349929 348608 346951 345060 343075 341312
52838C41312j188n94k80r3K55O55Q58J022J463J962J971J517J246J473J823J963
$$ 341312 340124 339530 339250 339157 339412 340067 340925 341947 343410 345372 347343 348860 350106 351579 353402 355365
52822C55365K077K215J848O52p40j454j473j361j123k49J146K094K067J806K372
$$ 355365 357442 359657 361505 362157 361417 359963 358490 357129 356006 355757 356903 358997 361064 362870 365242
52807C65242L856N595P280R129J0969J1736J0299O585J742k766o066q091r143
$$ 365242 369098 374693 381973 391102 402071 413807 424106 430691 432433 429667 423601 415510 406367
52794D06367r527r515r372r096q238o398l987k160j688k142k447k129j697j753
$$ 406367 396840 387325 377953 368857 360619 354221 350234 348074 346386 344244 341797 339668 337971 336218
52780C36218k113k045j205j29L68J01l24k65L12J011J559J847J652Q03l36j015
$$ 336218 334105 332060 330855 330726 331094 331195 330871 330606 330918 331929 333488 335335 336987 337790 337454 336439
52764C36439q64k25L55N60J72q57j930j962o16J023J608J125O72Q72J238J154
$$ 336439 335575 335350 335705 336265 336437 335580 333650 331688 331072 332095 333703 334828 335500 336372 337610 338764
52748C38764P49M68L48J33j56k08O2K68m9q46j473j287l76N07P86N33N9n05r15
$$ 338764 339513 339981 340329 340462 340306 340098 340160 340428 340379 339533 338060 336773 336397 336904 337690 338223 338282 337777 336862
52729C36862o34M53J545J788J390J146J104O64q5k35M23P76r0j511k120j531m79
$$ 336862 336228 336681 338226 340014 341404 342550 343654 344318 344233 343998 344421 345197 345107 343596 341476 339945 339466
52712C39466K81M93J29o27j234j196o47j11J97M19N22K70k13m00L9Q41J484J677
$$ 339466 339747 340240 340369 339742 338508 337312 336665 336554 336751 337170 337692 337962 337749 337349 337388 338229 339713 341390
52694C41390J461J033N99K73O3p3k02m01n83l96L54J236J545J233R58J002P89
$$ 341390 342851 343884 344483 344756 344819 344746 344544 344143 343560 343164 343518 344754 346299 347532 348490 349492 350281
52677C50281n7p58k66J208K338K246J276L05m6N10J848L171L444K460J145M99
$$ 350281 350224 349466 349200 350408 352746 354992 356268 356573 356527 357037 358885 362056 365500 367960 369105 369604
52661C69604N87P50N68K45K23O44J163J247P89K41Q6K35K85K21L26N25L07m77
$$ 369604 370191 370941 371509 371754 371977 372621 373784 375031 375820 376061 376147 376382 376667 376888 377214 377739 378046 377569
52643C77569j301j626j516j300j065p35l67j6M44J055J585J817J856J888J877
$$ 377569 376268 374642 373126 371826 370761 370026 369659 369643 370087 371142 372727 374544 376400 378288 380165
52628C80165J824K005K601L242L348K800J924R23k08j273j836j762j431j211j038
$$ 380165 381989 383994 386595 389837 393185 395985 397909 398832 398624 397351 395515 393753 392322 391111 390073
52613C90073p19m00m06p05q67o26k71l12o67n25P79K705L753K999J181o5M4Q49
$$ 390073 389354 388954 388548 387843 386976 386350 386079 385767 385100 384575 385354 388059 391812 394811 395992 395927 395971 396820
52595C96820J347J307J077Q09L85n3p8M39J070J316J093O78L83M14P78J189J241
$$ 396820 398167 399474 400551 401360 401745 401692 401614 402053 403123 404439 405532 406210 406593 407007 407785 408974 410215
52578D10215R14O87R24J345J400J047P71Q26Q48M30k68p10p03o08q40j353j681
$$ 410215 411129 411816 412740 414085 415485 416532 417303 418129 418977 419407 419139 418429 417726 417118 416278 414925 413244
52561D13244j429o64J39N49N27L81L67M59M57K90J43L18Q30J214R15M6m63J65
$$ 413244 411815 411151 411290 411839 412366 412747 413114 413573 414030 414320 414463 414781 415611 416825 417740 417786 417323 417488
52543D17488J531K363J953R25L80N96R34Q12M05K66N55Q60P66L92K77O69J192
$$ 417488 419019 421382 423335 424260 424640 425236 426170 426982 427387 427653 428208 429068 429834 430226 430503 431172 432364
52526D32364J323J070Q72R69J160J235J253J276J165Q80O89Q86J452K172K912
$$ 432364 433687 434757 435629 436598 437758 438993 440246 441522 442687 443567 444256 445142 446594 448766 451678
52511D51678L562L945M045M135M392M470L837K368M99j235k524l275l568l643
$$ 451678 455240 459185 463230 467365 471757 476227 480064 482432 482931 481696 479172 475897 472329 468686
52497D68686l752l904l923l681l213k623k051j665j561j657j751j653j242n58
$$ 468686 464934 461030 457107 453426 450213 447590 445539 443874 442313 440656 438905 437252 436010 435452
52483D35452J13M27L35J40J18K30K62R5k53o37q22o86m54m02l06M07J812L265
$$ 435452 435565 435992 436327 436467 436585 436815 437077 437172 436919 436282 435460 434774 434320 433918 433612 434019 435831 439096
52465D39096M156M533M674M626M478M561M845M574L130Q95j246k912m142m746
$$ 439096 443252 447785 452459 457085 461563 466124 470969 475543 478673 479568 478322 475410 471268 466522
52451D66522m613m318m516m838m321k997k060k211k754k670j844q24pM59N19M02
$$ 466522 461909 457591 453075 448237 443916 440919 438859 436648 433894 431224 429380 428556 428549 429008 429527 429929
52435D29929N22Q46P96J49m58l81J38M45M30M88P59R86R79P38J92p04j645k080
$$ 429929 430451 431297 432093 432242 431784 431403 431541 431986 432416 432904 433663 434649 435628 436366 436558 435854 434209 432129
52417D32129j762r80k08L67R47J797K804L442L453L406M145N631O910P486Q116
$$ 432129 430367 429387 429179 429546 430493 432290 435094 438536 441989 445395 449540 455171 462081 469567 477683
52402D77683R673J1651J2437J1008P773L815j42l761o634q240q447p790p064o558
$$ 477683 487356 499007 511444 522452 530225 534040 533898 530137 523503 515263 506816 499026 491962 485404
52388D85404n869m602l108k201k195k556k569j948p85O70K009K840L261L747M456
$$ 485404 479535 474933 471825 469624 467429 464873 462304 460356 459571 460241 462250 465090 468351 472098 476554
52373D76554N032N278N502N860N911N349M604M142L594K309N07r09j581j928k230
$$ 476554 481586 486864 492366 498226 504137 509486 514090 518232 521826 524135 524642 523733 522152 520224 517994
52358E17994k244j840j387j221j247j280j304j204p22J00Q05J093J227J587K150
$$ 517994 515750 513910 512523 511302 510055 508775 507471 506267 505545 505645 506450 507543 508770 510357 512507
52343E12507K566K630K436K327K742L886N343O355O611O550O776P401Q218R193
$$ 512507 515073 517703 520139 522466 525208 529094 534437 540792 547403 553953 560729 568130 576348 585541
52329E85541J0492J2110J3715J4859J5273J5113J4906J5065J5340J5002J3715
$$ 585541 596033 608143 621858 636717 651990 667103 682009 697074 712414 727416 741131
52318G41131J2020J0756J0208J0022R766R344Q989R047R750J0959J2188J2986
$$ 741131 753151 763907 774115 784137 793903 803247 812236 821283 831033 841992 854180 867166
52306H67166J3287J3264J3043J2716J2470J2457J2575J2569J2246J1463J0030
$$ 867166 880453 893717 906760 919476 931946 944403 956978 969547 981793 993256 1003286
52295A003286P877N319K870P87j026k678m088n156n912o321o187n371m117k976
$$ 1003286 1011163 1016482 1019352 1020139 1019113 1016435 1012347 1007191 1001279 994958 988771 983400 979283 976307
52281I76307k390k269k009j023N88J961K284J668J021J102J959L233M602N757
$$ 976307 973917 971648 969639 968616 969204 971165 973449 975117 976138 977240 979199 982432 987034 992791
52267I92791O425O738P312Q481R742J0367J0349J0272J0383J0497J0691J1423
$$ 992791 999216 1005954 1013266 1021747 1031489 1041856 1052205 1062477 1072860 1083357 1094048 1105471
52255A105471J2647J3615J3899J4024J4499J4732J3671J1237Q433O072M131K401
$$ 1105471 1118118 1131733 1145632 1159656 1174155 1188887 1202558 1213795 1222228 1228300 1232431 1234832
52243A234832J113O04Q27J458K222K892L298L548M002M805N579N803N414M884
$$ 1234832 1235945 1236549 1237376 1238834 1241056 1243948 1247246 1250794 1254796 1259601 1265180 1270983 1276397 1281281
52229A281281M684M777M660L983L088K722L114L631L646L438L701M466N124N425
$$ 1281281 1285965 1290742 1295402 1299385 1302473 1305195 1308309 1311940 1315586 1319024 1322725 1327191 1332315 1337740
52215A337740N766O317O671O606O564O910P316P400P548Q393R737J0662J0697
$$ 1337740 1343506 1349823 1356494 1363100 1369664 1376574 1383890 1391290 1398838 1407231 1416968 1427630 1438327
52202A438327J0339J0329J0814J1336J1451J1211J1153J1743J2771J3452J3282
$$ 1438327 1448666 1458995 1469809 1481145 1492596 1503807 1514960 1526703 1539474 1552926 1566208
52191A566208J2572J1926J1430J0698R571Q322P161N856L989J408j656m827p819
$$ 1566208 1578780 1590706 1602136 1612834 1622405 1630727 1637888 1643744 1647733 1649141 1647485 1642658 1634839
52178A634839j0453j2540j3844j4314j4227j3875j3296j2487j1778j1419j0897
$$ 1634839 1624386 1611846 1598002 1583688 1569461 1555586 1542290 1529803 1518025 1506606 1495709
52167A495709r302o588l863k099j040K34K133M359O418P829Q164P473O401N433
$$ 1495709 1486407 1479819 1475956 1473857 1472817 1473051 1475184 1479543 1485961 1493790 1501954 1509427 1515828 1521261
52153A521261M292K545M74j158j945k011j612j093q94r58n44O69J716J401q8j590
$$ 1521261 1525553 1528098 1528572 1527414 1525469 1523458 1521846 1520753 1519859 1518901 1518357 1519026 1520742 1522143 1522055 1520465
52137A520465k766m321o411q137q930r351r925j0109r090o930m286j518J272L860
$$ 1520465 1517699 1513378 1506967 1498830 1489900 1480549 1470624 1460515 1451425 1444495 1440209 1438691 1439963 1443823
52123A443823O109Q312J0756J3332J5884J8612K1607K4389K6375K7489K7925K7603
$$ 1443823 1449932 1458244 1469000 1482332 1498216 1516828 1538435 1562824 1589199 1616688 1644613 1672216
52111A672216K6367K4427K2199J9937J7889J6501J5956J5810J5596J5499J5963
$$ 1672216 1698583 1723010 1745209 1765146 1783035 1799536 1815492 1831302 1846898 1862397 1878360
52100A878360J6881J7690J8110J8353J8644J8997J9265J9067J7917J5827J3421
$$ 1878360 1895241 1912931 1931041 1949394 1968038 1987035 2006300 2025367 2043284 2059111 2072532
52089B072532J0907P345J832m779j0300j3370j4283j3661j1377p379k688J261
$$ 2072532 2083439 2090784 2092616 2087837 2077537 2064167 2049884 2036223 2024846 2017467 2014779 2016040
52077B016040L942N738O957P482P303O837O707P504R611J2856J6256J8482J8783
$$ 2016040 2019982 2025720 2032677 2040159 2047462 2054299 2061006 2068510 2078121 2090977 2107233 2125715 2144498
52064B144498J7402J5229J3148J1596J0470R441Q464P815P494O830N096K431k34
$$ 2144498 2161900 2177129 2190277 2201873 2212343 2221784 2230248 2238063 2245557 2252387 2257483 2259914 2259680
$$ [...]
##END NTUPLES=NMR SPECTRUM
##END=
