##TITLE=AC1547_ROEFFECT0013_8268726_AxEuISjyBX
##JCAMPDX= 6.0         $$ Bruker NMR JCAMP-DX V2.0
##DATA TYPE= NMR SPECTRUM
##DATA CLASS= NTUPLES
##ORIGIN= BRUKER
##OWNER= Administrator
$$ 1.72 TOPSPIN		Version 2.1
$$ 2013-10-12 13:46:54.822 -0700  Administrator@X
$$ Compression mode = diff/dup
##.OBSERVE FREQUENCY= 400.02188249412
##.OBSERVE NUCLEUS= ^1H
##.ACQUISITION MODE= SIMULTANEOUS (DQD)
##.ACQUISITION SCHEME= undefined
##.AVERAGES= 8
##.DIGITISER RES= 22
##SPECTROMETER/DATA SYSTEM= spect
##.PULSE SEQUENCE= zg30
##.SOLVENT NAME= COFFEE_meoh
##.SHIFT REFERENCE= INTERNAL, COFFEE_meoh, 1, 14.98509
##AUDIT TRAIL= $$ (NUMBER, WHEN, WHO, WHERE, PROCESS, VERSION, WHAT)
$$ ##TITLE= Audit trail, TOPSPIN		Version 2.1
$$ ##JCAMPDX= 5.01
$$ ##ORIGIN= Bruker BioSpin GmbH
$$ ##OWNER= Administrator
$$ $$ E:\/data/COFFEE/nmr/AC1547_ROEFFECT0013_8268726_AxEuISjyBX/10/pdata/1/auditp.txt
$$ ##AUDIT TRAIL=  $$ (NUMBER, WHEN, WHO, WHERE, PROCESS, VERSION, WHAT)
(   1,<2013-10-12 13:46:46.465 -0700>,<Administrator>,<X>,<go>,<TOPSPIN 2.1>,
      <created by zg
	started at 2013-10-12 13:45:46.100 -0700,
	POWCHK enabled, PULCHK disabled,
       configuration hash MD5:
       C8 4E 4E 5D D3 5C D8 9E 9F 52 82 E0 59 8A DE 15
       data hash MD5: 64K
       CE 96 A3 A9 04 15 40 F2 F9 AB DF 35 61 25 B2 C7>)
(   2,<2013-10-12 13:46:50.183 -0700>,<Administrator>,<X>,<proc1d>,<TOPSPIN 2.1>,
      <Start of raw data processing
       efp LB = 0 FT_mod = 6 PKNL = 1 PHC0 = 0 PHC1 = 0 SI = 32K 
       data hash MD5: 32K
       36 AF C5 89 7F 45 58 76 1A 58 B6 87 38 47 C3 89>)
(   3,<2013-10-12 13:46:50.555 -0700>,<Administrator>,<X>,<proc1d>,<TOPSPIN 2.1>,
      <pk PHC0 = 96.27319 PHC1 = 0 
       data hash MD5: 32K
       86 BA 30 99 35 76 8B 6D CC C3 5F 2A CB F2 A9 BE>)
(   4,<2013-10-12 13:46:50.829 -0700>,<Administrator>,<X>,<proc1d>,<TOPSPIN 2.1>,
      <abs ABSG = 1 
       data hash MD5: 32K
       9B 10 A6 21 0C 24 22 54 90 47 9B 4A 6B F0 45 D5>)
(   5,<2013-10-12 13:46:50.888 -0700>,<Administrator>,<X>,<proc1d>,<TOPSPIN 2.1>,
      <abs ABSG = 2 
       data hash MD5: 32K
       EC C8 09 E4 FB 3D 06 4F 24 DF 8C 3F F7 D2 0B 27>)
(   6,<2013-10-12 13:46:50.966 -0700>,<Administrator>,<X>,<proc1d>,<TOPSPIN 2.1>,
      <abs ABSG = 3 
       data hash MD5: 32K
       5E EF BC 33 54 B1 83 17 05 C5 37 55 69 9C 29 D9>)
(   7,<2013-10-12 13:46:51.025 -0700>,<Administrator>,<X>,<proc1d>,<TOPSPIN 2.1>,
      <abs ABSG = 4 
       data hash MD5: 32K
       1C 2D B6 0C 87 4C 2D 27 21 40 5B 5B 63 07 58 5A>)
(   8,<2013-10-12 13:46:51.064 -0700>,<Administrator>,<X>,<proc1d>,<TOPSPIN 2.1>,
      <abs ABSG = 5 
       data hash MD5: 32K
       89 F6 C4 A9 0C 60 09 D3 D1 32 80 56 EA EC 34 E3>)
$$ ##END=
$$ 
$$ $$ hash MD5
$$ $$ 75 96 F0 93 30 38 99 7A E7 F6 BA 71 E9 6E 2A A8
##$RELAX= 
##$RELAX= 
##$RELAX= 
##$RELAX= 
##$RELAX= 
##$RELAX= 
##$RELAX= 
$$ Bruker specific parameters
$$ --------------------------
##$DU= <E:\>
##$EXPNO= 10
$$ [...]
##$TP= (0..7)
150 150 150 150 150 150 150 150
##$TP07= 0
##$TPNAME0= <>
##$TPNAME1= <>
##$TPNAME2= <>
##$TPNAME3= <>
##$TPNAME4= <>
##$TPNAME5= <>
##$TPNAME6= <>
##$TPNAME7= <>
##$TPOAL= (0..7)
0.5 0.5 0.5 0.5 0.5 0.5 0.5 0.5
##$TPOFFS= (0..7)
0 0 0 0 0 0 0 0
##$TUNHIN= 0
##$TUNHOUT= 0
##$TUNXOUT= 0
##$USERA1= <user>
##$USERA2= <user>
##$USERA3= <user>
##$USERA4= <user>
##$USERA5= <user>
##$V9= 5
##$VALIST= <valist>
##$VCLIST= <CCCCCCCCCCCCCCC>
##$VD= 0
##$VDLIST= <DDDDDDDDDDDDDDD>
##$VPLIST= <PPPPPPPPPPPPPPP>
##$VTLIST= <TTTTTTTTTTTTTTT>
##$WBST= 1024
##$WBSW= 4
##$XGAIN= (0..3)
0 0 0 0
##$XL= 0
##$YL= 0
##$YMAX_a= 664252
##$YMIN_a= -564571
##$ZGOPTNS= <>
##$ZL1= 120
##$ZL2= 120
##$ZL3= 120
##$ZL4= 120
##$ABSF1= 14.98509
##$ABSF2= -5.573092
##$ABSG= 5
##$ABSL= 3
##$ALPHA= 0
##$AQORDER= 0
##$ASSFAC= 0
##$ASSFACI= 0
##$ASSFACX= 0
##$ASSWID= 0
##$AUNMP= <proc_prof1d_extract_pilot.lims>
##$AXLEFT= 0
##$AXNAME= <>
##$AXNUC= <1H>
##$AXRIGHT= 0
##$AXTYPE= 0
##$AXUNIT= <>
##$AZFE= 0.1
##$AZFW= 0.1
##$BCFW= 0
##$BC_mod= 0
##$BYTORDP= 0
##$COROFFS= 0
##$CY= 15
##$DATMOD= 1
##$DC= 0
##$DFILT= <>
##$DTYPP= 0
##$F1P= 0
##$F2P= 0
##$FCOR= 0.5
##$FTSIZE= 32768
##$FT_mod= 6
##$GAMMA= 0
##$GB= 0
##$INTBC= 1
##$INTSCL= 1
##$ISEN= 128
##$LB= 0
##$LEV0= 0
##$LPBIN= 0
##$MAXI= 10000
##$MC2= 0
##$MEAN= 0
##$ME_mod= 0
##$MI= 0
##$NCOEF= 0
##$NC_proc= -8
##$NLEV= 6
##$NOISF1= 0
##$NOISF2= 0
##$NSP= 0
##$NTH_PI= 0
##$NZP= 0
##$OFFSET= 14.98509
##$PC= 1
##$PHC0= 96.27319
##$PHC1= 0
##$PH_mod= 1
##$PKNL= yes
##$PPARMOD= 0
##$PPDIAG= 0
##$PPIPTYP= 0
##$PPMPNUM= 2147483647
##$PPRESOL= 1
##$PSCAL= 4
##$PSIGN= 0
##$PYNMP= <proc.py>
##$REVERSE= no
##$SF= 400.02
##$SI= 32768
##$SIGF1= 0
##$SIGF2= 0
##$SINO= 400
##$SIOLD= 32768
##$SPECTYP= <>
##$SREGLST= <1H.CDCl3>
##$SSB= 0
##$STSI= 32768
##$STSR= 0
##$SW_p= 8223.68421052631
##$SYMM= 0
##$S_DEV= 0
##$TDeff= 65536
##$TDoff= 0
##$TI= <>
##$TILT= no
##$TM1= 0
##$TM2= 0
##$TOPLEV= 0
##$USERP1= <user>
##$USERP2= <user>
##$USERP3= <user>
##$USERP4= <user>
##$USERP5= <user>
##$WDW= 1
##$XDIM= 32768
##$YMAX_p= 451486765
##$YMIN_p= -710331
##$CURPLOT= <Network HP LaserJet P1505>
##$CURPRIN= <$Network HP LaserJet P1505>
##$DFORMAT= <normdp>
##$LAYOUT= <+/1D_H.xwp>
##$LFORMAT= <normlp>
##$PFORMAT= <normpl>
##$SURQMSG= 1
$$ End of Bruker specific parameters
$$ ---------------------------------
##NTUPLES= NMR SPECTRUM
##VAR_NAME=  FREQUENCY,     SPECTRUM/REAL,   SPECTRUM/IMAG
##SYMBOL=    X,             R,               I
##VAR_TYPE=  INDEPENDENT,   DEPENDENT,       DEPENDENT
##VAR_FORM=  AFFN,          ASDF,            ASDF
##VAR_DIM=   32768,         32768,           32768
##UNITS=     HZ,            ARBITRARY UNITS, ARBITRARY UNITS
##FACTOR=    0.250966925370066, 1,           1
##FIRST=     8223.43324360094, -112674,      50128
##LAST=      0,             34071,           216871
##MIN=       0,             -710331,         0
##MAX=       8223.43324360094, 451486765,    0
$$ Real data points
##PAGE= N=1
##DATA TABLE= (X++(R..R)), XYDATA
$$ [...]
19533d18847A71649a42383j5040A22736d42081a51505A04040A2471J18960g2519
19522B8623j220c04281B15476a58128r4350B33672b66108L9164i6311m06316M3548
19511d59079B80455b6127q985l6068q8237j3020A92272d26023A27545N5218a15353
19499b93872R7898O8625j77761A05061b6330j62619A405Q7650b62423A64506C6477
19487E3287f2928B67959a58408a1099k47357J09342q5697J4851B77126b428A221
19475b00184A34709c3504M1o997F2156d05140f1936j26774A08688a32640m8175
19464a80815p2071A35006J12417d6728m1410G4638a17428B33538j03531b209o0370
19453f2579C80400a96157H7575b12048G6651b37296l7307e5052j39275b7440B78186
$$ plain form
19533 -418847 171649 -142383 -157423 122736 -442081 -151505 104040 12471 131431 -72519
19522 28623 27403 -304281 215476 -158128 -252478 233672 -266108 -226944 -96311 -502627 -459079
19511 -459079 280455 -26127 -35112 -71180 -159417 -172437 192272 -426023 127545 182763 -115353
19499 -293872 -195974 -127349 -305110 105061 -26330 -188949 1405 89055 -262423 164506 36477
19487 53287 -62928 267959 -158408 -11099 -258456 -149114 -234811 -219960 277126 -2428 1221
19475 -200184 134709 -33504 -33463 -40460 62156 -405140 -61936 -188710 108688 -132640 -180815
19464 -180815 -252886 135006 247423 -46728 -88138 74638 -117428 233538 130007 -2209 -62579
19453 -62579 380400 -196157 87575 -212048 76651 -237296 -274603 -55052 -194327 -27440 278186
19441a32756a108k24027K5947A5674h8015D2492d22575f1264j17182j5366Q2167
19430a11645C20229A02018a26144A62944c66264A81083h6891m0882j60502h0395
19419a38343L7867H2828b77448J35806f9996C45a29190p1211i5498c7207j89535
19408b26742C82379j30704a53401g6305A91284q2969a47352A30724h4254a7744
19397c04761J30364N4476A08231a50262A13392e0016B08441b56397j10783g4060
19386a96329L4258I7615P0592b25183f9340k68952A17806b17565J02595E5899
19375G5268a40412A86200P1862n2143o2949n3079M573a03803j42056J13116L0279
19364a02464o1887d301F202c45937E069a69004p1829B09428H8944e1912o45n8549
$$ plain form
19441 -132756 -1108 -225135 -199188 15674 -88015 42492 -422575 -61264 -178446 -193812 -111645
19430 -111645 320229 102018 -126144 162944 -366264 181083 -86891 -127773 -288275 -80395
19419 -138343 -100476 82828 -277448 -141642 -69996 345 -129190 -200401 -95498 -37207 -226742
19408 -226742 382379 251675 -153401 -76305 191284 108315 -147352 130724 -84254 -17744
19397 -304761 -174397 -119921 108231 -150262 113392 -50016 208441 -256397 -367180 -74060
19386 -196329 -162071 97615 168207 -225183 -69340 -338292 117806 -217565 -114970 55899
19375 75268 -140412 186200 258062 205919 142970 89891 94464 -103803 -245859 -132743 -102464
19364 -102464 -164351 -4301 6202 -345937 5069 -169004 -240833 209428 88944 -51912 -52557 -111106
19352a11106j1188H9823d96776A3116c0890l07956I6806c0469j37039A9906K91580
19341C11486L4794i7304f12E0204a83338b645B21328J8543a64033B57780a09737
19329b49333K2563B4176a18415K0048J5256a8552l95003H141L8434a20047A9929
19317c12708E3257a52176A7727a21063p541e8914n3924q9602j82491a51253j73478
19306c24731A16941a30869c8738k63585c9493D18622j45158A32163C4423d70269
19295b03760e0527K2528A21781R4148m4249b72028j2959g4380n7171m9819f0757
19283H3246L6674i9528F903M8394O7396L7663R3567C8119J146q650e6644A45587
19270C141J25458D6075n673K1545h807j7302J0246k892B79862a25605j93667H7639
$$ plain form
19352 -111106 -122294 89823 -496776 13116 -30890 -338846 96806 -30469 -167508 19906 311486
19341 311486 346280 -97304 -612 50204 -183338 -2645 221328 239871 -164033 257780 -109737
19329 -249333 -226770 24176 -118415 -98367 -83111 -18552 -413555 8141 46575 -120047 19929
19317 -312708 53257 -152176 17727 -121063 -128604 -58914 -112838 -202440 -384931 -151253 -324731
19306 -324731 116941 -130869 -38738 -302323 -39493 418622 273464 132163 34423 -470269
19295 -203760 -50527 -27999 121781 215929 171680 -272028 -284987 -74380 -131551 -181370 -60757
19283 83246 119920 -99528 6903 55297 122693 160356 253923 38119 39265 30615 -56644 145587
19270 3141 128599 46075 40402 61947 -8807 -26109 -15863 -18755 279862 -125605 -319272 87639
19257b99695A68786B3485b45119b3420m8901j36836o2242a11469o6743O124K7511
19246a44577k15765A71899D8259L3127d8379K133k39183Q3071B31100L2066a84496
19234c3766F8652d41512C155b21508a7288A35697b14872L543P4407B39403r0402
19223A49001b26845l6187L6841E0618j9252b60086b2527F8636a57951P4521G6725
19211a1525n2333l10761c2285B34127a76321C8429J22430b36704M3906A18630
19200A78912a76316j88379A05642A5601J91987N1321c27300P4238R9240A96457
19189i6780m29826a81118l27489D0438K8317g9738E3087k349a43682K8798n43254
19178f58138b0628A9592a93519Q525A67733a98081g0190j31029e8629j2176n3185
$$ plain form
19257 -299695 168786 23485 -245119 -23420 -72321 -209157 -271399 -111469 -178212 -172088 -144577
19246 -144577 -360342 171899 48259 81386 -48379 -46246 -285429 -202358 231100 263166 -184496
19234 -33766 68652 -441512 3155 -221508 -17288 135697 -214872 -211329 -136922 239403 149001
19223 149001 -226845 -263032 -226191 50618 31366 -260086 -22527 68636 -157951 -83430 76725
19211 -11525 -63858 -374619 -32285 234127 -176321 38429 160859 -236704 -192798 118630
19200 178912 -176316 -364695 105642 15601 207588 258909 -327300 -253062 -153822 196457
19189 -96780 -526606 -181118 -508607 40438 68755 -79738 53087 50738 -143682 -114884 -658138
19178 -658138 -20628 19592 -193519 -184994 167733 -198081 -70190 -201219 -58629 -70805 -123990
19167a23990B76884b01313o7936a1265o9815n71912b81351R8060B36111C0735
19156A1299e1220B70183i0433A80916i4097A38827J12351d6902k1963A22210M5722
19145A67932a11707d3463j13200A62050a20399C3313b93337F0666b25758A22e6033
19133I2168a50289A82448J37798A06321a76338a218B0542H48J66026J62154b793
19121a93776j09456J24667B15994a14239c2597l17632J36875q5411A82493g1184
19110b17523A36342O3715J21086E4247b04395O1128j7697M831A10420f12303b62346
19098e3312l80562e8413D3799a60878j22351A58580a28196b4394k74511a45258
19087a25171I0878f8230b8095j5953n8487e1074m42704d7003a0002A02057i7720
$$ plain form
19167 -123990 276884 -201313 -269249 -11265 -81080 -652992 -281351 -183291 236111 30735
19156 11299 -51220 270183 -90433 180916 -94097 138827 251178 -46902 -68865 122210 167932
19145 167932 -111707 -43463 -156663 162050 -120399 33313 -293337 60666 -225758 122 -56033
19133 92168 -150289 182448 320246 106321 -176338 -1218 20542 848 166874 329028 -2793
19121 -193776 -303232 -178565 215994 -114239 -32597 -350229 -213354 -298765 182493 -71184
19110 -217523 136342 200057 321143 54247 -204395 -143267 -160964 -156133 110420 -612303 -262346
19098 -53312 -433874 -58413 43799 -160878 -283229 158580 -128196 -24394 -298905 -145258
19087 -125171 90878 -68230 -28095 -44048 -102535 -51074 -493778 -47003 -10002 102057 -97720
19075d7153b0207m6854I9031m7249a7088j47907I4415a27202L9147k35440a46829
19063a86467P0340B91059a35838B4896J45240n4944M9352N7939f7705m9747k22368
19052c39820I302c1859j34066B48975i3174F9180i1118F1484d8320A85987h9351
19040c65793I0319K3648D0794Q846f4747P765j02370K227k08010a15500B30145
19028a12716l8692B97547f8958A87529D3040L0593g080j15363L1213E619h4949
19016d1916k67909A04877l0131o557a65252e0684j96691Q0171F9513N9335b45264
19004a52672l11517f5749A4667J54423a89193O8562k17142c3382B31862b25367
18993B73914b18747D350a8211j37909f4814D403a52861o3216a05449A44245a64569
$$ plain form
19075 -47153 -20207 -67061 99031 51782 -17088 -164995 94415 -127202 -88055 -323495 -146829
19063 -186467 -116127 291059 -135838 24896 170136 115192 164544 222483 -67705 -117452 -339820
19052 -339820 9302 -31859 -165925 248975 -93174 69180 -91118 61484 -48320 185987 -89351
19040 -365793 90319 113967 40794 49640 -64747 -56982 -159352 -157125 -365135 -115500 230145
19028 -112716 -151408 297547 -68958 187529 43040 73633 -7080 -122443 -91230 5619 -84949
19016 -41916 -309825 104877 74746 68189 -165252 -50684 -247375 -167204 69513 128848 -245264
19004 -152672 -464189 -65749 14667 169090 -189193 -120631 -337773 -33382 231862 -225367
18993 273914 -218747 4350 -18211 -156120 -64814 4403 -152861 -216077 -105449 144245 -164569
18981a4664A81279b18367A38785C0614g9416D1137a69096c1425l28653E6807c04203
18969b26914A63128E0206b16073A01700e2220a6099F3846r018J16394Q1347a21532
18957b31266i3147j88666e6698H3075b11290D2968d1930J195p3341A51505b28771
18945B12850M9917D1811e1587D4016a12861l5200L8672j66639a33419B51980E4859
18933b39788A32059g0291j08125B53899f6223C8168c4784A016N5581d5069B21961
18921b59248Q1957B3596c41493E0498b5692k58776c1778C06562j17472a53409
18910h5857M1044k75328R4517A92659f3066j86566O5185c0190I9743L3821a95841
18898a38543A2092O0808e900j9493l7191j31728A22253O5847p4832B9502a86699
$$ plain form
18981 -14664 181279 -218367 138785 30614 -79416 41137 -169096 -31425 -360078 56807 -304203
18969 -226914 163128 50206 -216073 101700 -52220 -16099 63846 54828 171222 252569 -121532
18957 -231266 -93147 -281813 -56698 83075 -211290 42968 -41930 -40735 -114076 151505 -228771
18945 212850 262767 41811 -51587 44016 -112861 -148061 -109389 -276028 -133419 251980 54859
18933 -239788 132059 -70291 -178416 253899 -66223 38168 -34784 1016 56597 -45069 221961
18921 -259248 -177291 23596 -341493 50498 -25692 -284468 -31778 306562 189090 -153409
18910 -85857 -44813 -320141 -225624 192659 -63066 -249632 -184447 -30190 99743 133564 -195841
18898 -138543 12092 72900 -5900 -25393 -62584 -194312 122253 188100 113268 29502 -186699
18886a25820A50416a54987A36120C823a31366O1443j3233b3759m15945F4031a57251
18874A28992a5268F2482b0339q6826j25179I9822a03781F521L83946F1975h4740
18862I8892m5579j1671b19218a862B9879a48247F3974b72140J19380j7299A31922
18850E3803i5821j08233Q825A98733B2690K95485a19985E8904b2420o0583E3048
18838f0399A67608A479a99163N8912H9024L6675k6293b25675A74368a4301F7815
18826a80102N4400d233H3945h5530A70248N5814C8528N3079l1868J0609J54336
18815B24684a1216A09994a53928o6215D07144j18504I4147j5393J18160b56073
18804a51174j15211B3254a17398F3323d29098e7158p2638A17969q238a3703l65713
$$ plain form
18886 -125820 150416 -154987 136120 3823 -131366 -69923 -83156 -23759 -439704 64031 -157251
18874 128992 -15268 62482 -20339 -107165 -232344 99822 -103781 6521 390467 61975 -84740
18862 98892 53313 41642 -219218 -1862 29879 -148247 63974 -272140 -152760 -170059 131922
18850 53803 -95821 -204054 -195229 198733 22690 318175 -119985 58904 -22420 -83003 53048
18838 -60399 167608 1479 -199163 -140251 89024 125699 99406 -225675 174368 -14301 67815
18826 -180102 -125702 -4233 83945 -85530 170248 226062 38528 91607 59739 70348 224684
18815 224684 -11216 109994 -153928 -220143 407144 288640 94147 78754 196914 -256073
18804 -151174 -266385 23254 -117398 63323 -429098 -57158 -129796 117969 109731 -13703 -379416
18793c79416a18388A34918m7755d9824A36739J51688b8036o3995A42979b12474
18782F1722L7208k4079M2583b05647J5496A65661J0715a73839N2813j59848R2088
18771a88786H2067B6970R8979b54230N986g7791a4512j34151A12340b48635E3231
18759A72021Q0784A2203a4219k12757p7424A01540a450j8321I222f9848m52005
18748e21853b46752R5898A59965m65a77821B0182f8302B5289O2368b1214A83427
18736I1166e0738j66387N8431f2626k24443h3378a3466j33795j130A47259h4709
18724a8558D3059a20974j00843a02692j4088A67406f4410L0676l9811o7952j59444
18713c00941D7050b7352g552o4230K3306k50159B8851c7694k41334G8464d49821
$$ plain form
18793 -379416 -118388 134918 87163 -49824 136739 288427 -28036 -92031 142979 -212474
18782 61722 98930 74851 117434 -205647 -190151 165661 176376 -173839 -121026 -280874 -188786
18771 -188786 82067 26970 125949 -254230 -248244 -77791 -14512 -148663 112340 -248635 53231
18759 172021 252805 12203 -14219 -226976 -304400 101540 -1450 -19771 9222 -69848 -521853
18748 -521853 -246752 -150854 159965 159500 -177821 20182 -68302 25289 87657 -21214 183427
18736 91166 -50738 -217125 -158694 -62626 -287069 -83378 -13466 -147261 -148391 147259 -84709
18724 -18558 43059 -120974 -221817 -102692 -116780 167406 -64410 -33734 -73545 -141497 -300941
18713 -300941 47050 -27352 -7552 -71782 -48476 -298635 28851 -37694 -279028 78464 -449821
18701A24598a76288r1590C8448K00445d7765A99036a89116G0961a02418k3339
18691a25757K8898M5261k61339A8681J4222a20096N7911B28048A2305a16148C0522
18679A53092R0618C1029c17815J19836P1927P766g959E6096e13932c5208A6510
18667b77468J36425G704N9163b33021M4332N7330B56963a98444i0355l9442j34801
18656b64598a09758P257A12208D3438a94276D29664b10670d2895J1938e348l671
18645i019p6584L4880k00532A34312M3759m2488L3031E9326a65996K0508A16227
18633b78109J29244b2756C22365a18308C3856f7615A16795i6186j76560B60861
18622a54493c2511k58450a2426j84890A32270A5764E267J47963N409a41604j16549
$$ plain form
18701 124598 -176288 -267878 38448 238893 -47765 199036 -189116 70961 -102418 -125757
18691 -125757 -96859 -51598 -312937 18681 32903 -120096 -62185 228048 12305 -116148 30522
18679 153092 243710 31029 -317815 -197979 -126052 -118286 -7959 56096 -513932 -35208 16510
18667 -277468 -141043 7704 66867 -233021 -188689 -131359 256963 -198444 -90355 -129797 -264598
18656 -264598 -109758 -102501 112208 43438 -194276 429664 -210670 -42895 -30957 -5348 -9019
18645 -9019 -85603 -50723 -251255 134312 178071 135583 168614 59326 -165996 -145488 116227
18633 -278109 -148865 -22756 322365 -118308 33856 -67615 116795 -96186 -272746 260861
18622 -154493 -32511 -290961 -12426 -197316 132270 15764 5267 153230 158639 -141604 -258153
18611b58153f589j8717B79537h1132o8925O2366c2410C8707g4874j16453K6900
18600a64427B57142b68872A82022b01765h6661b0338A90761f9430l35002L2796
18590c71636D3969g9164j38584b0610m9235G4978Q6023f7459A6612c5347k1724
18579e7071G9082Q6816b51160R0762b4047F6696b93178G5720a50390L3894j20760
18568b37256i4498J7099j10776f6614r9623L8118A96964i9296j0756b8171B5546
18556h9053D8894i9740J7772l2468F1743M4026d77353a96134m9858j11871J33595
18545b24268a02523M1093n6795E3978a13069a349j12306D7988a93729j13837B2275
18533A79710i8688M0908p752A49729b11162A84101F6076p183H63f8940a6117l19237
$$ plain form
18611 -258153 -6589 -25306 279537 -81132 -150057 -87691 -32410 38707 -74874 -191327 -164427
18600 -164427 257142 -268872 182022 -201765 -86661 -20338 190761 -69430 -404432 -371636
18590 -371636 43969 -79164 -217748 -20610 -69845 74978 161001 -67459 16612 -35347 -57071
18579 -57071 79082 165898 -251160 -160398 -24047 66696 -293178 75720 -150390 -116496 -237256
18568 -237256 -94498 -77399 -188175 -66614 -166237 -128119 196964 -99296 -110052 -28171 25546
18556 -89053 48894 -99740 -81968 -114436 61743 105769 -477353 -196134 -245992 -357863 -224268
18545 -224268 -102523 -61430 -118225 53978 -113069 -1349 -113655 47988 -193729 -307566 22275
18533 179710 -98688 -57780 -65532 149729 -211162 184101 66076 58893 863 -68940 -16117 -335354
18521c35354C00188c8966A06033b55649a19010j42643H0374K2521b9764O975l13696
18510c36485l0527h1015B42923r6261d03806B59135I4445b05669c1200G3485K0645
18499I4130i5640c6442B99149G9996a08204r2287A16696N9271M7464G2051g6380
18487g152A58309a98893k1844c6538B5916M4321i4832p373d5593B25192o2780
18476A62412J37412D2043h7433k15233Q4844e8556r0509p3532R3902r5930L8579
18465a86046C64975d2602k39628B29336E2425K6377b88786a09537A2351Q0844
18455I3195C2308R549J23658B5863d2946k04493Q8181k802j0344B00619C5022
18443a43610B24429A11311a70090D9063P2256b21554N1020B57339b58683I6239
$$ plain form
18521 -335354 300188 -38966 106033 -255649 -119010 -261653 80374 102895 -29764 -22789 -336485
18510 -336485 -367012 -81015 242923 146662 -403806 259135 94445 -205669 -31200 73485 94130
18499 94130 -95640 -36442 299149 79996 -108204 -200491 116696 175967 223431 72051 -76380
18487 -7152 158309 -198893 -220737 -36538 25916 70237 -94832 -102205 -45593 225192 162412
18476 162412 299824 42043 -87433 -302666 -217822 -58556 -149065 -222597 -128695 -224625 -186046
18465 -186046 364975 -42602 -282230 229336 52425 78802 -288786 -109537 12351 93195
18455 93195 32308 41857 165515 25863 -42946 -247439 -159258 -162060 -172404 200619 35022
18443 -143610 224429 111311 -170090 49063 121319 -221554 -170534 257339 -258683 96239
18432a25675j17412K5361e9653B17433q5345c08008B66151A13743j7895a98485
18421E1715c00715E9995B8018A1509L32654c83647a66299L4885c2181A8461Q2216
18410A00677b76714A46529a89657k75280H2458L52560i6768E16N3739a58941B7728
18398a30191B0807J96708B6151c9216B74421I584a25230K1990j78262B636c1585
18386d3315B99778e7447o557N936j28186A18833b05423a5970k11822l42559D5470
18374A31164b83511a493A26631c93746A6458a78226f4124A27121a43390j01383
18364b44773J21773m7272d2515J007A68008D0135b8902A15567e210m1956H322
18352D17069a03658A2554a04703A05444a42063D6600A3728f2917A6958J21756
$$ plain form
18432 -125675 -243087 -217726 -59653 217433 132088 -308008 266151 113743 95848 -198485
18421 51715 -300715 59995 28018 11509 344163 -383647 -166299 -131414 -32181 18461 100677
18410 100677 -276714 146529 -189657 -464937 82458 435018 -96768 516 54255 -158941 27728
18398 -130191 20807 217515 26151 -39216 274421 9584 -125230 -103240 -281502 2636 -31585
18386 -43315 299778 -57447 -64004 -58068 -186254 118833 -205423 -15970 -227792 -570351 45470
18374 131164 -283511 -1493 126631 -393746 16458 -178226 -64124 127121 -143390 -244773
18364 -244773 -123000 -170272 -42515 -41508 168008 40135 -28902 115567 -5210 -47166 8322
18352 417069 -103658 12554 -104703 105444 -142063 46600 13728 -62917 16958 138714
18342A38714b66229b1165k53478J12998L0912b4420A31281c20441e9796j09822
18332a69618g5479l4129G4016c54275a61517k43117f3213I6839a97988D9280K88892
18321C38172j32379a74346E1118c27473A7429K45418G5658a0033D3564A1201f0747
18309A01626g0951E699J17113d0547l7645j42906A36432b37561A7784b24544d741
18297B18731I8500a17842l947B15016K57377a75491l6537j93264J15326A65628
18286B2777M3540R9605B1114a52964p6146D550J43680n5042b11436g5416A11155
18274d73587b3337a1617A57461a87400A33708a64333A40086H483b07246A78647
18263C15459c35603B08634c19392H5738a27101j9649a7494j03029A15101a99625
$$ plain form
18342 138714 -266229 -21165 -274643 -161645 -130733 -24420 131281 -320441 -59796 -169618
18332 -169618 -75479 -109608 74016 -354275 -161517 -404634 -63213 96839 -197988 49280 338172
18321 338172 205793 -174346 51118 -327473 17429 262847 75658 -10033 43564 11201 -60747
18309 101626 -70951 5699 122812 -40547 -78192 -221098 136432 -237561 17784 -224544 -4741
18297 218731 98500 -117842 -121789 215016 472393 -175491 -212028 -405292 -289966 165628
18286 22777 66317 165922 21114 -152964 -229110 4550 148230 93188 -211436 -75416 111155
18274 -473587 -23337 -11617 157461 -187400 133708 -164333 140086 8483 -207246 178647
18263 315459 -335603 208634 -319392 85738 -127101 -146750 -17494 -120523 115101 -199625
18252b18830A62929a94092A20172a50624p6073I248a56928j72667c2057q1447
18242a13504d9602G8008N0929g4232k787p5048C59291b05990A8605J70753b89138
18230A79511d08548C51232a01129q4485B66630j15648B9572K5683M4268M3468
18220A42991g0965L0344p184A17780J7546a75559G9766L6635c78098R4010A00060
18208A099h4172A75854a40884k00313e5152n1343E8137d4835m21583J76136a6853
18196A58316K0226C9225a67681n0116b4992j82805e5672j04801f8738m436j34654
18185b07828C0925N4032a73785B73988a57377j50389a18115d8330n7625p3613
18175a79568A53659a95631M7135A0903L11535j38721a71252M3564A5570g2418
$$ plain form
18252 -218830 162929 -194092 120172 -150624 -226697 9248 -156928 -329595 -32057 -113504
18242 -113504 -49602 78008 128937 -74232 -77019 -152067 359291 -205990 18605 189358 -289138
18230 179511 -408548 351232 -101129 -185614 266630 150982 29572 55255 99523 142991
18220 142991 -70965 -40621 -47805 117780 135326 -175559 79766 116401 -378098 -284088 100060
18208 1099 -84172 175854 -140884 -341197 -55152 -106495 58137 -44835 -466418 -290282 -16853
18196 158316 178542 39225 -167681 -217797 -24992 -207797 -55672 -160473 -68738 -73174 -207828
18185 -207828 30925 84957 -173785 273988 -157377 -307766 -118115 -48330 -105955 -179568
18175 -179568 153659 -195631 -148496 10903 322438 183717 -171252 -127688 15570 -72418
18164b16256M1079c0695D2205J03729M2080a69873c5405m1305j2437j46122j15849
18153c51118e5423m2529m7595j04576B61942f976l4221A57282g4413k45801j50015
18142d70229G0003b25718A40920d0387B5642R7422C4580F364b35903h5756h796
18130a3336G120e0326j21212G8434f6626I9466m8080a8742k33812D8595J15864
18119A64459M8260B4786a46540N7820A24827a39429L9762c7897A06520D1760a82732
18107a50913j96542C759a51251a7414l28611p0111A62912D0366b9606F6247g0631
18095A35558J00498c969o6274C03933a84824N2679H8592K3403R4839b1239A52069
18083E6148K70598b22362A46476F5878c9462A62890o3550a16697j35449B412h3631
$$ plain form
18164 -216256 -175177 -30695 42205 145934 188014 -169873 -35405 -76710 -89147 -235269 -351118
18153 -351118 -55423 -97952 -145547 -250123 261942 -6976 -41197 157282 -74413 -320214 -470229
18142 -470229 70003 -225718 140920 -40387 25642 123064 34580 6364 -235903 -85756 -8796
18130 -13336 7120 -50326 -171538 78434 -66626 99466 51386 -18742 -252554 48595 164459
18119 164459 212719 24786 -146540 -88720 124827 -139429 -99667 -37897 106520 41760 -182732
18107 -150913 -347455 3759 -151251 -17414 -346025 -416136 162912 40366 -29606 66247 -70631
18095 135558 236056 -3969 -70243 303933 -184824 -132145 88592 111995 206834 -21239 152069
18083 56148 326746 -222362 146476 65878 -39462 162890 99340 -116697 -252146 2412 -83631
18071a71757q138A81412e38641H1215B4355a38691d4980a7495k41507R3915A62701
18059i4394q0257A74505C7010J2314R2665a90101N8845C9694b34102A21289a40196
18047b00265N4906o8744O1835j61790B4594P2605a33258K5959n6451P8588g53
18035A8903f8474b3473E0742g6148i036o3777E1484K36783a5842j40506E6267
18023c90684D6749a48172C22650j43480a2985D6028R9484b29047F6251d5313A68974
18011a26722e1296F1405N8870b17180J2921f0606A39307C8390L4240a09450k8795
18000a38245r0422R7540K2119k5403A31599J0290J1683a21872l5528L8101m6374
17989a65673A58868A0250J16071e964A19253E2967J93628a23139I7217a0992k17671
$$ plain form
18071 -171757 -179895 181412 -538641 81215 24355 -138691 -44980 -17495 -259002 -165087 162701
18059 -94394 -174651 174505 37010 49324 141989 -190101 -131256 39694 -234102 121289 -140196
18047 -200265 -145359 -214103 -152268 -314058 24594 97199 -133258 -107299 -163750 -85162 -753
18035 18903 -68474 -23473 50742 -76148 -9036 -72813 51484 288267 -15842 -156348 56267
18023 -390684 46749 -148172 322650 179170 -12985 46028 145512 -229047 66251 -45313 168974
18011 -126722 -51296 61405 120275 -217180 -204259 -60606 139307 38390 72630 -109450 -138245
18000 -138245 -228667 -131127 -109008 -134411 131599 141889 153572 -121872 -157400 -119299 -165673
17989 -165673 158868 10250 126321 -5964 119253 52967 246595 -123139 97217 -10992 -228663
17978b28663C8472g2320j84034C37349g7762j0896j41072g7235a3047r8050j26169
17967b37266P9578D9476K56892j28206a92323a0708j62351b5753k28485a8205
17956b58987B24003a77270Q1112C9847a36640r1634b4730n33568B5775g4332A87828
17944i3679j35212A6563R0449a40306D4501J68353a29205A86004f4121k66171
17934c30292g1731B50644e1594D1608P4754m2791O8719n5029R4694O8130a43523
17922D8292K27K77498A48138a87477j41895R4065J16574j1440B0713R58h602k5461
17910c4063C865a50753n6513J0370j06261B32423q4368b89443B8824b91307C2241
17898c07616C30456a62097A6948J65466p1142m0502J21626e056q2112A77617m4965
$$ plain form
17978 -228663 38472 -72320 -256354 337349 -77762 -88658 -229730 -77235 -13047 -111097 -237266
17967 -237266 -157688 49476 306368 178162 -192323 -10708 -173059 -25753 -254238 -18205
17956 -258987 224003 -177270 -96158 39847 -136640 -228274 -24730 -558298 25775 -74332 187828
17944 -93679 -228891 16563 107012 -140306 44501 212854 -129205 186004 -64121 -330292
17934 -330292 -71731 250644 -51594 41608 116362 73571 142290 87261 181955 250085 -143523
17922 48292 48519 326017 148138 -187477 -329372 -235307 -118733 -130173 20713 21671 -8602 -34063
17910 -34063 3865 -150753 -207266 -196896 -303157 232423 148055 -289443 28824 -291307 32241
17898 -307616 330456 -162097 16948 182414 111272 70770 192396 -5056 -87168 177617 132652
17887A32652a66538c2921j49295f1365a5080l81499B7658a17614c4740E4422i4180
17875a10215A38805i2292D4575g1332l9586I7384f7293G9985A3196M3539E837
17863c94268A54817K75805a49338j31384a34024A28860K0664a22317A52074Q4024
17853B36098o7581N6319R3164a26301n636b80r4095L6863K7775A7918b68223B6081
17840f3432A9757b25071O6493d7207B3941P3325K94741a69771M4688A02980l2057
17829G0923a15947A7609a7557I3203B8314b75926A80945g1662k16139a12141l8770
17818a50911c8630A0650J76986M235J32488A40059b92480B91645E2450a0277n6027
17807f6304a8707b847k02253d5499G0740l0486O4390f5086H0353a5523A31497
$$ plain form
17887 132652 -166538 -32921 -182216 -61365 -15080 -396579 27658 -117614 -34740 54422 -94180
17875 -110215 138805 -92292 44575 -71332 -110918 97384 -67293 79985 13196 56735 5837
17863 -394268 154817 430622 -149338 -280722 -134024 128860 149524 -122317 152074 236098
17853 236098 168517 224836 318000 -126301 -131937 -280 -94375 -57512 -29737 17918 -268223 26081
17840 -63432 19757 -225071 -158578 -47207 23941 97266 392007 -169771 -125083 102980 70923
17829 70923 -115947 17609 -17557 93203 28314 -275926 180945 -71662 -287801 -112141 -150911
17818 -150911 -38630 10650 187636 191871 324359 140059 -292480 291645 52450 -10277 -66304
17807 -66304 -18707 -2847 -205100 -45499 70740 40254 104644 -65086 80353 -15523 131497
17795b96759B4433h966A45360b07750e6186j71217I8271G654a19515La5117B6048
17782g4136B71084a19356D07256b04229A90327i1956j26488A48370a56994O42
17772a56352D7682M8839a55538A72720h1733B0455N464b48159F0424k3435h3435
17760A47447f0513B25602b19226F0398J01304p193B840d45519B0869a43213A46241
17748G4556a76841l82613G6330b04383C12440a04100j40162A10420K3980d8492
17737d61326b07628P8755D083N1965d7557a7134A89532a92240p554i2447A72484
17725a32291a8214A55081k4912m1833D0024R846J39045B3216O5560J86785a22174
17713A02200J56753F1832J14086k4472D7729b18375A82191h5587A90296A247P3109
$$ plain form
17795 -296759 24433 -8966 145360 -207750 -56186 -227403 98271 7654 -119515 -119512 -15117 26048
17782 -74136 271084 -119356 407256 -204229 190327 -91956 -218444 148370 -156994 -156352
17772 -156352 47682 96521 -155538 172720 -81733 20455 25919 -248159 60424 36989 -83435
17760 147447 -60513 225602 -219226 60398 161702 154509 2840 -445519 20869 -143213 146241
17748 74556 -176841 -559454 76330 -204383 312440 -104100 -244262 110420 134400 -48492
17737 -461326 -207628 -128873 4083 56048 -47557 -17134 189532 -192240 -199794 -92447 172484
17725 -132291 -18214 155081 130169 88336 40024 49870 188915 23216 88776 275561 -122174
17713 102200 258953 61832 175918 151446 47729 -218375 182191 -85587 190296 1247 74356
17702G4356c0224A90382b5776A7313J43381e6835B49130B2352J34481a39548D3534
17690F1328a73097G803M6740f9019k24083M4301j05212c6321k06016F3151c5927
17678A03954K36651H8385Q9137o0703a33039b2537F1821g8186B76414H839c23077
17666A07006a68252B63467o3383b16779A61402K9231p3128k4009g0472I882a43195
17654A81952j6634L20345A73557m3044d1113l23037a11200r2790B8438c3586B95222
17642b78707J26271L4942q6944I0614k1c98315d0143B97028i8991B3320a0942
17630B05245m1503b05834A7837a79217l61459A24725g8436B41154k5185L6677
17620B52646h3652A61696d8876I0300K41018C1976R7063a70952A58137a21753
$$ plain form
17702 74356 -30224 190382 -25776 17313 160694 -56835 249130 22352 156833 -139548 43534
17690 61328 -173097 7803 54543 -69019 -293102 -248801 -354013 -36321 -242337 63151 -35927
17678 103954 340605 88385 177522 116819 -133039 -22537 61821 -78186 276414 8839 -323077
17666 107006 -168252 263467 200084 -216779 161402 190633 117505 93496 -70472 9882 -143195
17654 181952 165318 485663 173557 130513 -41113 -364150 -111200 -203990 28438 -33586 295222
17642 -278707 -152436 -117494 -204438 90614 90593 -398315 -40143 297028 -98991 23320 -10942
17630 205245 163742 -205834 17837 -179217 -540676 124725 -78436 241154 215969 252646
17620 252646 -83652 161696 -48876 90300 331318 31976 129039 -170952 158137 -121753
17609b33621N9020h0005r0105F9250k8466J06610F8915j1211R7759l4730a286
17597c2211D0234D467K24407d24169A46241b01533n1058a4206A97862n7664F1272
17585A55570l4841a01705c0790p0164d5907k3163b6054D7499h2315l1983o0883
17574a75181d020r4210C7839K56558r7388J24827A4652d22073a14004D93796b21229
17562a01698B63501j18276K6276N7272A8532a61309H3156C9861L60992F6504R0915
17551A57419a87947C93581B6244L28410A6964h626A58792n696J6552J15962j36720
17540A48890K16469d8543J8065j56282A42445M5864N262b5187C12223A26356i8573
17528A98984d0558A31956m2587k0851L95777a63901C40829b6895A23272a41302
$$ plain form
17609 -233621 -174601 -80005 -170110 69250 40784 147394 68915 57704 155463 120733 -1286
17597 -32211 40234 4467 228874 -424169 146241 -201533 -252591 -14206 197862 140198 61272
17585 155570 120729 -101705 -30790 -100954 -45907 -69070 -26054 47499 -82315 -114298 -175181
17574 -175181 -4020 -98230 37839 294397 197009 321836 14652 -422073 -114004 493796 -221229
17562 -101698 263501 145225 171501 228773 18532 -161309 83156 39861 400853 66504 157419
17551 157419 -187947 393581 26244 354654 16964 -8626 158792 153096 169648 285610 148890
17540 148890 365359 -48543 -30478 -186760 142445 188309 193571 -25187 312223 126356 -98573
17528 198984 -40558 131956 89369 68518 464295 -163901 340829 -26895 123272 -141302
17517a1952B13037k1349p1435K3052J82682A43177a40159A62731a18004A77457
17506A76851A8786a28562b1793A86888l2868e7766H8984Q9008K9632I4250Q040
17495A02290l3835L6391J48959n9352G8878j396l3605J48343q1303C9667b08423
17483I6991I337g3033B32136b9035j66834A4838d1188p0905r2778K8162B11947
17471C56973m6010H6473g3070L0935k7799B48030F452J9753K30049E5974Q2247
17460A38221K05552A7847J10994M3909b304B59861l112O189N1863L4227j07350
17449B41678j9753J02272j356L3972K10958H8333J18046d3614B98888I2104a39395
17437B37109K8630k8717f3790A30620k0075m5573l0248M92260G2240L75755A06795
$$ plain form
17517 -11952 213037 191688 120253 143305 325987 143177 -140159 162731 -118004 177457
17506 176851 18786 -128562 -21793 186888 154020 -57766 88984 177992 207624 94250 102290
17495 102290 68455 104846 253805 194453 78878 77482 43877 192220 110917 39667 -208423
17483 96991 9337 -73033 232136 -29035 -195869 14838 -41188 -112093 -204871 -176709 211947
17471 356973 310963 86473 -73070 -42135 -69934 248030 6452 26205 256254 55974 138221
17460 138221 343773 17847 128841 172750 -2304 259861 256749 262938 314801 349028 241678
17449 241678 221925 324197 322841 356813 567771 88333 206379 -43614 298888 92104 -139395
17437 237109 265739 237022 -63790 130620 110545 64972 34724 526984 72240 447995 106795
17425D45920A30049C3413L73049A1913A488M84534k23190n903K01730n2509c3961
17413C73893K6723j06016H0469M2964g043C03219H2104L47178E7834M6204L54
17402A04392m2300M06535k29387j18621K36506r0976o6103G1760J48148h7307
17391a58404P913B70846j34619Q712k1464F0071L16462b1541j47286A57763b22318
17379E3625R4695a06789C47034B1120L15475A19826L2480D6625K34925j35648
17369A45902J55663N2499D9225e407k34233A65586p5717c3141B14665o8943m3322
17358A02400J14703a68717B04864m6858C408b67263g9226A9098J18055F3310J97510
17347B60820d7645D98920j47052j19843K00476q8702j28504o3877O325E4045L22347
$$ plain form
17425 445920 130049 33413 406462 11913 1488 486022 262832 256929 458659 406150 -33961
17413 373893 400616 294600 80469 123433 -7043 303219 82104 429282 57834 104038 104392
17402 104392 62092 468627 239240 120619 357125 266149 200046 71760 219908 -87307
17391 -158404 -150491 270846 136227 144939 123475 60071 376533 -21541 -168827 157763 -222318
17379 53625 148320 -106789 347034 21120 336595 119826 152306 46625 281550 145902
17369 145902 301565 354064 49225 -5407 -239640 165586 89869 -33141 214665 145722 102400
17358 102400 217103 -168717 204864 158006 3408 -267263 -79226 19098 137153 63310 260820
17347 260820 -47645 498920 351868 232025 432501 343799 215295 151418 157743 54045 376392
17336C76392j30867J17354F7024N6095A6209K00835A2088b0365A75345e1552A84013
17324G2589o950a2042A92088J45731G2366K07042a40492B43252B1573J69444I4231
17312A20452J31159q2381P1684O4844A25406C0327J38020K21841g2328C6724b9236
17300d818B33254d8800B41571o6565Q4550Q356e7299C02882A48091K7652L48506
17289E24249k28050j00883J19842G6016a13217B77921C1577a86632B35949K17750
17279D53699j51946E1976K18373M7147C1212L90550A74724J97006j71139J70774
17269C71365j69636j3392F9a9885B21589n8383J96943A13978K32763G3362K9046
17258A02408B2797K32854N891p6522c5484E66082m7343j39722n8424P0729j22359
$$ plain form
17336 376392 245525 362879 67024 123119 16209 217044 12088 -20365 175345 -51552 184013
17324 72589 65639 -12042 192088 337819 72366 279408 -140492 243252 21573 191017 94231
17312 120452 251611 169230 240914 305758 125406 30327 168347 390188 -72328 36724 -29236
17300 -4818 233254 -48800 241571 175006 259556 267912 -57299 302882 148091 175743 524249
17289 524249 296199 195316 315158 76016 -113217 277921 31577 -186632 235949 453699
17279 453699 301753 51976 270349 317496 31212 421762 174724 371730 200591 371365
17269 371365 201729 188337 69 -19885 221589 163206 360149 113978 346741 73362 102408
17258 102408 22797 255651 261542 185020 -35484 566082 518739 379017 320593 391322 268963
17247B68963j32039K58027A54073J22369j31595a97174B9698J75392G6223M33467
17237E09690A72605G6671K32916A54581h4513m5797C14635J22385m0477B3394
17226D19405H7966J95761M94940j73358G3117a0156D92104k21306J44844D5106
17215a22703A27562C2494J05526e0127B96204I1510K29100A50669L0508J13307
17205B94484A28591M31696c60228B27929m9052n6316K8333J68876j43730C6441
17194I8400M7993J55338f1011C31886L840g4477C73346L9318m6007j67390c3151
17182D52696R1136k31771A1843J60961L17286C3665K0641K98134j05304J2328
17172B59464J59970j51190a22705B589J66962N8036A10118J24145K3033J85907
$$ plain form
17247 268963 136924 394951 154073 276442 144847 -197174 29698 205090 76223 509690
17237 509690 172605 76671 309587 154581 -84513 -130310 314635 437020 396543 23394
17226 419405 87966 283727 778667 605309 73117 -10156 492104 270798 415642 45106
17215 -122703 127562 32494 138020 -50127 296204 91510 320610 150669 181177 294484
17205 294484 128591 560287 -360228 227929 178877 122561 150894 319770 176040 36441
17194 98400 146393 301731 -61011 331886 335726 -74477 373346 412664 366657 199267 -33151
17182 452696 543832 312061 11843 172804 490090 33665 54306 352440 247136 259464
17172 259464 419434 268244 -122705 2589 169551 227587 110118 234263 257296 443203
17162D43203p1086R9489l2128J01918A15925a4353C28571K75625B26434o5092
17152A61342J37773J44482j82430M4902g77D51836D2645M90275d2258E45131H3457
17140D66231p3221n6081r9734b87598D62170O7495k41620m8177O5127O8105j00943
17129B72157O5741k3599j18339J25825j57745k6351K75292I8437N10872B34871
17118C87431r5594P2770F5585N61157F7304Q5123J53930K14827k01567J35229
17108D54846B8021Q2998L69608J1481k19759K07736j21306J07660A95498K11646
17098D07144A34237J86275J43550E6387J65920O4361K98791k29942L8467n5349
17088C38635p586p2278L69597G224M28493K28322E2915N64557A25932K42848K19
$$ plain form
17162 443203 372117 471606 439478 541396 115925 -14353 328571 604196 226434 161342
17152 161342 299115 443597 261167 306069 -777 451836 42645 532920 -42258 545131 83457
17140 466231 393010 336929 237195 -287598 462170 529665 288045 239868 304995 373100 272157
17129 272157 337898 314299 195960 321785 164040 137689 412981 98437 609309 234871
17118 387431 291837 364607 65585 626742 67304 152427 306357 521184 319617 454846
17108 454846 28021 111019 480627 492108 272349 480085 358779 466439 195498 407144
17098 407144 134237 320512 464062 56387 222307 286668 585459 355517 393984 338635
17088 338635 331049 258771 628368 7224 435717 664039 52915 617472 125932 368780 368999
17077C68999J11077k21017J81639A50019K58968j76626K36432j79506P7852R6970
17067D64109k06861O11305B17069M67302P9325B63372K16920p1044o1767m5379
17057C02102J34783A25682K95760Q7991B04331N24748o0558k04709n2413K63354
17047F74753B59978L13199o0637J72348k4017r9260k25067M26248j66835p1493
17037E24464J78684J23595j91572r4331Q5494Q4005j95599l290P4460k44126R5794
17026D37578J45547J32036r7079K67854l13243k1845K17352k93600k4479J94891
17016F45012j3961L16582l61987j9552J25586J56207l95855P7365L8218Q3428
17006F51043r1915K95116l16401o465J47316j68113J0363p8924K10349R1230m6100
$$ plain form
17077 368999 480076 259059 440698 150019 408987 232361 468793 289287 367139 464109
17067 464109 257248 868553 217069 684371 763696 263372 480292 409248 347481 302102
17057 302102 436885 125682 421442 509433 204331 729079 668521 463812 411399 674753
17047 674753 259978 573177 512540 684888 660871 561611 336544 762792 595957 524464
17037 524464 703148 826743 635171 540840 626334 710339 514740 511450 585910 341784 437578
17026 437578 583125 715161 618082 885936 572693 550848 768200 474600 450121 645012
17016 645012 631051 947633 585646 566094 691680 847887 452032 529397 567615 651043
17006 651043 559128 854244 537843 531378 678694 510581 520944 442020 652369 743599 697499
16995F97499o5088O2813k81573M26369j55636l17249N73104k42744Q1999l9070
16985G40424j27976p836J66321J3344r2753L45977p3366j79525j58185L39976
16975I66401k07509k35906K52038M66531k83041j83851j06562K02274l93015L54105
16965H31465n5360J38555K29017j93778J0968p8576P2373j45201L25773l22603
16955H12633J83625J28342k27575l17750M975L75559J21838k17012J91127k83952
16945G71810J28642j31414N81725q4421k28589k11000J74708J78336J33130q5145
16935A227782J6558p976k24487J74529J86700n42265K66422K82579r8217M0240
16925A321865l65447J61376L59758p1585j9671j30604r8906M6217n2546J9629
$$ plain form
16995 697499 632411 695224 413651 840020 684384 367135 940239 697495 779494 740424
16985 740424 612448 604612 770933 784277 691524 1037501 964135 784610 626425 966401
16975 966401 758892 522986 775024 1241555 958514 774663 668101 870375 477360 831465
16965 831465 776105 914660 1143677 949899 960867 882291 954664 809463 1135236 812633
16955 812633 996258 1124600 897025 579275 584250 959809 1081647 864635 1055762 771810
16945 771810 900452 769038 1350763 1266342 1037753 826753 1001461 1179797 1312927 1227782
16935 1227782 1244340 1236364 1011877 1186406 1373106 830841 1097263 1379842 1281625 1321865
16925 1321865 956418 1117794 1477552 1405967 1386296 1255692 1156786 1203003 1150457 1170086
16915A170086M63060k13284l35247K46624K8591J24100k5327M1691J97262N0266
16905A747822j0914j11264J13911j49689M4706k21126k2364K43575j05862M71681
16895B000476l56742M84730l58440n4458L1313K69941K5936k18933Q1465j41016
16885A764272Q4322k80222L28027K03379K0205k77217N80090l49118L2878J56996
16875B263612k7668j40139J54962q7726J05838r6364o6182K09967N6796K01511
16865B574607J43038l07772M6419l8555q344M75760k86729j8367L58886l78423
16855B560520N32188k00212M13680n03342O3795J43656j04780M43209l09285L81467
16845C420896N6593l84119M59179j91281j24001L00495j90994K66965L65097j75409
$$ plain form
16915 1170086 1633146 1419862 1084615 1331239 1359830 1483930 1458603 1500294 1697556 1747822
16905 1747822 1736908 1625644 1739555 1589866 1634572 1413446 1391082 1634657 1528795 2000476
16895 2000476 1643734 2128464 1770024 1715566 1746879 2016820 2042756 1823823 1905288 1764272
16885 1764272 1848594 1568372 1896399 2099778 2119983 1842766 2422856 2073738 2106616 2263612
16875 2263612 2235944 2095805 2250767 2163041 2268879 2172515 2106333 2316300 2373096 2574607
16865 2574607 2717645 2409873 2456292 2417737 2409393 2885153 2598424 2580057 2938943 2560520
16855 2560520 3092708 2892496 3306176 2802834 2866629 3010285 2905505 3348714 3039429 3420896
16845 3420896 3477489 3093370 3552549 3361268 3237267 3537762 3346768 3613733 3978830 3803421
16835C803421N3624J81282k87827m406L62714l1883M24523l0034J58436J29312
16825D759162k43297J29394q7430K26305K84774M0849J5617R1940J87289K03303
16815E607906l1090J39486n7478L26790M2843j53085L87657j2456L52545o735
16805F596383m7820K84546K01408L98843J22995J14728j06869L84327L75090j6304
16795H307327P6746M8389N12478M60578J69885M6997M47523L10095K97543L64386
16785A1041947Q5137L40890M11115J24798R48762m5604N53014N72120L41917N45519
16775A4919615L31737N06095M35314O82089P16357K50215J206878O00484P58354
16766B0407138N97041R09255J094556P61898J162876J083713J071059J301610
$$ plain form
16835 3803421 3857045 4038327 3750500 3746094 4108808 4076925 4501448 4471414 4629850 4759162
16825 4759162 4515865 4645259 4557829 4784134 5068908 5109757 5125374 5217314 5404603 5607906
16815 5607906 5576816 5716302 5658824 5985614 6028457 5875372 6263029 6250573 6603118 6596383
16805 6596383 6548563 6833109 7034517 7433360 7556355 7671083 7564214 7948541 8323631 8307327
16795 8307327 8384073 8432462 8944940 9405518 9575403 9622400 10069923 10380018 10677561 11041947
16785 11041947 11127084 11467974 11879089 12003887 12952649 12907045 13460059 14032179 14374096 14919615
16775 14919615 15251352 15757447 16192761 16874850 17591207 17841422 19048300 19648784 20407138
16766 20407138 21004179 21913434 23007990 23769888 24932764 26016477 27087536 28389146
16758B8389146J016297J388017J477907J598402J832299J915300J484273K216542
16750D1318183K387638K229632K605668K977897K670807L600883L437420L668130
16742F4896258L927056M522552M907693N056564N627994N817007P070539O333182
16734A08158845P547527Q262298Q156631R091157R348372R319438R919334R752800
16726A79556402R461689Q900138P677540O878639N241158L950016J709637J86290
16718B23561509k053814l403388n414569o739884q047810q175364r716545r502617
16710A70507518r797572r825230r576279r011947r029394q304432p758345p076633
16702A00127686o463079o097428o034880n098911n058025m436338m276803l996402
$$ plain form
16758 28389146 29405443 30793460 32271367 33869769 35702068 37617368 39101641 41318183
16750 41318183 43705821 45935453 48541121 51519018 54189825 57790708 61228128 64896258
16742 64896258 68823314 73345866 78253559 83310123 88938117 94755124 101825663 108158845
16734 108158845 115706372 123968670 132125301 141216458 150564830 159884268 169803602 179556402
16726 179556402 189018091 197918229 205595769 212474408 217715566 221665582 223375219 223561509
16718 223561509 221507695 218104307 212689738 205949854 197902044 189726680 180010135 170507518
16710 170507518 160709946 150884716 141308437 132296490 123267096 114962664 107204319 100127686
16702 100127686 93664607 87567179 81532299 76433388 71375363 66939025 62662222 58665820
16694E8665820k995478l498516k878292k640500k516330k702599j714067k274812
16686C7445226j937777j925537j666740j451959j255792j489019j108265j310835
16678B5299302j229916j196715o51657r81553q87631r10414p90719n56458r96018
16669A7098221l43163q61034n45753r4769r73067l88432m64320o98949k11560
16660A2517174l61004p00024k3916k24383o37811k15957j14034j93995l98891
16651I647159m47729j03023l03183k02923j48226n01804m22217N66015l66567
16642G717502l90295k63855M2731m92665L51834o20031J57378l83754m28034J18319
16632E809130k50168j88969K02041l0609l92342q8799l57676L73883l66865j08732
$$ plain form
16694 58665820 55670342 52171826 49293534 46653034 44136704 41434105 39720038 37445226
16686 37445226 35507449 33581912 31915172 30463213 29207421 27718402 26610137 25299302
16678 25299302 24069386 22872671 22221014 21239461 20351830 19441416 18650697 18094239 17098221
16669 17098221 16755058 15894024 15348271 15253502 14280435 13892003 13427683 12728734 12517174
16660 12517174 12156170 11456146 11432230 11207847 10570036 10354079 10240045 10046050 9647159
16651 9647159 9199430 9096407 8793224 8590301 8442075 7940271 7518054 8084069 7717502
16642 7717502 7327207 7063352 7106083 6613418 6965252 6345221 6502599 6118845 5690811 5809130
16632 5809130 5558962 5369993 5572034 5541425 5149083 5060284 4702608 5076491 4709626 4600894
16622D600894K0359l7332K1122k32775k03827j28724K77073m23609L3801p5734
16612C851248k50484L1489l29939L63665j68850j71185J3522r5592k03804O8547
16602C108617l64668l2719J41128j10463J78924q3214k01918K47931k55498O4127
16592B692247J2539N6989k72290k94663Q0312o6805J10669J21816O6691l49981
16582B157524J25686K06801o66120J77198K00872j81340L34044o76371M54125
16573B132419k69453m7555K05323j91642l19756K49229n3269K97726n33990J48051
16563A617083N1695k54992k8649k0182n5896K97367l14827k8809K10932R9092
16553A572814n9022J2477M2452j57304j23260p8326j4045L90966k1052l15182
$$ plain form
16622 4600894 4621253 4583921 4605043 4372268 4168441 4039717 4316790 3893181 3926982 3851248
16612 3851248 3600764 3632253 3302314 3665979 3497129 3325944 3339466 3243874 3040070 3108617
16602 3108617 2743949 2711230 2852358 2741895 2920819 2837605 2635687 2883618 2628120 2692247
16592 2692247 2704786 2761775 2489485 2194822 2275134 2208329 2318998 2440814 2507505 2157524
16582 2157524 2283210 2490011 1823891 2001089 2201961 2020621 2354665 1678294 2132419
16573 2132419 1862966 1815411 2020734 1829092 1509336 1758565 1705296 2003022 1469032 1617083
16563 1617083 1668778 1413786 1385137 1364955 1309059 1606426 1291599 1262790 1473722 1572814
16553 1572814 1513792 1526269 1568721 1411417 1288157 1209831 1195786 1586752 1565700 1250518
16543A250518j08315P4736m3935J59954k61894K26093k06939K24100K9780k79671
16533A064427j77803M3301J01568J1342p49J86809J50596J5127l82038j66888
16523H45692j3638J18884j10863n8577n2833o1297L40325Q5311l05418Q4978r820
16512H62744j7687j08313K55857j43594J26110l38854P2427J38162N1716K9434
16502I28002r7558L21349n43747N1701J31822O6758k33334J24039C69472M92650
16492H62122Q6438o9839p8829Q0225p4100M0592l24476k9454L47740k23573m1509
16481E75337k48480N02691j24884k92947L21073n0750r2358J81986j86540P6408
16471F61536K4969j10666J96921q8864p2528k4524j84347K73675k77300j49480
$$ plain form
16543 1250518 1142203 1216939 1173004 1332958 1071064 1297157 1090218 1314318 1344098 1064427
16533 1064427 886624 929925 1031493 1042835 1042086 1228895 1379491 1394618 1012580 845692
16523 845692 832054 950938 840075 781498 728665 667368 1007693 1093004 787586 872564 862744
16512 862744 845057 736744 992601 849007 975117 636263 708690 846852 898568 928002
16502 928002 830444 1151793 608046 659747 791569 858327 624993 749032 369472 862122
16492 862122 948560 878721 799892 880117 806017 846609 522133 492679 840419 616846 575337
16481 575337 326857 829548 704664 411717 732790 682040 589682 771668 585128 661536
16471 661536 686505 575839 772760 683896 611368 586844 402497 676172 398872 249392
16461B49392N1136p5539M79052k77223M5851B33084K78370J35490k18622K98812
16451G27134P241A87491M11703p6948j95887j2742L0898J27194J82454B19099
16440C28945L54302p4007k65463J78531L25330l63426k16646M3456Q7174j61419
16430B36777K18966L9302A95627J8875K96539j59881n8272K28229m9352k9536
16420D42229n4229J9152J71776A74549J11312M41177B56006J65475r9462K88684
16410F10703k66697K8784Q8074H7406N6819N32182j58137a4528G38539l09146
16400D29393J18143A45893K47608r4403J48881L612J22327A00065L05528j80461
16390B25132K37892k2535J52096q4348A55752J99612j66394K63360j75896j8619
$$ plain form
16461 249392 300528 224989 704041 426818 472669 233084 511454 646944 428322 727134
16451 727134 734375 187491 599194 522246 326359 313617 344515 471709 654163 219099
16440 328945 683247 609240 343777 522308 847638 484212 267566 311022 398196 236777
16430 236777 455743 495045 195627 214502 511041 351160 292888 521117 471765 442229
16420 442229 388000 407152 578928 174549 285861 727038 256006 421481 322019 610703
16410 610703 344006 372790 460864 87406 144225 676407 518270 -14528 738539 429393
16400 429393 547536 145893 393501 299098 447979 451591 573918 100065 405593 225132
16390 225132 463024 440489 592585 508237 155752 355364 188970 452330 276434 257815
16380B57815j0982J69135A81558L11228F0031L91186J7502F1694L93332A02509
16369B12147A00862L77786j28513j29859C9572K71276j38042Q7490J1755D9224
16358D67837A34692M19042B56464K23304k12067J05876j84582k5702k2538J73729
16348C14484J24570A22796m6160O38841h59B18057Q5999O7231a75947E66301B77181
16336B19698R1904M7119J18847j82326j24895J8045J97486A47253K32701c4252
16325A72398J54609H5682j182P5781l0703J74646A42990C2744L45799b68906A8467
16313A84520n026N6872g4693I6445K78316j09401K9763A28487K22648A7123J04228
16302A21351M5245G5669M47984k41555K6980j22169j1847D1795K3412L03105j52846
$$ plain form
16380 257815 246833 415968 181558 492786 60031 451217 468719 61694 455026 102509
16369 212147 100862 478648 350135 220276 39572 310848 172806 260296 272051 49224
16358 467837 134692 553734 256464 479768 267701 373577 188995 163293 140755 314484
16348 314484 439054 122796 76636 715477 -859 218057 304056 371287 -175947 566301 277181
16336 219698 311602 358721 477568 295242 170347 188392 385878 147253 379954 -34252
16325 172398 327007 85682 84500 160281 129578 304224 142990 32744 378543 -268906 18467
16313 184520 179494 236366 -74693 96445 374761 265360 295123 128487 351135 17123 121351
16302 121351 166596 75669 523653 282098 309078 186909 175062 41795 65207 368312 215466
16291B15466n8749J84119K8870M5464g9494B95211r6413F4879a08773I5459k1945
16280G3514a8723A73706G1202K91407j30675a16193E1728K07520L7908K45391
16270E42547d2307C28200j01085K11376a9719A73358q5172O3247d5249b1326B38665
16258A29463a28150H879g2332C70323K2996L1253j52939a55943G2572K00977E6355
16246C97581b23026A82338i775G1074K5004L39399B09075I6193c2493B28840K19917
16235D48757j82737H6958C3910b11321H3244J32543C8663J94417H3925B5026K85544
16224C10570a10156A5506L62568j56727I545K7093J23527a31065F8965K04338
16214B73303a86285A25535K46152j65175J23816h559B21129d2418l7243m0274
$$ plain form
16291 215466 156717 340836 369706 415170 -79494 295211 198798 64879 -108773 95459 73514
16280 73514 -18723 173706 71202 362609 231934 -116193 51728 259248 297156 542547
16270 542547 -42307 328200 227115 438491 -19719 173358 88186 151433 -45249 -21326 238665
16258 129463 -128150 8879 -72332 370323 393319 424572 271633 -155943 72572 273549 56355
16246 397581 -223026 182338 -9775 71074 96078 435477 209075 96193 -32493 228840 448757
16235 448757 266020 86958 33910 -211321 83244 215787 38663 233080 83925 25026 310570
16224 310570 -110156 15506 378074 221347 9545 36638 160165 -131065 68965 273303
16214 273303 -186285 125535 371687 206512 330328 -8559 221129 -42418 -79661 -119935
16204a19935j94421A36623E095M28785j79441j13103E8199j9827b7843B35964
16193B04257K74267B19925d5453A12994L469k5706J55362o4342l3656J72052B8476
16181B52681a60535I5522P9385K0642H0724J74754I1566h1023r9467C60991a54496
16169I2181j3178C3631a03154j81742C5739E96g8093C2606Q3917O8644a16068
16157a18192L2364B47841i5928D84565b3933E1194J09792d77270a96226P4254
16147a21972A21594f587k97407B36601g7013D5552P4484a52584I7446m0814M783
16136F1415J28640O4500m0370B6231J93377g2964B35370G4848J95569a08469M5181
16125f3288m4705B77355j29821J27293K3438a20217B59260G5011J59723J34992
$$ plain form
16204 -119935 -314356 136623 5095 433880 254439 141336 58199 38372 -27843 235964
16193 204257 478524 219925 -45453 112994 116463 90757 246119 181777 148121 320173 28476
16181 252681 -160535 95522 174907 195549 80724 255478 91566 -81023 -180490 360991 -154496
16169 92181 79003 33631 -103154 -284896 35739 596 -78093 32606 116523 185167 -116068
16157 -118192 -85828 247841 -95928 484565 -23933 51194 160986 -477270 -196226 -121972
16147 -121972 121594 -6587 -303994 236601 -77013 45552 120036 -152584 97446 56632 61415
16136 61415 190055 254555 214185 26231 219608 -72964 235370 74848 270417 -108469 -63288
16125 -63288 -107993 277355 147534 274827 298265 -120217 259260 75011 234734 369726
16115C69726A47282a40552k42645A43156n3649f6890C20068F4747J53881G0891
16104i5497m4511B62286J59494j63693e5443n8597B15151a66730a6212j66450
16094a82662A39338a9454j33111C1575J88752c98461F0080K69134d17068j2292
16084d29360K02786n1384J31129j07878J02013k19771a47413l677j02370A96273
16073G7222L3235b43519C0026i2885G2651b46356A2708a6412F3138k942d5055
16061F808e4312j39512i4648j08790A33150N423a88391h7474p3667j7762J6532
16050a62371a4548B7815A2234a31336A47380p535a8621H1255j9404a75829l6828
16039b12657j4346B35184b18488H4078J7049b59324G8345a27319q8075A26849
$$ plain form
16115 369726 147282 -140552 -383197 143156 89507 -66890 320068 64747 218628 70891
16104 -95497 -140008 262286 421780 258087 -55443 -114040 215151 -166730 -16212 -182662
16094 -182662 139338 -19454 -152565 31575 220327 -398461 60080 329214 -417068 -429360
16084 -429360 -226574 -277958 -146829 -254707 -152694 -372465 -147413 -151090 -253460 196273
16073 77222 110457 -243519 30026 -92885 72651 -246356 12708 -16412 63138 60196 -45055
16061 6808 -54312 -193824 -94648 -203438 133150 138573 -188391 -87474 -161141 -178903 -162371
16050 -162371 -14548 27815 12234 -131336 147380 139845 -18621 81255 61851 -175829 -212657
16039 -212657 -227003 235184 -218488 84078 101127 -259324 78345 -127319 -215394 126849
16028C66468A69775J04648a99600B42900p6225C4009K56534N8598A59703M6656
16018B06359a99244A58360c1452B10058n1131E7991L3980K85958d0401k21770
16008b62171B74252b41094B07008H8703a16745K2166B4343a60061N2010H8378
15997e6685k37963B26996b91449a11095q8657o4201A45779d2966B02023m5551
15987A56472c61028J55954B1437J09885O3679a61049B24008a52903A21751b53836
15976d36418J49220p9484a69401c2860a4584A52812K39145c33822d4394k66351
15966c10745i0512m9610A28693a49475M4955p5335l3314j7701H6227b6429k91139
15955c17568N6538e7607j11104h2228k93728A55310a2881k02717P5714b4998j94401
$$ plain form
16028 366468 169775 274423 -199600 242900 166675 34009 290543 349141 159703 206359
16018 206359 -199244 158360 -31452 210058 158927 57991 91971 377929 -40401 -262171
16008 -262171 274252 -241094 207008 88703 -116745 -94579 24343 -160061 -108051 88378
15997 -56685 -294648 226996 -291449 -111095 -199752 -263953 145779 -42966 202023 156472
15987 156472 -361028 -205074 21437 131322 195001 -161049 224008 -152903 121751 -253836
15976 -436418 -287198 -366682 -169401 -32860 -14584 152812 391957 -333822 -44394 -310745
15966 -310745 -90512 -140122 128693 -149475 -104520 -179855 -213169 -230870 86227 -26429 -317568
15955 -317568 -261030 -57607 -168711 -82228 -375956 155310 -12881 -215598 -139884 -24998 -219399
15944b19399l9475B03088a42890A58079o0081C7591a91918H9929a66997K4828
15934a42169r046P2031l4430K907p1270A48428b92017g3145C3132b09639a01836
15922A7179K35783c19718a35375r23A40616o0046a5507j98591R3555L7180e849
15910b9643p7652A13003Q2275a35422H4863J0478f2529j42043C4113a83339j49504
15899c32843i8455C58905A35586b35278M7082P5301G5445N7468d0788k56736E0891
15887A03893b48157J06898l47782a76704C77534a27792C5651K6087e1443o5915
15877a17358l9899a1902j84839C80187b16972m2031f5902j20406D4631J1470R2168
15866A48269a79350A94349e3869j71988M1850d2825k67742b2775p9749d2606C19388
$$ plain form
15944 -219399 -258874 203088 -142890 158079 97998 37591 -191918 89929 -166997 -142169
15934 -142169 -151215 -79184 -113614 -110707 -181977 148428 -292017 -73145 33132 -209639 -101836
15922 17179 252962 -319718 -135375 -136298 140616 80570 -15507 -214098 -120543 -83363 -5849
15910 -29643 -107295 113003 195278 -135422 84863 95341 -62529 -204572 34113 -183339 -332843
15899 -332843 -98455 358905 135586 -235278 -188196 -112895 75445 132913 -40788 -297524 50891
15887 103893 -248157 -141259 -489041 -176704 377534 -127792 35651 61738 -51443 -117358
15877 -117358 -157257 -11902 -196741 380187 -216972 -259003 -65902 -186308 44631 56101 148269
15866 148269 -179350 194349 -53869 -225857 -184007 -42825 -310567 -22775 -102524 -42606 319388
15854A86377p5739c4197D5760e0069k21894e7682b7711j69367A64350E3416b46306
15842I1791a60594M2961I5238g2349A75653a53364N5363d1495B60859f8100A25619
15830A80839G3804P2149d02084E3052i1230j99156h1122j61941J02187N0308k19177
15819c09745d5650r2063A08139c90655H5321a7639l30184e0245E8364N7626c7634
15807D1414i1077o7924B2073a7064r1412B0279a63933C72189A6396m537b19825
15795a5542o8532Q932C1316N6188m3545a1991A67452a69146B68043m682H3845
15783a90692O3766A43196h5326B9145N8217a65869a0349A62500i2517A47254a2687
15771C9164a27169L7597b9272F6723M1939b12988L7607i689j79045H4686g10331
$$ plain form
15854 186377 110638 -34197 45760 -50069 -271963 -57682 -27711 -197078 164350 53416 -246306
15842 91791 -160594 -117633 95238 -72349 175653 -153364 -98001 -41495 260859 -68100 125619
15830 180839 73804 145953 -402084 53052 -91230 -290386 -81122 -243063 -140876 -90568 -309745
15819 -309745 -45650 -137713 108139 -390655 85321 -17639 -347823 -50245 58364 115990 -37634
15807 41414 -91077 -159001 22073 -17064 -108476 20279 -163933 372189 16396 11859 -219825
15795 -15542 -84074 -75142 31316 87504 43959 -11991 167452 -169146 268043 263361 83845
15783 -190692 -126926 143196 -85326 29145 87362 -165869 -10349 162500 -92517 147254 -12687
15771 39164 -127169 -89572 -29272 66723 108662 -212988 -175381 -9689 -188734 84686 -710331
15759d0278A58429a7200l2028b4559j32507f4503A14074l3869J2794c37138g6610
15747a422j92511I9235b00192l9735B46137c2010G3566a49133L2789k05977b8948
15735c21942M6702A20245d9977j84242D58936j60427c7623l2726a331A22093b00988
15723a16160C03525a20499Q182M7069J6236g051A09924a20296A37718a58976A1150
15711A31673f4472j58659j00141C68414p2753a84957F2025k135a3705H3857b08717
15699c97019E719a41117k9505A0917K2980a47328A66806m9353O2394b70944d5358
15687A19836b8205B83438E6990h3364B05560f2529k50245B26977i7120n5764A34773
15675f7482F4921a09441j70914B4741a64322F6517J62940C1072a37950A09693
$$ plain form
15759 -40278 158429 -17200 -49228 -24559 -157066 -64503 114074 80205 92999 -337138 -76610
15747 -1422 -193933 99235 -200192 -239927 246137 -32010 73566 -149133 -116344 -322321 -28948
15735 -321942 -275240 120245 -49977 -234219 458936 298509 -37623 -70349 -1331 122093 -200988
15723 -116160 303525 -120499 -112317 -65248 -49012 -7051 109924 -120296 137718 -158976 11150
15711 131673 -64472 -223131 -323272 368414 295661 -184957 62025 59890 -13705 83857 -208717
15699 -397019 5719 -141117 -170622 10917 33897 -147328 166806 117453 179847 -270944 -45358
15687 119836 -28205 283438 56990 -83364 205560 -62529 -312774 226977 -97120 -152884 134773
15675 -67482 64921 -109441 -280355 24741 -164322 66517 229457 31072 -137950 109693
15664B76071r3083J1024b04194i9546A25741b278k43047f1968A32111c7355j97471
15653b34826M2419l493B28427j7938G8054d49084B6497K37083b6697D600b49275
15641a01463C2205a73648D1544b38272p6237d6679j59337j81703C42146d23716
15630f0156j3021b5558j3197G6945C0070c28018k144h3773G3413j7838c4986E4592
15617F3352a24716B84976b27374C6532a23275j05137A12243a1944k58663F6884
15606C37463b87332n1981a53943k52371J90750B80367e0166D9105j000R4625a5810
15594a31212e350m2443l8580L859a052B18947b80989A89813a70429B08465m2285
15583A66180E5536J2706b27677A05990K05220a88256B8775K59442r6252f0624
$$ plain form
15664 276071 182988 194012 -204194 -99546 125741 -2278 -245325 -61968 132111 -37355 -234826
15653 -234826 -192407 -195900 228427 210489 78054 -449084 26497 263580 -26697 4600 -249275
15641 -101463 32205 -173648 41544 -238272 -314509 -46679 -206016 -387719 342146 -423716
15630 -60156 -73177 -25558 -38755 76945 30070 -328018 -330162 -83773 73413 55575 -34986 54592
15617 63352 -124716 284976 -227374 36532 -123275 -228412 112243 -11944 -270607 66884
15606 337463 -287332 -339313 -153943 -406314 -215564 280367 -50166 49105 48105 142730 -15810
15594 -131212 -5350 -47793 -86373 -82514 -1052 218947 -280989 189813 -170429 208465 166180
15583 166180 55536 68242 -227677 105990 311210 -188256 28775 288217 191965 -60624
15572A51822j6826c53503A47930m4821c16141F6069d0513A71464c64032d1057
15561D8057g5339A3675M4464e7500D7246L2870b42219k3074q1393J17730c1159
15549a35341K4963q0370a0848p3230B65O7277h3359B57858d106D06930f9893A58300
15536G8304h7995E6821a54337O3590k61299B9897J481L17939j66185n0395L0203
15525A62940h5343B59446c6455B13169a02977K3422J1072C55981A11658C0159
15514g7338A00219K20958a8955A32981E9799K25964p6225a29415O3413D60383
15503C6812h1710B27571j09441O2877K17477E7216A7387a63663M6161B20553f4371
15491A45798b58036M7739P1884a2499A20138C2835a39267M0075C73769b2220A32002
$$ plain form
15572 151822 134996 -353503 147930 103109 -316141 66069 -40513 171464 -364032 -41057
15561 48057 -75339 13675 58139 -57500 47246 80116 -242219 -265293 -346686 -228956 -31159
15549 -135341 -110378 -190748 -10848 -84078 265 67542 -83359 257858 -4106 406930 -69893 158300
15536 78304 -87995 56821 -154337 -90747 -352046 29897 31378 349317 183132 132737 162940
15525 162940 -85343 259446 -36455 213169 -102977 -79555 -68483 355981 111658 30159
15514 -77338 100219 321177 -18955 132981 59799 285763 209538 -129415 -66002 460383
15503 36812 -81710 227571 118130 181007 398484 57216 17387 -163663 -117502 220553 -64371
15491 145798 -258036 -210297 -138413 -12499 120138 32835 -139267 -99192 373769 -22220 132002
15479A73251H0311a50887k01308D49658A109h9286E2919g1939m3322D2090L90
15468D2480c2238B76055B9293J76945a99501L5718A16223c83430B2891J9006M6383
15457H8280b08338C41890j54903i6499A47632J15007A08748d32245B17932d7916
15446c6144D7922J74610G8193K42072a14364A6418a17156k72062g8928k36615
15436c15543J56072G9625d32378C6186J85055L5355a57783E0718c7272A14802
15425f3670J5555B53216j08699c04120E1803a74451L3475j63969A02114a50989
15414D3820J74540c62478g3369m581A0381O0982C2925e0350M347B6787i8057A92622
15401B39032f6536L520J156A4462P0479f4888m4702m8131c7029B9924O6573b54772
$$ plain form
15479 173251 80311 -150887 -352195 449658 1109 -89286 52919 -71939 -115261 42090 42480
15468 42480 -32238 276055 29293 206238 -199501 -163783 116223 -383430 22891 41897 88280
15457 88280 -208338 341890 186987 -96499 147632 262639 108748 -432245 217932 -47916
15446 -36144 47922 222532 78193 320265 -114364 16418 -117156 -389218 -78928 -315543
15436 -315543 -159471 79625 -432378 36186 221241 256596 -157783 50718 -37272 114802
15425 -63670 -48115 253216 144517 -304120 51803 -174451 -140976 -304945 102114 -150989
15414 43820 218360 -362478 -73369 -77950 10381 71363 32925 -50350 -46003 26787 -98057 192622
15401 239032 -66536 -63016 -61860 14462 84941 -64888 -109590 -157721 -37029 29924 96497 -254772
15388B83932a1331C15761D2900b7790m4921j43990R0910A46178e3706A5605J24200
15377A39805b02763B43678C1647c07588J24250j1546A5055h8904l24620d8653
15366c94760A19282C636R8623J19554B8903h6064q9656B40133I4241j1588a31767
15354a9843B40867c8655A08452B2793d6527j47804i2213E7470J75142a8967o8903
15343h7870A22585b1567j7153m7315j93099b0286k69050A52764c8544j96238o4489
15332b99271D9793M474L9813D5893b6865A59866o4118Q7141A4586a2777B40066
15320b12611e6279q820D25396B06210m7225a36494A3460J94397a91426k0217B49681
15308A64387k3375A7083g0060l4356k49281E0313a58494I9929H752a42B01798
$$ plain form
15388 283932 -11331 315761 42900 -27790 -72711 -216701 -125791 146178 -53706 15605 139805
15377 139805 -202763 243678 31647 -307588 -183338 -194884 15055 -88904 -413524 -48653
15366 -394760 119282 3636 102259 221813 28903 -86064 -175720 240133 94241 82653 -131767
15354 -19843 240867 -38655 108452 22793 -46527 -194331 -92213 57470 232612 -18967 -87870
15343 -87870 122585 -21567 -38720 -86035 -279134 -20286 -289336 152764 -38544 -234782 -299271
15332 -299271 49793 54267 94080 45893 -26865 159866 95748 182889 14586 -12777 240066
15320 -212611 -56279 -65099 425396 206210 158985 -136494 13460 207857 -191426 -211643 249681
15308 164387 141012 17083 -70060 -104416 -353697 50313 -158494 99929 8752 -142 201798
15296A82526N0934I7557C8898P5817f0215F4572e91689F173L8470h595k02063
15285b10658r3638J31267C4708E785b7913B07211l2092J41662E8452b95622B12346
15273C27369O8858j17485a81593B43163G4094M26863B42673a67816B7675J32222
15263A59897a49539A72626E790i959j4393r2755o1622B16534d097B98755p4031
15252B24724e4539A60579a17462D4558N47261m9020P08574k49520K67873K43078
15242A512804B87514P3104r0795r5469O4674m4916H7938J16739N6294F6281J83758
15231B50039d6605B30094A1639J52401c59931a25791M4628G3589b7593n3260q9441
15220a70294A30335n8259a93972G3385a33426q7561f3444k17038A67436k2413
$$ plain form
15296 182526 233460 97557 38898 114715 -60215 64572 -591689 6173 44643 -8595 -210658
15285 -210658 -304296 -173029 34708 5785 -27913 207211 175119 316781 58452 -295622 212346
15273 327369 396227 278742 -181593 243163 74094 500957 242673 -167816 27675 159897
15263 159897 -149539 172626 5790 -9959 -24352 -117107 -178729 216534 -4097 298755 224724
15252 224724 -54539 160579 -117462 44558 591819 542799 1251373 1001853 1269726 1512804
15242 1512804 287514 360618 269823 174354 239028 194112 87938 204677 260971 66281 250039
15231 250039 -46605 230094 11639 164040 -359931 -125791 -81163 73589 -27593 -80853 -170294
15220 -170294 130335 72076 -193972 73385 -133426 -220987 -63444 -280482 167436 145023
15210A45023J3222K33559q6923E0930K9763R4699j7368l3576A9670J80218l56
15199A99532i75j34831B28418a09015F792k259Q7638O5940a66582A3747J94528
15188B08275h3093r499I0539Q1290A4153J49497L2316D2686a10797e2473A68633
15176B06654e311B33772J65646q8513j12012r7947b52201g733B996K03940J89944
15165C96880D1008a86810A07525K79244B6642N0140R4926b0188j46376B0890l876
15154A7014J66818a71442A55195D1439J93071e6761j8444B63227a89580D9308
15143C29578b6384F0655A4243E266a54947g2900C76563E0075b87851A39087m5597
15132I3490O7900o0004a87515b5525B12174H9005J56503M7272j23927a61679B25332
$$ plain form
15210 145023 158245 391804 304881 50930 80693 175392 158024 124448 19670 199888 199532
15199 199532 -975 -135806 228418 -109015 6792 4533 92171 158111 -166582 13747 208275
15188 208275 -83093 -92592 90539 171829 14153 163650 195966 42686 -110797 -52473 168633
15176 206654 -5311 233772 399418 310905 198893 100946 -252201 -7733 2996 206936 396880
15165 396880 41008 -186810 107525 386769 26642 76782 171708 -20188 -166564 20890 17014
15154 17014 183832 -171442 155195 41439 234510 -56761 -75205 263227 -189580 49308
15143 329578 -26384 60655 14243 5266 -154947 -72900 376563 50075 -287851 139087 93490
15132 93490 161390 101386 -187515 -25525 212174 89005 245508 292780 168853 -161679 225332
15120F02515b715C6756Q9185l4373O4535d4377I8445K65935H3745K73160c0274
15108B86184E6737k011L41110A61201J57669D5131a7154n183I2912L48609a45530
15096B0157K50527c30112I3400R5402J89063a00791A00576g7558B14902J62927
15086C77829a3507B00460K49764A39904L22148a19321A65080a33428C03152A1501
15075b089B99781F3255K09372o0552P6121b04472E6472P5254J36874j3645b6067
15063A9729J94485p3627A5855J5924M94454k38967j19831L7830J79438b46140
15052B10759n9976F8489K38464I9860K11614j01121J13508A2698O92534B74090
15041a79285B13514M1888E6813L72251r2580A53938K38374Q589A91627H4633K42143
$$ plain form
15120 602515 -2715 36756 125941 91568 156103 -44377 98445 364380 83745 356905 -30274
15108 286184 56737 54726 395836 161201 318870 45131 -17154 -22337 92912 441521 -145530
15096 20157 270684 -330112 93400 188802 377865 -100791 100576 -77558 214902 377829
15086 377829 -13507 200460 450224 139904 462052 -119321 165080 -133428 303152 11501
15075 -2089 299781 63255 272627 212075 288196 -204472 56472 131726 268600 254955 -26067
15063 19729 214214 140587 15855 31779 526233 287266 167435 205265 384703 -246140
15052 210759 150783 68489 306953 99860 311474 210353 323861 12698 705232 274090
15041 -179285 213514 255402 56813 429064 336484 153938 392312 400901 191627 84633 326776
15030C26776i1323B19220B3149M13887B07721c6776B22798g1609A96637K21230
15020D17867B02983R515J00463a01712A54703i7281C03398j7975J48525k06250
15010B27698B8796M34395j07517A14948P26d8629A51770J74674A16638b2201C03158
14998H2042K04253A23524J2959J97393A30181E6294Q5176a33157C52068q7441
14988B64627J73301b09145B19565J519G9167M73693B31405J0366j07206L32533
14978D67098A23682J55660m0710J42868j43790G7524M99664j00890F9047K10791
14968B79838a0708A16094K15948H18K45076L2802j3812r7038J40057m5203R8043
14957C60743J981A7785K24576L07888B44853J52492j42891p7702o1031J79112
$$ plain form
15030 326776 -91323 219220 23149 437036 207721 -36776 222798 -71609 196637 417867
15020 417867 202983 212498 312961 -101712 154703 -97281 303398 285423 433948 227698
15010 227698 28796 463191 355674 114948 115674 -48629 151770 326444 116638 -22201 303158
14998 82042 286295 123524 136483 333876 130181 56294 141470 -133157 352068 264627
14988 264627 437928 -209145 219565 221084 79167 552860 231405 241771 134565 467098
14978 467098 123682 279342 238632 381500 237710 77524 577188 476298 69047 279838
14968 279838 -10708 116094 332042 818 245894 278696 264884 167846 307903 262700 360743
14957 360743 362724 17785 242361 550249 244853 397345 254454 176752 115721 294833
14947B94833N2696o0335L0064j35612J63202j20204J74679j66520J4130B1774
14936C30272M6036J65583k04717p6271R0798J25297B15215J60466A72806J20485
14926B93291m7828a8877m9256m673B43160H7691L45809H3155J97634J59094j33956
14915C05927Q616K43037B52602N2559R1840j58311K04697j18412o7473J57074
14905D14576A47128L87642j88814N7192A96832M32645C12098L97603C49714r0081
14895B59633L94531l20654J47217k40066A19977K29216K37616B57412J00023J4244
14885C71679l6016J28988A11374L51067P0362L0551a6405B61857J65311k02072
14875B25096P6836L8130j60837L62549k2500k8245A40949K60567J36036q1397
$$ plain form
14947 294833 347529 287194 317258 181646 344848 224644 399323 232803 246933 21774
14936 330272 376308 541891 337174 260903 351701 476998 215215 375681 172806 293291
14926 293291 245463 -18877 -68133 -72806 243160 87691 433500 83155 280789 439883 305927
14915 305927 314543 557580 252602 305161 397001 238690 443387 324975 257502 414576
14905 414576 147128 534770 345956 403148 196832 629477 312098 709701 349714 259633
14895 259633 654164 333510 480727 240661 119977 349193 586809 257412 357435 371679
14885 371679 335663 464651 111374 462441 532803 563354 -16405 261857 427168 225096
14875 225096 301932 340062 179225 541774 519274 491029 140949 401516 537552 456155
14865D56155j53688n6585l0667J28441J9521L93052l45723M5126j7697J74475
14855F12410k36465j40292L43322j07012l2441M3302K74658j81783J6776j48798
14845D43677L533o4692J64935r7747m779L9310N9306k02581N01617l65718J21663
14834E98524p468K29160k79564R9494k17424K35632A63778O4990K60985j84469
14824C05284o5890J7498Q3312K15022j27818J60884k44217M08509k23277B04582
14813D83742K17735p0650j91360j33813L13617j87604R1508o4762K8593L6121
14803E23127N053J76544l7739j79949K09325k98285N8607j28270m6605M41148
14793G22956k89493l333K49117C30033m8186L20959q290R0780N0936q8260J56450
$$ plain form
14865 456155 302467 245882 215215 343656 363177 756229 410506 455632 437935 612410
14855 612410 375945 235653 578975 471963 439522 482824 757482 575699 592475 443677
14845 443677 447210 382518 547453 449706 444927 484237 543543 340962 842579 476861 598524
14834 598524 591056 820216 540652 640146 422722 658354 163778 228768 489753 305284
14824 305284 239394 256892 340204 555226 427408 588292 344075 752584 529307 204582
14813 483742 701477 630827 439467 305654 619271 431667 523175 458413 487006 523127
14803 523127 528180 704724 666985 487036 696361 398076 456683 328413 281808 722956
14793 722956 433463 430130 679247 330033 281847 602806 594516 685296 736232 647972 804422
14782H04422k53751N0818k7282N6811J15828m2928j49530o2130J77759L8099R9729
14771H07845k95345O7908k6883M1026J45676k06898j68723J48649Q2290J57626
14761G53171N0869k39496K47248j77184J65425k45716J70524N8609q7519J09751
14751H05682k22001J31744O4552j33487J54662k15553O4148L3645n3445Q0127
14741G10074j0175k06450M13419R0562j46024l247j80802N85582j73453m54812
14731F24674L46383j55595q1950n902J35014j36928o9304K18539j20052p9143
14721F75736L41255j74471k1685L248O1296m9901C80720J33980L18940L62715
14711A196355E76289J18160J09789R4749k61478J74744j74672L65048j39626O189
$$ plain form
14782 804422 550671 601489 574207 631018 746846 703918 554388 492258 670017 708116 807845
14771 807845 512500 580408 553525 594551 740227 533329 364606 513255 595545 753171
14761 753171 804040 564544 811792 634608 800033 554317 724841 783450 695931 805682
14751 805682 583681 715425 779977 646490 801152 585599 649747 683392 629947 710074
14741 710074 699899 493449 906868 997430 851406 848159 667357 1252939 1079486 624674
14731 624674 971057 815462 733512 727610 862624 725696 656392 874931 754879 675736
14721 675736 1016991 842520 820835 824083 885379 835478 380720 514700 833640 1196355
14711 1196355 576289 694449 804238 898987 637509 812253 637581 1002629 863003 869192
14701H69192J33649M63252m73677K71386m40080j43374J81692J90235j38334j20244
14691G93697J02238M87989o25815L28144r7796N0367j91434L07689l28968J26817
14681I52928o4630M12966m09618M83102j15737J84o4933j81137l2553K31988k30057
14670I82503J39373j27187L1216L0124N98654p70542K90317k7031j84214J0596
14660I73809j63488O73123k41724k38443Q6001J0800K70534M440L8571J52737
14650A566360l93099K22769j81518J42911l49612K45497j62932J4669K55362p0055
14640A290352J34382j50881L02222j94365p0127R8171j24451R7932o706J02763
14630A479292k01194l4794K00455K95742l68184K65479Q1323l21661K11650q7257
$$ plain form
14701 869192 1002841 1466093 992416 1263802 823722 680348 862040 1052275 913941 793697
14691 793697 895935 1383924 758109 1086253 988457 1038824 847390 1155079 826111 952928
14681 952928 888298 1301264 891646 1374748 1259011 1259195 1194262 1013125 980572 1212560 982503
14670 982503 1121876 994689 1025905 1056029 1654683 884141 1174458 1147427 963213 973809
14660 973809 810321 1483444 1241720 1003277 1089278 1100078 1370612 1375052 1413623 1566360
14650 1566360 1173261 1396030 1214512 1357423 1007811 1253308 1090376 1105045 1360407 1290352
14640 1290352 1424734 1273853 1576075 1381710 1311583 1409754 1285303 1383235 1376529 1479292
14630 1479292 1278098 1243304 1443759 1739501 1371317 1636796 1718119 1396458 1608108 1520851
14620A520851k9830j25196r0605M75876p2652q9669L5022j37527J27422j5882
14610A597810j44987K12501k8946N3487r1365O2058j00192K60482p9187k25174
14600A516487K25713N1496j07880K57630j32911J63140q2253k11024M14957j19017
14590A976338L2865j65959j17209N16035J65632k45823k99973R1261K31398l05753
14580A878812M44577K62915o56384K30224K58008p6103p9407P7375j52283Q5566
14570B273300J74129l00915K32150K5898K39306j8606K16576j34389j13589M63889
14560C057749R8519m67978O33697l41476L20934j0639M48925K23349L84060N27441
14550D874581J241574K181113N868534J0421722J2755578L710387B0266832r590117
$$ plain form
14620 1520851 1491021 1365825 1275220 1751096 1678444 1588775 1623797 1486270 1613692 1597810
14610 1597810 1452823 1665324 1636378 1689865 1598500 1660558 1560366 1820848 1741661 1516487
14600 1516487 1742200 1793696 1685816 1943446 1810535 1973675 1891422 1680398 2095355 1976338
14590 1976338 2009203 1843244 1726035 2242070 2407702 2161879 1861906 1953167 2184565 1878812
14580 1878812 2323389 2586304 1929920 2160144 2418152 2342049 2262642 2340017 2187734 2273300
14570 2273300 2447429 2146514 2378664 2404562 2643868 2625262 2841838 2707449 2593860 3057749
14560 3057749 3156268 2688290 3321987 2980511 3301445 3290806 3739731 3963080 4347140 4874581
14550 4874581 6116155 8297268 14165802 24587524 37343102 41053489 20266832 10676715
14542A0676715l238958k783072j957279m04526J12084k79579N3257J0679L0843
14533B220164l9966L74806k48817l8318J6663J48353j72886K02844P2542L80050
14523B915435l97479R80l4700M36885j92183k22734Q5508K46497K68743J41882
14513C248834m09305J78835j75820K37624j97631J35104R5559j89142k06614Q76632
14503C594076l81681J99452k18349R0072j03666j70746M82521N7462K1532K8950
14493C599623J70503M2760k68717K19312j82180N20171m03497j58657J68347K17608
14483C925273Q8711L6031J19444l1955p5298M84357l28339K76802l90713J20289
14473D224602N9882J72623K30808j3836K68981m3025n6847J27505R626r6188R0505
$$ plain form
14542 10676715 7437757 4654685 2697406 2292880 2404964 2125385 2178642 2189321 2220164
14533 2220164 2180198 2555004 2306187 2267869 2284532 2432885 2259999 2462843 2535385 2915435
14523 2915435 2517956 2518936 2484236 2921121 2728938 2506204 2591712 2838209 3106952 3248834
14513 3248834 2839529 3018364 2842544 3080168 2882537 3017641 3113200 2924058 2717444 3594076
14503 3594076 3212395 3411847 3193498 3283570 3179904 3009158 3491679 3549141 3570673 3599623
14493 3599623 3770126 3812886 3544169 3763481 3581301 4101472 3697975 3539318 3707665 3925273
14483 3925273 4013984 4050015 4169459 4137504 4062206 4546563 4218224 4495026 4104313 4224602
14473 4224602 4284484 4457107 4687915 4674079 4943060 4900035 4843188 4970693 4980319 4884131 4974636
14462D974636l35511M72075o33525J605365n10924n03837K68000K765L19073k4627
14452E633490N8562J83715j4006j59405L19356J22652n1666j15380K63880k4634
14442F216564K90236j82813K11819j6339M85159k18679K09989j7961Q7977L3407
14432G099359K1989K98972J83444k4811r2179j27352N40432O768O9047P9180L68664
14421H423513P6591K7619J39108j91419K26089L22641j38077K17288K31309k71737
14411I062925N66954L02371l38994L24088O2023K03434K26988L65325k4345M3720
14401A0794489k5049N37898J02549J35254N64743j02059L98616J40992N2630M04165
14391A3004228K6226J00906N21179k3078L65822L38059j06341N01792J38898L83063
$$ plain form
14462 4974636 4639125 5111200 4477675 6083040 5572116 5068279 5336279 5339044 5658117 5633490
14452 5633490 5692052 5875767 5861761 5702356 6021712 6144364 6092698 5977318 6241198 6216564
14442 6216564 6506800 6323987 6535806 6519467 7004626 6785947 6995936 6977975 7065952 7099359
14432 7099359 7121348 7420320 7603764 7578953 7486774 7359422 7899854 7906622 7975669 8054849 8423513
14421 8423513 8500104 8527723 8666831 8475412 8701501 9024142 8886065 9103353 9334662 9062925
14411 9062925 9629879 9932250 9593256 9917344 9979367 10182801 10409789 10775114 10750769 10794489
14401 10794489 10769440 11307338 11409887 11545141 12109884 12007825 12406441 12547433 12600063 13004228
14391 13004228 13030454 13131360 13652539 13629461 13995283 14333342 14227001 14728793 14867691 15250754
14381A5250754J86610K93337K26727N6005N81648L58182K71616K7503P03259M492
14371A7960133P84814J29972M84382K63838Q18163j46312P71515N08284J56385
14362B1731174N00552O46550J97905J024203M4843P71379N05120Q72662J94057
14353B6488445Q24863M94150P51347N11323P25366J120773L87566J004249O57596
14344C2965678R64640O82565J074609O98176J113897J153669J315203P17413J484646
14335D2170496J141461J245022J526991J133000J673668J386531J588641J501962
14327E3367772J601030J757872J510293K396099J851793J925747K848832J912908
14319F9172346K489411K862137K544452K869601K930384L229426L354208L574860
$$ plain form
14381 15250754 15437364 15730701 15957428 16013433 16595081 16953263 17224879 17252382 17955641 17960133
14371 17960133 18744947 18874919 19359301 19623139 20441302 20294990 21066505 21574789 21731174
14362 21731174 22231726 22878276 23076181 24100384 24145227 24916606 25421726 26294388 26488445
14353 26488445 27313308 27807458 28558805 29070128 29795494 30916267 31303833 32308082 32965678
14344 32965678 33930318 34612883 35687492 36385668 37499565 38653234 39968437 40685850 42170496
14335 42170496 43311957 44556979 46083970 47216970 48890638 50277169 51865810 53367772
14327 53367772 54968802 56726674 58236967 60633066 62484859 64410606 67259438 69172346
14319 69172346 71661757 74523894 77068346 79937947 82868331 86097757 89451965 93026825
14311I3026825L413151M138085L678928M622325M893357M518860N259749N420184
14303A28971464N582260N840718O951488O489974P194685P804900P740517Q493338
14295A85069344R313450R213333R864526J0690708J0823806J1439962J2094976
14288B58510105J2289316J2973745J2916871J3847833J3927511J4064577J4365216
14281C52895174J3714152J3756095J3227132J2550936J1549464J0775867R253665
14274D37722485Q075113N191585M97582k608141q2210J108645k560474m481017
14266D42863568o534929p183546q289977r414571j1176195j2294371j2753227
14259C75216752j3947904j4597387j4779570j4396372j4015482j4127957j2544704
$$ plain form
14311 93026825 96439976 100578061 104256989 108879314 113772671 118291531 123551280 128971464
14303 128971464 134553724 140394442 147345930 153835904 161030589 168835489 176576006 185069344
14295 185069344 194382794 203596127 213460653 224151361 234975167 246415129 258510105
14288 258510105 270799421 283773166 296690037 310537870 324465381 338529958 352895174
14281 352895174 366609326 380365421 393592553 406143489 417692953 428468820 437722485
14274 437722485 445797598 450989183 451486765 448878624 448796414 449905059 447344585 442863568
14266 442863568 436328639 429145093 420855116 411440545 400264350 387969979 375216752
14259 375216752 361268848 346671461 331891891 317495519 303480037 289352080 276807376
14252B76807376j3091109j2195449j2335537j1409242j0293265j0697918r642545
14245A97142311r103171q453788q287628p845187p373172p176891o178423o003183
14237A36720868n508844o044952m868396n101225m778433m117537m100718l863795
14229I8336968l870945l684885l636497k977985l320248k960525k532678k549654
14221G2803551k513628k407374k448640j949468j974768k458350j364844j632886
14213E6053593j582986j685021j802926j407013j719276j105018o82473j201603
14205D4867277j616486j345595j138871r21780q38207j140205r23365q35762j224266
14196C4882740o85049p64483r76800p16637r19208p87327p42181q22358k24744
$$ plain form
14252 276807376 263716267 251520818 239185281 227776039 217482774 206784856 197142311
14245 197142311 188039140 179585352 171297724 163452537 156079365 148902474 142724051 136720868
14237 136720868 131212024 125167072 120298676 115197451 110419018 106301481 102200763 98336968
14229 98336968 94466023 90781138 87144641 84166656 80846408 77885883 75353205 72803551
14221 72803551 70289923 67882549 65433909 63484441 61509673 59051323 57686479 56053593
14213 56053593 54470607 52785586 50982660 49575647 47856371 46751353 46068880 44867277
14205 44867277 43250791 41905196 40766325 39844545 39006338 37866133 36942768 36107006 34882740
14196 34882740 34197691 33433208 32456408 31739771 30820563 30033236 29291055 28468697 28243953
14187B8243953r45869k65158q54823q09843n90010l24890p53341k03803l67197
14178B3129019n20579p92391j89396m85688m20853m39341l87797P2575r30636
14169A9034913n54416J30696l92889k93414n90088k91987k61380k69674n96772
14160A5914989j58641k9043k73315Q6225p08830k41668n20471m12444L4015k07848
14150A3482969m4372m77204L6754k34245l23268r2146j9526n58453K6800m63139
14140A1334170K11207j57074n55020q888q5790l11237J06871l96641j80675j2026
14130I944897m52543L81855k21878m52643K1152j4656J89238k42911l39766l2266
14120H780479k66308P6001k75939j61294m94988M88513o27609N81704L3219o58649
$$ plain form
14187 28243953 27298084 27032926 26178103 25368260 24778250 24453360 23700019 23496216 23129019
14178 23129019 22608440 21816049 21626653 21140965 20720112 20280771 19892974 19965549 19034913
14169 19034913 18480497 18611193 18218304 17924890 17334802 17042815 16781435 16511761 15914989
14160 15914989 15756348 15727305 15453990 15540215 14831385 14589717 14069246 13656802 13690817 13482969
14150 13482969 13438597 12961393 12998147 12763902 12440634 12348488 12328962 11770509 11797309 11334170
14140 11334170 11545377 11388303 10833283 10824395 10738605 10427368 10534239 10137598 9956923 9944897
14130 9944897 9492354 9874209 9652331 9199688 9220840 9206184 9395422 9152511 8812745 8780479
14120 8780479 8514171 8590172 8314233 8152939 7657951 8146464 7518855 8100559 8133778 7475129
14110G475129K95631m19778J47016l66505J80856k62547J36996q584n8431m66744
14100F653039K95851n75911K26827j94474n5869k28896M8303k17967j4655J84619
14090F120867l50015L86167l36264j98305Q8327k08186K78029l02193N1400R3400
14080E623227j56691l81321J93849J433l8962K11193q03761L38132J14111J6561
14070E117771k43266k04223j78374M20890j42956k31922q076K37273l07536l09818
14060D149763L11050l3083j67591j52314K37092l36007N80959o39638L7984o8470
14050C919745R4695k45338K84223j64707j28873M7292P0295k09771n1961j40079
14040C475521j21389n0268L2018p3283M15272k62003P1088j57252K20452l04531
$$ plain form
14110 7475129 7770760 7350982 7497998 7131493 7312349 7049802 7186798 7178214 7119783 6653039
14100 6653039 6948890 6372979 6599806 6405332 6349463 6120567 6168870 5950903 5936248 6120867
14090 6120867 5770852 6157019 5820755 5622450 5710777 5502591 5780620 5478427 5529827 5623227
14080 5623227 5466536 5085215 5279064 5280497 5241535 5452728 4648967 4987099 5101210 5117771
14070 5117771 4874505 4670282 4491908 4912798 4769842 4537920 4529844 4767117 4459581 4149763
14060 4149763 4460813 4427730 4260139 4107825 4344917 4008910 4589869 3950231 3988215 3919745
14050 3919745 4014440 3769102 4053325 3888618 3759745 3807037 3877332 3667561 3615600 3475521
14040 3475521 3354132 3303864 3335882 3262599 3677871 3415868 3486956 3329704 3550156 3245625
14030C245625J30037J2941p2041q2743k08390L55394l76077J64042j62956J79012
14020C184844Q6904k85731J99961k17882l33398K26894k51846j04400K27717K18202
14010B951265l48062o879O9159j77155J96690k95652J38801k54706r9233J82349
14000B356577J6053j31907O0205j58075K5169O699k68457L43235J27293K60152
13990B636944K81365J259378L804007J0013113J4500119J0741250j7655794j1761453
13982A3818929m892805k031446j255265r56723m68703m15996l02979k08178k88094
13973B998740L9109l19833j3661L99807L4737l59983l61067M5383J48207l03489
13963B307950K64196K15152m60990l04128L06793j11518L35045m19771O2972q2001
$$ plain form
14030 3245625 3375662 3388603 3316562 3233819 3025429 3380823 3004746 3168788 3005832 3184844
14020 3184844 3271748 2986017 3185978 2968096 2634698 2861592 2609746 2505346 2733063 2951265
14010 2951265 2603203 2596324 2665483 2488328 2685018 2389366 2528167 2273461 2174228 2356577
14000 2356577 2372630 2240723 2300928 2142853 2168022 2174721 1906264 2249499 2376792 2636944
13990 2636944 2918309 4177687 7981694 17994807 32494926 43236176 25580382 13818929
13982 13818929 8926124 6894678 5639413 4682690 4213987 3797991 3495012 3286834 2998740
13973 2998740 3037849 2718016 2704355 3104162 3138899 2778916 2417849 2463232 2611439 2307950
13963 2307950 2572146 2787298 2326308 2022180 2328973 2217455 2552500 2132729 2195701 2113700
13953B113700J12886p4060L678J15419p2651k43749L21677j03906j46441L15279
13943B341832m64140J48431r1459J05647K72979k87215l00571M92283o59996K11040
13933A768831M8879l23014M24056r3939J6633k40433P3219K19275N4287j88072
13923A759722M26954l91729j75287J28422K1915q2625J91751K20103l97688n9012
13913A642526R214R6810j34136j35259L60485o4835k74013q9175J99525l6113
13903A575029J31804l02412M6551J11058j65930J67474k44257J6022J08996j65264
13893A279071J63712j08134K97567k87003O4777k60258K93413k683J26062p5344
13883A491180J64932o80427L8131J59879R4520R0287j16022l5879K94846n11629
$$ plain form
13953 2113700 2226586 2152526 2156204 2271623 2198972 1955223 2276900 2172994 2026553 2341832
13943 2341832 1877692 2026123 1934664 2040311 2313290 2026075 1725504 2217787 1557791 1768831
13933 1768831 1817710 1494696 1918752 1824813 1841446 1601013 1674232 1893507 1947794 1759722
13923 1759722 2186676 1794947 1619660 1748082 1769997 1687372 1879123 2099226 1701538 1642526
13913 1642526 1651740 1748550 1614414 1479155 1839640 1774805 1500792 1411617 1611142 1575029
13903 1575029 1706833 1404421 1450972 1562030 1396100 1563574 1319317 1335339 1444335 1279071
13893 1279071 1442783 1334649 1632216 1345213 1409990 1149732 1443145 1440462 1566524 1491180
13883 1491180 1656112 975685 1013816 1173695 1268215 1358502 1242480 1206601 1501447 989818
13873I89818K96752p9476J97168p1207K28279k27091l9831J67943J73465n19628
13863A116192K45697l62888J33816o8110j5611K97380k54538O3989J0322k51969
13853I14280J13539P4559M0397K3409o1733J73764m38216J60436l9330L00042
13843A261147k35065L32658k85038j93902J24202J6644k68525L67590j00648L0153
13833A049216q6832R2863q2712M7680M0567k90175L22619k16179K5061N7700n2806
13822I07002K90601m50069M27320j33907R9055j27563k87056L66444k73772p5698
13812G42357J70294q7288j2331K54676k64976O4130J13726m6903J95613k36655
13802H92643O3807J92609l13041K4325j00028K40158m7478K7264p8102o169j25142
$$ plain form
13873 989818 1286570 1207094 1404262 1333055 1561334 1334243 1294412 1462355 1635820 1116192
13863 1116192 1361889 999001 1132817 1064707 1049096 1346476 1091938 1155927 1166249 914280
13853 914280 1027819 1102378 1142775 1166184 1104451 1278215 839999 1000435 961105 1261147
13843 1261147 1026082 1358740 1073702 879800 1004002 1020646 752121 1119711 1019063 1049216
13833 1049216 962384 1055247 972535 1020215 1060782 770607 1093226 877047 902108 959808 907002
13822 907002 1197603 747534 1174854 1040947 1140002 1012439 725383 1091827 818055 742357
13812 742357 912651 825363 813032 1067708 802732 866862 980588 933685 1129298 892643
13802 892643 956450 1149059 836018 860343 760315 1000473 952995 980259 902157 895988 770846
13791G70846K41746k0687k0136K1608D88663K97316J84408l44504J74066K03259
13781A003208D28278M38356C84668L06104R7595O9794j7710k05793J8850J83935
13771H37443q3417K62109j41473o0680K1111J58366j96261j63988o0320K22687
13761G95577j2367M6160o708J12302j71726K44515m98355M2427M74082D86661
13750H58747j34920k52051M46057n7742j64204C01501P8666K14468M61275k64419
13740G91491j60622M2940J16538j13107K6119k79806L49991N1577j5433K88174
13730A097862k61788j37880k4209K29425K02995m56195o6981Q2980j97924J65379
13720F33664P6301k58245L96407C74938J82743p8905K86162P7904k19265K90525
$$ plain form
13791 770846 1012592 991905 971769 993377 488663 785979 970387 625883 799949 1003208
13781 1003208 428278 866634 384668 690772 788367 858161 840451 634658 653508 837443
13771 837443 754026 1016135 874662 813982 835093 993459 797198 633210 572890 795577
13761 795577 783210 829370 822662 934964 763238 1007753 509398 551825 1025907 486661
13750 858747 723827 471776 917833 860091 695887 301501 380167 594635 1055910 791491
13740 791491 630869 673809 790347 677240 703359 423553 773544 825121 809688 1097862
13730 1097862 836074 698194 673985 903410 1106405 650210 583229 666209 468285 633664
13720 633664 709965 451720 848127 374938 557681 478776 764938 842842 623577 914102
13710I14102k26466j00002k1122J78674C41305J88575j9896M1412R9642q2028
13700E69010K30290j60274A85398K24507O5076J93290m0012j91095K72838j0865
13690F99137r2705o7657k17543L38417Q6515n8251C19112p9431n3011M33006p0005
13679E49671J86827j64353K58263o9617l60606J88653j11990r3168K05124N4572
13669F43376j49132j53793L45140j54723K27805k13682j42023J34199o6267o3872
13659D07028L73154l03859M1956J92560n9123j73366K19753B44601J27573k3059
13649C49115N72251D19169J90015J87241k68632P4032j30721J74368O8196R9019
13639H12687k01668j59992k05551K43517j0929L73929m16268n9646L72211l48755
$$ plain form
13710 914102 687636 587634 566512 745186 341305 529880 509984 551396 651038 569010
13700 569010 799300 639026 185398 409905 474981 668271 628259 437164 710002 699137
13690 699137 606432 538775 321232 659649 746164 687913 319112 239681 186670 619676 549671
13679 549671 736498 572145 830408 760791 400185 588838 476848 383680 588804 643376
13669 643376 494244 340451 685591 530868 758673 544991 402968 537167 470900 407028
13659 407028 780182 476323 518279 710839 651716 478350 698103 244601 372174 349115
13649 349115 921366 419169 609184 796425 527793 601825 471104 645472 713668 812687
13639 812687 611019 451027 245476 488993 478064 851993 435725 376079 748290 399535
13629C99535L46481l70313K77432k31848O0869A80411K68501j08j14214O9734
13619D04324O544M5942J2630j27032J28285q9138P3968j3443p1567J16267j10109
13608C76671M2721L1472L6321D3912L26912r46P5617A33071L62518k01825J09064
13597D02828j19334R5301k1798J38462q6586A78712L84181k72474K81463k03192
13587C68690m9279A24158J10041L78426k50330j04455J38820A95749K14141L596
13577D13486M2204j31257K7053n1734G0060M80264B47545L42346j82467r6701
13567C10723J71455r4748p7486K71167A68512R3286M062K34142j38176K2362j49578
13556B34610J64069o1370q7848K65596k14814J63098K02238B2832J15329L10057
$$ plain form
13629 399535 746016 375703 653135 421287 482156 180411 448912 448804 334590 404324
13619 404324 410868 456810 469440 342408 470693 381555 455523 442080 370513 486780 376671
13608 376671 419392 450864 487185 43912 370824 369878 445495 133071 495589 293764 402828
13597 402828 283494 378795 356997 495459 408873 178712 562893 290419 571882 368690
13587 368690 319411 124158 234199 612625 362295 257840 396660 195749 409890 413486
13577 413486 455690 324433 351486 299752 70060 550324 247545 589891 407424 310723
13567 310723 482178 387430 309944 581111 168512 261798 265860 500002 361826 384188 234610
13556 234610 398679 337309 249461 515057 300243 463341 665579 22832 138161 448218
13546D48218A00224N40149B48853N67974k67275j42613d7225A61075O40059A87748
13535C04337N252J17507l720j44226r2882L02531G1434L63522J80894B32301d605
13523D57910B16887L3378l8921K89725L22946A68215K77894M9370m4551A44312
13512B10268N7631p8943J65385k1721r0174J43674d0815I8089L56799A65300j7380
13501A47920L33930o9976o0082K12166j98185m5798b78082E67670j13442G9999
13490B09716A8711J61892K34815F0566K21992j33024L34413j56284j0312J22871
13480D40222l2647j4704k3993J35782j84035A57898C9908L82408p5966o8315K7476
13469C05511J20487I1092B5677L02456j06880p9340J59913J30629A24262M78501
$$ plain form
13546 448218 100224 640373 248853 816827 549552 406939 -47225 161075 801134 187748
13535 304337 309589 427096 423376 279150 186268 488799 71434 434956 615850 232301 -4605
13523 457910 216887 250265 211344 501069 824015 168215 446109 495479 450928 144312
13512 210268 267899 188956 354341 332620 242446 386120 -40815 98089 454888 165300 147920
13501 147920 481850 411874 351792 563958 365773 319975 -278082 567670 454228 79999
13490 209716 18711 180603 415418 60566 282558 149534 483947 327663 317351 440222
13480 440222 407575 392871 368878 504660 320625 157898 39908 422316 346350 278035 305511
13469 305511 425998 91092 25677 328133 221253 141913 301826 432455 124262 602763
13459F02763F2609L21863i23A97443J83456J56542A83243R4756N23953A71974
13448A90399M1128K67451k08171a82206B21584J48238j20331g4026C1477J39318
13438A70795m0472L22981C6968K71758J42329A83688J83915L1235g7286B72954
13427b9209A77516Q0460m8533J39057j71736M6586G2217M541M42199r2080B02319
13415A25526Q9593A1213J95489J99178R5228a72689I5781K76276A66938D6501
13404D8597L06454E0663K02586J09790D1514J76627R9746r9118b3303B30036L84598
13393F14634A89038J17187M530J65709B02001L6810J6796o580N6993J23136H3099
13381E40015j6345r1311A51306J51159m4619J07548A12733L19956j22971Q4701
$$ plain form
13459 602763 62609 384472 -923 197443 380899 537441 183243 277999 801952 171974
13448 190399 231527 498978 290807 -182206 221584 369822 249491 -74026 31477 170795
13438 170795 130323 453304 36968 308726 451055 183688 367603 398838 -77286 272954
13427 -29209 177516 257976 209443 348500 176764 223350 72217 76758 518957 426877 202319
13415 125526 215119 11213 206702 405880 501108 -172689 95781 372057 166938 46501
13404 48597 355051 50663 253249 363039 41514 218141 317887 218769 -23303 230036 614634
13393 614634 189038 306225 310755 476464 202001 238811 255607 249027 306020 429156 83099
13381 540015 523670 432359 151306 302465 257846 365394 112733 432689 309718 394419
13371C94419A28845R5676J35101B1722K94505L5129A63213J61170P866o6531D5982
13359F01231A97008o8168K27594j16314E1910J61688p1532J64783r1113K04771
13349D20507j70420K17013j85337L4907j27665L16945B48648K81663d9350B77869
13338A86810h9869B28455R1845a8671C89583j74242K36581e0406B39006L8341
13328B77347j35820J7840J00025R4014D6444e4276A72538K81563A85244O8414
13318B53658k0593K3107i5143D23372A74617o6135J90068j30860L11582k06530
13308B72742A74N65985c6676C2756K40608j11577a8067D00762j22855O6704F5277
13296A24243L33100d0089B98809O0003K5575c5908G3536L8861O000J01161b2313
$$ plain form
13371 394419 128845 224521 359622 21722 316227 351356 163213 324383 332249 265718 45982
13359 601231 197008 128840 356434 240120 51910 213598 142066 306849 215736 420507
13349 420507 250087 467100 281763 316670 189005 505950 248648 530311 -49350 277869
13338 186810 -89869 228455 320300 -18671 389583 215341 451922 -50406 239006 277347
13328 277347 141527 159367 259392 353406 46444 -54276 172538 454101 185244 253658
13318 253658 233065 256172 -95143 423372 174617 108482 298550 167690 479272 272742
13308 272742 174 566159 -36676 32756 273364 161787 -18067 400762 277907 344611 65277
13296 124243 457343 -40089 298809 358812 384387 -35908 73536 112397 118397 219558 -22313
13284F1244P9001J02905O567J2693a08134a307j55455D511L72857j36697j01800
13273A38871Q7899R8095C2409a63425e5755B51778D5164N3793B9897J10210j1005
13262A29102B7410j3623D485d0307C63805A34386M6671m4836b0253C39917F1321
13250B78400o6386a02686n1860B24056j2364K7899E0495K55948J36807j77811
13240B65439K49841c6446B59743A2501N9489a8860C25994a5943A99472d508A69943
13228I688J51871J35155C4361K24528g5596C06257c3012A86823c19363A54482
13217A01222D0498A1332J7844K83465j26491i2349l8612j86700B13701J31053
13207C44754j53138O8794b0948B81824a67851C9557J9665k0884K91850j55835
$$ plain form
13284 61244 140245 243150 249717 262410 -108134 -1307 -156762 4511 377368 240671 138871
13273 138871 226770 324865 32409 -163425 -55755 251778 45164 98957 29897 140107 129102
13262 129102 27410 13787 4485 -40307 363805 134386 181057 136221 -20253 339917 61321
13250 278400 212014 -102686 -154546 224056 211692 239591 50495 306443 443250 265439
13240 265439 515280 -36446 259743 12501 71990 -18860 325994 -15943 199472 -4508 169943
13228 9688 161559 296714 34361 258889 -75596 306257 -33012 186823 -319363 154482
13217 101222 40498 11332 29176 312641 186150 -92349 -130961 -317661 213701 344754
13207 344754 191616 260410 -20948 281824 -167851 39557 59222 38338 330188 174353
13197A74353J19626I0965K76169A19110j2731l8340M5110J44924h8789I0650m495
13186H6155J67566o0041G933J86260j5693D3817c4759A78910f3047A53537b38955
13174B5667f1008E7082k6980K87376J58751C1181a7503C91494b95532J44952k7424
13163a78004A36909o1718Q5502a00721B23262N4789k6849L3509A11881b246A81913
13151C36447g0308C20480j17717e3246C0719K52051C5156J34914K32865b76634
13140B4019d6885m5955B52142f8127B93140j41813K65942A79381E8120J35181
13130A93301h7066B34277o0480l3212e9521B21036f4300H7701J69483G8585h1927
13118a98195e1057A94061J60883e3401D2688M1123J66138b21458j4848C17449
$$ plain form
13197 174353 293979 90965 367134 119110 106379 68039 113149 258073 -88789 90650 86155
13186 86155 253721 193680 7933 194193 178500 43817 -34759 178910 -63047 153537 -238955
13174 25667 -61008 57082 30102 317478 476229 31181 -17503 391494 -295532 -150580 -178004
13163 -178004 136909 75191 160693 -100721 223262 278051 251202 284711 111881 -2246 181913
13151 336447 -70308 320480 202763 -53246 30719 282770 35156 170070 402935 -276634
13140 24019 -46885 -92840 252142 -68127 293140 151327 417269 179381 58120 193301
13130 193301 -87066 234277 173797 140585 -59521 221036 -64300 87701 257184 78585 -81927
13118 -198195 -51057 194061 354944 -53401 42688 83811 249949 -221458 -236306 317449
13107A844f5121F8614k7048b3384j09226C9866b53626B00542e9860D41473I3448
13095b6319m7179A02990c06591A30399K19470A31822Q3761a39615A66703c0648
13084a03813K3059D4367f7826F8964R8300a13249F9656K02111A5764J25576a09055
13072A26460J6754a13995n3578A10638a02121E5517b31786F2432h2390H9471J10057
13061A99528m2446a0517q7301A14791E4360J14466J64811E7179a8725A57026p1456
13050H5570J32562e152B53089r6221F6559L04281C4562b27910B04550J02764N0980
13039C58294K01429j01986D1436J6049J94327M2633b07883A38993J93641J09020
13029D41654k16745o7221b12180B30295J80015j27380e6384A60594M6865D5207
$$ plain form
13107 1844 -65121 68614 41566 -23384 -132610 39866 -253626 200542 -59860 441473 93448
13095 -26319 -73498 102990 -306591 130399 349869 131822 215583 -139615 166703 -30648
13084 -103813 -80754 44367 -67826 68964 167264 -113249 69656 271767 15764 141340 -109055
13072 126460 143214 -113995 -167573 110638 -102121 55517 -231786 62432 -82390 89471 199528
13061 199528 157082 -10517 -97818 114791 54360 168826 333637 57179 -18725 157026 85570
13050 85570 218132 -5152 253089 156868 66559 370840 34562 -227910 204550 307314 358294
13039 358294 559723 457737 41436 57485 251812 294445 -207883 138993 332634 441654
13029 441654 224909 157688 -212180 230295 410310 282930 -56384 160594 207459 45207
13018B00166e04A25652b47484A06572J43546J66050A31659D2181O1325M5167k2657
13007A26016J01477J96079A56413L08097h6410A41867L7733o9362C0375d6846
12996b61639J8233j51837C89328D7673i3436F1829L63229g9862p437A81802a17018
12984D04134F4548d1346A61396C655J28458R0324K10017b8754A49699E0075J13006
12973A63081b60786B61369C4859l399N587M09591A3914L88479a62850B71160m626
12962B66534i6323D62564A66363B1807P7777K40438Q772A7590g0907D4971Q1314
12951A26285m7758f1021k3098D17873A03570b43840C00369C4179a19711K183A21097
12939b2170A96511H1467l6560K3056O5871a2687A55858c0443B15991J0598h5857
$$ plain form
13018 200166 -504 125652 -247484 106572 250118 416168 131659 42181 103506 148673 126016
13007 126016 227493 423572 156413 464510 -86410 141867 179600 110238 30375 -46846
12996 -261639 -243406 -395243 389328 47673 -93436 61829 425058 -79862 -87299 181802 -117018
12984 404134 64548 -41346 161396 3655 132113 222437 432454 -28754 149699 50075 163081
12973 163081 -260786 261369 34859 31460 37047 446638 13914 402393 -162850 271160 266534
12962 266534 -96323 462564 166363 21807 99584 340022 348794 17590 -70907 44971 126285
12951 126285 78527 -61021 -84119 417873 103570 -243840 300369 34179 -119711 -117528 121097
12939 -22170 196511 81467 44907 67963 133834 -12687 155858 -30443 215991 226589 -85857
12927A21841b93265B1052b01749B62850b68122B03691k5583L5565a45557C5393
12916G0577K2818R7674I4122i7852b9087i533k47176h0604K1625I29J18610b25846
12903A32778f4733B09022B8355a89014b5690D8056f0385I1577h4686B82395A7200
12891a190E0226i8812c3027E0161K45677m6270J03896l4595j21016q8908b12520
12879b47640A17725a31996g402A25792k1503L02166a14640p4164c8387r268A72609
12867a09646C17597A808b42486o7685C35717c6529k07541J09033L0320R033j86228
12856b81912H9673a58111f8172j2606A22425J71425F5522J9736K18335k7749A03544
12844B49544N4028A34036J01440N4768H6599M6004K27935D1633c11850A26993
$$ plain form
12927 121841 -293265 21052 -201749 262850 -268122 203691 178108 213673 -145557 35393
12916 70577 93395 191069 94122 -97852 -29087 -9533 -256709 -80604 -58979 929 119539 -225846
12903 132778 -64733 209022 28355 -189014 -25690 48056 -60385 91577 -84686 282395 17200
12891 -1190 50226 -98812 -33027 50161 295838 249568 353464 318869 197853 108945 -212520
12879 -247640 117725 -131996 -7402 125792 104289 406455 -114640 -188804 -38387 -47655 172609
12867 -109646 317597 1808 -242486 -310171 335717 -36529 -244070 -135037 -104717 -95684 -281912
12856 -281912 89673 -158111 -68172 -80778 122425 293850 65522 85258 303593 275844 103544
12844 249544 303572 134036 235476 290244 86599 132603 360538 41633 -311850 126993
12833a81669G504J48601l3964b57666H7662B7019b40j27229B07311h6535E9061
12821B38P4453f2609A94636J60155q5405A14494a82905B02959F9206Q1463N3307
12810B03976P0923H8789e0850h369j83370D1864O6102J04608p2328M1715r0158
12799I1803J62046E7366b1879E1771J21234k9646e6044D8267O2806f1938r5854
12788a57792B7749a56859P3422c0578A65759c7915a3366q2109A40062n6497d4441
12776B50260a62136I2226J94139j19837a23908c3787j89999A85244a00901J9991
12766h0910G2327d10232d646B30358A09271J82605B1836Q9889L0192g2762A89020
12754A8473L1961a65445j24302N3893i8047C49870a12746H5246N3968i2793G3344
$$ plain form
12833 -181669 7504 156105 122141 -257666 87662 27019 -240 -127469 207311 -86535 59061
12821 238 74691 -62609 194636 354791 269386 114494 -182905 202959 69206 150669 203976
12810 203976 274899 88789 -50850 -8369 -191739 41864 107966 212574 140246 181961 91803
12799 91803 253849 57366 -21879 51771 173005 143359 -56044 48267 111073 -61938 -157792
12788 -157792 27749 -156859 -83437 -30578 165759 -37915 -13366 -95475 140062 83565 -44441
12776 250260 -162136 92226 286365 166528 -123908 -33787 -223786 185244 -100901 -80910
12766 -80910 72327 -410232 -4646 230358 109271 291876 21836 111725 141917 -72762 189020
12754 18473 50434 -165445 -289747 -235854 -98047 349870 -112746 85246 139214 -92793 73344
12742C42144H8076J12543A005Q9894J56172J63575g6353R612A84650C8719P7882
12731A16601E5152f2327K1086A93430b52651I1443Q1361a4486j32216A82065P6029
12720B58094F0881a39890B84769a00721B6205K54426j31056K71314E0137J96063
12710B46200g286A74735l5122n7891K65461j59146L582A4446J84221r4120K56926
12699C61473B6081J654b9654k86169d8634o6471I3259a00064E9095P9629N7338
12688A96062c2003j68506g5332j38820I7320c3630A2381a18207A97502E2184K16990
12677B69174j27806j2252J29648D9963M0705d7621A21053l4852L37J11481b3325
12665B95257n7558h2877A85828C4793L87973A35247j225A3361g7492C90832h3188
$$ plain form
12742 342144 88076 200619 1005 90899 247071 410646 -76353 -66741 184650 38719 116601
12731 116601 55152 -62327 -41241 193430 -252651 91443 172804 -14486 -146702 182065 258094
12720 258094 60881 -139890 284769 -100721 26205 280631 149575 420889 50137 246200
12710 246200 -7286 174735 139613 81722 347183 188037 191619 14446 198667 104547 361473
12699 361473 26081 27735 -29654 -315823 -48634 -115105 93259 -100064 59095 138724 196062
12688 196062 -32003 -200509 -75332 -214152 97320 -33630 12381 -118207 197502 52184 269174
12677 269174 141368 129116 258764 49963 90668 -47621 121053 86201 86538 198019 -23325
12665 295257 237699 -82877 185828 34793 422766 135247 134022 13361 -77492 390832 -83188
12653A67909D9236K1673a41413l0511A10367K63362a51527A76341R7149d8162
12642c95172a71984L4867l1840g8264A05437b25511f0422B50128B4035a7798D6580
12630B6035A449M1370J99878j17320O3933c2331j64316B39790k057A8093K78019
12619B96112A1204a23142B95695b1331B69805P5376G4485f1355q0440f6201j19937
12608a86138C01699a84301O0636A58383d4432B28994h6666j98254A48230P9422
12598B27652K8321j6792a23961A2947A314J47214K8661O4869g3411D7634a56113
12586c766m505k43283D8581e5004a1154m3539a5542B53094L5862a75541g8845
12574C23615F2781h4761B46397a83377a3249B1189N5165j7598K736J8246K09982
$$ plain form
12653 167909 49236 70909 -141413 -171924 110367 373729 -151527 176341 273490 -48162
12642 -395172 -171984 -137117 -168957 -78264 105437 -225511 -60422 250128 24035 -17798 46580
12630 26035 1449 42819 242697 125377 189310 -32331 -196647 239790 237733 18093 296112
12619 296112 11204 -123142 295695 -21331 269805 345181 74485 -61355 -141795 -66201 -186138
12608 -186138 301699 -184301 -123665 158383 -44432 228994 -86666 -284920 148230 227652
12598 227652 255973 239181 -123961 12947 1314 148528 177189 242058 -73411 47634 -156113
12586 -3766 -8271 -251554 48581 -55004 -11154 -54693 -15542 253094 288956 -175541 -78845
12574 323615 62781 -84761 246397 -183377 -13249 21189 76354 58756 61492 79738 289720
12563B89720Q7694a02401D4695M46463c94850a04906n6014i365D326h9581A75986
12551C27287i9768j27019c0388B07518q5240b6224D7017L29458a478k59441N5470
12540b05449Q0369A59643F8846a41876B36206B4436M2179Q061K52092I655b5101
12528A58255c04802b9068A4009a72675A5489M300Q1998J1570E3864Q6659J57950
12517B98473a93029e9013a1267q2786j1109A26270d08745E1589k0661M64785j69914
12506C25799a95672H2558l292M62785k50446c0828c48A65364c82348B01141b05930
12494B15877a04060E58098B70547A25777j9193b07269A37932D0705i566p3406
12484h2972B15687J08039A754J48491D4660P8559J28573b3896A85634K79593A53483
$$ plain form
12563 289720 377414 -102401 44695 491158 -394850 -104906 -160920 -9365 4326 -89581 175986
12551 327287 -99768 -226787 -30388 207518 122278 -26224 47017 376475 -1478 -260919 -205449
12540 -205449 -125080 159643 68846 -141876 236206 24436 66615 74676 326768 9655 -25101
12528 158255 -304802 -29068 14009 -172675 15489 19789 101787 113357 53864 140523 298473
12517 298473 -193029 -59013 -11267 -94053 -105162 126270 -408745 51589 30928 495713 325799
12506 325799 -195672 82558 79266 542051 291605 -30828 -348 165364 -382348 201141 -205930
12494 215877 -104060 558098 270547 125777 106584 -207269 137932 40705 -9566 -82972
12484 -82972 215687 323726 1754 150245 44660 123219 251792 -23896 185634 465227 153483
12472C00686O5930b6753B93038j06551b17126G1556b34828O9392C50700b62364
12461e759l746o9967j782e212p879q819l1642I2766a1475I5732I012K32601j18631
12448A22982J3315J8155J44072A12177Q8889r4880J8397f1523C44271a06785J2579
12437i4206j41193B07432a32449B31762c47723H6533O6358e856k34612C34183
12426H8977A8919J2783a34250j7781F3845e3043j4237o8447K9265k8117A75716
12414h8012A94562j3972E4522L3880a09126j07881E8210m323c80007h3577E9482
12402E1733c357j40988B00654n7535H172i1314j57295B8863e2315b1470j04422
12391a25892A86871d5381A45384c111A40543E7781h176n3029A99498H618f7595
$$ plain form
12472 300686 366616 -26753 293038 186487 -217126 71556 -234828 -165436 350700 -262364
12461 -5759 -9505 -79472 -81254 -5212 -13091 -21910 -53552 92766 -11475 95732 9012 241613 122982
12448 122982 136297 154452 298524 112177 201066 106186 124583 -61523 344271 -106785 -94206
12437 -94206 -235399 207432 -132449 231762 -347723 86533 152891 -5856 -240468 334183
12426 88977 18919 31702 -134250 -152031 63845 -53043 -67280 -135727 -106462 -134579 175716
12414 -88012 194562 180590 54522 88402 -109126 -217007 58210 53887 -380007 -83577 59482
12402 51733 -3357 -144345 200654 143119 8172 -91314 -248609 28863 -52315 -21470 -125892
12391 -125892 186871 -45381 145384 -3111 140543 57781 -8176 -61205 199498 8618 -67595
12379d3604k47009J30291G0827i2542C23070A51526J02550E2351d0544C63804
12368C5466g3790b4226k09227A66303J26706j28558a3374j80781E8383b17416
12357G8357d6151j58908C02550j28704G4849c6861p6622j09790A38087j0044j178
12346A26865N5860b397C11390e1818I4185K17061b8624j26075B28590j6611d1089
12334b0966A16078b04257f0095A12341f8039j89793a18402l93478A33312E0159
12323a63412A9471O2636h9199D2212K25150c1315A81228i1734b541B33216b52639
12311f9044p638B27190f9277B5905b74337B89458E8113K60281a91991F9177J12861
12300A82038c11889Q1747h2815k09922A21265J14739o993c3969j91311c9176j12609
$$ plain form
12379 -43604 -290613 -160322 70827 -92542 323070 151526 254076 52351 -40544 363804
12368 35466 -73790 -24226 -233453 166303 293009 164451 -13374 -194155 58383 -217416
12357 78357 -46151 -205059 302550 173846 74849 -36861 -113483 -223273 138087 128043 126865
12346 126865 182725 -2397 311390 -51818 94185 311246 -28624 -154699 228590 211979 -41089
12334 -20966 116078 -204257 -60095 112341 -68039 -257832 -118402 -511880 133312 50159
12323 -163412 19471 82107 -89199 42212 267362 -31315 181228 -91734 -2541 233216 -252639
12311 -69044 -76682 227190 -69277 25905 -274337 289458 58113 318394 -191991 69177 182038
12300 182038 -311889 -230142 -82815 -292737 121265 236004 229011 -33969 -225280 -39176 -151785
12289a51785A55530l0888M3415g0484B83418c5791B35743p0818b72309A86342
12278h0763j61003j79859A71645B7229J07935E4188i1604b1657A75718C4563O8470
12267A03033K02720A02780J02612B727J19654J1240a85675C5249h755B14151J54050
12256C68201A45037J19814c7601E8194E039M6422A9650L90353G6756A9953L19606
12245C39559o641j60323j3557J76383A5336a83645A85297o5042P7007A3818K45156
12234B58974A14557R8884f2734r7735A21887d2887C55572A55431J89486j71086
12224A73831J45022Q3237A80702N8294a8707D40103d9476j3613E05364j58041
12214C47323c0320A33625Q3892a60816g2496D35726E8764j7269J53654H4808J96646
$$ plain form
12289 -151785 155530 124642 168057 -70484 283418 -35791 235743 164925 -272309 186342
12278 -80763 -241766 -421625 171645 27229 135164 54188 -91604 -21657 175718 34563 103033
12267 103033 305753 102780 205392 2727 122381 133621 -185675 35249 -8755 214151 368201
12256 368201 145037 264851 -37601 58194 5039 51461 19650 410003 76756 19953 339559
12245 339559 332918 172595 159038 335421 15336 -183645 185297 120255 197262 13818 258974
12234 258974 114557 213441 -62734 -160469 121887 -42887 355572 155431 344917 173831
12224 173831 318853 402090 180702 238996 -18707 440103 -49476 -63089 505364 347323
12214 347323 -30320 133625 217517 -160816 -72496 435726 58764 41495 195149 84808 281454
12203B81454g1558H4279J56354K40116k09331M3983C9631L16661N983C4534J9801
12192E4335K56729m791H6920Q320R1725D8095J62215b9347H9026a92593M8578
12181a44015C9967a68020C39304j32434J19655j41634c09541F4885i7438A83532
12170e5578J2218p8646k4723D31692A75017C3219d6756C25121j22895f6488A35873
12158a12811I3963d3751A53279J49092A18238B3593b7433m6436j90721A14448
12147H2683P802e2564k999R095D8948b16737K2492d2256B63601L2956N0568b03279
12134i6994J2872B30837O1547d0189j21719G0649I107i7298B69968H302L72718
12123C81020A04405M2341b3622C71555a26643a9177A27178K29263E9326h0459
$$ plain form
12203 281454 -71558 84279 240633 480749 271418 315401 39631 356292 362275 34534 54335
12192 54335 311064 306273 86920 95240 186965 48095 210310 -29347 89026 -192593 -144015
12181 -144015 39967 -168020 339304 206870 326525 184891 -309541 64885 -97438 183532
12170 -55578 -43360 -122006 -146729 431692 175017 33219 -46756 325121 202226 -66488 135873
12158 -112811 93963 -43751 153279 302371 118238 23593 -27433 -73869 -264590 114448
12147 82683 90485 -52564 -55563 -46468 48948 -216737 -194245 -42256 263601 296557 347125 -203279
12134 -96994 -84122 230837 292384 -40189 -161908 70649 9107 -97298 269968 8302 381020
12123 381020 104405 146746 -23622 371555 -126643 -19177 127178 356441 59326 -80459
12112a39807c3192B84875a08724j15523J806A09234c49515I7174J85998b29821
12101a77794A05860B8410A0770b13804E15626E6572d4981B15676F1577J9244i2861
12089C0651a27085j56392h9379l0938i546E2074a66920J512A45220k9578a20058
12077H627a56553f5734m972A91686J72020H8384F167e2239c193k9469j25774n7665
12065b16101A09862d2900A15102P3480b93958B7218L4615J66852b33041l8425
12055b71466a8399G4824b63912c0902A55967d2827I9450P4988a85144f105I6936
12043B5863K99039e6161A79269b77264f1048k7905A82278K307q0108b38629a11990
12031E00922B10239c77823J10819G0101a7234A50159a62697f3483k25401a05514
$$ plain form
12112 -139807 -33192 284875 -108724 -224247 -222441 109234 -349515 97174 283172 -229821
12101 -177794 105860 28410 10770 -213804 515626 56572 -44981 215676 61577 80821 -92861
12089 30651 -127085 -283477 -89379 -120317 -9546 52074 -166920 -165408 145220 115642 -120058
12077 8627 -156553 -65734 -70706 191686 363706 88384 6167 -52239 -3193 -32662 -158436 -216101
12065 -216101 109862 -42900 115102 188582 -293958 27218 61833 228685 -233041 -271466
12055 -271466 -18399 74824 -263912 -30902 155967 -42827 99450 174438 -185144 -6105 96936
12043 25863 324902 -56161 179269 -277264 -61048 -88953 182278 184585 104477 -238629 -111990
12031 500922 210239 -377823 -267004 70101 -17234 150159 -162697 -63483 -288884 -105514
12020B56075b21087E22558j09610M27513C47943j47081l5410J00748a22454B53242
12009A97523I8309a71428e9621A65208h7066p1320c452B25939a98831A23351i4156
11997H1117j6061J09282e3930C02655b46182a17161e2021B1074a75375E063L14255
11986C19318F335N63J33752b943j53785b5885j60771F1726a78583A76177C7271
11974c5172A43069B7607J08505J85686A0532J08873c3258E4985O7624J133b40571
11962a10707A20071g4159A96180c77319H5369e3009k11406C8218a10740D86952
11951A15876a27207f0458k10871F3012a96418A24861f696k32108N7196K8668O0777
11940i2163L6651M769a5693k2927j34209j13191A62025i0602j55078A50409d907
$$ plain form
12020 256075 -221087 522558 412948 840461 347943 200862 165452 266200 -122454 253242
12009 197523 98309 -171428 -59621 165208 -87066 -158386 -3452 225939 -198831 123351 -94156
11997 81117 65056 174338 -53930 302655 -246182 -117161 -52021 21074 -175375 5063 319318
11986 319318 6335 6898 140650 -2943 -156728 -25885 -186656 61726 -178583 176177 37271
11974 -35172 143069 27607 136112 321798 10532 119405 -33258 54985 122609 123742 -240571
11962 -110707 120071 -74159 196180 -377319 85369 -53009 -264415 38218 -110740 486952
11951 115876 -127207 -60458 -271329 63012 -196418 124861 -6696 -238804 -181608 -152940 -92163
11940 -92163 -55512 -50743 -15693 -38620 -172829 -286020 162025 -90602 -245680 150409 -4907
11928a89961A49150h5805I3630a08400A06975c13945h7421B58591e6879j42312
11918a99191B40090G6817a12806K5628p9310h0177A32764A5591d8486p7870B97847
11906a9728C02862E6685a10622B23513c878I0510L4859F8R1741N7960P4396J65547
11894C89712a11082B718e7584A08876i3855C09115o6834h3112r334C3851Q6161
11883A20012c54753f70l82921D07966E5671a34220d0532A82017i1708B58939o5671
11872A93268f5342A94654d2021l7638D7196f7389C6053a64985E282a41275A49156
11860C6599d0849A06757j6807d8029r0732B06504b20495j51093A17884O319J43791
11849B67994a93075a8973E1190a7643k00687e8731o9656N0128k27210F3369d7910
$$ plain form
11928 -189961 149150 -85805 93630 -108400 106975 -313945 -87421 258591 -56879 -199191
11918 -199191 240090 76817 -112806 -87178 -166488 -80177 132764 15591 -48486 -126356 297847
11906 -19728 302862 56685 -110622 223513 -3878 90510 125369 68 91809 149769 224165 389712
11894 389712 -111082 2718 -57584 108876 -93855 309115 242281 -83112 -92446 33851 120012
11883 120012 -354753 -670 -383591 407966 55671 -134220 -40532 182017 -91708 258939 193268
11872 193268 -65342 194654 -42021 -79659 47196 -67389 36053 -164985 5282 -141275 149156
11860 36599 -40849 106757 89950 -48029 -138761 206504 -220495 -371588 117884 124203 267994
11849 267994 -193075 -18973 51190 -17643 -218330 -58731 -128387 -78259 -305469 63369 -47910
11837G7424c8614p4264M0101r23I380K12273l310a81623A82254g3790A06897e1394
11824I1033a24870m4505d670D5503R4972B9189a04424A89001j2409A6531J12193
11813A28724d36226P3453a74006A2901O0938N457b3568H4966f2321n7547C13292
11801c8868j51894B6303a62207A8179B432a36375m11136C310K1149J78219H08
11789d14335A44082g0380A93705n4778J0370c1906P466A65558l8357f3278k77194
11778c40472O7951b0769B10123J60783a53699E6985c73959g1545B18113B2946
11767A74117D0172e9588j29292A01954a20671G0605c17546C50775a99046B2420
11756f800k13438A12303A2354a64394A32640c32223h4308P476j1604F7351c6881
$$ plain form
11837 77424 -38614 -112878 -72777 -73700 9380 221653 218343 -181623 182254 -73790 106897 -51394
11824 91033 -124870 -169375 -4670 45503 140475 29189 -104424 189001 176592 16531 128724
11813 128724 -436226 -362773 -174006 12901 73839 79296 -23568 84966 -62321 -119868 313292
11801 -38868 -190762 26303 -162207 18179 2432 -136375 -547511 3310 24459 202678 808
11789 -414335 144082 -70380 193705 138927 149297 -31906 -24440 165558 127201 -63278 -340472
11778 -340472 -272521 -20769 210123 370906 -153699 56985 -373959 -71545 218113 22946
11767 174117 40172 -59588 -188880 101954 -120671 70605 -317546 350775 -199046 22420
11756 -6800 -220238 112303 12354 -164394 132640 -332223 -84308 -76832 -88436 67351 -36881
11744g5658l4263l5734e660j11007L4792q089C19568b06314e3966B4077g6674
11732A11516J26015d089A28614b6643A55114h7490j88725C1960o396a30120O409
11721a23711C1266M45980F7866M17610a54317L7235N0850B56990O4959F7153J7472
11710H4625a17689L8573k92029A62078a21676n1015j98979B44829A6403K25142
11700B41545a03605g113A59830a21663I7852K77737F8456K47720e8461F6785J45421
11689B12206A5403b07008A63882O6464h7448D7128a11521H025K43659b07005P5173
11678a31832A05548J6223l2863A32a77637B45320a8819A17161l722a2411l7972
11667e0383Q27E65379b32545A85602A8967L31203K8254A67886d2677C91477A39107
$$ plain form
11744 -75658 -109921 -145655 -5660 -116667 -81875 -89964 319568 -206314 -53966 24077 -76674
11732 111516 237531 -4089 128614 -26643 155114 -87490 -276215 31960 25564 -130120 -123711
11721 -123711 31266 477246 67866 485476 -154317 -117082 -66232 256990 321949 67153 84625
11710 84625 -117689 -79116 -371145 162078 -121676 -172691 -371670 244829 16403 241545
11700 241545 -103605 -7113 159830 -121663 97852 375589 68456 316176 -58461 66785 212206
11689 212206 15403 -207008 163882 230346 -87448 47128 -111521 8025 251684 -207005 -131832
11678 -131832 105548 121771 88908 132 -177637 245320 -18819 117161 113439 -12411 -50383
11667 -50383 -49556 565379 -232545 185602 18967 350170 378424 167886 -42677 391477 139107
11655c8565A11784d2889j72563d3459q347j26070h8585b4777A19661K06519A42050
11643H3647A1124J34062a92425c3178A49094a25403H2704f7910F7507Q9548a1062
11631A4085J27054A8469K45949H0682L44751a1934r6796L8274j1623B11864K05789
11620D17653A69753O0976e67123b1786l7123l3956J5857A8812a90537A95219m1386
11609A53833B9276L8297J61702i5588p4804B3799P7618J3751D1591R2232l1332
11598A02491k5928g8562B3807Q7931d3761A6692g7152B17212p3439K31069E2539
11586C73303o1528a78619A24862c26737A82142I0486h7270A12757C0654J96728
11576B27382q6357E4628d715B19269c8156A3806K10167a95057Q8924B91846A24575
$$ plain form
11655 -38565 111784 -42889 -215452 -43459 -51806 -177876 -88585 -24777 119661 326180 142050
11643 83647 11124 145186 -192425 -33178 149094 -125403 82704 -67910 67507 157055 -11062
11631 14085 141139 18469 264418 80682 425433 -11934 -108730 -70456 -82079 211864 417653
11620 417653 169753 230729 -567123 -21786 -58909 -92865 -77008 18812 -190537 195219 153833
11609 153833 29276 67573 229275 -95588 -170392 23799 101417 115168 41591 133823 102491
11598 102491 76563 -78562 23807 111738 -43761 16692 -77152 217212 143773 374842 52539
11586 373303 311775 -178619 124862 -326737 182142 90486 -87270 112757 30654 227382
11576 227382 141025 54628 -4715 219269 -38156 13806 223973 -195057 -106133 291846 124575
11564a04848B95154I0831K46965j22648a44590A35155l5547C3468e053A42937
11553a37766j03922B08224F2888Q3089d1579H8478b31203A41838k4739N0195J35196
11542C02490k0851I28a17649B46901a0283D3274a14020B29672e2812I3003J60433
11531B53436H6110C5011J47737a77340B67826I7719P0332a7881B44026A14517
11520A16612a5643D03384A26707J97423j43255A6624L208J00565a02690B69490
11509B24740o9305Q5411K77570B3996a14751b4586A30488L1768D0502R2660D0038
11497B37286F5759L1900J07405e6172n2289B11352a23574G998L9665K5676k4191
11486D9148K71220j4564f9398C7785K74789A37375L93030F7101k7160L0413J33324
$$ plain form
11564 -104848 295154 90831 337796 215148 -144590 135155 99608 33468 -5053 142937
11553 -137766 -241688 208224 62888 145977 -41579 88478 -231203 141838 117099 167294 302490
11542 302490 281639 928 -117649 246901 -10283 43274 -114020 229672 -52812 93003 253436
11531 253436 86110 35011 182748 -177340 267826 97719 168051 -17881 244026 114517
11520 116612 -15643 403384 126707 324130 180875 16624 19832 120397 -102690 269490
11509 224740 155435 240846 518416 23996 -114751 -24586 130488 162256 40502 133162 40038
11497 237286 65759 97659 205064 -56172 -108461 211352 -123574 7998 47663 73339 49148
11486 49148 320368 305804 -69398 37785 312574 137375 530405 67101 39941 70354 203678
11475B03678J29899j64431a93607c5221E11534B45053a34311K2815A87113K11747
11465C98860j37895I6356O8049o4942l5663L2563N00176a50260A46448a09978
11454I9011L05945H7251K06260E8309d4350C3828a18678c5670A11585a09753A59505
11442E67870B20129c47238F026P6256J55608g8827C00600G9725d598C55118D3081
11430b0960B89487a40385j01305B21599K1744I7175a7389E9701q21K75617c9266
11418b77024i4993L645A43450l3705B7983J55078B6365a11648I4509L8166j4723
11407A17952b0491A22902J16216b27874e6684D7679J22878a0608A59974N377G4105
11395b32524e3884m7484r3937B56639n1228b45911A17779g9994D5051b86220A4047
$$ plain form
11475 203678 333577 169146 -193607 -35221 511534 245053 -134311 -111496 187113 398860
11465 398860 260965 96356 164405 99463 63800 96363 596539 -150260 146448 -109978
11454 99011 404956 87251 293511 58309 -44350 33828 -118678 -35670 111585 -109753 159505
11442 567870 220129 -347238 6026 82282 237890 -78827 300600 79725 -4598 355118 43081
11430 -20960 289487 -140385 -241690 221599 243343 97175 -17389 59701 58880 334497 -39266
11418 -277024 -94993 -91348 143450 109745 27983 183061 26365 -111648 94509 132675 117952
11407 117952 -20491 122902 239118 -227874 -56684 47679 170557 -10608 159974 165351 74105
11395 -232524 -53884 -101368 -195305 256639 205411 -245911 117779 -79994 45051 -286220 14047
11383a05610k34538b8628m900k87242A62390J0999a03218D8530J36293K0718b26424
11371B05668a21477B33187c14157J19537i3260o0128A49300b22083g6244j07295
11361a83539L0614A12520C1263K11385a86226D2097a8230l6857A16920J26870
11351B43790f3910A6824a2086k29602L1546B36816c07666n6733A89855F2154b26920
11339h7837J9922j37036d4153j7638B03574G3596a45444j17583A28462a31973
11328b43260B77373j09375a8058C05984A01510D5505a50540A69189o6299c5387
11317a17875B98437j01162f7753E8096L8095b9029j56962A00905j6357J27845
11307B12393i5467I5088O222f4022l7549A25879R6394j3972J04215E8453a44478
$$ plain form
11383 -105610 -340148 -28628 -33528 -320770 162390 173389 -103218 48530 184823 205541 -226424
11371 205668 -121477 233187 -314157 -194620 -93260 -153388 149300 -222083 -76244 -183539
11361 -183539 -152925 112520 31263 242648 -186226 42097 -18230 -55087 116920 243790
11351 243790 -63910 16824 -12086 -241688 -210142 236816 -307666 -364399 189855 62154 -226920
11339 -87837 -67915 -204951 -44153 -61791 203574 73596 -145444 -263027 128462 -131973
11328 -243260 277373 167998 -18058 305984 101510 45505 -150540 169189 102890 -35387
11317 -117875 298437 197275 -67753 58096 96191 -29029 -185991 100905 84548 212393
11307 212393 -95467 95088 101310 -64022 -101571 125879 222273 208301 312516 58453 -144478
11295c01838C3887a94772B1957a62770o6278a03281e903D01904b10761P9788A033
11283B29145l8786b11170a9402B33625c61973A64154G5676O0464M9453c57542
11272A94345B9630L747g684p4385O955A41611K792i4304A26836M2417g796F6386
11259B75791A31405D3428a41773A05790A3395J88283a28443A3249e0116A80257
11248b05936C50239H7521R7022L5060m6609H3693b10664b996E3276K11680M9836
11237C14792d8358m6537C18048q8786J51270A24837J09754N8448g6714B68997
11226a82160F3237J54953e18601e0903j8233l0004K731c3824m0862I9872b72732
11214c0222A2576P0559M7964b31518j52112d9549j58051F2779c6162l44728J21390
$$ plain form
11295 -301838 33887 -194772 21957 -162770 -229048 -103281 -5903 401904 -210761 -130973 1033
11283 229145 190359 -211170 -19402 233625 -361973 164154 75676 136140 185593 -357542
11272 194345 29630 33377 -7684 -82069 -75114 141611 144403 -94304 126836 169253 -7796 66386
11259 275791 131405 43428 -141773 105790 13395 201678 -128443 13249 -50116 180257
11248 -205936 350239 87521 184543 219603 172994 83693 -210664 -2996 53276 264956 314792
11237 314792 -48358 -94895 318048 229262 380532 124837 234591 293039 -76714 268997
11226 -182160 63237 218190 -518601 -50903 -69136 -99140 -96409 -33824 -74686 99872 -272732
11214 -30222 12576 83135 131099 -231518 -383630 -49549 -207600 62779 -36162 -380890 -259500
11203b59500c2637j97790Q4480e1425j31817q5023o2963A32287O8674C7738N5940
11192I3678b74096c8079k79638J041a260B0063g6554A35840c08846B59538h2119
11180a54929C0375m264a55564E3243e2431I441J26904n465J03319a47281a84k96421
11168b96605G3396b14782J01291j47845J09052C17501a32691D3534j4277a75870
11157c9640o4649j7781d3084q7278c0724B3298i6446A61298P0758J68377D4042
11145F0175J14458D3892A6490M7245c8341k1847A80815K4812a01685B3547a7527
11133A21373b35488a04347r5635E7609d9972j64495a2069j25076G0109K0922k3480
11122F7551K0604P7768b30044e0692j53800B32023J44060a45044e5705J6890D56121
$$ plain form
11203 -259500 -32637 -230427 -145947 -51425 -183242 -268265 -331228 132287 200961 37738 93678
11192 93678 -274096 -38079 -317717 -316676 -1260 20063 -76554 135840 -308846 259538 -82119
11180 -154929 30375 26111 -155564 53243 -52431 9441 136345 130880 234199 -147281 -184 -296605
11168 -296605 73396 -214782 -113491 -261336 -152284 317501 -132691 43534 29257 -175870
11157 -39640 -104289 -122070 -43084 -130362 -30724 23298 -96446 161298 232056 400433 44042
11145 60175 174633 43892 16490 63735 -38341 -60188 180815 205627 -101685 23547 -17527
11133 121373 -235488 -104347 -199982 57609 -49972 -214467 -12069 -137145 70109 91031 67551
11122 67551 88155 165923 -230044 -50692 -204492 232023 376083 -145044 -55705 -38815 456121
11110A6569O1697A2406J86414k6854k3407J26499o7216J12293a82014B69231G7785
11098A87792K89142A68168R2248n3243H1933P6335O0829M5906G2372K78688q7122
11087B63938l0662A07773b8358o3535A42144o1103J83081k3705J79753a3578I877
11075A90265B0360O0607L08890j17636J33673o6320j29567J68912K8685q7660
11065C19944A4312h7300A53925M85742j37957J54611k01526K26044j69585K12175
11055G23429k70114J99907K62573j66963K8365l48210N7865l8326N54260l68577
11045F34209o782J30032k46101J97410j55597L02424l8819j22234k14448K26125
11035G06219L35904k07468o8017Q6165J2307j36279J39685R6671D52476K45530
$$ plain form
11110 16569 78266 12406 198820 171966 148559 275058 207842 320135 -182014 269231 77785
11098 187792 476934 168168 260416 207173 81933 158268 219097 265003 72372 351060 263938
11087 263938 233276 107773 -28358 -91893 142144 81041 264122 240417 420170 -13578 9877
11075 190265 20360 80967 389857 272221 405894 339574 210007 378919 407604 319944
11065 319944 14312 -87300 153925 639667 501710 656321 454795 680839 511254 723429
11055 723429 453315 653222 915795 748832 777197 428987 486852 448526 1002786 634209
11045 634209 627427 757459 511358 708768 553171 855595 816776 694542 480094 706219
11035 706219 1042123 834655 766638 852803 865110 728831 868516 965187 452476 698006
11025F98006K7756K91443j89871m02025K69876J39244M9084j61583k21120M1535
11015E42345M7884L84722D00073A94561M56955l2625j95978M64713p7846j91959
11005F17821K09387J38527l32426j48302N55157n05981N56880l47989j46445r6634
10995D99995K8348J33371P5782K1326o4867J01133J82732r2054p783n3698L06074
10984A130359l3282k05735M44420k49118N97151l63870L5392J06349J97298K74324
10974A933288M67055K56509K06684j48378K44441M52067J98068j95820j35244
10965C278670m44776r9660n86202k12402K05562l16135p9447j39147Q7020K392
10955A695875J46695l28926j48279k04248j53013j46515C24249j37893O36737
$$ plain form
11025 698006 725762 1017205 827334 425309 695185 834429 883513 721930 500810 542345
11015 542345 590229 974951 400073 194561 651516 618891 422913 887626 809780 617821
11005 617821 827208 965735 633309 485007 1040164 534183 1091063 743074 596629 499995
10995 499995 528343 661714 737496 758822 693955 795088 977820 885766 877983 824285 1130359
10984 1130359 1097077 891342 1335762 1086644 1683795 1319925 1355317 1461666 1658964 1933288
10974 1933288 2400343 2656852 2863536 2715158 2959599 3411666 3609734 3413914 3278670
10965 3278670 2833894 2734234 2148032 1935630 2141192 1825057 1745610 1606463 1693483 1695875
10955 1695875 1842570 1513644 1365365 1161117 1008104 861589 324249 186356 823093
10946H23093A97391K85457j84015k5747K477L8315A42838f566B26523e4105B72351
10934C28793A08268e1374k144A071J1507c00009B15793G9438e8365A4614J2920
10923B7534R9694a10055c2973A43016J24922H479L68617F8413a37554J2631H1248
10911b34196B37620R7577j24302g125E1262P8554e4719m1873k8277D8471b00799
10899A73758D0473i3001A20859K4009F1262e7707B930a93463j07240h0786o7632
10888a48418A82628c65890C388i7068j4929I1717b48931a05114a704B27070K44850
10877D71920D6769J81122C8141a29195A22685b05361H5539b33757B60345I1918
10866A43913Q0427a58865G481J13817e3892m1446H5340l9164f767m6589C8331
$$ plain form
10946 823093 197391 482848 298833 273086 275563 313878 142838 -6566 226523 -54105 272351
10934 328793 108268 -51374 -53518 1071 12578 -300009 215793 79438 -58365 14614 27534
10923 27534 127228 -110055 -32973 143016 267938 8479 377096 68413 -137554 -124923 81248
10911 -234196 237620 335197 210895 -7125 51262 129816 -54719 -96592 -124869 48471 -200799
10899 173758 40473 -93001 120859 144868 61262 -57707 2930 -193463 -300703 -80786 -148418
10888 -148418 182628 -365890 3388 -97068 -111997 91717 -248931 -105114 -1704 227070 471920
10877 471920 46769 227891 38141 -129195 122685 -205361 85539 -233757 260345 91918
10866 143913 224340 -158865 7481 121298 -53892 -95338 85340 46176 -6767 -53356 38331
10854B24654p0580b55877a07472o3227B5162a1873C94687a08371J3508l53016
10844d47879a04108D9196e9038j05179H7888c55686B11300p0640a89967D33018
10833B7403J40229c2323H1022a35239C2619a78595o2424A1433J06121B7547j0508
10822A7039b70537c8607B53302c7404q8323j21246A03501f570A40502a83524P1045
10811a12479M4221b677j31186f5305J9113n6214Q002A02738a79027q5411k45541
10800e09979C08531b05846A89853b95015I9180l2777b53292F0953b82598C198
10789B18252g0416j26420Q6244A17937f854j37888o3084c0143k78454G4078c6520
10777d1251A50299p1048J9535b76805O6263F2607L52617j82815j15200J1656M0522
$$ plain form
10854 224654 154074 -255877 -107472 -170699 25162 -11873 394687 -108371 -94863 -447879
10844 -447879 -104108 49196 -59038 -164217 87888 -355686 211300 140660 -189967 433018
10833 27403 167632 -32323 81022 -135239 32619 -178595 -241019 11433 117554 27547 17039
10822 17039 -270537 -38607 253302 -37404 -125727 -246973 103501 -6570 140502 -183524 -112479
10811 -112479 -68258 -2677 -133863 -65305 -46192 -102406 -94404 102738 -179027 -264438 -509979
10800 -509979 308531 -205846 189853 -295015 99180 66403 -253292 60953 -282598 3198
10789 218252 -70416 -196836 -110592 117937 -6854 -144742 -207826 -30143 -308597 74078 -36520
10777 -41251 150299 79251 98786 -276805 -210542 62607 415224 232409 117209 128865 169387
10766A69387a36352L5783a2770n3111C07760c8496H0567b79229j6174A31450b9817
10754b6596o7092p2963c849J224A12638a60098q346M332e2950j36418A15091L9129
10742A54220F1372a22840D6033e7216C8993A4471J08926a95470d8515D545N4134
10731E8679g2893A31709c79651J56193B5037L1866b59069a27158j82575J26311
10721a83422H2832N0465a93719A57471B8666d9038f797j03194N1831A08193b30619
10709B92369a1856j77320p5334i0429r7199G953f1388p1558N7547m6876E0583
10697b93319C1831d03659R1691J54418c4581A12207g1084j12095P0074A25953
10686a60854B15228C3779K30981H5101C5393J66392D3796J78799f6275l3817C4435
$$ plain form
10766 169387 -136352 -100569 -12770 -65881 307760 -38496 80567 -279229 -295403 131450 -29817
10754 -26596 -93688 -166651 -3849 -2625 112638 -160098 -168444 -164112 -52950 -189368 115091 154220
10742 154220 61372 -122840 46033 -57216 38993 14471 123397 -195470 -48515 4545 58679
10731 58679 -72893 131709 -379651 -223458 25037 56903 -259069 -127158 -309733 -183422
10721 -183422 82832 133297 -193719 157471 28666 -49038 -6797 -109991 -58160 108193 -230619
10709 292369 -11856 -189176 -264510 -90429 -187628 7953 -61388 -132946 -75399 -122275 50583
10697 -293319 31831 -403659 -311968 -157550 -34581 112207 -71084 -183179 -113105 125953
10686 -160854 215228 33779 264760 85101 35393 201785 43796 222595 -66275 -100092 34435
10674b82917k3259a28154A51866a34779A53651F7905J37478a10105m378C052Q3934
10663H6986k2789c60115b5222r8971B11937b2312E1668a78158a1109n8349L0043
10652c9415A902J78113a64830h2279E8925B020a86664P2332A1948c4423B37311
10640a8882k55105g6754F4294c57359J27355a7763j28242A84795f3585H8020j6884
10629G1136A1706a44729B15329I925b08540D1126b78l54113A63566b27507A20883
10617b0551j18909O5166A11137h9104B75960b44980M3909d6717J9096l8188k52094
10606c17903E2168a83469d6757a2911A51846k6986a86095p101A39728M6604a43166
10594C4756J22798d32863B922J36772b54712c2280j87613B96477a38837J2762
$$ plain form
10674 -282917 -306176 -128154 151866 -134779 153651 67905 205383 -110105 -114483 3052 86986
10663 86986 64197 -360115 -25222 -124193 211937 -22312 51668 -178158 -11109 -69458 -39415
10652 -39415 1902 180015 -164830 -82279 58925 2020 -186664 -114332 11948 -34423 237311
10640 -18882 -273987 -76754 64294 -357359 -230004 -17763 -146005 184795 -63585 88020 71136
10629 71136 11706 -144729 215329 9925 -208540 41126 -278 -354391 163566 -227507 120883
10617 -20551 -139460 -74294 111137 -89104 275960 -244980 -201071 -46717 -27621 -65809 -317903
10606 -317903 52168 -183469 -46757 -12911 151846 124860 -186095 -193196 139728 186332 -143166
10594 34756 157554 -432863 2922 139694 -254712 -32280 -219893 296477 -138837 -126075
10584a26075a5051k81768E9308b06222A41077c4027A66685C9671b61407B813a03631
10572H0799J3446b03464C48345A16357b34857g7109j33181c5345j57728i194j02103
10561a11297E0170A4925c9134a0816l92194c1923B4135Q2869b48508G5537K3548
10550I9085e5222A58525d91817a3926E7767i8933b4984A9496i8539j4750M4415
10539f8874j73777a16056r8434e2824A07108C7300A4900a25985E2948a04720H0653
10527c37503a9553i077A41813h7947E6262N8263B1282a74586H9575a28654A40312
10515h3561k48539e6087K4599C5146R1095a04760C20118G5907K718P2873M9440
10504B00938b74321c2726Q370A00334R8529J81090c70176e4829k67986J26399
$$ plain form
10584 -126075 -15051 -296819 59308 -206222 141077 -34027 166685 39671 -261407 2813 -103631
10572 80799 94245 -203464 348345 116357 -234857 -77109 -210290 -35345 -193073 -9194 -111297
10561 -111297 50170 14925 -39134 -10816 -403010 -31923 24135 107004 -248508 75537 99085
10550 99085 -55222 158525 -491817 -13926 57767 -98933 -24984 19496 -98539 -113289 -68874
10539 -68874 -242651 -116056 -214490 -52824 107108 37300 14900 -125985 52948 -104720 80653
10527 -337503 -19553 -9077 141813 -87947 56262 114525 21282 -174586 89575 -128654 140312
10515 -83561 -332100 -56087 -31488 35146 126241 -104760 320118 75907 78625 151498 200938
10504 200938 -274321 -32726 -24356 100334 198863 379953 -370176 -54829 -322815 -196416
10494a96416R4355o8313b987A17069B6226q990K02154D482a21880e5237A35755
10482A83078K90378A86834m2344J39304A05326a42365D9200L16239D3839o507
10472C7332J52752b55583F1803J99124A17797J46972A03221B618a14813n0535
10462a65348l6099b4477C4487P4507f7095j0093c2034H8581a38196B4482a23939
10450a71291M8326j19205F135J44289a44774e9721j20906D9217J97473r6504b75569
10438G7540K1047b25591A15526a69332m51881d336j89775C35772D8048d41513
10427c8923I11J64970q1331j5845i0535j53296a10553q8826d0814B038L50008
10416C52046A3944O7717N1851e872A28732M9287i3650C8981K41823c8308C76523
$$ plain form
10494 -196416 -102061 -170374 -2987 117069 26226 17236 219390 4482 -121880 -55237 135755
10482 183078 473456 186834 144490 283794 105326 -142365 49200 365439 43839 37332
10472 37332 190084 -255583 61803 260927 117797 264769 103221 2618 -114813 -165348
10462 -165348 -201447 -24477 34487 108994 -67095 -77188 -32034 88581 -138196 24482 -123939
10450 -171291 -122965 -242170 6135 150424 -144774 -59721 -180627 49217 246690 150186 -275569
10438 77540 98587 -225591 115526 -169332 -621213 -4336 -194111 335772 48048 -441513
10427 -38923 911 165881 84550 68705 -90535 -243831 -110553 -199379 -40814 2038 352046
10416 352046 13944 81661 133512 -5872 128732 178019 -93650 38981 280804 -38308 376523
10404A38496d2641A6279a2882j47312P1192A22419b8185A88979a79246h0696C10904
10392A77886L44469d4052b345A04622Q3645m8058D4638J1815c7541D40847G3161
10380F5171L4359J7952K98266H2658L30211L8873n2416k0479D5067Q626L38196
10369C91889L1597K3119j19113K1281K37986B22163L39584j37423k02461J53546
10359C75409j2596m2718B8397M29199j94383m4631F207L95682O6138K4022K28294
10348G20343r6884f3935C19382J04975j85943K81700q2623j85879a05235o864
10338a12099A33661K10140m7840J10233D0529J49845Q0502d9754b657n4086k398
10327e9141j657B09055I8483L14879A0073L92569A02927a39489A37470Q5091k054
$$ plain form
10404 138496 -42641 16279 -12882 -160194 -89002 122419 -28185 188979 -179246 -80696 310904
10392 177886 522355 -44052 -2345 104622 188267 140209 44638 56453 -37541 440847 73161
10380 65171 99530 117482 415748 82658 412869 451742 399326 378847 45067 53693 391889
10369 391889 423486 446605 327492 348773 586759 222163 561747 424324 221863 375409
10359 375409 362813 320095 28397 457596 263213 218582 6207 401889 468027 492049 720343
10348 720343 623459 -63935 319382 424357 238414 520114 437491 251612 -105235 -112099
10338 -112099 133661 343801 295961 406194 40529 190374 270876 -49754 -2657 -56743 -59141
10327 -59141 -60798 209055 98483 413362 10073 402642 102927 -139489 137470 222561 220507
10316B20507b8830B07417r3563a1010n5023B68551E425J80362o3773a57279p0247
10305b27526M2510C16948H5690a75766a6855k02655B48179L3557r4034M0482m3829
10294A84355q4901f6679B43254a4017A9753h4189j08414B1076K66516A20385b04080
10282a90281Q3271b5893c17A82721d3521j7677l7555A61925R0127a66209n4662
10271b20871g8086j90535B31635c50298A37829f2047H7011L37620H4175j8760
10261F5415g5880B67713j32546K36196D501O16634B48853A18244l5238a5036B51937
10249d6780G6973a70346j8878C5688d0961A0633K7401L561a08550K2066B70312
10237A80901d3065p2867A7938J62434b94424g7878n5462L8566k20908B9646M415
$$ plain form
10316 220507 -28830 207417 113854 -11010 -66033 268551 5425 185787 122014 -157279 -227526
10305 -227526 -185016 316948 85690 -175766 -16855 -219510 248179 281736 187702 228184 184355
10294 184355 99454 -66679 243254 -14017 19753 -84189 -192603 21076 287592 120385 -204080
10282 -190281 -107010 -25893 -317 182721 -43521 -61198 -98753 161925 252052 -166209 -220871
10271 -220871 -78086 -268621 231635 -350298 137829 -62047 87011 424631 84175 65415
10261 65415 -75880 267713 135167 371363 4501 621135 248853 118244 83006 -15036 251937
10249 -46780 76973 -170346 -189224 35688 -40961 10633 38034 41595 -108550 -86484 270312
10237 180901 -43065 -115932 17938 180372 -294424 -77878 -133340 -94774 -315682 29646 34061
10226C4061N2009b02441M3455k0467g5244E6211J9100G352h2221a6765j41531
10215a58296j6177H9717N4475C3663a95341J0301Q4689j38893A3987a76665M1675
10204a34990G0998a01939K5763A2557b58006J21045B65842b17757N0655c2453
10193A39932Q0952b3836B07258E3942a12457K5768A17734c27151a27157F3108
10182D01746b16384e9561F4960a41244p603B0405a04114p5952A86544b25468A3869
10170e0222m1886p5494j09648A97887b51459C4714b22582A91473b98178J35439
10160a62739C7164J09137h9669B5270b19598A07590h9664r8676a5638n2352J6287
10149e1703j43055j86725a77912A91807a41373o4572B9939d6019k19049C9176
$$ plain form
10226 34061 86070 -202441 -158986 -179453 -75244 56211 75311 7352 -82221 -16765 -158296
10215 -158296 -174473 89717 144192 33663 -195341 -185040 -100351 -239244 13987 -176665 -134990
10204 -134990 70998 -101939 -76176 12557 -258006 -136961 265842 -217757 -167102 -32453
10193 139932 220884 -23836 207258 53942 -112457 -86689 117734 -327151 -127157 63108
10182 401746 -216384 -59561 64960 -141244 -148847 20405 -104114 -180066 186544 -225468 13869
10170 -50222 -92108 -167602 -277250 197887 -251459 34714 -222582 191473 -298178 -162739
10160 -162739 37164 146301 -89669 25270 -219598 107590 -89664 -188340 -15638 -67990 -51703
10149 -51703 -194758 -381483 -177912 191807 -141373 -205945 29939 -46019 -265068 39176
10138a62433O7711M579J7041k58854a27004B0285i8672B1884K2690b19114a6827
10126b59379F2091a75781n7160A00637N1851C0968c79059R6239a09063b5854d222
10114b40472G6666d1246j56792b388B630a3181k5100A3324a9074j45563L0222
10103a34415D3333d8301i460A49119c047A88596b58564A4877c19153a55967l0752
10092a86719J594q3527A52790a26021A00121D3207f9823A8859b92936G9937K9350
10081A09287a20296c6096k59701c4691k49613E6683m225M7417O4375q1955g2453
10069c7621k89251A84919c10131a03222j64352f0148p6541D9374N7110e9725p2870
10058a32595F5734P7654m968J24885H6890c3095j42598E77262B86065c70661E4538
$$ plain form
10138 -162433 -94722 -90143 -73102 -331956 -127004 20285 -98672 21884 44574 -219114 -16827
10126 -259379 62091 -175781 -232941 100637 152488 30968 -379059 -282820 -109063 -25854 -4222
10114 -240472 76666 -41246 -198038 -2388 2630 -13181 -38281 13324 -19074 -164637 -134415
10103 -134415 43333 -48301 -9460 149119 -3047 188596 -258564 14877 -319153 -155967 -186719
10092 -186719 -185125 -268652 152790 -126021 100121 43207 -69823 18859 -292936 79937 109287
10081 109287 -120296 -36096 -295797 -34691 -284304 56683 52458 99875 164250 82295 -72453
10069 -37621 -326872 184919 -310131 -103222 -267574 -60148 -136689 49374 106484 -59725 -132595
10058 -132595 65734 143388 138420 263305 86890 -33095 -175693 577262 286065 -370661 54538
10046a58203g4229p1599G9590b74254g6856A3117b63578N1376A99266b14909R6714
10035a18195I4800b51565N5090A68156c430F0337p368a26187E6163b30777J5829
10024b14948k0971L7349D7838a21333A23559A6539M8953c8950j36517B24650B1055
10012a54512l51014a45018A75679f2087r0490j1318B3443a60136c9978A22183
10001a28402m2057d9081j0857k2185H1817K8215d54172J73416C0001c73585a58071
9989F507J20528K07774k528b59564a00542F3476a22135F6101J56331p9086m0674
9978A02672B7363c02929B49106b25988h3396k37107A81263K2610b74575F0594
9967b08881A18791b75733O2807f0017j7392B00924d6951j21460B27923N1618g0980
$$ plain form
10046 -158203 -74229 -145828 79590 -274254 -76856 13117 -263578 -212202 199266 -214909 -118195
10035 -118195 94800 -251565 -196475 168156 -3430 60337 52969 -126187 56163 -230777 -214948
10024 -214948 -235919 -198570 47838 -121333 123559 16539 65492 -38950 -175467 224650 21055
10012 -154512 -505526 -145018 175679 -62087 -152577 -163895 23443 -160136 -39978 122183
10001 -128402 -170459 -49081 -59938 -82123 81817 110032 -454172 -280756 30001 -373585 -158071
9989 6507 127035 334809 332281 -259564 -100542 63476 -122135 66101 222432 143346 102672
9978 102672 27363 -302929 249106 -225988 -83396 -320503 181263 203873 -274575 60594
9967 -208881 118791 -275733 -212926 -60017 -77409 200924 -46951 -168411 227923 279541 -70980
9955C419b7435o6420l24233a64910l53020h4051J0225E7779i4659q3409m2877
9944b20945b1497D6330J64420c1358p3590l1792N6517H3284k1925d16097A74355
9932D1991a17030m9123j72288G1295b71643j1325A79404b30876r9437O4447d5044
9920b28275q7854a37777j22546J27208m7443B07265H5161Q7251n2079h7425c7588
9908A7582a94833m0555J6344J4306J9966j8486C58163A21272a63931j4578H6329
9896c5498j67875F8325e0515D1945b61169m5630K7770A2877P6577c89753a46745
9884A14271N0567h0702H1820l1567d24847a05491j3337j38966G8337a66645O3417
9873a03228E8770a6898m2373l8947A01764A4745e3715E5421c39796I3304b68723
$$ plain form
9955 3419 -27435 -93855 -418088 -164910 -517930 -84051 -73826 57779 -94659 -178068 -220945
9944 -220945 -21497 46330 210750 -31358 -104948 -136740 -80223 83284 61359 -416097 174355
9932 41991 -117030 -166153 -338441 71295 -271643 -282968 179404 -230876 -330313 -265866 -45044
9920 -228275 -316129 -137777 -260323 -133115 -180558 207265 85161 172412 120333 -87425 -37588
9908 17582 -194833 -235388 -219044 -204738 -184772 -203258 358163 121272 -163931 -178509 86329
9896 -35498 -203373 68325 -50515 41945 -261169 -306799 -279029 12877 89454 -389753 -146745
9884 114271 164838 -80702 81820 50253 -424847 -105491 -118828 -257794 78337 -166645 -103228
9873 -103228 58770 -16898 -59271 -98218 101764 14745 -53715 55421 -339796 93304 -268723
9861b6998r6686A6489a45665N7076R730b8043E4073J89261A12317a86082N1746
9850a34336G419R7663b13978H3218M8651a17228b8203j11823r9611H9833b81451
9838I2619a03659C0230j3246J02650a621k81686A08844a5851j21012k688g676
9826a62180E4418J52832H4017b11492k5228C74852H377g33j97291D5820R9464
9815A45284J33579d86435b1878m7590A09904g0310k12784k02023A67931g8786
9804C91070a07569n7037j49503A84726A9037a89456A35681k5417b88568a4828
9793B10207B993b0932A33152a78189c2266B70N602a32871N0135J379n5917k88468
9781d25742C3494a21850l64562B53803b42793O9991q3200g3225p1141k2695r7326
$$ plain form
9861 -26998 -123684 16489 -145665 -88589 -78859 -28043 54073 243334 112317 -186082 -134336
9850 -134336 7419 105082 -213978 83218 131869 -117228 -28203 -140026 -239637 89833 -281451
9838 92619 -103659 30230 16984 119634 -1621 -283307 108844 -15851 -136863 -139551 -7676
9826 -162180 54418 207250 84017 -211492 -236720 374852 8377 -733 -198024 45820 145284
9815 145284 278863 -486435 -21878 -69468 109904 -70310 -283094 -485117 167931 -78786
9804 391070 -107569 -164606 -314109 184726 19037 -189456 135681 110264 -288568 -14828
9793 210207 2993 -20932 133152 -178189 -32266 270 5872 -132871 -82736 -81357 -137274 -425742
9781 -425742 33494 -121850 -486412 253803 -242793 -172802 -256002 -73225 -144366 -167061 -264387
9770b64387B19660e9936n1684C8538b00161j1503J3179g1462j13556g5368p7114
9759a52482j72973C56758A59686a64060A66492e712j13175L5340i330A33665i4259
9747b56851A57024b34812A78784b29618o7673h5821G4231Q2522g6836K0990j74354
9736b30200j77128a88462k414A03201a84933F9738J4912a17572b0295A61141m0951
9725A20190c96234a19625j10523H0063K32714F608a5219H7182O1614h6098q524
9714i4622B3982a21B47324a76789M1293f3583k72961a31450m7329h3195I4921
9702A49666a44011A09373l6504R597b93432i0761i993F8674A7090J69892i3400
9690b27691O3264h0100A96826b45956Q7406j57448f3601J5179k6172o8689e7779
$$ plain form
9770 -264387 219660 -59936 -111620 38538 -200161 -211664 -198485 -71462 -185018 -75368 -152482
9759 -152482 -325455 356758 159686 -164060 166492 -5712 -118887 -83547 -9330 133665 -94259
9747 -256851 157024 -234812 178784 -229618 -297291 -85821 74231 156753 -76836 -55846 -230200
9736 -230200 -407328 -188462 -190876 103201 -184933 69738 84650 -117572 -20295 161141 120190
9725 120190 -396234 -119625 -230148 80063 312777 6608 -15219 87182 148796 -86098 -94622
9714 -94622 23982 -121 247324 -176789 -135496 -63583 -336544 -131450 -178779 -83195 94921
9702 149666 -144011 109373 72869 82466 -293432 -90761 -9993 68674 17090 186982 -93400
9690 -227691 -164427 -80100 196826 -245956 -158550 -315998 -63601 -48422 -74594 -143283 -57779
9678E1733A3518a98902c8561r841B0871b63573i1776H0439a60445H8040c8272
9666A6463K11269c40605a53365H690b61233g3348A71525b21924m2322C8785b52300
9654a00899l45487b1807n9767j08051A824b2257A29315f2373A04950a25772I3907
9642c46214B5680b7344j98348B7021d13084B71532A185M8714c9026m328j10491
9631a53845F6311a1528r5418A49626a9542A4034L438b29481a3983D0689a89530
9619b12342N5281C02007b57105A61669h5590B26293J0595q5210a93517k01652
9609c95169h0078H9001e6484B13979e04152B3550K3159q670a30480A637M0290
9598D1927J20708a63840A10400a10469J3161l5544A03790J64431j04158M292c33689
$$ plain form
9678 51733 13518 -198902 -38561 -48402 20871 -263573 -91776 80439 -160445 88040 -38272
9666 16463 227732 -340605 -153365 8690 -261233 -73348 171525 -221924 -264246 38785 -252300
9654 -100899 -446386 -21807 -81574 -189625 1824 -22257 129315 -62373 104950 -125772 93907
9642 -346214 25680 -27344 -225692 27021 -413084 271532 1185 49899 -39026 -43354 -153845
9631 -153845 66311 -11528 -106946 149626 -19542 14034 17472 -229481 -13983 40689 -189530
9619 -212342 -157061 302007 -257105 161669 -85590 226293 236888 151678 -193517 -395169
9609 -395169 -80078 89001 -56484 213979 -504152 23550 46709 38039 -130480 1637 41927
9598 41927 162635 -163840 110400 -110469 -97308 -132852 103790 268221 164063 168355 -333689
9586a32344l2174A77157b15025G9736K00215A5307a73916j43482B21104a61868
9575f178R67B7278a03716j13308p0169a19687B9275b8664B45349c02773A7955
9563b83586a24649m7620E1934J7372g6474F5540b22768A31769Q3366B3402f2724
9551b12937D2798K5455f5067r2899N0353B88014B7459c98803J74506K803l0803
9540b52297j29414A10246a83334K4956K9376j20987p9208G8782A8620a08905B78002
9528c40777e6464j99098b0648A03564G911a97141j517e6749j85152o3201a19236
9516A54320l9532a65876L5215n0687A07940k4379b79472J28450A01095B916a9774
9504B0023b34822O2996N9248B97837c86792J05212b3816j71004A78451a29857
$$ plain form
9586 -132344 -164518 177157 -215025 79736 279951 15307 -173916 -317398 221104 -161868
9575 -6178 -5211 27278 -103716 -217024 -287193 -119687 29275 -28664 245349 -302773 17955
9563 -283586 -124649 -172269 51934 69306 -76474 65540 -222768 131769 215135 23402 -62724
9551 -212937 42798 68253 -65067 -157966 -107613 288014 27459 -398803 -224297 -221494 -252297
9540 -252297 -381711 110246 -183334 -158378 -129002 -249989 -329197 78782 18620 -108905 278002
9528 -340777 -56464 -255562 -20648 103564 7911 -197141 -198658 -56749 -241901 -305102 -119236
9516 154320 114788 -165876 -130661 -181348 107940 83561 -279472 -151022 101095 2916 -19774
9504 20023 -234822 -171826 -112578 297837 -386792 -281580 -23816 -194820 178451 -129857
9493e66475C3511a38928m4680A75300h3758C4037b54056j853A1682L5602b82216
9481B57017I4810J13074c00499f1883n663E6944a68923M035l3594L9715P4350
9470h4417k81369a78967e2234l21607M9761a35082A22809A850g7575l13299A16350
9458b26870a08841r3936g6926A37555a90311D5817G548L52622O9593i8919a5779
9446b90704J11535j8407O1502c5315k44849H9211b21358j37855b9038j44632o8160
9435b41830f7656p2570j22811A53875c07148J00283q9953M1158A87131A1890a74365
9423A033i5700j28310C2503d75579A54361j812a08045n6048r4786A35480b82975
9411G905a72687A2884b18212A20597a40018A46914e382q4336A16197a9320C5254
$$ plain form
9493 -566475 33511 -138928 -183608 175300 -83758 34037 -254056 -255909 11682 47284 -282216
9481 257017 94810 207884 -300499 -61883 -67546 56944 -168923 -164888 -198482 -158767 -84417
9470 -84417 -365786 -178967 -52234 -373841 -324080 -135082 122809 1850 -77575 -390874 116350
9458 -226870 -108841 -202777 -76926 137555 -190311 45817 7548 360170 429763 -98919 -15779
9446 -290704 -179169 -197576 -136074 -35315 -280164 89211 -221358 -359213 -29038 -173670 -241830
9435 -241830 -67656 -140226 -263037 153875 -307148 -206865 -296818 -255660 187131 11890 -174365
9423 1033 -95700 -224010 32503 -475579 154361 152549 -108045 -164093 -258879 135480 -282975
9411 7905 -172687 12884 -218212 120597 -140018 146914 -5382 -89718 116197 -19320 35254
9399a10511M6437k32371M7442P8184q4786A33780d72121J72616a423j02353D6845
9387A62058c5975A89380p1387b62841a25884E3963F285N1712a72450H5872a63763
9375a91095l2391j17760B94559b60172m4286f7959B83540a709k67786J21677E7013
9363c3435k68682B00818a06681j62896B52823H2184J28911d5472l00320b8615
9352A2342b7634n031k07992m2307h5451G2756M1381b18614f5916q8173L489A7469
9339d005k565m43889A10005c3999F9448g8569G2134d3122B93556p0695c2449k52594
9327b85043a24489q4867A4434M8777L366d0478J5206m2218l5578k49116E4230
9315a19417C31472C3309O1219O2560l997b29024j14644A7898J03064a38900n6465
$$ plain form
9399 -110511 -64074 -296445 -249003 -170819 -255605 133780 -472121 -299505 -1423 -103776 46845
9387 162058 -35975 189380 117993 -262841 -125884 53963 6285 57997 -172450 85872 -163763
9375 -191095 -223486 -341246 294559 -260172 -304458 -67959 283540 -1709 -269495 -147818 57013
9363 -33435 -302117 200818 -106681 -269577 252823 82184 211095 -45472 -345792 -28615
9352 12342 -27634 -32665 -240657 -282964 -85451 72756 114137 -218614 -65916 -154089 -150600 17469
9339 -4005 -6570 -450459 110005 -33999 69448 -78569 72134 -43122 293556 222861 -32449 -285043
9327 -285043 -124489 -209356 14434 63211 66577 -40478 -25272 -67490 -103068 -352184 54230
9315 -119417 331472 33309 94528 157088 153091 -229024 -343668 17898 120962 -138900 -195365
9304a95365o7398a01954l74065A89735i7072j96540J46670p4398J6033g8795I2956
9292c04594f6941q633B2027P676a18458N2914q3985n1566b1929r9553j3334j9062
9280a53878N6597f192j765H627i5916b9753k95986L7587m9264J52940j4352e7515
9267D9632c69705E2346c44697A36861b57679A15097d38396B08622m9006E7394
9256g5183o5173C4082e3105M71l28289i4555G050O3670B501M0344J76741a06221
9243f3803J4935F5613K212H129J97551c1087B24794c7265G4814c28544J01313
9232b27231A41906C4303a49963j4370K8752a2357k31832B6223h6093A3828L1875
9221D5703J38619R6415b87823b8381C21148c0754A57145g1491B31431A06495J943
$$ plain form
9304 -195365 -262763 -101954 -476019 189735 -97072 -293612 -146942 -221340 -205307 -78795 92956
9292 -304594 -66941 -75574 22027 29703 -118458 -65544 -149529 -201095 -21929 -121482 -134816 -153878
9280 -153878 -97281 -6192 -7957 8627 -95916 -29753 -325739 -288152 -337416 -184476 -198828 -57515
9267 49632 -369705 52346 -344697 136861 -257679 115097 -438396 208622 159616 57394
9256 -75183 -140356 34082 -53105 -52634 -380923 -94555 7050 70720 2501 42845 219586 -106221
9243 -63803 -48868 65613 67825 8129 205680 -31087 224794 -37265 74814 -328544 -227231
9232 -227231 141906 34303 -149963 -164333 -135581 -12357 -244189 26223 -86093 13828 45703
9221 45703 184322 280737 -287823 -28381 321148 -30754 157145 -71491 231431 106495 108438
9210A08438b43184m3488a34909B29238b26508r765A89186D4461b91566I5104a51750
9198A55822a78231m10372E6826g5731a6043C01440b16558Q9071b5278j7854j08555
9187a51687K29o3595H246K23097q6612l8841a44213n1627R6254F3429a01455H4028
9174g0241A85398F7244b09664D375e646k0345m51721d9551r0343o7668A78973
9162B46967b79285O4484b9458j36824d4482C0231d04115C2082L01929a03690F6132
9150C657c17909G8201c22762a19358G305R4507J62205d4821J8712k26241i2353
9138b89427a7579j44790R447n8857g5237B04750b63813B7878e5948n3628k1193
9127a30769c0151F2842a96770a2934o0717j48952A35419D3841b05489c7703n8398
$$ plain form
9210 108438 -243184 -286672 -134909 229238 -226508 -236273 189186 44461 -291566 95104 -151750
9198 155822 -178231 -588603 56826 -75731 -16043 301440 -216558 -127487 -25278 -43132 -151687
9187 -151687 -151458 -215053 8246 231343 144731 105890 -144213 -195840 -99586 63429 -101455 84028
9174 -70241 185398 67244 -209664 4375 -5646 -25991 -477712 -49551 -139894 -207562 178973
9162 246967 -279285 -214801 -29458 -166282 -44482 30231 -404115 32082 334011 -103690 66132
9150 3657 -317909 78201 -322762 -119358 7305 101812 264017 -44821 -26109 -252350 -92353
9138 -289427 -17579 -162369 -152922 -211779 -75237 204750 -263813 27878 -55948 -109576 -130769
9127 -130769 -30151 62842 -196770 -12934 -73651 -222603 135419 43841 -205489 -37703 -96101
9116i6101j59282h6685q8175p0362O9560A77471a62898j12863i6689n4726f3849
9104A2125i8102m4577A2514b38226R7483B20074G9218i3945l84475g7681J8221
9093e9460A50576q398h5814j74132R9224L6269k25383a53893A97444c18631K6644
9082b91987B95835I8263g8058A02900f2277m6698A67048C3656d78266a24923j56640
9071b81563J2656b9779o8240L3945k53075A77837n1904a10706g316A36612d1430
9059A2807a09099C7255i9638H409a38122c8438A2934h580q5076r8017A34186a7087
9046f9797r7315A4806c40797N7302A58565d25782g9188A12043I881J30374F0788
9034h4251j28255D2258J58133b39224J08651j07081I8195a93922a9055m19721
$$ plain form
9116 -96101 -255383 -86685 -174860 -245222 -175662 177471 -162898 -275761 -96689 -151415 -63849
9104 12125 -98102 -142679 12514 -238226 -140743 220074 79218 -93945 -478420 -77681 -59460
9093 -59460 150576 142178 -85814 -259946 -160722 -124453 -349836 -153893 197444 -318631 -291987
9082 -291987 295835 98263 -78058 102900 -62277 -108975 167048 33656 -478266 -124923 -281563
9071 -281563 -268907 -29779 -98019 -64074 -317149 177837 125933 -110706 -7316 136612 -41430
9059 12807 -109099 37255 -99638 8409 -138122 -38438 12934 -8580 -93656 -191673 134186 -17087
9046 -69797 -167112 14806 -340797 -283495 158565 -425782 -79188 112043 9881 140255 60788
9034 -84251 -212506 42258 200391 -239224 -130573 -237654 98195 -193922 -19055 -438776
9024d38776B19136d44173a03257J5676j6455H3058d2119k72007Q934D41772F3093
9012D860b84372A4150a12751D8384b69250j1271J25709A6786P3656d0053m560
9001d4613A57391D4684I942J56023a04978I0937f429k15839a10341j6916q962
8990a36219j60631c2625A11788d73658J60919B03838a5246j97164A73091n9182
8980A13909b97117b5568E4703J38387d50014i2615m8497G4747K00188q3306a19398
8968i5354j24113j13140J46153H7542b82221A83129a59322l1061I9086h9375C70136
8956c36149A44496d81128a74474O1612N2808B16721g2730q3332N9965L0618B8476
8944b01306m3616P3994m34976D703O0889a44886E8702R6743i6865A21060J75396
$$ plain form
9024 -438776 219136 -444173 -103257 -87581 -104036 83058 -42119 -314126 -305192 441772 63093
9012 4860 -284372 14150 -112751 48384 -269250 -280521 -154812 16786 90442 -40053 -44613
9001 -44613 157391 44684 9942 165965 -104978 90937 -6429 -222268 -110341 -127257 -136219
8990 -136219 -296850 -32625 111788 -473658 -312739 203838 -15246 -212410 173091 113909
8980 113909 -297117 -25568 54703 193090 -450014 -92615 -141112 74747 274935 191629 -119398
8968 -95354 -219467 -332607 -186454 87542 -282221 183129 -159322 -190383 99086 -89375 370136
8956 -336149 144496 -481128 -174474 -112862 -60054 216721 -72730 -156062 -96097 -65479 28476
8944 -201306 -244922 -170928 -605904 4703 65592 -144886 58702 155445 -96865 121060 296456
8933B96456a88965r5313b1600E1561R1163n7463K24351J71566m2203O19341K388609
8922C446925L664307M816538C478939A070269l84670p5987j62261B10689j05136
8913A05553J48310A16776a1800A94866K56257m6527A355J70348G4584J097a22886
8901a27620j22150d9840a5041D4060J88041B3705H254J91226b67606h2811c2884
8889B11644a41563o1290j0789b3967j05448O922K2753p0882N5503J4592j14489
8878b15016A33123D3680h182p754A27157c4517D4983M6099a30720F5287L10058
$$ plain form
8933 296456 -188965 -284278 -21600 51561 142724 85261 309612 481178 438975 1058316 3446925
8922 3446925 7111232 11927770 3478939 1070269 685599 609612 447351 210689 105553
8913 105553 253863 116776 -11800 194866 451123 404596 1355 171703 74584 75681 -122886
8901 -127620 -249770 -49840 -15041 44060 232101 23705 8254 199480 -267606 -82811 -32884
8889 211644 -141563 -202853 -213642 -23967 -129415 -122493 -99740 -170622 -115119 -100527 -215016
8878 -215016 133123 43680 -8182 -15936 127157 -34517 44983 91082 -130720 65287 375345
$$ [...]
##END NTUPLES=NMR SPECTRUM
##END=
