##TITLE=AC1548_ROEFFECT0014_8268774_JFnQT3Gdvp
##JCAMPDX= 6.0         $$ Bruker NMR JCAMP-DX V2.0
##DATA TYPE= NMR SPECTRUM
##DATA CLASS= NTUPLES
##ORIGIN= BRUKER
##OWNER= Administrator
$$ 1.72 TOPSPIN		Version 2.1
$$ 2013-10-11 22:02:27.520 -0700  Administrator@X
$$ Compression mode = diff/dup
##.OBSERVE FREQUENCY= 400.02188249412
##.OBSERVE NUCLEUS= ^1H
##.ACQUISITION MODE= SIMULTANEOUS (DQD)
##.ACQUISITION SCHEME= undefined
##.AVERAGES= 8
##.DIGITISER RES= 22
##SPECTROMETER/DATA SYSTEM= spect
##.PULSE SEQUENCE= zg30
##.SOLVENT NAME= COFFEE_meoh
##.SHIFT REFERENCE= INTERNAL, COFFEE_meoh, 1, 14.98509
##AUDIT TRAIL= $$ (NUMBER, WHEN, WHO, WHERE, PROCESS, VERSION, WHAT)
$$ ##TITLE= Audit trail, TOPSPIN		Version 2.1
$$ ##JCAMPDX= 5.01
$$ ##ORIGIN= Bruker BioSpin GmbH
$$ ##OWNER= Administrator
$$ $$ E:\/data/COFFEE/nmr/AC1548_ROEFFECT0014_8268774_JFnQT3Gdvp/10/pdata/1/auditp.txt
$$ ##AUDIT TRAIL=  $$ (NUMBER, WHEN, WHO, WHERE, PROCESS, VERSION, WHAT)
(   1,<2013-10-11 22:02:20.770 -0700>,<Administrator>,<X>,<go>,<TOPSPIN 2.1>,
      <created by zg
	started at 2013-10-11 22:01:14.880 -0700,
	POWCHK enabled, PULCHK disabled,
       configuration hash MD5:
       C8 4E 4E 5D D3 5C D8 9E 9F 52 82 E0 59 8A DE 15
       data hash MD5: 64K
       88 14 E7 C5 AF CA 82 21 0B 76 2F F3 E8 5B 21 EA>)
(   2,<2013-10-11 22:02:23.786 -0700>,<Administrator>,<X>,<proc1d>,<TOPSPIN 2.1>,
      <Start of raw data processing
       efp LB = 0 FT_mod = 6 PKNL = 1 PHC0 = 0 PHC1 = 0 SI = 32K 
       data hash MD5: 32K
       EA 56 D8 13 BA A0 B7 B8 14 F3 A3 7C CB B8 57 1E>)
(   3,<2013-10-11 22:02:24.114 -0700>,<Administrator>,<X>,<proc1d>,<TOPSPIN 2.1>,
      <pk PHC0 = 95.74036 PHC1 = 0 
       data hash MD5: 32K
       79 59 DD C4 1D 6D B8 3A CD 02 81 9E 45 BD 19 BE>)
(   4,<2013-10-11 22:02:24.208 -0700>,<Administrator>,<X>,<proc1d>,<TOPSPIN 2.1>,
      <abs ABSG = 1 
       data hash MD5: 32K
       7E 22 AE E7 A7 AB EE E4 B5 48 B9 8E A5 91 D0 D9>)
(   5,<2013-10-11 22:02:24.270 -0700>,<Administrator>,<X>,<proc1d>,<TOPSPIN 2.1>,
      <abs ABSG = 2 
       data hash MD5: 32K
       BD B8 48 94 9A C1 61 F0 83 0C 94 70 2A 69 C8 A5>)
(   6,<2013-10-11 22:02:24.317 -0700>,<Administrator>,<X>,<proc1d>,<TOPSPIN 2.1>,
      <abs ABSG = 3 
       data hash MD5: 32K
       E6 55 68 AE BE 70 D4 06 F1 9D ED A2 F1 12 E0 BF>)
(   7,<2013-10-11 22:02:24.380 -0700>,<Administrator>,<X>,<proc1d>,<TOPSPIN 2.1>,
      <abs ABSG = 4 
       data hash MD5: 32K
       52 FB 35 DB E4 A6 BC A7 95 BE 89 B4 D9 B8 0B D9>)
(   8,<2013-10-11 22:02:24.442 -0700>,<Administrator>,<X>,<proc1d>,<TOPSPIN 2.1>,
      <abs ABSG = 5 
       data hash MD5: 32K
       FD 27 5A 7E 1B B4 58 F3 54 84 8E A6 F6 12 EF F0>)
$$ ##END=
$$ 
$$ $$ hash MD5
$$ $$ 75 D9 1F AA CD 53 70 9E 32 DA 8F 45 48 A3 BC 49
##$RELAX= 
##$RELAX= 
##$RELAX= 
##$RELAX= 
##$RELAX= 
##$RELAX= 
##$RELAX= 
$$ Bruker specific parameters
$$ --------------------------
##$DU= <E:\>
##$EXPNO= 10
$$ [...]
150 150 150 150 150 150 150 150
##$TP07= 0
##$TPNAME0= <>
##$TPNAME1= <>
##$TPNAME2= <>
##$TPNAME3= <>
##$TPNAME4= <>
##$TPNAME5= <>
##$TPNAME6= <>
##$TPNAME7= <>
##$TPOAL= (0..7)
0.5 0.5 0.5 0.5 0.5 0.5 0.5 0.5
##$TPOFFS= (0..7)
0 0 0 0 0 0 0 0
##$TUNHIN= 0
##$TUNHOUT= 0
##$TUNXOUT= 0
##$USERA1= <user>
##$USERA2= <user>
##$USERA3= <user>
##$USERA4= <user>
##$USERA5= <user>
##$V9= 5
##$VALIST= <valist>
##$VCLIST= <CCCCCCCCCCCCCCC>
##$VD= 0
##$VDLIST= <DDDDDDDDDDDDDDD>
##$VPLIST= <PPPPPPPPPPPPPPP>
##$VTLIST= <TTTTTTTTTTTTTTT>
##$WBST= 1024
##$WBSW= 4
##$XGAIN= (0..3)
0 0 0 0
##$XL= 0
##$YL= 0
##$YMAX_a= 650241
##$YMIN_a= -552075
##$ZGOPTNS= <>
##$ZL1= 120
##$ZL2= 120
##$ZL3= 120
##$ZL4= 120
##$ABSF1= 14.98509
##$ABSF2= -5.573092
##$ABSG= 5
##$ABSL= 3
##$ALPHA= 0
##$AQORDER= 0
##$ASSFAC= 0
##$ASSFACI= 0
##$ASSFACX= 0
##$ASSWID= 0
##$AUNMP= <proc_prof1d_extract_pilot.lims>
##$AXLEFT= 0
##$AXNAME= <>
##$AXNUC= <1H>
##$AXRIGHT= 0
##$AXTYPE= 0
##$AXUNIT= <>
##$AZFE= 0.1
##$AZFW= 0.1
##$BCFW= 0
##$BC_mod= 0
##$BYTORDP= 0
##$COROFFS= 0
##$CY= 15
##$DATMOD= 1
##$DC= 0
##$DFILT= <>
##$DTYPP= 0
##$F1P= 0
##$F2P= 0
##$FCOR= 0.5
##$FTSIZE= 32768
##$FT_mod= 6
##$GAMMA= 0
##$GB= 0
##$INTBC= 1
##$INTSCL= 1
##$ISEN= 128
##$LB= 0
##$LEV0= 0
##$LPBIN= 0
##$MAXI= 10000
##$MC2= 0
##$MEAN= 0
##$ME_mod= 0
##$MI= 0
##$NCOEF= 0
##$NC_proc= -8
##$NLEV= 6
##$NOISF1= 0
##$NOISF2= 0
##$NSP= 0
##$NTH_PI= 0
##$NZP= 0
##$OFFSET= 14.98509
##$PC= 1
##$PHC0= 95.74036
##$PHC1= 0
##$PH_mod= 1
##$PKNL= yes
##$PPARMOD= 0
##$PPDIAG= 0
##$PPIPTYP= 0
##$PPMPNUM= 2147483647
##$PPRESOL= 1
##$PSCAL= 4
##$PSIGN= 0
##$PYNMP= <proc.py>
##$REVERSE= no
##$SF= 400.02
##$SI= 32768
##$SIGF1= 0
##$SIGF2= 0
##$SINO= 400
##$SIOLD= 32768
##$SPECTYP= <>
##$SREGLST= <1H.CDCl3>
##$SSB= 0
##$STSI= 32768
##$STSR= 0
##$SW_p= 8223.68421052631
##$SYMM= 0
##$S_DEV= 0
##$TDeff= 65536
##$TDoff= 0
##$TI= <>
##$TILT= no
##$TM1= 0
##$TM2= 0
##$TOPLEV= 0
##$USERP1= <user>
##$USERP2= <user>
##$USERP3= <user>
##$USERP4= <user>
##$USERP5= <user>
##$WDW= 1
##$XDIM= 32768
##$YMAX_p= 453098419
##$YMIN_p= -652513
##$CURPLOT= <Network HP LaserJet P1505>
##$CURPRIN= <$Network HP LaserJet P1505>
##$DFORMAT= <normdp>
##$LAYOUT= <+/1D_H.xwp>
##$LFORMAT= <normlp>
##$PFORMAT= <normpl>
##$SURQMSG= 1
$$ End of Bruker specific parameters
$$ ---------------------------------
##NTUPLES= NMR SPECTRUM
##VAR_NAME=  FREQUENCY,     SPECTRUM/REAL,   SPECTRUM/IMAG
##SYMBOL=    X,             R,               I
##VAR_TYPE=  INDEPENDENT,   DEPENDENT,       DEPENDENT
##VAR_FORM=  AFFN,          ASDF,            ASDF
##VAR_DIM=   32768,         32768,           32768
##UNITS=     HZ,            ARBITRARY UNITS, ARBITRARY UNITS
##FACTOR=    0.250966925370066, 1,           1
##FIRST=     8223.43324360094, -226079,      -170617
##LAST=      0,             -148942,         -249175
##MIN=       0,             -652513,         0
##MAX=       8223.43324360094, 453098419,    0
$$ Real data points
##PAGE= N=1
##DATA TABLE= (X++(R..R)), XYDATA
$$ [...]
19548i3174r1369H2196b48504j13324J05257J04099H0141c19115C46351c87935
19537a19004q3311j1808C3020a71331o4864R8626o4709p0181a06323C0766A587
19525a06724a0277A3579a79236m19960a4203n8383j6928A48964A633a52251j14244
19514b66495A12971b91448A11961b49234k02373c3119A39201e0421j77599C49454
19503a4421n7611A1020c61596C46510b3269q6175j38371B78491r7506f1922j28288
19492a90210n3735O5322J8347G2067l3559b52415a04647j60043a69j7835k54978
19481b72982g4259l29612C6919j763b47162c443j06665J6277A21220K5991b40694
19469a6394k50817P0949B18494a8855k85509a46322f3283B69957c2221j88237
$$ plain form
19548 -93174 -184543 82196 -248504 -361828 -256571 -152472 80141 -319115 346351 -387935
19537 -119004 -202315 -214123 33020 -171331 -236195 -137569 -202278 -272459 -106323 30766 1587
19525 -106724 -10277 13579 -179236 -599196 -14203 -72586 -89514 148964 1633 -152251 -266495
19514 -266495 112971 -291448 111961 -249234 -451607 -33119 139201 -50421 -228020 349454
19503 -14421 -72032 11020 -361596 346510 -23269 -109444 -247815 278491 180985 -61922 -190210
19492 -190210 -243945 -178623 -160276 72067 38508 -252415 -104647 -264690 -169 -18004 -272982
19481 -272982 -74259 -403871 36919 35156 -247162 -3443 -110108 -93831 121220 147211 -240694
19469 -16394 -267211 -196262 218494 -18855 -304364 -146322 -63283 269957 -32221 -220458
19459b20458B3036h9145E1855L33856b62545d1788A51113i9910A66668m1033g2744
19447a75153C0276J28486b33783B1218c7852D954L33310a88423J0274M811P3542
19436i9796q7287A213a1041n698j17275B7497h3298p8646n6525i1053C9799b18030
19423c10715A80850g6561A59314C0461D736b71611B6413Q6275J93476A35672c25195
19411a08050d1500D3624b23383g7020C5356K58690B5064K4066M0812m0317P0303
19400A19928N9533E8960a55357j30505a07431m7901g3033j58354r2138i4088G6266
19388a33056q7251c747A13664A965K22549b72535h74k2269j63021d0186q3449
19377a23635l8322A46015l2970b71854d1344D8256a82745H1128b16393i4192j9162
$$ plain form
19459 -220458 23036 -89145 51855 385711 -262545 -41788 151113 -99910 166668 125635 -72744
19447 -175153 30276 158762 -233783 21218 -37852 4954 338264 -188423 -178149 -173338 -99796
19436 -99796 -187083 1213 -11041 -16739 -134014 27497 -83298 -161944 -218469 -91053 39799 -218030
19423 -310715 180850 -76561 159314 30461 4736 -271611 26413 112688 306164 135672 -325195
19411 -108050 -41500 43624 -223383 -77020 35356 294046 25064 49130 89942 49625 119928
19400 119928 179461 58960 -155357 -285862 -107431 -155332 -73033 -231387 -323525 -94088 76266
19388 -133056 -220307 -3747 113664 1965 224514 -272535 -874 -23143 -186164 -40186 -123635
19377 -123635 -161957 146015 113045 -271854 -41344 48256 -182745 81128 -216393 -94192 -113354
19366a13354m0371q3734B6247a51403A53560d7300B7285O7493g6103j26973d7489
19354g0624c1868A06798c8898F5718d93488A84912a68397j06169h3676j38779
19344b22455L2104A57547F3653a32235A40676a32123l1688m11519A4797K97099
19334C11896j24991a97424B19651c4626a2988B49187h3688R867l7809j13650a11928
19322E7151f328j252Q1l16357i4773k98926a8512k65461A23264j8159b58088J19376
19310a38712D17596b18031J05690p0245K6724F7304a26014N202A59143c4109B2094
19298a02875D1376b6950q7295b3463k27608h5977D1904e2009A37100o570R007
19287A39537E2500O6914m0367a02318L9279k12771n8024A10703c74649A31904
$$ plain form
19366 -113354 -153725 -237459 26247 -151403 153560 -47300 27285 94778 -76103 -203076 -47489
19354 -70624 -31868 106798 -38898 65718 -493488 184912 -168397 -274566 -83676 -222455
19344 -222455 -190351 157547 63653 -132235 140676 -132123 -163811 -575330 14797 311896
19334 311896 186905 -197424 219651 -34626 -12988 249187 -83688 -73821 -111630 -225280 -111928
19322 57151 -6328 -7580 -7499 -323856 -94773 -393699 -18512 -283973 123264 105105 -258088 -138712
19310 -138712 417596 -218031 -112341 -182586 -155862 67304 -126014 -120812 159143 -34109 22094
19298 -102875 41376 -26950 -114245 -23463 -251071 -85977 41904 -52009 137100 130530 139537
19287 139537 52500 119414 79047 -102318 -63039 -275810 -333834 110703 -374649 131904
19276a98112e5078I1692J29922A05753A0988b11935o5424D7152b49171F7592B9439
19264A03772c09753J21007n424B3315c59300a43952N1395k90338h2331j77740
19254b60071E4962b78060B14215a96224B24345b1122A64536A3499e911D0611d6142
19242A0991a05092j44915a11814C21183a41775e8223n0281r1311P4822K9405A87225
19230C138a11542K2946j27830J02846A04548L3225b3526j13999f351k74586A56298
19218A7561J6728L9645a69089B8639h0471j62984l02552a74616L6424b4163q8876
19207a13039D0157c33173B0088h766E9566c28777a8194k71571c2883B21393i7981
19195B78028B1224c10909A01385N4265a06258d1058j13571J7912q7661i3637D4810
$$ plain form
19276 -198112 -55078 91692 221614 105753 10988 -211935 -277359 47152 -249171 67592 29439
19264 103772 -309753 -188746 -194170 23315 -359300 -143952 -92557 -382895 -82331 -260071
19254 -260071 54962 -278060 214215 -196224 224345 -21122 164536 13499 -5911 40611 -46142
19242 10991 -105092 -250007 -111814 321183 -141775 -58223 -108504 -199815 -124993 -95588 187225
19230 3138 -111542 -88596 -216426 -113580 104548 137773 -23526 -137525 -6351 -280937 156298
19218 17561 34289 73934 -169089 28639 -80471 -243455 -546007 -174616 -138192 -24163 -113039
19207 -113039 40157 -333173 20088 -8766 59566 -328777 -18194 -289765 -32883 221393 -97981
19195 278028 21224 -310909 101385 155650 -106258 -41058 -154629 -136717 -224378 -93637 44810
19183i0697A44667b672k65553E5623B6887e561k719F1032a1765B56267g4421A88319
19170B50206a23115j56395K3263L1389e478B1251J08336a62317N5067D4178f6014
19158b3332C7932d3962J5441j34079J3554k8445B44992O8551b282l63937a56098
19146A04222K19261b42671b5235H1384a5303j97865Q1195A04246a09446a8802
19135i924q8265E4089a08504j35512H623c21988A21008D9579J21349F4267h5343
19123c55269a1174B7268c5410o2146b8623A04117c46815a31603j20655A43591
19112A84968a7487B79276A04220a86998e6847j00188r772c3968A28742L20859
19102D49601F9143j7884a02110A77133c18199a10378m813A14126K5664c49718
$$ plain form
19183 -90697 144667 -2672 -268225 55623 26887 -5561 -8280 61032 -11765 256267 -74421 188319
19170 250206 -123115 -279510 -256247 -224858 -5478 21251 129587 -162317 -107250 44178 -66014
19158 -23332 37932 -43962 -28521 -162600 -149046 -177491 244992 313543 -2282 -366219 -156098
19146 104222 323483 -242671 -25235 81384 -15303 -213168 -131973 104246 -109446 -18802
19135 -9924 -98189 54089 -108504 -244016 8623 -321988 121008 49579 170928 64267 -85343
19123 -355269 -11174 27268 -35410 -97556 -28623 104117 -346815 -131603 -252258 143591
19112 184968 -17487 279276 104220 -186998 -56847 -157035 -166807 -33968 128742 449601
19102 449601 69143 51259 -102110 177133 -318199 -110378 -115191 114126 139790 -349718
19091c8298K274n3261A38361Q6388q7251F8230a22860k03460I0327f2781o9937
19080a32718a2057A6827b28593N3414K5424k28774a29708A34208j6071K9114C1982
19068a26862A43188f7054j29297g6694B13462a71534B71363b71770c5956k57920
19058b93876a44601j67198d7100k23563J22095K7893G7432J90045b15020J8178
19048a96842Q8671K1114r2136A24689i2239k4116k14851A80513a27655h120A75271
19036b27051D4606e8823g4j28151d1856k48662B30647a85356p9897r9412C09875
19024a7014B51738A7058b33985A02124l4537q231H628i7038G8028J03776F9014
19012b3064A16959j0189b87863H941a80210P5084J6703J3489B7371a63807E3886
$$ plain form
19091 -38298 -36024 -89285 138361 224749 137498 68230 -122860 -326320 90327 -62781 -132718
19080 -132718 -12057 16827 -228593 -175179 -149755 -378529 -129708 134208 118137 147251 31982
19068 -126862 143188 -67054 -196351 -76694 213462 -171534 271363 -271770 -35956 -293876
19058 -293876 -144601 -311799 -47100 -270663 -148568 -120675 77432 267477 -215020 -196842
19048 -196842 -108171 -87057 -179193 124689 -92239 -116355 -331206 180513 -127655 -8120 175271
19036 -227051 44606 -58823 -74 -128225 -41856 -290518 230647 -185356 -265253 -364665 309875
19024 -17014 251738 17058 -233985 102124 67587 59356 8628 -97038 78028 181804 69014
19012 -23064 116959 106770 -287863 8941 -180210 -105126 -88423 -74934 27371 -163807 53886
19000G1030K25253a96433C45380a30320L8752A61316l1477E2215g7293A65133
18989C713i3096L887m2192l2957B86811b4182r7865B23697c30823f2073k9626
18978i1699j76302h3214G5388K12356r5274a86699e5962p1302o0481O6084j1592
18967a33253k7349j8644B42362a70142l1956F7241c63475b8930A01428c64736
18956a58135B11584a3039E1863J65817f1793j38952A00884b81236b3680k06278
18946b29958n1785h9460p3184f9538A8471a40648O7177n8990l75089B40749p8272
18935A62477N8574b3557j17610j34691P766C1388d2688k08977R3456B51827p0839
18924A80988J28232b32652A00593a94277H0106O8186h6638O450A38671a33468
$$ plain form
19000 71030 296283 -196433 345380 -130320 -91568 161316 129839 52215 -77293 165133
18989 3713 -93096 -89209 -131401 -164358 286811 -24182 -122047 223697 -330823 -62073 -91699
18978 -91699 -268001 -83214 75388 287744 192470 -186699 -55962 -127264 -187745 -121661 -133253
18967 -133253 -160602 -179246 242362 -170142 -202098 67241 -363475 -28930 101428 -364736
18956 -158135 211584 -13039 51863 217680 -61793 -200745 100884 -281236 -23680 -229958
18946 -229958 -281743 -89460 -162644 -69538 18471 -140648 -73471 -132461 -507550 240749 162477
18935 162477 221051 -23557 -141167 -275858 -268092 31388 -42688 -251665 -158209 251827 180988
18924 180988 309220 -232652 100593 -194277 80106 148292 -86638 -80188 138671 -133468
18913B25422b66361A79833a06453A40952c2095B11679A5557i9585j14087Q0506
18903a33166d9462k6228B16443b00124q0270h6536k35445N9643D9953c79426A17966
18891A21593L3063i8209A1706L05604b85683H6544J7433B9342b02435c6183j86338
18880b22521m7922k4119D15700a4939l20931a09718G931a77672J396A43747a79827
18868c7220k46094q950A59084J57741h5484A27699a34597j20377Q6574P2983M1220
18857e4197E594J11778a28081A73444A7254b09682k9729I0009J06805R2950a94143
18845e1713B18079c0539q4446M6338l4237d3835C3172b00459d7579l07342a57093
18833a56320l9736a4483B6756K12170j11391a72979a3363p56p3910n1688A94948
$$ plain form
18913 225422 -266361 179833 -106453 140952 -32095 211679 15557 -99585 -213672 -133166
18903 -133166 -49462 -75690 216443 -200124 -280394 -86536 -321981 -262338 49953 -379426 117966
18891 121593 154656 -98209 11706 317310 -285683 86544 103977 29342 -202435 -36183 -222521
18880 -222521 -270443 -294562 415700 -14939 -335870 -109718 7931 -177672 -176276 143747 -179827
18868 -37220 -283314 -292264 159084 316825 -85484 127699 -134597 -254974 -168400 -95417 -54197
18857 -54197 5594 117372 -128081 173444 17254 -209682 -239411 90009 196814 289764 -194143
18845 -51713 218079 -30539 -114985 -68647 -102884 -43835 33172 -200459 -47579 -354921 -157093
18833 -156320 -196056 -14483 26756 238926 127535 -172979 -13363 -14119 -88029 -139717 194948
18821g5977B32448g4749q6424A48670j5932K05265h7129k37915A06577L7672a10092
18809h1169B62805a18595d6931E8061a16300A33224b01500O6362K7116H5024b81961
18797D1007J94931A2989K3966d3184A69869a17632k17352G7234c2962I9756a88452
18785h245j41217E730f0623j7302B7319N1185C1173R1199a00418k8882j69129
18774b98429a39986j9250o9186c5425k12685E3591d36012A63225C8768a91127
18763A35614i7635l9291M1432B33073R6352a45215J4411b2800j10516k02581i6818
18751C6320a2527l15781A16744J851i6815j30301A4037h8903j21340G7480g5756
18739b06076j03881K2422B0153i3083c6662A50097d5901B20930F8892a25891B41534
$$ plain form
18821 -75977 232448 -74749 -161173 148670 132738 338003 -87129 -325044 106577 144249 -110092
18809 -81169 262805 -118595 -46931 58061 -116300 133224 -201500 -135138 -108022 85024 -281961
18797 41007 235938 12989 36955 -43184 169869 -117632 -334984 77234 -32962 99756 -188452
18785 -8245 -149462 5730 -60623 -77925 27319 78504 31173 122372 -100418 -129300 -298429
18774 -298429 -139986 -159236 -228422 -35425 -248110 53591 -436012 163225 38768 -191127
18763 135614 -97635 -136926 -95494 233073 329425 -145215 -130804 -22800 -133316 -335897 -96818
18751 36320 -12527 -328308 116744 118595 -96815 -227116 14037 -88903 -210243 77480 -75756
18739 -206076 -309957 -287535 20153 -93083 -36662 150097 -45901 220930 68892 -125891 241534
18727f9891G4544b16900B9479G108a28426j40690L2427O9846d4388k61075B05783
18715h6507c2374m6000A40934I513b1987D03767A73310b07166k7309B73238e3523
18703A38097b35353H9487b87574a29007G0075b41147h8034E3915K744P2151j3571
18692A15239a47729j4931m7081q0559A00888C6498K07395G3136e7985A41215b15366
18680a32355o6568j43890Q2236j18878J15865G2288o147b44900r0003R8412K4962
18669b11529R8329E5210K7916k4196j7882C895i9329G0864i068j29558j886p0361
18657b10873J04202a2739C7288b52058B4716h5320l0531o4783D1415h0200E2363
18645g8981B8405e8821E3192K39018c52509C546O2537a169j48833j7771q4325
$$ plain form
18727 -69891 74544 -216900 29479 7108 -128426 -269116 -236689 -166843 -44388 -305463 205783
18715 -86507 -32374 -78374 140934 9513 -21987 403767 173310 -207166 -234475 273238 -53523
18703 138097 -235353 89487 -287574 -129007 70075 -241147 -88034 53915 56659 128810 115239
18692 115239 -147729 -162660 -209741 -290300 100888 36498 243893 73136 -57985 141215 -215366
18680 -132355 -198923 -342813 -260577 -379455 -263590 72288 66141 -244900 -334903 -236491 -211529
18669 -211529 -113200 55210 83126 58930 41048 3895 -99329 70864 -9068 -138626 -140512 -210873
18657 -210873 -106671 -12739 37288 -252058 24716 -85320 -115851 -180634 41415 -80200 52363
18645 -78981 28405 -58821 53192 292210 -352509 3546 66083 -1169 -150002 -167773 -252098
18634b52098C1374a56999C33362B597f1616n126j22582A69315a4099j44235O0706
18623i7628q9337l7205h8877d1819j45636I7884J25978L7184A7651g3205b5175
18611a8085h507j89769j19434E7977c67241a49355f7252B09204d6153A32989a76597
18599B02145l0172g9524j87191I2875b43477k199g7933F9261e8972A6384Q7357
18588A03741c00230f5481j55708O6784c3000A88863b15500A45790e3650H7289
18577d9528j15799C66404a50209k044C1381J40860a51432O1782K1985j99042J20984
18566a45723B87869d8974k05358j4386j15011J48332P7630E9450N9298L9495p8518
18555G9725b21058R1292m1678K4776a2203k3704l82974A2093g7416n4713J2120
$$ plain form
18634 -252098 31374 -156999 333362 2597 -61616 -66742 -189324 169315 -14099 -158334 -97628
18623 -97628 -186965 -224170 -88877 -41819 -187455 97884 223862 261046 17651 -73205 -25175
18611 -18085 -8507 -198276 -317710 57977 -367241 -149355 -67252 209204 -46153 132989 -176597
18599 202145 171973 -79524 -266715 92875 -243477 -245676 -77933 69261 -58972 16384 103741
18588 103741 -300230 -65481 -221189 -154405 -33000 188863 -215500 145790 -53650 87289
18577 -49528 -165327 366404 -150209 -152253 31381 172241 -151432 -89650 -67665 -266707 -145723
18566 -145723 287869 -48974 -254332 -268718 -383729 -235397 -157767 59450 118748 158243 79725
18555 79725 -221058 -129766 -171444 -146668 -12203 -35907 -418881 12093 -77416 -132129 -120009
18544a20009A90404e8261j18452B51741A08698m0361b69067e5089j4254k9164
18534i8507j41848d1913E5066d476j44025D6256c24786e8407k97518C5681c2185
18522A47567d08246a14208j29A31562o2046a95142k6167N1984M0321A85170n9044
18511A26126d17617A93147g4959J5027o9322k36004I553P0675c85464e6036E0552
18499A43655b34153B9276b5216p4489l0638j42496Q9148I5600K26221b97700d3648
18487h5965k2264j90623E744b21277B39909l7231b86675h437I197i9008B35693
18475b88761F1375a14655B72303g038k27111b5116j70524j97741d8954E6947N3100
18464A10047b06995i3720c5607m34338h2281o6551b9590j85028e1541C29380A43872
$$ plain form
18544 -120009 190404 -58261 -176713 251741 108698 68337 -269067 -55089 -69343 -98507
18534 -98507 -240355 -41913 55066 -4476 -148501 46256 -324786 -58407 -355925 35681 -32185
18522 147567 -408246 -114208 -114337 131562 69516 -195142 -221309 -169325 -129004 185170 126126
18511 126126 -417617 193147 -74959 -59932 -129254 -365258 9553 80228 -385464 -56036 50552
18499 143655 -234153 29276 -25216 -99705 -130343 -272839 -183691 95600 321821 -297700 -43648
18487 -85965 -108229 -298852 5744 -221277 239909 202678 -286675 -8437 9197 -99008 235693
18475 -288761 61375 -114655 272303 -7038 -234149 -25116 -195640 -393381 -48954 56947 110047
18464 110047 -206995 -93720 -35607 -469945 -82281 -148832 -29590 -214618 -51541 329380 143872
18452a16128A00565c7370A68420b02010A4011b85111C54355a57808j09270a22547
18441d2407k05080B75317a89399j2728L538l05724d8285g28A03735J26170K3737
18430B53642F5605K23956j38746c21533g4256q4497E2931P8112K4321c380j22420
18419a25800f415k8428A83100b12199P7452A5640b34498A31731A8760d8763B09641
18407c61828J79471o4233A20994e0130A63914f4405A3650K22211e1084j6359q5354
18396a52797e1994N209j91519d7664j60912J01286A61113a48070i139A04121a05106
18384a83995c4710G6289J38732a04759F0131d74641c2651A92317b35491A64722
18373B11699b7498k71792C6942P0729e1500A00178C9804K01480N4193d5260k9043
$$ plain form
18452 -116128 100565 -37370 168420 -202010 14011 -285111 354355 -157808 -267078 -122547
18441 -42407 -247487 275317 -189399 -202127 -198589 -504313 -48285 -728 103735 229905 253642
18430 253642 65605 289561 150815 -321533 -74256 -158753 52931 131043 155364 -3380 -125800
18419 -125800 -6415 -34843 183100 -212199 -134747 15640 -234498 131731 18760 -48763 209641
18407 -361828 -182357 -246590 120994 -50130 163914 -64405 13650 235861 -51084 -67443 -152797
18396 -152797 -51994 -46785 -238304 -47664 -208576 -107290 161113 -148070 -9139 104121 -105106
18384 -183995 -34710 76289 215021 -104759 60131 -474641 -32651 192317 -235491 164722
18373 211699 -27498 -299290 36942 107671 -51500 100178 39804 241284 295477 -45260 -74303
18362g4303L3465E1946d4355o8823L5018A72315b74538A1568a76994H0780J53879
18351B34659a80591A35404f4647A39924C6266J30308b43713h262o329C77079a99479
18339h3612O877h788A82491n7623A3513a15424j79640J06686A49529a27317M8717
18328g8600A34644b4906B61231I721J51403c16921B48265M1135a85897P1128B07646
18316h3119H4273b719F1510a56102C61081b6869j66423j1919h0055D2704a79404
18304A8045g5771J6179n621h347j43570A30235b44904q5346a22132r9657E1516
18292a83055B5618c9088j97851A6655a68221j33131a13600M6801A46518b19713
18281b23735F5681J15376i086j65997c3216r0460C67305D410L5131J1410a84437
$$ plain form
18362 -74303 -40838 51946 -44355 -113178 -78160 172315 -274538 11568 -176994 80780 234659
18351 234659 -180591 135404 -64647 139924 36266 166574 -243713 -8262 -14591 377079 -199479
18339 -83612 -76735 -8788 182491 124868 13513 -115424 -295064 -188378 149529 -127317 -78600
18328 -78600 134644 -24906 261231 9721 161124 -316921 248265 289400 -185897 -114769 207646
18316 -83119 84273 -2719 61510 -156102 361081 -26869 -193292 -205211 -80055 42704 -179404
18304 18045 -75771 -59592 -65213 -8347 -151917 130235 -244904 -330250 -122132 -221789 51516
18292 -183055 25618 -39088 -236939 16655 -168221 -301352 -113600 -66799 146518 -219713
18281 -223735 65681 181057 -9086 -175083 -33216 -123676 367305 4410 39541 50951 -184437
18269a17134l7950A3893R0966J24165B1039D816i9153g801k41576j50305B1112
18257e3777k36853P8357I3406c07655h8937j92666k6782A00393a75061P6095B41925
18245A17014a51782m1362h7384C1867j1865N782J59474H8300e5317A74497b62988
18233a91756a3409k93026b5501A35946k1394A6344e35517I6797J10376d6058q9990
18222a36048P75A9616N4295J80394e9546j31133A9811e8086B4224a52659e6307
18210A06976J2051l0175a23417B00321a4597D1520f3698j52306Q7019B02745c39360
18198A40230a34708B04601q2401a5604k35319B57740G6919g2815j5543c9624H5612
18186h6313k3498d6923l02763A32298h0350b3619B66515A03673B4980O5977j1024
$$ plain form
18269 -117134 -155084 13893 104859 229024 21039 4816 -99153 -7801 -249377 -399682 21112
18257 -53777 -290630 -212273 93406 -307655 -88937 -281603 -308385 100393 -175061 -98966 241925
18245 117014 -151782 -193144 -87384 31867 20002 25784 185258 88300 -55317 174497 -262988
18233 -191756 -13409 -306435 -25501 135946 114552 16344 -535517 96797 207173 -46058 -136048
18222 -136048 -135273 19616 73911 254305 -59546 -190679 19811 -58086 24224 -152659 -56307
18210 106976 119027 88852 -123417 200321 -14597 41520 -63698 -216004 -128985 202745 -339360
18198 140230 -134708 204601 122200 -15604 -250923 257740 76919 -72815 -88358 -39624 85612
18186 -86313 -109811 -46923 -349686 132298 -80350 -23619 266515 103673 24980 90957 79933
18175G9933J86782n8444d08477a53315c4531j67280A31530j8778a77516A73890
18164a28931A28789a90151g4023m2585N4014b4776j27770E2812J3541a20609D3995
18152A8367J029a17299h770I24J94604H3534c1842k70910A96374b80008h4961
18140d5426n9677B59865n022A21705d80500D4046k0493J82529a33676O2610j46888
18129b17954C15061p0350f3533A64025g9551L6020j02354e5951q3962A9970B439
18117b84327i7650F6935L850N169j345J95569f7797a224k28713E2626j562L2459
18105H3523r507K876c95769D17898F5637c02797e971m2866j83522i8137K6988
18094g1149k8920C0643M8614B2703b31457G0689a67105D2300L5508a0623l3597
$$ plain form
18175 79933 266715 208271 -408477 -153315 -34531 -201811 131530 112752 -177516 173890
18164 -128931 128789 -190151 -74023 -116608 -62594 -24776 -152546 52812 66353 -120609 43995
18152 18367 19396 -117299 -8770 924 195528 83534 -31842 -302752 196374 -280008 -84961
18140 -45426 -105103 259865 254843 121705 -480500 44046 23553 206082 -133676 -71066 -217954
18129 -217954 315061 244711 -63533 164025 -79551 -43531 -145885 -55951 -139913 19970 2439
18117 -284327 -97650 66935 70785 75954 74609 270178 -67797 -1224 -229937 52626 51064 83523
18105 83523 74016 76892 -395769 417898 65637 -302797 -5971 -48837 -232359 -98137 -71149
18094 -71149 -100069 30643 79257 22703 -231457 70689 -167105 42300 77808 -10623 -44220
18083d4220b0886m5898G6025b5006k85703E3513g4121j92342L9989A86337b5573
18071b08205B33162e4618C7768a2209A1866J09911N075E6681m25O2733D7851d02033
18058F2937K8849J55194B4333e5851C0662K42696a81081m2278Q3658j14646A24889
18046C03675a36827F2443J3477b02667I9801J41509a49586a0968k31562g8773
18035a20889Q339q9799b8366B25391c33390N070f9370C59167A6809a59926B8252
18023g7520b1937j15305c2645J6189G0738a77779r1850a3588j67858m122k7237
18012b12805I4547L3939b39975I6768b21428b8859D81508b39376j68350F8799
18001C16J1553a92942g0818j04258c6706j45528m21343C00174a9335I5420I387
$$ plain form
18083 -44220 -20886 -66784 76025 -25006 -310709 53513 -74121 -266463 -226474 186337 -25573
18071 -208205 233162 -54618 37768 -12209 11866 121777 126852 56681 56256 118989 47851 -402033
18058 62937 91786 246980 24333 -55851 30662 273358 -181081 -223359 -139701 -254347 124889
18046 303675 -136827 62443 75920 -202667 99801 241310 -149586 -10968 -242530 -78773
18035 -120889 -112550 -202349 -28366 225391 -333390 -328320 -69370 359167 16809 -159926 28252
18023 -77520 -21937 -137242 -32645 -16456 70738 -177779 -269629 -13588 -181446 -185568 -212805
18012 -212805 94547 128486 -239975 96768 -221428 -28859 481508 -239376 -407726 68799
18001 316 11869 -192942 -70818 -175076 -36706 -182234 -603577 300174 -19335 95420 9387
17989a12657K9349d1114o6403D8836h5623A52965b82322C43975A2124J6289b36216
17977d5799j1332B9952J72206E4356M9215b50254Q7033c7882c296k05341G5911
17965g9894r7318m7844A29149m171L8044a09643A91162c0075k28885e8751A38086
17953a27134A51973b2869j78646B7731b08023l1370A02638L3024f2404j21156
17943a83560d5421B0425J5485E243O7651d88328a9567r359k90535B23961p7803
17932A46158c4864A65975b3968j72675G8559M7882a03899j09767c9519n2559p1943
17921a64021e4387D5797c2729k38915B88759a70744L2988A7360b65083J25981
17911a39102k9873c9288l279j27739A31421h7606L7011n6708J3962c9699I3953
$$ plain form
17989 -112657 -83308 -41114 -107517 48836 -85623 152965 -282322 343975 12124 28413 -236216
17977 -45799 -57131 29952 202158 54356 103571 -250254 -163221 -37882 -3296 -208637 75911
17965 -79894 -177212 -225056 129149 124978 163022 -109643 191162 -30075 -258960 -58751 138086
17953 -127134 151973 -22869 -201515 27731 -208023 -239393 102638 135662 -62404 -183560
17943 -183560 -45421 20425 35910 5243 72894 -488328 -19567 -28926 -319461 223961 146158
17932 146158 -34864 165975 -23968 -196643 78559 126441 -103899 -213666 -39519 -92078 -164021
17921 -164021 -54387 45797 -32729 -271644 288759 -170744 -137756 17360 -265083 -139102
17911 -139102 -168975 -39288 -42567 -170306 131421 -87606 -50595 -107303 -93341 -39699 93953
17899c04984g4716j91485A10682a58579A76155a18230C82188A74071F659J08131
17889A14790h7831K1209B6628K40872l6811l0043H741f4326b8497A41332m8704
17878I2628g1216B64139a5375A04255K45420B7553d3589E2169P2517c5352B84737
17866A09650J10089h0299A8952g350B46115b7448B8986K45874c4170q9150j78597
17855c01917e8840B98410b9004j59255O9041o339l21392a576o4854l01138J67157
17844b00411m2813J15324A20325a07577J1279F9100R9142d7526J5907j42951B5240
17832F3629J34626b23745J06301A20918c70336A84530h5742K9152K7571m17195
17822d46214B77482E353J82314d3068A24930K58899C7019J12854d1898o169l8941
$$ plain form
17899 -304984 -74716 -266201 110682 -158579 176155 -118230 382188 174071 6659 114790
17889 114790 -87831 -66622 26628 267500 230689 200646 8741 -64326 -28497 141332 92628
17878 92628 -71216 264139 -15375 104255 349675 27553 -43589 52169 124686 -35352 284737
17866 109650 219739 -80299 18952 -7350 246115 -27448 28986 274860 -34170 -123320 -301917
17855 -301917 -58840 298410 -29004 -188259 -119218 -125557 -446949 -1576 -66430 -367568 -200411
17844 -200411 -243224 -127900 120325 -107577 -96298 69100 168242 -47526 -31619 -174570 25240
17832 63629 198255 -223745 -117444 120918 -370336 184530 -85742 -56590 -29019 -446214
17822 -446214 277482 5353 187667 -43068 124930 383829 37019 149873 -41898 -48067 -87008
17811h7008B65350G9183e3782E6644a58596A38974b0980A58693e956j75068A67109
17799a16422B65125D8134a62717A1724O0350b74745f2B06038b6990l11230N9533
17788b78687A32268O1388J25218c6783b572D3293N49519B09024B1935i4514m7239
17777a41753C02669j33988a23942N2506K7743B10821m1039b7874l04316H2159
17766b31890i1787m6290B64g672j58931D9366B2961a77161l6023A25805g5214
17754C39084a96455g7403A53831R6178e2322n0428A81554c82252A41613P1282
17744B12895E8266O3233M3151i8554B6821K7901L8380N9835F830a84626A4058
17732B54660a12073A6380N5063J02690a15997M7580a210j30135c151o0263j83192
$$ plain form
17811 -87008 265350 79183 -53782 56644 -158596 138974 -20980 158693 -5956 -181024 167109
17799 -116422 265125 48134 -162717 11724 72074 -274745 -62 206038 -26990 -338220 -278687
17788 -278687 132268 193656 318874 -36783 -2572 43293 592812 209024 21935 -94514 -141753
17777 -141753 302669 168681 -123942 -71436 -43693 210821 169782 -27874 -332190 82159
17766 -231890 -91787 -138077 264 -7672 -166603 49366 22961 -177161 -213184 125805 -75214
17754 339084 -196455 -77403 153831 250009 -52322 -102750 181554 -382252 141613 212895
17744 212895 58266 121499 164650 -98554 26821 54722 93102 152937 6830 -184626 14058
17732 254660 -112073 16380 71443 174133 -115997 -68417 -1210 -131345 -3151 -63414 -246606
17721b46606d0218A54253e0854G3321a83386j1154F3540Q4063c11793C10666i3615
17709H1725d9768j0230B267R5030R1723b29080A66536A8430K6885M02K20271E6478
17696c01853B84340i8667C12801a50842B81083a6050n5293I6671C5099d8862A07159
17684c0051D436J74556R6923A30961e34870K54534f4891k7119C7527J32364J35914
17673C05805a00853M6568E2079e6634l1622D3743J18714J1508C7119C976L52426
17662C56402A26397P6610H008J99385a47348q4081D7513N8462j4900J68488J39
17651B59702A00946A4908J9819i4298r5268H4358c64701B23850H2956a3581n2494
17640f6075A70710a6170l919E463J70304h2735B43773a53507I6080A7529M9764
$$ plain form
17721 -246606 -40218 154253 -50854 73321 -183386 -194540 63540 147603 -311793 310666 -93615
17709 81725 -49768 -59998 2267 97297 189020 -229080 166536 18430 45315 45717 265988 56478
17696 -301853 284340 -98667 312801 -150842 281083 -16050 -71343 96671 35099 -48862 107159
17684 -30051 4436 178992 275915 130961 -534870 -280336 -64891 -92010 37527 169891 305805
17673 305805 -100853 -54285 52079 -56634 -88256 43743 162457 173965 37119 3976 356402
17662 356402 126397 203007 8008 207393 -147348 -231429 47513 105975 91075 259563 259702
17651 259702 100946 14908 34727 -94298 -189566 84358 -364701 223850 82956 -13581 -66075
17640 -66075 170710 -16170 -20089 5463 175767 -82735 243773 -153507 96080 17529 67293
17629F7293g4663k82051D3120A1256J85641G1660J60038E0169f2294B9030r921
17618A9109R3782A0702d3186J4944l1561A23502E0493K7892h5300n6657H4897
17606h150j85342j50303R6549f5991j45570d1388j16317M6493C1063a708A14691
17594i315A35717m0907m5396a57814A80294b6096q9519A20694c4018m422A41712
17582D1101K8482a31347A41008m1084b76950O4839B77514l6343e4155D84791b00404
17570e5101A67842N8333a1225A64088b37421D1248e3749j14827P9131G7133b58761
17558A54745I295i648o2117C03350a37281F2961J09543Q6328a05009B96004q8574
17547B07430a1453B20450B2126R0328l732h693l4659C02792j16968d0518l24069
$$ plain form
17629 67293 -74663 -356714 43120 11256 196897 71660 231698 50169 -62294 29030 19109
17618 19109 112891 10702 -43186 -28242 -59803 123502 50493 78385 -85300 -141957 84897
17606 -8150 -193492 -343795 -247246 -65991 -211561 -41388 -157705 -111212 31063 -1708 114691
17594 -9315 135717 94810 49414 -157814 180294 -26096 -115615 120694 -34018 -38440 141712
17582 41101 69583 -131347 141008 99924 -276950 -212111 277514 241171 -54155 484791 -200404
17570 -55101 167842 226175 -11225 164088 -237421 41248 -53749 -168576 -89445 77133 -258761
17558 154745 9295 -9648 -71765 303350 -137281 62961 172504 258832 -105009 296004 207430
17547 207430 -11453 220450 22126 112454 108722 -8693 -43352 302792 185824 -40518 -364587
17536c64587C3979i877A63949J31987a3050A7426O2106A0065J19756l7515J73322
17525B65628c7098B85962G5146P1275n4655K77855A25789c9554A24936E0711a55277
17513E6434f3083A07077J01054m2311c89281A36876a05407E9371A7907P0643J23180
17502B11730I2023J17977E5806R94K44484i648C23014a6998B39325A946N3414
17491E5360h8j3509j94559C58411j35037K72134A6984M7120j8235a53413H9419
17479D51279j31139j17398J61954A27362K71686A63849o7515h5237c3050q099
17469d1149H3983J47589b5096A27768K09597n8587b29008B67954n0925c4582D7572
17457G5214J07820a42052B54259A03573J20128R4062E7227K17989Q1379n4891
$$ plain form
17536 -364587 33979 -9877 163949 295936 -13050 17426 79532 10065 129821 92306 265628
17525 265628 -37098 285962 75146 146421 91766 369621 125789 -39554 124936 50711 -155277
17513 56434 -63083 107077 208131 165820 -389281 136876 -105407 59371 17907 88550 211730
17502 211730 92023 210000 55806 56800 301284 -9648 323014 -16998 239325 1946 55360
17491 55360 -88 -13597 -208156 358411 223374 495508 16984 64104 45869 -153413 89419
17479 451279 320140 202742 364696 127362 399048 163849 96334 -85237 -33050 -41149
17469 -41149 83983 231572 -25096 127768 337365 278778 -229008 267954 217029 -34582 47572
17457 75214 183034 -142052 254259 103573 223701 317763 57227 275216 356595 301704
17447C01704J9395A60169K31923A85347k0636K4019B8688K19473J31143C7678
17436C36070J72121A51945J55949E6681M638J14362J45494A01023M4422l7565
17426A07880K0490J79726j14155G4054K72954j26946E8939R8322e1283C39704
17415D85446p3570j84946L83200a27822D31018A91342k8774a1895A63228f0970
17404A55200K7362J10620C4763K63146i8972A12369K48574b27803h2876l2845
17394a15721A13017d8632B77150P5441J524A49468a14460B27708J93894A85477
17383a47611c4539r9228F4095e0706A84634L0308B1911c8942A77756C4307O9497
17372A03804M270J15018J86430A58302M4849K8371A5097L41482A54337a02472
$$ plain form
17447 301704 321099 160169 392092 185347 164711 188730 28688 248161 379304 37678
17436 336070 508191 151945 307894 56681 61319 175681 321175 101023 145445 107880
17426 107880 128370 308096 193941 74054 347008 220062 58939 157261 -51283 339704
17415 485446 411876 226930 610130 -127822 431018 191342 162568 -11895 163228 -60970
17404 155200 182562 293182 34763 297909 -98972 112369 360943 -227803 -82876 -115721
17394 -115721 113017 -48632 277150 352591 354115 149468 -114460 227708 421602 185477
17383 -147611 -34539 -133767 64095 -50706 184634 214942 21911 -38942 177756 34307 103804
17372 103804 108074 223092 409522 158302 203151 231522 15097 356579 154337 -102472
17361h2088D92813D4176J56079P6294l9636L9830J49326j4773g2902A1530M06540
17350D18070j4871B8842J90316b40054A15016E1311L8428f913A50202A9287L9662
17339E8949b732A71698b5383j29925b1403l11526C05739K9790j58120l6327C7819
17327E7831M76775A88506J18959b0162B53181J80058B4676d4619C8062P3105L6932
17316A48099a57010O7329c990B08922h8105A65654b72677A03871A1390N25427
17306E36817B42359A3706P8326J422F986a8076C63865G0078J6265J03946N4906
17295B45195j00685b6907B50751D7249K24359J4076H318K28159J12309i2410l9292
17284a31702D11303N6499B00296K05942j42470J91554A72218r309L03921d3510
$$ plain form
17361 -82088 492813 44176 200255 276549 236913 276743 426069 411296 -72902 11530 418070
17350 418070 403199 28842 219158 -240054 115016 51311 89739 -6913 150202 19287 58949
17339 58949 -2732 171698 -25383 -155308 -21403 -332929 305739 335529 177409 141082 37819
17327 57831 534606 188506 307465 -20162 253181 433239 24676 -44619 38062 111167 148099
17316 148099 -157010 -89681 -3990 208922 -88105 165654 -272677 103871 11390 536817
17306 536817 242359 13706 92032 93454 6986 -18076 363865 70078 86343 190289 245195
17295 245195 144510 -26907 250751 47249 271608 285684 8318 236477 348786 -92410 -131702
17284 -131702 411303 467802 200296 406238 263768 455322 172218 162909 466830 -43510
17273B53689a01313d500H6300A1361K769d30348A78214G5932K07265r2352a38740
17261C74833j51021l9248M8394O2612r0402R2245B6552g7523A32309b6556J56
17250b6400j73632g1883A93281K58267A02620K36883B3075K74874j37798F8895
17239C45474E6321M7913K01120J34926j73704L7188r7737r1858R0956E4695P3708
17228A28403K99000k05640f4474H9647m3407L09448p7457j28232o6243a3515A39951
17216D19666j71529A1878K74911L38934r2480A11657J09113D1047J03693J90047
17206C34787e4237B74001J15394r8365d0847B13188h662B47181j7628J33315p0080
17195B92788A17008M14223j8395A18444a8291B63629f0111C6110J42278K4108
$$ plain form
17273 253689 -101313 -4500 86300 11361 14130 -430348 178214 75932 283197 190845 -138740
17261 374833 223812 184564 232958 295570 205168 297413 26552 -77523 132309 -26556 -26400
17250 -26400 -200032 -71883 193281 451548 102620 339503 23075 297949 160151 68895
17239 345474 56321 104234 305354 440280 266576 303764 206027 114169 205125 54695 128403
17228 128403 427403 221763 -64474 89647 46240 355688 278231 149999 83756 -13515 139951
17216 419666 248137 11878 286789 625723 533243 111657 220770 41047 144740 334787
17206 334787 -54237 274001 389395 291030 -40847 213188 -8662 247181 229553 362868 292788
17195 292788 117008 531231 512836 118444 -18291 263629 -60111 36110 178388 202496
17185B02496b08846C49913D8230L19611j78232P2492o8114f0498C03301b6897
17174D15870A74021Q5802A8657J22781N775K2375M9121L15641A22147J33699a16919
17162D87363j97358n64r66b789B28807J7743J48994q4623J22326B07527j1116
17151A96411L8403o4863J28605p1192K10010M5457q8732j78051J23789r2824R5067
17140C42080I5067K0250J48483j2529r2150J08741r4257J9329J76940r0792R4044
17129C73126A47499M96973B34249O1700r5171L07424E5959O20091B72965D9815
17118A06760K04768p8177O3261K7950L2584j10762M0185L78286A82491L85010
17108E67501A12820L81460k39795L39021j57003m1985l966J4638A84092M27976
$$ plain form
17185 202496 -208846 349913 48230 367841 189609 262101 193987 -60498 303301 -26897
17174 415870 174021 259823 18657 141438 147213 169588 218709 534350 122147 255846 -116919
17162 487363 290005 289441 288475 -2789 228807 246550 395544 310921 433247 207527 196411
17151 196411 234814 169951 298556 227364 437374 482831 394099 216048 339837 247013 342080
17140 342080 95067 115317 263800 251271 159121 267862 173605 192934 369874 279082 373126
17129 373126 147499 644472 234249 295949 200778 508202 55959 676050 272965 49815
17118 106760 311528 233351 296612 324562 357146 246384 286569 664855 182491 567501
17108 567501 112820 494280 254485 593506 436503 394518 390552 405190 184092 612068
17098F12068j53138O29A94525L16359q7013K83601A36056O6029M8645J87304K72552
17087G10586k25686j44682J5732A58188L21278B27191K26656A05253M97610B90171
17076C31118A29805J34590Q1963L8644m0903K73654j0753j65712p5631J5565k4393
17065C56829m2926Q0496M0441j77252N29829k32526A31170L20552J2788J40739
17055F05249J7840P79j82039J56619r9833j02736j79715O45797l07390l1784J65123
17044F87910j0023j37720r2541j63945M19402j57762J66654j67623j40156r1132
17034C13064J89990M0035L87270C95953K04820J0235j12562K06646N1490j52137
17024F04445J79590j94589O3071K59699C63627M52813B89447L11563k3145K56738
$$ plain form
17098 612068 458930 459559 194525 510884 423871 707472 136056 202085 250730 438034 710586
17087 710586 484900 340218 355950 158188 479466 227191 453847 105253 602863 290171
17076 331118 129805 264395 346358 385002 344099 617753 607000 441288 365657 381222 356829
17065 356829 313903 394399 434840 257588 787417 554891 131170 451722 464510 605249
17055 605249 623089 623868 441829 598448 498615 395879 216164 861961 554571 522787 687910
17044 687910 677887 540167 447626 283681 703083 545321 711975 544352 404196 313064
17034 313064 503054 543089 930359 395953 600773 611008 498446 705092 756582 604445
17024 604445 784035 589446 652517 912216 363627 816440 289447 601010 577865 834603
17014H34603j7844C81852L00465p7756K68675o9310l97828L89786k86236J26905
17004F36553B97063M40465l18823N2640P3244O4982p7973K08263Q2148J75904
16994I97913l32054j80557L15380o0512q533P2880q2714k10742K02852J18693
16984H32606j48432P3916J24396j56652J59435j38581J40370o6088J4190J47825
16974I82985k16472J37412j59389K01210K75814l56874O1062j0139j46648J42809
16964I11770m20898O29146J70871n60999J91262J83472l97642O432K05579l43950
16954E75043N41085n41265N32806j55490R5873o8994j14491K23485k38608L31350
16944A180794k60590M45103m80752M6009K09910k82150K35370q6453P8312J43140
$$ plain form
17014 834603 816759 381852 682317 604561 873236 803926 406098 795884 509648 636553
17004 636553 297063 737528 418705 471345 544589 609571 531598 739861 822009 997913
16994 997913 665859 485302 800682 740170 731637 804517 721803 511061 713913 832606
16984 832606 684174 758090 882486 725834 885269 746688 887058 820970 835160 982985
16974 982985 766513 903925 744536 945746 1221560 864686 925748 915609 768961 911770
16964 911770 490872 1120018 1290889 729890 921152 1104624 706982 713414 918993 575043
16954 575043 1116128 574863 1107669 952179 1048052 979058 864567 1088052 849444 1180794
16944 1180794 920204 1365307 884555 930564 1140474 858324 1093694 1007241 1085553 1228693
16934A228693l13119K51980k00893Q1291K86042m64031L10859L41792k83943o4336
16924A174335k5124J9944L0702J7130J82538k29406J43162j48545L92686m1938
16914A515484m2191j36769J14608P0048o3356K58192m40617J18585P4621m717
16904A463888J64845m02428K63272L04081K01969m90290K59337J85P0596j34564
16894A700891j01113J34466J58205j61678L22205j69589L5984r5208J03860J03356
16884B031379j68565n3952J63267M6104k2787J52342J33500m10309P8060M09528
16874B358567n72728M98799n2645J52292j23352m4764K08390J01447Q6163j04647
16864B507522l68515L45239O1490j4884j52147M96706j87541l53643P1720K13502
$$ plain form
16934 1228693 915574 1167554 966661 1047952 1333994 869963 1180822 1522614 1238671 1174335
16924 1174335 1149211 1169155 1199857 1216987 1399525 1170119 1313281 1164736 1557422 1515484
16914 1515484 1473293 1336524 1451132 1521180 1457824 1716016 1275399 1393984 1468605 1463888
16904 1463888 1628733 1226305 1489577 1793658 1995627 1505337 1764674 1764859 1835455 1700891
16894 1700891 1599778 1734244 1892449 1730771 2052976 1883387 1919371 1824163 1928023 2031379
16884 2031379 1862814 1808862 1972129 2018233 1995446 2147788 2281288 1870979 1949039 2358567
16874 2358567 1785839 2284638 2231993 2384285 2260933 2216169 2424559 2526006 2612169 2507522
16864 2507522 2139007 2484246 2545736 2530852 2378705 2875411 2687870 2334227 2405947 2619449
16854B619449J26497K00561J10462J77468L8681n71879N06944J70623k76076N0808
16844C153538j38699M03129K20973j67064j47118N59826l83226J87625o9911J78712
16834C797785P2336K25994k16568o1392J34677K63917M80806o21014O06309l18032
16824D364818L43523r027J79018J19386l7553K05526r964L53459l17390M96668
16814E688464p600M39839j50294P9642q8617M52950k84587O60418m07447M10445
16804F793213k869J62022M42931j19625M61384J81152K59421j84242M01797K85118
16794H680302K57665k4951L93247N5912L45525k5020O98505J93643Q4706O67183
16784A1326717L38730P2571P36575Q078L09120N51728M50814M38150N64513L24277
$$ plain form
16854 2619449 2745946 2946507 3056969 3234437 3273118 2701239 3208183 3378806 3102730 3153538
16844 3153538 3014839 3417968 3638941 3471877 3324759 3884585 3501359 3688984 3619073 3797785
16834 3797785 3870121 4096115 3879547 3818155 3952832 4216749 4697555 4076541 4682850 4364818
16824 4364818 4708341 4699314 4878332 4997718 4960165 5165691 5155727 5509186 5191796 5688464
16814 5688464 5680864 6120703 5970409 6050051 5961434 6414384 6129797 6790215 6382768 6793213
16804 6793213 6790344 6952366 7395297 7275672 7737056 7918208 8177629 7993387 8395184 8680302
16794 8680302 8937967 8913016 9306263 9362175 9707700 9682680 10381185 10574828 10659534 11326717
16784 11326717 11665447 11738018 12474593 12482671 12791791 13343519 13794333 14232483 14796996 15121273
16774A5121273M03133N61535L30141Q39599P35310O02386N38512J017377N69603
16765B0718869O47644P53613J069600R55361O70152J409942J382639J130239J019192
16756B9757251J028160J717385J532301J734047J593318J855921K240440J887262
16748D3346085K591305K288435K347891L305415K697332L228174L449434L813225
16740F7067296M226217M102583M722152M930207N783505N576238O057821O367315
16732A08833334O905651P596157P659752P642596Q078938Q177667Q034717P761229
16724A70690041P029894O963120N939462M760007L795248K222135J087000o59367
16716B01827540k099968l091618m861882n286307o598487p314025p302826q025166
$$ plain form
16774 15121273 15524406 16085941 16416082 17255681 17990991 18593377 19131889 20149266 20718869
16765 20718869 21366513 22120126 23189726 24145087 24815239 26225181 27607820 28738059 29757251
16756 29757251 30785411 32502796 34035097 35769144 37362462 39218383 41458823 43346085
16748 43346085 45937390 48225825 50573716 53879131 56576463 59804637 63254071 67067296
16740 67067296 71293513 75396096 80118248 85048455 90831960 96408198 102466019 108833334
16732 108833334 115738985 123335142 130994894 138637490 146716428 154894095 162928812 170690041
16724 170690041 177719935 184683055 190622517 195382524 199177772 201399907 202486907 201827540
16716 201827540 199727572 196635954 191774072 186487765 179889278 172575253 165272427 157247261
16708A57247261q180578p825362q111522p631205p620463p218178o485147o472229
16700I7702577o044872n829171m820518m949077m400100m630223l818330l299923
16692E9910363l678997k895279k777989k792797k627218k378251k156441j988300
16684C8615091k179787j620292j258564j786928j116556j564096j291551j378426
16676B6418891q75828j613516p85837p41395r50171q47939p67659o39945p94542
16667A8402059m85599o75817q20048J23349j084219l56712l47760o47280n22695
16658A3585278j60320o35915n36465m82866j36596m73562J05312q23318j31023
16649A0310525j90177m93583n34587K31168l12917K5083m63005j38101m23104
$$ plain form
16708 157247261 149066683 141241321 133129799 125498594 117878131 110659953 104174806 97702577
16700 97702577 91657705 85828534 81008016 76058939 71658839 67028616 63210286 59910363
16692 59910363 56231366 53336087 50558098 47765301 45138083 42759832 40603391 38615091
16684 38615091 36435304 34815012 33556448 31769520 30652964 29088868 27797317 26418891
16676 26418891 25543063 23929547 23143710 22402315 21452144 20604205 19836546 19196601 18402059
16667 18402059 17916460 17240643 16420595 16543944 15459725 15103013 14755253 14107973 13585278
16658 13585278 13424958 12789043 12252578 11769712 11633116 11159554 11264866 10441548 10310525
16649 10310525 10120348 9626765 9092178 9323346 9010429 9035512 8572507 8434406 8011302
16640H011302q1044l23425k101l86626j85647j88517l62396J28395Q3804k29294
16630F464451l4512p2032k07986o6654l08982j4874k35764n22194Q4648l7486
16620E048615j10474J74247m03993r2548j08439K49500q2833l10188l16200J66964
16610D214651j79550L1477j88748J7185J71338l28098J26241k07474R7726N3747
16600C808495k11823j20729l52426J69229j38021O4744o73275O40430k28093K96687
16590C255218j15998k21609o45967P35912j89370j11470j60795K06784r2335k24211
16580B436159J01146m2703k86070K5787J38358J18135j42591j9077r260k09024
16570B110860k15840J65698J52523q8169l5575k48256O8138R7072l10784Q1294
$$ plain form
16640 8011302 7930258 7606833 7604732 7218106 7032459 6843942 6481546 6609941 6693745 6464451
16630 6464451 6429939 6357907 6149921 6083267 5774285 5759411 5523647 5001453 5086101 5048615
16620 5048615 4938141 5112388 4708395 4615847 4507408 4756908 4674075 4363887 4047687 4214651
16610 4214651 4035101 4066578 3877830 3895015 4066353 3738255 3864496 3657022 3754748 3808495
16600 3808495 3596672 3475943 3123517 3292746 3154725 3219469 2546194 3186624 2958531 3255218
16590 3255218 3139220 2917611 2271644 3007556 2818186 2706716 2545921 2752705 2660370 2436159
16580 2436159 2537305 2494602 2208532 2234319 2372677 2490812 2348221 2329144 2319884 2110860
16570 2110860 1895020 2060718 2213241 2125072 2089497 1841241 1909379 2006451 1695667 1776961
16560A776961M5793j7603n9197P0053j86693J73427k92579J08667K56207L460
16550A878496J03711m89930J99772j66303m8389j40185K95180J61209j99808j65342
16540A428411j05578L88993o11026L71479j56992j14267j0165N72124m56097N01
16530A307383p5909K06555o5583K8371k11034K9028O1044K44358l61101J65066
16520A328178l8722p2986j40789M73731l23126k18602K72836j33837j71870K55761
16510A230574l97916K77532j66766m2207Q335K19488n672N7091q9972m5530j75882
16499H69075J64663j45654j09321L24270Q9632n91714L70612j78419K25979J20677
16489A139800l12223K65973l55440j90980J59999P5121L10892k07835J36209k85631
$$ plain form
16560 1776961 1822754 1805151 1745954 1816007 1629314 1802741 1510162 1618829 1875036 1878496
16550 1878496 1982207 1492277 1692049 1525746 1477357 1337172 1632352 1793561 1593753 1428411
16540 1428411 1322833 1711826 1100800 1472279 1315287 1201020 1190855 1762979 1306882 1307383
16530 1307383 1231474 1438029 1372446 1400817 1189783 1218811 1279855 1524213 1163112 1328178
16520 1328178 1289456 1216470 1075681 1549412 1226286 1007684 1280520 1146683 974813 1230574
16510 1230574 832658 1110190 943424 901217 909552 1129040 1123368 1180459 1090487 1044957 869075
16499 869075 1033738 888084 778763 1103033 1192665 600951 971563 793144 1019123 1139800
16489 1139800 827577 1093550 738110 547130 707129 782250 1093142 885307 1021516 735885
16479G35885K16987R3252E01499K96146J57036r7999k46475L99597l32018J41908
16469H19694j75964L54098j97477k64165j45677l6132L47734l47481L97230J08873
16459H60733k79054J39474R2141l2303l8276r921J84868l79986R1377k66758L96286
16448G58581r6157M8038K496N8575l6973k29428J59586C14536M72061j27664j69657
16437D89276o2755J7929O7544J92107j77673J98102k28832O9768J44752o6078
16427F44140P2691J4996J25101C76173J12004J26025k14720O2494r0876j69078
16417B02022N17760k91558M9936j04586L6125K33257K7186j43632n8069O4830
16407E33271k10805J77337Q3150k74729R6188M14082D00892J5124R0669P0271
$$ plain form
16479 735885 952872 1046124 501499 797645 954681 856682 610207 1009804 677786 819694
16469 819694 643730 997828 800351 536186 390509 354377 702111 354630 751860 860733
16459 860733 581679 721153 813294 780991 742715 732794 917662 537676 629053 362295 758581
16448 758581 662424 710462 712958 771533 734560 505132 664718 314536 786597 658933 489276
16437 489276 426521 444450 511994 704101 526428 724530 495698 565466 710218 644140
16427 644140 716831 731827 856928 376173 488177 614202 399482 461976 371100 202022
16417 202022 719782 428224 478160 373574 409699 642956 670142 526510 468441 533271
16407 533271 322466 499803 582953 308224 404412 818494 400892 416016 506685 576956
16397E76956j11828J05790j01013Q1350O2463p6319j64450K76157N9352l25132
16387C83326M2737m4390N9894j49397Q283O2178J19556J73124B66866J98991l6572
16376D29285J26819j41932m0889J83227J2955j07643A97408k151R2447J53616
16366D41320N8408m3733p4921P2329k22319L54804P66j55788K24801j16949j00934
16355D37784p2291J0777J37683a4791A72581K58817G7417M42367P1752q0888j67462
16344C43186A55457L74015A54530M62287j41837j58599A50670J49735J09987A35184
16333C93544F9720r031L52608l1886O2369I9870l7232L99420k03019J47744f0922
16321C36415m7281l6275K61581A56574A4349L02992k4667R2219j4496K1380A67247
$$ plain form
16397 576956 465128 570918 469905 551255 613718 537399 372949 649106 708458 383326
16387 383326 426063 381673 441567 292170 300453 362631 482187 655311 266866 465857 429285
16376 429285 556104 414172 373283 556510 569465 461822 197408 195257 287704 441320
16366 441320 499728 455995 381074 453403 231084 585888 586654 430866 655667 538718 437784
16355 437784 365493 376270 513953 -14791 172581 431398 77417 519784 591536 510648 343186
16344 343186 155457 529472 154530 616817 474980 316381 150670 300405 410392 135184
16333 393544 69720 60689 413297 381411 443780 99870 62638 462058 259039 406783 -60922
16321 336415 289134 252859 514440 156574 14349 317341 292674 384893 370397 391777 167247
16309f2039D76210j12465L63897B46355J25975e6730A17692M3662p5090J36512
16299B22776m4986Q5320A06340L3580J81109K4576A10687O5750K5332I2269J36184
16288B28453K12038j23337j44825J09087J8266K35550l7411D6311K50441K04429
16278E01181A89469J05785n6918A9883L61801L1090J40229B3309J74673p1317
16268A26665K85625a63515A66478F6660Q9310P6727J1256o4386k7560J28690d8332
16256B42909K3946R638M3400J26814m3332q6584a59124j02510B41453G7274c23800
16244A61452R498K68229l4988a28301D81379I4705L11602A40432o8069Q3582O6914
16233B22859J2544J22137a7629A16687C1506A0114O7657b0315A32870K21553r0459
$$ plain form
16309 -62039 476210 363745 727642 246355 372330 -56730 117692 161354 86264 222776
16299 222776 177790 263110 106340 139920 321029 345605 110687 176437 201769 92269 228453
16288 228453 440491 317154 172329 281416 299682 535232 497821 46311 296752 501181
16278 501181 189469 295254 238336 19883 381684 412774 553003 23309 197982 126665
16268 126665 412290 -163515 166478 66660 155970 232697 243953 179567 152007 280697 -48332
16256 242909 266855 276493 319893 446707 403375 316791 -159124 -261634 241453 77274 -323800
16244 161452 170950 439179 404191 -128301 481379 94705 406307 140432 72363 155945 222859
16233 222859 235403 357540 -17629 116687 31506 10114 77771 -20315 132870 354423 263964
16222B63964P4000F2638h660B96086A00693Q6698J2894J11221B8480K69734d882
16210C23690j28220o9753L1042a0386B25253l8849D0371M74212k31588E7332m173
16199E3159k0224J67445K07227B9675R88L08430a42413F7534d3078D39968n1358
16188C88610A10004K27583K0792a77705B89049A25486a55894B11678f5837A25991
16177B69739m0387a42415A96802L06769A4765L12524B9762K39498j25687O0062
16167B03635K16480k8785j20271N5477G9023P3301L25679D7700J79509E1641K61078
16156C12719j10747a79766c8874H3632j2470K98687j15679A506J57068N2881b26300
16144A75708q0056c031A12024a06769B18755C4352Q1938a03453j04119A79070
$$ plain form
16222 263964 337964 62638 -8660 296086 100693 187391 200285 311506 28480 298214 -4882
16210 323690 195470 125717 156759 -10386 225253 186404 40371 514583 282995 57332 53159
16199 53159 32935 200380 407607 29675 30663 339093 -142413 67534 -43078 439968 388610
16188 388610 110004 337587 358379 -177705 289049 125486 -155894 211678 -65837 125991
16177 269739 229352 -142415 196802 503571 14765 327289 29762 269260 143573 203635
16167 203635 420115 391330 271059 326536 79023 152324 478003 47700 227209 51641 312719
16156 312719 201972 -179766 -38874 83632 71162 369849 254170 1506 158574 211455 -226300
16144 175708 95652 -3031 112024 -106769 218755 34352 116290 -103453 -207572 179070
16133C10166k2825a34112j20704G5006d4353j15964j8041K6676H6557K64820j15517
16122B35860h7048A1611N1256a95136A92633I662N2825J15832J57564H594L99987
16111D08581I107M15835e4521A54748J9920J35036o5126a62351d3858n7180B12926
16099A86033J30035a7194j30407b5669I2937a55286A5663K16901c42159A03309
16088b25675R6254C7027K4785M7235e2719j07859N2331D4898b3519A71318a73318
16076a68635c1505B21602f0975K9993F1774d8081D05904b11278C96389a92341
16065c2073B03325G7990J64464B667J13350f4599b3430A34493b37512A72521a82407
16053a78340A34046N5853b24932I0855b04125G6197a93808c9889j46980o2978
$$ plain form
16133 310166 287341 -134112 -254816 75006 -44353 -160317 -178358 -151682 86557 351377 235860
16122 235860 -87048 11611 62867 -195136 192633 9662 62487 178319 335883 8594 408581
16111 408581 9107 424942 -54521 154748 174668 309704 244578 -162351 -43858 -101038 212926
16099 186033 316068 -17194 -147601 -25669 92937 -155286 15663 232564 -342159 103309
16088 -225675 -129421 37027 61812 109047 -52719 -160578 -108247 44898 -23519 171318 -173318
16076 -168635 -31505 221602 -60975 -30982 61774 -48081 405904 -211278 396389 -192341
16065 -32073 203325 77990 242454 2667 116017 -64599 -23430 134493 -237512 172521 -182407
16053 -178340 134046 189899 -224932 90855 -204125 76197 -193808 -39889 -186869 -249847
16043b49847C66348j48248b30957A69380b9713k89699J33024C7174i4634A34355
16032a84664I7723a75554F1430P1010a25844C49444I2345J10269F2572b82778
16021a53395j46305J00025G4004b27430c510j84365C88002a74895A92333d35815
16010e68837f9718m40157f3072D602O1345a56228B47251f8461A42044b26910k5421
15999b52331K6283B92991h281B86491c1548A17004b17217J4754D8400f2260C25053
15987c5278a644j30878i38j01130p3116f2392a6522j3626C02486b24065c6095
15975c18146B6280R7901m9075a08347A8172J37937o009b328F0410c154H4812K9649
15963A14461E036J73410p0370g5833K3918H2329K17510g676k03491e2916A6963
$$ plain form
16043 -249847 366348 218100 -230957 169380 -29713 -319412 -186388 37174 -94634 134355
16032 -184664 97723 -175554 61430 132440 -125844 349444 92345 202614 62572 -282778
16021 -153395 -299700 -199675 74004 -227430 -3510 -187875 388002 -174895 192333 -435815
16010 -568837 -69718 -509875 -63072 4602 65947 -156228 247251 -68461 142044 -226910 -252331
15999 -252331 -226048 292991 -8281 286491 -31548 117004 -217217 -202463 48400 -62260 325053
15987 -35278 -1644 -132522 -938 -102068 -175184 -62392 -16522 -30148 302486 -224065 -36095
15975 -318146 26280 124181 75106 -108347 18172 156109 150100 -2328 60410 -3154 84812 114461
15963 114461 5036 178446 108076 -75833 -51915 82329 299839 -7676 -211167 -52916 16963
15951b08681B41588a54221a0617m9117k20605c4359k12544D0501c2260A50519
15940B7082J63400O1311D2P5996a97094d7862A91575a03215n1101A81810R1312
15929B73122b10489H4069g0866p3081O9161j7960C69601a00206F449c0751C9014
15917d99974d9347C58090G9234e1761C4803a9924A63655l9862a22180K532I3780
15905a25954p4093A04198j1250l4285p862a81323l12941a20979C667c14298J06434
15894b07864Q9944C35187i2988j71767R321B26349b2505j82588M2941j69744g8326
15882d8924j82794C55022f0561K7268k41310R1303A66579b52703H551M9858h2632
15870b3541n1785k14579d0542B19450a53408q3009A911c04408B86133b52235C8972
$$ plain form
15951 -208681 241588 -154221 -10617 -59734 -280339 -34359 -246903 40501 -32260 150519
15940 27082 190482 251793 42 76038 -197094 -47862 191575 -103215 -154316 181810 273122
15929 273122 -210489 84069 -70866 -143947 -74786 -92746 369601 -100206 6449 -30751 39014
15917 -499974 -49347 358090 79234 -51761 34803 -19924 163655 123793 -122180 -119648 93780
15905 -125954 -200047 104198 92948 58663 50801 -181323 -494264 -120979 3667 -314298 -207864
15894 -207864 -117920 335187 -92988 -264755 -255434 226349 -22505 -205093 -162152 -331896 -78326
15882 -48924 -231718 355022 -60561 -33293 -274603 -183300 166579 -252703 8551 58409 -82632
15870 -23541 -75326 -289905 -40542 219450 -153408 -236417 1911 -304408 286133 -252235 38972
15858I2237C6439M4641a4535I8952O4900l2369L7280G2760a50770f2650A65170
15846b04206B2913c51942A21392a64496a2961A81587D7471J52589b88988b1918
15835b3679q4604M6651j85881a09503d6959r8172B26945A9587b88837A61755a66492
15823a60041p3450B47705A14445a34710L56E9833K9341a6026n8068H0169d1161
15811b21845h4237p511r545r388L3432a9481k09265A04102G614K70864A06546
15799A47355d73727h2210n8858C20430j05309G7521b41327P3160F709a1361A45836
15787A26140J8647a61629C6419q278K5153c71591a32270f5895A48452o7794J20381
15776B01039a71023L0061C6958a14892A09678a86615O5951M1996L7146l82590
$$ plain form
15858 92237 36439 81080 -14535 98952 163852 131483 168763 72760 -150770 -62650 165170
15846 -204206 22913 -351942 121392 -164496 -12961 181587 47471 200060 -288988 -21918
15835 -23679 -108283 -61632 -247513 -109503 -46959 -145131 226945 19587 -288837 161755 -166492
15823 -160041 -233491 247705 114445 -134710 -134354 59833 89174 -16026 -74094 80169 -41161
15811 -221845 -84237 -91748 -101293 -110681 -77249 -19481 -228746 104102 7614 278478 106546
15799 147355 -473727 -82210 -141068 320430 215121 77521 -241327 -168167 6709 -11361 145836
15787 126140 144787 -161629 36419 28141 53294 -371591 -132270 -65895 148452 80658 201039
15776 201039 -171023 -140962 36958 -114892 109678 -186615 -120664 -78668 -41522 -424112
15766d24112F214d0470a6829j36598E5890e8838j42555I3414a41426A45568e1000
15754c56476D66213A42215P4381m4633G5833b47253A38769i1442b6376C84188
15743A64255J9168a97348D3999b91358J32343A76757a08616a6121A78604H2562
15732a53432O5015A40018M2857J3347D8129a73259H7705b14076l5001c255D2681
15720c84862A89796b39701E1894b59869a27784l9212R33j4294D2586j1458a35824
15708a2839j43970c2809l10732A98945A0170g4460K0890l51298g8162k71293i356
15696C9466h4121G0813b15259A30656l7305K11600h6675a7578B1326a34383A08485
15684a50435g3038A37143F2563a60137l6398L9269C9048a04926B56623b21020
$$ plain form
15766 -424112 6214 -40470 -16829 -153427 55890 -58838 -201393 93414 -141426 145568 -51000
15754 -356476 466213 142215 216596 171963 75833 -247253 138769 -91442 -26376 384188
15743 164255 183423 -197348 43999 -291358 -159015 176757 -108616 -16121 178604 82562
15732 -153432 -88417 140018 182875 196222 48129 -173259 87705 -214076 -249077 -3255 42681
15720 -384862 189796 -239701 51894 -259869 -127784 -166996 -166063 -180357 42586 31128 -135824
15708 -12839 -156809 -32809 -343541 198945 10170 -74460 -53570 -404868 -78162 -349455 -9356
15696 39466 -84121 70813 -215259 130656 93351 304951 -86675 -17578 21326 -134383 108485
15684 -150435 -73038 137143 62563 -160137 -196535 -157266 39048 -104926 256623 -221020
15673E9329b2120A6683a43162k6431I4622J18314L50123D8947a74010h3701n0513
15662a34214g210j80492m9498b9419j49071A05926A8048c04378E2702c23861A16176
15650C24301d2854A13861K38307d0137J1720o6892b9246N482j50788L4035N2692
15639h7825B1706b81567g3951c902j02704D3346b56907H9064P4550B6346b32753
15627e8608a7750C47584I6760b47628a06821B67446a13827C4101e60111H4640
15616g7460k6549j98687A76475C6767e6441B08959b08525A2318c64884A19018
15605b58336h6322b1580D4877f342g91j27813e8454a5898F2873d0120j6621l23504
15593c80245g1405A16538C829J83632I0357i5139j52648a07241j00013R8430G565
$$ plain form
15673 59329 -22120 16683 -143162 -169593 94622 212936 563059 48947 -174010 -83701 -134214
15662 -134214 -7210 -187702 -237200 -29419 -178490 105926 18048 -304378 52702 -323861 116176
15650 324301 -42854 113861 352168 -40137 -28417 -95309 -29246 -23764 -174552 -140517 -87825
15639 -87825 21706 -281567 -73951 -3902 -106606 43346 -256907 89064 163614 26346 -232753
15627 -58608 -17750 347584 96760 -247628 -106821 267446 -113827 34101 -560111 84640
15616 -77460 -104009 -302696 176475 36767 -56441 208959 -208525 12318 -364884 119018
15605 -258336 -86322 -21580 44877 -6342 -791 -128604 -58454 -15898 62873 -40120 -56741 -380245
15593 -380245 -71405 116538 3829 187461 90357 -95139 -247787 -107241 -207254 -108824 7565
15581A12364c88336e7477j69199o2988A85765a96851P9861l1688H1569a38173
15570d2968k59567a45761P583f3360j9947a7460l02660F056f0199A77018c4283
15558d1930j42701b7661j92958B60003j17355K80888d4679n863o3093k93177G7879
15546b99448B8629a38956f0020p8392B62662F0466a32688n5722m9519A10432a80270
15534H1867h8024k16087A7189d11898A01379J41017a94098l0303A50536a47897
15523B49149a34605d631C5528b13691i6654A24023a84879A0770g978j07374i191
15511a47688C11776I2941P1748a74056B74373K64715a67255I3471P8742c65839
15500a11773d9314o211A7342f9031A4333Q348J85367A823d2181D09988b68238
$$ plain form
15581 112364 -388336 -57477 -226676 -289664 185765 -196851 -116990 -148678 81569 -138173
15570 -42968 -302535 -145761 -138178 -63360 -83307 -17460 -320120 6056 -60199 177018 -34283
15558 -41930 -184631 -27661 -220619 260003 142648 423536 -44679 -50542 -113635 -406812 77879
15546 -299448 28629 -138956 -60020 -138412 262662 60466 -132688 -188410 -237929 110432 -180270
15534 81867 -88024 -304111 17189 -411898 101379 242396 -194098 -224401 150536 -147897
15523 249149 -134605 -4631 35528 -213691 -96654 124023 -184879 10770 -7978 -115352 -9191
15511 -147688 311776 92941 164689 -174056 274373 539088 -167255 93471 172213 -365839
15500 -111773 -49314 -55525 17342 -69031 14333 22681 208048 1823 -42181 409988 -268238
15488c02615A46400k0962d57216B08858a62318D11729H7455L1002c16396A06921
15477C2919J61801a94128j256O2460A54910D3510K2330c62446G6772F942c22258
15465f1415A35964h3669p661C69844j58075G9692i0303B78491I0215A3893K87254
15454C01147b96447B75384j662d7411A75427a7853F1794J11143d81457a79621
15443a54273A20180b13419D2508a50018A87559a04446J6023k74567a01433E1527
15432A38404f5615k4683n5609C9222a77019e311j79452B7089a91123j5069A98746
15420H296L0972i9992G051K17036i3786A65056A1919a60863D607J90415e1445
15408a43414f5882B19276b26738O5430L2008C31704f2279m6616A19041c0725C9732
$$ plain form
15488 -302615 146400 125438 -457216 208858 -162318 411729 87455 118457 -316396 106921
15477 32919 194720 -194128 -195384 -132924 154910 43510 65840 -362446 76772 6942 -322258
15465 -61415 135964 -83669 -91330 369844 211769 79692 -90303 278491 90215 13893 301147
15454 301147 -296447 275384 273722 -47411 175427 -17853 61794 172937 -481457 -179621
15443 -154273 120180 -213419 42508 -150018 187559 -104446 -88423 -362990 -101433 51527
15432 138404 -65615 -90298 -145907 39222 -177019 -5311 -184763 27089 -191123 -206192 198746
15420 8296 39268 -99992 7051 224087 -93786 165056 11919 -160863 4607 195022 -51445
15408 -143414 -65882 219276 -226738 -161308 -129300 331704 -62279 -108895 119041 -30725 39732
15396H9701h5907L0759J2753k10706A66309b8463A37568D8427J82527h4478B32451
15384C9912b36163B165O7538B8426J51640D306b1745H5027K48933F7358J06306
15373A73664a73147B6412K01904a68176H6036d651B9728c06648B31364b89463
15362e2074k95056a0550F0393a83908B4332c52949J26412G0625K536b6421D5985
15350A42364o7852N0737b62177g1424B31292g1717c139r0305d715j39307B62910
15338A25063b09826B572b50298P0516b6569n12A96882g8m4416a2521C06704B3215
15325A55489B3755b2190m557o0417J7748E5776K25112R8833b41260c7071C43627
15313B43595e265A8464P8526a26888C19083b23545A13401J504a02191B23773J09233
$$ plain form
15396 89701 -85907 -55148 -42395 -253101 166309 -28463 137568 48427 230954 -84478 232451
15384 39912 -236163 2165 69703 28426 180066 4306 -21745 85027 333960 67358 173664
15373 173664 -173147 26412 228316 -168176 86036 -4651 29728 -306648 231364 -289463
15362 -52074 -347130 -10550 60393 -183908 24332 -352949 -226537 70625 73161 -26421 45985
15350 142364 74512 125249 -262177 -71424 231292 -71717 -3139 -93444 -4715 -144022 262910
15338 125063 -209826 2572 -250298 -179782 -26569 -27081 196882 -78 -44494 -12521 306704 23215
15325 155489 23755 -22190 -26747 -87164 -69416 55776 280888 379721 -241260 -37071 343627
15313 243595 -5265 18464 96990 -126888 319083 -223545 113401 114905 -102191 223773 333006
15302C33006h2887B99022a06854H9317K1110J35275J9775A07127l2499b1982F8152
15290E8789b7804p2498C04821F1113J13119C9667R1205J13790i5228B65287p5206
15279A90081g1057D58244Q4068h727o5609B67732i2380B47153K868C1251M0742
15268G1993a64803A36654B6223a40542n1300A28962J6032a99147i3649B60452
15257C79289i2012C6953P2909J8880a41714C29662A13486J94608j46245K20597
15247C82446Q42312M7913K7774j64972D57200j61393k818c0660B93173j01394
15237A91779b41791I5392A7395M30282a59165d3701j85391B78882p6428a72284
15226b7797C17213a77199I4049J43268I9157h4426D6344f5777A13031c64500A21176
$$ plain form
15302 333006 -82887 299022 -106854 89317 110427 245702 265477 107127 74628 -21982 68152
15290 58789 -27804 -100302 304821 61113 174232 39667 130872 244662 -95228 265287 190081
15279 190081 -71057 458244 542312 -8727 -74336 267732 -92380 247153 250021 31251 71993
15268 71993 -164803 136654 26223 -140542 -191842 128962 144994 -199147 -93649 260452
15257 379289 -92012 36953 109862 128742 -141714 329662 113486 308094 161849 382446
15247 382446 1224758 1272671 1300445 1135473 457200 295807 292989 -30660 293173 191779
15237 191779 -241791 95392 17395 447677 -159165 -43701 -229092 278882 202454 -172284
15226 -27797 317213 -177199 94049 237317 99157 -84426 46344 -65777 113031 -364500 121176
15214b11474A0951K57J49479b6859p1597A89008J88913c96617a6723B74431d5247
15202F6592a20650b1565A58331g739B66890A10343b8661D3567I333a45559N4770
15191i0789n4980e3515H8294N1672a19759A89329N1976a83574b1083I3853L4523
15180A28376l460J06227C2571a3735C02390a2768A43517g241A33614b24716C85387
15168a32083A41816i2522C76R0051J32859Q3390m1920K66298F0448J48964I1981
15156c26828J16597e7563j09177F5389K06488c8667l8591J1682r4102C0083J76345
15145B06428h2840A07622M08491k15878j04201O7163a84544A41407N370P0642
15135B17419r5692L43340A22147E6612B2212J48738K21643j52885J44020j72993
$$ plain form
15214 -211474 10951 11208 160687 -26859 -98456 189008 377921 -396617 -16723 274431 -45247
15202 66592 -120650 -21565 158331 -7739 266890 110343 -28661 43567 9333 -145559 -90789
15191 -90789 -145769 -53515 88294 139966 -119759 189329 241305 -183574 -21083 93853 128376
15180 128376 124916 231143 32571 -13735 302390 -12768 143517 -7241 133614 -224716 385387
15168 -132083 141816 -92522 376 90427 223286 306676 264756 531054 60448 209412 91981
15156 -326828 -210231 -57563 -166740 65389 271877 -38667 -77258 -65576 -159678 30083 206428
15145 206428 -82840 107622 516113 300235 196034 263197 -184544 141407 146777 217419
15135 217419 121727 465067 122147 56612 22212 170950 392593 239708 383728 210735
15125B10735G0151a24187a1790A80422P8063j9679j08345N6956k8693F7575b0347
15113B42376B4991a89904C70072E6777J21161J08978d6884l1628m2944E2138J5941
15102F8079d7422D10024E3193M38627j95480D1304A3252a88243h9824D34677a25505
15090A08765C6116b46879A90415H4447M40843h6635A96541K19613I7113m2423
15080E4690P8746J94850i6358M5773I8646L171M363G195J20978o0925b07246A01506
15067B59482M6446M7532r6687i1632B58451j3980a29595A68849K95203A57136
15056A09159K6051J36064O0249k6315a5789A20946K63597R3137j39747A00401
15045A81368k9246C3600L6606K2813B9206J5186J49099J78725n2209L23258j92908
$$ plain form
15125 210735 70151 -124187 -11790 180422 258485 238806 130461 187417 158724 67575 -20347
15113 242376 24991 -189904 370072 56777 177938 286916 -46884 -78512 -121456 52138 68079
15102 68079 -47422 410024 53193 491820 296340 41304 13252 -188243 -89824 434677 -125505
15090 108765 36116 -246879 190415 84447 525290 -86635 196541 416154 97113 54690
15080 54690 133436 328286 -96358 -50585 98646 101817 106180 7195 128173 67248 -207246 101506
15067 259482 305928 353460 256773 -91632 258451 244471 -129595 168849 464052 157136
15056 109159 135210 271274 331523 305208 -15789 120946 384543 477680 337933 100401
15045 181368 152122 33600 70206 93019 29206 44392 193491 372216 320007 643265 450357
15034D50357A48215b15322c2469B11389Q5216j41157a2645C52463L9426k1093
15024C70796j51498m8191m8656K12618j32618Q0347r5540L58824j67991d9488
15013C14818A37590d2204F39790B8261L76666H4954A6787Q3750i020q6923D92274
15001C16864j9697P3305c83746B60842a12307C53754l6226j30840j5556m6030
14991A25102J94660J71868A52315h0645D47188n7447A42488o7332a21648A30168
14980B34022J04876A03487J21859A07420J23738f8934F2590g1656C87902A66797
14969A41199J53316G4791R8063K09811j50674K10138A89705J8371J48490j2261
14959C44305A03402L51732j3086l0451b9146C58099j10898d457B79797E0857L47937
$$ plain form
15034 450357 148215 -215322 -32469 211389 296605 155448 -12645 352463 391889 370796
15024 370796 219298 171107 122451 335069 202451 282798 187258 546082 378091 -49488
15013 314818 137590 -42204 639790 28261 404927 84954 16787 100537 -9020 -95943 492274
15001 316864 297167 370472 -383746 260842 -112307 353754 317528 186688 171132 125102
14991 125102 319762 491630 152315 -80645 447188 389741 142488 75156 -121648 130168
14980 234022 338898 103487 225346 107420 231158 -68934 62590 -71656 387902 166797
14969 141199 294515 74791 172854 382665 231991 442129 189705 208076 356566 344305
14959 344305 103402 455134 442048 411597 -29146 358099 247201 -4457 279797 50857 398794
14948C98794l5422j45004K38119L5351D9605M27256j98376q337J49149j01981
14938C17316A19259J18694K94889j74438k3570H5930J95864o2418C847P19170
14928G23017H6258J61974M270J90572J0663L2577p9289j65681K43744j53094m5474
14917B86520K11949B06308r2630J21196K94800O1928a19325C00455Q3996L74012
14907G58463B59758P8584j0754p8551f9216g724C60548J35914j04187J8860j02778
14896C08357K4604O9507J39546k00765J67504B14457K88004j32597K44888j98004
14886D16748J21798A36156Q699K76381j25946J33812j09194r7337K51631J016
14876D75218a9454D86151k23131L04868n7735J80075l33563l0301p2398J34308
$$ plain form
14948 398794 363372 218368 456487 491838 49605 476861 278485 270148 419297 317316
14938 317316 119259 237953 532842 358404 334834 85930 281794 219376 3847 723017
14928 723017 86258 248232 252502 443074 453737 486314 407025 241344 485088 331994 286520
14917 286520 498469 206308 113678 234874 529674 591602 -119325 300455 384451 758463
14907 758463 259758 338342 327588 249037 -69216 -7724 360548 496462 392275 411135 308357
14896 308357 332961 402468 542014 341249 508753 214457 502461 369864 614752 416748
14886 416748 538546 136156 144855 421236 295290 429102 319908 222571 474202 475218
14876 475218 -19454 486151 263020 567888 510153 690228 356665 326364 253966 388274
14866C88274j40469O7363J72780J70953l15957M01489j57245j89790j25382J59210
14856D31226E5945N54422J40656k83643j08653J31706m5137j68054O3016F8467
14845F49332l3450B89362J88386N6275k01262K32720A57729m849K93995L4031
14835D80906R7787m2180j06140L6288j37327K72309Q4067C42142J89677m5366
14825D86453J36629o5743O5520B04946K37664M0253O4593J09035k41626K11436
14815F26301B50154K65351N1818P4416j45153q9433q877j96827M69737j8946k97306
14804C54934K09347j12810j48462L38943B98782K93085B86768O9087J10897R4620
14794E61372j8687J5174J81143G4925L43570K29846r4280K8763L9172r1617L3784
$$ plain form
14866 388274 247805 315168 487948 658901 342944 744433 587188 397398 272016 431226
14856 431226 55945 610367 751023 467380 358727 490433 445296 277242 340258 68467
14845 649332 615882 289362 477748 534023 332761 565481 157729 152880 446875 480906
14835 480906 578693 536513 430373 466661 329334 601643 685710 342142 531819 486453
14825 486453 623082 557339 622859 204946 442610 482863 547456 656491 414865 626301
14815 626301 250154 515505 567323 641739 496586 407153 398276 201449 671186 652240 354934
14804 354934 564281 451471 303009 641952 298782 591867 286768 355855 466752 561372
14794 561372 542685 557859 739002 74925 418495 648341 554061 582824 621996 530379 564163
14783E64163O2960m6972J7081R3044C18357J71887A54082M9502N07529k03978
14773E07135L05520k57641K4086R130l3094J87964n1312j33318K46433A86950
14762F69908p6361P0185J94865l38263J81946j57162r2047J97911M4851k44229
14752D51604K20650p6550K6477L127P4199k84119K08355K7515k2748m9830q7085
14741D91595N8698o4656K70767j56836K60383k92341K10371j98853J96220l04008
14731D71340P7716K1073N19308k91771J1067m03959L37538j43469m6130K81712
14721H34425J5818K43753m97835K01419L39106l14410p6982J88341O9112j89347
14711H13400l64107L89511N1085m4790j97371J31251Q9585j0884J7958p1298K27376
$$ plain form
14783 564163 627123 580151 597232 690276 318357 490244 154082 203584 711113 507135
14773 507135 812655 555014 579100 588230 555136 743100 691788 558470 804903 186950
14762 669908 593547 663732 858597 520334 702280 545118 453071 650982 695833 451604
14752 451604 672254 595704 622181 625308 699507 415388 623743 651258 628510 578680 491595
14741 491595 550293 485637 756404 599568 859951 567610 777981 579128 775348 471340
14731 471340 549056 570129 1089437 797666 808733 404774 742312 598843 552713 834425
14721 834425 850243 1093996 596161 797580 1136686 822276 745294 933635 1002747 813400
14711 813400 449293 838804 889889 845099 647728 778979 868564 857680 875638 804340 1031716
14700A031716M9734l71328j6382L14323Q1372J5652k49353j71013K82973P2785
14690A040479p6962K06148j78213o8459l76897K10626N73231o54318L76200k97827
14680G54008M21617J54858k61738J93780l22286L2354R8861o9375p9167O4849
14670I87761o4274K22335k34107L72410l40840J79783k90142M28819m1641j48928
14660A071176l7483K42356k92940J44954p4276L79256n86103K90035J75764j851
14650A310888J24141l77559K07417N9061k27360m9031K31634j01670K71379l42108
14640A106792M00222m03226Q5474l0574l8735K24590p1283J16743P3706l10966
14630A152743J07353L3166J50625l53657M12524k88954O9383o3098L06851k90506
$$ plain form
14700 1031716 1081450 710122 693740 1008063 1089435 1105087 855734 684721 967694 1040479
14690 1040479 963517 1169665 991452 922993 546096 756722 1329953 675635 1051835 754008
14680 754008 1175625 1330483 1068745 1262525 940239 972593 1071454 1002079 922912 987761
14670 987761 923487 1145822 911715 1284125 943285 1123068 832926 1261745 1220104 1071176
14660 1071176 1033693 1276049 983109 1128063 1053787 1433043 846940 1136975 1312739 1310888
14650 1310888 1435029 1057470 1264887 1323948 1096588 1047557 1279191 1177521 1448900 1106792
14640 1106792 1507014 1103788 1189262 1158688 1119953 1344543 1273260 1390003 1463709 1152743
14630 1152743 1260096 1293262 1443887 1090230 1502754 1213800 1283183 1220085 1526936 1236430
14620A236430P4300L31122k28494j48847L92926l52891j33019L46503k53751L76601
14610A640880l73285M45088K29357m55158J55093Q9941j13755K25825j06305o1264
14600A676417J75010j98676J02423K73157J14607j24511l36800j86472K71511
14591A766666J22002k7033k3729R8617r1873N6956J71522j11987K96047o41844
14581A615344M68162N4228J88012j73421k77129J30106J23777J58155J13338J26919
14571B527491m44628P5795O6135j52830L61033j12738K8974P7327J86398k69253
14561B343704P03915m74543L90540K07857l70474J14950M27283L36081K49890
14552C929203M16109Q28370J002908L209217N688591Q710532R738198N090054
$$ plain form
14620 1236430 1310730 1641852 1413358 1264511 1657437 1304546 1171527 1518030 1264279 1640880
14610 1640880 1267595 1712683 1942040 1486882 1641975 1731916 1618161 1843986 1737681 1676417
14600 1676417 1851427 1652751 1755174 2028331 2142938 2018427 1681627 1495155 1766666
14591 1766666 1888668 1861635 1837906 1936523 1844650 1901606 2073128 1961141 2257188 1615344
14581 1615344 2083506 2137734 2325746 2152325 1875196 2005302 2129079 2287234 2400572 2527491
14571 2527491 2082863 2158658 2224793 2071963 2432996 2320258 2349232 2426559 2612957 2343704
14561 2343704 3047619 2573076 2963616 3171473 2800999 2915949 3343232 3679313 3929203
14552 3929203 4345312 5173682 6176590 9385807 15074398 23784930 33523128 38613182
14544C8613182j7516509r770217n077267j937568r24127o37896m74062L32464
14536B608000m72260k22025K34126j25547Q1971j65707K51092L3929M40135n48838
14526B114876K33928j89857j1156k8032M44100m73200N45539p0455J19206n636
14516B679313r94o3260m1019K7195o4786K15790l1509J08575N9567j52449J05170
14505B841593j91172L07966O0509l1807J96384P349Q4240J11170l36889J08467
14495C157810K55415j91200j11260M16284q8180k83557O88196j67129r5580K13925
14485C794724q3211m4772K67181l84019M41678j27574j23072o6275M70486J357
14475D146503j77413l0339J09027K72761k48647N15731k47818J35467k94081N17576
$$ plain form
14544 38613182 21096673 11326456 6249189 4311621 3387494 2749598 2275536 2608000
14536 2608000 2135740 1913715 2147841 2022294 2104265 1938558 2189650 2223579 2663714 2114876
14526 2114876 2348804 2158947 2147791 2119759 2563859 2090659 2636198 2565743 2684949 2679313
14516 2679313 2678319 2615059 2574040 2601235 2536449 2752239 2720730 2829305 2888872 2736423 2841593
14505 2841593 2650421 2958387 3018896 2987089 3183473 3190822 3275062 3386232 3049343 3157810
14495 3157810 3413225 3222025 3110765 3527049 3438869 3155312 3843508 3676379 3580799 3794724
14485 3794724 3711513 3666741 3933922 3549903 3991581 3864007 3740935 3674660 4145146 4146503
14475 4146503 3969090 3938751 4047778 4320539 4071892 4587623 4339805 4475272 4181191 4698767
14465D698767Q4016k57956j97890M30959N6703l38733O69399o3713M283Q228J90087
14454E284150p7553R9258K21921k56505O6688L6045K15592l09523M68832k50848
14444E498057M04959Q1980p0888Q1624L44276m94472L41616L36815l12370N54409
14434F766006l52209L13247j24204K21992K53988K23340k34024K27667J78750
14425G474553J0249j69289Q23468l86188K79433j68615K03021j46801M86145P0310
14415H476286k06961J65877L97716l6088J56747k4884N90336l93372K45477M72166
14405I843300j65184J74895L1089M58682J16222J40699K02983L78012k7965n1686
14395A1101047L03915J90566O82538j87493O0734K68320M13909J14850J47842
$$ plain form
14465 4698767 4782783 4524827 4326937 4757896 4814599 4475866 5145265 5081552 5085835 5094063 5284150
14454 5284150 5206597 5305855 5527776 5271271 5337959 5374004 5589596 5280073 5748905 5498057
14444 5498057 5903016 5984996 5914108 5995732 6340008 5845536 6187152 6523967 6211597 6766006
14434 6766006 6413797 6727044 6602840 6824832 7078820 7302160 7068136 7295803 7474553
14425 7474553 7484802 7315513 8138981 7752793 8032226 7863611 8066632 7919831 8405976 8476286
14415 8476286 8269325 8435202 8832918 8796830 8953577 8928693 9519029 9125657 9371134 9843300
14405 9843300 9678116 9853011 9884100 10342782 10459004 10599703 10802686 11180698 11152733 11101047
14395 11101047 11404962 11595528 12278066 12090573 12151307 12419627 12833536 12948386 13096228
14386A3096228L23658Q1135L08303j40381M51809N13377J11487N83496L4601L27471
14376A5691184J18915P02801M75458q5323N36508j7481P50391N8688M17569N82426
14366A9231136L83390J98631O22043J48635K65989Q63541N54440P72757R8423
14357B3138985O01242M69991O16054M46054L82073O72133Q83636N35027R11252
14348B8656447P43517N20057P65204Q51819P88986Q09492J447610L91450R07223
14339C5881805J118757J055302J169175R58185R55858J472605J384367J429447
14331D5425501J039618J838428J117773J847307J565504J563051J587924J910737
14323E7895843K291744K129612K115141K183971K019959K821255K867885K543004
$$ plain form
14386 13096228 13419886 13501021 13809324 13668943 14120752 14634129 14745616 15329112 15363713 15691184
14376 15691184 15810099 16512900 16988358 16903035 17439543 17422062 18172453 18231141 18648710 19231136
14366 19231136 19614526 19813157 20435200 20583835 20849824 21713365 22267805 23040562 23138985
14357 23138985 23740227 24210218 24826272 25272326 25654399 26326532 27210168 27745195 28656447
14348 28656447 29399964 29920021 30685225 31537044 32326030 33135522 34583132 34974582 35881805
14339 35881805 37000562 38055864 39225039 40183224 41139082 42611687 43996054 45425501
14331 45425501 46465119 48303547 49421320 51268627 52834131 54397182 55985106 57895843
14323 57895843 60187587 62317199 64432340 66616311 68636270 71457525 74325410 76868414
14315G6868414K760743L151350L324186L591000L673599L929496M102294M127576
14307A05528658M490104M937464M841512N712323N404722O140820O486289O855449
14299A50397341P275526P538689P949979Q692066Q949112R684972J0045607J0823733
14291B21357025J1024293J1492231J2178210J2972587J3331307J3904493J4119071
14284C10379217J4649044J4890812J4806677J4705996J4557780J3912320J3464987
14277D11366833J2476833J0861370R313790O832204K247389n82369l452473R17604
14269D49981181L007800l569585o703355o722575p126985q697464j0108868j1871585
14261C98188564j2801843j3493074j3893179j5067529j5055754j4870441j4947181
$$ plain form
14315 76868414 79629157 82780507 86104693 89695693 93369292 97298788 101401082 105528658
14307 105528658 110018762 114956226 119797738 125510061 130914783 137055603 143541892 150397341
14299 150397341 157672867 165211556 173161535 181853601 190802713 200487685 210533292 221357025
14291 221357025 232381318 243873549 256051759 269024346 282355653 296260146 310379217
14284 310379217 325028261 339919073 354725750 369431746 383989526 397901846 411366833
14277 411366833 423843666 434705036 444018826 450851030 453098419 452516050 449063577 449981181
14269 449981181 452988981 449419396 442716041 435993466 428866481 420169017 410060149 398188564
14261 398188564 385386721 371893647 358000468 342932939 327877185 313006744 298059563
14254B98059563j3646765j3732091j3354250j2403124j1766949j1600163j0629135
14247B10927086j0268644j0015070r341028p916183q088460p879533p296949o857164
14239A43264055o103200o003747n591226n322628n347956m643060m643713m445344
14231A01163181l394443l687641m262485l327866l081542l222946l368554k483509
14223G4334195k779629k491678k535555j721364k145864k373071j703207k126012
14215E6457815j721252j525052j262393j667099j966042j545870j169034j086125
14207D4514948j025013q18388j606719q42629j402618r73262p07704r64471j065238
14198C5108906j063267r00240p62036r11190l03440r87074j120868o27215n09529
$$ plain form
14254 298059563 284412798 270680707 257326457 244923333 233156384 221556221 210927086
14247 210927086 200658442 190643372 181302344 173386161 165297701 157418168 150121219 143264055
14239 143264055 137160855 131157108 125565882 120243254 114895298 110252238 105608525 101163181
14231 101163181 97768738 94081097 89818612 86490746 83409204 80186258 76817704 74334195
14223 74334195 71554566 69062888 66527333 64805969 62660105 60287034 58583827 56457815
14215 56457815 54736563 53211511 51949118 50282019 48315977 46770107 45601073 44514948
14207 44514948 43489935 42671547 41064828 40222199 38819581 37846319 37138615 36174144 35108906
14198 35108906 34045639 33145399 32383363 31472173 31168733 30181659 29060791 28433576 27924047
14189B7924047n29652q90787l28765o39142r38866l23484m95396k78113r08423
14180B2591419k13078n36960m97111n81893l36822m74250J2312r62273M7243l36626
14170A8711961o20142L5337n18487q63083j41101n16089L00057j84084n57521
14161A5646848k86971n70761J20332l69158m18771l5342k12665l05656k22032
14152A3345824n1935j37220l49058m54817o6015K05456j45640o41784N1788p9874
14142A1676725j07080k36817n43763l1189o2416j20872j42854k50529o287m22364
14132I752554j97491N8308J17351k61525m52680j87976j25925n0204j12556j69284
14122H370572Q3135j06756p3521l75273M0157j56070k11268M30802o4992q30399
$$ plain form
14189 27924047 27394395 26503608 26174843 25535701 24596835 24273351 23777955 23499842 22591419
14180 22591419 22378341 21841381 21344270 20762377 20425555 19951305 19963617 19001344 19048587 18711961
14170 18711961 18091819 18127156 17608669 16745586 16604485 16088396 16388453 16204369 15646848
14161 15646848 15359877 14789116 14909448 14540290 14121519 14086177 13873512 13567856 13345824
14152 13345824 13293889 13156669 12807611 12352794 12286779 12492235 12346595 11704811 11756599 11676725
14142 11676725 11569645 11332828 10789065 10757876 10695460 10574588 10431734 10181205 10174918 9752554
14132 9752554 9555063 9613371 9730722 9469197 9016517 8828541 8702616 8652412 8539856 8370572
14122 8370572 8453707 8346951 8273430 7898157 7938314 7782244 7570976 8001778 7936786 7106387
14112G106387M14168L062n26001K52168q5616m79004L56537k7959j99160j47564
14102F667018k91860M4599k48001K77838k56707j34593m1650K01886j3833m8046
14092F156651q7750l22722J64650l36950m8497k41671R7658o6510K9022J53981
14082E497862j76193N6372l23324J68395k02970l09461J91506k19942j82664L98391
14072D897972m41573J58604r0153M47245l28263l77248K71029j81165k29284K53552
14062D380716n82695K00007L94404k0799k38372J09134j08802j34395k6511j18232
14052C854455j98280Q0812K58409m57345o7295R9001J95367l03138J65561k33362
14042C394185Q9624p7197o9773K7190Q5657k60003K54070j1085j65206p1118M0945
$$ plain form
14112 7106387 7520555 7523617 6997616 7249784 7164168 6685164 7041701 7013742 6814582 6667018
14102 6667018 6375158 6419757 6171756 6449594 6192887 6058294 6016644 6218530 6204697 6156651
14092 6156651 6068901 5746179 5910829 5573879 5525382 5283711 5381369 5314859 5343881 5497862
14082 5497862 5321669 5378041 5054717 5223112 5020142 4710681 4902187 4682245 4499581 4897972
14072 4897972 4456399 4615003 4524850 4972095 4643832 4266584 4537613 4356448 4127164 4380716
14062 4380716 3798021 3998028 4392432 4371633 4133261 4242395 4133593 3999198 3972687 3854455
14052 3854455 3656175 3736987 3995396 3538051 3470756 3569757 3765124 3461986 3627547 3394185
14042 3394185 3483809 3406612 3336839 3364029 3449686 3189683 3443753 3432668 3267462 3196344 3237289
14031C237289p2262q6081M90199K071m69651p0427Q9732k82145j39707K88036
14021B987054J0748k08371N3496J5953j6557K6012m57457o0798M23808k88399
14011B485489Q0274M7348j26201j08374K00320J17116l47971k9819P1217j30078
14001B259321J32198J69137l04421Q5929j07291J73361m6396J31453q2431J8766
13991B429626J34573O88101J945775M473497Q373039J0732333J0072163j4155153
13983B4693954j0609589m574005k462241j667587r14564l41603m58737k67330
13975C398298k73009J27865k86094j63197O0124l10443J294j82929J22066J656
13965B495631m7062m8138j27863J98131l21333J92265j94867K54246j71710l71488
$$ plain form
14031 3237289 3165027 3078946 3569145 3571216 3101565 3031138 3120870 2838725 2699018 2987054
14021 2987054 2997802 2789431 2842927 2858880 2842323 2868335 2410878 2350080 2773888 2485489
14011 2485489 2565763 2613111 2486910 2378536 2578856 2695972 2348001 2318182 2389399 2259321
14001 2259321 2391519 2560656 2256235 2342164 2234873 2408234 2361838 2493291 2410860 2429626
13991 2429626 2564199 3252300 5198075 9671572 18044611 28776944 38849107 24693954
13983 24693954 14084365 9510360 7048119 5380532 4465968 4124365 3665628 3398298
13975 3398298 3125289 3253154 2967060 2803863 2863987 2553544 2554838 2371909 2493975 2495631
13965 2495631 2448569 2400431 2272568 2470699 2149366 2341631 2146764 2401010 2229300 1857812
13955A857812N6699j53978M87730M9529m98557J42920L72513j25462m00168J4271
13945A803309K49717j26247K43766m10236R3835J30098n9485l18427J96486q1125
13935A721691J8572j35143K93480j79921p7949K60504k85575j12593J59732j41491
13925A521307k06994M71859m60329K60098L5805J70041m62908N2741n5808J80164
13915A505976K38838k26146J60865n006q649m47484J46156K9272J43791k92603
13905A245010M58464m32900Q4833j74414L88582J12598m52393K59598j26861R9452
13895A461969r0235J29541k94023R0105J07713j33539J1962k87860O55554j50503
13885A500684j61869j77650J66316p543j29137Q4976M99255o33093k09971L00393
$$ plain form
13955 1857812 1914511 1760533 2248263 2297792 1799235 1942155 2314668 2189206 1789038 1803309
13945 1803309 2053026 1926779 2170545 1760309 1854144 1984242 1924757 1606330 1802816 1721691
13935 1721691 1740263 1605120 1898600 1718679 1640730 1901234 1615659 1503066 1662798 1521307
13925 1521307 1314313 1786172 1325843 1585941 1621746 1791787 1328879 1381620 1325812 1505976
13915 1505976 1744814 1518668 1679533 1674527 1665878 1218394 1364550 1393822 1537613 1245010
13905 1245010 1703474 1270574 1355407 1180993 1569575 1682173 1229780 1489378 1362517 1461969
13895 1461969 1371734 1501275 1207252 1297357 1405070 1271531 1283493 995633 1651187 1500684
13885 1500684 1338815 1161165 1327481 1319938 1190801 1275777 1775032 1141939 931968 1232361
13875A232361n241J75421j11905j21537K59671J4361j9963l29446L72167F62242
13864A314691j707l24270j25380J91900n9767n850P0996j40962K65428j73747
13854A011332K1832R3518j00136J52723k492j06891k76215L69598j85649M05874
13844A383494k88328j30122k50065K16377M9440J10493j49339j97517N53897k48653
13834A049677L3108J39000k464j41256j88347k40178k0373K04528q7694L60998
13824A106999m5650r225r0146j08173J95577k11677j71253M60766m38926K09323
13814H97615J64339L6784k33028J16224K19149l66335J95173m67986L15026J86182
13804A063143L9472C47676L53098O2867L92731n44563M74039k83218Q3492P1664
$$ plain form
13875 1232361 1227120 1402541 1290636 1169099 1428770 1443131 1423168 1093722 1465889 662242
13864 1314691 1312984 988714 863334 1055234 995467 989617 1060613 919651 1185079 1011332
13854 1011332 1033164 1126682 1026546 1179269 1176777 1069886 793671 1163269 977620 1383494
13844 1383494 1095166 965044 714979 931356 980796 1091289 941950 744433 1298330 1049677
13834 1049677 1082785 1221785 1219321 1078065 889718 649540 629167 833695 746001 1106999
13824 1106999 1061349 1052124 961978 853805 1049382 837705 666452 1127218 688292 897615
13814 897615 1061954 1098738 865710 981934 1201083 834748 1029921 561935 876961 1063143
13804 1063143 1102615 347676 700774 763641 1156372 611809 1085848 802630 886122 957786
13794I57786P302j73519K43618k96058J61111C97909K75470M4448O9996K45926
13784A033749l67902j74473K70872L9514j97719K48632O099J07421p3238j05490
13774G87465k83922J18788p9124L64925L8503j79404K05572k95441o2988J76996
13764G91370j08747J0745p8486J00481J08787k68062j08306J42331j46677K92387
13754G35823J60538k76798L09226K2918l70163K63201r8519j27680J81378R9740
13744H99664D35704M11827M7696l47671J9380J97725J39324k00963k79350J00174
13734E23846j68104R7702j4356J32488j81753L62486k0963j04370N00012C88595
13723E92731J01345k02808M8085K4627k42988K59354J2106J63184k02498J86413
$$ plain form
13794 957786 965088 791569 1035187 739129 900240 397909 673379 717827 787823 1033749
13784 1033749 665847 491374 762246 801760 604041 852673 858772 966193 892955 787465
13774 787465 503543 622331 543207 908132 946635 767231 972803 677362 614374 791370
13764 791370 682623 693368 614882 715363 824150 556088 447782 590113 443436 735823
13754 735823 896361 619563 928789 951707 581544 844745 746226 618546 799924 899664
13744 899664 435704 847531 895227 547556 566936 764661 903985 703022 423672 523846
13734 523846 355742 453444 439088 571576 389823 752309 731346 626976 1126988 388595
13723 592731 694076 491268 539353 563980 320992 580346 592452 755636 553138 739551
13713G39551R0898k57019J69107q4706j63018P4436K39644k55150j4589K07025
13703G46179B61244P6661K90789J61532l18716J54245k20320J11250J19654n1532
13693E84807K39914j37509M5206r7934J46210j43073j89923O3600K21978G2030
13682H06749k72318n8694j12655o445M71318p8517P5047r2642C50751L32054B3229
13670D01735L09661C36598j1069K16613l9986q7675K89350k16692j1396o8695
13660D07048K86920k94866j64154K70590j81801K82579r0288j90514L25431B78494
13649B37308J42016j52288M58795C01906L10541K86002l74297j79168K56311j34431
13639D66864R7477j44275J25872m5726j07626J99104k2859M3296l0609K42247
$$ plain form
13713 739551 830449 573430 742537 657831 494813 569249 808893 553743 539154 746179
13703 746179 261244 337905 628694 790226 471510 625755 405435 516685 636339 584807
13693 584807 824721 687212 732418 634484 780694 637621 447698 511298 733276 72030
13682 806749 534431 475737 363082 356637 827955 749438 824485 731843 350751 682805 23229
13670 401735 711396 336598 325529 542142 502156 414481 703831 487139 475743 407048
13660 407048 693968 399102 234948 505538 323737 606316 516028 325514 650945 278494
13649 237308 379324 227036 685831 301906 612447 898449 524152 344984 601295 466864
13639 466864 564341 420066 545938 500212 392586 591690 568831 612127 581518 823765
13629H23765l45697L00415l77970J74922B59221J00706O6560J64633A66132J53826
13619C19958L20239k83224j78433O8514J80017A80562K18933r2989G0774L01932
13609C72706J02653J10782j72583A27427J26626K66040j13767R263j05985r8640
13599B10964J51781j78330J94176J2008L33736m1172k36868j68791k6484L17130
13589E68150A72782p0756L64232B16654J76914j40584K35375l6878A5593M25137
13579D40730j87921p1561J91038K54706j71841B9505M3637L85300K50239k16405
13569D92276J16605j34282P6384j69268K87592B83345K67189j00747B04771N1973
13559B56744J94690j81663P5869J79411j90597j39389m7702K27434A84836M1465
$$ plain form
13629 823765 478068 778483 400513 575435 259221 359927 426487 591120 166132 319958
13619 319958 640197 356973 178540 247054 427071 180562 399495 306506 70774 372706
13609 372706 475359 586141 413558 127427 254053 520093 406326 415589 309604 210964
13599 210964 362745 184415 378591 390599 724335 683163 446295 277504 251020 568150
13589 568150 172782 102026 466258 216654 393568 252984 488359 451481 15593 440730
13579 440730 252809 181248 372286 626992 455151 29505 73142 458442 708681 492276
13569 492276 608881 474599 550983 381715 669307 283345 550534 449787 204771 256744
13559 256744 451434 269771 345640 525051 334454 195065 147363 374797 184836 226301
13549B26301o881K01066Q6649a8844B62157O1744K87603k09893q1256Q0515A43908
13537C14893j29997O0801K44594B25224M6864A9675J61260F2410L38745j3258
13527C87897A50612J53807Q8165r6392P3457j48355M35154j95139j09470K10546
13517E62385k43857K26535k37379R4445M8488j41047A43255L26473m2738E9469
13506A69578n1025J54596A28782K55253J58974k44012a2014C87533I1625K85621
13496C77246k7332A40332K8785M4564K82780j80399A30177c11085D70165j33377
13486C36788m7465J64649j95111k8105N9769q4285j02909j5285K96074K6610K36320
13475F47050B45048j01069R9797K61657j62119j904A24255f2581E02638j13264
$$ plain form
13549 226301 219420 420486 507135 -18844 262157 323901 611504 401611 320355 400870 143908
13537 314893 184896 245697 490291 225224 272088 19675 180935 62410 401155 387897
13527 387897 150612 304419 392584 296192 369649 221294 656448 461309 351839 562385
13517 562385 318528 545063 307684 402129 450617 309570 143255 469728 426990 59469
13506 169578 118553 273149 128782 384035 543009 298997 -12014 387533 91625 377246
13496 377246 349914 140332 169117 213681 496461 316062 130177 -311085 470165 336788
13486 336788 289323 453972 258861 230756 290525 206240 103331 88046 384120 410730 647050
13475 647050 245048 143979 243776 505433 343314 341410 124255 -62581 502638 389374
13465C89374A57363R0152r6116P4422M8482g4624B61226J73664B06002r0001O989
13454A22990j5952J21240q8157J31738L9751J63202E8355M69698A70941H0400
13443A45076L16795N1523B37708R6686J10504E0386K70975a5734D88143K8333
13433E16476l8435B31635O885J4244C3058K24044a875E88720D9780L89334j90310
13422B48804l6601J76666A61754M27958B70092f9925b6375A55962J45101r6731
13412B04332K5131m663G4568L22353A67424j763F9104B8017K85357L0143a71111
13400A63947K19912a45470k684C95951A04567E860O37840h117A83618D9919N5457
13389A05376d8767l13427A48619J21040g7623B58436K12758B11139c4105A06836
$$ plain form
13465 389374 157363 247515 151399 225821 274303 -74624 261226 434890 206002 116001 122990
13454 122990 107038 228278 140121 271859 311610 474812 58355 528053 170941 80400
13443 145076 461871 513394 237708 334394 444898 50386 321361 -15734 488143 516476
13433 516476 478041 231635 238520 252764 33058 257102 -1875 588720 49780 439114 248804
13422 248804 212203 388869 161754 589712 270092 -69925 -26375 155962 301063 204332
13412 204332 229463 224800 74568 396921 167424 165661 69104 28017 313374 343517 -171111
13400 163947 383859 -145470 -148154 395951 104567 5860 643700 -8117 183618 49919 105376
13389 105376 -48767 -362194 148619 269659 -77623 258436 471194 211139 -34105 106836
13378g470r9701A34977F0053P6803K35903j73181J5215O6483O2039N6607A51069
13366h300G8705r596N12988E4397L33566J55348A23211L68882I1297K31008q2737
13355B39568J60350o0313A32397O6874l9612Q8541D7087K6290J11316M1933J41157
13344C67783J81999B18369L13996k46961O2202j44028a0752D03736e4705B27706
13333B94094A26344f0511o58B13051J18616A53152F2975K49611r1010D7578K15573
13322B63151l7904J66714M5431j10945J25177A96833O4862j09550k8966K54273
13312C77452C3074J20288O2471c53226E9671b460A65912n6328j7493a8625d378
13300A18918a55974A02469J31960K22605B09533h1022D03952b29695i1766C39205
$$ plain form
13378 -7470 -107171 134977 60053 136856 372759 199578 214793 281276 343315 399922 151069
13366 -8300 78705 69109 582097 54397 387963 543311 123211 492093 91297 322305 239568
13355 239568 399918 339605 132397 199271 159659 248200 47087 73377 184693 226626 367783
13344 367783 549782 218369 532365 285404 347606 203578 -10752 403736 -54705 227706
13333 294094 126344 -60511 -61169 213051 331667 153152 62975 312586 221576 47578 263151
13322 263151 225247 391961 437392 326447 451624 196833 261695 152145 123179 377452
13312 377452 33074 153362 215833 -353226 59671 -2460 165912 109584 92091 -18625 -4378
13300 118918 -155974 102469 234429 457034 209533 -81022 403952 -229695 -91766 339205
13289A16954J832A301e7985b3753B09131R6502n6827B069a72985e3362C02111
13277B90483j40218K50773A00185I111R4670J64756A17595A0845d3770b0508C36868
13265A3532J53323a64693A42877b9466A94002C9711J29014J86536D5211M3256
13255H8467l507a62542A46056l139K5918a73180E12096k38873a7866B91398D6489
13243B16684P8196a40741A57172K56682b32024A98864C0298K04213c795j67832
13233a71627A93307m3593J82004r7034A04335N298n3349K60367A14797J76034
13223B90831H3500B6180J86056K67679A24680J50337J71744k01452n302e9877
13212H1828L2861m89m5963f2796B36357J56357c090A86860l9130J4532J77119
$$ plain form
13289 116954 118786 1301 -57985 -23753 209131 305633 248806 2069 -172985 -53362 302111
13277 290483 150265 401038 100185 9111 103781 268537 117595 10845 -43770 -20508 336868
13265 13532 166855 -164693 142877 -29466 194002 39711 168725 355261 45211 88467
13255 88467 84960 -162542 146056 142917 168835 -173180 512096 273223 -17866 291398 46489
13243 216684 294880 -140741 157172 413854 -232024 198864 30298 234511 -3795 -171627
13233 -171627 193307 149714 331718 234684 104335 109633 56284 316651 114797 290831
13223 290831 83500 26180 212236 479915 124680 275017 446761 245309 240007 -59877
13212 81828 114689 114200 68237 -62796 236357 392714 -3090 186860 147730 162262 339381
13201C39381b2724j42593B00340b7140A24785L5035E8047c0591k98206B49221
13190i4398J5033A95512a07976F8411m864J09508k0841A8453J82565c9574I8218
13178B42104J30388G5255a23003b6217D35511b1251I9100J23809c13615D9719
13167C62557k9524c305D34724o1859a26855A92004C6035Q1695L767L9655h9500
13155A08593P8077n803a84151A91181J24118A30309N5199B8002J46594Q4282l7349
13144B21529j04285K1287K2346o5700K73858m2626c57764b7311A01204a1457j57470
13133a68927G8490a28045E2914L6592L0082m0261C0407K02054d5871j82485b6411
13121I4398h661A86843p0764A1401e5723A57339G4324N8616E4046L74684B0855
$$ plain form
13201 339381 -22724 -165317 200340 -27140 124785 159820 58047 -30591 -328797 249221
13190 -94398 -79365 195512 -107976 68411 63547 173055 152214 18453 201018 -39574 98218
13178 242104 372492 75255 -123003 -26217 435511 -21251 99100 222909 -313615 49719
13167 362557 333033 -3305 434724 372865 -126855 192004 36035 117730 121497 161152 -89500
13155 108593 186670 180867 -184151 191181 315299 130309 185508 28002 174596 258878 221529
13144 221529 117244 138531 160877 95177 369035 326409 -357764 -27311 101204 -11457 -168927
13133 -168927 78490 -128045 52914 89506 119588 79327 30407 232461 -45871 -228356 -26411
13121 94398 -8661 186843 116079 11401 -55723 157339 74324 132940 54046 428730 20855
13109f0211b6190A79407H477a45246G5052c116j84093C31166a51906G7683c4873
13097B24350b0641p7642B45818j7248B1228a16779E7058K59603c40602G5854a19406
13085B74868J16491d0789a9836F0018N6394J91547e2825N231C15293a36287L8521
13074i7766B66305B5655K07734j04227J20130A21771K09753A41772j2377n3830
13064G5565r061h536G8439c342C45138M1014c8811A74650E1421c8843H6880O5821
13052A52701C3118J59632q5642J09240C7802L3356P0645C0544N6814J33532j08602
13041A12288K96112A91570K6622K1611A08677L88542P7600G7532a4049A66877
13030A73989J22610b85850A07967M05693A63502a14827D71870A2969M17489e3260
$$ plain form
13109 -60211 -26190 179407 8477 -145246 75052 -3116 -187209 331166 -151906 77683 -34873
13097 224350 -20641 -98283 245818 228570 21228 -116779 57058 316661 -340602 75854 -119406
13085 274868 391359 -40789 -19836 60018 116412 307959 -52825 -47594 315293 -136287 -97766
13074 -97766 266305 25655 233389 129162 249292 121771 331524 141772 129395 75565
13064 75565 66504 -8536 78439 -3342 345138 386152 -38811 174650 51421 -38843 86880 152701
13052 152701 33118 192750 107108 216348 37802 71158 141803 30544 87358 220890 112288
13041 112288 408400 191570 218192 239803 108677 497219 574819 77532 -14049 166877
13030 173989 296599 -285850 107967 513660 163502 -114827 471870 12969 430458 -53260
13019C99233j02545a63657Q1058B84428q9330G5936b9524A85033f2712B99249
13008D4962Q4116D2913J61154I017b16920B54372a84281C86911h6791H1543B3224
12996D1100K32522G9851a17073E7951J82292c1286A45269n835Q972O7109b05497
12984H9722g5087c5803C981J19338E1006J21867a18888B1895K1745J97043K13252
12973D53935c8954C12137A0656a57603H1927a00143o7400j22418B81017j18354
12963A62663M85692C18112o4085a01084B6617d5045H8771K9899J56208i1262m1373
12952a32635C19988o1307D8000O0541b77604B01926p2008J66556B478M80887E9825
12940B0035N1278N0693b6780F8949J53028j10077j994J99644i7306a6752A21142
$$ plain form
13019 399233 296688 -163657 -82599 284428 195098 75936 -29524 185033 -62712 299249
13008 44962 129078 42913 204067 9017 -216920 254372 -184281 386911 -86791 81543 23224
12996 41100 273622 79851 -117073 57951 240243 -31286 145269 139434 148406 215515 -205497
12984 89722 -75087 -35803 3981 123319 51006 172873 -118888 21895 43640 240683 453935
12973 453935 -38954 312137 10656 -157603 81927 -100143 -167543 -289961 281017 162663
12963 162663 648355 318112 254027 -101084 26617 -45045 88771 118670 274878 -91262 -132635
12952 -132635 319988 258681 48000 108541 -277604 201926 129918 296474 2478 483365 59825
12940 20035 71313 122006 -26780 68949 221977 111900 109906 309550 -97306 -16752 121142
12928d3497A29798E5591M816O7651b22712B41469A19420A1902K03213D9043b868
12916A041J24839j8547b7709q5249d9244F1954A6598a7421l24748c4909A1494
12904D2495J2191g1107A70628d9474A65473e2344n5343j10354M8118p8292A72039
12892B36137c05530B71299K3828j03600K3047F2718K83443J09238D9296c7615
12881B34027F3774O1728E7338d4120n7335A58487M5079F4937e9125j2910B42428
12869C50735a1645j63964I5572g2175C7240M3415A9528J58071q4249f4106j89991
12858b54097P8330E3913J56256I3784J31426H1084d2371q2253D11J04885C0281
12846a21658j42030J10449b5205A67234A9732K53553H7607D275J34119K09718
$$ plain form
12928 -43497 129798 55591 60407 128058 -222712 241469 119420 11902 215115 49043 -2868
12916 1041 125880 107333 -27709 -112958 -49244 61954 16598 -17421 -342169 -34909 11494
12904 42495 54686 -71107 170628 -49474 165473 -52344 -107687 -218041 -169923 -248215 172039
12892 236137 -305530 271299 295127 191527 214574 62718 346161 455399 49296 -37615
12881 234027 63774 125502 57338 -44120 -101455 158487 203566 64937 -59125 -72035 242428
12869 350735 -11645 -175609 95572 -72175 37240 80655 19528 177599 93350 -64106 -254097
12858 -254097 -175767 53913 210169 93784 225210 81084 -42371 -124624 411 105296 30281
12846 -121658 -263688 -153239 -25205 167234 19732 273285 87607 4275 138394 348112
12836C48112P748g4618B01212G6708J47715F9248J57267i6241B7249J38047A519
12824A43688b6207D2555P3565J04565a26608j27869A84751M3315N9925j39281
12814A48710J233J20173a30460L5693j07370i9678B99374a08114j40751H6895
12803a8207k32611D152N99507f3147A34718b25821A40343a69860C6146d1692H0859
12791I6761B9322K37041b55156J08076l3917E866M13J6556J25724J6424a7703
12779b25701i6483D0008L03662j66504b74163e471B9873M4140J82024L6427h6248
12767A86155a08953A50722c016B01226b21511B20761a12536C13886l5843b86426
12756b31668E02684a16057J1818I0565l9676b37966A223L7400J29833c5090D833
$$ plain form
12836 348112 355860 -74618 201212 76708 224423 69248 226515 -96241 27249 165296 1519
12824 143688 -26207 42555 116120 220685 -126608 -254477 184751 228066 287991 148710
12814 148710 149943 270116 -130460 -94767 -202137 -99678 299374 -108114 -248865 86895
12803 -18207 -250818 4152 603659 -63147 134718 -225821 140343 -169860 36146 -41692 80859
12791 96761 29322 266363 -255156 -147080 -180997 5866 6279 22835 148559 164983 -17703
12779 -225701 -96483 40008 343670 177166 -274163 -5471 29873 74013 256037 292464 -86248
12767 186155 -108953 150722 -3016 201226 -221511 220761 -112536 313886 278043 -286426
12756 -231668 502684 -116057 -104239 90565 50889 -237966 1223 38623 168456 -35090 4833
12744I6416a03062C6875L3423r257M0211b9059F3328M72919j21486j36077J18587
12733C97271j98203E4428J23941R13q7144J21203A02427a22709A36124f4045A51837
12721h8732C59909j10134b41710e633D7054i4258G3318P7351m6880O6549A5604
12709E5202M81K9771d5806j64484C61011b9903j08061A95841F5786J55661A1609
12697A67111E6520K05691A7625K04477a2868k05549A37856b0063B83880a36629
12686A12168m1202J66956C0271e8611j88054a03195A39947h786D81053A10637
12675F2403J26751a39777a0498A28898m5116R5816b91504a1767B69244r2977O620
12664A82887a34323D8561b2476j66334r6106J28659B88321i7981B0136O4573C5475
$$ plain form
12744 96416 -103062 36875 70298 61041 101252 -29059 63328 536247 414761 278684 397271
12733 397271 199068 54428 178369 179282 92138 213341 102427 -122709 136124 -64045 151837
12721 -88732 359909 249775 -241710 -5633 47054 -94258 73318 150669 103789 170338 15604
12709 55202 55683 85454 -45806 -210290 361011 -29903 -137964 195841 65786 221447 11609
12697 167111 56520 262211 17625 222102 -12868 -218417 137856 -20063 283880 -136629
12686 112168 70966 237922 30271 -58611 -246665 -103195 139947 -8786 481053 110637
12675 62403 189154 -139777 -10498 128898 83782 179598 -291504 -11767 269244 176267 182887
12664 182887 -134323 48561 -22476 -188810 -284916 -156257 288321 -97981 20136 84709 35475
12652c8474o6556I9509O528K08139P3149A05464b10173G1467D774i471A23753
12640b7503j25569L4445C98656M670d18060B0247J85141m686o8166n8053l4907
12629C9576h0547I8150K44248q298j30904r7393J87791j38138k0322J12989O0463
12618C08586I1178N3178k5354B7684b71720A42318f3595n936A89023j365J96830
12607C84488D6970g4432A81385B9327K23186m2131E6856e3721A45174J95238G2528
12595a41221n0814d2875E2740A9441J32783m4601j3373D3093K6255b52994G3067
12583B8077Q8664h8814A01590c6980j2028o3020B15515a29434C5030a00736D07728
12571C20577a8511j65257r4423C34186F390J29527K2579n9963J12542C6168a59285
$$ plain form
12652 -38474 -105030 99509 106037 314176 387325 105464 -210173 71467 4774 -9471 123753
12640 -27503 -153072 -118627 398656 403326 -418060 20247 205388 200702 132536 74483 39576
12629 39576 -80547 98150 342398 334100 203196 105803 293594 155456 135134 248123 308586
12618 308586 91178 144356 119002 27684 -271720 142318 -63595 -69531 189023 187658 384488
12607 384488 46970 -74432 181385 29327 252513 210382 56856 -53721 145174 340412 72528
12595 -141221 -192035 -42875 52740 19441 152224 107623 94250 43093 69348 -252994 73067
12583 28077 116741 -88814 101590 -36980 -49008 -112028 215515 -129434 35030 -100736 407728
12571 320577 -18511 -183768 -278191 334186 6390 135917 158496 98533 211075 36168 -159285
12559a02745b454B84115M2501g0071l42756K05529i1055a0677J486D02047b4419
12547g0317j2415p9640I683J83963a8155E4013g8824A93377p6513B0171J00993
12536A21164b61504a6567A38575b82925B09069K6465b60842M110B9908J37741
12526A67649C3153b4940j29943I9787j6943E464K48982A4788a7009j05667F5712
12514A43831a46071B795J16384N8500a23129b4784A88102i455j54070A56507N082
12503A61589J27750d338B72418A21062c02469G8462h943A22084E9253c0159C1924
12491D9085J53834D726J44384f2947j01219A21783i6126A25946E912a02136D13782
12479E2088J7460b6099B25371b22320h4906B05022o4928k4683a05941O589B71568
$$ plain form
12559 -102745 -2454 284115 326616 -70071 -412827 -207298 -91055 -10677 -9191 402047 -24419
12547 -70317 -82732 -162372 9683 193646 -18155 54013 -78824 193377 116864 20171 121164
12536 121164 -261504 -16567 138575 -282925 209069 235534 -260842 -256732 29908 167649
12526 167649 33153 -24940 -154883 99787 82844 5464 254446 14788 -17009 -122676 65712
12514 143831 -146071 2795 119179 177679 -123129 -24784 188102 -9455 -163525 156507 161589
12503 161589 289339 -4338 272418 121062 -302469 78462 -8943 122084 59253 -30159 31924
12491 49085 202919 4726 149110 -62947 -164166 121783 -96126 125946 5912 -102136 413782
12479 52088 69548 -26099 225371 -222320 -84906 205022 140094 115411 -105941 -99352 271568
12467e3391B74417B2673P4707a92569k324B91240c77343D8405a97464J4459C67847
12455c1981j37790A87588a42952J4170M4888B09792A9535K85442b924l0806j79559
12444b13289A24083D2799n229a17442F5894M3357f8850C89290b51659H1452J56658
12433B38110R3486f2203b0916j64035H5544A8312a07110o2687j61943a13719B73034
12421B22499K47181b456r0071q2892B03649b2776A97901l7426e5659j485C5659
12409b1003j33704j88824C3073J51033D3642J23558b75030A78956D389R1925K5424
12398A21738K58873a94315C37209h8429B6263a88130f3107H4840c5515J2975l13002
12387c35542b6223L065k17777d3180J2658k49932A17993J53873A15021a77657
$$ plain form
12467 -53391 274417 22673 97380 -192569 -194893 291240 -377343 48405 -197464 -183005 367847
12455 -31981 -169771 187588 -142952 -128782 -83894 209792 19535 304977 -2924 -33730 -213289
12444 -213289 124083 42799 37570 -117442 65894 109251 -68850 389290 -251659 81452 238110
12433 238110 331596 -62203 -20916 -184951 85544 18312 -107110 -169797 -331740 -113719 273034
12421 222499 469680 -2456 -92527 -175419 203649 -22776 197901 160475 -55659 -57144 35659
12409 -21003 -154707 -343531 33073 184106 43642 167200 -275030 178956 4389 96314 121738
12398 121738 380611 -194315 337209 -88429 26263 -188130 -63107 84840 -35515 -22540 -335542
12387 -335542 -26223 -23158 -240935 -43180 -30522 -280454 117993 271866 115021 -177657
12376I1827b79730D35529P49i4874B0771c1921A58290m3132b04403f5673n2549
12365a18222o1616F6763c5720A59227J39122J38922a04270M2181n3940J8979A40802
12353a30950A12431J17043g1063A93596H5764c19985J18884A03035a86406A15207
12342A81959b24682G5917K08423F4768b75327A87018B314J20069J72220b0951
12331A11105h0124L6433l8391K7377l21743M5690Q6194B2487O3115J35537n9832
12320A61307M060D9087B3392J35783a02723d9778C04451A20112L7858a97086a8406
12308c6274A55198a78365A54387N7067B7523b4055r4545b9653C04715O1560A12273
12296a60857A36431J27242j27491K6230n9684e9005B59630D7329i845j35714n7414
$$ plain form
12376 91827 -279730 435529 436278 -94874 20771 -31921 158290 115158 -204403 -65673 -118222
12365 -118222 -179838 66763 -35720 159227 298349 437271 -104270 -62089 -116029 -97050 140802
12353 -130950 112431 229474 -71063 193596 85764 -319985 -201101 103035 -186406 115207
12342 181959 -224682 75917 284340 64768 -275327 187018 2314 122383 294603 -20951
12331 111105 -80124 -43691 -82082 -54705 -376448 -330758 -244564 22487 85602 221139 161307
12320 161307 165367 49087 23392 159175 -102723 -49778 304451 120112 157970 -197086 -18406
12308 -36274 155198 -178365 154387 211454 27523 -24055 -118600 -29653 304715 366275 112273
12296 -160857 136431 263673 136182 162412 102728 -59005 259630 47329 -9845 -145559 -202973
12285b02973A24960a72300B46411K6921a21827o3931A27650F2975c5572A0660
12274b1371G8738K36756e0530B12690d4577F3781a33498A99074E4121K15298b4883
12262A57319a20877f932I1398c15105d6428A99567L05204A95395G5031O4311a29397
12250A0630M05759c7032e057A90915b20541I1461O4672O5022n8709f9011B42263
12238A38966N0951p082I0007a17575B7431P9517L4175q428K0046a53296K4630
12227a28666A80037J0360E2594j6053L07698l4006A26695J70323P2276p5329O3628
12216C57593j53014R5502F9191O0033K91238e0563J4156m6934C11608I991J72682
12205A82673o1009J9506d5467j45703F7561K33966k1303j12531m7389m9522K09072
$$ plain form
12285 -202973 124960 -172300 246411 273332 -121827 -185758 127650 62975 -35572 10660
12274 -21371 78738 315494 -50530 212690 -44577 63781 -133498 199074 54121 269419 -24883
12262 157319 -120877 -6932 91398 -315105 -46428 199567 504771 195395 75031 139342 -129397
12250 10630 416389 -37032 -5057 190915 -220541 91461 156133 221155 162446 -69011 242263
12238 138966 189917 182835 90007 -117575 27431 106948 141123 132695 152741 -153296 -128666
12227 -128666 180037 190397 52594 36541 344239 310233 126695 297018 369294 293965 357593
12216 357593 204579 300081 69191 129224 420462 -50563 -36407 -83341 311608 9991 182673
12205 182673 121664 141170 -45467 -191170 67561 301527 280224 167693 120304 70782 279854
12194B79854j08933J86522H9979L7404a6927A00139J3889a75072f7462F9857J0324
12183H0181k787K79838A60928N429E0545M84925A61218K1732L92718k80317L4263
12172C29614b3608B99299B816b06687A56797J08370J17725A35717k594C7998K35068
12161B73066A16530K37076b4006l16964a02032B23425J0767A13794O3130a2747
12150A25797H595R0332L68436A10437d9212m2810A78456g7828F0531R0928c3190
12138a24719m4593A44900c54154J33303G3510J75674a73000C70232a45949K4281
12128a21668b6265a1715h77k24163J02278B80732G8968J18490r4954e6427k01639
12117b58066H4242L5334J44130b26205B1913a25207N1164j95869O7176m0289D7372
$$ plain form
12194 279854 170921 357443 89979 127383 -16927 100139 114028 -175072 -67462 69857 80181
12183 80181 77394 357232 160928 166357 50545 535470 161218 182950 575668 295351 329614
12172 329614 -23608 299299 2816 -206687 156797 265167 382892 135717 133123 37998 273066
12161 273066 116530 353606 -24006 -340970 -102032 223425 234192 113794 176924 -12747
12150 125797 8595 98927 467363 110437 -49212 -92022 178456 -77828 60531 151459 -33190
12138 -124719 -169312 144900 -354154 -220851 73510 249184 -173000 370232 -145949 -121668
12128 -121668 -26265 -11715 -877 -225040 -122762 280732 78968 197458 102504 -56427 -258066
12117 -258066 84242 119576 263706 -226205 21913 -125207 -74043 -269912 -202736 -243025 47372
12105A69650a306B36420a26201p1708B495J74628h822A43944a0139G1871a85977
12093a49172B4900Q900q815a50698c0499F6069J23168J7488r5888k8206B6093
12081a69869O3675j59085I5998g1972B48649b68133B43652G5324P0867N9100G4555
12069h5098J9402r820B21493b20499A38437a8330q4261M8366l70984a66335A09961
12057C30752d1817H9746b82216h8042m9578C59202g2695D6342O9912N0096c53579
12045a76235A40481J75784e0472m0293I8676b16894j4550A09366I269g6294b375
12033B30744c03870R1075f6587F9621J79729a47175A38379R6453A17000K65054
12023C82054P0992N42149m23915A70861F2093c1642o1179B2140b12964R1612A78523
$$ plain form
12105 169650 -1306 236420 -126201 -197909 2495 177123 -8822 143944 -10139 71871 -185977
12093 -149172 24900 33800 24985 -150698 -30499 66069 189237 206725 110837 82631 26093
12081 -169869 -106194 -265279 95998 -71972 248649 -268133 243652 75324 146191 205291 74555
12069 -85098 -65696 -75516 221493 -220499 138437 -18330 -102591 -54225 -425209 -166335 109961
12057 330752 -41817 89746 -282216 -88042 -137620 359202 -72695 46342 116254 166350 -353579
12045 -176235 140481 316265 -50472 -90765 98676 -216894 -231444 109366 9269 -76294 -2375
12033 230744 -303870 -212795 -66587 69621 249350 -147175 138379 234832 117000 382054
12023 382054 453046 995195 571280 170861 62093 -31642 -92821 22140 -212964 -121352 178523
12011D8561J53835B7413K58644D3837E268N7955O7390a25202C58511i5675l0410
12000a26085A53702a3582E7320A3595a04172j12478d9427n9003a2134j1857H2902
11988A14717c34556d4695r219r2002j7074A41143c9554A95339i9517b7621m8458
11977g6079D1937P1711M4347j8701e5265K90j01351J5705k04181f8561C4121J85663
11965B19784K21222K4840A57507g8494L8037k24186n7531A03171D0636a0474k42211
11954b52685C39N6440a03210B12093c7411I198a28104a9129A97485J65648J94500
11943E57633a00n6551B26962b246D9824J59737P1179n2882a4017j58927r6139
11932b69083a6387j15623j01611L3827l2989A90737b99463g8148q107I8690b4875
$$ plain form
12011 48561 202396 27413 286057 43837 5268 63223 130613 -125202 358511 -95675 -126085
12000 -126085 153702 -13582 57320 13595 -104172 -216650 -49427 -108430 -12134 -23991 82902
11988 114717 -334556 -44695 -53914 -145916 -162990 141143 -39554 195339 -99517 -27621 -76079
11977 -76079 41937 113648 157995 139294 -55265 -54975 -156326 -140621 -344802 -68561 34121 219784
11965 219784 441006 465846 157507 -78494 -40457 -264643 -322174 103171 40636 -10474 -252685
11954 -252685 339 56779 -103210 212093 -37411 9198 -128104 -19129 197485 363133 557633
11943 557633 -100 -56651 226962 -2246 49824 209561 280740 227858 -14017 -172944 -269083
11932 -269083 -16387 -132010 -233621 -199794 -232783 190737 -299463 -78148 -86255 98690 -24875
11920b46456a04165k1005G2332J30994G4563J2846K70033a35296d0643B8266B629
11908d02003e0304G8368c3358H0817a25124a670B10348r1091b548k35288a18410
11896a80795I5323b07299B89363H7187J6733c1319m4056m1349A18404n6742a21310
11884i2424j72243A98585a35533a6495k09524k0137B95877o0519b01492h3217
11873a2402A03692b37493c5203j2349C78771D4553K15353d9386J1304E5055K20852
11862B75907J369a42314g0842k02430L4509I0192K09953G527M38749a71793c092
11850c7767B50223q5700b15997Q2301m4417H9861J02796g6730p552B58085e2020
11838H0111c9570B61827E0947J66251a37381j06803j36196A16735h9775D506d3099
$$ plain form
11920 -246456 -104165 -125170 72332 203326 74563 87409 357442 -135296 -40643 28266 2629
11908 -402003 -50304 78368 -33358 80817 -125124 -1670 210348 119257 -2548 -237836 -118410
11896 -180795 95323 -207299 289363 87187 103920 -31319 -75375 -116724 118404 61662 -121310
11884 -92424 -264667 198585 -135533 -16495 -226019 -246156 295877 235358 -201492 -83217
11873 -12402 103692 -237493 -35203 -47552 378771 44553 259906 -49386 -38082 55055 275907
11862 275907 277276 -142314 -70842 -273272 -238763 90192 300145 7527 446276 -171793 -3092
11850 -37767 250223 164523 -215997 -133696 -178113 89861 192657 -76730 -84282 258085 -52020
11838 80111 -39570 261827 50947 217198 -137381 -244184 -380380 116735 -89775 4506 -43099
11826a1296I7206a25429b9751j03301A19012e4957J3496l9803r1485g3421j20120
11815a93541j25145F9805j256a69363A48847d21270E694f1994k7352k9790h081
11803a95167E2009p964h2730b2599M198o0783F5416a52509B42654b99033j98450
11792d97483b15116C270e8518A53501m1238D5977a04890B6314j2805a40439F9944
11780B4224L60381a52783m3667c1774j64337I3492k9468a17946A4574M9187b88408
11768I9697e889D7164L251K67786k0094b9479G3264b00701B6811g6172k33571
11757c09743J10363G418P9672a67093e965C75124I4646J01439L4912k6440b61036
11745A7828a35443c6719k7250A76663a74277C66915j29493b19841K4304I321J04990
$$ plain form
11826 -11296 97206 -125429 -29751 -133052 119012 -54957 -41461 -81264 -172749 -73421 -193541
11815 -193541 -318686 69805 68549 -169363 148847 -421270 5694 -61994 -89346 -119136 -8081
11803 -195167 52009 44045 -82730 -22599 -18401 -79184 65416 -152509 242654 -299033 -497483
11792 -497483 -215116 3270 -58518 153501 112263 45977 -104890 26314 13509 -140439 69944
11780 24224 384605 -152783 -196450 -31774 -196111 93492 64024 -117946 14574 63761 -288408
11768 99697 -5889 47164 50415 318201 298107 -29479 73264 -200701 26811 -76172 -309743
11757 -309743 -199380 7418 87090 -167093 -5965 375124 94646 196085 230997 204557 -261036
11745 17828 -135443 -36719 -63969 176663 -174277 366915 237422 -219841 -195537 9321 114311
11734A14311d2279B89915f0527o2652A7749P7812B8049a35294A61233i122A09694
11722g3498H4709K5027J0215g8458B22205K3327a35157L2017J1249A08224c59529
11710I9830C6913I599J15780a63774B34237d5285A34413M3391a35257M6741D99274
11698B11992a55445g3720C31956e8488J4855K0581k79675A79770p7892C5288a52873
11686C9553a32022D77802A03673K57611b24164i3476E8507K06400F1172O2938
11676A24110b9623j22332H3429a72906A23211a14301A73294a45743f3350H3534
11665a13369j9958A25061o0385a43511j03577h5561A287a5000l6890o3377c3908
11653A55571a11118j96010B3075H03M3381J35108p2488K31063a57486j47570J10002
$$ plain form
11734 114311 -42279 289915 -60527 -123179 17749 95561 28049 -135294 161233 -9122 109694
11722 -73498 84709 109736 119951 -78458 222205 245532 -135157 -103140 -91891 108224 -359529
11710 99830 36913 9599 125379 -163774 234237 -45285 134413 177804 -135257 -88516 499274
11698 211992 -155445 -73720 331956 -58488 -43633 -23052 -302727 179770 101878 35288 -152873
11686 39553 -132022 477802 103673 361284 -224164 -93476 58507 264907 61172 124110
11676 124110 -29623 -151955 83429 -172906 123211 -114301 173294 -145743 -63350 83534
11665 -113369 -133327 125061 64676 -143511 -247088 -85561 1287 -15000 -51890 -115267 -33908
11653 155571 -111118 -307128 23075 803 44184 179292 106804 337867 -157486 -305056 -195054
11642a95054C06569a29622D2650a16057M553n9628e7291m2631d2574A14750g1880
11630i8244A69384a98708j0325n4074C17885J217a06563d302k56275A51382C4025
11618C9531e2629n2306K516A7634K26061D8063L9587J05385c7125G316L72618
11607C79934A70676D6892K60829r4752O032c22360e1761k6271e344D75141b92267
11595h2166A72946c21174G4169J87291G9835M1008M3447b59558A07842L90746
11585D98588a75694I1151c0542j05258e5598A51744j2027a02874h415B22718e7343
11573A39198Q3168g3638F8722K31542A0161Q4475J12961J12466A15312h4477A72116
11561B22212b21345D5298k2421c58558A86781b16337C07281h2624D6242J45727
$$ plain form
11642 -195054 306569 -129622 42650 -116057 -111504 -171132 -57291 -99922 -42574 114750 -71880
11630 -98244 169384 -198708 -209033 -263107 317885 319102 -106563 -4302 -260577 151382 34025
11618 39531 -52629 -104935 -102419 17634 243695 48063 87650 193035 -37125 7316 379934
11607 379934 170676 46892 307721 212969 219001 -322360 -51761 -78032 -5344 475141 -292267
11595 -82166 172946 -321174 74169 261460 79835 120843 164290 -259558 107842 498588
11585 498588 -175694 91151 -30542 -135800 -55598 151744 139717 -102874 -8415 222718 -57343
11573 139198 222366 -73638 68722 300264 10161 94636 207597 320063 115312 -84477 172116
11561 222212 -221345 45298 22877 -358558 186781 -216337 307281 -82624 46242 191969
11551A91969F2219f551G3025O5416a07080A71615c89952G8523M62767A17497A0699
11539c38562e5066K2339A60481g2512r5579D68262a6786B24273a50090B28703
11528B62484A20210B4453L1591J60010J29623j05878b64716C9930Q0568m5585
11518G4913J34845b43634A75029N9287C6252J25867b35873g8352C2244M3718a25053
11506H1915a53628f5299B05596b1367D28439Q3368B10267i551I3688Q2864a0956
11494A95206F5460h0317F9680H238h6218d169A96652K463M2289K1795j16994L4578
11482A80783n168c24k46431J05755A49270b9909B78912a34133P20j2555H1029
11470I5831J38204J44142j70730K58562a06308K527E9509K11642j00682a51562
$$ plain form
11551 191969 62219 -6551 73025 138441 -107080 171615 -389952 78523 541290 117497 10699
11539 -338562 -55066 -32727 160481 -72512 -168091 468262 -16786 224273 -150090 228703
11528 262484 120210 24453 56044 216054 345677 239799 -264716 39930 120498 74913
11518 74913 209758 -243634 175029 234316 36252 162119 -235873 -78352 32244 75962 -125053
11506 81915 -153628 -65299 205596 -21367 428439 511807 210267 -9551 93688 176552 -10956
11494 195206 65460 -80317 69680 8238 -86218 -4169 196652 199115 241404 263199 146205 180783
11482 180783 175615 -324 -246755 -141000 149270 -29909 278912 -134133 -133413 -145968 81029
11470 95831 234035 378177 207447 466009 -106308 -103781 59509 271151 170469 -151562
11459A65972q0813N6570K44890I5302g2320C92958B8265K30281d146A73672e5821
11447C03257M86J6578g2778k5093M3673I8996J60905n8141E0391J33957D5565
11435a06392j53450A11333O9509b57357B2977N9335h5930A8700b3872C40178H7167
11423D367i9779d3782A24794J31661A0187d0770A64566a68139F9000o635R7966
11412A60331E6779h7930c4223A70795G6236O3155g2404C3670J28984L5537D8144
11400B20022J2365a95094M7485B6292j2070J16747k0649b82688B61056A18620
11389A4783J46518a42496H9906e9029I7869c1955j4568B5871a91799A0873a54619
11377a21473j48379o3333E1949J12927f1010D51833j98609g6782j427j58063E620
$$ plain form
11459 165972 85159 141729 386619 95302 -72320 392958 28265 258546 -4146 173672 -55821
11447 303257 303743 320321 -72778 -97871 -54198 98996 259901 201760 50391 184348 45565
11435 -106392 -259842 111333 180842 -257357 22977 82312 -85930 18700 -23872 340178 87167
11423 4367 -99779 -43782 124794 256455 10187 -40770 164566 -168139 69000 62365 160331
11412 160331 56779 -87930 -34223 170795 76236 139391 -72404 33670 162654 198191 48144
11400 220022 232387 -195094 -147609 26292 14222 130969 110320 -282688 261056 118620
11389 14783 161301 -142496 89906 -59029 97869 -31955 -46523 25871 -191799 10873 -154619
11377 -121473 -269852 -333185 51949 164876 -61010 451833 253224 -76782 -78209 -236272 5620
11365C38795g1992E0590h5460q2820o5272J8940q874n0247f9773j02862l6568
11354b09203n5674R1227D59418j73292H6252K5687F557b57A45054i7050K7037
11343g0013p279D68428a34702A83576h6795A94838a82284a390k59053Gb68778
11331E7384a27785K4311j79764a24659J4832a2140A08593g5712E7535M564i1906
11319h6512B49915B5203a25152k4297F3768j4243j5096b37121A91094F295M4060
11308E0355a25518e3436A24047b69241C8459J4718O5144l042b1310L790j26917
11297a44437j8485A39285a72068H7726B9223c18589R5753P2680b5689A85763b46163
11285I131J98894G060d82j28796k92395A20602E7375a42308H2428a93275O8203
$$ plain form
11365 338795 -71992 50590 -85460 -168280 -233552 -214612 -223486 -273733 -69773 -172635 -209203
11354 -209203 -264877 -173650 459418 286126 86252 111939 6557 -257 145054 -97050 -70013
11343 -70013 -77292 468428 -134702 183576 -86795 194838 -182284 -1390 -260443 7 -268778
11331 57384 -127785 -103474 -283238 -124659 -109827 -12140 108593 -75712 57535 62099 -91906
11319 -86512 249915 25203 -125152 -149449 63768 49525 34429 -237121 191094 6295 50355
11308 50355 -125518 -53436 124047 -269241 38459 53177 118321 115279 -21310 -17520 -144437
11297 -144437 -162922 139285 -172068 87726 29223 -318589 -222836 -150156 -25689 185763 -246163
11285 9131 208025 7060 -482 -129278 -421673 120602 57375 -142308 82428 -193275 -125072
11274a25072I1429J05473b67067c0428J1868f317G6068k8726J42577b9322I199
11262h8087j34435b5833k16A85458a64943q0027c690A58611L0470i7144q6039
11251a83183C24838e4760n2014C3761e1586E9480i1335A09794L50615c14111A20542
11239c57440A241K22402c7322l0109A49544C1252b43948C83590c36417J27887
11229b08530f2647a5454A1640J4000b70487A96202a41453e8021j60715a6187r9561
11218a15748k27897R6464A61459m696d5622r6228M5780d1741J0500G859a58278
11206B2363c56370J05165F8916b49170k4771j24143C74956a05351G2148A0573
11195c7676B0381a24814A23422a51810p3533I5843b24617a4631m0698A62969b62192
$$ plain form
11274 -125072 91429 196902 -267067 -30428 -18560 -6317 76068 47342 189919 -29322 9199
11262 -88087 -222522 -25833 -26049 185458 -164943 -244970 -3690 158611 189081 -97144 -183183
11251 -183183 324838 -54760 -106774 33761 -51586 59480 -91335 109794 460409 -314111 120542
11239 -357440 1241 223643 -37322 -67431 149544 31252 -243948 383590 -336417 -208530
11229 -208530 -62647 -15454 11640 25640 -270487 196202 -141453 -58021 -218736 -16187 -115748
11218 -115748 -343645 -247181 161459 156763 -45622 -141850 -96070 -41741 -31241 7859 -158278
11206 22363 -356370 -251205 68916 -249170 -273941 -398084 374956 -105351 72148 10573
11195 -37676 20381 -124814 123422 -151810 -225343 95843 -224617 -14631 -55329 162969 -262192
11183b98962b0963A15341n4256J6734Q4193I295a70567C4153a75636j70408a43823
11171a542C0086N2718K5580K2952a4692j62847d6239D39606c22333J22786D107
11159H410J65606i9534l40713J40670B96603a57586M7685A13636a5506A45812
11148B55462B2280h3820j84659A325J73891C0595a00022L6527A53036A446P2335
11137G3781c1188q8860a7029I7241B5713M4664a19271j47746J16132A33367m9226
11126H4141A357J97403J07260J44751g9560I363d4182A9783J56200K46335a22796
11114F1114a7184I0208a85056A50758p3475g7238D2006f9759B52785m4482a03675
11102A35503a36996A43223b46908C47154b05674E09053A0293K72998j02655b7672
$$ plain form
11183 -298962 -20963 115341 61085 77819 162012 9295 -170567 34153 -175636 -346044 -143823
11171 -1542 30086 82804 108384 131336 -14692 -177539 -46239 439606 -322333 -199547 4107
11159 8410 174016 -99534 -440247 -299577 296603 -157586 -109901 113636 -15506 145812
11148 255462 22280 -83820 -268479 1325 175216 30595 -100022 -63495 153036 1446 73781
11137 73781 -31188 -120048 -17029 97241 25713 70377 -119271 -267017 -150885 133367 84141
11126 84141 1357 198760 306020 450771 -79560 9363 -44182 19783 175983 422318 -122796
11114 61114 -17184 90208 -185056 150758 77283 -77238 42006 -69759 252785 208303 -103675
11102 135503 -136996 143223 -246908 347154 -205674 509053 10293 283291 180636 -27672
11091A54229M48534k31053R111m9412F9495k8943A2159J46243R0505r507L24786
11080E64186H0627P1220O6298a18883A99118m8822J80378M6652j43823L43987
11070E77490k80169R8502A84134R4741K47981k56615K86008j3864J29002f0842
11059B92039J41966o9585K46966k60100J11838K39540p3138J76648B68253L64917
11049F33170M4984J10947k16624K89249k21093L03044k78530J15902J510q7109
11039F95450j19868L44551j29213j02739j13339K545J36663j41386P5522J94400
11029H42586k51957j05243K1503K39387n2537J27102P9086j15754j23864N7149
11019G17458p3721q8908r7236L53360j33985j1159K02618k47292J04893J84634
$$ plain form
11091 154229 602763 371710 380821 331409 69495 40552 12159 158402 248907 239400 564186
11080 564186 80627 151847 218145 -118883 199118 150296 330674 377326 233503 577490
11070 577490 297321 395823 184134 278875 526856 270241 556249 542385 671387 -60842
11059 292039 434005 364420 611386 351286 463124 702664 629526 806174 268253 633170
11049 633170 678154 789101 572477 861726 640633 943677 665147 781049 782559 695450
11039 695450 575582 920133 790920 688181 574842 577387 714050 572664 648186 842586
11029 842586 590629 485386 506889 746276 693739 820841 899927 784173 660309 717458
11019 717458 643737 554829 457593 810953 676968 665809 868427 621135 726028 910662
11009I10662k21829M0205K9112P2990k7609q0310n421p3031K49114k70745j12446
10998E10692j12548O1836L09322k57768J87794K15909l73937M06519j20344l94596
10988D32879L31363P7724r1147J16497J7594K48585K00135j65766j06530L57332
10978A418666O3213M60935k86272L48924J65631O04938M2686R9300J78203K40565
10968C336789k00139J64541q17928j28232k52836n15463J22559j55571q7984L25916
10958A791652n54444P1486J41639l47845J06836k57273L04353E30354L6598J61818
10948G28770k45054J19157B74322o172J74283j10640D2875a1289A11060J74193
10938B85253j35668a7795F32264k43230k7696a61513B6156c4252B56258P4580
$$ plain form
11009 910662 688833 729038 758150 831140 803531 723221 717800 644769 893883 623138 510692
10998 510692 398144 459980 769302 511534 699328 915237 541300 947819 827475 432879
10988 432879 764242 841966 750819 867316 884910 1133495 1333630 1167864 1061334 1418666
10978 1418666 1481879 1942814 1656542 2005466 2171097 2776035 2818721 2918021 3096224 3336789
10968 3336789 3136650 3301191 2483263 2355031 2102195 1586732 1709291 1553720 1465736 1791652
10958 1791652 1237208 1308694 1450333 1102488 1209324 952051 1256404 530354 566952 728770
10948 728770 483716 602873 274322 268150 442433 331793 42875 -11289 111060 285253
10938 285253 149585 -17795 632264 389034 361338 -161513 26156 -34252 256258 330838
10928C30838A48461L3736a98816I739b77812B42234H4816J23415a21221A24551
10917A72025g6351A33799Q6875C492a32051m1719g3564b887r0707A42568K00332
10906C42900D5716b21998A49342B6370O3388a1282B8812a9792A76989j1472o7887
10895I7630M140J46737a93107a4628C43854E1745a86494B22069g1420a9898A51150
10883f438I7838a47463A8072J42409b88042g9520j42119I3634J75852a74505q0686
10872b55191L136N3452B53767a52227B33837A09650a99040A31010j8669e93F8940
10860B40422f3018E8967d0491j3000n8754B30378o7576f9674j80768J3703E6569
10848A04195a65134L789J2211j22572M2755P5047A00959e5319H6358g4773m3157
$$ plain form
10928 330838 148461 182197 -198816 9739 -277812 242234 84816 208231 -121221 124551
10917 172025 -76351 133799 220674 3492 -132051 -173770 -73564 -2887 -93594 142568 342900
10906 342900 45716 -221998 149342 26370 89758 -11282 28812 -19792 176989 165517 97630
10895 97630 101770 248507 -193107 -14628 343854 51745 -186494 222069 -71420 -19898 151150
10883 -6438 97838 -147463 18072 160481 -288042 -79520 -221639 93634 269486 -174505 -255191
10872 -255191 -252055 -198603 253767 -152227 233837 109650 -199040 131010 112341 -593 68940
10860 240422 -63018 58967 -40491 -53491 -112245 230378 162802 -69674 -250442 -236739 56569
10848 104195 -165134 -161345 -149134 -271706 -228951 -153904 100959 -55319 86358 -74773 -117930
10837a17930E2936d4189H177b78961J16196D83889d18125g5455j21423g2178I7923
10825G207b91526a1759r0486k3425p8891i1883D9706j9207a08920a3583E7202
10813d6808D7059a93379H9690a0625j52446g758m52938B55770a43167k4492A08234
10801A33215B6650J42117b64091B18336a19764l7092a8824C1595a46117B8792
10790A36034a97206c8466j26961N3915C03477i3283B28746h1789j65926A53345
10779b71000R9792j34535A07810J38031c66878m1463J0398A06381P4764n203d73620
10767A27190b6779B9690b48856C6433b61221B19605r3729a11364F0470b9074k8366
10756e7440D069L68260A16227c61995J69626e7300j0959B678J85582i819C7242
$$ plain form
10837 -117930 52936 -44189 8177 -278961 -162765 483889 -418125 -75455 -196878 -72178 97923
10825 7207 -291526 -11759 -102245 -125670 -204561 -91883 49706 30499 -108920 -13583 57202
10813 -46808 47059 -193379 89690 -10625 -163071 -7758 -460696 255770 -143167 -167659 108234
10801 133215 26650 168767 -264091 218336 -119764 -156856 -18824 31595 -146117 28792
10790 136034 -197206 -38466 -165427 -111512 303477 -93283 228746 -81789 -247715 153345
10779 -271000 -171208 -305743 107810 245841 -366878 -408341 -397943 106381 181145 175942 -473620
10767 127190 -26779 29690 -248856 36433 -261221 219605 125876 -111364 60470 -29074 -57440
10756 -57440 4069 372329 116227 -361995 -192369 -57300 -68259 2678 188260 -9819 37242
10744b74650c4908A41739a45304k1293M9328A37675F5120b8208j86441B35563
10733d516j85166N2821N5650A89124J16978G510b0351B2666K48930b14071m0179
10722b54250A6008J63115c73654B03010l8664b67977j4493P5243j89074A42349
10711a35231j85173i2473k28020A3046a11746o9359B69956E059b42550h0087l38176
10700d18263A48594E4622M2395b36873f7430k99410E4475d49813a8943A56980
10689a25586n2619K3611f6266j4817p2615J5646Q278m9810G645b50073J00654
10678a49419j48639A55832b09031F1930O2309R5410C0275b871m4364C4253a4352
10666a58231A86721P8643d6911j10916d3102j49629A35470A8175a1769n59G3332
$$ plain form
10744 -274650 -34908 141739 -145304 -166597 -117269 137675 65120 -28208 -214649 235563
10733 -4516 -189682 -136861 -81211 189124 306102 7510 -20351 22666 271596 -214071 -254250
10722 -254250 16008 179123 -373654 203010 164346 -267977 -282470 -207227 -396301 142349
10711 -135231 -320404 -92473 -320493 13046 -111746 -181105 269956 5059 -242550 -80087 -418263
10700 -418263 148594 54622 97017 -236873 -67430 -366840 54475 -449813 -18943 156980
10689 -125586 -178205 -154594 -66266 -81083 -153698 -138052 -129774 -179584 7645 -250073 -149419
10678 -149419 -298058 155832 -209031 61930 124239 219649 30275 -2871 -47235 34253 -14352
10666 -158231 186721 265364 -46911 -157827 -43102 -192731 135470 18175 -11769 -12328 73332
10654F4545c59766J05158I9105L958a33367G9334C1641a11690l8437L8318G4408
10642a07138A24877i2619A36116B1498a97283b4440E5181a51797A89605Q7708
10632B77313E1245a71185L4997n5187C22194b80262a01218D7231L16585a6304
10621C739c58686C7153J95992a69732l7320c1283o3884F3870b21125l6242A45371
10609A19676m0726b69023j15121d3584F3402R4210a78455k21518L5562B44392
10598e7755A16165j9666a5583j0244j78780R5582j23344I4348R8127c01709a38005
10586A85362g3363J245m3005A0180P7737k6799N6835K85778A3005L87708a59649
10574h5263J4884H08d1002m3840I7827h1009b9358k06576Q8035a5970A1685d0668
$$ plain form
10654 64545 -359766 -254608 99105 103063 -133367 79334 31641 -111690 -150127 -111809 74408
10642 -107138 124877 -92619 136116 21498 -197283 -24440 55181 -151797 189605 277313
10632 277313 51245 -171185 -136188 -191375 322194 -280262 -101218 47231 363816 -16304
10621 3739 -358686 37153 233145 -169732 -207052 -31283 -95167 63870 -221125 -257367 145371
10609 119676 78950 -269023 -384144 -43584 63402 157612 -178455 -399973 -364411 244392
10598 -57755 116165 96499 -15583 -25827 -204607 -109025 -232369 94348 192475 -301709 -138005
10586 185362 -73363 -72118 -115123 10180 87917 61118 117953 403731 13005 400713 -159649
10574 -85263 -70379 808 -41002 -84842 97827 -81009 -29358 -235934 -147899 -15970 11685 -40668
10561c00798J14201PH9085a13104B5511M7535J34215j2663c86690d5202A07270
10549a009r2537A10140C7863J41293n6108n8817K20750A27787R288A931e7183
10537C7502A6249c05960d9450j95056o9421E4548a41725M5914E4756J38442O3396
10526B56594A14059b24169F446e5073a9176j453j25308N4571G8676a50092b2790
10514G1652J48109r552N8306h4746b9918o4863o0651B83943j41396c17768g1992
10502C40752f8305O999F2819b40397b0276l2960l09329f0031A18318f2559A00823
10490a1783l3282D2273a35280A04883f0407j74923A0959J81291J1329a3322A93779
10478D3136P8403b19887A22357m1997d79917A38019e454A25890a39444A38472
$$ plain form
10561 -300798 -186597 -186590 89085 -113104 25511 73046 207261 194598 -386690 -45202 107270
10549 -1009 -93546 110140 37863 179156 123048 64231 284981 127787 137075 1931 -57183
10537 37502 16249 -305960 -49450 -244506 -313927 54548 -141725 -95811 54756 193198 256594
10526 256594 114059 -224169 6446 -55073 -19176 -20629 -145937 -91366 78676 -150092 -22790
10514 71652 219761 210209 268515 -84746 -29918 -94781 -155432 283943 142547 -317768 -71992
10502 340752 -68305 -61306 62819 -240397 -20276 -53236 -362565 -60031 118318 -62559 100823
10490 -11783 -45065 42273 -135280 104883 -60407 -235330 10959 192250 203579 -13322 193779
10478 43136 121539 -219887 122357 80360 -479917 138019 -5454 125890 -139444 138472
10467A8412K1430a45159c4504j49915c6632m4519C0557J7795J7462L4686j2978
10456H7522d69275e0596H2067e5557I4945A6239b50643i8244d8729B16384f798
10444i4193B43454C1795a30968F8856J8240M0795b39103C63758B2535c43158I3097
10432a19911B21321I3748i4984H6683O8416B1032b40365A70647a06725r6839M3546
10421a60018E1711Q0283K7969R0024q6038N9887A03332e6942q1739d9474j36059
10410a85533Q511B0341K86403k8842j38700N8373C8816D155R3498a20028B3361
10398B27090d3902k62027B19359e1656J4070k19968A66042M6413L9994R7126M3644
10387C93219A8870a17597B5214f1779A41966b04197k8225A23946J41640F4807
$$ plain form
10467 18412 39842 -145159 -34504 -184419 -36632 -81151 30557 48352 65814 100500 87522
10456 87522 -469275 -50596 82067 -55557 94945 16239 -250643 -98244 -48729 216384 -6798
10444 -94193 243454 31795 -130968 68856 87096 127891 -239103 363758 22535 -343158 93097
10432 -119911 221321 93748 -94984 86683 155099 21032 -240365 170647 -106725 -203564 -160018
10421 -160018 51711 131994 159963 249987 163949 223836 103332 -56942 -138681 -49474 -185533
10410 -185533 -177022 20341 306744 277902 139202 197575 38816 4155 97653 -120028 23361
10398 227090 -43902 -305929 219359 -51656 -37586 -257554 166042 212455 252449 349575 393219
10387 393219 18870 -117597 25214 -61779 141966 -204197 -232422 123946 265586 64807
10376A68635L32570k12201P01J32429j03277H3380K51735F2804J35172M09469
10366F07445B25387P474K26157I0746K46674J00713e0074B81345m8262l3864K57198
10355D56417K43A71278L73648r3232j00111L3758j58533L13581j50880j51151
10345B38358k3447R5417n9733k7399p4534J78779A22247k9739J27991K05076J8094
10334D43669A22131O7943l5580D0853c8612A16299M4749a2919F4829J34397m4944
10323A54282a0426H011R3412b2162B84529j3066p1959a70304B6506J57635p0550
10312A13591n133E3238a64264F1189a65948G9092h7296a89H4393a68224A09824
10300F3941a27746b8473I0220a45145l06307a21814D976L81538A57399k4256b98032
$$ plain form
10376 168635 501205 289004 289705 422134 318857 83380 335115 62804 197976 607445
10366 607445 225387 232861 459018 90746 337420 438133 -50074 281345 233083 199219 456417
10355 456417 456660 171278 544926 451694 351583 385341 226808 540389 389509 238358
10345 238358 214911 310328 250595 223196 148662 327441 122247 92508 220499 425575 443669
10334 443669 122131 190074 154494 40853 -38612 116299 161048 -12919 64829 199226 154282
10323 154282 -10426 8011 101423 -22162 284529 271463 199504 -170304 26506 184141 113591
10312 113591 108458 53238 -164264 61189 -165948 79092 -87296 -189 84393 -168224 109824
10300 63941 -127746 -28473 90220 -145145 -451452 -121814 4976 386514 157399 133143 -298032
10288a83257O2174c5111j02258E7793c21886a34095n8838A38765b36495b5683
10277a35696j4157A5369J25590q647a01500A2129g4033r0819K472a7408A00746
10265A19821a31298L105I3015P7130e1439C49264A74310a5130B63020D5968c3011
10253B28294C3563b027H2505J08725j7129d1673B9117b58125f764B44396A16568
10241A55208p2880a31190d2756Q078B43315g7390l6403k06898D746J02835d8286
10229a09647E1739a29992A5272b01506A89254K1004A7667M2993b425C2653M8714
10218H1367J13945c49743F817c74793d1110l04563a2445j91337D7517a21482C0077
10206A02576N0372J7368b24186l42872a9861n61257a25805D2649J9435H806b25148
$$ plain form
10288 -183257 -121083 -35111 -137369 57793 -321886 -134095 -192933 138765 -236495 -25683
10277 -135696 -149853 15369 140959 132312 -101500 12129 -74033 -164852 -162380 -17408 100746
10265 119821 -131298 -128193 93015 170145 -51439 349264 174310 -15130 263020 45968 -33011
10253 228294 33563 -2027 82505 191230 174101 -41673 29117 -258125 -6764 244396 116568
10241 155208 82328 -131190 -42756 -34678 243315 -77390 -113793 -320691 4746 107581 -48286
10229 -109647 51739 -129992 15272 -201506 189254 210258 17667 60660 -2425 32653 81367
10218 81367 195312 -349743 6817 -374793 -41110 -345673 -12445 -203782 47517 -121482 30077
10206 102576 152948 170316 -224186 -567058 -19861 -581118 -125805 42649 62084 8806 -225148
10194C15893I8886d1242H9289b44801A57544K9305a17772k134L7407h460k16375
10183b24835F3906f14256g6720A74129M9814A5091b53643J19236E6377J12142
10173A68519i9950d5634j25252C16604j767a40286L9529k2189A18743a99952m946
10162b04898g3187A38709o7450P8893a57976B00056b22678J8130H7181a63846
10151a40916j15528O4604L0352M8096a0081I5142c39162A65729c29716d621A6296
10139C6827A0110K8530L74567a72368B0846a07721d6658q1502m6123O9545I8869
10127a8699F02636a75123Q7008K8062D1789a08104G5578M36745b8428m65305e7769
10115c2026j4871n1021B7275b58436o6455A41520b80791b5641A49710J31572a49256
$$ plain form
10194 315893 98886 -41242 89289 -244801 157544 186849 -117772 -119906 -82499 -8460 -224835
10183 -224835 63906 -614256 -76720 174129 223943 15091 -253643 -134407 56377 168519
10173 168519 -99950 -45634 -170886 316604 314837 -140286 -100757 -122946 118743 -199952 -204898
10162 -204898 -73187 138709 71259 150152 -157976 200056 -222678 -204548 87181 -163846
10151 -140916 -256444 -191840 -161488 -113392 -10081 95142 -339162 165729 -329716 -4621 16296
10139 36827 10110 38640 413207 -172368 20846 -107721 -46658 -128160 -174283 -104738 98869
10127 -18699 602636 -175123 -88115 -60053 41789 -108104 75578 512323 -28428 -493733 -57769
10115 -32026 -46897 -97918 27275 -258436 -324891 141520 -280791 -25641 149710 281282 -149256
10103B16735a65492n3470A99574G4938e1345j8827j96136A15382K50772l8563
10093C27591a17935A49601e2065k41186J38855f2647A86850H7982d74520B2962
10082d57604c5688a4151j45827C4476O935L1568a04325A11271e09942A45400k9621
10071A15779a65248d695A4233J80092i9487q3802A35536i9343J6385q7487D7471
10059c67556A84503o5180a77484J1990p1630A21756m5691a84410O8052A63853
10048d293k38481R794a02722A00914J73280c55541g9134l92221A18570a12748
10037d4845j09591B3125b71891a08274j8139a664n1626j24196f291j67830A19798
10025a36606M5519j48959A40655B4991N5934a07693K3944I5192D0154a51912D7540
$$ plain form
10103 216735 -165492 -218962 199574 74938 -51345 -70172 -266308 115382 366154 327591
10093 327591 -117935 149601 -52065 -293251 -154396 -62647 186850 87982 -474520 22962
10082 -457604 -35688 -14151 -159978 34476 41411 72979 -104325 111271 -509942 145400 115779
10071 115779 -165248 -4695 14233 194325 -99487 -183289 135536 -99343 -82958 -170445 47471
10059 -367556 184503 119323 -177484 -165494 -237124 121756 76065 -184410 -116358 163853
10048 -4293 -242774 -232980 -102722 100914 274194 -355541 -79134 -471355 118570 -112748
10037 -44845 -154436 23125 -271891 -108274 -126413 -1664 -53290 -177486 -6291 -174121 119798
10025 -136606 -91087 -240046 140655 24991 80925 -107693 -83749 95192 40154 -151912 47540
10013d4052A0210a4998e945o4702A61508g1758c5351r6398p9754c5293k43089
10002b78382F5547c14591J49753o7352j63217d949A05250f6108H4109h5037j90879
9991b75916a36409A41783C6752J1252K40262a93672L6315B16375a77917Q6597
9981i1320a6078q9042M8437a8411k22776k865O3262j70015a32145A50936a51956
9969a00622l5216M5113j52388J2508f0172M374A59846a71783K7156C8295b68780
9957A6259d6349j74535c0153j35800E0397i3863j41807K4621e5071J7048B77305
9945c51579d4790j76146l44681a679k3950I0893a34344d9004o7253k24761a48950
9933A67505b56622d2516A35918c1052A75138b36681d2090H9670a34730B9070O6408
$$ plain form
10013 -44052 10210 -14998 -5945 -70647 161508 -71758 -35351 -131749 -211503 -35293 -278382
10002 -278382 65547 -314591 -164838 -232190 -395407 -4949 105250 -66108 84109 -85037 -275916
9991 -275916 -136409 141783 36752 48004 288266 -193672 -157357 216375 -177917 -91320
9981 -91320 -16078 -105120 -56683 -18411 -241187 -244052 -180790 -350805 -132145 150936 -151956
9969 -100622 -135838 -90725 -243113 -230605 -60172 -55798 159846 -171783 -144627 38295 -268780
9957 16259 -46349 -220884 -30153 -165953 50397 -93863 -235670 -211049 -55071 -38023 277305
9945 -351579 -44790 -220936 -565617 -1679 -25629 90893 -134344 -49004 -116257 -341018 -148950
9933 167505 -256622 -42516 135918 -31052 175138 -236681 -42090 89670 -134730 29070 95478
9922I5478a99159A91166B9579a0069C74104A35263a92104A16345b33697L5812
9912a97885E241P3279d76496E358b58083B05469a62427A12542d8134p2484A0831
9900a9869G4111a59174k49415a99130A81617i6728j51643A70156c9173e495j17410
9889a22905J7591I108J94293B8289i4557K9231j839A68086n6271a28175A40192
9877c0972j72100A77044K3007b37448a07250j04865J04095A07693J49484a04707
9866b71939j099h895j89256l5181b3544C0541a08464C20274H7952M6806a88642
9854b58919H6177a15140C49115A68051g5515k20879A2657a24224l183j33109J25283
9843a35233l02288J87368L5143A17563b53432l5525B22575k457F1103b16700b4299
$$ plain form
9922 95478 -199159 191166 29579 -10069 374104 135263 -192104 116345 -233697 -197885
9912 -197885 5241 78520 -476496 5358 -258083 205469 -162427 112542 -48134 -120618 10831
9900 -19869 74111 -159174 -408589 -199130 181617 -96728 -248371 170156 -39173 -5495 -122905
9889 -122905 -105314 9108 203401 28289 -94557 -65326 -67165 168086 111815 -128175 140192
9877 -30972 -203072 177044 200051 -237448 -107250 -212115 -108020 107693 257177 -104707
9866 -271939 -273038 -8895 -198151 -233332 -23544 30541 -108464 320274 87952 134758 -188642
9854 -258919 86177 -115140 349115 168051 -75515 -296394 12657 -124224 -127407 -260516 -135233
9843 -135233 -437521 -250153 -215010 117563 -253432 -288957 222575 220118 61103 -216700 -24299
9831i4414k8511j00545a04417A04613d8231k17842A3063f2404I9057a96941B10608
9819E6576K28886h9818R712j35613C5325J68013g0805D6294C973b03517h8646
9807c53499L9123a54066b6786j62286f7251A04943i9295a9028A39053d39078a60964
9795e04460D73959g6562k51627C1530K56161a06250B82183a38770a7153D8019
9784c01249B13517p5298c15074H7815C0344K3952c5280p2422j51384A21228n9060
9773F2168K9480a81161o2524A68470a95290F4850a11870G6471h6685A97572a30563
9761b12211D6002h782k55464A31524a31863A04619b11763j8032B48307J2882b42916
9749a71128A06363R9349C9299f2222H4385a77042a4468I9847c09012L1813h1031
$$ plain form
9831 -94414 -122925 -223470 -104417 104613 -48231 -266073 13063 -62404 99057 -196941 210608
9819 56576 285462 -89818 -80106 -215719 35325 203338 -70805 46294 3973 -203517 -88646
9807 -353499 -314376 -154066 -26786 -189072 -67251 104943 -99295 -19028 139053 -439078 -160964
9795 -504460 473959 -76562 -328189 31530 287691 -106250 282183 -138770 -17153 48019
9784 -301249 213517 138219 -315074 87815 30344 54296 -35280 -107702 -259086 121228 62168
9773 62168 91648 -181161 -243685 168470 -195290 64850 -111870 76471 -86685 197572 -130563
9761 -212211 46002 -8782 -264246 131524 -131863 104619 -211763 -229795 248307 261189 -242916
9749 -171128 106363 205712 39299 -62222 84385 -177042 -14468 99847 -309012 -277199 -81031
9737e6400A69444b91065K4512g7328k21899P4682c2752j59744J9374j51879o8030
9726c93031a43888M1485j8701d7582l91723a94961g6450j44155M5067b7356n2566
9715g9922A90675o3101m3077j5514J2572b98577A49969b22341d0886k12043J2091
9704b40838h0593l13089a90645B52965a69812b0038m58975E2784d35399a24586
9693d7344j01879O363k23789B3403J7644O9352A1455c036j43897K2262A60721
9681a33334A6480a32166l14467d6415m2281F4055e8016K8107A34912l4478b48941
9669d79983b996p26o768l05731a00188k99783c4782j34266P0961q1667D82b97982
9656A08507c10301f0430J3356C6538b11993i59A47703o0359K33973a82356D0828
$$ plain form
9737 -56400 169444 -291065 -266553 -77328 -299227 -224545 -32752 -192496 -173122 -325001 -393031
9726 -393031 -143888 -102403 -121104 -47582 -439305 -194961 -76450 -220605 -175538 -27356 -79922
9715 -79922 190675 127574 84497 68983 81555 -298577 149969 -222341 -40886 -252929 -240838
9704 -240838 -80593 -393682 -190645 252965 -169812 -20038 -479013 52784 -435399 -124586
9693 -47344 -149223 -142860 -366649 23403 41047 110399 11455 -3036 -146933 -124671 160721
9681 -133334 16480 -132166 -446633 -46415 -88696 64055 -58016 -29909 134912 100434 -248941
9669 -479983 -2996 -3722 -10490 -316221 -100188 -399971 -34782 -169048 -98087 -179754 482 -297982
9656 108507 -310301 -60430 -47074 36538 -211993 -959 147703 87344 321317 -182356 40828
9644a09152B31142I9613B708c46098J64229B2687J73547A7170g4527H0080r929
9633G0151f1783e332B72220e0824o7125c7910A30705B5362M810J21838i9182m70457
9621e69639C387K13467a09098B6766c93419H9246a48895j73211e1118k39491P0066
9610b20543B07322b01048k90878I308J82856i7782k01063C09731b3122A03365
9599a2336j50186l0927e6448k62789l8776j104a47902o4534o8232g1869B95861
9587b07139C5119g0695B70066q1785o8011D6119A7021L16257e3570A26061c01968
9575b89448a3921l35693D7459b64391A04188b64934A36141a70871l5280A35835
9564a72684g5137A04846f9802k8034r6501C27233b11891M3957q9836f5821b2832
$$ plain form
9644 -109152 231142 99613 2708 -346098 -181869 22687 196234 17170 -74527 80080 70151
9633 70151 -61783 -5332 272220 -50824 -117949 -37910 130705 25362 30172 152010 -99182 -569639
9621 -569639 3387 216854 -109098 26766 -393419 89246 -148895 -322106 -51118 -290609 -220543
9610 -220543 207322 -201048 -491926 9308 192164 -97782 -298845 309731 -23122 103365
9599 -12336 -162522 -193449 -56448 -319237 -358013 -359117 -147902 -212436 -280668 -71869 295861
9587 -207139 35119 -70695 270066 188281 120270 46119 17021 333278 -53570 126061 -301968
9575 -289448 -13921 -349614 47459 -264391 104188 -264934 136141 -170871 -206151 135835
9564 -172684 -75137 104846 -69802 -97836 -194337 327233 -211891 -167934 -257770 -65821 -22832
9552B5403L5945a95326j5667b2517j70018k9662A57890l1874b56129A65010a89109
9540a68550j89814J69593B31773c85651h8962C94281G1865b06054M2543d6585
9529d03281e4515j99449A11158d8954F4104J6457c01510N7275C837a65487j0205
9518a75692c170A96330J7261h0033C32623e0230q2784j80908f0817o5312K7650
9507i8479k10939A45000f0711B5352L2530b11870A7106K86631d7516j6741J0121
9496e4136E2690K12763I885J20202E9165J85187m1978a13139k30837a34175A32916
9484a61907K9006j49727a06328I2521b83932f2331q0764k7532D1179a23146B72210
9472b23318G1748e6306R678A24814a68658A87743b69676C2055a19692C20252a82046
$$ plain form
9552 25403 61348 -195326 -210993 -22517 -192535 -222197 157890 126016 -256129 165010 -189109
9540 -168550 -358364 -188771 231773 -385651 -88962 394281 71865 -206054 -163511 -46585
9529 -403281 -54515 -253964 111158 -48954 64104 80561 -301510 -244235 3837 -165487 -175692
9518 -175692 -3170 196330 213591 -80033 332623 -50230 -133014 -313922 -60817 -126129 -98479
9507 -98479 -309418 145000 -60711 25352 57882 -211870 17106 303737 -47516 -64257 -54136
9496 -54136 52690 265453 9885 130087 59165 244352 202374 -113139 -343976 -134175 132916
9484 -161907 -132901 -282628 -106328 92521 -283932 -62331 -143095 -170627 41179 -123146 272210
9472 -223318 71748 -56306 -46628 124814 -168658 187743 -269676 32055 -119692 320252 -182046
9460I4351a04014j71841i4276j46373A20446a74076D8151b20433l8518m3119I5540
9448B49931b34883E7194e602j51780A0768c09696c6133I1018c08548c4425I164
9436h6886A02094c51369A59309P3926g7209k25321q208h6381A05942P893b986
9424a63062f3303B0677b09881H2673I286d885l23797a13369L5479k17797B46447
9412c92377J94170C3992a01955f539k24713A23634a25911J8928I9932a8303m51493
9401d69796a61715I8140G569b71353e921C753K62001f2407K0023k95705a32602
9389b35536j3347I213J38905N0736O9867b52293a18034o4572a8126j46444M0314
9378a24256j02397Q1643C6173b35691H336M881f6663J2675j34376p947B28059
$$ plain form
9460 94351 -104014 -275855 -94276 -240649 120446 -174076 48151 -220433 -258951 -302070 95540
9448 249931 -234883 57194 -5602 -157382 10768 -309696 -36133 91018 -308548 -34425 9164
9436 -86886 102094 -351369 159309 233235 -77209 -302530 -310738 -86381 105942 113835 -2986
9424 -163062 -63303 20677 -209881 82673 9286 -4885 -328682 -113369 -77890 -295687 246447
9412 -392377 -198207 33992 -101955 -6539 -231252 123634 -125911 -106983 99932 -18303 -469796
9401 -469796 -161715 98140 7569 -271353 -5921 3753 265754 -62407 -42384 -338089 -132602
9389 -235536 -248883 9213 148118 198854 268721 -252293 -118034 -182606 -18126 -164570 -124256
9378 -124256 -226653 -145010 36173 -235691 8336 13217 -66663 -53988 -188364 -196311 228059
9366A55004a09379M3370l55011F1939a1913A45364c31116B7176J40196F013b53725
9354a1069j52027j89290h7718K0967E6285f9718j77885o6539A00222k2295i2978
9342i2303K209j53610Q4716A36016a40662c8881m38462b7110k92039O5189B84113
9330b34033g2249n2008c8734A11409C1563K27043C3384a89848g8671E6676e7779
9318a35650l799A77842a50399c1102j49805A86814l7430F2081h5045B17646o4525
9307A53121C7378d82801a31650a6737k20124C646J61191a34759c5920p1648B15334
9295b06921R3289k73255I0598L1844m6671M3017a22852L3747B3927K5809a96816
9283A54600d4932C7946a5365l3587F0094a17736A51966g8199C2412J84897b24729
$$ plain form
9366 155004 -109379 -66009 -421020 61939 -11913 145364 -331116 27176 167372 6013 -253725
9354 -11069 -163096 -352386 -87718 -66751 56285 -69718 -247603 -314142 100222 77927 -92978
9342 -92303 -90094 -243704 -158988 136016 -140662 -38881 -477343 -27110 -319149 -253960 284113
9330 -234033 -72249 -124257 -38734 111409 31563 258606 33384 -189848 -78671 56676 -57779
9318 -135650 -139449 177842 -150399 -31102 -180907 186814 149384 62081 -85045 217646 153121
9307 153121 37378 -482801 -131650 -16737 -236861 3646 164837 -134759 -35920 -107568 215334
9295 -206921 -113632 -386887 90598 122442 75771 118788 -122852 -89105 23927 49736 -196816
9283 154600 -44932 37946 -15365 -48952 60094 -117736 151966 -78199 32412 217309 -224729
9271b46004j0946j80152c2150o6153F6681a20891A25123a82600g6412o0025n310
9260a41747d3927A25467i6088A17173a40043a7355k21826i4412l7313N246p650
9249a34129a2888l8890J4462M077n4115M3092n5719B6801a92057B31506q6935
9238A44571l5289B0861d4783A70b69648B78677A12140b12890E8429b32596Q4848
9227a47748c2847o4410b379A65448c91456B80512a9657A41309a21716M7016H6049
9215b31958K8156h6624q8339D0985a19608b0413j48102b2049A41147e7659O047
9204e1612A20936a107A8865b85591a00577k77326E552K38394i8831B6536J68554
9193A95090A0726c57386A45461a10338B7824a71311d0705l98698A10358K0681
$$ plain form
9271 -246004 -256950 -437102 -32150 -98303 66681 -120891 125123 -182600 -76412 -136437 -141747
9260 -141747 -43927 125467 -96088 117173 -140043 -17355 -239181 -94412 -131725 -126479 -134129
9249 -134129 -12888 -51778 -37316 -33239 -87354 -44262 -99981 26801 -192057 231506 144571
9238 144571 109282 20861 -44783 170 -269648 278677 112140 -212890 58429 -232596 -147748
9227 -147748 -32847 -97257 -2379 165448 -391456 280512 -19657 141309 -121716 -74700 86049
9215 -231958 -203802 -86624 -174963 40985 -119608 -20413 -168515 -22049 141147 -57659 -51612
9204 -51612 120936 -1107 18865 -285591 -100577 -377903 5552 243946 -98831 26536 195090
9193 195090 10726 -357386 145461 -110338 27824 -171311 -40705 -439403 110358 131039
9183A31039l0560J68139B3857A1120c36721I7171R4936o7346a25836F1409a15808
9171C51908E6413J203A4044K61536E5583A8016J18013d66289B46460a32660A4927
9159A24224M0192a26389M7702m9458j13875a03544L1233k27093j4261G3475c00737
9147d9517j4951L1253m4859j07432k6113d3559j92031i5742J259C4191P921h4357
9134b21190j28845f8407j35439d6378p4502l1939r6951k5381O0880H8952b2488
9122a12854o5206C66586e5485a0158j14185J8505a1278E6718K35084O6904j61478
9111A97228H6762a11092p9158A29955a1266q3346j10703A82143a24002e4404D9398
9099a26441D5021b38369e0093A63634i6588k39065R2340D8714Q9407c9327l08662
$$ plain form
9183 131039 100479 268618 23857 11120 -336721 97171 192107 124761 -125836 61409 -115808
9171 351908 56413 57616 14044 275580 55583 18016 136029 -466289 246460 -132660 14927
9159 124224 164416 -126389 -78687 -128145 -242020 -103544 -72311 -299404 -313665 73475 -300737
9147 -49517 -64468 -33215 -78074 -185506 -211619 -43559 -235590 -95742 -94483 34191 42112 -84357
9134 -221190 -350035 -68407 -203846 -46378 -120880 -152819 -249770 -275151 -214271 88952 -22488
9122 -112854 -178060 366586 -55485 -10158 -124343 -105838 -11278 56718 291802 358706 197228
9111 197228 86762 -111092 -190250 129955 -11266 -94612 -205315 182143 -124002 -54404 49398
9099 -126441 45021 -238369 -50093 163634 -96588 -335653 -243313 48714 138121 -39327 -347989
9088c47989B37475d11438a49032a6283B30131E9823c81299i2286j59549O6461
9078a85374A46402a27152A49693d9872C2081d2382B7083J50789L1780a12587D3972
9066D57721A89349C849b4362j73273A84707F4649d6980Q012j10813A28364a757
9054b64542p9681d4247j6068B1680g1694j45615c4755k1366q3170B6736d90743
9042b14542o7524A35026D7726b45573h581j52491A00740e2221A11959l3921j6427
9031F1611d8832l06244R4978N7335j0830m1061J21134e372A10941b36995j61605
9020c98600Q9082a48743E6242B6990J16870a15944C11635G9897b7702j19912A23995
9008H4620a15275J8988K1403D05599b31700M3292I6385c0347j37391d2507l967
$$ plain form
9088 -347989 237475 -411438 -149032 -16283 230131 59823 -381299 -92286 -251835 -185374
9078 -185374 146402 -127152 149693 -49872 32081 -42382 27083 177872 209652 -112587 43972
9066 457721 189349 3849 -24362 -197635 184707 64649 -46980 -38968 -149781 128364 -1757
9054 -264542 -344223 -44247 -60315 21680 -71694 -217309 -34755 -56121 -139291 26736 -490743
9042 -214542 -282066 135026 47726 -245573 -8581 -161072 100740 -52221 111959 78038 61611
9031 61611 -48832 -355076 -260098 -202763 -213593 -254654 -133520 -5372 110941 -236995 -398600
9020 -398600 -309518 -148743 56242 26990 143860 -115944 311635 79897 -27702 -147614 123995
9008 84620 -115275 -96287 -74884 405599 -231700 -188408 96385 -30347 -167738 -42507 -46474
8997d6474A1098i9086b3712f036G5359b03841R6546C33704f4255C06160a1783
8985g8700l8188A37654m8563a97414b6025l33216J67582A9993b52130j05777A12381
8973a55119k96549A21268O2987c40835a25484I9929b61774B80137b01429l3562
8963b34991A30408E620Q6199K8359C8332J06615A6693e9538a3958H7407J06188
8952A93595B3753J99155a98698m6694c5804F2436a53940B13914h2233j76715A84502
8940A69430d9924B30364q5411O5899H4266L38270A89965c32k32557A23255Q8087
8929B11342a92482B11609L8505P8516M30429J980886L337388N014631J40874C746940
8918A478274p27041j77435k14984P5058a2845l5466B18305a4200n2599A27653
$$ plain form
8997 -46474 11098 -99086 -23712 -6036 75359 -203841 -107295 333704 -64255 306160 -11783
8985 -78700 -116888 137654 89091 -197414 -26025 -359241 -191659 19993 -252130 -357907 112381
8973 -155119 -451668 121268 184255 -340835 -125484 99929 -261774 280137 -201429 -234991
8963 -234991 130408 5620 91819 120178 38332 144947 16693 -59538 -13958 87407 193595
8952 193595 23753 222908 -198698 -245392 -35804 62436 -153940 213914 -82233 -258948 184502
8940 169430 -49924 230364 144953 210852 84266 422536 189965 -332 -232889 123255 211342
8929 211342 -192482 211609 250114 328630 759059 2739945 6077333 11091964 11232838 3746940
8918 1478274 751233 573798 358814 433872 -12845 -48311 218305 -14200 -66799 127653
8907C48591A29276h4919k05573D4678Q651K68786i722A39008b45353r2668a68362
8895E33824F176J77532R6927j24117b40466A02291Q9345M2573b72936C34282A41991
8883a63928A85513H7920d5542D1836K7056d61881A85646e0675j5491A66308o9008
8872I7300D7613N5549m0618g1193A83454N1660A2018J70740a82652c378A4713
8860a36401p8513H1220c37144g8276D6658b63039A58630m0865a22483N0356A95404
$$ plain form
8907 348591 129276 -84919 -290492 44678 53329 322115 -9722 139008 -245353 -338021 -168362
8895 533824 6176 183708 280635 156518 -240466 102291 191636 234209 -272936 334282 141991
8883 -163928 185513 87920 -45542 41836 68892 -461881 185646 -50675 -66166 166308 97300
8872 97300 47613 103162 62544 -71193 183454 235114 12018 182758 -182652 -3378 14713
8860 -136401 -214914 81220 -337144 -78276 46658 -263039 158630 117765 -122483 -72127 195404
$$ [...]
##END NTUPLES=NMR SPECTRUM
##END=
