##TITLE=AC1548_ROEFFECT0014_8268774_JFnQT3Gdvp
##JCAMPDX= 6.0         $$ Bruker NMR JCAMP-DX V2.0
##DATA TYPE= NMR SPECTRUM
##DATA CLASS= NTUPLES
##ORIGIN= BRUKER
##OWNER= Administrator
$$ 1.72 TOPSPIN		Version 2.1
$$ 2013-10-11 22:15:26.725 -0700  Administrator@X
$$ Compression mode = diff/dup
##.OBSERVE FREQUENCY= 400.02188249412
##.OBSERVE NUCLEUS= ^1H
##.ACQUISITION MODE= SIMULTANEOUS (DQD)
##.ACQUISITION SCHEME= undefined
##.AVERAGES= 64
##.DIGITISER RES= 22
##SPECTROMETER/DATA SYSTEM= spect
##.PULSE SEQUENCE= noesygpps1d.comp
##.SOLVENT NAME= COFFEE_meoh
##.SHIFT REFERENCE= INTERNAL, COFFEE_meoh, 1, 14.96089
##AUDIT TRAIL= $$ (NUMBER, WHEN, WHO, WHERE, PROCESS, VERSION, WHAT)
$$ ##TITLE= Audit trail, TOPSPIN		Version 2.1
$$ ##JCAMPDX= 5.01
$$ ##ORIGIN= Bruker BioSpin GmbH
$$ ##OWNER= Administrator
$$ $$ E:\/data/COFFEE/nmr/AC1548_ROEFFECT0014_8268774_JFnQT3Gdvp/12/pdata/1/auditp.txt
$$ ##AUDIT TRAIL=  $$ (NUMBER, WHEN, WHO, WHERE, PROCESS, VERSION, WHAT)
(   1,<2013-10-11 22:15:21.741 -0700>,<Administrator>,<X>,<go>,<TOPSPIN 2.1>,
      <created by zg
	started at 2013-10-11 22:03:51.653 -0700,
	POWCHK enabled, PULCHK disabled,
       configuration hash MD5:
       C8 4E 4E 5D D3 5C D8 9E 9F 52 82 E0 59 8A DE 15
       data hash MD5: 64K
       C6 5C 43 1D DC 20 A6 F7 BA 69 29 17 E1 35 80 B1>)
(   2,<2013-10-11 22:15:24.709 -0700>,<Administrator>,<X>,<proc1d>,<TOPSPIN 2.1>,
      <Start of raw data processing
       efp LB = 0.3 FT_mod = 6 PKNL = 1 PHC0 = 0 PHC1 = 0 SI = 128K 
       data hash MD5: 128K
       59 45 23 28 39 B6 C4 7A CF 57 90 80 2C 77 6A 27>)
(   3,<2013-10-11 22:15:25.709 -0700>,<Administrator>,<X>,<proc1d>,<TOPSPIN 2.1>,
      <pk PHC0 = -82.39746 PHC1 = 0 
       data hash MD5: 128K
       33 BD 83 2F DE 8A 1B B7 07 3B 56 B8 10 7E 93 3F>)
(   4,<2013-10-11 22:15:26.194 -0700>,<Administrator>,<X>,<proc1d>,<TOPSPIN 2.1>,
      <abs ABSG = 1 
       data hash MD5: 128K
       60 EC 16 B6 B0 D0 B4 CE 25 44 1B 79 8D 1D 99 D6>)
(   5,<2013-10-11 22:15:26.288 -0700>,<Administrator>,<X>,<proc1d>,<TOPSPIN 2.1>,
      <abs ABSG = 2 
       data hash MD5: 128K
       8F 9C B0 01 AC 31 56 20 DD 0A 50 A6 EF 0D 81 5F>)
(   6,<2013-10-11 22:15:26.381 -0700>,<Administrator>,<X>,<proc1d>,<TOPSPIN 2.1>,
      <abs ABSG = 3 
       data hash MD5: 128K
       06 86 7B 25 39 86 73 01 EC E8 8C D9 07 11 0C A1>)
(   7,<2013-10-11 22:15:26.444 -0700>,<Administrator>,<X>,<proc1d>,<TOPSPIN 2.1>,
      <abs ABSG = 4 
       data hash MD5: 128K
       21 65 FC 6B 99 F0 42 5C A8 92 0A 1E 11 67 59 9F>)
(   8,<2013-10-11 22:15:26.522 -0700>,<Administrator>,<X>,<proc1d>,<TOPSPIN 2.1>,
      <abs ABSG = 5 
       data hash MD5: 128K
       90 F8 BC 58 76 82 A8 33 AA 40 CD CA 26 FF B4 5C>)
$$ ##END=
$$ 
$$ $$ hash MD5
$$ $$ BB 52 9D 3C 8D 60 5E 0D 4E 56 A5 07 76 52 72 C6
##$RELAX= 
##$RELAX= 
##$RELAX= 
##$RELAX= 
##$RELAX= 
##$RELAX= 
##$RELAX= 
##$RELAX= 
$$ Bruker specific parameters
$$ --------------------------
##$DU= <E:\>
##$EXPNO= 12
$$ [...]
##$TP07= 0
##$TPNAME0= <>
##$TPNAME1= <>
##$TPNAME2= <>
##$TPNAME3= <>
##$TPNAME4= <>
##$TPNAME5= <>
##$TPNAME6= <>
##$TPNAME7= <>
##$TPOAL= (0..7)
0.5 0.5 0.5 0.5 0.5 0.5 0.5 0.5
##$TPOFFS= (0..7)
0 0 0 0 0 0 0 0
##$TUNHIN= 0
##$TUNHOUT= 0
##$TUNXOUT= 0
##$USERA1= <user>
##$USERA2= <user>
##$USERA3= <user>
##$USERA4= <user>
##$USERA5= <user>
##$V9= 5
##$VALIST= <valist>
##$VCLIST= <CCCCCCCCCCCCCCC>
##$VD= 0
##$VDLIST= <DDDDDDDDDDDDDDD>
##$VPLIST= <PPPPPPPPPPPPPPP>
##$VTLIST= <TTTTTTTTTTTTTTT>
##$WBST= 1024
##$WBSW= 4
##$XGAIN= (0..3)
0 0 0 0
##$XL= 0
##$YL= 0
##$YMAX_a= 6245533
##$YMIN_a= -13003585
##$ZGOPTNS= <>
##$ZL1= 120
##$ZL2= 120
##$ZL3= 120
##$ZL4= 120
##$ABSF1= 14.96089
##$ABSF2= -5.597292
##$ABSG= 5
##$ABSL= 3
##$ALPHA= 0
##$AQORDER= 0
##$ASSFAC= 0
##$ASSFACI= 0
##$ASSFACX= 0
##$ASSWID= 0
##$AUNMP= <proc_prof1d_extract.lims>
##$AXLEFT= 0
##$AXNAME= <>
##$AXNUC= <1H>
##$AXRIGHT= 0
##$AXTYPE= 0
##$AXUNIT= <>
##$AZFE= 0.1
##$AZFW= 0.1
##$BCFW= 0
##$BC_mod= 0
##$BYTORDP= 0
##$COROFFS= 0
##$CY= 15
##$DATMOD= 1
##$DC= 0
##$DFILT= <>
##$DTYPP= 0
##$F1P= 0
##$F2P= 0
##$FCOR= 0.5
##$FTSIZE= 131072
##$FT_mod= 6
##$GAMMA= 0
##$GB= 0
##$INTBC= 1
##$INTSCL= 1
##$ISEN= 128
##$LB= 0.3
##$LEV0= 0
##$LPBIN= 0
##$MAXI= 10000
##$MC2= 0
##$MEAN= 0
##$ME_mod= 0
##$MI= 0
##$NCOEF= 0
##$NC_proc= -2
##$NLEV= 6
##$NOISF1= 0
##$NOISF2= 0
##$NSP= 0
##$NTH_PI= 0
##$NZP= 0
##$OFFSET= 14.96089
##$PC= 1
##$PHC0= -82.39746
##$PHC1= 0
##$PH_mod= 1
##$PKNL= yes
##$PPARMOD= 0
##$PPDIAG= 0
##$PPIPTYP= 0
##$PPMPNUM= 2147483647
##$PPRESOL= 1
##$PSCAL= 4
##$PSIGN= 0
##$PYNMP= <proc.py>
##$REVERSE= no
##$SF= 400.020009680849
##$SI= 131072
##$SIGF1= 0
##$SIGF2= 0
##$SINO= 400
##$SIOLD= 131072
##$SPECTYP= <>
##$SREGLST= <1H.CDCl3>
##$SSB= 0
##$STSI= 131072
##$STSR= 0
##$SW_p= 8223.68421052631
##$SYMM= 0
##$S_DEV= 0
##$TDeff= 65536
##$TDoff= 0
##$TI= <>
##$TILT= no
##$TM1= 0
##$TM2= 0
##$TOPLEV= 0
##$USERP1= <user>
##$USERP2= <user>
##$USERP3= <user>
##$USERP4= <user>
##$USERP5= <user>
##$WDW= 1
##$XDIM= 131072
##$YMAX_p= 324038379
##$YMIN_p= -11170
##$CURPLOT= <Network HP LaserJet P1505>
##$CURPRIN= <$Network HP LaserJet P1505>
##$DFORMAT= <normdp>
##$LAYOUT= <+/1D_H.xwp>
##$LFORMAT= <normlp>
##$PFORMAT= <normpl>
##$SURQMSG= 1
$$ End of Bruker specific parameters
$$ ---------------------------------
##NTUPLES= NMR SPECTRUM
##VAR_NAME=  FREQUENCY,     SPECTRUM/REAL,   SPECTRUM/IMAG
##SYMBOL=    X,             R,               I
##VAR_TYPE=  INDEPENDENT,   DEPENDENT,       DEPENDENT
##VAR_FORM=  AFFN,          ASDF,            ASDF
##VAR_DIM=   131072,        131072,          131072
##UNITS=     HZ,            ARBITRARY UNITS, ARBITRARY UNITS
##FACTOR=    0.0627417313425164, 1,          1
##FIRST=     8223.62146879497, -25,          -67053
##LAST=      0,             2339,            -67806
##MIN=       0,             -11170,          0
##MAX=       8223.62146879497, 324038379,    0
$$ Real data points
##PAGE= N=1
##DATA TABLE= (X++(R..R)), XYDATA
$$ [...]
63798D71412q738p906p343o352n036m213l979l646l210l572m801n504m764l560
63784C98788l302l818l927l363k900k945l110l065k875k528j924j353j263j533
63770C60882j573j155n80LQ07J868K803L289L396L350L274L257L406L679L855
63755C90561L642K700P51k044m992p358q859r481r162q059o802o015n621n079
63741C24182m182l203k358j612r30k96M68J521K606L264L396L291L197L172L311
63726C35827L675M047M105L869L609L466L478L778M348M722M473L865L451L156
63712C89869K410J138j02j038j944k859l254k903k384k351k712k941k738k061
63698C66130r70J95Q00N19k73r27j080o63J89J049J425J310J135J019N98j19m29
$$ y = [471412, 462674, 454768, 447425, 441073, 436037, 431824, 427845, 424199, 420989, 417417, 412616, 407112, 402348, 398788, 395486, 391668, 387741, 384378, 381478, 378533, 375423, 372358, 369483, 366955, 365031, 363678, 362415, 360882, 359309, 358154, 357574, 357577, 358384, 360252, 363055, 366344, 369740, 373090, 376364, 379621, 383027, 386706, 390561, 394203, 396903, 397654, 395610, 390618, 383260, 374401, 364920, 355758, 347699, 340897, 334882, 329261, 324182, 320000, 316797, 314439, 312827, 311897, 311601, 312069, 313590, 316196, 319460, 322856, 326147, 329344, 332516, 335827, 339502, 343549, 347654, 351523, 355132, 358598, 362076, 365854, 370202, 374924, 379397, 383262, 386713, 389869, 392279, 393417, 393315, 392277, 390333, 387474, 384220, 381317, 378933, 376582, 373870, 370929, 368191, 366130, 365160, 365355, 366155, 366674, 366401, 365474, 364394, 363731, 363920, 364969, 366394, 367704, 368839, 369858, 370456, 370337, 369908]
63681C69908N2O66O07R1j11J32L75N73J130J957K371K067J631J751K436L215L792
63664C92643M167M406M467M173L289J813J56j181k097k818l361l450l048k687
63650C96472k950l740m193l448j496P64K374L224L972N126O471P488Q023Q247
63636D26334Q276Q133P955P871P784P441O700N597M360L503L538M312M913M709
63622E11426M162M181M885N688O354P303Q806J0626J2614J4978J7651J9926K1166
63609F49766K1550K1815K2549K3905K5628K7035K7350K6472K5100K3746K1906
63598I16822J8707J4145R117M301l53m901q760j1266j2509j3229j3892j4343j4422
63585H69417j4565j5449j7128j8861j9898k0215k0313k0375j9922j8423j6052
$$ y = [369908, 369960, 370626, 371233, 371324, 371213, 371345, 371720, 372293, 373423, 375380, 377751, 379818, 381449, 383200, 385636, 388851, 392643, 396810, 401216, 405683, 409856, 413145, 414958, 415114, 413933, 411836, 409018, 405657, 402207, 399159, 396472, 393522, 389782, 385589, 382141, 380645, 381409, 383783, 387007, 390979, 396105, 402576, 410064, 418087, 426334, 434610, 442743, 450698, 458569, 466353, 473794, 480494, 486091, 490451, 493954, 497492, 501804, 506717, 511426, 515588, 519769, 524654, 530342, 536696, 543999, 552805, 563431, 576045, 591023, 608674, 628600, 649766, 671316, 693131, 715680, 739585, 765213, 792248, 819598, 846070, 871170, 894916, 916822, 935529, 949674, 958791, 963092, 962739, 957838, 949078, 937812, 925303, 912074, 898182, 883839, 869417, 854852, 839403, 822275, 803414, 783516, 763301, 742988, 722613, 702691, 684268, 668216]
63574F68216j3646j1889j0667r381p764o137m823l594j994mJ945L512M700N585
63560F14059O281P197Q813J1015J3093J4682J6223J8158K0257K2199K4291K6911
63548H03179K9593L1531L2814L4379L6794L9868M3357M7027M9602M8571M1859
63537A238574K9605J4144j365j4151k2590k6618k7404k6311k4215k1818j9940
63526A097911j9063j8936j9144j9823k1335k3489k5590k7193k8344k9077k9104
63515H36813k8092k6079k3546k1166j9423j8227j6989j5225j3071j1130r959r696
63503F24210j0034j0412j0493j0473j0712j1028j0799r985r390r541r743q924
63491E02676p050n086l686k671j766j090p33l52L53J160J634J788K104K996M341
$$ y = [668216, 654570, 642681, 632014, 622633, 614869, 608732, 603909, 600315, 598321, 598317, 600262, 603774, 608474, 614059, 620340, 627537, 636350, 647365, 660458, 675140, 691363, 709521, 729778, 751977, 776268, 803179, 832772, 864303, 897117, 931496, 968290, 1008158, 1051515, 1098542, 1148144, 1196715, 1238574, 1268179, 1282323, 1280958, 1266807, 1244217, 1217599, 1190195, 1163884, 1139669, 1117851, 1097911, 1078848, 1059912, 1040768, 1020945, 999610, 976121, 950531, 923338, 894994, 865917, 836813, 808721, 782642, 759096, 737930, 718507, 700280, 683291, 668066, 654995, 643865, 633906, 624210, 614176, 603764, 593271, 582798, 572086, 561058, 550259, 540274, 530884, 521343, 511600, 502676, 495626, 490540, 486854, 484183, 482417, 481327, 480594, 480242, 480595, 481755, 483389, 485177, 487281, 490277, 494618]
63476D94618N631O414O647O581O462O428O573O776O552N529M176L515L825M190
63462E73917L799L127L137L720L853L100K078J374Q51K39m07j041j782k310j869
63447E91786k43J735L188M276N873Q509J2045J5957J9495K1917K3101K3782K4801
63434G56222K6284K8005L0265L3816L8848M4319M8205M8200M2656L1688J7633
63423A146141L961o707j3596j7096j7626j5377j0824n045O64N534R654J3440J6827
63410A109950J9110J9644J8415J5742J1780O602P14n016r947j3931j6993j9039
63398A137031j9981k0058j9822j9892k0618k1928k3551k5388k7495k9631l1140
63387H77527l1516l0896k9670k7839k5175k1917j8772j6179j3958j1825r837q203
$$ y = [494618, 500249, 506663, 513310, 519891, 526353, 532781, 539354, 546130, 552682, 558211, 562387, 565902, 569727, 573917, 577716, 580843, 583980, 587700, 591553, 594653, 596731, 598105, 598956, 599195, 598788, 597747, 595965, 593655, 591786, 591543, 593278, 596466, 600742, 606615, 615124, 627169, 643126, 662621, 684538, 707639, 731421, 756222, 782506, 810511, 840776, 874592, 913440, 957759, 1005964, 1054164, 1096820, 1128508, 1146141, 1150102, 1143395, 1129799, 1112703, 1095077, 1079700, 1068876, 1063831, 1064495, 1070029, 1079683, 1093123, 1109950, 1129060, 1148704, 1167119, 1182861, 1194641, 1201243, 1201957, 1196941, 1186994, 1173063, 1156070, 1137031, 1117050, 1096992, 1077170, 1057278, 1036660, 1014732, 991181, 965793, 938298, 908667, 877527, 846011, 815115, 785445, 757606, 732431, 710514, 691742, 675563, 661605, 649780, 639943, 631740]
63375F31740o905n684m171j957J057M300O878Q628J0371J2805J5404J7125J8113
63362G07704J9956K3877K9039L3174L4869L4861L5002L6263L7993L8918L8529
63351A070185L7382L6279L5357L3922L1047K6313K0007J2741N116k157q077j1870
63339A286245j3775j4832j5663j5818j4807j3411j3322j5435j8997k2616k5595
63328A101974k8005k9843l0688l0172k8443k6050k3487k0952j8399j5654j2366
63317H37915q095k880K054M382J951n650j6606k7722l5901l9451l8700l5464l1635
63304F04198k8082k4757k1461j8151j4873j1926j0003r494r699r355q061o659
63292D31677n985n932n948n831n600n120m417l889l673l240k182j113r75j625
$$ y = [631740, 624835, 619151, 614980, 613023, 614080, 618380, 625258, 633886, 644257, 657062, 672466, 689591, 707704, 727660, 751537, 780576, 813750, 848619, 883480, 918482, 954745, 992738, 1031656, 1070185, 1107567, 1143846, 1179203, 1213125, 1244172, 1270485, 1290492, 1303233, 1308349, 1306192, 1298115, 1286245, 1272470, 1257638, 1241975, 1226157, 1211350, 1197939, 1184617, 1169182, 1150185, 1127569, 1101974, 1073969, 1044126, 1013438, 983266, 954823, 928773, 905286, 884334, 865935, 850281, 837915, 829820, 826940, 828994, 833376, 835327, 829677, 813071, 785349, 749448, 709997, 671297, 635833, 604198, 576116, 551359, 529898, 511747, 496874, 484948, 474945, 465451, 455752, 446397, 438336, 431677, 425692, 419760, 413812, 407981, 402381, 397261, 392844, 388955, 385282, 382042, 379860, 378747, 377772, 376147]
63278C76147j874j029K47R00P47M46N14P76P57L21j17n5N66J339J842J892J465
63261C84884P49L46R04K239L300L450L277L650M434M838M768M921N564O089N961
63246D39374N423M960M684M563M752N288N836O095O253O696P500Q383R041R414
63232E28262R726J0292J1050J1472J1213J0789J1090J2199J3225J3415J2921J2348
63220F68002J2019J1945J2037J2055J1725J1138J0668J0386R968R301Q556P596
63208G95396N918L480Q44j745m654p882j0625j2438j3912j5429j6138j5243j3588
63195F93984j2643j2322j1179q677n880l782k170n04J164K650M148N784P312Q648
63181F66533J0098J1705J3016J3864J4673J5601J6004J5273J3618J1525R078O411
$$ y = [376147, 374273, 373244, 373491, 374391, 375138, 375584, 376098, 376874, 377631, 377952, 377835, 377780, 378346, 379685, 381527, 383419, 384884, 385633, 385979, 386883, 389122, 392422, 395872, 399149, 402799, 407233, 412071, 416839, 421760, 427324, 433413, 439374, 444797, 449757, 454441, 459004, 463756, 469044, 474880, 480975, 487228, 493924, 501424, 509807, 518848, 528262, 537988, 548280, 559330, 570802, 582015, 592804, 603894, 616093, 629318, 642733, 655654, 668002, 680021, 691966, 704003, 716058, 727783, 738921, 749589, 759975, 769943, 779244, 787800, 795396, 801314, 804794, 805638, 803893, 799239, 791357, 780732, 768294, 754382, 738953, 722815, 707572, 693984, 681341, 669019, 657840, 649163, 643283, 639501, 637331, 636827, 637991, 640641, 644789, 650573, 657885, 666533, 676631, 688336, 701352, 715216, 729889, 745490, 761494, 776767, 790385, 801910, 810988, 817399]
63169H17399M245L192K818K142Q45o05j911l349n182p247r233j1106j3092j5427
63155G63489j8091k0667k2574k3569k3855k3576k2581k0912j9147j7870j6988
63144E33659j6081j5106j4249j3236j1413q676n887m121l670l877l809l099k251
63131D28184k087k773l493l316k200r84m52o66j102j141n29L06N40j60j034r65
63115D08128K10J509J998J792J620J810K065K098K093K406L030L610L911M118
63101D40398M546N221N904O463O988P582Q245Q978R733J0305J0501J0518J0660
63088E46042J0693R925Q099N658K894n25m658q564j1117j2254j2597j2229j0710
63075E10657q195n612l603k086r09j65L88J445L240N198O736P917Q930R667J0266
$$ y = [817399, 821644, 824836, 827654, 829796, 830641, 830036, 828125, 824776, 819594, 812347, 803114, 792008, 778916, 763489, 745398, 724731, 702157, 678588, 654733, 631157, 608576, 587664, 568517, 550647, 533659, 517578, 502472, 488223, 474987, 463574, 454898, 449011, 444890, 441220, 437343, 433534, 430435, 428184, 426097, 423324, 419831, 416515, 414315, 413331, 412879, 412213, 411111, 409970, 409441, 409747, 410287, 410127, 409093, 408128, 408338, 409847, 411845, 413637, 415257, 417067, 419132, 421230, 423323, 425729, 428759, 432369, 436280, 440398, 444944, 450165, 456069, 462532, 469520, 477102, 485347, 494325, 504058, 514363, 524864, 535382, 546042, 556735, 566660, 574759, 580417, 583311, 582786, 578128, 569564, 558447, 546193, 533596, 521367, 510657, 502462, 496850, 493247, 491161, 490252, 490087, 490475, 491920, 495160, 500358, 507094, 515011, 523941, 533608, 543874]
63060E43874J1434J3563J5912J7369J7735J7724J8028J9029K1086K4243K7644
63049G47641L0000L0840L0812L0756L0953L1393L2084L2810L3060L2607L1832
63038A094788L1192L0648K9950K9233K8852K8696K8121K6664K4583K2383K0089
63027A395199J7188J3352Q940M506On231j1516j8119k3814k8021l1029l3202l4408
63014A253851l4390l3367l1804k9784k6959k3137j8626j3889r143m446N7M205
63002A032568P998J1469J4401J6483J7723J8451J8851J8747J8023J6954J5859
62991A207527J4668J3183J1627J0513R916R293Q167O676N207L760J924o02l751
62978A298108p319j1186j5332j9634k3761k7297l0051l2260l4247l5909l6763
$$ y = [543874, 555308, 568871, 584783, 602152, 619887, 637611, 655639, 674668, 695754, 719997, 747641, 777641, 808481, 839293, 870049, 901002, 932395, 964479, 997289, 1030349, 1062956, 1094788, 1125980, 1156628, 1186578, 1215811, 1244663, 1273359, 1301480, 1328144, 1352727, 1375110, 1395199, 1412387, 1425739, 1434679, 1439185, 1439191, 1433960, 1422444, 1404325, 1380511, 1352490, 1321461, 1288259, 1253851, 1219461, 1186094, 1154290, 1124506, 1097547, 1074410, 1055784, 1041895, 1032752, 1028306, 1028363, 1032568, 1040566, 1052035, 1066436, 1082919, 1100642, 1119093, 1137944, 1156691, 1174714, 1191668, 1207527, 1222195, 1235378, 1247005, 1257518, 1267434, 1276727, 1284894, 1291570, 1296777, 1300537, 1302461, 1301859, 1298108, 1290789, 1279603, 1264271, 1244637, 1220876, 1193579, 1163528, 1131268, 1097021, 1061112, 1024349]
62967A024349l6602l5836l4969l3980l2519l0595k8595k6709k4726k2542k0440
62956F96836j8657j6951j4970j2947j1588j1247j1482j1539j1116j0430r762r172
62944E46975q608q074p592p139o660o081n361m686m450m784n122m728l755l247
62930D66688l680m058l118j220q3n92j656j694n93L99M40L0J68J123K238K804
62914D57196K888L250M387N808O556O389N999N958N956N404M325L075J568n04
62900E18255k738m089m050l188k294j466m66M68P51K44n37j064j333j620j958
62885D94915k097j857j306o01J24O61P89O01O04J136J774J764J043L34L5m06j619
62868D95894l246m374m676m558m308l825l154k591k144j541r41r04j352j292j24
$$ y = [1024349, 987747, 951911, 916942, 882962, 850443, 819848, 791253, 764544, 739818, 717276, 696836, 678179, 661228, 646258, 633311, 621723, 610476, 598994, 587455, 576339, 565909, 556147, 546975, 538367, 530293, 522701, 515562, 508902, 502821, 497460, 492774, 488324, 483540, 478418, 473690, 469935, 466688, 463008, 458950, 455832, 454612, 454529, 453937, 452281, 450587, 449994, 450393, 450833, 450863, 451031, 452154, 454392, 457196, 460084, 463334, 467721, 473529, 480085, 486474, 492473, 498431, 504387, 509791, 514116, 517191, 518759, 518255, 515517, 511428, 507378, 504190, 501896, 500430, 499964, 500432, 501183, 501427, 500890, 499826, 498493, 496873, 494915, 492818, 490961, 489655, 489054, 489178, 489839, 490628, 491229, 491833, 492969, 494743, 496507, 497550, 497884, 497919, 497513, 495894, 492648, 488274, 483598, 479040, 474732, 470907, 467753, 465162, 463018, 461477, 460536, 459632, 458280, 456988, 456864]
62853D56864J312J673Q10j78m09oN11R62J429J923K385K792L045K990K632K135
62837D80870J564Q93L54L73R61J477J356Q83Q70J664K778L584L973M180M250L976
62821E14006L349K771K678L088L581L656L055J844L43r88j785k022j934j712j328
62806E28602o56L30J547K825L882M419M504M727N623O949P848P875P582P840Q814
62791F02711R972J1037J2487J4899J8086K1157K3365K4742K5995K7952L1001L4821
62779H58225L8542M1357M3133M4428M5923M7793M9595N0627N0422M9015M6823
62768A365883M4192M1061L7069L1936K5627J8320J0444K664m492j1138j7875k4975
62756A518716l1870l7659m1956m5125m7800n0264n2192n2882n1934m9782m7307
$$ y = [456864, 458176, 459849, 460659, 460481, 460072, 460066, 460577, 461539, 462968, 464891, 467276, 470068, 473113, 476103, 478735, 480870, 482434, 483327, 483681, 484054, 485015, 486492, 487848, 488731, 489601, 491265, 494043, 497627, 501600, 505780, 510030, 514006, 517355, 520126, 522804, 525892, 529473, 533129, 536184, 538028, 538371, 537383, 535598, 533576, 531642, 529930, 528602, 527946, 528276, 529823, 532648, 536530, 540949, 545453, 550180, 555803, 562752, 570600, 578475, 586057, 593897, 602711, 612683, 623720, 636207, 651106, 669192, 690349, 713714, 738456, 764451, 792403, 823404, 858225, 896767, 938124, 981257, 1025685, 1071608, 1119401, 1168996, 1219623, 1270045, 1319060, 1365883, 1410075, 1451136, 1488205, 1520141, 1545768, 1564088, 1574532, 1577196, 1572704, 1561566, 1543691, 1518716, 1486846, 1449187, 1407231, 1362106, 1314306, 1264042, 1211850, 1158968, 1107034, 1057252, 1009945]
62745A009945m4891m2161l8877l5537l2644k9840k6437k2628j9396j7272j5845
62734F84417j4596j3496j2510j1256r556p771o195m573k779j402j022j189r34
62721E97138j23M31K62pM79J730L063M004M703N531O612P812R064J0535J2433
62706F63667J4650J6814J8738K0692K3009K5594K8002K9941L1458L2758L4031
62695I39354L5373L6627L7443L7710L7767L7885L7703L6582L4396L1513K8034
62684A330387K3646J8307J2489O506R8o946j4166k0810k6579l1631l6060l9773
62672A215468m2628m4374m4677m3635m2013m0549l9133l7190l4727l2358l0228
62661G83956k7666k4247k0707j8210j7012j6323j5333j3884j2198j0475q944p942
$$ y = [1009945, 965054, 922893, 884016, 848479, 815835, 785995, 759558, 736930, 717534, 700262, 684417, 669821, 656325, 643815, 632559, 623003, 615232, 609037, 604464, 601685, 600283, 599261, 598072, 597138, 597015, 597446, 597708, 597701, 598180, 599910, 602973, 606977, 611680, 617211, 623823, 631635, 640699, 651234, 663667, 678317, 695131, 713869, 734561, 757570, 783164, 811166, 841107, 872565, 905323, 939354, 974727, 1011354, 1048797, 1086507, 1124274, 1162159, 1199862, 1236444, 1270840, 1302353, 1330387, 1354033, 1372340, 1384829, 1391335, 1391433, 1384487, 1370321, 1349511, 1322932, 1291301, 1255241, 1215468, 1172840, 1128466, 1083789, 1040154, 998141, 957592, 918459, 881269, 846542, 814184, 783956, 756290, 732043, 711336, 693126, 676114, 659791, 644458, 630574, 618376, 607901, 598957, 591015]
62649E91015p605p656p673p495p227o928o531o014n409m690l828k962k323j868
62635E12806j275m35K76M87L83M11N61L34m64j372j837j809j519j016k80M38Q18
62618E06507R17J036J149Q64Q4o77p79r3J008K102K940L433L625L670L701L793
62602E33280M130N009O531Q383J0132J1729J3490J5529J7426J8597J8936J8997
62590F82169J9507K0689K2076K2961K3035K2497K1602K0209J7983J4833J1098
62579H98659P209L344n88m736r093j3320j6756j8889j9922k0717k1890k3104k3532
62566G36665k2982k2122k1460k0574j8802j6410j4470j3540j3035j2131j0759
62555E50380r347p998o555n275m758n045n369n012m007k799j689q78o75j109j555
$$ y = [591015, 583410, 575754, 568081, 560586, 553359, 546431, 539900, 533886, 528477, 523787, 519959, 516997, 514674, 512806, 511531, 511096, 511372, 511859, 512242, 512653, 513214, 513548, 513084, 511712, 509875, 508066, 506547, 505531, 505251, 505689, 506507, 507424, 508460, 509609, 510473, 510557, 509880, 509101, 509008, 510016, 512118, 515058, 518491, 522116, 525786, 529487, 533280, 537410, 542419, 548950, 557333, 567465, 579194, 592684, 608213, 625639, 644236, 663172, 682169, 701676, 722365, 744441, 767402, 790437, 812934, 834536, 854745, 872728, 887561, 898659, 905868, 909212, 908624, 903888, 894795, 881475, 864719, 845830, 825908, 805191, 783301, 760197, 736665, 713683, 691561, 670101, 649527, 630725, 614315, 599845, 586305, 573270, 561139, 550380, 541033, 533035, 526480, 521205, 516447, 511402, 506033, 501021, 497014, 494215, 492526, 491648, 490973, 489864, 488309]
62540D88309j263k49Q00J441J866K314K629K592K365K229K180K040J894K108K912
62525E14167M138N349O150O454O622P324Q979J1270J3305J4427J4929J5824J7801
62512F46739K0445K2677K3902K4479K4905K5028K4451K3375K2383K1457J9933
62501H99774J7552J4894J2359R455N674J568j811m267o445q526r789r702q803
62488I11933q063p729p189n816l737j732n32p2M18J459K697L471L746L795L236
62473H95885J203k264n789q179r784j1836j4840j8190k1070k3083k4190k4552
62461G33311k4461k4084k3319k2199k1095k0197j9071j7246j4986j2916j1113
62450E22624r263p528o463n984n205l607j734m26O9l8n76j332j844j727j019j3
$$ y = [488309, 487046, 486797, 487597, 489038, 490904, 493218, 495847, 498439, 500804, 503033, 505213, 507253, 509147, 511255, 514167, 518305, 523654, 529804, 536258, 542880, 550204, 559183, 570453, 583758, 598185, 613114, 628938, 646739, 667184, 689861, 713763, 738242, 763147, 788175, 812626, 836001, 858384, 879841, 899774, 917326, 932220, 944579, 954034, 959708, 961276, 959465, 955198, 948753, 940227, 930438, 920736, 911933, 903870, 896141, 888952, 883136, 879399, 877667, 877135, 877063, 877481, 878940, 881637, 885108, 888854, 892649, 895885, 897088, 894824, 889035, 880856, 871072, 859236, 844396, 826206, 805136, 782053, 757863, 733311, 708850, 684766, 661447, 639248, 618153, 597956, 578885, 561639, 546653, 533737, 522624, 513361, 505833, 499370, 493386, 488181, 484574, 482840, 482414, 482483, 482445, 481869, 480537, 478693, 476966, 475947, 475934]
62434D75934R16J290P65k79q99o50p9J15o5l67r07j701k088j474m39j79q90j508
62416D67495j212l47L10M60J57n76j508j989j519l21R15J641J645R89R8l75q6
62399D65777P20J685K710L620L920L432K874L156M157M821M523L792L444L587
62385E12218L778L844L995M290M464M349M240M615N614O896P950Q561Q912R303
62371E93029R792J0180J0370J0640J1453J3000J5055J7283J9587K2038K4591K7066
62359G84084K9450L1984L4803L7596L9855M1461M2838M4394M6000M7002M6764
62348A226231M5060M2038L7854L2456K5789J8186J0361K846m363j1354j7707k2839
62336A384558k6896l0713l4621l7878l9693m0366m0774m1028m0436l8772l6737
$$ y = [475934, 476850, 478140, 478905, 478626, 477727, 477077, 476998, 477113, 477048, 476681, 475774, 474073, 471985, 470511, 470072, 469893, 469003, 467495, 466283, 465936, 466246, 466706, 466863, 466287, 464779, 462790, 461271, 460950, 461865, 463506, 465151, 466140, 466238, 465863, 465777, 466497, 468182, 470892, 474512, 478432, 481864, 484738, 487894, 492051, 496872, 501395, 505187, 508631, 512218, 515996, 519840, 523835, 528125, 532589, 536938, 541178, 545793, 551407, 558303, 566253, 574814, 583726, 593029, 602821, 613001, 623371, 634011, 645464, 658464, 673519, 690802, 710389, 732427, 757018, 784084, 813534, 845518, 880321, 917917, 957772, 999233, 1042071, 1086465, 1132465, 1179467, 1226231, 1271291, 1313329, 1351183, 1383639, 1409428, 1427614, 1437975, 1440821, 1436458, 1425104, 1407397, 1384558, 1357662, 1326949, 1292328, 1254450, 1214757, 1174391, 1133617, 1092589, 1052153, 1013381, 976644]
62325I76644l4912l3006l0570k7949k5891k4519k3292k1884k0474j9189j7850
62314F97108j6391j5136j4322j3654j2629j1090r327p770o730o243n935n241l992
62301E68648k628j629r65l60J31K91L05N98J061J100N86K04M86J082J498K010
62285E72418L097M259M402L427K526K541K854K478J611J292J838K457K418J924
62271F09542J651K020L074M673O496Q250J0090J2513J5519J8312K0252K1822K4082
62258G58296K7236L0429L3108L5924L9730M4082M7460M8978M9190M8958M8151
62247A211542M5911M1839L6215K9244K0861J1479K243n873j2843j9111k4755k9577
62235A307175l3665l7239m0107m1893m2707m3018m2841m1737l9669l7243l4770
$$ y = [976644, 941732, 908726, 878156, 850207, 824316, 799797, 776505, 754621, 734147, 714958, 697108, 680717, 665581, 651259, 637605, 624976, 613886, 604559, 596789, 590059, 583816, 577881, 572640, 568648, 566020, 564391, 563426, 563066, 563197, 563488, 563793, 564391, 565452, 566552, 567138, 567342, 567828, 568910, 570408, 572418, 575515, 579774, 584176, 587603, 590129, 592670, 595524, 598002, 599613, 600905, 602743, 605200, 607618, 609542, 611193, 613213, 616287, 620960, 627456, 635706, 645796, 658309, 673828, 692140, 712392, 734214, 758296, 785532, 815961, 849069, 884993, 924723, 968805, 1016265, 1065243, 1114433, 1163391, 1211542, 1257453, 1299292, 1335507, 1364751, 1385612, 1397091, 1399334, 1393461, 1380618, 1361507, 1336752, 1307175, 1273510, 1236271, 1196164, 1154271, 1111564, 1068546, 1025705, 983968, 944299, 907056, 872286]
62224H72286l1820k8159k4521k1797j9750j7371j4377j1711j0291r856r348q215
62212F65070o988o616p313q236q303p358o266n798n731n365m538l665k969k260
62198E83664j498q95l26O90K170L363L764L904M576N708O652P304Q091Q871Q826
62183F44864P760O797P114Q490R666R897R523R132Q818Q386P832P327P061P282
62169G59949Q336J0391J3246J6448J9562K2299K4626K6812K9147L1522L3392L4268
62157A029998L3993L2495K9526K4919J8985J2467O123M01m625r128j3203j6622
62145A145329j9167k1193k3450k6059k8109k8682k7891k6471k4635k2011j8529
62134H79132j4589j0441o085j869J626M503P629J1383J5000J7618J9406K1140
$$ y = [872286, 840466, 812307, 787786, 765989, 746239, 728868, 714491, 702780, 692489, 682633, 673285, 665070, 658082, 651466, 644153, 635917, 627614, 620256, 613990, 608192, 602461, 597096, 592558, 588893, 585924, 583664, 582166, 581271, 580945, 581635, 583805, 587168, 590932, 594836, 599412, 605120, 611772, 619076, 627167, 636038, 644864, 652624, 659421, 666535, 675025, 684691, 694588, 704111, 713243, 722061, 730447, 738279, 745606, 752667, 759949, 768285, 778676, 791922, 808370, 827932, 850231, 874857, 901669, 930816, 962338, 995730, 1029998, 1063991, 1096486, 1126012, 1150931, 1169916, 1182383, 1188506, 1188907, 1184282, 1175154, 1161951, 1145329, 1126162, 1104969, 1081519, 1055460, 1027351, 998669, 970778, 944307, 919672, 897661, 879132, 864543, 854102, 848017, 846148, 847774, 852277, 859906, 871289, 886289, 903907, 923313, 944453]
62122I44453K3145K5278K7477K9601L1013L1007K9605K7387K4690K1562J8360
62111A233578J5612J3189J0247O202J373l401p218r228q983p029m658k693r16
62098A236075J138L292N143O934R322J2387J5435J7873J9832K1670K3172K3641
62086A395914K2787K1311K0291K0133K0282K0064J9569J9483K0214K1512K2855
62075A624415K4003K5078K6299K7631K8644K8823K8115K6933K5373K2833J8899
62064A907046J4400J0894R096Q455Q310Q747J0035J1891J3792J5502J6857J7432
62052B052457J6916J5518J3605J1218Q319N175J981j687o502j2598j9568k7063
62040B057771l4900m2612m9491n5184n9904o3972o7390o9919p1282p1314p0068
$$ y = [944453, 967598, 992876, 1020353, 1049954, 1080967, 1111974, 1141579, 1168966, 1193656, 1215218, 1233578, 1249190, 1262379, 1272626, 1278828, 1280201, 1276800, 1269582, 1260354, 1251371, 1244342, 1239684, 1236991, 1236075, 1237213, 1240505, 1245648, 1252582, 1261904, 1274291, 1289726, 1307599, 1327431, 1349101, 1372273, 1395914, 1418701, 1440012, 1460303, 1480436, 1500718, 1520782, 1540351, 1559834, 1580048, 1601560, 1624415, 1648418, 1673496, 1699795, 1727426, 1756070, 1784893, 1813008, 1839941, 1865314, 1888147, 1907046, 1921446, 1932340, 1941436, 1949891, 1958201, 1966948, 1976983, 1988874, 2002666, 2018168, 2035025, 2052457, 2069373, 2084891, 2098496, 2109714, 2118033, 2123208, 2125189, 2123502, 2117000, 2104402, 2084834, 2057771, 2022871, 1980259, 1930768, 1875584, 1815680, 1751708, 1684318, 1614399, 1543117, 1471803, 1401735]
62029A401735o7866o5045o1793n8238n4493n0454m5842m0803l6115l2440k9633
62018H59013k7228k5209k3765k2521k0842j8827j7228j6216j5003j2909j0194
62007F49071p552n289l413k016j092k88P66K011L095L781M089M151M052L570K198
61992F57134k45k980m870n722o451p753r262j0331j0919j1206j0937r944q849
61979E57665q452q669q766q435p908p193o032m634l711l472l306k644j704j008
61965D81731n95q6P09J508J877J716J456J655K304K766K673K484K800L497M192
61950E10687N194P120R614J1493J2291J2760J3601J4623J5546J6659J8103J9397
61938F67088K0348K1631K3583K5190K5301K4276K3292K2474K1052J9081J7505
$$ y = [1401735, 1333869, 1268824, 1207031, 1148793, 1094300, 1043846, 998004, 957201, 921086, 888646, 859013, 831785, 806576, 782811, 760290, 739448, 720621, 703393, 687177, 672174, 659265, 649071, 641519, 636230, 632817, 630801, 629709, 629421, 630187, 632198, 635293, 639074, 643163, 647314, 651366, 654936, 657134, 656889, 653909, 649039, 643317, 636866, 629113, 619851, 609520, 598601, 587395, 576458, 566514, 557665, 549213, 540544, 531778, 523343, 515435, 508242, 502210, 497576, 493865, 490393, 487087, 484443, 482739, 481731, 481136, 481050, 481759, 483267, 485144, 486860, 488316, 489971, 492275, 495041, 497714, 500198, 502998, 506495, 510687, 515881, 523001, 532615, 544108, 556399, 569159, 582760, 597383, 612929, 629588, 647691, 667088, 687436, 709067, 732650, 757840, 783141, 807417, 830709, 853183, 874235, 893316, 910821]
61927I10821J6397J4600J1659Q818P276O468N005K623J82j840l777n766p219p517
61913I57730o681n151l240j039J392L911O436R071J1930J4714J6608J6953J5954
61900A038588J4306J2154Q995M780M05l325o672j0407j4624j8608k1623k3374
61888I80595k3972k3948k4057k4535k4756k4044k2566k0937j9297j7432j5608
61877G39443j4488j4152j3917j3175j1987j0666r320p874o177m059j699L12J701
61864F33942L106N201P432Q596Q714R306J1445J4471J7150J9272K1461K3993K6555
61851H10644K8861L0903L2741L4479L6212L7689L8427L8343L7885L7176L5587
61840A198947L2633K8779K4743K0407J5186R242L663n72l327n051o202o856o573
$$ y = [910821, 927218, 941818, 953477, 962295, 969571, 976039, 981044, 983667, 983849, 982009, 978232, 972466, 965247, 957730, 951049, 945898, 942658, 941619, 943011, 946922, 953358, 962429, 974359, 989073, 1005681, 1022634, 1038588, 1052894, 1065048, 1074043, 1078823, 1079228, 1075903, 1069231, 1058824, 1044200, 1025592, 1003969, 980595, 956623, 932675, 908618, 884083, 859327, 835283, 812717, 791780, 772483, 755051, 739443, 724955, 710803, 696886, 683711, 671724, 661058, 651738, 643864, 637687, 633628, 631929, 632241, 633942, 637048, 642249, 649681, 658277, 666991, 676297, 687742, 702213, 719363, 738635, 760096, 784089, 810644, 839505, 870408, 903149, 937628, 973840, 1011529, 1049956, 1088299, 1126184, 1163360, 1198947, 1231580, 1260359, 1285102, 1305509, 1320695, 1329937, 1333600, 1333028, 1329701, 1324650, 1318448, 1311592, 1305019]
61827A305019m687j118L267P331J0581J3152J5182J6465J6529J4810J1074N912
61815A413517M05n055j1064j7975k4922l0677l5024l8493m1182m2701m3059m2751
61803A081019m1985m0547l8426l5929l3209l0214k7092k4116k1350j8827j6818
61792G52506j5402j4072j2471j1144j0782j1006j0849j0154r492q927q066p232
61780F22909p309q157q448p441n864m685m025l706l782m017l791l086k614k540
61766E53444k110j124n87j096j687j309n29n10j049q94L19J683K389K477K285
61751E51702K017J876J985K237K576L120L668L667L150L057L927N011N475N735
61737E99203O584P661Q093Q113Q653R625J0051R839R991J0842J1451J1062J0029
$$ y = [1305019, 1300332, 1299214, 1302481, 1309812, 1320393, 1333545, 1348727, 1365192, 1381721, 1396531, 1407605, 1413517, 1413922, 1408867, 1397803, 1379828, 1354906, 1324229, 1289205, 1250712, 1209530, 1166829, 1123770, 1081019, 1039034, 998487, 960061, 924132, 890923, 860709, 833617, 809501, 788151, 769324, 752506, 737104, 723032, 710561, 699417, 688635, 677629, 666780, 656626, 647134, 638207, 630141, 622909, 615600, 607443, 598995, 591554, 585690, 581005, 576980, 573274, 569492, 565475, 561684, 558598, 555984, 553444, 551334, 550210, 549623, 548527, 546840, 545531, 545002, 544492, 543443, 542549, 542868, 544551, 546940, 549417, 551702, 553719, 555595, 557580, 559817, 562393, 565513, 569181, 572848, 575998, 579055, 582982, 587993, 593468, 599203, 605787, 613448, 621541, 629654, 638307, 647932, 657983, 667822, 677813, 688655, 700106, 711168, 721197]
61724G21197Q892P672O525N994O084N910M887L574K800K541K180J314r7j892l666
61709G73915n006n986o942p705p775p353p285p642p348n746l705k489k235k233
61695F94465k060j683r84n8M52L2q48j268r54l18K94P17O94J46m40n48m52q48
61677F86339j796k669l130l517m148m811n132n066m860m801n043n465n694n455
61663F24752m816l927k803j624r76j259k025k365j967j297q29n61l72l19m18m71
61647E98723l72k86l93n87n83k03M46R73R83M66j50n24q00j273j813k059k033
61630E90515k128k478k833l049l306l664l836l601l076k422j655r03m89m55l23
61615E56297L14J191J734J792J646J438J029L39n89j796l264m474m615l492j821
$$ y = [721197, 730089, 737761, 744286, 750280, 756364, 762274, 767161, 770735, 773535, 776076, 778256, 779570, 779473, 777581, 773915, 768909, 762923, 755981, 748276, 740501, 733148, 725863, 718221, 710873, 705127, 701422, 698933, 696698, 694465, 692405, 690722, 689738, 689680, 690132, 690164, 689316, 688048, 687094, 686776, 687070, 687787, 688481, 688627, 688187, 687639, 687187, 686339, 684543, 681874, 678744, 675227, 671079, 666268, 661136, 656070, 651210, 646409, 641366, 635901, 630207, 624752, 619936, 616009, 613206, 611582, 610606, 609347, 607322, 604957, 602990, 601693, 600864, 600303, 599931, 599612, 599194, 598723, 598351, 598065, 597672, 597085, 596502, 596299, 596745, 597718, 598701, 599167, 599017, 598493, 597693, 596420, 594607, 592548, 590515, 588387, 585909, 583076, 580027, 576721, 573057, 569221, 565620, 562544, 560122, 558467, 557564, 557075, 556620, 556297, 556611, 557802, 559536, 561328, 562974, 564412, 565441, 565780, 565191, 563395, 560131, 555657, 551042, 547550, 545729]
61600E45729l80P42J740K371K294J896K014K747L237K952K491K553K647J643n36
61585E74140k599l376l068k689k830l317l795m170m540n034n768o754p801q567
61571E09832q802q571q236q115q042p476o225m869m149m047l918l487l177l256
61557D27462l275k801k269k478l372l980l696l039k803k777k007l16J056Q87k91
61542C96301p26L32J708K044J564J367J646J705J406J359J657J614J072P72R56
61527D14777O30r49k967m028l841l145k511k050j830j789j546j036r45j721k645
61512C84404k714k058j511j170n62K0l02j449k252k129j785j820j821j333p89
61497C62729p63j096j402j772k268k306j366L8P81L77p30j788k240j825p12N31
$$ y = [545729, 545349, 546091, 547831, 550202, 552496, 554392, 556406, 559153, 562390, 565342, 567833, 570386, 573033, 574676, 574140, 571541, 568165, 565097, 562408, 559578, 556261, 552466, 548296, 543756, 538722, 532954, 526200, 518399, 509832, 501030, 492459, 484223, 476108, 468066, 460590, 454365, 449496, 445347, 441300, 437382, 433895, 430718, 427462, 424187, 421386, 419117, 416639, 413267, 409287, 405591, 402552, 399749, 396972, 394965, 394649, 395705, 396592, 396301, 395575, 395907, 397615, 399659, 401223, 402590, 404236, 405941, 407347, 408706, 410363, 411977, 413049, 413821, 414777, 415407, 414458, 411491, 407463, 403622, 400477, 397966, 395916, 394086, 392297, 390751, 389715, 388770, 387049, 384404, 381690, 379632, 378121, 376951, 376389, 376409, 376107, 374658, 372406, 370277, 368492, 366672, 364851, 363518, 362729, 361966, 360870, 359468, 357696, 355428, 353122, 351756, 351794, 352575, 352952, 352222, 350434, 348194, 346369, 345657, 346188]
61481C46188J397J749J656J308J205J822K789L024K085P97P1k12n29o59k52J19
61465C62558l87j376j536n23N73Q37O66Q48J357J582J229N06k13n22k06M15P14
61448C66522O44Q85J802K707K723J988J413J489J929K377K866L482M088M530M806
61433D04251M925M834M594M318L927L243K400J851J800J926J860J670J679J953
61419D45231K285K475K415K030J471J216J595K233K310J536M40l66q62j394k100
61404D60515k904l832m877n668n655m756l583k911l005l439l530l011k363k351
61390D08630l103l857l797k939j926j157n56k8L27M41K87k67j195j918j760r03
61374C86279k57k05j47L80Q85P79M84Q25J679K102J745J281J331J727K059K366
$$ y = [346188, 347585, 349334, 350990, 352298, 353503, 355325, 358114, 361138, 363223, 364020, 364091, 363879, 363350, 362691, 362439, 362558, 362171, 360795, 359259, 358736, 359309, 360146, 360812, 361660, 363017, 364599, 365828, 366334, 366121, 365599, 365393, 365808, 366522, 367166, 368051, 369853, 372560, 375283, 377271, 378684, 380173, 382102, 384479, 387345, 390827, 394915, 399445, 404251, 409176, 414010, 418604, 422922, 426849, 430092, 432492, 434343, 436143, 438069, 439929, 441599, 443278, 445231, 447516, 449991, 452406, 454436, 455907, 457123, 458718, 460951, 463261, 464797, 465237, 464871, 464009, 462615, 460515, 457611, 453779, 448902, 443234, 437579, 432823, 429240, 426329, 423324, 419885, 416355, 413344, 410981, 408630, 405527, 401670, 397873, 394934, 393008, 391851, 391295, 391267, 391594, 392035, 392322, 392055, 390860, 388942, 387182, 386279, 386022, 385817, 385670, 386050, 386935, 387714, 388198, 389023, 390702, 392804, 394549, 395830, 397161, 398888, 400947, 403313]
61358D03313K850L414L865M288M838N390N768O113O681P363P718P531P161P273
61344D83566Q297J0012J1606J2235J1747J0796J0154J0004R983R710Q978P593
61332F04681N440K855O07p89j644k747m396o059p038p276p257p215o771n536l765
61317E53090k218j416j301j556j943k257k265j902j361q17j21R14K054K750K822
61302E44473K780L219M076M737M882M859N122N514N474M836M032L433K759J434
61288F01630o19k831m513n313n249m625l914l448l053k309j214l16QJ15N56J223
61272E66128J508J249J115J824L323M906N927O205N922N462N300N771O803P936
61258F29379Q705Q993R129R591J0538J1596J2248J2429J2559J2895J3032J2243
$$ y = [403313, 406163, 409577, 413442, 417730, 422568, 427958, 433726, 439839, 446520, 453883, 461601, 469132, 476293, 483566, 491863, 501875, 513481, 525716, 537463, 548259, 558413, 568417, 578400, 588110, 597088, 604681, 610121, 612976, 613583, 612794, 611150, 608403, 604007, 597948, 590910, 583634, 576377, 569162, 562391, 556855, 553090, 550872, 549456, 548155, 546599, 544656, 542399, 540134, 538232, 536871, 536054, 535933, 536847, 538901, 541651, 544473, 547253, 550472, 554548, 559285, 564167, 569026, 574148, 579662, 585136, 589972, 594004, 597437, 600196, 601630, 601011, 598180, 593667, 588354, 583105, 578480, 574566, 571118, 568065, 565756, 564542, 564226, 564234, 564349, 564905, 566128, 567636, 568885, 570000, 571824, 575147, 580053, 585980, 592185, 598107, 603569, 608869, 614640, 621443, 629379, 638084, 647077, 656206, 665797, 676335, 687931, 700179, 712608, 725167, 738062, 751094, 763337]
61246G63337J0186P064L310n77l948o365q105r921j2005j3490j3404j1927j0306
61233F93849r514r343q858p501n558l760k614k075j694j027L6J311K588L781M838
61218F54459N642O160O609P247P927Q025P074N433M046L456L314L035K663K730
61204G27820L405M388N606P444R940J2259J3534J3987J4699J6350J8675K1160
61192H69267K3685K6260K8545L0128L1014L1545L1820L1589L0733K9551K8367
61181A192504K7054K5207K2765K0102J7502J4813J1847Q843O172L692Q22k677
61169A348646o437j0031j3475j6967k0473k3743k6505k8500k9691l0581l1830
61158A110413l3256l3762l2728l0985k9740k8980k7713k5562k3146k0907j8524
$$ y = [763337, 773523, 780587, 783897, 783320, 779372, 773007, 764902, 754981, 742976, 729486, 716082, 704155, 693849, 684335, 674992, 666134, 658633, 653075, 649315, 646701, 644626, 642932, 641905, 641941, 643252, 645840, 649621, 654459, 660101, 666261, 672870, 680117, 688044, 696069, 703143, 708576, 712622, 716078, 719392, 722427, 725090, 727820, 731225, 735613, 741219, 748663, 758603, 770862, 784396, 798383, 813082, 829432, 848107, 869267, 892952, 919212, 947757, 977885, 1008899, 1040444, 1072264, 1103853, 1134586, 1164137, 1192504, 1219558, 1244765, 1267530, 1287632, 1305134, 1319947, 1331794, 1340637, 1346809, 1350501, 1351323, 1348646, 1342209, 1332178, 1318703, 1301736, 1281263, 1257520, 1231015, 1202515, 1172824, 1142243, 1110413, 1077157, 1043395, 1010667, 979682, 949942, 920962, 893249, 867687, 844541, 823634, 805110]
61147H05110j5766j3048j0747q595o245l889j864j16J483K721L473M136N045N785
61133G67483N797N485N965P682R936J1980J3941J6316J9041K1635K4136K7161
61121I36558L0940L4739L7681L9846M2040M4584M6921M8552M9700N0678N1216
61110A413455N0967N0198M9238M7604M4611M0654L6818L3217K8855K3390J7855
61099A836862J2987Q009J955m617j0330j4913j9362k4423k9905l5337m0381m4579
61087A635966m7469m9167n0263n1092n1545n1462n0670m8814m5840m2521l9814
61076A107309l7629l5035l1720k8475k5976k3846k1252j7944j4347j1133q863
61065H51089p646o840n576l772k149j095k3J725L940N919P380Q592R866J1352
$$ y = [805110, 789344, 776296, 765549, 756954, 750709, 746820, 744956, 744840, 746323, 749044, 752517, 756653, 761698, 767483, 773280, 778765, 784730, 792412, 802348, 814328, 828269, 844585, 863626, 885261, 909397, 936558, 967498, 1002237, 1039918, 1079764, 1121804, 1166388, 1213309, 1261861, 1311561, 1362239, 1413455, 1464422, 1514620, 1563858, 1611462, 1656073, 1696727, 1733545, 1766762, 1795617, 1819007, 1836862, 1849849, 1857858, 1859813, 1855196, 1844866, 1829953, 1810591, 1786168, 1756263, 1720926, 1680545, 1635966, 1588497, 1539330, 1489067, 1437975, 1386430, 1334968, 1284298, 1235484, 1189644, 1147123, 1107309, 1069680, 1034645, 1002925, 974450, 948474, 924628, 903376, 885432, 871085, 859952, 851089, 843443, 836603, 831027, 827255, 825106, 824011, 823988, 825713, 829653, 835572, 842952, 851544, 861410, 872762]
61051H72762J3088J4912J6565J8076J9795K1820K3823K5714K7951L0698L3226
61040A118430L4758L5589L6667L8214L9520M0110M0380M0887M1557M1939M1821
61029A549872M1320M0547L9544L8433L7441L6858L6943L7737L8885L9877M0626
61018A978083M1795M4348M8923N5734O5086P7732R4414J15097J38906J65030J93647
61007C018795K25850K63035L06683L58511M19763M89473N63372O35114O99374
60998F979970P54967Q06125Q61257R29619J017810J127070J249307J359436J409514
60989A6495075J338686J105808P27158K85424j06132l60316m50400m04200k79261
60980A8351842j47392q7922j68172m07877p56719j113942j381274j508749j502948
$$ y = [872762, 885850, 900762, 917327, 935403, 955198, 977018, 1000841, 1026555, 1054506, 1085204, 1118430, 1153188, 1188777, 1225444, 1263658, 1303178, 1343288, 1383668, 1424555, 1466112, 1508051, 1549872, 1591192, 1631739, 1671283, 1709716, 1747157, 1784015, 1820958, 1858695, 1897580, 1937457, 1978083, 2019878, 2064226, 2113149, 2168883, 2233969, 2311701, 2406115, 2521212, 2660118, 2825148, 3018795, 3244645, 3507680, 3814363, 4172874, 4592637, 5082110, 5645482, 6280596, 6979970, 7734937, 8541062, 9402319, 10331938, 11349748, 12476818, 13726125, 15085561, 16495075, 17833761, 18939569, 19666727, 19952151, 19846019, 19485703, 19035303, 18631103, 18351842, 18204450, 18116528, 17948356, 17540479, 16783760, 15669818, 14288544, 12779795, 11276847]
60971A1276847j403389j254140j089034r29450p86363o62991n58221m69972l96560
60962C726727l36142k86293k44733k10133j81807j58832j39888j23971j10774
60953A934154r9993r0648q1541p2356o3837n6690n0699m5178m0047l6039l3834
60942A263292l3260l3436l3521l3152l2262l0805k8856k6863k5401k4543k3734
60931I37459k2469k0874j9407j8208j7046j5741j4302j2793j1394j0505j0371
60920G64349j0683j0889j0823j0618j0139r152p977p352p398p385o729n674m643
60907F54887l540k176r43m96r87k030l136l874l955l648l748m682n831o355o337
60892F03149o528p121p503p274o823o673o762o687o248n540m750m106l807l777
$$ y = [11276847, 9873458, 8619318, 7530284, 6600834, 5814471, 5151480, 4593259, 4123287, 3726727, 3390585, 3104292, 2859559, 2649426, 2467619, 2308787, 2168899, 2044928, 1934154, 1834161, 1743513, 1661972, 1589616, 1525779, 1469089, 1418390, 1373212, 1333165, 1297126, 1263292, 1230032, 1196596, 1163075, 1129923, 1097661, 1066856, 1038000, 1011137, 985736, 961193, 937459, 914990, 894116, 874709, 856501, 839455, 823714, 809412, 796619, 785225, 774720, 764349, 753666, 742777, 731954, 721336, 711197, 702045, 694068, 686716, 679318, 671933, 665204, 659530, 654887, 651347, 649171, 648228, 647732, 646745, 644715, 641579, 637705, 633750, 630102, 626354, 621672, 615841, 609486, 603149, 596621, 589500, 581997, 574723, 567900, 561227, 554465, 547778, 541530, 535990, 531240, 527134, 523327, 519550]
60878E19550l621l086k408k083k291k671k688k152j288l35P34J887K653K525J807
60863E06533J517K169L061L249K836K718L245L847M042M121M496M864M548L523
60849E54769K571K325K439K025P53p74j786k207k528l022l497l748l891m205m880
60834E34344n989p330q284q285p497o616n929n104m040l224k884k472j545n88
60820D64557l28o35q28o62l69rN04J016J460K278L740N118N406M719M115M116
60804D94198M303M345M396M429M116L646L634L978L782K791J941J922K135J787
60790E41403J181J019J093O40l72j273j837k518l523m330m349l632k853k764l571
60775E14314m719n388n395n310n524n624n063m012l092k586k388k455k692k676
$$ y = [519550, 515929, 512843, 510435, 508352, 506061, 503390, 500702, 498550, 497262, 496927, 497661, 499548, 502201, 504726, 506533, 508050, 510219, 513280, 516529, 519365, 522083, 525328, 529175, 533217, 537338, 541834, 546698, 551246, 554769, 557340, 559665, 562104, 564129, 564882, 564108, 562322, 560115, 557587, 554565, 551068, 547320, 543429, 539224, 534344, 528355, 521025, 512741, 504456, 496959, 490343, 484414, 479310, 475270, 472046, 469162, 466690, 465145, 464557, 464229, 463594, 462766, 462104, 461735, 461726, 462230, 463246, 464706, 466984, 470724, 475842, 481248, 485967, 490082, 494198, 498501, 502846, 507242, 511671, 515787, 519433, 523067, 527045, 530827, 533618, 535559, 537481, 539616, 541403, 542584, 543603, 544696, 545336, 544964, 543691, 541854, 539336, 535813, 531483, 527134, 523502, 520649, 517885, 514314, 509595, 504207, 498812, 493502, 487978, 482354, 477291, 473279, 470187, 467601, 465213, 462758, 460066, 457390]
60761D57390k028j037l84l04m78o32p15n46J79J306K127K057J237L60P6N73J558
60744D60739K536L206L578L721L610L262K789K174J350O44P36J803L086L689L527
60729E00450L070K538J952J676K157L124L758L708L352K937K140P91m71p29J59
60714E30612J299J551N57r26j728j467r04j022j937l047l938m594m921m619l726
60699E01190k766k259k373k964l652l903l517k946k659k386j596p05p91j952k819
60684D63902k234o92N01R26J185J731K380K867L205L406L330K953K502K249K367
60669D90578K837L402L774M011M417M862M577L120J202N5L8M61O59O56O64N45
60653E25858O6o56j262j494j228m63M97J082R77N06J76Rl81j080j663j836j880
$$ y = [457390, 455362, 454325, 453941, 453637, 453159, 452527, 451812, 451266, 451445, 452751, 454878, 456935, 458172, 458532, 458608, 459181, 460739, 463275, 466481, 470059, 473780, 477390, 480652, 483441, 485615, 486965, 487609, 488345, 490148, 493234, 496923, 500450, 503520, 506058, 508010, 509686, 511843, 514967, 518725, 522433, 525785, 528722, 530862, 531653, 531182, 530453, 530612, 531911, 533462, 534019, 533093, 531365, 529898, 528994, 527972, 526035, 522988, 519050, 514456, 509535, 504916, 501190, 498424, 496165, 493792, 490828, 487176, 483273, 479756, 476810, 474151, 471765, 470169, 469464, 468673, 466721, 463902, 461668, 460976, 461477, 462403, 463588, 465319, 467699, 470566, 473771, 477177, 480507, 483460, 485962, 488211, 490578, 493415, 496817, 500591, 504602, 509019, 513881, 518458, 521578, 522780, 522835, 522873, 523334, 523993, 524649, 525313, 525858, 525924, 525268, 524006, 522512, 521284, 520821, 521318, 522400, 523377, 523883, 524059, 524068, 523687, 522607, 520944, 519108, 517228]
60636E17228k115k210j555k82O30N44OK2Q48J927K792L405L688L453K961K931
60620E34273L620M307M140L183K219J775J726J708J549J340J387J933K711K965
60606E68836K293J217O28P69J204J589J978K415K728K865K966L063L016K848K695
60591F01110K377J571N16P5O54J563J874J594J396J469J285N63k08n35o91j295
60575F13318k293k905k588j651p23J1P43J407J616J322J128J669K894M166M959
60560F23073N169M951M551M278M319M484M393L939L363K872K422K013J908K373
60546F74108L374M575N568N996N770N272N157N686O360O422N752N067N212O248
60532G50567P323P534O919O414O711P473P982Q294R122J0607J1997J2725J3182
$$ y = [517228, 515113, 512903, 511348, 511066, 511696, 512240, 512246, 512268, 513116, 515043, 517835, 521240, 524928, 528381, 531342, 534273, 537893, 542200, 546340, 549523, 551742, 553517, 555243, 556951, 558500, 559840, 561227, 563160, 565871, 568836, 571129, 572346, 572974, 573743, 574947, 576536, 578514, 580929, 583657, 586522, 589488, 592551, 595567, 598415, 601110, 603487, 605058, 605574, 605649, 606303, 607866, 609740, 611334, 612730, 614199, 615484, 616047, 615839, 615304, 614613, 613318, 611025, 608120, 605532, 603881, 603158, 603169, 603912, 605319, 606935, 608257, 609385, 611054, 613948, 618114, 623073, 628242, 633193, 637744, 642022, 646341, 650825, 655218, 659157, 662520, 665392, 667814, 669827, 671735, 674108, 677482, 682057, 687625, 693621, 699391, 704663, 709820, 715506, 721866, 728288, 734040, 739107, 744319, 750567, 757890, 765424, 772343, 778757, 785468, 792941, 800923, 809217, 818339, 828946, 840943, 853668, 866850]
60519H66850J3938J4845J5554J6343J7684J9191J9940J9771J9546J9950K0765
60508A064377K1485K1970K2216K2037K1421K0768K0392K0090J9494J8544J7315
60497A290109J5782J4085J2672J1725J0694Q890O335L605J012j678m827q613j2970
60484A346821j7454k1423k4693k7772l0975l3632l4907l5073l5048l4792l3287
60473A017765l0432k7741k6451k5863k4520k2356k0562j9662j8919j7651j6130
60462G67478j4828j3739j2797j2281j2215j1906j0807r476r060r825j0758j0693
60450F29093r501q075p410p751q373q197o807n000m118m721o038o812o501n548
60436E34241m669m183m023m037m082m009l762l520l520l724l843l680l311k797
$$ y = [866850, 880788, 895633, 911187, 927530, 945214, 964405, 984345, 1004116, 1023662, 1043612, 1064377, 1085862, 1107832, 1130048, 1152085, 1173506, 1194274, 1214666, 1234756, 1254250, 1272794, 1290109, 1305891, 1319976, 1332648, 1344373, 1355067, 1363957, 1370292, 1373897, 1374909, 1373231, 1368404, 1359791, 1346821, 1329367, 1307944, 1283251, 1255479, 1224504, 1190872, 1155965, 1120892, 1085844, 1051052, 1017765, 987333, 959592, 933141, 907278, 882758, 860402, 839840, 820178, 801259, 783608, 767478, 752650, 738911, 726114, 713833, 701618, 689712, 678905, 669429, 660369, 650544, 639786, 629093, 619592, 611517, 604107, 596356, 587983, 579786, 572979, 567979, 563861, 559140, 553102, 546290, 539789, 534241, 529572, 525389, 521366, 517329, 513247, 509238, 505476, 501956, 498436, 494712, 490869, 487189, 483878, 481081]
60422D81081k002r23o4q2r69j860j882j069k66j12l80l83J36P46R93R75J041J099
60404D76079O53l92j369j553r31l0P99J474J808J570R14L13M1O8M52J240J965
60387D83101J931J268R81J519J928J211q4m93L38J279J360Q64M92L10Pm02o65
60370D94945p37p32p06p88j163j599j411l77O63O97j97j039j205q93n03j97j04
60353D84654l10m62qR66J680J672J399J451J738J900K073K667L609M453N046N528
60337E18056N724N257M352L884M289M925M957M479M305M790N411N439M634L190
60323E83692J419l84j978l326m509n412n695n251m435l644k774j424L97K077K989
60308E51742L114K967L119L808M919O179P421Q673R893J0736J0809J0152R108
$$ y = [481081, 479079, 478156, 478092, 478010, 477041, 475181, 473299, 472230, 471964, 471852, 471472, 471089, 471225, 471971, 472964, 473939, 474980, 476079, 476732, 476340, 474971, 473418, 472487, 472457, 473256, 474730, 476538, 478108, 479022, 479335, 479376, 479444, 479896, 481136, 483101, 485032, 486300, 487281, 488800, 490728, 491939, 491855, 491362, 491700, 492979, 494339, 495203, 495695, 496005, 496012, 495610, 494945, 494208, 493476, 492770, 491982, 490819, 489220, 487809, 487432, 488095, 488792, 488595, 487556, 486351, 485458, 484955, 484758, 484654, 484344, 483882, 483874, 484840, 486520, 488192, 489591, 491042, 492780, 494680, 496753, 499420, 503029, 507482, 512528, 518056, 523780, 529037, 533389, 537273, 541562, 546487, 551444, 555923, 560228, 565018, 570429, 575868, 580502, 583692, 585111, 584727, 582749, 579423, 574914, 569502, 563807, 558556, 554121, 550477, 547703, 546279, 546676, 548753, 551742, 554856, 557823, 560942, 564750, 569669, 575848, 583269, 591942, 601835, 612571, 623380, 633532, 642640]
60295F42640P616N031R68l885q184j1037j2409j2601j1791j0205q331o765n879
60282E65168n626n532n008l962k961k554k538k303j746j291j062p51m13o01j367
60267E27453j824j315m47k10n35m83L27J305J868K091K299K608L016L470L708
60252E43331L531L287L528M145M298L417J786Mj614k943l837m321m559m485l944
60237E41624l277l145l465l228j884k05Q20J361K175L212L749L720L826M322M572
60222E54177M097L296K786K631K589K651K938L369L827M366N020N558N689N365
60208F08359M802M403M634N621O739O991O061M664L660L143K658J986J317Q24
60194F65862N14L72L69L76K96K64M05M99J80n62j347j863k149k360k487k421k112
$$ y = [642640, 650256, 655287, 656255, 652370, 644186, 633149, 620740, 608139, 596348, 586143, 577812, 571047, 565168, 559542, 554010, 549002, 545040, 542079, 539525, 536987, 534684, 532938, 531647, 530585, 529834, 529421, 528820, 527453, 525629, 524314, 523867, 523657, 523122, 522639, 522966, 524271, 526139, 528230, 530529, 533137, 536153, 539623, 543331, 546862, 550149, 553677, 557822, 562120, 565537, 567323, 567327, 565713, 562770, 558933, 554612, 550053, 545568, 541624, 538347, 535202, 531737, 528509, 526625, 526420, 527240, 528601, 530776, 533988, 537737, 541457, 545283, 549605, 554177, 558274, 561570, 564356, 566987, 569576, 572227, 575165, 578534, 582361, 586727, 591747, 597305, 602994, 608359, 613161, 617564, 622198, 627819, 634558, 641549, 647610, 652274, 655934, 659077, 661735, 663721, 665038, 665862, 666376, 666748, 667117, 667493, 667789, 668053, 668458, 668957, 669137, 668575, 667228, 665365, 663216, 660856, 658369, 655948, 653836]
60177F53836j661j295j271j613k035k256k333k414k220j165P88K754L698L453
60163F46266K711K148J947K105K722L725M592M751M191L481L175L444M149M958
60149F94365N390N057M091L126K684K806L307M174N358O500P203P562P996Q602
60135G68221R049R162R173R205Q851P624N670L685K112O78j173l490n612o757
60121H16398o684n786m559l265k111j386j136q72m6J156J899J626O24m47j233
60106G94178j671j697j283o84l34m67r77j589k077k423k726k928k568j199Q88
60091G72443K625L160K759K474L029M223N306N739N621N531N858O226N821M373
60077H35188K543J002m00k181m202n812o866p926r240j0237j0323r731r211r151
$$ y = [653836, 652175, 650880, 649609, 647996, 645961, 643705, 641372, 638958, 636738, 635573, 636361, 639115, 642813, 646266, 648977, 651125, 653072, 655177, 657899, 661624, 666216, 670967, 675158, 678639, 681814, 685258, 689407, 694365, 699755, 704812, 708903, 712029, 714713, 717519, 720826, 725000, 730358, 736858, 744061, 751623, 759619, 768221, 777270, 786432, 795605, 804810, 813661, 821285, 826955, 830640, 832752, 833430, 832257, 828767, 823155, 816398, 809714, 803928, 799369, 796104, 793993, 792607, 791471, 790599, 790553, 791709, 793608, 795234, 795858, 795411, 794178, 792507, 790810, 789527, 788843, 788509, 788042, 787065, 785476, 783399, 780976, 778250, 775322, 772754, 771555, 772443, 775068, 778228, 780987, 783461, 786490, 790713, 796019, 801758, 807379, 812910, 818768, 824994, 830815, 835188, 837731, 838733, 838333, 836152, 831950, 826138, 819272, 811346, 802106, 791869, 781546, 771815, 762604, 753453]
60063G53453r400r635r568q968p869o690n868n508n523n793n960n370l809k033
60049F61459j055q50m54O21J728K132K110K478L400M264M583M477M259L997L559
60034F96708K857J933J041M70N8q98k776m851n971o063o240p224q401q891q897
60019F42855r292j0254j1101j1338j1127j0721j0017q887p440n829m180k811k109
60006E37749k001j891j275k58O93J239J354J283J364J674J882J743J630K165L312
59991E50663M332M760M943N403O115O626O579N868M637L324K383J762J022N3p85
59976F07685j452k499m162n688o167n675n004m563m130l510k889k512k417k457
59962E54560k349j832j044m99m64n90m67j93r7k55o35j261j800j524l14Q02Q14
$$ y = [753453, 744053, 734418, 724850, 715882, 708013, 701323, 695455, 689947, 684424, 678631, 672671, 667301, 663492, 661459, 660404, 659554, 659100, 659721, 661449, 663581, 665691, 668169, 671569, 675833, 680416, 684893, 689152, 693149, 696708, 699565, 701498, 702539, 703009, 703067, 702169, 699393, 694542, 688571, 682508, 676268, 669044, 660643, 651752, 642855, 633563, 623309, 612208, 600870, 589743, 579022, 569005, 560118, 552678, 546849, 542669, 539858, 537749, 535748, 533857, 532582, 532324, 533017, 534256, 535610, 536893, 538257, 539931, 541813, 543556, 545186, 547351, 550663, 554995, 559755, 564698, 570101, 576216, 582842, 589421, 595289, 599926, 603250, 605633, 607395, 608417, 608470, 607685, 606233, 603734, 599572, 593884, 587717, 582042, 577038, 572475, 568345, 564835, 561946, 559434, 557017, 554560, 552211, 550379, 549335, 548836, 548372, 547782, 547315, 547122, 547025, 546770, 546135, 544874, 543074, 541550, 541236, 542038, 542852]
59945E42852K9n58p65j128j686j970k065k499l071k953k115j544j671j735j195
59930E17926o64q70j474j691j396r06l55J51L33K70M87R85R15L4m18O63K362K820
59912E19172J867J190J867L051L527L398L507L947M100L802L598L833M093L848
59898E64800L262K966L160L323L020K630K825L572M170M298M447N090N980O564
59884F20107O659O418O037N838O135O634O479N416M425M528N339N445M073J705
59870F95238p50k738m137n209o454q003r205r390q797q218p770o864n280l608
59856F08815k409j599q61o8Q18J809K647L016L080L382M125N072O166P552Q895
59841F50440R390Q776P648O475M926K735O20k71L92J910L342M060L785K586Q86
$$ y = [542852, 542881, 542323, 541558, 540430, 538744, 536774, 534709, 532210, 529139, 526186, 524071, 522527, 520856, 519121, 517926, 517262, 516392, 514918, 513227, 511831, 510925, 510570, 510721, 511054, 511324, 511811, 512796, 513711, 513745, 513327, 513990, 516352, 519172, 521039, 522229, 524096, 527147, 530674, 534072, 537579, 541526, 545626, 549428, 553026, 556859, 560952, 564800, 568062, 571028, 574188, 577511, 580531, 583161, 585986, 589558, 593728, 598026, 602473, 607563, 613543, 620107, 626766, 633184, 639221, 645059, 651194, 657828, 664307, 669723, 674148, 678676, 684015, 689460, 693533, 695238, 694488, 691750, 687613, 682404, 675950, 667947, 658742, 649352, 640555, 632337, 624567, 617703, 612423, 608815, 606406, 604807, 603946, 603878, 604696, 606505, 609152, 612168, 615248, 618630, 622755, 627827, 633993, 641545, 650440, 659830, 668606, 676254, 682729, 687655, 690390, 691010, 690739, 691131, 693041, 696383, 700443, 704228, 706814, 707700]
59826G07700q41k370l681m764n633o327o884p411q234r554j0905j1393j0626r103
59812F09974p592o476n746n192m449l329k267j892k089k076j584j196j230j142
59798E63714n97k71q22j752k217k373k908l672l929l724l775m015l480j904l17
59783E27958L73N06Q03J229J375J350J515J781J891K047K546K952K484J224K26
59768E50260K18P71J090J138J476K251K878K799K113J303O97M62Q07J759K801
59753E72823L201K789K103J646J396J172J120J436J891K050J817J464J177R32
59739E97017P21N86M36J73l8N0L14L48P6r0J75O68J005J123J203J297J280J167
59721F07511J139J305J551J702J684J544J359J284J446J709J648J006J59j77J53
$$ y = [707700, 706859, 704489, 700808, 696044, 690411, 684084, 677200, 669789, 661555, 652001, 641096, 629703, 619077, 609974, 602382, 595906, 590160, 584968, 580519, 577190, 574923, 573031, 570942, 568866, 567282, 566086, 564856, 563714, 563117, 562846, 562024, 560272, 558055, 555682, 552774, 549102, 545173, 541449, 537674, 533659, 530179, 528275, 527958, 528331, 528837, 529640, 530869, 532244, 533594, 535109, 536890, 538781, 540828, 543374, 546326, 548810, 550034, 550260, 550478, 551249, 552339, 553477, 554953, 557204, 560082, 562881, 564994, 566297, 566994, 567456, 568263, 570022, 572823, 576024, 578813, 580916, 582562, 583958, 585130, 586250, 587686, 589577, 591627, 593444, 594908, 596085, 597017, 597738, 598324, 598760, 598933, 598895, 598945, 599259, 599607, 599683, 599593, 599768, 600436, 601441, 602564, 603767, 605064, 606344, 607511, 608650, 609955, 611506, 613208, 614892, 616436, 617795, 619079, 620525, 622234, 623882, 624888, 625047, 624870, 625023]
59706F25023N08L35j19l33l91p00j093r93m68k60o03r01q58j008j575j708p38
59689F14118N35Q32J78l57l38k93m32k97K18N76O04Q52J484J691P99p41j953k451
59671F15025k378j867j184r71j573k287j981n10J008J484J045P85J501K875L902
59656F14874L969L329K528J709P82o3m76m72l38j01M20J036J211P37q3r72j846
59639F26244k361k009q98J02L29pl55m21l7R94K437L553L919L896L911L748L083
59622F46128K238J848K063K547K963L046K512J385J96n63r26j121j106q50o50
59607F59710o19k70Q90K532L782M087L517K471J523J125J044M58r28k363l111
59592F73848l481m093m745m827m453m289m521m890n353n836n726m666l530l352
$$ y = [625023, 625531, 625866, 625747, 625414, 625023, 624323, 623230, 622237, 621769, 621509, 620906, 620005, 619147, 618139, 616564, 614856, 614118, 614653, 615485, 615663, 615306, 614968, 614675, 614243, 613946, 614164, 614740, 615344, 616196, 617680, 619371, 620170, 619429, 617476, 615025, 612647, 610780, 609596, 608625, 607052, 604765, 602784, 602274, 603282, 604766, 605811, 606596, 608097, 610972, 614874, 618843, 622172, 624700, 626409, 627191, 627128, 626652, 626180, 625842, 625741, 626161, 627197, 628408, 629145, 629062, 628090, 626244, 623883, 621874, 620976, 621078, 621407, 621400, 621045, 620624, 620587, 621581, 624018, 627571, 631490, 635386, 639297, 643045, 646128, 648366, 650214, 652277, 654824, 657787, 660833, 663345, 664730, 664926, 664363, 663437, 662316, 661210, 660360, 659710, 659091, 658821, 659711, 662243, 666025, 670112, 673629, 676100, 677623, 678748, 679792, 680250, 679322, 676959, 673848, 670367, 666274, 661529, 656702, 652249, 647960, 643439, 638549, 633196, 627360, 621634, 616968, 613438, 610086]
59578F10086l554k617n89O87K12p91q13j11J61j27j51M48J205J667J832J903K107
59561F11555K609L194L339K902K418K374K572K571K398K442K919L746M687N380
59547F55106N546N363N339N640N944O055O170O430O788P526R182J1698J4341J6751
59533G67879J9218K1385K1685J8982J4188R471O310N000N434P237R377J0691J0858
59520I27715J0298R339Q070O680N140K842n90m404p421r471j1246j2962j4169
59507I09821j4805j5242j5255j4010j1546r192q021p646p062n898m340k460l59
59494G93985J541L013M462O319Q296R799J0762J1601J2480J3274J4069J5222J6870
59481I21693J8735K0451K1836K2947K4040K5396K6956K8247K8860K8844K8345
$$ y = [610086, 606532, 603915, 603326, 604013, 604225, 603434, 602621, 602510, 602671, 602544, 602393, 602841, 604046, 605713, 607545, 609448, 611555, 614164, 617358, 620697, 623599, 626017, 628391, 630963, 633534, 635932, 638374, 641293, 645039, 649726, 655106, 660652, 666015, 671354, 676994, 682938, 688993, 695163, 701593, 708381, 715907, 725089, 736787, 751128, 767879, 787097, 808482, 830167, 849149, 863337, 872808, 879118, 884118, 889552, 896789, 906166, 916857, 927715, 938013, 947352, 955422, 962102, 967242, 970084, 969494, 965090, 957669, 948198, 936952, 923990, 909821, 895016, 879774, 864519, 850509, 838963, 829771, 821750, 814104, 807042, 801144, 796804, 794344, 793985, 795526, 798539, 803001, 809320, 817616, 827415, 838177, 849778, 862258, 875532, 889601, 904823, 921693, 940428, 960879, 982715, 1005662, 1029702, 1055098, 1082054, 1110301, 1139161, 1168005, 1196350]
59470A196350K7029K4210J9625J3852Q048L427R19R25L233P243J2427J8529K5431
59457A361248L2897M0511M7762N4158N9285O2745O4247O3888O2376O0742N9722
59446A969581N9440N9431N8569N4716M4977K7087J097l0090o1669q8558j06800
59435A987781j14614j12864j04485r2950q0839o9521n9747n2010m6242m1582l6878
59424A176049l1446k5202j8315j1056l964K241P133J0723J3172J4587J5159J5129
59412A164210J4491J3087J1159R389P984O051K216m183j2617k1560k8891l2741
59400A128595l2780l0455k7378k3625j8408j2203p268n768q066j2994j8876k3910
59388I06864k6512k6229k4146k1686j9250j6509j3682j1643j0733j0227r268p829
$$ y = [1196350, 1223379, 1247589, 1267214, 1281066, 1289114, 1292541, 1293460, 1294385, 1297618, 1304861, 1317288, 1335817, 1361248, 1394145, 1434656, 1482418, 1536576, 1595861, 1658606, 1722853, 1786741, 1849117, 1909859, 1969581, 2029021, 2088452, 2147021, 2201737, 2246714, 2273801, 2274898, 2244808, 2183139, 2094581, 1987781, 1873167, 1760303, 1655818, 1562868, 1482029, 1412508, 1352761, 1300751, 1254509, 1212927, 1176049, 1144603, 1119401, 1101086, 1090030, 1086066, 1088307, 1095440, 1106163, 1119335, 1133922, 1149081, 1164210, 1178701, 1191788, 1202947, 1212336, 1220320, 1226371, 1228587, 1224404, 1211787, 1190227, 1161336, 1128595, 1095815, 1065360, 1037982, 1014357, 995949, 983746, 976478, 970710, 962644, 949650, 930774, 906864, 880352, 854123, 829977, 808291, 789041, 772532, 758850, 747207, 736474, 726247, 716979, 709150]
59376G09150o405n128l719k133q12j63j03k20k15L7O26J588K774L984N259O741
59360G11261Q264R408J0174J1231J3207J5850J8289K0005K1243K2567K4280K6270
59348I12049K8156K9538L0327L0827L1264L1320L0368K8116K4825K0902J6547
59337A214239J1729O339M43n545j1108j6214k1371k6731l1458l4505l5815l6193
59325A013810l6143l5495l4096l2197k9992k7397k4518k1773j9331j6810j3856
59314G22202j0699p995o340n892o070n725m146j874j0J233K520M067N221N607
59300F92099N706N912O009O104P097R305J1373J1492R305N743J608k661o159p727
59286G55206p272n944m770l632j842P73L586N746O996Q041R923J2789J5603J7392
$$ y = [709150, 702745, 697617, 693898, 691765, 690953, 690790, 690687, 690467, 690252, 690289, 690915, 692503, 695277, 699261, 704520, 711261, 719525, 728933, 739107, 750338, 763545, 779395, 797684, 817689, 838932, 861499, 885779, 912049, 940205, 969743, 1000070, 1030897, 1062161, 1093481, 1123849, 1151965, 1176790, 1197692, 1214239, 1225968, 1232307, 1232750, 1227205, 1216097, 1199883, 1178512, 1151781, 1120323, 1085818, 1050003, 1013810, 977667, 942172, 908076, 875879, 845887, 818490, 793972, 772199, 752868, 736058, 722202, 711503, 703508, 697168, 691276, 685206, 679481, 675335, 673461, 673451, 674684, 677204, 681271, 686492, 692099, 697805, 703717, 709726, 715830, 722927, 732232, 743605, 755097, 764402, 770145, 771753, 769092, 762933, 755206, 747934, 741990, 737220, 733588, 731746, 732519, 736105, 741851, 748847, 756888, 766811, 779600, 795203, 812595]
59272H12595J8351J9277K0331K1041K1127K0543J9011J6379J3319J0727Q345M973
59260A006019K65m555q173j0636j2866j5290j7450j8570j8165j6404j4175j2506
59248H57494j1569j0526q552n718k700l3K121L752N018O252P727R456J1286J2946
59234H76954J3979J3950J2872J1151Q987O241K949m53l710p044j0545j3710j6051
59221H95570j7857j9722k1484k2231k1427j9597j7717j6324j5359j4551j3648
59210F95653j2463j0981r437q152p215o469n718m909m050l199k597k571l034l226
59196F11632k404q39K73J22q01j362r93k3R26J470J575J603K076L127M242M922
59180F25546N359O063O999P676P961Q289R050J0285J1965J3975J5804J6876J7328
$$ y = [812595, 830946, 850223, 870554, 891595, 912722, 933265, 952276, 968655, 981974, 992701, 1001046, 1006019, 1006284, 1001729, 993556, 982920, 970054, 954764, 937314, 918744, 900579, 884175, 870000, 857494, 845925, 835399, 826847, 821129, 818429, 818396, 820517, 824269, 829287, 835539, 843266, 852722, 864008, 876954, 890933, 904883, 917755, 928906, 937893, 944134, 947083, 946630, 942920, 935876, 925331, 911621, 895570, 877713, 857991, 836507, 814276, 792849, 773252, 755535, 739211, 723852, 709301, 695653, 683190, 672209, 662772, 654620, 647405, 640936, 635218, 630309, 626259, 623060, 620463, 617892, 614858, 611632, 609228, 608389, 608662, 608784, 607983, 606621, 605628, 605605, 606531, 608001, 609576, 611179, 613255, 616382, 620624, 625546, 630905, 636968, 643967, 651643, 659604, 667893, 676943, 687228, 699193, 713168, 728972, 745848, 763176]
59167G63176J7880J8796J9529J9560J9015J8111J6622J4311J1423Q356N192J938
59155I33909j227m261p391j0518j2986j4448j5452j6593j7460j7262j6189j5295
59143G84827j5034j4778j3969j2990j2472j2308j1863j0808r398q044o965o159
59131F50039n487m770l929k991j926o46P66K022K929L600M248M921N591O339P234
59116F67940Q104Q692R000R290R729J0255J0806J1359J1656J1242J0063Q796Q189
59103G95121Q207Q202P821P297O823O200N243M101K947J809Q59M28L77K6r09j743
59087H52809j777j368j422k182l279m633o402q202r332r833j0432j1307j1787
59074G70853j1560j1249j1344j1439j1010j0246r527q672p435o186n439n072m676
$$ y = [763176, 781056, 799852, 819381, 838941, 857956, 876067, 892689, 907000, 918423, 926779, 931971, 933909, 932682, 928421, 921030, 910512, 897526, 883078, 867626, 851033, 833573, 816311, 800122, 784827, 769793, 755015, 741046, 728056, 715584, 703276, 691413, 680605, 671207, 663163, 656198, 650039, 644552, 639782, 635853, 632862, 630936, 630290, 631056, 633078, 636007, 639607, 643855, 648776, 654367, 660706, 667940, 676044, 684736, 693736, 703026, 712755, 723010, 733816, 745175, 756831, 768073, 778136, 786932, 795121, 803328, 811530, 819351, 826648, 833471, 839671, 844914, 849015, 851962, 853771, 854630, 855058, 855435, 855461, 854552, 852809, 851032, 849664, 848242, 846060, 842781, 838148, 831746, 823544, 814212, 804379, 793947, 782640, 770853, 759293, 748044, 736700, 725261, 714251, 704005, 694478, 685806, 678371, 672185, 666746, 661674, 656998]
59061F56998m278m088l812k987j769q03m16n28j199k491l883m526m248l712l438
59046F14820l218k684j960j425j206j184j302j515j602j271m58O47J887L263M711
59031F07503N836O153N758N502O238P874R519J0527J1017J1396J1844J2394J3025
59018G24586J3478J3382J2825J2267J1680J0377Q071N586L893L041K576K527L169
59005H27458M205N070N836O987Q490R931J1434J3445J5552J6615J6324J5615J5170
58992I72132J4360J2408R816P852O946O306M907K355j055m581p446r439j1020
58979A003541j2511j3393j2876j1015q795p038n668m145k164K19K787N157O746
58966I40845P255P201P636R099J0981J2114J1882J0541Q642O505M275K035l69
$$ y = [656998, 652720, 648632, 644820, 641833, 640064, 639261, 638845, 638317, 637118, 634627, 630744, 626218, 621970, 618258, 614820, 611602, 608918, 606958, 605533, 604327, 603143, 601841, 600326, 598724, 597453, 596995, 597642, 599529, 602792, 607503, 613339, 619492, 625250, 630752, 636990, 644864, 654383, 664910, 675927, 687323, 699167, 711561, 724586, 738064, 751446, 764271, 776538, 788218, 798595, 806666, 812252, 816145, 819186, 821762, 824289, 827458, 831663, 836733, 842569, 849556, 858046, 867977, 879411, 892856, 908408, 925023, 941347, 956962, 972132, 986492, 998900, 1008716, 1016568, 1023514, 1029820, 1034727, 1037082, 1036027, 1031446, 1024000, 1014561, 1003541, 991030, 977637, 964761, 953746, 944951, 937913, 932245, 928100, 925936, 926155, 928942, 934099, 940845, 948100, 955301, 962937, 972036, 983017, 995131, 1007013, 1017554, 1026196, 1032701, 1036976, 1039011, 1038642]
58953A038642l248o534r643j2166j4349j6509j8218j8636j7601j5854j4163j2618
58941H79103j0871q698o233l967k479j858j454o81q2r77l816p400j0101j1436
58927H09050j2074j2676j3274j3594j3364j2281j0202p566n257l768k709j390
58915G00895L26K027L488M938O501P760Q247Q149Q164Q764R944J1567J3436J5100
58901H09306J6136J6869J8226K0620K3402K5682K7180K7954K7963K7460K7283
58890A068081K8011K9228L0310L1543L3542L5891L7358L7372L6305L4228L0451
58879A432320K4685J7700J0389K902m831j2399j9308k5619l1609l7136m1693m4762
58867A270639m5855m4729m1930l8708l5873l3096k9725k5902k2406j9726j7820
$$ y = [1038642, 1035394, 1028860, 1019217, 1007051, 992702, 976193, 957975, 939339, 921738, 905884, 891721, 879103, 868232, 859534, 853301, 849334, 846855, 844997, 843543, 842862, 842780, 841803, 837987, 830587, 820486, 809050, 796976, 784300, 771026, 757432, 744068, 731787, 721585, 714019, 708762, 704994, 702285, 700895, 701221, 703248, 706736, 711674, 718175, 725935, 734182, 742331, 750495, 759259, 769203, 780770, 794206, 809306, 825442, 842311, 860537, 881157, 904559, 930241, 957421, 985375, 1013338, 1040798, 1068081, 1096092, 1125320, 1155630, 1187173, 1220715, 1256606, 1293964, 1331336, 1367641, 1401869, 1432320, 1457005, 1474705, 1485094, 1487996, 1483165, 1470766, 1451458, 1425839, 1394230, 1357094, 1315401, 1270639, 1224784, 1180055, 1138125, 1099417, 1063544, 1030448, 1000723, 974821, 952415, 932689, 914869]
58856I14869j6523j5663j4937j4113j3314j2747j2297j1694j0931j0192r482q653
58844G64323p675o710o006n856o371p119p372o953o515o591o804o473n660n053
58830F73165m978n097m950m391l492k484j760j510j335n76R41K755M341N527O383
58815F62539O954P144O719N630M335L530L294K911J881O94%m99j597l127l915
58800F96493l338k181j601j811k174k124j589q15j35K33M46R09J748K567K946
58785F89574L000L183L735M542N426O226O664O418N566M708M449M720M803M132
58771G57146K874J612O40o8l58J41J372K616L201L051K351J141l44j334j250m80
58755G72311J75P24J895L826N594O347O281O075N900N454M720M164M243M932N777
$$ y = [914869, 898346, 882683, 867746, 853633, 840319, 827572, 815275, 803581, 792650, 782458, 772976, 764323, 756648, 749938, 743932, 738076, 731705, 724586, 717214, 710261, 703746, 697155, 690351, 683878, 678218, 673165, 668187, 663090, 658140, 653749, 650257, 647773, 646013, 644503, 643168, 642592, 643533, 646288, 650629, 656156, 662539, 669493, 676637, 683356, 688986, 693321, 696851, 700145, 703056, 704937, 705631, 705631, 705132, 703535, 700408, 696493, 693155, 690974, 689373, 687562, 685388, 683264, 681675, 680860, 680725, 680958, 681404, 682313, 684061, 686628, 689574, 692574, 695757, 699492, 704034, 709460, 715686, 722350, 728768, 734334, 739042, 743491, 748211, 753014, 757146, 760020, 761632, 762272, 762204, 761846, 761987, 763359, 765975, 769176, 772227, 774578, 775719, 775375, 774041, 772791, 772311, 772486, 773210, 775105, 778931, 784525, 790872, 797153, 803228, 809128, 814582, 819302, 823466, 827709, 832641, 838418]
58740H38418O292O397O438O724P097P237P247P491P868P792P103O486O616P326
58726I36532P992Q439Q997R860J0785J1351J1210J0287Q986Q013P671P540P183
58713A054846O841O917P026O360M911L578K793J842j03k815n485p894j0457j3334
58699A055026j6159j8669k0997k3180k4743k5116k4189k2393k0314j8366j6631
58688H24269j4961j3308j1902j0965j0339r710r143q961r041q715p624o276n287
58675F98037m478l168j246O40J999L090M402N927P237Q127Q897R989J1484J3002
58661G63939J4056J4389J3884J2343R676O370L340J090p38k696m698o184o876
58648H17895o900o360n332m195l441l073k667k019j280n27L22J089J450J614K233
$$ y = [838418, 844710, 851107, 857545, 864269, 871366, 878603, 885850, 893341, 901209, 909001, 916104, 922590, 929206, 936532, 944524, 952963, 961960, 971820, 982605, 993956, 1005166, 1015453, 1024439, 1032452, 1040123, 1047663, 1054846, 1061687, 1068604, 1075630, 1081990, 1086901, 1090479, 1093272, 1095114, 1095011, 1092196, 1086711, 1078817, 1068360, 1055026, 1038867, 1020198, 999201, 976021, 951278, 926162, 901973, 879580, 859266, 840900, 824269, 809308, 796000, 784098, 773133, 762794, 753084, 743941, 734980, 725939, 717224, 709600, 703324, 698037, 693559, 690391, 689145, 689785, 691784, 694874, 699276, 705203, 712440, 720567, 729464, 739453, 750937, 763939, 777995, 792384, 806268, 818611, 828287, 834657, 837997, 839087, 838349, 835653, 830955, 824771, 817895, 810995, 804635, 799303, 795108, 791667, 788594, 785927, 783908, 782628, 782101, 782423, 783512, 784962, 786576, 788809]
58633G88809L477M741N512N922O174O012N258M255L345K414J480J205K124L802
58619H44530N457P061R073J1357J3264J4732J6367J8286J9662J9773J8854J7491
58607A015907J5641J2762Q724M191J39k798m571n466n724n462m926m497m266l833
58593A015821k885j724q77k85N94J973L531N072O841Q992J1106J2617J3432J3998
58579A088206J4765J5746J6430J6113J4525J2163R855P997O493N329M780M983
58567A217385N688O622P766R037J0055J0516J0661J0983J1539J1807J1260R863
58555A333182P961N814L354L52l296p384j1348j4342j5634j5248j4210j3719j3929
58542A241553j3930j3122j2207j2345j3651j5069j5703j5608j5204j4460j3047
$$ y = [788809, 792286, 797027, 802539, 808461, 814635, 820647, 825905, 830160, 833505, 835919, 837399, 838604, 840728, 844530, 849987, 857048, 866121, 877478, 890742, 905474, 921841, 940127, 959789, 979562, 998416, 1015907, 1031548, 1044310, 1053034, 1057225, 1057364, 1054566, 1049995, 1044529, 1038805, 1033343, 1028417, 1023920, 1019654, 1015821, 1012936, 1011212, 1010335, 1010050, 1010644, 1012617, 1016148, 1021220, 1028061, 1037053, 1048159, 1060776, 1074208, 1088206, 1102971, 1118717, 1135147, 1151260, 1165785, 1177948, 1187803, 1195800, 1202293, 1207622, 1212402, 1217385, 1223073, 1229695, 1237461, 1246498, 1256553, 1267069, 1277730, 1288713, 1300252, 1312059, 1323319, 1333182, 1341143, 1346957, 1350311, 1350663, 1347367, 1339983, 1328635, 1314293, 1298659, 1283411, 1269201, 1255482, 1241553, 1227623, 1214501, 1202294, 1189949, 1176298, 1161229, 1145526, 1129918, 1114714, 1100254, 1087207]
58531A087207j0957q604o378m383k537p66J030K980N047O787P566P331O961P382
58517A098666Q378Q776Q026O888O154N413L827J764O06J021K244L202L576L580
58503A162121L440L463M009N017N994O752P584Q473Q734Q012P013O543O241N154
58489A248550L358K009J594J051p76l415n247n480m877m475m280l621k254n73
58475A221564J007K271K885K421R19j118l406o120r132j1632j3011j3735j4680
58462A158233j5736j5794j4237j1861j0011r089q274o662m381k404j310n96M47
58449A058325J518J598M20j130k315l402m790n969o209n635m856l894k414o64
58435A020583P74K008L649N702P522Q837R898J0638J0707J0470J0837J1862J2539
$$ y = [1087207, 1076250, 1067646, 1061268, 1056885, 1054348, 1053582, 1054612, 1057592, 1062639, 1069426, 1076992, 1084323, 1091284, 1098666, 1107044, 1115820, 1123846, 1130734, 1136888, 1142301, 1146128, 1147892, 1148498, 1149519, 1151763, 1154965, 1158541, 1162121, 1165561, 1169024, 1173033, 1178050, 1184044, 1190796, 1198380, 1206853, 1215587, 1223599, 1230612, 1237155, 1243396, 1248550, 1251908, 1253917, 1255511, 1256562, 1255786, 1252371, 1247124, 1241644, 1236767, 1232292, 1228012, 1224391, 1222137, 1221564, 1222571, 1224842, 1227727, 1230148, 1231067, 1229949, 1226543, 1220423, 1211291, 1199659, 1186648, 1172913, 1158233, 1142497, 1126703, 1112466, 1100605, 1090594, 1081505, 1073231, 1066569, 1062188, 1059784, 1058474, 1057878, 1058325, 1059843, 1061441, 1061861, 1060731, 1058416, 1055014, 1050224, 1044255, 1038046, 1032411, 1027555, 1023661, 1021247, 1020583, 1021357, 1023365, 1027014, 1032716, 1040238, 1049075, 1058973, 1069611, 1080318, 1090788, 1101625, 1113487, 1126026]
58422A126026J2382J2174J2575J3008J2611J1432R837P509M090L59k288l340l459
58409A212916l405l536m204n726p734r218r526q920p982o874n430l662j820j21
58395A134758J284K221K641K890L468M329M663L746J840j57j863l632n558p028
58381A143602p638p875q302q675q565q322q468q538p528n389l065j127O69K463
58367A063242L942N142O558Q171R277R625R869J0491J1153J1470J1653J1819J1454
58354A183866J0200Q473O793M991K698J75j879k963k908j776k3J669L067M498
58340A216881O110P589Q822J0209J1917J3476J4494J5200J5898J6434J6561J6287
58328A369878J5570J4221J2434J0801R521Q251O982O247O222O467O908Q088R913
$$ y = [1126026, 1138408, 1150582, 1163157, 1176165, 1188776, 1200208, 1210045, 1217554, 1221644, 1222003, 1219715, 1216375, 1212916, 1209511, 1205975, 1201771, 1196045, 1188311, 1179093, 1169567, 1160647, 1152665, 1145791, 1140361, 1136699, 1134879, 1134758, 1136042, 1138263, 1140904, 1143794, 1147262, 1151591, 1156254, 1160000, 1161840, 1161683, 1159820, 1156188, 1150630, 1143602, 1135964, 1128089, 1119787, 1111112, 1102547, 1094225, 1085757, 1077219, 1069691, 1064302, 1061237, 1060110, 1060779, 1063242, 1067184, 1072326, 1078884, 1087055, 1096332, 1105957, 1115826, 1126317, 1137470, 1148940, 1160593, 1172412, 1183866, 1194066, 1202539, 1209332, 1214323, 1217021, 1217196, 1215317, 1212354, 1209446, 1207670, 1207647, 1209316, 1212383, 1216881, 1222991, 1230580, 1239402, 1249611, 1261528, 1275004, 1289498, 1304698, 1320596, 1337030, 1353591, 1369878, 1385448, 1399669, 1412103, 1422904, 1432425, 1440676, 1447658, 1453905, 1460127, 1466594, 1473502, 1481590, 1491503]
58315A491503J1221J1307J0971J1312J2321J3448J4705J6294J7818J8793J9357
58304A649050J9714J9519J8659J7933J8092J8788J9309J9733K0347K0570J9574
58293A861288J7701J6241J6002J6875J8436K0268K1932K3336K4824K6414K7433
58282B090750K7547K7456K7889K8524K8704K8629K9014L0068L1570L3435L5428
58271B419014L6967L7931L9050M0836M2857M4826M7434N1063N4640N6954N8415
58260B929987O0268O2650O4750O6348O8006O9964P1924P3703P5276P6675P8394
58249C697945Q1235Q5147Q9118R2915R7747J04287J11456J18255J25456J34057
58239D737618J43466J52804J62686J73935J85777J97197K09019K22684K38010
$$ y = [1491503, 1502724, 1514031, 1525002, 1536314, 1548635, 1562083, 1576788, 1593082, 1610900, 1629693, 1649050, 1668764, 1688283, 1706942, 1724875, 1742967, 1761755, 1781064, 1800797, 1821144, 1841714, 1861288, 1878989, 1895230, 1911232, 1928107, 1946543, 1966811, 1988743, 2012079, 2036903, 2063317, 2090750, 2118297, 2145753, 2173642, 2202166, 2230870, 2259499, 2288513, 2318581, 2350151, 2383586, 2419014, 2455981, 2493912, 2532962, 2573798, 2616655, 2661481, 2708915, 2759978, 2814618, 2871572, 2929987, 2990255, 3052905, 3117655, 3184003, 3252009, 3321973, 3393897, 3467600, 3542876, 3619551, 3697945, 3779180, 3864327, 3953445, 4046360, 4144107, 4248394, 4359850, 4478105, 4603561, 4737618, 4881084, 5033888, 5196574, 5370509, 5556286, 5753483, 5962502, 6185186, 6423196]
58230F423196K54158K71760K92001L14536L38472L64514L94059M27077M63094
58221I542867N03268N49233O00935O58058P22612P97664Q84522R83837J098580
58212A6341576J233419J392513J580961J807485K082598K414647K809671L273058
58204C2935928L808217M416153N100950N874537O751720P739977Q833236J0006548
58196H5467266J1207466J2357556J3378576J4229641J4925498J5527632J6122902
58189A83216537J6796865J7596995J8484816J9273241J9546011J8619715J5695539
58182C09229719J0277998K657175n960376j3899659j9788101k3107277k4193549
58175B35215930k3812629k2683661k1230180j9595398j7798465j5878610j3937270
$$ y = [6423196, 6677354, 6949114, 7241115, 7555651, 7894123, 8258637, 8652696, 9079773, 9542867, 10046135, 10595368, 11196303, 11854361, 12576973, 13374637, 14259159, 15242996, 16341576, 17574995, 18967508, 20548469, 22355954, 24438552, 26853199, 29662870, 32935928, 36744145, 41160298, 46261248, 52135785, 58887505, 66627482, 75460718, 85467266, 96674732, 109032288, 122410864, 136640505, 151566003, 167093635, 183216537, 200013402, 217610397, 236095213, 255368454, 274914465, 293534180, 309229719, 319507717, 322164892, 316204516, 302304857, 282516756, 259409479, 235215930, 211403301, 188719640, 167489460, 147894062, 130095597, 114216987, 100279717]
58168A00279717j2091687j0419643q950076p684420o610697n705837m942339m297783
58160C9577235l754714l294812k900318k559887k267399k015934j797609j607796
58152A9378766j444402j303557j180103j071455r77093q94798q20944p53818o93265
58143A0239331o37794n85269n35900m91435m51760m15091l81066l50785l24194
58134F066037l00079k78402k60113k44743k30460k16289k02395j88554j74447
58125C970555j61090j49935j40782j32330j24355j17491j11424j05289r9437r4853
58115B733569r1176q7103q2459p8085p4087o9975o6062o2954o0048n6367n2467
58104A952786m9659m7748m5536m3197m2049m2047m1638m0122l8281l6520l4332
$$ y = [100279717, 88188030, 77768387, 68818311, 61133891, 54523194, 48817357, 43875018, 39577235, 35822521, 32527709, 29627391, 27067504, 24800105, 22784171, 20986562, 19378766, 17934364, 16630807, 15450704, 14379249, 13402156, 12507358, 11686414, 10932596, 10239331, 9601537, 9016268, 8480368, 7988933, 7537173, 7122082, 6741016, 6390231, 6066037, 5765958, 5487556, 5227443, 4982700, 4752240, 4535951, 4333556, 4145002, 3970555, 3809465, 3659530, 3518748, 3386418, 3262063, 3144572, 3033148, 2927859, 2828422, 2733569, 2642393, 2555290, 2472831, 2394746, 2320659, 2250684, 2184622, 2121668, 2061620, 2005253, 1952786, 1903127, 1855379, 1809843, 1766646, 1724597, 1682550, 1640912, 1600790, 1562509, 1525989, 1491657]
58093A491657l1798k9850k8676k7491k6110k5158k4564k3421k1651k0233j9554
58082A213151j8995j8399j8344j8695j8477j7594j7111j7341j7218j6168j5127
58071A019682j4916j4936j4342j3403j2762j2327j1701j1006j0555j0258r897
58060H83579r498r032q396p822p670p694p315o752o882p770q358p982p253o937
58046G74218o899o717o481o421o357o086n788n648n615n769o330p025p126o452
58032F85504n705n476n576n650n745n898n761n093m186l419k830k413k339k647
58018F22766l082l445l665l490k676j583r88j139j547j826k104k519k921l230
58004E88551l504l542l126k666k875l623l946l333k331j620j298j287j646k145
$$ y = [1491657, 1459859, 1430009, 1401333, 1373842, 1347732, 1322574, 1298010, 1274589, 1252938, 1232705, 1213151, 1194156, 1175757, 1157413, 1138718, 1120241, 1102647, 1085536, 1068195, 1050977, 1034809, 1019682, 1004766, 989830, 975488, 962085, 949323, 936996, 925295, 914289, 903734, 893476, 883579, 874081, 865049, 856653, 848831, 841161, 833467, 826152, 819400, 812518, 804748, 796390, 788408, 781155, 774218, 767319, 760602, 754121, 747700, 741343, 735257, 729469, 723821, 718206, 712437, 706107, 699082, 691956, 685504, 679799, 674323, 668747, 663097, 657352, 651454, 645693, 640600, 636414, 632995, 630165, 627752, 625413, 622766, 619684, 616239, 612574, 609084, 606408, 604825, 603837, 602698, 601151, 599325, 597221, 594702, 591781, 588551, 585047, 581505, 578379, 575713, 572838, 569215, 565269, 561936, 559605, 557985, 556687, 555400, 553754, 551609]
57990E51609k364k426k898l660l763k826j652j065r25q43r71j486j979k073k008
57975E20670k040j878j330r09j131j671j874j591j059m07J63K40k17o41p05p40
57959E04880q57m13R18K220K403J607O43m46k162m141n222m955m181l806l775
57944D82713l476k683j787j335j446j594j130j23O52Q06Q89J440K025J832R51
57929D77734L13M94J178J673J474N04p12j246p47o2l40j603k783l091k786k577
57913D67423k787l224l444l149k545k201k282k243j673j063j117j681k086k324
57899D35604k973l966m390l819l060l130l949m494l970k558j151n04n41n16mM76
57883C97055J91p16j378j322q48l78r4k48j123k404l234l170k656k311k250k348
$$ y = [551609, 549245, 546819, 543921, 540261, 536498, 533672, 532020, 530955, 530030, 529187, 528216, 526730, 524751, 522678, 520670, 518630, 516752, 515422, 514513, 513382, 511711, 509837, 508246, 507187, 506780, 506943, 507183, 506966, 506325, 505620, 504880, 504023, 503610, 504528, 506748, 509151, 510758, 511401, 510955, 508793, 504652, 499430, 494475, 490294, 486488, 482713, 479237, 476554, 474767, 473432, 471986, 470392, 469262, 469139, 469791, 470597, 471486, 472926, 474951, 476783, 477734, 478047, 478541, 479719, 481392, 482866, 483370, 482658, 481412, 480665, 480603, 480263, 478660, 475877, 472786, 470000, 467423, 464636, 461412, 457968, 454819, 452274, 450073, 447791, 445548, 443875, 442812, 441695, 440014, 437928, 435604, 432631, 428665, 424275, 420456, 417396, 414266, 410317, 405823, 401853, 399295, 398144, 397640, 397099, 396583, 396579, 397055, 397246, 396530, 395152, 393830, 392982, 392604, 392510, 392262, 391139, 388735, 385501, 382331, 379675, 377364, 375114, 372766]
57867C72766k638l081l330l166k842k672k529k097j368n65J95Q94J410J587J468
57852C54032J333J549K376L600M485M430L768L365L424L312K752K386K700L112
57838C96624K856K240K101K366K081Q83n11j377j789k137k502k878l440m167m580
57823C85770m281l453k598k031j903k328l120l639l334k365j388q76q05q71p86
57808C51992n66p49j982m075n846o355o057o045o419o175m912l651l499m119m320
57793B87222l778l358l724m344m238l240k062j297q32k96K85N68M43J96R3J43
57777B61781L66R33J852K717L113L117L058L004K882K893L277L677L416K440J429
57762B99955Q17L29k91p68r00j029j439j821j886j947k262k340j695q57p24j157
$$ y = [372766, 370128, 367047, 363717, 360551, 357709, 355037, 352508, 350411, 349043, 348478, 348673, 349567, 350977, 352564, 354032, 355365, 356914, 359290, 362890, 367375, 371805, 375573, 378938, 382362, 385674, 388426, 390812, 393512, 396624, 399480, 401720, 403821, 406187, 408268, 409151, 408640, 407263, 405474, 403337, 400835, 397957, 394517, 390350, 385770, 381489, 378036, 375438, 373407, 371504, 369176, 366056, 362417, 359083, 356718, 355330, 354454, 353649, 352778, 351992, 351426, 350677, 348695, 344620, 338774, 332419, 326362, 320317, 313898, 307723, 302811, 299160, 295661, 291542, 287222, 283444, 280086, 276362, 272018, 267780, 264540, 262478, 261181, 260349, 260053, 260338, 260906, 261349, 261545, 261638, 261781, 262147, 263080, 264932, 267649, 270762, 273879, 276937, 279941, 282823, 285716, 288993, 292670, 296086, 298526, 299955, 300772, 301101, 300810, 300042, 299142, 298113, 296674, 294853, 292967, 291020, 288758, 286418, 284723, 283866, 283142, 281985]
57746B81985j236p49m23o11p53m38j07k30n54o59p17j113j796k362k577k408j835
57729B63417r77j50M39Q51J089R52L67m08j053j413j339p77j71k62j166k065k139
57712B55195j475p93o46j144k109l071l446l083k439k019j824j627j365j095q17
57697B28242o29p25j030j154q71k76N44J538K292K332K010K334L474M382M396
57682B46859M401N502P451R308J1100J3522J6407J8722K0070K1005K1901K2480
57670D18728K2707K3178K4435K6537K9333L2121L2961K9320K0095O481r134k4306
57658F32456l6490m3297m4053m0700l6257l2406k8864k4827k0347j6326j3495
57647B95394j1613r682p141m638l253l071l140k835k515k579k666k343j904j874
$$ y = [281985, 280749, 280000, 279577, 278966, 278213, 277775, 277668, 277438, 276884, 276225, 275508, 274395, 272599, 270237, 267660, 265252, 263417, 262440, 262290, 262729, 263580, 264669, 265621, 265988, 265580, 264527, 263114, 261775, 260998, 260827, 260565, 259399, 257334, 255195, 253720, 252927, 252281, 251137, 249028, 245957, 242511, 239428, 236989, 234970, 233146, 231519, 230154, 229059, 228242, 227613, 226888, 225858, 224704, 223833, 223557, 224101, 225639, 227931, 230263, 232273, 234607, 238081, 242463, 246859, 251260, 256762, 264213, 273521, 284621, 298143, 314550, 333272, 353342, 374347, 396248, 418728, 441435, 464613, 489048, 515585, 544918, 577039, 610000, 639320, 659415, 665896, 656762, 632456, 595966, 552669, 508616, 467916, 431659, 399253, 370389, 345562, 325215, 308889, 295394, 283781, 274099, 266958, 262320, 259067, 255996, 252856, 250021, 247506, 244927, 242261, 239918, 238014, 236140]
57633B36140k079j905j246n60j35J86N45P88P36L68k07p94j170j287j381j691
57617B26308k159k506k572k414k225k226k427k416j743n92K47L45J09P9J27j15
57601B05820m60m30j25j56p02j253j476j699k190k495k022j087p01j236j918j901
57585A85969j477j618k557l481l743l673l744l595k601j109k73n89j348j590j074
57570A53497j35O55O51l58j490j446k25O62K31o06n32J68K58l36m87J77P01M26
57552A51811j7Q2L77K99J74O12J218R45l60j605j781j052k76J05L61Q03J222J093
57534A54011L30l86k41P67J701J618N01p98j419j169m91P8L83O73J164J674J802
57517A60198J413P98L77M24J009J850K291J837Q24J66K61N94O52O98J139J564
$$ y = [236140, 234061, 232156, 230910, 230350, 230215, 230401, 230946, 231734, 232470, 232838, 232631, 231837, 230667, 229380, 227999, 226308, 224149, 221643, 219071, 216657, 214432, 212206, 209779, 207363, 205620, 205028, 205275, 205620, 205729, 205808, 205935, 205820, 205360, 204930, 204805, 204649, 203947, 202694, 201218, 199519, 197329, 194834, 192812, 191725, 191024, 189788, 187870, 185969, 184492, 182874, 180317, 176836, 173093, 169420, 165676, 162081, 159480, 158371, 158098, 157509, 156161, 154571, 153497, 153362, 154017, 154668, 154310, 152820, 151374, 151149, 151811, 152042, 151436, 150904, 151072, 151330, 150994, 150507, 150684, 151385, 151811, 151794, 151876, 152253, 152552, 152726, 153338, 154556, 155501, 155141, 153536, 151755, 150703, 150427, 150532, 150893, 151696, 152918, 154011, 154341, 153955, 153714, 154481, 156182, 157800, 158301, 157503, 156084, 154915, 154424, 154502, 154885, 155558, 156722, 158396, 160198, 161611, 162409, 162786, 163210, 164219, 166069, 168360, 170197, 171021, 171187, 171448, 172042, 172694, 173392, 174531, 176095]
57501A76095J200J22p05p05l28k37m98q41j222j671k005k064k029k075k026j684
57485A59327j319j339j670j879j820j682j515j179p40m44k30J66N82M82k03q31
57469A45706r91j036j335j482r71j98L2k05LR92J915J933J295P63M72mo85j048
57451A45156q55n80o90r68q65l28J88L94M58N60N27J74l07n49m96l42j22K65O88
57432A42308Q26O09K61j43p38j387j579j122m72q1K03O88J174J228R17O51M95
57415A43838J65l47o56n43j73K56O56Q52O46K14k3M1Q8o1k49l97o49r21q01j46
57395A41790N37O65K23l13m57J6R58J783J851J208O12N87P49M68j60m26L4Q04
57377A50929J230J020L87k12m13k12P6K30L43N48P19O19K87j7j10l1J01K27L73
$$ y = [176095, 177295, 177417, 176712, 176007, 175679, 175442, 174944, 174103, 172881, 171210, 169205, 167141, 165112, 163037, 161011, 159327, 158008, 156669, 154999, 153120, 151300, 149618, 148103, 146924, 146184, 145740, 145510, 145676, 146258, 146740, 146537, 145706, 144715, 143679, 142344, 140862, 139891, 139693, 139725, 139520, 139523, 140515, 142430, 144363, 145658, 146421, 146893, 146889, 146204, 145156, 144301, 143721, 143031, 142063, 141198, 140870, 141058, 141452, 141910, 142470, 142997, 143171, 142864, 142315, 141819, 141477, 141355, 141620, 142308, 143134, 143743, 144004, 143861, 143123, 141736, 140157, 139035, 138563, 138482, 138685, 139373, 140547, 141775, 142692, 143343, 143838, 144003, 143656, 143000, 142457, 142284, 142540, 143196, 144048, 144694, 144908, 144885, 144926, 145014, 144953, 144704, 144307, 143658, 142737, 141936, 141790, 142327, 142992, 143215, 142902, 142445, 142461, 143419, 145202, 147053, 148261, 148873, 149460, 150209, 150677, 150517, 150091, 150125, 150929, 152159, 153179, 153566, 153354, 152941, 152729, 152805, 153035, 153378, 153926, 154645, 155264, 155551, 155534, 155424, 155393, 155494, 155721, 156094]
57358A56094O31R76J118P22n9n29j29Q91J678J638R77M29N25J047J269P92K8l42
57340A67756k32j11j47K5N87J076R54K60n54j144j337j077n97l33l54j77M73J072
57322A66140Q90j6q42r35k49Q75J914K289J736O90n9q0M44J050J346J158O07j2
57304A76946n33r42j017m27O02J240J128R39J344J911J823J296J253J767J900
57289A89230J208L82J32L13N96J097J766J918J168L11M54J523K430K580K443K550
57273B10101K648K178J145J17m47m84r7O01J348J724J602J473J960K919L320K361
57257B32469N36p61p14J88R33J205J527K279K931K539J008m50m94Q22K101K275
57241B48394J699J367J503J574J320J159J472K110K701L090L355L690M268M967
$$ y = [156094, 156725, 157701, 158819, 159541, 159482, 158953, 158824, 159715, 161393, 163031, 164008, 164437, 164962, 166009, 167278, 168070, 168098, 167756, 167524, 167413, 167266, 167291, 167878, 168954, 169908, 170168, 169614, 168470, 167133, 166056, 165459, 165126, 164772, 164595, 165068, 166140, 167030, 167014, 166172, 165237, 164988, 165863, 167777, 170066, 171802, 172492, 172433, 172353, 172797, 173847, 175193, 176351, 176958, 176946, 176413, 175471, 174454, 174027, 174629, 175869, 176997, 177936, 179280, 181191, 183014, 184310, 185563, 187330, 189230, 190438, 190820, 190952, 191265, 191861, 192958, 194724, 196642, 197810, 198121, 198575, 200098, 202528, 205108, 207551, 210101, 212749, 214927, 216072, 216189, 215742, 215258, 215161, 215762, 217110, 218834, 220436, 221909, 223869, 226788, 230108, 232469, 233005, 232244, 231530, 231718, 232651, 233856, 235383, 237662, 240593, 243132, 244140, 243690, 243196, 244018, 246119, 248394, 250093, 251460, 252963, 254537, 255857, 257016, 258488, 260598, 263299, 266389, 269744, 273434, 277702, 282669]
57227B82669N325N066M605M645N338O242O973P416P397O808O149O263P339Q648
57213C70883R531J0070J0526J0716J0416R954R874J0214J0616J0908J1190J1417
57201D96315J1309J0802J0289J0303J1034J2122J2989J3371J3494J3608J3633
57190F29269J3519J3708J4717J6305J7652J8346J8678J8923J9013J9161K0049
57179H19340K1873K3805K4872K5058K5049K5312K5850K6505K6972K6883K6353
57168A097872K6140K6648K7159K6788K5934K5903K7093K8472K9049K9178K9845
57157A400081L1280L2772L3693L4108L4486L5140L6051L6912L7277L6782L5472
57146A784054L3945L3066L3415L4986L7399M0326M3597M6928M9717N1222N0974
$$ y = [282669, 287994, 293060, 297665, 302310, 307648, 313890, 320863, 328279, 335676, 342484, 348633, 354896, 362235, 370883, 380414, 390484, 401010, 411726, 422142, 432096, 441970, 452184, 462800, 473708, 484898, 496315, 507624, 518426, 528715, 539018, 550052, 562174, 575163, 588534, 602028, 615636, 629269, 642788, 656496, 671213, 687518, 705170, 723516, 742194, 761117, 780130, 799291, 819340, 841213, 865018, 889890, 914948, 939997, 965309, 991159, 1017664, 1044636, 1071519, 1097872, 1124012, 1150660, 1177819, 1204607, 1230541, 1256444, 1283537, 1312009, 1341058, 1370236, 1400081, 1431361, 1464133, 1497826, 1531934, 1566420, 1601560, 1637611, 1674523, 1711800, 1748582, 1784054, 1817999, 1851065, 1884480, 1919466, 1956865, 1997191, 2040788, 2087716, 2137433, 2188655, 2239629]
57135B239629M9246M7188M6223M6903M8362M9323M9638N0469N2945N7069O2122
57124B799117O7552P3093P8296Q2563Q5767Q8682R2674R8907J07860J19477J33665
57113C827653J50190J68132J86276K04741K25796K52275K85456L25416L73077
57104E999012M30715N00465N83684O81977P97448R31327J083607J254534J445203
57095A3707972J655975J885466K131387K390463K656244K917786L158818L352397
57087C3856508L454497L413451L203003K854536K450496K073855J755012J461563
57079E4522921J133455P27325K37254l11204q78028j423400j915760k334057k666523
57070D7091983k908671l061600l130247l121717l044755k910212k731064k521407
$$ y = [2239629, 2288875, 2336063, 2382286, 2429189, 2477551, 2526874, 2576512, 2626981, 2679926, 2736995, 2799117, 2866669, 2939762, 3018058, 3100621, 3186388, 3275070, 3367744, 3466651, 3574511, 3693988, 3827653, 3977843, 4145975, 4332251, 4536992, 4762788, 5015063, 5300519, 5625935, 5999012, 6429727, 6930192, 7513876, 8195853, 8993301, 9924628, 11008235, 12262769, 13707972, 15363947, 17249413, 19380800, 21771263, 24427507, 27345293, 30504111, 33856508, 37311005, 40724456, 43927459, 46781995, 49232491, 51306346, 53061358, 54522921, 55656376, 56383701, 56620955, 56309751, 55431723, 54008323, 52092563, 49758506, 47091983, 44183312, 41121712, 37991465, 34869748, 31824993, 28914781, 26183717, 23662310]
57062B3662310k295338k066083j844806j639214j453126j287445j141514j014094
57054A0920690r03801q09042p27467o55887n91522n33517m82691m39519m02704
57045E374540l69911l39531l11418k86267k64558k45919k29151k12949j96826
57036B918010j81279j66923j53589j40521j27349j14551j02811r2039q1288o9673
57026A687987n7244m4743l2609k0525q461J620N380j735k0827m7363p2909r0018
57014A298553r6371r4616q8768q1193p2682o4026n6325n0019m4569l9398l4565
57003E76021l0335k6590k3068j9948j7666j6259j5167j3828j2198j0619r264p911
56991C73168o280m442k822j815j512j684j907j705q44M03J358J471O21j083l485
$$ y = [23662310, 21366972, 19300889, 17456083, 15816869, 14363743, 13076298, 11934784, 10920690, 10016889, 9207847, 8480380, 7824493, 7232971, 6699454, 6216763, 5777244, 5374540, 5004629, 4665098, 4353680, 4067413, 3802855, 3556936, 3327785, 3114836, 2918010, 2736731, 2569808, 2416219, 2275698, 2148349, 2033798, 1930987, 1838948, 1757660, 1687987, 1630743, 1586000, 1553391, 1532866, 1524405, 1526025, 1531405, 1529670, 1508843, 1461480, 1388571, 1298553, 1202182, 1107566, 1018798, 937605, 864923, 800897, 744572, 694553, 649984, 610586, 576021, 545686, 519096, 496028, 476080, 458414, 442155, 426988, 413160, 400962, 390343, 381079, 373168, 366888, 362446, 359624, 357809, 356297, 354613, 352706, 351001, 350157, 350560, 351918, 353389, 354010, 352927, 349442]
56976C49442o213q594j0096j0758j0871j0411r179p378n603m100k517n90J288
56963B64420K574L349M213N482O880P987Q674R011Q972Q364O887M256M48m062
56949C37455q378j1661j3477j3802j2853j0937q400n615k979q33Q54K510M463
56936B56347O465Q002R076J0180J1483J2565J3123J3331J3014J1112O730M66o082
56923C65812j1823j6466j9538k0351j9212j7593j6508j5534j3945j2040j0565
56912A92237r485q266o930n884n003l788k371j434j166j038o90k21M38J617L136
56897A51152M216M547M744N400O288O934P433Q156R035R737J0277J0960J1844
56884B50723J2574J2654J1676R452O213K527j068m174o270o809n832m091k185
$$ y = [349442, 343229, 334635, 324539, 313781, 302910, 292499, 283320, 275942, 270339, 266239, 263722, 263132, 264420, 266994, 270343, 274556, 280038, 286918, 294905, 303579, 312590, 321562, 329926, 336813, 341069, 341517, 337455, 329077, 317416, 303939, 290137, 277284, 266347, 257947, 252332, 249353, 248520, 249374, 251884, 256347, 262812, 270814, 279890, 290070, 301553, 314118, 327241, 340572, 353586, 364698, 371428, 371894, 365812, 353989, 337523, 317985, 297634, 278422, 260829, 244321, 228787, 214842, 202802, 192237, 182752, 174486, 167556, 161672, 156669, 152881, 150510, 149076, 147910, 146872, 146182, 145961, 146399, 148016, 151152, 155368, 159915, 164659, 170059, 176347, 183281, 190714, 198870, 207905, 217642, 227919, 238879, 250723, 263297, 275951, 287627, 297079, 303292, 305819, 304751, 300577, 294307, 287498, 281666, 277575, 275390]
56871B75390M2K935O161Q943J0968J2636J4425J6351J8121J9601K1116K3193K5825
56858D55707K7970K8172K5770K1082J4443N847l940j2699j8140j9835j9050j6844
56846D88483j3114p596r56N538J1073J5608J9434K2650K5096K6753K8214L0489
56834F51672L4073L8219M1371M2077L9225L1820J9485L512j3130k7337l7391m3083
56822G80513m4851m3286l9161l3413k6819j9842j2837o308q09L499P032J0372
56810E74090J3673J6657J9246K1771K4307K5995K5296K0921J2484O96j2629k5005
56798G17502l4348l9837m1690m0382l6501l1123k5615k0789j6554j2519q599m993
56786D04552j894O15K585M288O002P719R181J0179J0427R159N406j008q919j6428
$$ y = [275390, 275432, 278367, 284528, 293471, 304439, 317075, 331500, 347851, 365972, 385573, 406689, 429882, 455707, 483677, 511849, 537619, 558701, 573144, 578991, 575051, 562352, 544212, 524377, 505327, 488483, 475369, 467773, 466817, 472355, 483428, 499036, 518470, 541120, 566216, 592969, 621183, 651672, 685745, 723964, 765335, 807412, 846637, 878457, 897942, 901454, 888324, 860987, 823596, 780513, 735662, 692376, 653215, 619802, 592983, 573141, 560304, 553996, 553187, 556686, 563718, 574090, 587763, 604420, 623666, 645437, 669744, 695739, 721035, 741956, 754440, 755136, 742507, 717502, 683154, 643317, 601627, 561245, 524744, 493621, 468006, 447217, 430663, 418144, 409545, 404552, 402658, 403273, 405858, 410146, 416148, 423867, 433048, 443227, 453654, 462813, 468219, 467211, 458292, 441864]
56772D41864k1995k4993k5649k4821k3548k2485k1576k0290j8224j5579j3052
56761B09652j1177r763q221o521n404n313n610n384m636m023l714l357k966k866
56747A30697k764j998q89o57j543k194j683r93j430k474k580j529n00j17J07L13
56731A09766j47j257j767r02M03P93K78j85k40k73k92J92J107J539Q47l72q26
56714A08664K06K212L907M218L106J515M77K85N16O64N18R5m32p60p59o37o38
56697A23157o27l07K07N20N72P21J067J227R99P41P63P57L34k27l22O0L15J39
56679A30096j46k52l67o67q06l85L25N79J45k70J15J113J686J170J01m76k94k5
56661A31642j66l46j5O95J216J360J293R79L11l16k17O20J426J644J458J185P87
$$ y = [441864, 419869, 394876, 369227, 344406, 320858, 298373, 276797, 256507, 238283, 222704, 209652, 198475, 188712, 180491, 173970, 168566, 163253, 157643, 152259, 147623, 143600, 139886, 136529, 133563, 130697, 127933, 125935, 125046, 124389, 122846, 120652, 118969, 117976, 116546, 114072, 111492, 109963, 109463, 109346, 109453, 109766, 109619, 108362, 106595, 105693, 106096, 106889, 107167, 106982, 106742, 106469, 106177, 106369, 107476, 109015, 109862, 109490, 108664, 108870, 111082, 114989, 119207, 122313, 123828, 124305, 124590, 125106, 125770, 126288, 126383, 125951, 125191, 124432, 123795, 123157, 122530, 122223, 122430, 122950, 123522, 124243, 125310, 126537, 127536, 128277, 129040, 129797, 130131, 129904, 129582, 129642, 129957, 130096, 129950, 129698, 129331, 128664, 127858, 127473, 127798, 128377, 128522, 128252, 128367, 129480, 131166, 132336, 132437, 131961, 131667, 131642, 131476, 131130, 131115, 131810, 133026, 134386, 135679, 136658, 136969, 136653, 136436, 137056, 138482, 140126, 141584, 142769, 143556]
56644A43556L49L76J100J849J733P49k56n50n5Q13J446J363P23L23O33J019N58
56627A55729n43j035l16O56N55o31j668j615q13k84n18j095j320r79l95j4j07
56610A45607o34j172j105k60P10R67N24J49K78N34N25M65O30P82O15L24K24J96
56592A49359Q6K03Q03J412J341P08K09J16J57K64N96Q96O45J2j35O36J752K469
56574A61529K664K541K206J788J584J682J829J835J855K033K254K371K383K285
56560A90839K113K203K866L762M099L626K945K595K348J728Q19J83J67N64Q37
56545B21694N90K1k09J73N11M8r11j353r66m16j69LJ72r1q10j235r63o69j059
56526B14361j756j953j614j301j238j243j225j193j099j109j618k494k889k352
$$ y = [143556, 143905, 144281, 145381, 147230, 148963, 149712, 149456, 148906, 148851, 149664, 151110, 152473, 153196, 153519, 154152, 155171, 155729, 155186, 154151, 153835, 154491, 155046, 154415, 152747, 151132, 150319, 150035, 149517, 148422, 147102, 146123, 145728, 145714, 145607, 144973, 143801, 142696, 142436, 143146, 144113, 144637, 144786, 145064, 145598, 146123, 146588, 147218, 148000, 148615, 148939, 149163, 149359, 149445, 149648, 150451, 151863, 153204, 153912, 154121, 154237, 154394, 154658, 155254, 156150, 156795, 156807, 156672, 157308, 159060, 161529, 164193, 166734, 168940, 170728, 172312, 173994, 175823, 177658, 179513, 181546, 183800, 186171, 188554, 190839, 192952, 195155, 198021, 201783, 205882, 209508, 212453, 215048, 217396, 219124, 219943, 220126, 220293, 220857, 221694, 222284, 222305, 222096, 222269, 222780, 222828, 221917, 220564, 219598, 219182, 219013, 219016, 219188, 219097, 218287, 217052, 216089, 215420, 214361, 212605, 210652, 209038, 207737, 206499, 205256, 204031, 202838, 201739, 200630, 199012, 196518, 193629, 191277]
56512A91277j540j172r55l63J42k05j030j224o31j44j55n2M53O78J19o15n92K14
56494A84205J059J377J237R97Q52O65K00l99n51L8P54P22km31R6J108J642J305
56476A94874N44R2K67O83O91J65l07k71K7J88L91Q89J187O27l71n72L74J375J349
56457B02202N11k36m84l93l3O29J255J244L98p22j241p23M22J288J309P06N0l68
56439B05814n95o76o78q28j099q65M12K181L112K593J349M58K25L29M73N40M48
56422B13193K19L4L6K40O97J406J962J745O67n76j177r29j77N94R55P66M05M63
56404B20523R47J168O71q8l63r2K19M14Q90J829K606K394J214L9k64J36M05J93
56386B32841n4J7R4j07j29N98J658J974J239L82M24J320K175K300J813J369J342
$$ y = [191277, 189737, 188565, 187610, 187247, 187389, 187184, 186154, 184930, 184299, 184155, 184000, 183948, 184401, 185079, 185198, 184583, 183991, 184205, 185264, 186641, 187878, 188875, 189727, 190392, 190592, 190193, 189642, 189680, 190434, 191156, 191154, 190723, 190819, 191927, 193569, 194874, 195418, 195510, 195777, 196460, 197151, 197316, 197009, 196738, 196765, 196953, 197344, 198233, 199420, 200047, 199676, 199104, 199478, 200853, 202202, 202713, 202477, 201993, 201600, 201567, 202196, 203451, 204695, 205093, 204371, 203130, 202407, 202829, 204117, 205426, 206132, 206182, 205814, 205219, 204543, 203865, 203037, 201938, 201073, 201485, 203666, 206778, 209371, 210720, 211178, 211403, 211732, 212205, 212745, 213193, 213412, 213446, 213482, 213722, 214419, 215825, 217787, 219532, 220199, 219623, 218446, 217517, 217340, 217934, 218889, 219655, 220060, 220523, 221470, 222638, 223309, 223221, 222858, 222766, 222985, 223399, 224289, 226118, 228724, 231118, 232332, 232371, 232107, 232243, 232648, 232841, 232787, 232804, 232898, 232791, 232662, 233260, 234918, 236892, 238131, 238513, 238937, 240257, 242432, 244732, 246545, 247914, 249256]
56369B49256J377Q78Ml27K84R92Q65K39J06N83R32Q95R19J038P05p5m79j15L89
56350B58466M48K91K66J81j18k71K2N49J150J960K726K708J856J184J345J619
56334B74382J116K41l2L43P33J075J707K313K192J528J272J690J980J525P35L19
56318B93119L96O48Q84J131J431J791K126K237K027J686J465J357J210R75O85
56303C13168M16M88J350K901M282M759M526M237M024L487K476J355O46P19J613
56288C50447K791L440L394L296L509L462K744K124K515L501L973L933M358N381
56274C98868O008N797N547N907O474O728O881P106O928O170N686O320P634Q575
56260D90629Q910R177R549R764J0063J1259J3679J6644J9287K1357K3095K4733
$$ y = [249256, 250633, 251511, 251515, 251188, 251472, 252464, 253329, 253568, 253674, 254257, 255189, 256084, 257003, 258041, 258746, 258671, 258192, 258077, 258466, 258914, 259205, 259471, 259652, 259534, 259263, 259285, 259834, 260984, 262944, 265670, 268378, 270234, 271418, 272763, 274382, 275498, 275739, 275707, 276050, 276783, 277858, 279565, 281878, 284070, 285598, 286870, 288560, 290540, 292065, 292800, 293119, 293515, 294163, 295047, 296178, 297609, 299400, 301526, 303763, 305790, 307476, 308941, 310298, 311508, 312483, 313168, 313584, 314072, 315422, 318323, 322605, 327364, 331890, 336127, 340151, 343638, 346114, 347469, 348115, 348834, 350447, 353238, 356678, 360072, 363368, 366877, 370339, 373083, 375207, 377722, 381223, 385196, 389129, 393487, 398868, 404876, 410673, 416220, 422127, 428601, 435329, 442210, 449316, 456244, 462414, 468100, 474420, 482054, 490629, 499539, 508716, 518265, 528029, 538092, 549351, 563030, 579674, 598961, 620318, 643413, 668146]
56248F68146K6495K8664L1279L3843L5711L6825L7784L9035M0195M0448L9487
56237A057912L7775L5720L3130K9687K5634K1495J7214J2113N747j553q973j5683
56225A250218k1079k5091k8370l1713l5088l7591l8568l8354l7652l6689l5329
56214H84694l3641l1798k9683k7153k4634k2866k1894k0823j8857j6301j4201
56203F22843j3078j2331j0967q730o326m668m033m019m110m083l955l741l401
56190E39401k936k398j761r21Q5R09J141P74L12K07L87M89M92P28J267J719J805
56173E41700J831K318L259M103M354M079L763L783L992L850L173K578K885M053
56159E89721N159N496N339N413O066P268Q891J0553J1540J1499J1028J1104J1995
$$ y = [668146, 694641, 723305, 754584, 788427, 824138, 860963, 898747, 937782, 977977, 1018425, 1057912, 1095687, 1131407, 1164537, 1194224, 1219858, 1241353, 1258567, 1270680, 1276427, 1274874, 1265901, 1250218, 1229139, 1204048, 1175678, 1143965, 1108877, 1071286, 1032718, 994364, 956712, 920023, 884694, 851053, 819255, 789572, 762419, 737785, 714919, 693025, 672202, 653345, 637044, 622843, 609765, 597434, 586467, 577737, 571411, 566743, 562710, 558691, 554581, 550498, 546543, 542802, 539401, 536465, 534067, 532306, 531385, 531470, 532379, 533520, 534294, 534606, 534813, 535200, 535689, 536181, 536909, 538176, 539895, 541700, 543531, 545849, 549108, 553211, 557565, 561644, 565407, 569190, 573182, 577032, 580205, 582783, 585668, 589721, 594880, 600376, 605715, 611128, 617194, 624462, 633353, 643906, 655446, 666945, 677973, 689077, 701072]
56146G01072J3132J3930J4358J4756J5547J7035J9179K1530K3685K5667K7710
56135I07601K9954L2663L6416M1591M7778N4167O0267O5820P0264P2942P3690
56124A493153P2507O8879O2226N3257M3979L6024K9543K3968J9124J4991J0891
56113A928542N718r74q547j5851k1959k6390k9140l0737l2208l4705l8937m4674
56101A650138n0770n5736n8490n8685n6561n2604m7308m1177l4791k8853k3828
56090A141335j9563j5549j1728q691o769n273l171m09J983L194L624M305N622
56077A088910O996P777Q099Q635R595J0408J0591J0558J1136J2442J3782J4672
56065A213601J5369J6269J7300J8109J8465J8330J7965J8012J8901K0078K0536
$$ y = [701072, 714204, 728134, 742492, 757248, 772795, 789830, 809009, 830539, 854224, 879891, 907601, 937555, 970218, 1006634, 1048225, 1096003, 1150170, 1210437, 1276257, 1346521, 1419463, 1493153, 1565660, 1634539, 1696765, 1750022, 1794001, 1830025, 1859568, 1883536, 1902660, 1917651, 1928542, 1934260, 1933286, 1924739, 1908888, 1886929, 1860539, 1831399, 1800662, 1768454, 1733749, 1694812, 1650138, 1599368, 1543632, 1485142, 1426457, 1369896, 1317292, 1269984, 1228807, 1194016, 1165163, 1141335, 1121772, 1106223, 1094495, 1085804, 1079035, 1073762, 1070591, 1070182, 1072165, 1075359, 1078983, 1083288, 1088910, 1095906, 1103683, 1111782, 1120417, 1130012, 1140420, 1151011, 1161569, 1172705, 1185147, 1198929, 1213601, 1228970, 1245239, 1262539, 1280648, 1299113, 1317443, 1335408, 1353420, 1372321, 1392399, 1412935]
56054A412935K0216K0129K0784K1384K1116K0404K0192K0678K1446K2290K3201
56043A644775K3997K4681K5656K7025K8218K8888K9581L0852L2397L3761L5182
56032A965013L6912L8489L9571M0764M2606M4467M5589M6555M8470N1189N3684
56021B453309N5695N7738N9810O1457O2923O5063O8161P1867P5922Q0028Q3494
56010C195467Q6139Q9060R3304R8336J03059J07701J13213J19473J25678J32057
56000D263487J39474J47827J56503J65937J76885J88637J99956K11342K24349
55991E874397K38977K54023K69821K88226L09839L33607L59332L88239M20860
55982H737321M56649M96041N40704N91385O47799P10899P83224Q66788R62947
$$ y = [1412935, 1433151, 1453280, 1474064, 1495448, 1516564, 1536968, 1557160, 1577838, 1599284, 1621574, 1644775, 1668772, 1693453, 1719109, 1746134, 1774352, 1803240, 1832821, 1863673, 1896070, 1929831, 1965013, 2001925, 2040414, 2079985, 2120749, 2163355, 2207822, 2253411, 2299966, 2348436, 2399625, 2453309, 2509004, 2566742, 2626552, 2688009, 2750932, 2815995, 2884156, 2956023, 3031945, 3111973, 3195467, 3281606, 3370666, 3463970, 3562306, 3665365, 3773066, 3886279, 4005752, 4131430, 4263487, 4402961, 4550788, 4707291, 4873228, 5050113, 5238750, 5438706, 5650048, 5874397, 6113374, 6367397, 6637218, 6925444, 7235283, 7568890, 7928222, 8316461, 8737321, 9193970, 9690011, 10230715, 10822100, 11469899, 12180798, 12964022, 13830810, 14793757]
55973A4793757J074592J206305J362490J547851J769866K038322K362256K749029
55965B8904468L204984L733857M336226N015466N784187O660503P656693Q770996
55957G4067380R981192J1233192J2436939J3491479J4332626J4966681J5467941
55950A65977430J5952151J6541925J7322686J8284999J9253321J9804049J9222566
55943B92359127J6632934J1399659L646659n516262j4355992k1285283k5494569
55936B57386273k7056130k6585835k4827312k2408449j9773168j7194435j4815339
55929A04725605j2698827j0864295r302530p984771o876457n946544n166444m508407
55921D1377330l949391l473081l066120k715689k411872k148410j919417j718221
$$ y = [14793757, 15868349, 17074654, 18437144, 19984995, 21754861, 23793183, 26155439, 28904468, 32109452, 35843309, 40179535, 45195001, 50979188, 57639691, 65296384, 74067380, 84048572, 95281764, 107718703, 121210182, 135542808, 150509489, 165977430, 181929581, 198471506, 215794192, 234079191, 253332512, 273136561, 292359127, 308992061, 320391720, 324038379, 318522117, 304166125, 282880842, 257386273, 230330143, 203744308, 178916996, 156508547, 136735379, 119540944, 104725605, 92026778, 81162483, 71859953, 63875182, 56998725, 51052181, 45885737, 41377330, 37427939, 33954858, 30888738, 28173049, 25761177, 23612767, 21693350, 19975129]
55913A9975129j540256j383781j246713j125579j018187r24321q42945p71310
55905A1122037p07485o51058o00848n54575n11424m72369m37312m04417l72869
55896F409680l43810l17806k93732k70942k50241k31882k14744j98308j83427
55887D104788j70332j57930j45908j35522j27403j20342j13210j06307j00021
55878B927813r3916q8208q4391q3240q3416q3082q1602p8955p5009p0413o6818
55867B038763o4966o3528o0898n7133n3296m9893m6998m4893m3515m1962l9505
55856A472176l6582l4066l2196l0813k9962k9492k8745k7327k5706k4511k3758
55845A149018k3262k3186k3593k3976k3764k2917k1679k0206j8684j7349j6158
$$ y = [19975129, 18434873, 17051092, 15804379, 14678800, 13660613, 12736292, 11893347, 11122037, 10414552, 9763494, 9162646, 8608071, 8096647, 7624278, 7186966, 6782549, 6409680, 6065870, 5748064, 5454332, 5183390, 4933149, 4701267, 4486523, 4288215, 4104788, 3934456, 3776526, 3630618, 3495096, 3367693, 3247351, 3134141, 3027834, 2927813, 2833897, 2745689, 2661298, 2578058, 2494642, 2411560, 2329958, 2251003, 2175994, 2105581, 2038763, 1973797, 1910269, 1849371, 1792238, 1738942, 1689049, 1642051, 1597158, 1553643, 1511681, 1472176, 1435594, 1401528, 1369332, 1338519, 1308557, 1279065, 1250320, 1222993, 1197287, 1172776, 1149018, 1125756, 1102570, 1078977, 1055001, 1031237, 1008320, 986641, 966435, 947751, 930402, 914244]
55834I14244j4902j3744j3062j2704j2139j1395j1068j1284j1468j1298j0955
55823G80225j0390r368q428q606r816j0657j0319r565r228q912p981o824o192
55810F63939o018n773n323m650l418j612jQ82J570K701L824M113L771L708M114
55795F61827M290L727K568J072o75k595m636o869r089j0589j0905j0476j0118
55782F07532r956r516q727q185q463r572j1026j2084j2029j0703q817p359o660
55769D84435o206n316l835k269j362j453k163k913l686m920o538p700p824p371
55755D20879p208p496p715p526p151o939o985p145p253p197o891o218n186m172
55741C25797l724l829l749l000k126j782j498m17R57J101k44j500j514j052j271
$$ y = [914244, 899342, 885598, 872536, 859832, 847693, 836298, 825230, 813946, 802478, 791180, 780225, 769835, 760467, 752039, 743433, 733617, 722960, 712641, 703076, 693848, 684936, 676955, 670131, 663939, 657921, 652148, 646825, 642175, 638757, 637145, 637144, 638026, 639596, 642297, 646121, 650234, 654005, 657713, 661827, 666117, 669844, 672412, 673484, 672809, 670214, 665578, 658709, 649620, 639031, 628126, 617650, 607532, 597576, 588060, 579333, 571148, 562685, 553113, 542087, 530003, 517974, 507271, 498454, 491095, 484435, 478229, 472913, 469078, 466809, 465447, 463994, 461831, 458918, 455232, 450312, 443774, 436074, 428250, 420879, 413671, 406175, 398460, 390934, 383783, 376844, 369859, 362714, 355461, 348264, 341373, 335155, 329969, 325797, 322073, 318244, 314495, 311495, 309369, 307587, 306089, 305672, 306629, 307730, 307486, 305986, 304472, 303420, 302149]
55726C02149j897k036j846k076k613k768k607k654k600j614M9J073Q97L98L94
55711B82249N82M14J26J75L46J75r4K09J080J626J102k10j441k145k661l450m376
55694B73707m900m809m409l958l297k239j027j45J34j33o45r25o20J9L39J51K5
55677B47268L87Q37P87L00k28q99k007l207l741l471k938k419j638n61K95N99
55661B29364O73Q46R33P26N77R44J674K221K449K725L263L786L956L798L565L415
55645B64915L324L163K641J368p15k970m427m712m426m418m863n252n152m592
55631B33884l725k564j243k11R6l16j069j752k110k052j663j188r03j001j562
55616B12621k470l373l857l751l205k547k181k393k952l117k387j212n51p54j330
$$ y = [302149, 300252, 298216, 296370, 294294, 291681, 288913, 286306, 283652, 281052, 279438, 279487, 280560, 281457, 281855, 282249, 282831, 283245, 283371, 283546, 283892, 284067, 283973, 284182, 285262, 286888, 287990, 287780, 286339, 284194, 281533, 278083, 273707, 268807, 263998, 259589, 255631, 252334, 250095, 249068, 248923, 249057, 248924, 248279, 247354, 246734, 246753, 247092, 247243, 247268, 247655, 248492, 249279, 249579, 249351, 248452, 246445, 243238, 239497, 236026, 233088, 230669, 229031, 228470, 228765, 229364, 230037, 230883, 231816, 232542, 233119, 234063, 235737, 237958, 240407, 243132, 246395, 250181, 254137, 257935, 261500, 264915, 268239, 271402, 274043, 275411, 274696, 271726, 267299, 262587, 258161, 253743, 248880, 243628, 238476, 233884, 230159, 227595, 226352, 226141, 226237, 225921, 224852, 223100, 220990, 218938, 217275, 216087, 215184, 214183, 212621, 210151, 206778, 202921, 199170, 195965, 193418, 191237, 188844, 185892, 182775, 180388, 179176, 178625, 177871, 176541]
55601A76541j735j874j801j512j199j186j416j456j154p91m97r4K96K16l13o39
55585A61386n00m21p15q53m43k9j36k73K21Q74P63J8m40m34n88r43p06L83J492
55566A58656J856J701J537J334Q57L33J97M62O97M73k72j091j293p34k29o67j699
55549A62118k010j074J30M56P7o5K78M59Q7m11n35m81p63j312j390n59O52J293
55531A56950J118P34O41O48M52K36K74K80k28j140j894k229k272k022j380o52
55515A49516l92o55r68j050j028q78l46M16P99N77K40J95J67k06p25r57q64o50
55497A43191l87j53k42p59j259j192o09l0K43L48N12P42R02Q90P24N30L80J60
55479A43991k39o25o84m43j88N1M93J028J214J004Q88R63N77n73j618j533n71
$$ y = [176541, 174806, 172932, 171131, 169619, 168420, 167234, 165818, 164362, 163208, 162417, 161920, 161826, 162122, 162338, 162025, 161386, 160886, 160465, 159750, 158897, 158454, 158425, 158289, 158016, 158237, 159111, 159874, 159892, 159452, 159018, 158430, 157487, 156781, 157164, 158656, 160512, 162213, 163750, 165084, 165941, 166274, 166471, 166933, 167630, 168103, 167831, 166740, 165447, 164713, 164484, 163817, 162118, 160108, 159034, 159164, 159620, 159697, 159632, 159910, 160369, 160456, 160045, 159510, 159029, 158266, 156954, 155564, 155005, 155657, 156950, 158068, 158802, 159443, 160091, 160543, 160779, 161053, 161333, 161105, 159965, 158071, 155842, 153570, 151548, 150168, 149516, 149124, 148469, 147501, 146451, 145423, 144545, 144199, 144615, 145414, 145991, 146231, 146426, 146593, 146387, 145662, 144705, 143841, 143191, 142804, 142651, 142409, 141650, 140391, 139199, 138590, 138560, 138803, 139151, 139663, 140405, 141307, 142197, 142921, 143451, 143831, 143991, 143752, 143127, 142443, 142000, 141812, 141863, 142356, 143384, 144598, 145602, 146490, 147453, 148030, 147457, 145839, 144306, 143735]
55462A43735J43K11K11M66N04L4l71m3Q16J351R95q5j169j405m65Q98J352M31
55444A47609q34j145m85R6L7j76j5K43J36j45n9L51M92J36k10m9L52L09l94j241
55424A45008j580j282p36l43j49N7L72O27O31M45L24M29P61J273J866K279K210
55407A52192J611P52p4p42j143j174r38p88r75j363j622j585j342j149j292j820
55391A38548k301k102j122K2O90Q41P33M50ml46k87J4J67J30J50K05j4m96p83
55372A34495o11l30m24q57j083o69K33J074J481J605J748J793J317L46m19m25
55356A39274R2N91J001J482J748J314L68k45J1P69J280J082K26q63j641j850j649
55339A42990j227n38K78O23J98l65l11P7l9o23q56n96n91j075j277p63j65mK35
$$ y = [143735, 143878, 144089, 144300, 144766, 145270, 145304, 144933, 144890, 145706, 147057, 148052, 147967, 146798, 145393, 144928, 145826, 147178, 147609, 146775, 145630, 145145, 145241, 145278, 145102, 145087, 145330, 145466, 145321, 145262, 145613, 146105, 146241, 146031, 145982, 146334, 146643, 146249, 145008, 143428, 142146, 141410, 141067, 140918, 140975, 141347, 141974, 142605, 143050, 143374, 143803, 144564, 145837, 147703, 149982, 152192, 153803, 154555, 154481, 153739, 152596, 151422, 150484, 149696, 148721, 147358, 145736, 144151, 142809, 141660, 140368, 138548, 136247, 134145, 133023, 133045, 133735, 134576, 135309, 135759, 135755, 135409, 135122, 135136, 135303, 135433, 135583, 135788, 135774, 135278, 134495, 133884, 133554, 133130, 132273, 131190, 130521, 130754, 131828, 133309, 134914, 136662, 138455, 139772, 140118, 139699, 139274, 139366, 139957, 140958, 142440, 144188, 145502, 145870, 145625, 145636, 146405, 147685, 148767, 148993, 148130, 146489, 144639, 142990, 141763, 141225, 141503, 142126, 142324, 141959, 141648, 141725, 141686, 141063, 140207, 139611, 139020, 137945, 136668, 135905, 135740, 135736, 135971]
55320A35971J046J826J770J146P35N22o9r48j406j173o12O6R36J724J865J261
55304A44660L95l88j073j542j523j086o04j99L06Q17R28N64R7k26n44r11j147
55287A38524j242j415j614j427p09J48P52J085J113O34k19p20l07P10J630K220
55271A39163K669K917K572J551L43m59p07o54n66m65k65oJ14N7J32N98J149J154
55253A49297N02j97m13l20k98k33J83O62M96m55j422j622j081l89P3L40N68P93
55235A46484R31Q10L22l03n72k98O4k0m30o31n69q08j595k265k014r92j60j19
55217A37835m90m94J05Q79J275J137P43N11O15Q99J090J043P45K22l67o55l62
55200A44731K97O67L16n09j120j056m71Q5K32Q2L0J97K98J57R3M66R26O63m69
$$ y = [135971, 137017, 138843, 140613, 141759, 142494, 143016, 142947, 141999, 140593, 139420, 138808, 138874, 139810, 141534, 143399, 144660, 145055, 144667, 143594, 142052, 140529, 139443, 138839, 138640, 138946, 139763, 140691, 141255, 141352, 141126, 140582, 139671, 138524, 137282, 135867, 134253, 132826, 132117, 132265, 133017, 134102, 135215, 135849, 135630, 134910, 134603, 135313, 136943, 139163, 141832, 144749, 147321, 148872, 149215, 148756, 148049, 147395, 146829, 146364, 146099, 146093, 146207, 146264, 146396, 146994, 148143, 149297, 149799, 149602, 149189, 148869, 148571, 148338, 148521, 149183, 149679, 149224, 147802, 146180, 145099, 144710, 144783, 145123, 145691, 146484, 147415, 148225, 148547, 148244, 147672, 147374, 147438, 147418, 146988, 146357, 145788, 144980, 143385, 141120, 139106, 138114, 137954, 137835, 137345, 136851, 136956, 137835, 139110, 140247, 140990, 141501, 142116, 143015, 144105, 145148, 145893, 146115, 145748, 145093, 144731, 145028, 145695, 146011, 145502, 144382, 143326, 142855, 142940, 143172, 143254, 143284, 143481, 143779, 143936, 144029, 144495, 145421, 146084, 145615]
55181A45615j453j176K14J404J418O76L26Q19J502J576J017L22k44o93q02k49
55165A50272O23Q40K3r15q02L28J383J622J302R90Q65Q03O27J17p68j543j535
55148A54232p71q2r0m74n86l96l96p59j079r82o57n93r05j107o87K10Q50P31Q8
55129A46547n06p12m23L58J187J187O7j135j099J05J147J199P39N25O77J004J456
55112A52323J791J576Q48K07q3m25r85j294j068o65k29O89J981K492J552K46J8
55095A58974P16J165J163J461K106K181J365M21j37p16j621k322k297j789j236
55080A59434o04J72O83N41K8k88k74k16k68l22l21l14k71n4L43O46M86j33o19
55061A58649k84P56J510J158j6j037j300r54n07m27q59j323r90K91J578J941J593
$$ y = [145615, 144162, 142986, 143200, 144604, 146022, 146698, 147024, 147843, 149345, 150921, 151938, 152260, 152016, 151323, 150521, 150272, 150895, 151735, 151758, 150843, 150041, 150369, 151752, 153374, 154676, 155666, 156531, 157334, 157961, 158078, 157310, 155767, 154232, 153461, 153379, 153289, 152815, 152229, 151833, 151437, 150678, 149599, 148617, 147960, 147367, 146462, 145355, 144668, 144878, 145728, 146459, 146547, 146041, 145329, 144906, 145264, 146451, 147638, 147705, 146570, 145471, 145576, 146723, 147922, 148661, 149186, 149863, 150867, 152323, 154114, 155690, 156538, 156745, 156662, 156237, 155252, 153958, 152890, 152225, 151996, 152685, 154666, 157158, 158710, 158956, 158974, 159690, 160855, 162018, 163479, 165585, 167766, 169131, 169552, 169415, 168699, 167078, 164756, 162459, 160670, 159434, 158830, 159002, 159685, 160226, 160254, 159966, 159692, 159476, 159208, 158886, 158565, 158251, 157980, 157926, 158269, 158915, 159401, 159268, 158649, 158365, 159121, 160631, 161789, 161773, 160736, 159436, 158482, 157975, 157548, 156689, 155366, 154376, 154667, 156245, 158186, 159779]
55044A59779J256R45K64m32k78O82J399J237N96j7n45p85k96O51R55J11j001j331
55026A63190r88p56q90j084j159j127r06n05k09j76r2L01P97J142J478J876J909
55009A62801J234K35m72q66j335j864k039j679j007k44M97J038J214J091Q59O16
54993A60079M38M02M00K25P1M23J187J449O97k29j35Q71J485Q75m41j363j286
54976A65148l58P79J422J346J015R82J196J221R81P31M99R6l10l06L8J33k55o18
54958A73740m70rL28N36Q33J116J067P39N32O01O30L54K3N7M27O89O40N95Q42
54939A83270J148J110P97O45P85R49J015J197J537J748J680J552J499J344J074
54924B01350J064J498K013K309K584L003L219L025K974L624M437M295K985J385
$$ y = [159779, 161035, 161980, 162244, 161812, 161534, 162216, 163615, 164852, 165448, 165431, 164886, 164101, 163805, 164456, 165411, 165522, 164521, 163190, 162202, 161446, 160556, 159472, 158313, 157186, 156280, 155775, 155566, 155390, 155298, 155599, 156396, 157538, 159016, 160892, 162801, 164035, 164270, 163798, 162932, 161597, 159733, 157694, 156015, 155008, 154764, 155261, 156299, 157513, 158604, 159463, 160079, 160517, 160919, 161319, 161544, 161615, 162038, 163225, 164674, 165371, 165142, 165007, 165878, 167363, 168238, 167797, 166434, 165148, 164790, 165569, 166991, 168337, 169352, 170334, 171530, 172751, 173732, 174463, 174962, 175058, 174748, 174442, 174480, 174613, 174358, 173740, 173270, 173261, 173589, 174125, 174958, 176074, 177141, 177880, 178412, 179013, 179643, 179997, 180020, 180077, 180504, 181193, 181833, 182428, 183270, 184418, 185528, 186325, 186970, 187755, 188704, 189719, 190916, 192453, 194201, 195881, 197433, 198932, 200276, 201350, 202414, 203912, 205925, 208234, 210818, 213821, 217040, 220065, 223039, 226663, 231100, 235395, 238380, 239765]
54910B39765J49j007k512m059m898m678l795l075l081l542l616l011k498k781
54896A97361l234k614r57K75J53n40n29K90J069J250J010P52Q17J467K570L422
54880B02562L348K525J765J598J852K144K370K653L034L433L689L526K620Q59
54866B37978j385l363m448m586m206l707l178k680k510k867l443l644l233k433
54852A92295j503n54J69K65l74j384k263k683k473j680p61l13m01m97k23J58K23
54835A78001M7qJ17J48n3l05l12J18Q90J592J753J325P15K63m7k51k26p1k48q89
54815A82559j312p93L98J293J435J179Q51K96n17j080r76m66j05k1L8J30Q8p5
54797A82922j44p8q8k67m43m76m39l59l0P13J624K214K263J958J552J098O34M07
$$ y = [239765, 239914, 238907, 236395, 232336, 227438, 222760, 218965, 215890, 212809, 209267, 205651, 202640, 200142, 197361, 194127, 191513, 190556, 190831, 190984, 190444, 189915, 190205, 191274, 192524, 193534, 194286, 195103, 196570, 199140, 202562, 205910, 208435, 210200, 211798, 213650, 215794, 218164, 220817, 223851, 227284, 230973, 234499, 237119, 237978, 236593, 233230, 228782, 224196, 219990, 216283, 213105, 210425, 207915, 205048, 201605, 197961, 194728, 192295, 190792, 190238, 190407, 190672, 190298, 188914, 186651, 183968, 181495, 179815, 179054, 178741, 178340, 177843, 177620, 177778, 178001, 178048, 178040, 178157, 178305, 178252, 177947, 177635, 177753, 178643, 180235, 181988, 183313, 184028, 184291, 184244, 183993, 183767, 183696, 183448, 182559, 181247, 180454, 180852, 182145, 183580, 184759, 185610, 185906, 185389, 184309, 183333, 182867, 182762, 182741, 182779, 182909, 182997, 182922, 182778, 182700, 182612, 182345, 181902, 181426, 180987, 180628, 180598, 181311, 182935, 185149, 187412, 189370, 190922, 192020, 192654, 193061]
54779A93061O74J308J832J923J812K052K845L714L974L466K727K377K497K756
54765B27018K975L264L705M127M315M179L676K817J882J252Q28m7j776l825n216
54750B49174n548n168m568m046l829l982m154l840k991k005j102k56K82P5o74
54735B07368j073o70p6N0L0N12J274J490J067Q29J346K295L117L658L922L809
54719B28948L432L243L430L516K921J625Pj637l060l855l813l414l405l893m243
54704B19802l967l332k902k828k836k709k452k068j497q36m41n70r82j097o24
54689A90661R1M84M50L43L19P5n74j168j114n58k63n39p87l64M73Q94N49j20n40
54670A88312o01m99l47j80q5j11n9L73J196J981K158J475J93j080j725j446n21
$$ y = [193061, 193735, 195043, 196875, 198798, 200610, 202662, 205507, 209221, 213195, 216661, 219388, 221765, 224262, 227018, 229993, 233257, 236962, 241089, 245404, 249583, 253259, 256076, 257958, 259210, 260038, 259991, 258215, 254390, 249174, 243626, 238458, 233890, 229844, 226015, 222033, 217879, 214039, 211048, 209043, 207941, 207685, 207967, 208042, 207368, 206295, 205625, 205549, 205599, 205629, 206141, 207415, 208905, 209972, 210801, 212147, 214442, 217559, 221217, 225139, 228948, 232380, 235623, 239053, 242569, 245490, 247115, 247122, 245485, 242425, 238570, 234757, 231343, 227938, 224045, 219802, 215835, 212503, 209601, 206773, 203937, 201228, 198776, 196708, 195211, 194375, 193934, 193364, 192382, 191285, 190661, 190752, 191236, 191686, 192029, 192348, 192423, 191849, 190681, 189567, 189009, 188746, 188207, 187420, 187056, 187529, 188423, 188972, 188852, 188312, 187711, 187212, 186865, 186685, 186600, 186489, 186430, 186803, 187999, 189980, 192138, 193613, 193806, 192726, 191001, 189555, 189034]
54653A89034K89L12l24p05j50R19J417R29J64k5L54O92O78M65K02q6l24m69p06
54634A92666j175j551j379p60k06J40N33Q75O56j68q90r93p90o97m89K12J133
54617A87117J635J482Q72O8n69n48J32P24O47L25L75M86m2q66r02m0O06L81l1
54598A91852J51O08O11J68k27m34n65m83m7L70K99j40m56m61k97J8M95Q14N86
54579A92862n0n39n97l92j23K20O70J137J433J275M91n45j041p54m14p62j402
54562A91469j364n32K25L70K49K31Q0l83p50o35l93n93j104j300r93o38n78n47
54544A82814j32N74J027R04M98L49O12R37J003Q82P83P50P93J042J343J100jj272
54526A94006j721j332r37q29l93O42J509J505J019P75O96L22j66k15O1K1m19p08
$$ y = [189034, 189323, 189635, 189311, 188606, 188456, 189375, 190792, 191721, 191885, 191860, 192214, 192906, 193584, 194049, 194251, 194165, 193841, 193372, 192666, 191491, 189940, 188561, 187801, 187595, 187735, 188268, 189143, 189799, 189631, 188741, 187748, 186958, 186261, 185772, 185984, 187117, 188752, 190234, 191106, 191174, 190605, 190057, 190189, 190913, 191560, 191885, 192260, 192746, 192704, 191838, 190936, 190896, 191502, 191883, 191852, 192003, 192611, 193222, 193390, 193163, 192729, 192164, 191681, 191634, 192004, 192303, 192163, 191707, 191246, 190949, 190967, 191462, 192276, 192862, 192812, 192273, 191676, 191284, 191161, 191381, 192051, 193188, 194621, 195896, 196387, 195842, 194801, 194047, 193633, 192871, 191469, 190105, 189573, 189798, 190168, 190417, 190648, 190728, 190345, 189595, 188960, 188567, 187974, 186870, 185570, 184577, 183939, 183361, 182814, 182682, 183256, 184283, 185187, 185685, 186034, 186646, 187583, 188586, 189468, 190251, 191001, 191794, 192836, 194179, 195279, 195278, 194006, 192285, 190953, 190016, 189187, 188794, 189436, 190945, 192450, 193469, 194244, 194940, 195262, 195096, 194881, 194942, 194963, 194544, 193836]
54508A93836o00l63j1P63J671J777Q21j46r8N88P40N6o42o98m35m92q21p75kJ005
54488A96174J379P95k07q35q02l56K22P99J174J073N02j74n99o17j64O50J324
54471B00338J263N18k27n04n16n38l97J17P14J010J067J124J075P12J93j76m80
54454B05293r66j489j665j484j232r43m76OJ96K66O90J397J689J168K20n67r61
54437B01142r75o75l30l31o88r46p43j65N30J136J366J008L77J41M55P25M80K6
54419B02533p5K39O13P77O37K72j7Q7M14M39J63K49R22J360P91k87p50l87m4k86
54399B07650p03o31k7O08Q17N07q3n66o84m30N2N06N72P9n05m04M69J230J130
54380B09587N07J97L65N21M03K15J26Q4J08K50L06J7m80p80p17l08N41J736K550
$$ y = [193836, 193236, 192873, 192862, 193625, 195296, 197073, 197894, 197748, 197650, 198238, 198978, 199034, 198392, 197694, 197259, 196767, 195946, 195171, 195169, 196174, 197553, 198348, 198141, 197306, 196504, 196148, 196370, 197169, 198343, 199416, 199918, 199744, 199145, 198528, 198364, 199014, 200338, 201601, 202119, 201892, 201388, 200872, 200334, 199937, 200054, 200768, 201778, 202845, 203969, 205044, 205756, 205949, 205773, 205293, 204327, 202838, 201173, 199689, 198457, 197514, 197038, 197044, 197240, 197506, 198196, 199593, 201282, 202450, 202670, 202103, 201142, 200167, 199492, 199162, 198831, 198143, 197197, 196454, 196289, 196819, 197955, 199321, 200329, 200706, 200847, 201302, 202027, 202507, 202533, 202458, 202697, 203310, 204087, 204724, 204996, 204979, 205066, 205480, 205919, 206082, 206331, 207253, 208613, 209404, 209117, 208367, 207980, 207936, 207650, 206947, 206316, 206289, 206897, 207714, 208221, 208138, 207572, 206888, 206458, 206510, 207016, 207588, 207667, 207162, 206758, 207227, 208457, 209587, 210094, 210291, 210656, 211177, 211580, 211795, 211921, 212005, 212113, 212363, 212669, 212686, 212206, 211426, 210709, 210401, 210942, 212678, 215228]
54361B15228K174Q04l61m13L90J130J244Q52M24K31P5l50q37p29J09Q32O06k69
54343B21140q94j056j217j435j146j82Q09J142P77J27l77m35r5J57Nj63J15M54
54325B17726J03p90j289j079p79p24m65K29P91P71M98L48J49k19l43J7M11M33
54307B15788L32M05M12K25L93J318K367K563J785O83k68r05r70l30N85J093R95
54290B26471N70R0l18n65p61j148j541j279j65J031J485J293R83N87r1p07p06
54273B25229k20J09M3j33k90o15j148j652j934j851j257l46K22J12p1M37J410
54256B18045J899J451M65n07j122j157o64j63p3j59n8kk63k69P20K181K666J679
54238B24669K54n35p21p56n82M5Q52J231R70M09O9J93N01M62rl50j61J67J67J52
$$ y = [215228, 217402, 218206, 217845, 217432, 217822, 218952, 220196, 221048, 221472, 221703, 221778, 221428, 220591, 219862, 219971, 220803, 221409, 221140, 220246, 219190, 217973, 216538, 215392, 215210, 216019, 217161, 217938, 218065, 217688, 217253, 217158, 217315, 217320, 217157, 217272, 217726, 217829, 217039, 215750, 214671, 213892, 213168, 212703, 212932, 213723, 214494, 214992, 215340, 215489, 215270, 214927, 214944, 215355, 215788, 216120, 216525, 216937, 217162, 217555, 218873, 221240, 223803, 225588, 226271, 226003, 225098, 224128, 223798, 224383, 225476, 226471, 227041, 227131, 226813, 226248, 225487, 224339, 222798, 221519, 221354, 222385, 223870, 225163, 226146, 226733, 226642, 225935, 225229, 225009, 225118, 225161, 225028, 224738, 224123, 222975, 221323, 219389, 217538, 216281, 215935, 216157, 216269, 216198, 216635, 218045, 219944, 221395, 221860, 221353, 220231, 219074, 218410, 218247, 218174, 218015, 217957, 217955, 217692, 217423, 218143, 220324, 222990, 224669, 224923, 224388, 223667, 222911, 222329, 222374, 223226, 224457, 225427, 225836, 225905, 226098, 226599, 227061, 227052, 226702, 226541, 226708, 226875, 227027]
54218B27027N68R37M74m49o67n6K87p0k06M66J082P33r7m27l38n20r44j021p38
54199B26041n87n79k13N18R05L69r31k312k979k376p19R57J719J643J411J262
54183B24129R70O34P01J093J105M70j25l3L63K06n80j164r36j86M35O96P57P16
54165B29251N92N66Q06J059Q67K82m0K90Q99J240J326J471J680J764J796J945
54149B45794K044J893J718J777J650P28o86j552j533j417j809k236k061j597j592
54134B41121k069k406k346k235k235j938j028J33Q86J099J249J635J838J288K49
54119B35241l04J08Q52J163J160J415J854J869J262M40k12m86j15Q39J502J093
54103B47681K18J90J067J524R37K66K99L15n52j743k160j916j881k053j594l91
$$ y = [227027, 227595, 228532, 229006, 228557, 227890, 227834, 228121, 228051, 227845, 228311, 229393, 230126, 230029, 229602, 229264, 228744, 227800, 226779, 226041, 225454, 224875, 224662, 225180, 226085, 226454, 225523, 223211, 220232, 217856, 217137, 218094, 219813, 221456, 222867, 224129, 225099, 225733, 226434, 227527, 228632, 229102, 228977, 228944, 229307, 229513, 228933, 227769, 226833, 226647, 227082, 227778, 228535, 229251, 229843, 230409, 231215, 232274, 233141, 233423, 233383, 233673, 234572, 235812, 237138, 238609, 240289, 242053, 243849, 245794, 247838, 249731, 251449, 253226, 254876, 255604, 254918, 253366, 251833, 250416, 248607, 246371, 244310, 242713, 241121, 239052, 236646, 234300, 232065, 229830, 227892, 226864, 226997, 227883, 228982, 230231, 231866, 233704, 234992, 235241, 234937, 235045, 235897, 237060, 238220, 239635, 241489, 243358, 244620, 245060, 244848, 244362, 244247, 245086, 246588, 247681, 247899, 248089, 249156, 250680, 251617, 251883, 252182, 252497, 251945, 250202, 248042, 246126, 244245, 242192, 240598, 240207]
54087B40207N79O05N8k66m7M78Q80Q52M38Kk30l66m29j51M82R15P34L39L72Q24
54067B46276J224J338J162N55m17j135j070n41j77%K76L89p8o55l72P63J707J879
54049B51124J804K005K178J927J582J725K423L309M113M651M739M454M200M233
54035B94467M261L901L295L100L763M967N757N432M341L542L456L334K475J455
54021C47546J336J942J992R45k82p99q71j100j320j111p82r63j559j951k096k643
54005C38284l852n048n344m605l490k816k918l446l682l230k373j681j376j241
53991B93182j138j196j494j834j972j859j523j002n65p35j651k535k363j155p9
53976B72081l3o53j116j393j905k382k020q39J07J79p4LJ56j06m94m37p5K5j57
$$ y = [240207, 240786, 241391, 241449, 241183, 241136, 241614, 242494, 243346, 243784, 243786, 243556, 243190, 242761, 242610, 243092, 244007, 244741, 245080, 245452, 246276, 247500, 248838, 250000, 250555, 250138, 249003, 247933, 247392, 247215, 247215, 247491, 247880, 247802, 247147, 246775, 247538, 249245, 251124, 252928, 254933, 257111, 259038, 260620, 262345, 264768, 268077, 272190, 276841, 281580, 286034, 290234, 294467, 298728, 302629, 305924, 309024, 312787, 317754, 323511, 328943, 333284, 336826, 340282, 343616, 346091, 347546, 348882, 350824, 352816, 353761, 353479, 352680, 351809, 350709, 349389, 348278, 347496, 346533, 344974, 343023, 340927, 338284, 334432, 329384, 324040, 319435, 315945, 313129, 310211, 306765, 303083, 299853, 297480, 295799, 294423, 293182, 292044, 290848, 289354, 287520, 285548, 283689, 282166, 281164, 280599, 279864, 278213, 275678, 273315, 272160, 272081, 272048, 271395, 270279, 268886, 266981, 264599, 262579, 261740, 261847, 262026, 261952, 261955, 262111, 262005, 261511, 261074, 260999, 261024, 260867]
53957B60867j30K81Q53J469K044K173J653J116J351K020K050J280Q01J350K292
53942B81470K688K596K677K977K910K257J563J483K001K531K641K517K655L167
53928C16133L761M359N269O471P282P209O750O655O772O353N302M292L745L517
53914C93870L556M007M590M754M581M715N147M952L588J759N00L8r2l84j100k153
53898D32328k967l026k693k843l529l875l596l594m468n435n447m646l869l447
53884C78893l304l681m733n862o308o131n815n286m231l055k563k795l020k853
53870C19256k593k496k439k348k300k191j889j632j714j884j667j167r07r83j130
53855B91916j457k255l034k708j059P30J367P38l85j248j447r15m2N27N59L58
$$ y = [260867, 260737, 261018, 261871, 263340, 265384, 267557, 269210, 270326, 271677, 273697, 275747, 277027, 277828, 279178, 281470, 284158, 286754, 289431, 292408, 295318, 297575, 299138, 300621, 302622, 305153, 307794, 310311, 312966, 316133, 319894, 324253, 329522, 335993, 343275, 350484, 357234, 363889, 370661, 377014, 382316, 386608, 390353, 393870, 397426, 401433, 406023, 410777, 415358, 420073, 425220, 430172, 433760, 435519, 436019, 436057, 435965, 435581, 434481, 432328, 429361, 426335, 423642, 420799, 417270, 413395, 409799, 406205, 401737, 396302, 390855, 386209, 382340, 378893, 375589, 371908, 367175, 361313, 355005, 348874, 343059, 337773, 333542, 330487, 327924, 325129, 322109, 319256, 316663, 314167, 311728, 309380, 307080, 304889, 303000, 301368, 299654, 297770, 296103, 294936, 294029, 293046, 291916, 290459, 288204, 285170, 282462, 281403, 282133, 283500, 284238, 283853, 282605, 281158, 280243, 280201, 280728, 281287, 281645]
53839B81645J76r9m34m21J03O26N38r1o91q84o95l54j18j22j73R7O94J172J210
53820B82179J004Q08N06k8m47k78M42J251J926K590L147L147K392J450J169J788
53804C03046K735L307L422L534L927M358M411M049L579L241K997K690K233J661
53790C49190J202J169J565J887J631R06L14J92K72J33l65j112j890k399k404k078
53774C48213j929k238k761l112l231l294l363l332l084k596j957j372j017q53
53760C14074p43p15r13j240j371j195r38p52n50l90n82j145j503j150l47K40M05
53743C01185M65O47Q71J087J321J388J045N38M66R63J430J352J055J178J735K135
53727C18861K073J879J893J943J710J380J493K144K700K525J784J248J405K007
$$ y = [281645, 281821, 281722, 281288, 280867, 280970, 281596, 282134, 282043, 281352, 280468, 279773, 279419, 279301, 279179, 279006, 279103, 279797, 280969, 282179, 283183, 283991, 284497, 284469, 284022, 283744, 284186, 285437, 287363, 289953, 293100, 296247, 298639, 300089, 301258, 303046, 305781, 309088, 312510, 316044, 319971, 324329, 328740, 332789, 336368, 339609, 342606, 345296, 347529, 349190, 350392, 351561, 353126, 355013, 356644, 357550, 357864, 358056, 358328, 358461, 358096, 356984, 355094, 352695, 350291, 348213, 346284, 344046, 341285, 338173, 334942, 331648, 328285, 324953, 321869, 319273, 317316, 315944, 314927, 314074, 313331, 312616, 311703, 310463, 309092, 307897, 306959, 306207, 305657, 305267, 304685, 303540, 302037, 300887, 300540, 300780, 301185, 301650, 302297, 303168, 304255, 305576, 306964, 308009, 308547, 309013, 309976, 311406, 312758, 313813, 314991, 316726, 318861, 320934, 322813, 324706, 326649, 328359, 329739, 331232, 333376, 336076, 338601, 340385, 341633, 343038, 345045]
53713C45045K632L219L852M358M522M545M760M987M681L921L615M397N736O668
53699D06938P064P632Q790J0187J1397J2474J3660J5004J6481J8134J9765K0865
53687E68391K1164K1046K1129K1601K2155K2274K1293J8400J3060N449l613j3021
53675G39328k1491k7718l0937l1356k9853k7326k4473k1738j9146j6430j3691
53664D75169j1561j0258q995p076n183m551n040n201m338l280k842k680k321k167
53650C99676k531k635j694l69R7k58l73l2j30r25j345n53P18J192P51L54O27J183
53632C93753J359J096R39J359K207K858K905K580K429K706L290L947M365M180
53618D29973L350K458K175K460K804L117L754M627M993M476L715L521L831L960
$$ y = [345045, 347677, 350896, 354748, 359106, 363628, 368173, 372933, 377920, 382601, 386522, 390137, 394534, 400270, 406938, 414002, 421634, 430424, 440611, 452008, 464482, 478142, 493146, 509627, 527761, 547526, 568391, 589555, 610601, 631730, 653331, 675486, 697760, 719053, 737453, 750513, 755962, 752349, 739328, 717837, 690119, 659182, 627826, 597973, 570647, 546174, 524436, 505290, 488860, 475169, 463608, 453350, 444355, 437279, 432096, 427545, 422505, 417304, 412966, 409686, 406844, 404164, 401843, 399676, 397145, 394510, 392816, 392447, 392544, 392286, 391913, 391881, 391751, 390826, 389481, 388928, 389646, 390838, 391589, 391943, 392570, 393753, 395112, 396208, 397147, 398506, 400713, 403571, 406476, 409056, 411485, 414191, 417481, 421428, 425793, 429973, 433323, 435781, 437956, 440416, 443220, 446337, 450091, 454718, 459711, 464187, 467902, 471423, 475254, 479214]
53604D79214L586K992K564K515K966L747M188L582K056N96pK5q0n33p52l04L03
53587E06658J21j003k130k348j816j337j195r89n94o58j729l316m245l907k819
53572D78693j957j810k122k393k428k406k515k657k621k381k086j759j267o00
53558D49691M4M94O33K61p09j720j714k86J584K473K134J603J676J942J718J301
53542D61125J564K607L602M028M264M695N018M949N026N893P204Q076Q433R034
53528E35518J0152J1178J1720J2141J2709J3070J3112J3488J4559J5587J5714
53517F78948J5282J5254J5878J6738J7764J9161K0627K1649K2449K3514K4402
53506H91666K4172K3151K2931K4237K5894K6471K5936K5040K4054K2998K2362
$$ y = [479214, 482800, 485792, 488356, 490871, 493837, 497584, 501772, 505354, 507410, 508006, 507999, 508024, 507944, 507411, 506659, 506355, 506658, 506779, 505776, 503646, 501298, 499482, 498145, 496950, 495961, 495367, 494709, 492980, 489664, 485419, 481512, 478693, 476736, 474926, 472804, 470411, 467983, 465577, 463062, 460405, 457784, 455403, 453317, 451558, 450291, 449691, 449735, 450229, 450862, 451123, 450414, 448694, 446980, 446694, 448278, 450751, 452885, 454488, 456164, 458106, 459824, 461125, 462689, 465296, 468898, 472926, 477190, 481885, 486903, 491852, 496878, 502771, 509975, 518051, 526484, 535518, 545670, 556848, 568568, 580709, 593418, 606488, 619600, 633088, 647647, 663234, 678948, 694230, 709484, 725362, 742100, 759864, 779025, 799652, 821301, 843750, 867264, 891666, 915838, 938989, 961920, 986157, 1012051, 1038522, 1064458, 1089498, 1113552, 1136550, 1158912]
53495A158912K2585K3212K3391K2998K2518K2156K1795K1559K1651K1670K0947
53484A403394J9648J8752J8770J8956J8215J6391J4329J2781J1638J0265Q442
53473A571581O770N966O038O307O201N642M663L192J357l45j465j903j777j300
53459A610927r41j106j501j337o02m98k255o025j1470j8633k7261l5694m1644
53446A461960m4199m4283m3033m0662l7111l2990k9191k5983k3005j9985j7028
53435A104490j4341j1945r722p577n510l521j539M22K071L065L629M660O831R773
53421A080786J2453J4245J5331J6235J7378J9018K1140K3363K5289K6920K8422
53410A300580K9647L0347L0838L1842L3582L5559L7336L9069M1002M2886M4344
$$ y = [1158912, 1181497, 1204709, 1228100, 1251098, 1273616, 1295772, 1317567, 1339126, 1360777, 1382447, 1403394, 1423042, 1441794, 1460564, 1479520, 1497735, 1514126, 1528455, 1541236, 1552874, 1563139, 1571581, 1578351, 1584317, 1590355, 1596662, 1602863, 1608505, 1613168, 1616360, 1617717, 1617372, 1615907, 1614004, 1612227, 1610927, 1609986, 1608880, 1607379, 1606042, 1605440, 1604942, 1602687, 1596662, 1585192, 1566559, 1539298, 1503604, 1461960, 1417761, 1373478, 1330445, 1289783, 1252672, 1219682, 1190491, 1164508, 1141503, 1121518, 1104490, 1090149, 1078204, 1068482, 1060905, 1055395, 1051874, 1050335, 1050757, 1052828, 1055893, 1059522, 1064182, 1071013, 1080786, 1093239, 1107484, 1122815, 1139050, 1156428, 1175446, 1196586, 1219949, 1245238, 1272158, 1300580, 1330227, 1360574, 1391412, 1423254, 1456836, 1492395, 1529731, 1568800, 1609802, 1652688, 1697032]
53399A697032M5529M7009M9058N1336N3302N4705N5650N6263N6459N6210N5931
53388B278484N6203N6892N6836N4931N1456M7826M5099M3091M0977L8271L4964
53377B805030L1160K6889K2211J7312J2588Q500N082J668k515p460j2482j7183
53365B890800k1801k6478l0765l4220l7113m0112m3494m6969n0122n2698n4624
53354B452404n6010n7042n7710n7726n6856n5175n2947n0549m8527m7346m6885
53343A865631m6477m5685m4677m3565m1915l9393l6605l4619l3700l3091l2007
53332A433897l0345k8371k6226k3975k1795j9791j7872j6022j4512j3619j3194
53321A208175j2745j1864j0458q659o708m931l601k666j755n45Q84K236L490M967
$$ y = [1697032, 1742561, 1789570, 1838628, 1889964, 1943266, 1997971, 2053621, 2109884, 2166343, 2222553, 2278484, 2334687, 2391579, 2448415, 2503346, 2554802, 2602628, 2647727, 2690818, 2731795, 2770066, 2805030, 2836190, 2863079, 2885290, 2902602, 2915190, 2923690, 2928772, 2930440, 2927925, 2920465, 2907983, 2890800, 2868999, 2842521, 2811756, 2777536, 2740423, 2700311, 2656817, 2609848, 2559726, 2507028, 2452404, 2396394, 2339352, 2281642, 2223916, 2167060, 2111885, 2058938, 2008389, 1959862, 1912516, 1865631, 1819154, 1773469, 1728792, 1685227, 1643312, 1603919, 1567314, 1532695, 1498995, 1465904, 1433897, 1403552, 1375181, 1348955, 1324980, 1303185, 1283394, 1265522, 1249500, 1234988, 1221369, 1208175, 1195430, 1183566, 1173108, 1164449, 1157741, 1152810, 1149209, 1146543, 1144788, 1144243, 1145127, 1147363, 1150853, 1155820]
53307A155820O835Q787J0456J1946J3630J5481J7085J8351J9791K1871K4347K6516
53295A350916K7991K8944K9674L0147K9987K8880K6992K4904K2966K0848J8097
53284A640346J5156J3239J2883J3147J2604J0858Q535O148L658J028j451l640
53272A732511n798q147j0555j2804j4835j6553j7745j8496j9356k0783k2603k4338
53260A540498k5823k7201k8442k9296k9760l0226l1014l1944l2550l2577l2151
53249A209514l1519l0850l0239k9707k9118k8237k7043k5920k5307k5135k4844
53238I01595k4017k2826k1690k0737j9837j8939j8024j6881j5363j3821j2867
53227F96593j2600j2505j2169j1678j1197j0662j0150r961r965r456q323p788
$$ y = [1155820, 1162655, 1171442, 1181898, 1193844, 1207474, 1222955, 1240040, 1258391, 1278182, 1300053, 1324400, 1350916, 1378907, 1407851, 1437525, 1467672, 1497659, 1526539, 1553531, 1578435, 1601401, 1622249, 1640346, 1655502, 1668741, 1681624, 1694771, 1707375, 1718233, 1726768, 1732916, 1736574, 1737602, 1736151, 1732511, 1726713, 1718566, 1708011, 1695207, 1680372, 1663819, 1646074, 1627578, 1608222, 1587439, 1564836, 1540498, 1514675, 1487474, 1459032, 1429736, 1399976, 1369750, 1338736, 1306792, 1274242, 1241665, 1209514, 1177995, 1147145, 1116906, 1087199, 1058081, 1029844, 1002801, 976881, 951574, 926439, 901595, 877578, 854752, 833062, 812325, 792488, 773549, 755525, 738644, 723281, 709460, 696593, 683993, 671488, 659319, 647641, 636444, 625782, 615632, 605671, 595706, 586250, 577927, 570139]
53215E70139r020j1230j2241j1076r037p851p681p537o903o084n386m815m473
53202D66805m513m767m945n119n446n573m981l890l196l275l554l410k955k648
53188D08533k636k796k996l007k596j993j864k425l041l014k429j756j134n58
53174C76288l64q19j471j629j337j181j227r24j94J99l36j357j887j436k75R67
53158C63017J685J598R21J21o20j461k336k713k132q06N00J039N22o25j432j126
53142C56152N0J129J578J785K219K626K473J851J417J571K090K540K729K797L035
53127C86042L626M367M781M577L879K961J986J115M93r2j094k485l519l680l476
53112C99481l710m221m101l111k142k048k614l028k911k444j815r98o9O12P08
$$ y = [570139, 561119, 549889, 537648, 526572, 517535, 509684, 502003, 494466, 487563, 481479, 476093, 471278, 466805, 462292, 457525, 452580, 447461, 442015, 436442, 431461, 427571, 424375, 421100, 417546, 414136, 411181, 408533, 405897, 403101, 400105, 397098, 394502, 392509, 390645, 388220, 385179, 382165, 379736, 377980, 376846, 376288, 375924, 375105, 373634, 372005, 370668, 369487, 368260, 367336, 367142, 367341, 367005, 365648, 363761, 362325, 362050, 363017, 364702, 366300, 367221, 367342, 366722, 365261, 362925, 360212, 358080, 357274, 357774, 358813, 359335, 358710, 357278, 356152, 356202, 357331, 358909, 360694, 362913, 365539, 368012, 369863, 371280, 372851, 374941, 377481, 380210, 383007, 386042, 389668, 394035, 398816, 403393, 407272, 410233, 412219, 413334, 413827, 413735, 412641, 410156, 406637, 402957, 399481, 395771, 391550, 387449, 384338, 382196, 380148, 377534, 374506, 371595, 369151, 367336, 366338, 366269, 366881, 367589]
53097C67589K12n44j125j213o64M80J872K882L007K398J776J688J992K212K156
53082C84718J887J407P24J78J82O24Q89N48k53j118j747j926j601j113j015j447
53066C80937k012k376k707l189l487l151k363j835j933k272k288j895j397j016
53052C49016o85l01P0K47J18k86q05j278j645j940k148k056j525q69p64j417k077
53035C31655j769n61M12L63j42k4Q06J362R26p3o35l32L34N77J61m09m77lN13
53016C32684P92J087J489J490P21k42m64J18P44R91J106J171Q55K62J45Q37J609
52999C45395J669J156O19J05m72o68m8Q77J208R64R19J239J279Q68P72J426K097
52982C59405J944J347J328K003K444K045J312J050J257J252O44j88n61j58Q43
$$ y = [367589, 367801, 367257, 366132, 364919, 364255, 364735, 366607, 369489, 372496, 374894, 376670, 378358, 380350, 382562, 384718, 386605, 388012, 388736, 388914, 389096, 389720, 390609, 391157, 390904, 389786, 388039, 386113, 384512, 383399, 382384, 380937, 378925, 376549, 373842, 370653, 367166, 364015, 361652, 359817, 357884, 355612, 353324, 351429, 350032, 349016, 348331, 348030, 348100, 348347, 348465, 348179, 347374, 346096, 344451, 342511, 340363, 338307, 336782, 335913, 335149, 333732, 331655, 329886, 329325, 329737, 330100, 329958, 329934, 330740, 332102, 333028, 332955, 332320, 331988, 332322, 332899, 333060, 332651, 332174, 332171, 332684, 333476, 334563, 336052, 337542, 338263, 338021, 337557, 337675, 338419, 339410, 340516, 341687, 342542, 342804, 342949, 343786, 345395, 347064, 348220, 348839, 348944, 348472, 347804, 347756, 348633, 349841, 350805, 351724, 352963, 354242, 355110, 355882, 357308, 359405, 361349, 362696, 364024, 366027, 368471, 370516, 371828, 372878, 374135, 375387, 376031, 375843, 375282, 375124, 375967]
52967C75967K004K779K651J547J63m65j2P70R26L19m62j005j463k147l095m030
52951C74447m507m137l013j841j272j146q12j20L96L24j21o55j357k250k885k831
52935C48220k250j591r64k40L87M62p9p47j049r37o68m53l72m55o92r66j037p14
52917C35855j33K69K47J22L80R39J214J020Q39J023J229R94M60N3j92m07m00O2
52899C43574N69M58k31p80q17o60n56k86K44O01M55J25J23M10N10J46n45j245
52881C42095j638j515j003n63n26p28p69n24k50k54n98j022j085n66K30P01O13
52864C32598K96J49J92K62L20L62K65L2m2K79P23P53J82o17j080r72n62l88o87
52845C32065j045r13l98j99n76q51l06Q23J663J753J330Q30N21N49Q77J230J389
$$ y = [375967, 377971, 380750, 383401, 384948, 385111, 384646, 384634, 385404, 386330, 386649, 386187, 385182, 383719, 381572, 378477, 374447, 369940, 365803, 362790, 360949, 359677, 358531, 357719, 357599, 357995, 358319, 358198, 357543, 356186, 353936, 351051, 348220, 345970, 344379, 343415, 343175, 343562, 344024, 343945, 343198, 342149, 341212, 340544, 340091, 339719, 339264, 338572, 337606, 336569, 335855, 335722, 335991, 336238, 336360, 336740, 337679, 338893, 339913, 340752, 341775, 343004, 343998, 344458, 344511, 344319, 343912, 343512, 343574, 344143, 344601, 344370, 343590, 342773, 342113, 341557, 341271, 341515, 342116, 342571, 342696, 342819, 343229, 343739, 343885, 343340, 342095, 340457, 338942, 337939, 337376, 336850, 336122, 335353, 334829, 334579, 334325, 333727, 332705, 331620, 331054, 331284, 331985, 332598, 332894, 333043, 333235, 333497, 333817, 334179, 334444, 334476, 334434, 334713, 335436, 336189, 336371, 335754, 334674, 333702, 333140, 332752, 332065, 331020, 330107, 329709, 329510, 328934, 328083, 327777, 328600, 330263, 332016, 333346, 334176, 334697, 335246, 336123, 337353, 338742]
52828C38742J473J615J578J099M09r8n03j101j635j496p10o1J4oM24J080J407
52811C42231J352J281J405J708K298L280M366N034N120M891M484L500J380j824
52797C80506n165p379p865p051n787m506l231k169j775k030k169j501l70J40n77
52782C29071j954k805k418j122R8N00J81k21l31l40n08o46m12Q4L05j5m90n46
52764C18431j23L35N53P90J371K011K011J170J90j30J50L13j1m57n91m55l00j37
52746C25121J35L68K75j20m34l60j6K42K91L56O24Q70O83Q1l70k54K11N66P58
52727C29027R89J106O61l95j428j741j210l42J79K0m90o80l39l1k72p64q66n98
52709C22826m93o26n95l67l65o02n93k44l4n3K18Q39J047N17O2L82R56R36M79
$$ y = [338742, 340215, 341830, 343408, 344507, 344916, 344818, 344315, 343214, 341579, 340083, 339373, 339312, 339326, 339320, 339744, 340824, 342231, 343583, 344864, 346269, 347977, 350275, 353555, 357921, 362955, 368075, 372966, 377450, 380950, 382330, 380506, 375341, 367962, 360097, 353046, 347259, 342753, 339522, 337353, 335578, 333548, 331379, 329878, 329508, 329648, 329071, 327117, 324312, 321894, 320772, 320870, 321370, 321551, 321330, 320999, 320659, 320151, 319505, 319093, 319177, 319482, 319467, 318977, 318431, 318308, 318643, 319196, 319986, 321357, 323368, 325379, 326549, 326739, 326609, 326759, 327072, 327061, 326604, 326013, 325558, 325258, 325121, 325256, 325624, 325899, 325779, 325345, 324985, 324969, 325211, 325502, 325858, 326482, 327352, 328035, 328116, 327746, 327492, 327703, 328269, 329027, 330016, 331122, 331783, 331388, 329960, 328219, 327009, 326667, 326846, 326866, 326376, 325696, 325357, 325326, 325054, 324290, 323424, 322826, 322333, 321707, 321112, 320745, 320380, 319778, 319185, 318941, 318907, 318854, 319072, 319911, 320958, 321475, 321537, 321919, 322875, 323811, 324290]
52690C24290K86M82Q14J333J920J755M42q42o30P01J500J342J406K198K548J541
52674C41086M7n65k09L62R04J542J930J649J119J121J473J178o4j176r45N65K076
52657C52093K394J414L9p64p75m20o1L00O58P83N96L98L91K94j92p21o31J59R46
52638C56901J124Q37N94M72J21n24q94m41O07J459J719J713J795J802J539J299
52622C70123J375J361O12o62j480j384r35p86p69m22J49L78N9l81m15J1M72N68
52604C67874M10M53P57P23n7r90j137m96P0K09N10J321K040K077J792J765J729
52587C79050R98l43j397j538r15%Q53J429J649J605J334P77J45k0M59R70Q49K91
52569C86196j4P7J13r6j87J12N83Q01N34j80r45j178o66R4N15O52Q27Q56L31l96
$$ y = [324290, 324576, 325058, 325872, 327205, 329125, 330880, 331322, 330480, 329850, 330551, 332051, 333393, 334799, 336997, 339545, 341086, 341133, 340568, 340359, 340721, 341625, 343167, 345097, 346746, 347865, 348986, 350459, 351637, 351573, 350397, 349452, 350017, 352093, 354487, 355901, 355940, 355176, 354401, 353981, 353920, 354220, 354878, 355661, 356257, 356655, 357046, 357340, 357148, 356427, 355796, 355955, 356901, 358025, 358862, 359456, 359928, 360049, 359525, 358631, 358190, 358797, 360256, 361975, 363688, 365483, 367285, 368824, 370123, 371498, 372859, 373471, 372809, 371329, 369945, 369010, 368224, 367455, 367033, 367182, 367560, 367619, 367238, 366823, 366834, 367306, 367874, 368284, 368737, 369494, 370217, 370160, 369170, 368033, 367537, 367607, 367816, 368326, 369647, 371687, 373764, 375556, 377321, 379050, 380048, 379705, 378308, 376770, 375855, 375855, 376708, 378137, 379786, 381391, 382725, 383502, 383647, 383627, 384086, 385056, 385905, 386196, 386182, 386259, 386372, 386276, 386089, 386201, 386784, 387585, 388119, 387939, 386994, 385816, 385150, 385244, 385759, 386411, 387238, 388094, 388425, 388029]
52549C88029l98N18J477J759J590J420J111M42j78k10J48K76R5J45O68J190J145
52532C99227N30j54m16j56K95M58K18L5M55J408K153K119J565J280J619K121K133
52515D14890J691J456J876K683L314L527L393K934K141J214M41j70q07j497k107
52500D34979k654l248l711l658l061k397k051j933j797j620j435j099n48m7J38
52485D05858J57L89Q90J288J172M45n70j278j215n04J87M11L91O54J305J994K421
52468D13995K526K243J584R33Q69J449K014J979J548J309J348J157M27n08j173
52453D31700j589k110k746l056k705j873r91l06R6R8l29q43q98k82O36J283J347
52436D17432Q89J79m85r12j111j222j267j095o44j46Q4K1o3L4K17L24M23P10J065
$$ y = [388029, 387631, 388149, 389626, 391385, 392975, 394395, 395506, 395948, 395770, 395560, 395708, 395984, 396079, 396224, 396892, 398082, 399227, 399757, 399603, 399187, 399031, 399326, 399784, 400002, 400037, 400492, 401900, 404053, 406172, 407737, 409017, 410636, 412757, 414890, 416581, 418037, 419913, 422596, 425910, 429437, 432830, 435764, 437905, 439119, 439560, 439390, 438583, 437086, 434979, 432325, 429077, 425366, 421708, 418647, 416250, 414199, 412266, 410469, 408849, 407414, 406315, 405767, 405720, 405858, 406015, 406404, 407294, 408582, 409754, 410199, 409629, 408351, 407136, 406632, 406819, 407230, 407621, 408275, 409580, 411574, 413995, 416521, 418764, 420348, 421281, 422150, 423599, 425613, 427592, 429140, 430449, 431797, 432954, 433381, 432873, 431700, 430111, 428001, 425255, 422199, 419494, 417621, 416630, 416324, 416420, 416518, 416189, 415346, 414448, 414166, 414802, 416085, 417432, 418321, 418500, 418015, 417103, 415992, 414770, 413503, 412408, 411764, 411618, 411702, 411723, 411660, 411694, 411911, 412235, 412658, 413368, 414433]
52417D14433J046N73L59J238K947M209M266L845M110N072N831O161O773P855Q424
52402D77142P779O738O501O729N820L025p09m081o671q496r264q769p573o529
52388D61642n811m971l861k898k369j990j361m97L41J058J756K433K923L098L038
52373D52531K980L103L333L419L298L257L526L714L012J172j002k370k590k287
52359D75096k139k146j850j072k56j7m86j091j069j53J269K593L406L525L034
52344D78644K427K429L243M191M405L825L194L156L759M720N718O426O678O831
52330E39646P504Q776J0035J0733J0969J1150J1534J2268J3351J4188J3813J2124
52318F76091J0417R961J0382J0307R384Q783R520J1159J2565J3240J3480J3668
$$ y = [414433, 415479, 416052, 416411, 417649, 420596, 424805, 429071, 432916, 437026, 442098, 447929, 454090, 460863, 468718, 477142, 484921, 491659, 498160, 504889, 510709, 513734, 513025, 508944, 502273, 493777, 484513, 475744, 468171, 461642, 455831, 450860, 446999, 444101, 441732, 439742, 438381, 437884, 438225, 439283, 441039, 443472, 446395, 449493, 452531, 455511, 458614, 461947, 465366, 468664, 471921, 475447, 479161, 482173, 483345, 482343, 479973, 477383, 475096, 472957, 470811, 468961, 467889, 467633, 467616, 467130, 466039, 464970, 464817, 466086, 468679, 472085, 475610, 478644, 481071, 483500, 486743, 490934, 495339, 499164, 502358, 505514, 509273, 513993, 519711, 526137, 532815, 539646, 547150, 555926, 565961, 576694, 587663, 598813, 610347, 622615, 635966, 650154, 663967, 676091, 686508, 696469, 706851, 717158, 726542, 735325, 744845, 756004, 768569, 781809, 795289, 808957]
52306H08957J3914J4164J4250J3954J3243J2306J1250J0021Q745P769P153O448
52294I42174N247L684K116O42p03j684k195k634l378m101m171l675l356l479l411
52279I21076k640j607j075j051r14l45M37J302K436L825M995N541N644N772O156
52264I49552O813P827R185J0464J1102J1044J0796J0808J1070J1333J1437J1321
52252A072752J1014J0727J0547J0028Q491N997L548J918Q28k52r90p65m8j70j490
52237A132135k815l014k455k275k739l088k649j469k2J089J288M99n24q41m00
52222A112720j1j73l99N4J192K373L103L389L462L552L958M919O248P269P365
52207A159021O595N641N197N526O437P455P996P726P043O840P517Q343Q256P194
$$ y = [808957, 822871, 837035, 851285, 865239, 878482, 890788, 902038, 912059, 920804, 928573, 935726, 942174, 947421, 951105, 953221, 953863, 953160, 951476, 949281, 946647, 943269, 939168, 934997, 931322, 927966, 924487, 921076, 918436, 916829, 915754, 914703, 913789, 913444, 913881, 915183, 917619, 921444, 926439, 931980, 937624, 943396, 949552, 956365, 964192, 973377, 983841, 994943, 1005987, 1016783, 1027591, 1038661, 1049994, 1061431, 1072752, 1083766, 1094493, 1105040, 1115068, 1123559, 1129556, 1133104, 1135022, 1135850, 1135598, 1134608, 1133843, 1133795, 1133625, 1132135, 1129320, 1126306, 1123851, 1121576, 1118837, 1115749, 1113100, 1111631, 1111609, 1112698, 1113986, 1114485, 1113961, 1113120, 1112720, 1112709, 1112536, 1112137, 1112191, 1113383, 1115756, 1118859, 1122248, 1125710, 1129262, 1133220, 1138139, 1144387, 1151656, 1159021, 1165616, 1171257, 1176454, 1181980, 1188417, 1195872, 1203868, 1211594, 1218637, 1225477, 1232994, 1241337, 1249593, 1256787]
52193A256787O137N802N824N502M790M144L644K899J686K63j058k284l555m816
52179A285765n855o616p340q226q980q845p479n679m781n125n563m883l268j838
52165A201287j034k29J153K775L922M362M440M613N119N797O132N701M651L479
52151A252168K386J245K16j87Q4L77K30NJ28K67j05p14q70o51q51j750k715l193
52133A246070l320l240k628j351J4R58J830L249N052O610P907R541J1660J3724
52119A296076J5343J6741J8125J9281K0132K1033K2118K2784K2391K1113J9659
52108A514796J8420J7383J6636J6333J6234J5919J5396J5093J5168J5333J5316
52097A692027J5050J4354J3043J1462J0316R660Q638O605L973J433j193m507q223
$$ y = [1256787, 1262924, 1268726, 1274550, 1280052, 1284842, 1288986, 1292630, 1295529, 1297215, 1297478, 1296420, 1294136, 1290581, 1285765, 1279910, 1273294, 1265954, 1257728, 1248748, 1239903, 1232424, 1226745, 1221964, 1216839, 1211276, 1206393, 1203125, 1201287, 1200253, 1200024, 1201177, 1203952, 1207874, 1212236, 1216676, 1221289, 1226408, 1232205, 1238337, 1244038, 1248689, 1252168, 1254554, 1255799, 1256015, 1255828, 1255912, 1256289, 1256519, 1256524, 1256652, 1256919, 1256814, 1256100, 1255230, 1254579, 1253728, 1251978, 1249263, 1246070, 1242750, 1239510, 1236882, 1235531, 1235545, 1236503, 1238333, 1241582, 1246634, 1253244, 1261151, 1270692, 1282352, 1296076, 1311419, 1328160, 1346285, 1365566, 1385698, 1406731, 1428849, 1451633, 1474024, 1495137, 1514796, 1533216, 1550599, 1567235, 1583568, 1599802, 1615721, 1631117, 1646210, 1661378, 1676711, 1692027, 1707077, 1721431, 1734474, 1745936, 1756252, 1765912, 1774550, 1781155, 1785128, 1786561, 1785368, 1780861, 1772638]
52084A772638j1017j1876j1009r242p076m624k048L54K359L791M402M090L264
52071A734006K707L020M282O182Q257R997J0951J0991J0445R796R253Q688P944
52058A836519P080O259N560M975M492M070L591K928K002P86o55k120l446m781
52044A867260o362p924q712q452p957q201r010r281q428o884n153l256j472q26
52030A775342k016m251n944o321n891n485n547o243p481q666r053q579p991p886
$$ y = [1772638, 1761621, 1749745, 1738736, 1729494, 1722418, 1717794, 1715746, 1716100, 1718459, 1722250, 1726652, 1730742, 1734006, 1736713, 1739733, 1744015, 1750197, 1758454, 1768451, 1779402, 1790393, 1800838, 1810634, 1819887, 1828575, 1836519, 1843599, 1849858, 1855418, 1860393, 1864885, 1868955, 1872546, 1875474, 1877476, 1878262, 1877607, 1875487, 1872041, 1867260, 1860898, 1852974, 1844262, 1835810, 1827853, 1819652, 1810642, 1801361, 1792933, 1786049, 1780896, 1777640, 1776168, 1775342, 1773326, 1769075, 1763131, 1756810, 1750919, 1745434, 1739887, 1733644, 1726163, 1717497, 1708444, 1699865, 1691874, 1683988]
$$ [...]
##END NTUPLES=NMR SPECTRUM
##END=
