##TITLE=AC1549_ROEFFECT0014_8268862_wcNlsfVCId
##JCAMPDX= 6.0         $$ Bruker NMR JCAMP-DX V2.0
##DATA TYPE= NMR SPECTRUM
##DATA CLASS= NTUPLES
##ORIGIN= BRUKER
##OWNER= Administrator
$$ 1.72 TOPSPIN		Version 2.1
$$ 2013-10-11 22:38:25.352 -0700  Administrator@X
$$ Compression mode = diff/dup
##.OBSERVE FREQUENCY= 400.02188249412
##.OBSERVE NUCLEUS= ^1H
##.ACQUISITION MODE= SIMULTANEOUS (DQD)
##.ACQUISITION SCHEME= undefined
##.AVERAGES= 8
##.DIGITISER RES= 22
##SPECTROMETER/DATA SYSTEM= spect
##.PULSE SEQUENCE= zg30
##.SOLVENT NAME= COFFEE_meoh
##.SHIFT REFERENCE= INTERNAL, COFFEE_meoh, 1, 14.98509
##AUDIT TRAIL= $$ (NUMBER, WHEN, WHO, WHERE, PROCESS, VERSION, WHAT)
$$ ##TITLE= Audit trail, TOPSPIN		Version 2.1
$$ ##JCAMPDX= 5.01
$$ ##ORIGIN= Bruker BioSpin GmbH
$$ ##OWNER= Administrator
$$ $$ E:\/data/COFFEE/nmr/AC1549_ROEFFECT0014_8268862_wcNlsfVCId/10/pdata/1/auditp.txt
$$ ##AUDIT TRAIL=  $$ (NUMBER, WHEN, WHO, WHERE, PROCESS, VERSION, WHAT)
(   1,<2013-10-11 22:38:18.633 -0700>,<Administrator>,<X>,<go>,<TOPSPIN 2.1>,
      <created by zg
	started at 2013-10-11 22:37:12.321 -0700,
	POWCHK enabled, PULCHK disabled,
       configuration hash MD5:
       C8 4E 4E 5D D3 5C D8 9E 9F 52 82 E0 59 8A DE 15
       data hash MD5: 64K
       AA D5 38 9C F4 B4 B0 F9 EE 34 3D FA 86 66 AE EE>)
(   2,<2013-10-11 22:38:21.571 -0700>,<Administrator>,<X>,<proc1d>,<TOPSPIN 2.1>,
      <Start of raw data processing
       efp LB = 0 FT_mod = 6 PKNL = 1 PHC0 = 0 PHC1 = 0 SI = 32K 
       data hash MD5: 32K
       35 FF 18 40 D3 74 0D B4 85 00 B7 B2 9C 78 39 CA>)
(   3,<2013-10-11 22:38:21.914 -0700>,<Administrator>,<X>,<proc1d>,<TOPSPIN 2.1>,
      <pk PHC0 = 94.14185 PHC1 = 0 
       data hash MD5: 32K
       EA 78 B5 C5 EB A4 68 F9 00 4B 00 68 B6 CD 45 51>)
(   4,<2013-10-11 22:38:22.024 -0700>,<Administrator>,<X>,<proc1d>,<TOPSPIN 2.1>,
      <abs ABSG = 1 
       data hash MD5: 32K
       58 57 95 A8 B9 CE 60 E5 FC 87 45 22 25 42 BF E1>)
(   5,<2013-10-11 22:38:22.086 -0700>,<Administrator>,<X>,<proc1d>,<TOPSPIN 2.1>,
      <abs ABSG = 2 
       data hash MD5: 32K
       DD BF 37 8F CF 52 63 5F 5C A4 76 58 E3 73 57 73>)
(   6,<2013-10-11 22:38:22.133 -0700>,<Administrator>,<X>,<proc1d>,<TOPSPIN 2.1>,
      <abs ABSG = 3 
       data hash MD5: 32K
       DE C5 E2 EA FA CE 34 BB 2D 99 FD E7 05 49 8E 38>)
(   7,<2013-10-11 22:38:22.227 -0700>,<Administrator>,<X>,<proc1d>,<TOPSPIN 2.1>,
      <abs ABSG = 4 
       data hash MD5: 32K
       CE 32 29 ED ED 2C DA BB 5A 5B BF 25 38 40 D8 11>)
(   8,<2013-10-11 22:38:22.274 -0700>,<Administrator>,<X>,<proc1d>,<TOPSPIN 2.1>,
      <abs ABSG = 5 
       data hash MD5: 32K
       DF 76 EF FF 9B 77 88 FB 90 14 BD 64 A4 1B 74 FA>)
$$ ##END=
$$ 
$$ $$ hash MD5
$$ $$ F4 95 45 BF F2 C3 EA D6 C4 F2 C3 9C 32 03 E6 9B
##$RELAX= 
##$RELAX= 
##$RELAX= 
##$RELAX= 
##$RELAX= 
##$RELAX= 
##$RELAX= 
$$ Bruker specific parameters
$$ --------------------------
##$DU= <E:\>
##$EXPNO= 10
$$ [...]
##$TP= (0..7)
150 150 150 150 150 150 150 150
##$TP07= 0
##$TPNAME0= <>
##$TPNAME1= <>
##$TPNAME2= <>
##$TPNAME3= <>
##$TPNAME4= <>
##$TPNAME5= <>
##$TPNAME6= <>
##$TPNAME7= <>
##$TPOAL= (0..7)
0.5 0.5 0.5 0.5 0.5 0.5 0.5 0.5
##$TPOFFS= (0..7)
0 0 0 0 0 0 0 0
##$TUNHIN= 0
##$TUNHOUT= 0
##$TUNXOUT= 0
##$USERA1= <user>
##$USERA2= <user>
##$USERA3= <user>
##$USERA4= <user>
##$USERA5= <user>
##$V9= 5
##$VALIST= <valist>
##$VCLIST= <CCCCCCCCCCCCCCC>
##$VD= 0
##$VDLIST= <DDDDDDDDDDDDDDD>
##$VPLIST= <PPPPPPPPPPPPPPP>
##$VTLIST= <TTTTTTTTTTTTTTT>
##$WBST= 1024
##$WBSW= 4
##$XGAIN= (0..3)
0 0 0 0
##$XL= 0
##$YL= 0
##$YMAX_a= 638549
##$YMIN_a= -541507
##$ZGOPTNS= <>
##$ZL1= 120
##$ZL2= 120
##$ZL3= 120
##$ZL4= 120
##$ABSF1= 14.98509
##$ABSF2= -5.573092
##$ABSG= 5
##$ABSL= 3
##$ALPHA= 0
##$AQORDER= 0
##$ASSFAC= 0
##$ASSFACI= 0
##$ASSFACX= 0
##$ASSWID= 0
##$AUNMP= <proc_prof1d_extract_pilot.lims>
##$AXLEFT= 0
##$AXNAME= <>
##$AXNUC= <1H>
##$AXRIGHT= 0
##$AXTYPE= 0
##$AXUNIT= <>
##$AZFE= 0.1
##$AZFW= 0.1
##$BCFW= 0
##$BC_mod= 0
##$BYTORDP= 0
##$COROFFS= 0
##$CY= 15
##$DATMOD= 1
##$DC= 0
##$DFILT= <>
##$DTYPP= 0
##$F1P= 0
##$F2P= 0
##$FCOR= 0.5
##$FTSIZE= 32768
##$FT_mod= 6
##$GAMMA= 0
##$GB= 0
##$INTBC= 1
##$INTSCL= 1
##$ISEN= 128
##$LB= 0
##$LEV0= 0
##$LPBIN= 0
##$MAXI= 10000
##$MC2= 0
##$MEAN= 0
##$ME_mod= 0
##$MI= 0
##$NCOEF= 0
##$NC_proc= -8
##$NLEV= 6
##$NOISF1= 0
##$NOISF2= 0
##$NSP= 0
##$NTH_PI= 0
##$NZP= 0
##$OFFSET= 14.98509
##$PC= 1
##$PHC0= 94.14185
##$PHC1= 0
##$PH_mod= 1
##$PKNL= yes
##$PPARMOD= 0
##$PPDIAG= 0
##$PPIPTYP= 0
##$PPMPNUM= 2147483647
##$PPRESOL= 1
##$PSCAL= 4
##$PSIGN= 0
##$PYNMP= <proc.py>
##$REVERSE= no
##$SF= 400.02
##$SI= 32768
##$SIGF1= 0
##$SIGF2= 0
##$SINO= 400
##$SIOLD= 32768
##$SPECTYP= <>
##$SREGLST= <1H.CDCl3>
##$SSB= 0
##$STSI= 32768
##$STSR= 0
##$SW_p= 8223.68421052631
##$SYMM= 0
##$S_DEV= 0
##$TDeff= 65536
##$TDoff= 0
##$TI= <>
##$TILT= no
##$TM1= 0
##$TM2= 0
##$TOPLEV= 0
##$USERP1= <user>
##$USERP2= <user>
##$USERP3= <user>
##$USERP4= <user>
##$USERP5= <user>
##$WDW= 1
##$XDIM= 32768
##$YMAX_p= 453295595
##$YMIN_p= -676836
##$CURPLOT= <Network HP LaserJet P1505>
##$CURPRIN= <$Network HP LaserJet P1505>
##$DFORMAT= <normdp>
##$LAYOUT= <+/1D_H.xwp>
##$LFORMAT= <normlp>
##$PFORMAT= <normpl>
##$SURQMSG= 1
$$ End of Bruker specific parameters
$$ ---------------------------------
##NTUPLES= NMR SPECTRUM
##VAR_NAME=  FREQUENCY,     SPECTRUM/REAL,   SPECTRUM/IMAG
##SYMBOL=    X,             R,               I
##VAR_TYPE=  INDEPENDENT,   DEPENDENT,       DEPENDENT
##VAR_FORM=  AFFN,          ASDF,            ASDF
##VAR_DIM=   32768,         32768,           32768
##UNITS=     HZ,            ARBITRARY UNITS, ARBITRARY UNITS
##FACTOR=    0.250966925370066, 1,           1
##FIRST=     8223.43324360094, -104548,      72171
##LAST=      0,             -36067,          -166197
##MIN=       0,             -676836,         0
##MAX=       8223.43324360094, 453295595,    0
$$ Real data points
##PAGE= N=1
##DATA TABLE= (X++(R..R)), XYDATA
$$ [...]
19564b59488j356H276R1988O7614C8207b08057N6924I9180O537a44496e5139m0083
19552i5222k0030m072A5795f4034m6082J8809j94823N1565O1924E0763b58047
19540a80927A03211J22428b50176G4650i3558C6553A000a07406k59505D2214c4894
19528A51165J07580A03805a12592B65387G8775f6610k33238a32432b3047C82519
19517b72526j39578B23127c8267k74660E8721J42197d16916J42320A34949a19556
19506i1773l48945A25348Q0500a81526A29471C336i1254A97667n7973e9693k64261
19495c23954B588b00216o5027A72236e8030k2407K9989H7966J9610a19618H7573
19483d4772m7349m6737C8992d490j42645j21572n1026B60948C4489b85220c9826
$$ y = [-259488, -260844, 8276, 100264, 167878, 38207, -208057, -151133, 99180, 105717, -144496, -55139, -95222, -115252, -119324, 15795, -64034, -110116, -91307, -286130, -234565, -172641, 50763, -258047, -180927, 103211, 225639, -250176, 74650, -93558, 36553, 1000, -107406, -366911, 42214, -34894, 151165, 258745, 103805, -112592, 265387, 78775, -66610, -299848, -132432, -23047, 382519, -272526, -412104, 223127, -38267, -312927, 58721, 200918, -416916, -274596, 134949, -119556, -91773, -440718, 125348, 205848, -181526, 129471, 3336, -91254, 197667, 139694, -59693, -323954, 2588, -200216, -265243, 172236, -58030, -80437, -50448, 87966, 107576, -119618, 87573, -44772, -92121, -138858, 38992, -4490, -147135, -268707, -319733, 260948, 34489, -285220, -39826]
19471g4689G8733b79714I8102f958A41560J53265j03226e8068J4027m1823o4252
19460a50116B76042b48789C3670Q9941B5630N4238P3994g6772a8925A99820a04161
19448c7723p4371L6386A45381a48381b33A74075j8023p0693J70962d1344F6239
19436a90597g9941C55031a98362d2980G5227c30490d3723a3918j110B19584m7847
19425A71737b55395P6194g9520r6465o0395a0816C08120D6744Q8032E1812J31087
19414A82899b27811g251j54367E4723a01139r2175A31190h6436D4717f754j54613
19403a61367c0423G3344N4970k1823c40516B29177h0206j97295l2389r6604d1987
19391e3436B1157a80562a7138G1278l3172c39314B3949a40254D8882c29748O4529
$$ y = [-74689, 78733, -279714, 98102, -6958, 141560, 294825, 191599, -58068, -44041, -85864, -150116, 276042, -248789, 33670, 123611, 25630, 79868, 153862, -76772, -18925, 199820, -104161, -37723, -112094, -75708, 145381, -148381, -233, 174075, 156052, 85359, 256321, -41344, 66239, -190597, -79941, 355031, -198362, -42980, 75227, -330490, -43723, -13918, -15028, 219584, 171737, -255395, -179201, -79520, -175985, -236380, -10816, 308120, 46744, 134776, 51812, 182899, -227811, -7251, -161618, 54723, -101139, -193314, 131190, -86436, 44717, -6754, -161367, -30423, 73344, 128314, 106491, -340516, 229177, -80206, -277501, -309890, -406494, -41987, -53436, 21157, -180562, -17138, 71278, 38106, -339314, 23949, -140254, 48882, -329748, -265219]
19380b65219m5730a29713k94126a67428B58632i6974K2766E7473a2802A01770
19369b18392f1179j49619m2377H1174f0401A82096a19461o2941g1641A2235e2414
19357b08694j04883f4332C3414b88799J05748j47255G7773f4556H4785L9904E2409
19345a04110A95550a47241B33003r1298j4994J0231l8534m1243b10211e6484p0632
19334a27116j6808M5021j01633B11272f9339D2398J93239a70782r6092B91554
19323H7510c7054A69289a52758n9789e8521C31721i3017k65777g7790B34797g2095
19311B62111E1021c88667C2568a2787k23222A62132M6343g4876k2653o8709F5144
19299E5995H626J74613l4521C546J8125J43900F9776i6327J4780B77554d85452
$$ y = [-265219, -310949, -129713, -423839, -167428, 258632, -96974, -74208, 57473, -12802, 101770, -218392, -61179, -210798, -253175, 81174, -60401, 182096, -119461, -182402, -71641, 12235, -52414, -208694, -313577, -64332, 33414, -288799, -183051, -330306, 77773, -64556, 84785, 124689, 52409, -104110, 195550, -147241, 233003, 141705, 126711, 136942, 98408, 57165, -210211, -56484, -127116, -143924, -98903, -200536, 211272, -69339, 42398, 235637, -170782, -266874, 291554, 87510, -37054, 169289, -152758, -212547, -58521, 331721, -93017, -358794, -77790, 234797, -72095, 262111, 51021, -388667, 32568, -12787, -236009, 162132, 208475, -74876, -97529, -166238, 65144, 55995, 8626, 183239, 148718, 3546, 21671, 165571, 69776, -96327, -81547, 277554, -485452]
19287a46841a3685k7782j67659K8775l4084k51880A26106J2852a40694c7390A31436
19275A55063b31584A05130K2133M2635b7859j16244f7620p0213B34714a63742
19264B42197b30192L0908g6732k54871F5602a49470L3208L7409R356q2830A55144
19252D0339a7338m36401A43309b33174P7918j1427M0361L4911r1414D933h2225
19240a4434m9159p0223E4509k580a01860B09442a16851A24228K2275a55815f0290
19228a12367j98937F471J21727d13762d6029b1858l22212A44821E1106a58833
19217a16466j5891l7145d0536i227H6630b53095B02345G8644c4689o006B03185
19205G6111e3077A02144h8013n8842B47394r9191b7118H4006b30765B15479C2274
$$ y = [-146841, -13685, -41467, -209126, -180351, -214435, -466315, 126106, 138958, -140694, -37390, 131436, 155063, -231584, 105130, 127263, 169898, -27859, -144103, -67620, -137833, 234714, -163742, 242197, -230192, -199284, -76732, -331603, 65602, -149470, -116262, -78853, -69497, -152327, 155144, 40339, -17338, -453739, 143309, -233174, -155256, -166683, -126322, -91411, -182825, 4933, -82225, -14434, -63593, -133816, 54509, 51929, -101860, 209442, -116851, 124228, 146503, -155815, -60290, -112367, -311304, 6471, 128198, -413762, -46029, -21858, -344070, 144821, 51106, -158833, -116466, -132357, -169502, -40536, -9227, 86630, -253095, 202345, 78644, -34689, -40695, 203185, 76111, -53077, 102144, -88013, -146855, 247394, 148203, -27118, 84006, -230765, 215479, 32274]
19193b08711M1491n7750p6A24045h0813A52231b13837F1307b52519J13128a8974
19181C2382a46835k76983a31589N9176j15992B0845a79304B35568h8572A59874
19170a70517G1599b2359k31500k79708a99462E3775P6576a87892j10519a29521
19159B69313c3011j55816g0477H4299Q9692a57447N8155r4519D8880a02768J2128
19148i0640j69207A2517a91941f4445q8490a0967j88519A80498o1635a10318o1460
19137a71778M1905D141L8651e4778j12548l3370f5738n330E1963D512N6725b48467
19124c7346k37904A15245E4890J21825a07739H6175b73527B07542h1225m24586
19114e05811a5929A82755d02191e6792B55011h5457B36248F1368R6536C0191b50448
$$ y = [-208711, -167220, -224970, -225046, 124045, -80813, 152231, -213837, 61307, -252519, -139391, -18974, 32382, -146835, -423818, -131589, -72413, -188405, 20845, -179304, 235568, -88572, 159874, -170517, 71599, -22359, -253859, -533567, -199462, 53775, 130351, -187892, -298411, -129521, 269313, -33011, -188827, -70477, 84299, 173991, -157447, -99292, -193811, 48880, -102768, -90640, -259847, 12517, -191941, -64445, -152935, -10967, -199486, 180498, 118863, -110318, -171778, -129873, 4141, 42792, -54778, -167326, -200696, -65738, -71068, 51963, 4512, 61237, -248467, -37346, -275250, 115245, 54890, 176715, -107739, 86175, -273527, 207542, -81225, -505811, -15929, 182755, -402191, -56792, 255011, -85457, 236248, 61368, 157904, 30191, -250448]
19102A04963L0547g6759j53873J12554G4694K23788c42651R8943i6348r6674O4463
19091a28559D5329a82955f0450j1277I0950L84689c16161K3695J19225I580a42172
19079A59781C0428J30734k4735b45655F1316Q9433R518a28806F5219b91916A1785
19067h187F4987K8054J480j1939g9144A26641N7013J88149a7839k52082a28030
19055b06550a8978j86244c7240A27872h6812o7283M3589k41707B45447g7756k62350
19044c40106A4201M8023B1571b04010i1040N067a9466k38474B27711b20522a9743
19032H0149R4025a78453j0707A62932o908j4209a35887K7285K3355a8663A61722
19020a94761I7595a57850n2251k874k9876O3617A43288b05983R2743A04446d3774
$$ y = [104963, 135510, -76759, -230632, -118078, 74694, 298482, -342651, -243708, -96348, -193022, -128559, 45329, -182955, -60450, -71727, 90950, 475639, -316161, -292466, -173241, 9580, -142172, 159781, 30428, 161162, 136427, -245655, 61316, 150749, 160267, -128806, 65219, -291916, 11785, -8187, 64987, 93041, 94521, 82582, -79144, 126641, 183654, 371803, -17839, -269921, -128030, -206550, -18978, -205222, -37240, 127872, -86812, -154095, -110506, -352213, 245447, -77756, -340106, 14201, 62224, 21571, -204010, -91040, -85973, -19466, -257940, 227711, -220522, -19743, 80149, 174174, -178453, -189160, 162932, 156024, 141815, -135887, -108602, -85247, -18663, 161722, -194761, 97595, -157850, -210101, -212975, -242851, -179234, 143288, -205983, -113240, 104446, -43774]
19008a42066j01943A1182a65364B1709b9457j39923o0031A69783a36192B55786
18997c6847m8684k17491A92503b22797D4644a094l18828g9688C3674J18440b6499
18985a55845B74659d8324A29118C593c97936f8927j82517B43850G185f4497A09017
18973c71720f4365A88413o8145a46731N4759D0836e0311k09099J5050A05554c5201
18961a52121b6736k57371G1069j0390M3584J99821h1449K8210B29751b21948b3553
18949A78884a58697f982o8439l12585C04328K399A00200m5139B3860J04480O7127
18938A95467a23097j4221d5254q8020b8346A3719a61633P0368j678A45455a91614
18926a81264C35494D2365I924a84257A01888K2482c74931a01037J3193b8958k3116
$$ y = [-142066, -244009, 11182, -165364, 21709, -29457, -169380, -229411, 169783, -136192, 255786, -36847, -85531, -303022, 192503, -222797, 44644, -1094, -319922, -79688, 33674, 152114, -26499, -155845, 274659, -48324, 129118, 3593, -397936, -68927, -251444, 243850, 7185, -64497, 109017, -371720, -64365, 188413, 120268, -146731, -91972, 40836, -50311, -259410, -244360, 105554, -35201, -152121, -26736, -284107, 71069, 60679, 104263, 304084, -81449, -53239, 229751, -221948, -23553, 178884, -158697, -6982, -75421, -388006, 304328, 306727, 100200, 55061, 23860, 128340, 195467, -123097, -137318, -45254, -133274, -28346, 13719, -161633, -91265, -92943, 145455, -191614, -181264, 335494, 42365, 9924, -184257, 101888, 124370, -374931, -101037, -87844, -28958, -52074]
18915e2074j19948N7306b6071D6388J34317O693e76622C3518e2659k52309p512
18904c12480b5589q9761m8097k04820J80066A19645P9500a3019j9386j65279B11097
18892B5652b6680k34636k6890A19857b2497A68522h2194A08990c3479H4371a52713
18880g8198A04206d0970D7480K9116a38093H1100L4040D9663b86990G5160d27587
18868a20347j65254a0193j11184d1748k82735a04741j37207G1788d2288m5594
18858h7882B03582b21454B03800a8521C88098F5867e5355q5364C20998B8527J00203
18847A28730K24693C6483K17585b2146A3876b93623B8387a54968a2090k4291k97052
18836c33433A8259J55447a7338A28126c58796d8828j16815c2955A1349a57421
$$ y = [-52074, -172022, -114716, -26071, 46388, 180705, 187398, -576622, 33518, -52659, -304968, -312480, -25589, -115350, -163447, -368267, -188201, 119645, 199145, -13019, -32405, -197684, 211097, 25652, -26680, -261316, -288206, 119857, -22497, 168522, -82194, 108990, -33479, 84371, -152713, -78198, 104206, -40970, 47480, 76596, -138093, 81100, 115140, 49663, -286990, 75160, -427587, -120347, -285601, -10193, -121377, -41748, -324483, -104741, -241948, 71788, -42288, -87882, 203582, -221454, 203800, -18521, 388098, 65867, -55355, -140719, 320998, 28527, 128730, 353423, 36483, 254068, -22146, 13876, -293623, 28387, -154968, -12090, -36381, -333433, 18259, 173706, -17338, 128126, -358796, -48828, -165643, -32955, 11349, -157421]
18825a88204D3674f1880D5463h7845F268a86186C1451i2658H5628a0275k5153
18814c5428I9828a05504A78613K616a56956B73175A04683B7003L17037f0588j15509
18803a76097K9499j93297d286D4379K181c20325M2824G1461b74239a05695l38840
18792d44535F6482a65770j4550K912E6600R2230c5102k16908A75292c46809a51346
18780a42789A08218D4362h004k64139A29730F0141a81029k1109A25606a91176
18769i7253L7321o7344A85840e4188j0265k08175g8472k8742L1537D5279L4218
18758G9497d29075B44603a95119B1582a69608f8956c2827n4958j40091c4386j7894
18747e2280A52857E581b68463J29429k54260A21802l2368b32553m0471A06633
$$ y = [-188204, 43674, -61880, 45463, -87845, 6268, -186186, 31451, -92658, 85628, -10275, -35428, 99828, -105504, 178613, 181229, -156956, 273175, 104683, 27003, 344040, -60588, -176097, -146598, -339895, -4286, 44379, 46560, -320325, -277501, 71461, -274239, -105695, -444535, 66482, -165770, -180320, -177408, 56600, 148830, -35102, -252010, 175292, -346809, -151346, -142789, 108218, 44362, -8004, -272143, 129730, 60141, -181029, -202138, 125606, -191176, -97253, -59932, -127276, 185840, -54188, -64453, -272628, -78472, -107214, -75677, 45279, 79497, -429075, 244603, -195119, 21582, -169608, -68956, -32827, -87785, -227876, -34386, -52280, 152857, 5581, -268463, -139034, -393294, 121802, 89434, -232553, -273024, 106633]
18736E8869J83845a77933e4178A12231f8061B0470f0449a5400j03918b2360k3436
18725d5796l75662b449B9833d06719F8133c4808A193c16978J43592l0182c401
18713D5781P2588f7652m4031k86115b1217r2901K4196h005C3954J70549G2105
18701A24831D421a9870B05406a1167G4767j8866b3084B04726l1945C03a70747
18689g0834j84855A43839N1158A9328J4116a71651Q5493k48075h6572l76781G9944
18677b40137R7799q1327B85741f0588A50421a15458n0743o0200j00741E3872c34997
18665d8278g723j01455B4796a79745n1390C40967A41075h0034k26911I0036k2025
18654F8011b99246a21476A85911a04376o7217b7035o0969k07600A39539a06103
$$ y = [58869, 242714, -177933, -54178, 112231, -68061, 20470, -60449, -15400, -119318, -22360, -45796, -421458, -2449, 29833, -406719, 68133, -34808, 1193, -316978, -173386, -203568, -3401, 45781, 118369, -67652, -111683, -397798, -21217, -114118, -89922, -8005, 33954, 204503, 72105, 124831, 4421, -19870, 205406, -11167, 74767, 55901, -23084, 204726, 172781, 303, -170747, -70834, -255689, 143839, 194997, 19328, 33444, -171651, -86158, -334233, -86572, -463353, 79944, -240137, -142338, -223665, 285741, -60588, 150421, -115458, -166201, -226401, -327142, 53872, -334997, -48278, -7723, -109178, 24796, -179745, -231135, 340967, 141075, -80034, -306945, 90036, 68011, -299246, -121476, 185911, -104376, -171593, -27035, -88004, -295604, 139539, -106103]
18643D8361K2348k6325q970d1566I7676j4040K43899a78906B13868a81157a7312
18631a13107b5088G5279J33235i0356k67769a21078O013e1503l5813b3977A13201
18619a81508M1069A0857a19718j86115g5910B99449G4098b42535I299a09559m38780
18608e48339H0705c7670A10671b58836H4831M2003o561c9174k21198J24521F5081
18596D3582b02694e4862F0963i9851B50115a05590l52088l1363A43561e9411l2471
18585i1882K854J9027A88537N9499b13810C5332b30425D4144a40092f4028k6578
18574i0606k46563g0592k95625B61055h3560D14380a52251f1537D6874a29412
18563A74707g6308B58645i5292k49302A40831D5724Q3693R6211e0998j52312j5352
$$ y = [48361, 70709, 44384, 35414, -41566, 97676, 83636, 327535, -178906, 213868, -181157, -17312, -113107, -25088, 75279, 208514, -90356, -358125, -121078, -115065, -51503, -87316, -23977, 113201, -181508, -140439, 10857, -119718, -305833, -75910, 299449, 74098, -242535, 9299, -109559, -548339, 80705, -37670, 110671, -258836, 84831, 126834, 120273, -39174, -260372, -135851, 65081, 43582, -202694, -54862, 60963, -99851, 250115, -105590, -457678, -489041, 143561, -59411, -91882, -89028, -70001, 188537, 248036, -213810, 35332, -230425, 44144, -140092, -64028, -90606, -337169, -70592, -366217, 261055, -83560, 414380, -152251, -61537, 46874, -129412, 174707, -76308, 258645, -95292, -344594, 140831, 45724, 129417, 225628, -50998, -203310, -218662]
18552b18662b1010j70138A10921I300g8427b1417l38117C09979c47272c0689j01235
18541a31924A21694a55023C6781J40650B9958a5894j34274r3959f7347a1135j95293
18530b06428g9160E3815Q2166r511a68324m7690c2701k385H1286a04554r3582
18519a98136A57338a20426D3531Q6064C6877b42479J10398N2844A0714b9581A5895
18507b89257K1594M9926d4973j21583l2766k3884f7475B15129e4905p4958q0731
18496b10594I2951a37687K6770B06031a17512o7868l6892A32237k5139d19538
18485e5959j17919g0954B15708A01692b9262q4248l42820b09491A25315b7388
18474i9813j85817D5165P7017A7395b4493B76397a16299B14862a27184B7437K2184
$$ y = [-218662, -21010, -191148, 110921, 9300, -78427, -21417, -359534, 309979, -347272, -30689, -131924, 121694, -155023, 36781, 177431, 29958, -15894, -150168, -244127, -67347, -11135, -206428, -79160, 53815, 135981, 126470, -168324, -216014, -32701, -35086, 81286, -104554, -198136, 157338, -120426, 43531, 129595, 36877, -242479, -132081, -79237, 10714, -29581, 15895, -289257, -267663, -217737, -44973, -166556, -199322, -223206, -67475, 215129, -54905, -129863, -210594, 92951, -137687, -110917, 206031, -117512, -185380, -222272, 132237, 107098, -419538, -55959, -173878, -70954, 215708, 101692, -29262, -113510, -456330, -209491, 125315, -27388, -99813, -285630, 45165, 122182, 17395, -24493, 276397, -116299, 214862, -127184, 27437, 49621]
18463D9621a05019a8564A28090G646b65651A675N3726a91213F7335b9895n5514
18452h5409l66114i248l21932A81383g9732k52404R7536r218B21243D6192J23519
18441A69711F1243J64384c16253B0914h145l74491g681j15307F759J03830A6792
18429c0921q5601F9064a64615B08527b98115B6805L48156A68088d5618k49257
18419b94875G8555k2531N0776b2680A22102h0465A08738J41539D6234J38604b07000
18407b59251B87558h6858B06273C5836d4013j41966f9690h488p7218j68001A64840
18395h719l01962R1901J05860M0410J3070A41221G460b49453F7624a03347B72228
18383C9841c60584B3868a03194l992j63564D4574a70999m2316B37995g5013B3467
$$ y = [49621, -105019, -18564, 128090, 7646, -265651, 1675, 55401, -191213, 67335, -29895, -85409, -451523, -9248, -331180, 181383, -79732, -332136, -234600, -243818, 221243, 46192, 169711, 61243, 225627, -316253, 20914, -8145, -382636, -7681, -122988, 6759, 110589, 16792, -30921, -116522, 69064, -164615, 208527, -298115, 26805, 374961, 168088, -45618, -294875, 78555, 56024, 106800, -22680, 122102, -80465, 108738, 250277, 46234, 184838, -207000, -259251, 287558, -86858, 206273, 35836, -44013, -185979, -69690, -8488, -85706, -253707, 164840, -8719, -310681, -218780, -112920, -72510, -59440, 141221, 7460, -249453, 67624, -103347, 272228, 39841, -360584, 23868, -103194, -107186, -270750, 44574, -170999, -213315, 237995, -75013, 23467]
18371E8283b50317o9532E7788J67706b2802G0567l1327r178a79416J2728N5413
18360a11275A40067b36077i9407N968H7708a58014a8389j58552K4510d1830n630
18349d7460o2591a8445o3643C2945f14539b9580A54985c5009l66799J66151a0817
18337H5109R6581p7494a06249A16584a39201b2711j02371A09547A4092J8603M8349
18326H1044c02208B36655Q053c14860E8575h6290G6739i0499p2503K2108k496
18315a43390B45122b00729l20629A99352O532g7112J1725C59198E9821i3122a673
18303B25736b62550C606a07496r5869L7035B42704c12031a54915E4105i0135A37896
18291A47318c6772j27337A07600b74203Q7107A66891E0962a05576a1651K366G8895
$$ y = [58283, -250317, -319849, 57788, 225494, -22802, 70567, 39240, 30062, -179416, -166688, -111275, 140067, -236077, -99407, -93439, 87708, -158014, -18389, -176941, -152431, -41830, -47460, -110051, -18445, -82088, 32945, -614539, -29580, 154985, -35009, -401808, -235657, -10817, 85109, 181690, 104196, -106249, 116584, -139201, -22711, -125082, 109547, 14092, 32695, 81044, -302208, 236655, 244708, -314860, 58575, -86290, 76739, -90499, -163002, -140894, -143390, 245122, -200729, -521358, 199352, 205884, -77112, -65387, 359198, 59821, -93122, -1673, 225736, -262550, 3606, -107496, -203365, -166330, 242704, -312031, -154915, 54105, -90135, 137896, 147318, -36772, -164109, 107600, -274203, -187096, 166891, 50962, -105576, -11651, -9285, 78895]
18279i4152A27442k755B4704a03241a737A98329a53734j25973G2967I509J67514
18268A77023R460a05238j24953d6599l835I468K17416P7381b12248l3415F6524
18256A76647F7057a8214I3463b49651R5396A39454f4256l3320L9682B36a90654
18244A27224a36797q7318A58937a02221C22143b57871G2121B480J74621b03413
18233I4124d0226p1921F7097K4525b11705A25192b37361f1088A37828b02072a6940
18221d20360a81657e6380l21105e1213j15903o3662a4372C41349i3350B65117
18210b25503K2053k6018A98463C2995P3179C8947j7431g5182j07803D6807g2240
18198c26082B5372M131d02418B38001e701p1605l7634I3024c2532j0449B21901
$$ y = [-94152, 127442, 124687, 24704, -103241, -1737, 198329, -153734, -279707, 72967, 9509, 177023, 186483, -105238, -230191, -46599, -50434, 9468, 226884, 304265, -212248, -245663, 66524, 176647, 67057, -18214, 93463, -249651, -154255, 139454, -64256, -97576, -57894, 236, -190654, 127224, -136797, -224115, 158937, -102221, 322143, -257871, 72121, 2480, 177101, -203413, 94124, -40226, -112147, 67097, 91622, -211705, 125192, -237361, -61088, 137828, -202072, -16940, -420360, -181657, -56380, -377485, -51213, -167116, -230778, -14372, 341349, -93350, 265117, -225503, -203450, -229468, 198463, 32995, 106174, 38947, 21516, -75182, -182985, 46807, -72240, -326082, 25372, 29503, -402418, 238001, -5701, -77306, -114940, 93024, -32532, -42981, 221901]
18186A46735m9818a24230k8830d5965A44425b30132O3340c9253j5836A04032a54740
18174B42233e3905b3201l48093a28936D7511K01890C8920J02477a76752B18488
18163a96657A98282b42522A41250a58040f9047D49740j99770H355b24935A14862
18152B63911A13765J2985E7050c05680G1669b47051A43510i4629E3694d01939
18141A90626k8763b37344p1769a28790A11016J26053a14660N975k13893g3790
18130D2774b62792N2120f5122D48722b29011A20988B4661e6001n1590b0694n3632
18119g4326j62807R2048N6700I7998k331c91398d7681l63459D33a35822A61922
18107I8605b41093P8936l7055k62245C75478m5851c53950a65077d4812I293e748
$$ y = [146735, 96917, -124230, -153060, -45965, 144425, -230132, -166792, -39253, -55089, 104032, -154740, 242233, -53905, -23201, -371294, -128936, 47511, 249401, 38920, 141397, -176752, 218488, -196657, 198282, -242522, 141250, -158040, -69047, 449740, 249970, 8355, -224935, 114862, 263911, 113765, 126750, 57050, -305680, 71669, -247051, 143510, -94629, 53694, -401939, 190626, 161863, -237344, -309113, -128790, 111016, 237069, -114660, -108685, -322578, -73790, 42774, -262792, -210672, -65122, 448722, -229011, 120988, 24661, -56001, -107591, -20694, -74326, -237133, -145085, -88385, 97998, 95667, -391398, -47681, -411140, 433, -135822, 161922, 98605, -241093, -162157, -199212, -461457, 375478, 329627, -353950, -165077, -44812, 9293, -5748]
18095e3801C81881A07574b45370J09759K9702B24554j00835b61065A25075b4308
18084f1134A27924E2218P8254k4494l3962N5383r522A2404K31024k5780F8622
18072f3900A30620a87922R0400B30192c1780B9959a16772K5624a025k3974k2506
18061d7505J5066q6950c4349m01075R4293C91949a11462C6326b567C8171a97731
18049B35521a5614j45659c4203k15272f1578j44681n2873j68598A03615J42421
18039B46036c35112A52719f6237l08804B73557a96145g8325j91098B73094a16648
18028A87971B3038b5306i908j29341A45749d19680c4305A22822c14473a33588
18017E3549b28434l2539d6228j56955K5828H6980O3039c70390C8933J29303m2866
$$ y = [-53801, 381881, 107574, -245370, -135611, -105909, 224554, 123719, -261065, 125075, -24308, -61134, 127924, 52218, 130472, 105978, 72016, 127399, 117877, 12404, 243428, 217648, 68622, -63900, 130620, -187922, -97522, 230192, -31780, 29959, -116772, -91148, -1025, -24999, -47505, -32439, -119389, -34349, -435424, -341131, 391949, -111462, 36326, -2567, 38171, -197731, 235521, -15614, -161273, -34203, -249475, -61578, -206259, -259132, -427730, 103615, 246036, -335112, 152719, -66237, -375041, 273557, -196145, -78325, -269423, 273094, -116648, 187971, 23038, -25306, -9908, -139249, 145749, -419680, -34305, 122822, -314473, -133588, 53549, -228434, -260973, -46228, -203183, -177355, 86980, 150019, -370390, 38933, 168236, 125370]
18006A25370r143c0039A17457a09821A58876d50373B6736a91912D2406n57i6091
17994i7825c6234A70268a66952O8493D17539h2717l6594A60722k1406g3407l94953
17983d68360J76801l014a7310l261A63599a24924A8262f2499B21325r791k8755
17972A82779h2664j47666a7908A48201b45762G4300d6702B31132c5756k34019
17962b69775D3410K82272b27439f2505Q592j13072A42526J47297E9153b02320
17951b77590K7068e0294H8352b08584B01171L11476d6817k99622A76054b58839
17940A77544K56182e6675A82660j9452a65856l3412E0589i8360K7664A78413b62641
17928i8303A19383e5911C45506c168p8292B46904a75385H1239a09951A08363n1904
$$ y = [125370, 116227, -30039, 117457, -109821, 158876, -450373, 26736, -191912, 42406, 41849, -96091, -97825, -36234, 170268, -166952, -98459, 417539, -82717, -119311, 160722, 139316, -73407, -468360, -291559, -294573, -17310, -20571, 163599, -124924, 18262, -62499, 221325, 211534, 182779, -82664, -230330, -17908, 148201, -245762, 74300, -46702, 231132, -35756, -269775, 43410, 325682, -227439, -62505, -53913, -166985, 142526, 289823, 59153, -202320, -277590, -250522, -50294, 88352, -208584, 201171, 512647, -46817, -346439, 176054, -258839, 177544, 433726, -56675, 182660, 163208, -165856, -199268, 50589, -98360, -70696, 178413, -262641, -98303, 119383, -55911, 345506, -3168, -81460, 246904, -175385, 81239, -109951, 108363, 56459]
17917E6459j1879b70925g9708j21099a061E6831b17787f3654q8210F807K08772
17906B15579k1789a62800A20447a74277F4649F754a90451j9392O4586f8966k3055
17895i2021A39077K19024H416e543j27704B82007b5987A36422l9081a6939k0038
17884c6977E7751P6571a1971k22748E8942K05880C5037a1465j45768J8978d0492
17872C05438l2764D2866h3897b5041D760Q032f2872K877A77637h5005A72338E7806
17859B17548b46353E9924P2914J03142a95621A5053J09178j4848b51591C4244
17848A09382C6175a89639C06340b35775h1229K1278h641A8383g2870C00991a23449
17836D2772M4478a71168a5220B31143j12327E2029K20087F8720a62891C1751j4087
$$ y = [56459, 44580, -270925, -79708, -200807, -1061, 56831, -217787, -63654, -151864, 6807, 215579, 193790, -162800, 120447, -174277, 64649, 6754, -190451, -209843, -145257, -68966, -92021, 139077, 358101, 8416, -5543, -133247, 282007, -25987, 136422, 97341, -16939, -36977, 57751, 134322, -11971, -234719, 58942, 264822, 35037, -11465, -157233, -138255, -40492, 305438, 272674, 42866, -83897, -25041, 4760, 12792, -62872, -59995, 177637, -85005, 172338, 57806, 217548, -246353, 59924, 132838, 235980, -195621, 15053, 124231, 109383, -251591, 34244, 109382, 36175, -189639, 306340, -235775, -81229, -59951, -8641, 18383, -72870, 300991, -123449, 42772, 87250, -171168, -15220, 231143, 118816, 52029, 272116, 68720, -162891, 31751, 17664]
17825A7664J16727f8492k87162A20660a16024k9092l895g4282j63988F112c08671
17813B02081B9210c6973b560n0181A2491d1589j3362K4107H1265b9469p020k02946
17801b39435e5370q2642A48627c2276D8976a00543b2781k26808B34845b39538
17790C31342n911a50889l2475E2382b75966H5271R9633a47055a9199B81629F9006
17778h685m5833B999K15123a07078c8745k00533I2577a56074A15908b66862m6639
17767c13501B3389a27300A66434m4961a43460A55484h6694G8616c00453C3662
17756B82677A31060N4206a36888A54184a65744C0421a86917A26850E5934c414
17745c98417J74211m1210E1948e4681I7509J56866G8584c6495p0671L1976b6459
$$ y = [17664, 134391, -68492, -355654, 120660, -116024, -145116, -149011, -74282, -238270, 6112, -308671, 202081, 29210, -36973, -2560, -52741, 12491, -41589, -54951, -30844, 81265, -29469, -36489, -239435, -55370, -138012, 148627, -32276, 48976, -100543, -22781, -249589, 234845, -239538, 331342, 325431, -150889, -183364, 52382, -275966, 85271, 184904, -147055, -19199, 281629, 69006, -8685, -54518, 2999, 218122, -107078, -38745, -239278, 92577, -156074, 115908, -266862, -313501, 23389, -127300, 166434, 121473, -143460, 155484, -86694, 78616, -300453, 33662, 282677, 131060, 185266, -136888, 154184, -165744, 30421, -186917, 126850, 55934, -3414, -398417, -224206, -265416, 51948, -54681, 97509, 254375, 78584, -36495, -107166, -75190, -26459]
17733a8492h548D303h9055A46705a53709B87480a70492b7751A12603c42196H1790
17721b28297J10818j02449B84193a65546G2518g3605j71120e825j01265B7904
17710c53650C2384L0439R0848n4721l1011J53510j5335c6724j42428O6902E0226
17698C5321J26428f0601j45274A0814d0449j11308A08266R0139C7537h1874j89624
17687b71498H6666a8865j52614C13433n9449a41962C5534O5443c26615A21003
17676G4246j9604N836K8275J6461B2726J90675i0081A08964b4644k10412B70262
17664a44460A8455N2226O8437n136a9564j2859j8697j71181g5988F5791J7539
17653H3330g783l4218o1484n6326j40866C67801G1469f2693C77179d3094B11428
$$ y = [-18492, -8548, 4303, -89055, 146705, -153709, 287480, -170492, -27751, 112603, -342196, 81790, -228297, -117479, -219928, 284193, -165546, 72518, -73605, -244725, -5825, -107090, 27904, -353650, 32384, 62823, 153671, 98950, 67939, 221449, 206114, -36724, -179152, -112250, 50226, 35321, 161749, -60601, -205875, 10814, -40449, -151757, 108266, 198405, 37537, -81874, -271498, 86666, -18865, -171479, 313433, 253984, -141962, 35534, 100977, -326615, 121003, 74246, 54642, 60478, 88753, 105214, 22726, 213401, -90081, 108964, -24644, -235056, 270262, -144460, 18455, 70681, 139118, 133982, -19564, -32423, -51120, -222301, -75988, 65791, 83330, -7783, -42001, -103485, -159811, -300677, 367801, 71469, -62693, 377179, -43094, 211428]
17641G0709R5968a1670B38221a32598H9310J02922l2306D7357A9254b1954A29792
17629B52652A24345a21228C55232a32145l2467B01003d4485B3425a6728j67891
17619a84619f7825k12431h1191M093C7970P082K55503a93581g3401B25446a3317
17607E560J68324J694i4346I7416a35170B81371e598l7308A63233a09491A11786
17595g7777e063F493P6045K5647a55000B47424r0998b27142A85792b69882h3004
17583b53967g4082H5526C8779h9362G1254J0773b1161D3165b6610C0240O1042
17572I1282J96688q8493b44032R1790A58889J94692H3089N461K20711b35862h9630
17560H9462a24972K290C08938C1864Q0825L15248A92053d1453A58253b07180A05217
$$ y = [70709, 166677, -11670, 238221, -132598, 89310, 192232, 159926, 47357, 19254, -21954, 129792, 252652, 124345, -121228, 355232, -132145, -164612, 201003, -44485, 23425, -16728, -184619, -67825, -280256, -81191, -77098, 37970, 45052, 300555, -193581, -73401, 225446, -13317, 5560, 173884, 175578, -94346, 97416, -135170, 281371, -5598, -42906, 163233, -109491, 111786, -77777, -5063, 6493, 82538, 108185, -155000, 247424, 156426, -227142, 185792, -269882, -83004, -253967, -74082, 85526, 38779, -89362, 71254, 82027, -21161, 43165, -26610, 30240, 91282, 287970, 199477, -244032, -152242, 158889, 353581, 83089, 88550, 309261, -235862, -89630, 89462, -124972, -122682, 308938, 31864, 112689, 427937, 192053, -41453, 158253, -207180, 105217]
17548a32320C39000g1974l15451h3007l816b3387A87372m7487b45332A59648a7881
17536A73108D4324h9103j2351P786G0576N1726M4842A2510J34798a472A86414
17524B37798d0789A63854G3395b75093B39926A307J9000R3033O159J77809F7557
17512G5558L58198A05119J48953A03790n952m3328J16675J25802b40901G3021
17501A61172G4442b21467A18854d6008B23604b527C70647a12474A59133J56795
17491C15928O0085e7014J5957F3354j8656J87023c13054d4022A61115J8863A4055
17479i19j53619D9989j9545J45506J00207b0392C01382g3059K5142k09005C15623
17467A65934a60697B90886m4317a55887C45039H6702d185A26771J18430j21850
$$ y = [-132320, 339000, -71974, -387425, -83007, -86823, -23387, 187372, 139885, -245332, 159648, -17881, 173108, 44324, -89103, -101454, -93668, 70576, 122302, 167144, 12510, 147308, -1472, 186414, 237798, -40789, 163854, 73395, -275093, 239926, 1307, 20307, 113340, 119499, 297308, 67557, 75558, 433756, 105119, 254072, 103790, 97838, 54510, 171185, 296987, -240901, 73021, 161172, 74442, -221467, 118854, -46008, 223604, -2527, 370647, -112474, 159133, 315928, 376013, -57014, -41057, 63354, 44698, 231721, -313054, -44022, 161115, 179978, 14055, -919, -154538, 49989, 30444, 175950, 276157, -20392, 301382, -73059, -47917, -256922, 315623, 165934, -160697, 290886, 246569, -155887, 345039, 86702, -4185, 126771, 245201, 123351]
17457A23351L0303c7244B25030H0953J03527c7782B86781j8755K0004q4843B1809
17445C75489j1304j44326a00220C01989A17606C3412K69153r5146J36069A62378
17434D30266B12747k1425J44082b00808B9613K04929P7420J79327j33920Q938
17424C66307J2004A53997K1458M86068D9904a9413q900A00567L15352j69647E1768
17412E07940r2905A00613L61767j08579j9291j20896K10738A77607J616n8387
17402A20836N7887K3493J27780E6619j1544J28497q5277L02492b13836A07386
17391c2561C03182H6263Q480b372C2154K74989f8852A25245e6807q2550M625B80518
17378A24387j5700b8597A49015j4144r770K34571p8765m4989K7312j07248e756
$$ y = [123351, 153654, -37244, 225030, 80953, 184480, -37782, 286781, 268026, 288030, 203187, 21809, 375489, 364185, 219859, -100220, 301989, 117606, 33412, 302565, 207419, 343488, 162378, 430266, 212747, 191322, 335404, -200808, 29613, 234542, 311962, 491289, 357369, 366307, 378311, 153997, 175455, 661523, 49904, -19413, -28313, 100567, 415919, 246272, 51768, 507940, 415035, 100613, 462380, 353801, 334510, 213614, 424352, 177607, 179223, 120836, 178723, 202216, 329996, 56619, 45075, 173572, 88295, 390787, -213836, 107386, -32561, 303182, 86263, 94743, -2372, 32154, 307143, -68852, 125245, -56807, -139357, -134732, 280518, 124387, 108687, -28597, 149015, 134871, 125101, 359672, 280907, 235918, 263230, 155982, -5756]
17366B33367m6846j8628p019a57572B15118a6504L204C06349f5023j22480A6181
17354D6237a17341K9810G3484P1649j0270K94953A28940M661b08038B11044G9386
17342B39560G3043K71126A06292a3680L558k32590B25354i2360A14055k5128J07380
17331A96307J43727A8997N9648B007J89629L92558A65767a92680f0470B80498
17320d0179G0528e8622F1760J49255D0634J57754p3732a8078E9237J64126a80547
17308B83131j06488k8241R735l1853K89475A21691C2713d8784A09017J15860o9366
17297A55511c29j76951A22244g6443b188B97889a79024E37764B1331J05547f4867
17285E9333K94276O589B4316O9256k0776J82833L52614A13722L9185l7625J76981
$$ y = [233367, 186521, 167893, 160874, -157572, 215118, -16504, -13300, 306349, -65023, -187503, 16181, 46237, -117341, -87531, 73484, 145133, 134863, 429816, 128940, 133601, -208038, 211044, 79386, 239560, 73043, 344169, 106292, -13680, -10122, -242712, 225354, -92360, 114055, 88927, 196307, 340034, 18997, 78645, 2007, 191636, 584194, 165767, -192680, -60470, 280498, -40179, 70528, -58622, 61760, 211015, 40634, 198388, 124656, -18078, 59237, 223363, -180547, 283131, 176643, 148402, 158137, 126284, 415759, 121691, 32713, -48784, 109017, 224877, 155511, -329, -177280, 122244, -76443, -2188, 297889, -179024, 537764, 21331, 126878, -64867, 59333, 353609, 360198, 24316, 93572, 72796, 255629, 608243, 113722, 152907, 115282, 292263]
17274B92263A37840L31025E6164M4150K43561r4559K49597b52475B39775a6505
17263b9947A30090J84543b2009A86797K95400e9250C56485E0283J98356M9961
17253B98600F8415R1517l683n4459N6583C2941K21682D3106J29023L2663a48930
17241B28608J16540D2750K96186P954A2249J18431L7072K52221D4056N5027L03074
17230D02157F7513J42481H2025N3828J75451R6632j37722a41609H621K21986k9892
17219B00715a44603B06124o5996K54308j64588j622b65417C65838B9897g715B2165
17207B48685J23342P6511A32690l9279L26761Q8707I4639a394B01049J9543o9287
17196A51305G247M8255A0503L58751K0748p520K58433C13652O7816K8641B02293
$$ y = [292263, 137840, 468865, 56164, 100314, 343875, 249316, 498913, -252475, 239775, -16505, -29947, 130090, 314633, -22009, 186797, 482197, -59250, 356485, 50283, 248639, 298600, 68415, 159932, 156249, 101790, 158373, 32941, 254623, 43106, 172129, 204792, -148930, 228608, 345148, 42750, 338936, 346890, 12249, 130680, 167752, 419973, 44056, 99083, 402157, 67513, 209994, 82025, 135853, 311304, 407936, 270214, -141609, 8621, 230607, 200715, -144603, 206124, 140128, 394436, 229848, 228226, -265417, 365838, 29897, -7715, 22165, 248685, 372027, 448538, 132690, 93411, 420172, 508879, 94639, -1394, 201049, 220592, 151305, 7247, 55502, 10503, 369254, 390002, 382482, 640915, 313652, 381468, 410109, 202293]
17184B00856J20131j53146L30968j76695j12287P5670H331J87270K4816p0963
17174A49454E8769L70649A6156L38214A64657O285J82533J44570M516A04246L88942
17163D93188A37590Q0860f8992C17380r6454l7126B6306J51762L20101j31158
17153C67011j02025J60984J8290j22134M2790E7057L40916n2751j759j00924Q05
17142B43344K73605j19514j42486j04904K14099A69281L8369K67887B9822h2348
17131D81301A93243M3179K31292A63089j9055K43080N8424N5642j12809l3583
17121C54788b9941C64937A27696J00120F9075L59072j81097B3207N69328j87379
17111D05156H0022L67785L0008E602J66963J90078q1231O5480J08743j53785F4549
$$ y = [200856, 320987, 167841, 498809, 322114, 209827, 285497, 8331, 195601, 220417, 149454, 58769, 429418, 16156, 354370, 164657, 170942, 353475, 498045, 502561, 104246, 493188, 137590, 218450, -68992, 317380, 220926, 183800, 26306, 178068, 498169, 367011, 264986, 425970, 444260, 322126, 364916, 57057, 397973, 345222, 343463, 242539, 243344, 516949, 397435, 254949, 150045, 364144, 169281, 207650, 475537, 29822, -82348, 481301, 193243, 236422, 467714, 163089, 144034, 387114, 445538, 501180, 388371, 354788, -29941, 364937, 127696, 227816, 69075, 428147, 247050, 23207, 592535, 405156, 80022, 447807, 477815, 5602, 172565, 362643, 281412, 346892, 455635, 301850, 64549]
17099D92474O7141k55453Q8083R7419j35484J68656p3401J94824B09300m2272
17089A67028b0336D45544j43512L80769k98375N42047m15320j31006l4613k2161
17079C23373I9056N4478L36472A51790Q5824O33764l44940j30578p1321A14981
17068E15032B36793M7952n2856K77167k09507m601J92681J09255B79186K59407
17058E38593J72266j45745j43338M6791p7237J57006r5157k7151A47190K92881
17048D40071j91073K11408j35496P1760K08179R0203j60579L64397m32683j80659
17038B85528J37926L09350B04676K20778J05975j1636K00827l60138J71174k19807
17028C11849J18536K08238J39133C36275K19989Q4168K75611C74783j48923L26238
$$ y = [492474, 559615, 304162, 392245, 489664, 354180, 522836, 449435, 644259, 209300, 167028, -20336, 445544, 302032, 682801, 384426, 926473, 511153, 380147, 345534, 323373, 99056, 153534, 490006, 151790, 237614, 871378, 526438, 395860, 324539, 114981, 515032, 236793, 284745, 231889, 509056, 299549, 294948, 487629, 596884, 279186, 538593, 710859, 565114, 421776, 468567, 391330, 548336, 453179, 426028, 147190, 440071, 248998, 460406, 324910, 396670, 604849, 695052, 534473, 898870, 466187, 285528, 423454, 732804, 204676, 425454, 531429, 519793, 720620, 360482, 531656, 311849, 430385, 638623, 777756, 336275, 556264, 640432, 916043, 374783, 225860, 552098]
17018E52098J65858q521J56530q5296k18787J95487k03620L93105J48735l50811
17008G44778L06669m94122K75826j40144j55605j56729J92036M7595m2486K20562
16998G98380k61724k5648K84533k31456m1916j6015M58883k77560n2031m6233
16988E89213K60644k3124p8948r6285L36534o7915j2144j5834K36590C92072N23891
16977I15963o5468L0950J16575l61681J73872L0634j50619K35030j65868k94951
16967D64437K12089L90642k88008N32586j39344j49573K8667k45187m6022K25602
16957I85889k86352L75328K2689o7967j76015r2590J81764L91074l27420j19607
16947H86793J53715K8001r4461O3084p9887J06724k48675L03774L1694j74027
$$ y = [552098, 717956, 709435, 865965, 780669, 561882, 757369, 553749, 946854, 1095589, 744778, 1051447, 557325, 833151, 693007, 537402, 380673, 572709, 620304, 577818, 798380, 536656, 511008, 795541, 564085, 522169, 506154, 965037, 687477, 635446, 589213, 849857, 826733, 747785, 651500, 988034, 920119, 907975, 892141, 1128731, 392072, 915963, 850495, 881445, 998020, 636339, 810211, 840845, 690226, 925256, 759388, 464437, 676526, 1067168, 779160, 1311746, 1172402, 1022829, 1051496, 806309, 760287, 985889, 699537, 1074865, 1097554, 1029587, 853572, 760982, 942746, 1333820, 1006400, 886793, 1040508, 1068509, 974048, 1037132, 957245, 1063969, 815294, 1119068, 1150762, 976735]
16937I76735L71441O7299l17484K68404p6128j62953K20340l52734J88156K15354
16927A398430k04730k35493N53869k12824m5667N47436o21728L44599r1419k65734
16917A166739J92331J56436J36376r1617J88158m4662l34170J19995L8576j38361
16907A389801O1595J30261j48723J92954j58408k8819j7244q8634N54502l88940
16897A498345J58200K2120J9083K29362j28939l2864L2075J59254j57060N9776
16887A859352Q4749p4643J39869k13712N20630j46818k36801Q4187L0155L4472
16877B081440K1988J17459L7866l63403J37120L74823k35386J49221K29593l13667
16867B237054J88915m8566K17487l7394j56195L53165l84686M17360P6723n10660
$$ y = [976735, 1348176, 1415475, 1097991, 1366395, 1290267, 1127314, 1347654, 994920, 1183076, 1398430, 1193700, 958207, 1512076, 1299252, 1253585, 1801021, 1179293, 1523892, 1432473, 1166739, 1359070, 1515506, 1651882, 1560265, 1748423, 1703761, 1369591, 1489586, 1528162, 1389801, 1451396, 1581657, 1432934, 1625888, 1467480, 1438661, 1421417, 1332783, 1887285, 1498345, 1656545, 1678665, 1697748, 1927110, 1798171, 1765307, 1797382, 1956636, 1799576, 1859352, 1944101, 1869458, 2009327, 1795615, 2316245, 2169427, 1932626, 2016813, 2046968, 2081440, 2103428, 2220887, 2258753, 1895350, 2032470, 2407293, 2171907, 2321128, 2550721, 2237054, 2425969, 2377403, 2594890, 2557496, 2401301, 2754466, 2369780, 2787140, 2863863, 2353203]
16857B353203O25305l13188L51034k26404N6347m7970N52888n17545J14820L82609
16847C331099j06150R7037O6150l0455j51245J34626Q5117L43668l08216K02834
16837C664465J34072k14497O82109n78456M84643j42068n731K11907N8178j2837
16827D281785J60197L86512j87435N6914K67201j57850L31271K3338K23715O4785
16817E450433j84025J68987K12923K3643K47101K92751K0601j21962J19343L79018
16807F608813J29955J66054l3449N7466L4150K89658N74827j1053k41325P75397
16797H350493k75938K55575O71995o1811N70832M9624J99585L48218K32286M2216
16787A0383075L59927N50376M75643J40475L40798K31434N36086N00131N20309
$$ y = [2353203, 2978508, 2665320, 3016354, 2789950, 2846297, 2798327, 3351215, 2833670, 2948490, 3331099, 3224949, 3321986, 3388136, 3357681, 3206436, 3341062, 3426179, 3769847, 3461631, 3664465, 3798537, 3584040, 4266149, 3687693, 4172336, 4030268, 4024537, 4236444, 4294622, 4281785, 4441982, 4828494, 4641059, 4697973, 4965174, 4807324, 5138595, 5161933, 5385648, 5450433, 5266408, 5435395, 5648318, 5671961, 5919062, 6211813, 6232414, 6110452, 6229795, 6608813, 6738768, 6904822, 6871373, 6928839, 6962989, 7252647, 7827474, 7816421, 7575096, 8350493, 8074555, 8330130, 9002125, 8940314, 9511146, 9560770, 9760355, 10108573, 10340859, 10383075, 10743002, 11293378, 11769021, 11909496, 12250294, 12481728, 13017814, 13517945, 14038254]
16778A4038254L27047M12916Q00641j42942M82147R08922Q33704M50605M41917
16769A8553211Q35234M13877P50945J052325O83480O42692J106120J119301R52764
16760B6109949J063762J423144J552460J246515R53668J485832J759790J897459
16752C7492579J696063J749031K352381K497178K165115K592320K848258K850711
16744E6243636K915192L085176M151842L770677M280950M716113N138617M725802
16736H9028005N888866N949289O180930O635906P132919P145198P542373P625195
16728A43128681P897741P648397P762760O992496O775983N840064M657633L598305
16720A94302060K713676O32981k33769j679243l500153m519620n151804o415247
$$ y = [14038254, 14365301, 14778217, 15578858, 15435916, 15918063, 16826985, 17660689, 18111294, 18553211, 19388445, 19802322, 20553267, 21605592, 22289072, 22931764, 24037884, 25157185, 26109949, 27173711, 28596855, 30149315, 31395830, 32349498, 33835330, 35595120, 37492579, 39188642, 40937673, 43290054, 45787232, 47952347, 50544667, 53392925, 56243636, 59158828, 62244004, 66395846, 70166523, 74447473, 79163586, 84302203, 89028005, 94916871, 100866160, 107047090, 113682996, 120815915, 127961113, 135503486, 143128681, 151026422, 158674819, 166437579, 173430075, 180206058, 186046122, 190703755, 194302060, 197015736, 197648717, 197414948, 195735705, 192235552, 187715932, 182564128, 176148881]
16712A76148881o726055p192957q081290p534073p810673p591252p818595o877086
16704A16516900p284934o534223o355104n684736n371716n181411m991245m162309
16696G0951222m282084l549403l974039l143507l085784k897989k674381k477788
16688D4866247k344286k058025k009460j663731k130132j353473j651363j345371
16680C0310406j715173r06060j550051q63440j154927o26689q32099j347351p50648
16671B0563968m70192q04080p35767q89698m31011j100434M1439j009234k9681
16662A5135310p54013m98628k88761p69851k98066o8781k96417m53459o36372
16653A1070962o0401m91787k62485n83304J09803n20360j34846k65503j32705
$$ y = [176148881, 169422826, 162229869, 154148579, 146614506, 138803833, 131212581, 123393986, 116516900, 109231966, 102697743, 96342639, 90657903, 85286187, 80104776, 75113531, 70951222, 66669138, 63119735, 59145696, 56002189, 52916405, 50018416, 47344035, 44866247, 42521961, 40463936, 38454476, 36790745, 34660613, 33307140, 31655777, 30310406, 28595233, 27689173, 26139122, 25275682, 24120755, 23494066, 22661967, 21314616, 20563968, 20093776, 19289696, 18553929, 17664231, 17233220, 16132786, 16174225, 15164991, 15135310, 14381297, 13882669, 13593908, 12824057, 12525991, 12457210, 12160793, 11707334, 11070962, 11010561, 10518774, 10256289, 9672985, 9782788, 9262428, 9127582, 8862079, 8729374]
16644H729374r7061l98625O8795o57688j08278j33370j402k0111k79580k54261
16634F847793l7257n46234l21709L55700j45519l72295P1627j86805J92825l31060
16624E527066j81234r3106M5895l36939J22520n72042K94049m03709K07939l7288
16614D573151k50525q2955k71592J91409k15303J37759l08043P8918k20580j93445
16604C438794j6396K34344j55148j57310m8101p7398K79169o06654L92220l20925
16594B962595J60784j80128l60025K26729J51385j60615j18795q0763p0866N278
16584B535579J67622Q2387L2968m08582N8748k90604r3387j1203j06732J92427
16574B159223J15187j18714j64039K6799Q7642l11794L9586M60082l1111k47030
$$ y = [8729374, 8632313, 8233688, 8302483, 7644795, 7536517, 7403147, 7401745, 7381634, 7102054, 6847793, 6810536, 6264302, 5942593, 6298293, 6152774, 5780479, 5852106, 5665301, 5858126, 5527066, 5345832, 5252726, 5298621, 4961682, 5084202, 4512160, 4806209, 4402500, 4610439, 4573151, 4322626, 4239671, 3968079, 4159488, 3944185, 4081944, 3773901, 3852819, 3632239, 3438794, 3422398, 3656742, 3501594, 3344284, 3296183, 3218785, 3497954, 2891300, 3283520, 2962595, 3123379, 2943251, 2583226, 2809955, 2961340, 2800725, 2681930, 2601167, 2530301, 2535579, 2703201, 2785588, 2818556, 2409974, 2468722, 2178118, 2084731, 2073528, 1966796, 2159223, 2274410, 2155696, 1991657, 2018456, 2106098, 1794304, 1833890, 2293972, 2262861, 2015831]
16564B015831k03737J07588o1339n7756M6228M19611n03939j23261K18319J45529
16554B003074k17931m42269r808m19L24474k99500K6932L74102l33543q9747J59051
16543A494416j4010K97931j01421L18361o36478O3776J87178k90556k54065L20142
16533A385274j41538L05535k99657L06629j39852K02242o32244j54975J20326
16524I51740K16567k58884J08313K26392k31800m9761L41759k30662O4746l7020
16514A101390M851L63469n11928j22632J48396o7933L81752j05499q4352l31692
16504G75822J22216o3526J65020D86839L42336j62824K28660J30064l0649k63471
16494G30955M6463M35843l77968O7147L5556K8993n9775J608j52930K90571k37447
$$ y = [2015831, 1812094, 1919682, 1858343, 1800587, 1846815, 2266426, 1762487, 1639226, 1857545, 2003074, 1785143, 1342874, 1333066, 1332647, 1657121, 1357621, 1384553, 1758655, 1425112, 1335365, 1494416, 1480406, 1778337, 1676916, 1995277, 1358799, 1422575, 1609753, 1319197, 1065132, 1385274, 1243736, 1549271, 1249614, 1556243, 1416391, 1618633, 986389, 831414, 951740, 1168307, 909423, 1017736, 1244128, 1012328, 962567, 1304326, 1073664, 1138410, 1101390, 1106241, 1469710, 957782, 835150, 983546, 915613, 1297365, 1191866, 1107514, 775822, 898038, 834512, 999532, 486839, 829175, 666351, 895011, 1025075, 994426, 730955, 777418, 1213261, 835293, 902440, 937996, 966989, 907214, 908822, 755892, 1046463, 809016]
16483H09016J160l4012j74906M37182k95854j95991J72576J87323j06919Q6849
16473H86424k92040J31635J8871M0373J73338l0100k3126l42158L26423p5328
16463H14312N3535J4515j59656J7142M9907J45597j86357j34332P1570L75650
16453A061883D88743J98Q6031O0814O01371n58776o9851j32671J98727j31844
16443E42742K3982M9332M9835J397l9977P9938K08903J1484l64796j13670J30053
16432E79223J98158J03543p4702l75763K38288k12896L4180j09034k0121n7377
16422C03499K20460k58746K40963k05066L75628J53905l87381J26576L1706J97130
16412G98674C71921O5961J79932k32786L44070k86587J01086O7792k40012L57883
$$ y = [809016, 810176, 776164, 601258, 1038440, 742586, 546595, 719171, 906494, 799575, 886424, 594384, 726019, 744890, 785263, 958601, 928501, 905375, 563217, 889640, 814312, 867847, 882362, 722706, 739848, 789755, 935352, 748995, 614663, 686233, 1061883, 488743, 488941, 574972, 635786, 1237157, 678381, 608530, 475859, 674586, 542742, 566724, 616056, 665891, 667288, 627311, 707249, 916152, 927636, 562840, 449170, 579223, 777381, 880924, 806222, 430459, 668747, 455851, 490031, 380997, 360876, 303499, 523959, 265213, 506176, 301110, 676738, 830643, 443262, 569838, 601544, 798674, 371921, 437882, 617814, 385028, 729098, 442511, 543597, 611389, 371377, 729260]
16402G29260j92154A99590M75636j39439J68660B25380r6834M23715p9544J29946
16392F02663j22823j64077M3407j67955K01169j46209L34137j96149J4244L76157
16382G74564k25400O9402j21743j95389K32973J89845l48927n7278J42618J21969
16372E82634B27957A02234P9608J59650K45370H7302L01491n1860R0479N6627
16362D84039N1396j48050J77764k74011K54593O9293F8389L21481O9975B15954
16351B83313A13676O58422A73232L04655B36636k098J78268A98345O63962D28967
16340C66464K2452J0365A20207J00938O0170J57273J54689k14138K09458A78481
16329E14393A70830P3528k9897F678K20106O9455r3328J57794J13414q7054K58731
$$ y = [729260, 537106, 199590, 675226, 535787, 704447, 225380, 128546, 552261, 472717, 602663, 479840, 315763, 359170, 191215, 392384, 246175, 580312, 384163, 398407, 774564, 549164, 618566, 496823, 301434, 534407, 724252, 375325, 318047, 460665, 582634, 227957, 102234, 181842, 341492, 586862, 87302, 388793, 336933, 427412, 484039, 535435, 387385, 565149, 291138, 545731, 615024, 68389, 389870, 459845, 215954, 283313, 113676, 772098, 173232, 477887, 236636, 234538, 412806, 198345, 862307, 428967, 366464, 388916, 399281, 120207, 221145, 281315, 438588, 593277, 379139, 588597, 178481, 514393, 170830, 244358, 214461, 6678, 226784, 296239, 202911, 360705, 474119, 387065, 645796]
16318F45796A32535K40440j13796J7091Q9277j25213J41605p2391J89192k10051
16308B88689j37273J38194o5134J52789A62101N1577G1104O69263k00248A64372
16297E48779k59538r4961p6205J86468L2804L6155j33050K24086K5762A89706
16286A28079L60843A24058K62916J13512F2870L96153k17193D6209J70487K55386
16276D72082j63325q0360J76914j53777A11358M7684a95984B30702N23398E6714
16265I6887b20557B59049f8006C79519j49623P6330J79356b60639B90604k7761
16255B62843A23002K88191j21446q2366G7502L87101q9387j33560J32204H8215
16244A46773R2746M138j7066H0317N4872o6145J44119B2429K32046a09530G5041
$$ y = [645796, 132535, 372975, 259179, 276270, 365547, 240334, 381939, 309548, 498740, 288689, 151416, 289610, 224476, 377265, 162101, 213678, 71104, 740367, 540119, 164372, 548779, 289241, 194280, 118075, 304543, 337347, 373502, 240452, 464538, 490300, 189706, 128079, 488922, 124058, 386974, 500486, 62870, 459023, 241830, 46209, 216696, 472082, 308757, 228397, 405311, 251534, 111358, 159042, -195984, 230702, 754100, 56714, 96887, -220557, 259049, -68006, 379519, 229896, 306226, 485582, -260639, 290604, 262843, 123002, 411193, 289747, 207381, 77502, 464603, 375216, 241656, 373860, 88215, 146773, 239519, 243657, 226591, 80317, 135189, 69044, 213163, 22429, 254475, -109530, 75041]
16232E4980O20279F9768L72493j29979L10164D4819R5090K45638J05922j92051
16222B99418I1035K58096j34619N2835K01762a22687C88768A49178K82282j69645
16212B61815j08138f5182A55839J20174j37955h646r476A94179P2183G5975L1122
16201A07097J50361J4659J95887c1248B11394f3271B97153H3333M876k7612L55056
16190D15653a9945B25930L459j02517M8404D5854J51866G1651N47086f2584B98437
16178C11438m0570O1431A0034a81035D23867j29469B8218J09699L03439A8807
16167B02481m4385m3409j200a02393B58102a22459m665A95847p6323k3539K14271
16156C10256i723B25018G1550k3102a76671B0366J2040J7850a12984C05618P0533
$$ y = [54980, 675259, 69768, 442261, 312282, 622446, 44819, 139909, 385547, 491469, 299418, 91035, 349131, 214512, 267347, 469109, -122687, 388768, 149178, 431460, 261815, 153677, -65182, 155839, 276013, 138058, -8646, -18122, 194179, 266362, 75975, 107097, 257458, 272117, 468004, -31248, 211394, -63271, 297153, 83333, 88209, 60597, 415653, -19945, 225930, 229389, 126872, 175276, 45854, 197720, 71651, 618737, -62584, 298437, 311438, 270868, 332299, 10034, -181035, 423867, 294398, 28218, 137917, 441356, 18807, 202481, 158096, 114687, 113487, -102393, 258102, -122459, -127124, 195847, 119524, 95985, 310256, -9723, 225018, 71550, 48448, -176671, 20366, 32406, 50256, -112984, 305618, 376151]
16145C76151A39059K13955r2487b01881D2683f8805B70694M4711R4117H6398K62318
16134C48716j24796b78600A36513a7633H3442J87137j22323K20891b25285K0603
16124b04682P5467A95842r0267d8292A20061E5515J27992l116O0879a13458j85430
16113b98888H00g8818E1351O5340K8560O1145c62921a76017A38413a49704E00315
16101C85568A01544L5769i3206m2494d6898E8888A0750J08450N7532F8733K01150
16090B69883o7652K25261B1519a5728l554C39225i7053A04240J99435A09309k7280
16079H2029b16881E4382n61J23361G4750J82937A24113J25316b35423R3499f833
16067c71478A75497B4690b31514L8487p1583H4250m661A0836J42463a19200M5053
$$ y = [376151, 139059, 353014, 260527, -201881, 42683, -68805, 270694, 315405, 409522, 86398, 348716, 223920, -278600, 136513, -17633, 83442, 270579, 148256, 369147, -225285, -204682, -129215, 195842, 105575, -48292, 120061, 55515, 183507, 180391, 241270, -113458, -298888, 800, -78818, 51351, 116691, 145251, 206396, -362921, -176017, 138413, -149704, 500315, 385568, 101544, 137313, -93206, -135700, -46898, 58888, 10750, 119200, 176732, 68733, 269883, 202231, 427492, 21519, -15728, -19282, 339225, -97053, 104240, 303675, 109309, 82029, -216881, 54382, 53821, 177182, 74750, 257687, 124113, 249429, -235423, -141924, -6833, -371478, 175497, 24690, -231514, -193027, -264610, 84250, 79589, 10836, 153299, -119200, -74147]
16056g4147A6539K36556d7432j19982P7147D5711a52422p5185h3788n6724e8586
16044C9773J97112b33138C6565K9999l2677c35795J13188f7412j24527h4147J4943
16033f9204a9633A98069a8298j55615A824d7317j86626E8608r262K30093a29152
16021b24940F8194b02775k8500o1854d3194k07131R4921a2627j10400J2544q5422
16010a95905j90662B11636A02187j2098b32866D2041a51176A6456a84441B05135
15999A87083a86983k0938j86365I5335K99332b39631q5600J57033M4023A88746
15988a73735G4858a0284b173m0915j60476P5630n3550k8093B14214r849a61651
15976g5187A13267A5989b10160A95971g0806A11874k3056M0758b12765C08380
$$ y = [-74147, 16539, 253095, -47432, -167414, -90267, 45711, -152422, -227607, -83788, -140512, -58586, 39773, 236885, -233138, 36565, 66564, 33887, -335795, -222607, -67412, -191939, -84147, -69204, -19633, 198069, -18298, -173913, 1824, -47317, -233943, 58608, 49346, 279439, -129152, -224940, 68194, -202775, -231275, -293129, -43194, -250325, -155404, -12627, -123027, -110483, -195905, -386567, 211636, 102187, 90089, -232866, 42041, -151176, 16456, -184441, 205135, 187083, -186983, -207921, -394286, 95335, 394667, -239631, -325231, -168198, -124175, 188746, -173735, 74858, -10284, -2173, -43088, -203564, -127934, -181484, -209577, 214214, 204365, -161651, -75187, 113267, 15989, -210160, 195971, -70806, 111874, 88818, 129576, -212765, 308380]
15965D0958J2067J39016R897L4736N97E9887J05703J27144A07202K79168d1129
15953A31941a94509B31470A0022R618a71577r07r4711f0990j4177F3208A4021
15941a243C9027g8210A74793a01984k39185B3249a049A9961a07387k01518B75474
15929A45277d1297A17285R577K51211a1487l00217C82154A69700b40511e3171
15918H6271C1336b64784B97381j48446e6541l32199A13353Q7982F1143a52324
15907G9642b75697A48668d990q4207b6655O165C5237b46596B79591c08963A46930
15895a27037j2012k4091K0467b9791Q005D4091a15334A10619e0496A60952C1687
15883f3618A29215b68575J11262C03238b65207h4289a3949G503i8985d6137A86268
$$ y = [40958, 53025, 192041, 201938, 236674, 237271, 59887, 165590, 292734, 107202, 386370, -41129, 131941, -194509, 231470, 10022, 19640, -171577, -172484, -267195, -60990, -75167, 63208, 14021, -1243, 39027, -78210, 174793, -101984, -341169, 23249, -1049, 19961, -107387, -308905, 275474, 145277, -41297, 117285, 126862, 378073, -11487, -311704, 382154, 169700, -240511, -53171, 86271, 31336, -264784, 297381, 148935, -56541, -388740, 113353, 201335, 61143, -152324, 79642, -275697, 148668, -4990, -89197, -26655, -20490, 35237, -246596, 279591, -308963, 146930, -127037, -139049, -163140, -142673, -29791, -21786, 44091, -115334, 110619, -50496, 160952, 31687, -63618, 129215, -268575, -157313, 303238, -265207, -84289, -13949, 7503, -98985, -46137, 186268]
15871a7063j17994A36032e8818C4497f4335j3959p440j32178g1118K6238b387
15859e500j22195B92365a73120A86049e5983a4708E3153b5094K322F8361i2767
15847H8849Q6050l8510b37641J11195D4050A914g2910A99584a41650d5513A33066
15835B38448d55593i7311j20929C63295d04469O0007A38163i6299K6092k86771
15825c56978A65920c8034k40728r9481d9119k8079G3644k2540R9009J06706a94784
15813a6297A4105a97352A34822e3820K40I271b5745D4147p030J46386a64941l1238
15801a96179l9930M4118N1621k44677J69574A53710a01388k65294J12923c1990
15790c01384B46556j2309i7237L8531B85504e8242k30707e5145A9791J64943E9949
$$ y = [-17063, -135057, 136032, -58818, 34497, -64335, -78294, -85734, -217912, -71118, -44880, -2387, -5500, -127695, 292365, -173120, 186049, -55983, -14708, 53153, -25094, -22772, 68361, -92767, 88849, 174899, 136389, -237641, -126446, 44050, 1914, -72910, 199584, -141650, -45513, 133066, 238448, -455593, -97311, -218240, 363295, -404469, -344462, 138163, -96299, -70207, -356978, 165920, -38034, -278762, -378243, -49119, -77198, 73644, 51104, 150113, 256819, -194784, -16297, 14105, -197352, 134822, -53820, -53580, 9271, -25745, 44147, 37117, 183503, -164941, -196179, -236109, -191991, -140370, -385047, -215473, 153710, -101388, -366682, -253759, -31990, -301384, 246556, 234247, -97237, -58706, 285504, -58242, -288949, -55145, 19791, 184734, 59949]
15778B99482a28551k45294A93673i6009c8298j01733b1461C3883M17868c19587
15767f3891A72176b35136C22132A22356a56311E4868a48534f3650l94260A30252
15756A67957f4377j75447C1942b33091c0710A02611f1618o482J971A98812b70438
15744A12031B4234d4680B44269a41802O1124k6792a2646c569A57768g0386C4109
15732c18785C7980h301F2450c23577J29644I1004a12761A6176N0759C0841b92240
15720A75179b59658R5247e7129b8039j06623H7963K55225d7047j64128B49025
15709b17033n8759a15540a8454l87719J90671a6442j18204A14858K8675g7771
15698h940H0289a58746A6933a48031A1761a51542C63047J92487A62331G4270J29471
$$ y = [299482, -128551, -373845, 193673, -96009, -38298, -140031, -21461, 33883, 451751, -319587, -63891, 172176, -235136, 322132, 122356, -156311, 54868, -148534, -63650, -457910, 130252, 167957, -64377, -239824, 31942, -233091, -30710, 102611, -61618, -68100, -66129, 198812, -270438, 112031, 24234, -44680, 244269, -141802, -80678, -107470, -12646, -3569, 157768, -70386, 34109, -318785, 37980, -8301, 62450, -323577, -193933, 91004, -112761, 16176, 66935, 30841, -292240, 175179, -259658, -164411, -57129, -28039, -134662, 87963, 343188, -47047, -211175, 249025, -217033, -275792, -115540, -18454, -406173, -215502, -16442, -134646, 114858, 143533, -77771, -8940, 80289, -158746, 16933, -148031, 11761, -151542, 363047, 555534, 162331, 74270, 203741]
15687B03741b6224l0718B9133Q4817i7542k8564j06888a8607h19m4990j43316
15676a89125O1594L6247j66832J9668g9331j4352A4916a01353j01141C9245j307
15665C7938J76773P8712h6318B5346f5410N210n7394E5361b8826H2736m0795P2104
15653A14045c0218j92047G482J25283c49038A13649R5691A6168K5823e2017B55552
15641i2885E6387J022J57257a06257L80k20761B02615G7390J6017b88559Q3361
15630b05198O3419g0872c2906l39578R7415F003O018b75979K0394i5355F5819
15618d3281B02842a7840A01430g9356A85333a81590O9293A71524G8693k998C4506
15606C5093J65083c27844e7461b8160A4784L8702A5005b95403R2917f8970C53005
$$ y = [203741, -26224, -56942, 29133, 113950, -97542, -126106, -232994, -18607, -819, -45809, -189125, -127531, -91284, -258116, -238448, -79331, -93683, 14916, -101353, -202494, 39245, 37938, 214711, 293423, -86318, 25346, -65410, -60200, -117594, 55361, -28826, 82736, 41941, 114045, -30218, -222265, 7482, 132765, -349038, 113649, 209340, 16168, 41991, -52017, 255552, -92885, 56387, 57409, 214666, -106257, -105877, -326638, 202615, 77390, 93407, -288559, -205198, -141779, -70872, -32906, -372484, -275069, 6003, 12021, -275979, -255585, -95355, 65819, -43281, 202842, -17840, 101430, -79356, 185333, -181590, -112297, 171524, 78693, 75695, 34506, 35093, 200176, -327844, -57461, -28160, 14784, 53486, 15005, -295403, -202486, -68970, 353005]
15594B36304A0433R098b83279A10390F698P6678b13551e241A85374a78665P7377
15583a01288K8531j06292d9041m9689j21735m1757A30468d3398i726k05895P0721
15572a44900b2341l57500B03623q7265J40924i8570j39988e3358n2043k12227
15562c17628e7442B38861e3920b3216j05317H7633a18209A32102f2838A14774
15551d0115f995p7100m1935n9903Q6467I742g9503a4015A47356M671n7734P1800
15539A66093K6n2459K61583C5740J90906J00649a28452a8583A31039n3336h3661
15527A91232k7706l373c06594B89191A13988E170e623p1942r1927L9648M935A89922
15514c70020A34726a8244n7986l9073A77671d0300A08765j4051b32294a11750
$$ y = [236304, 10433, 19531, -283279, 110390, 6698, 83376, -213551, -5241, 185374, -178665, -101288, -72757, -179049, -49041, -98730, -220465, -262222, 130468, -43398, -9726, -215621, -144900, -22341, -379841, 203623, 116358, 257282, -98570, -238558, -53358, -105401, -317628, -57442, 238861, -53920, -23216, -128533, 87633, -118209, 132102, -62838, 114774, -40115, -6995, -84095, -126030, -185933, -99466, 9742, -79503, -14015, 147356, 152027, 94293, 166093, 166119, 113660, 375243, 35740, 226646, 327295, -128452, -18583, 131039, 77703, -83661, 191232, 163526, 160153, -306594, 289191, 113988, 5170, -5623, -77565, -169492, -129844, -124909, 189922, -370020, 134726, -18244, -76230, -115303, 177671, -40300, 108765, 94714, -232294, -111750]
15503A99262D1365j3768L97605q5064c30296a4339k96816H0766f179k49466e876
15491c3987A39698F9454I714b92569F3428a1992k8063c029F0262j3248L89315
15480D36329a19863B06537h6766D2404b9109q5833L4859A16473g8422A77124c9500
15468A07694a7969k67672A96259a27937E1228O6386f0872k0800A55751J07779
15458B63530c4415D7259J00477P0919b01804A00325b25645D5996D423c8450A05859
15446B68617c68292A87850h4307K6046j79823A00496b90830I3508J13107h2346
15435A55148a9923A30307k0711C0474O0410d10186i7051C79616a05739K4317b5116
15423H55O2482K00202a44234C8901J62085I498a53465G133c7919r8311N1887J4169
$$ y = [199262, 41365, 27597, 425202, 340138, -330296, -14339, -311155, 80766, -6179, -255645, -5876, -33987, 139698, 69454, 9714, -292569, 63428, -11992, -40055, -3029, 60262, 47014, 436329, -119863, 206537, -86766, 42404, -29109, -114942, -80083, 116473, -78422, 177124, -39500, 107694, -17969, -285641, 196259, -127937, 51228, 117614, -60872, -81672, 155751, 263530, -34415, 47259, 147736, 218655, -201804, 100325, -225645, 45996, 4423, -38450, 105859, 268617, -368292, 187850, -84307, -58261, -238084, 100496, -290830, 93508, 206615, -82346, 155148, -19923, 130307, 109596, 30474, 90884, -410186, -97051, 379616, -105739, -81422, -25116, 855, 63337, 263539, -144234, 38901, 200986, 9498, -153465, 7133, -37919, -136230, -84343, -70174]
15411g0174A40403c52238g4879G8179c6404A01317d9869E76M8275a52987c3009
15399E7239c24587g9575j03151D56067A18064j1938c21021a5125j66798f3992
15388a75960r2137A873a25323k5494D0209c51570B33823d644p2592J1282G2465
15376h1545m6619A56159d0353A06440B3051M3001h9054b2239o4394o087A38662
15364c562m0070r6984a2846r714k17104d3517B90508j41319E5524K6352b13091
15352D9503c41978b8810k5736A92381a54418A2032a96481d4698j8660j30832B2932
15340C12827A9105N1942a41906D2744L8380B111d7177B9406J12137A3217K62142
15329B75359a25755q7915L9881d8526j81749Q0157E79284A99773R5583B5212c24363
$$ y = [-70174, 140403, -352238, -74879, 78179, -36404, 101317, -49869, 576, 48851, -152987, -33009, 57239, -324587, -79575, -182726, 456067, 118064, 106126, -321021, -15125, -181923, -63992, -175960, -268097, 1873, -125323, -150817, 40209, -351570, 233823, -4644, -77236, -65954, 72465, -81545, -128164, 156159, -40353, 106440, 23051, 66052, -89054, -22239, -86633, -92720, 138662, -3562, -43632, -140616, -12846, -22560, -239664, -43517, 290508, 149189, 55524, 81876, -213091, 49503, -341978, -28810, -54546, 192381, -154418, 12032, -196481, -44698, -63358, -194190, 22932, 312827, 19105, 71047, -141906, 42744, 81124, 2111, -47177, 29406, 141543, 13217, 275359, -125755, -213670, -173789, -48526, -230275, -150118, 579284, 199773, 295356, 25212, -324363]
15317b00742I9299A4399a08133A08688D1598J67262a18642A31573j6207J2075
15307A27441f5028A41167a62701A76562b58165M0617F9261b24713h6908M112A39400
15295g9666B46014e3135A91230H7715h2046B17448J0806b15769i7028k06511B75295
15283c00049A80144o3139J76699A9047J43904Q279J30947n8813b6158j52268C03122
15271B37140p1269b8432J1666E6939Q1063J4732J39753C8975J26065b94534b1983
15259f1102A81413l0910O5905b754I9401B301J27546D7127A6635K67316m3342
15248B40609J60013R20640k39578J56739j26897l05505j19982B83819I7198Q9766
15238A86964O7018a4485q6994A89257F4809O0267k5480J91265a08180G9906M3856
$$ y = [-200742, 99299, 14399, -108133, 108688, 41598, 208860, -118642, 131573, 115366, 127441, -65028, 141167, -162701, 176562, -258165, -217548, 69261, -224713, -86908, -82796, 139400, -79666, 246014, -53135, 191230, 87715, -82046, 217448, 228254, -215769, -97028, -303539, 275295, -300049, 180144, 117005, 293704, 19047, 162951, 171230, 302177, 243364, -26158, -178426, 303122, 237140, 165871, -28432, -16766, 56939, 138002, 152734, 292487, 38975, 165040, -294534, -21983, -61102, 181413, 150503, 216408, -2754, 99401, 2301, 129847, 47127, 16635, 283951, 240609, 400622, 1321262, 1081684, 1238423, 1111526, 806021, 686039, 283819, 97198, 186964, 253982, -14485, -101479, 189257, 64809, 125076, 99596, 290861, -108180, 79906, 123762]
15227A23762b36794B65390o1130b21071C55803j18616D3580j7945L08565c978
15216a62991b9266A33441N6618a67004C81021b05793C996e1665K1825p1517j18130
15205b19487a1723F4366J5810P1314J0919d19619a80342g918B28432D2054L59189
15194D01243j39387a36297k01838A81364p1128a50523A20730h4711H4675J36014
15184B20689m3387L17504f3209C55609B7927K64101D6740K4142k1582c35586G4494
15172h1938G6781K04358j17491k3364m553a89288a803A81340A4539O5268J33890
15161B13697o5715B9847J49736a88809B01929i6428J2164j5608E0767B3239J41216
15150A64455L1896g6038F7569c6783C88164C6965L88443B05015m3574F1905J99293
$$ y = [123762, -236794, 265390, 204260, -221071, 355803, 237187, 43580, 25635, 334200, -3978, -162991, -29266, 133441, 190059, -167004, 381021, -205793, 3996, -51665, -29840, -101357, -219487, -11723, 64366, 80176, 151490, 162409, -419619, -180342, -7918, 228432, 42054, 401243, 261856, -136297, -338135, 181364, 110236, -150523, 120730, -84711, 84675, 220689, 177302, 494806, -63209, 355609, 27927, 292028, 46740, 70882, 49300, -335586, 74494, -81938, 76781, 281139, 163648, 140284, 135731, -189288, -1803, 181340, 14539, 79807, 213697, 147982, 29847, 179583, -188809, 201929, -96428, -84264, -99872, 50767, 23239, 164455, 196351, -76038, 67569, -36783, 388164, 36965, 425408, 205015, 161441, 61905, 261198]
15139B61198I4930b05604F0760M580K2838K0408Q3351c601A08714L9825n3007
15128I5532J88850Q3354a25353n4034B32600F7530b20528G734J27412d475A96941
15116f8266H6519K31170A30722J7276M4154J14833b09797i7594A29484e5613b199
15104h9305M3346B84741m9770l7387b12847A39047O201L8978G0874J1255K29719
15093C11848A01917a20689a3403B94261A29331d5898B90148B3671J08726K08506
15083C40903i1830A65568K9571N2096J39841f7709A88868K4668J06690c7649C14726
15071d5743F4657K33161A19293m826J03666e7566A27177L16191k17348E0283L5356
15060H5639r641J12442b16210B08596A00034L5779P7457c0035j10256C03333A26400
$$ y = [261198, 94930, -205604, 60760, 65340, 88178, 108586, 191937, -3601, 108714, 148539, 95532, 284382, 367736, -125353, -179387, 232600, 67530, -220528, 7734, 135146, -4475, 196941, -68266, 86519, 317689, 130722, 147998, 192152, 306985, -209797, -97594, 129484, -55613, -2199, -89305, -45959, 284741, 234971, 197584, -212847, 139047, 145248, 184226, 70874, 82129, 311848, 101917, -120689, -13403, 294261, 129331, -45898, 290148, 23671, 132397, 340903, -91830, 165568, 195139, 247235, 387076, -67709, 188868, 213536, 320226, -37649, 314726, -45743, 64657, 297818, 119293, 114467, 218133, -57566, 127177, 443368, 226020, 50283, 85639, 75998, 188440, -216210, 208596, 100034, 135813, 213270, -30035, -140291, 303333, 126400]
15048D27560j21661M7999j14546G2287J11733o2014C9612N0198L06389a43693
15037D06707A29026L58233A01339c0021C04799a25927G5605K73394r653H0419
15026B9806J12422K86173A88123J28120j13430m6529E037a45652B81156e3781
15015G6964k9840J75544Q6446m5092a05808F68731B16944J7975c7935H7408f7185
15003A70400m693C1828J36450H090K61926J75268k18829O6055m3228q5612C7375
14991c9370j26870D40781O7497A96018n6338K57208I1315J44661L67583I8265
14980C29251r7638F2249j6425J2235K70342J1847e8384C29548C3706b4162B5035
14968C45431A29123J05250H8696K82548a54537D74407j98219P8573j01920J9378
$$ y = [427560, 305899, 353898, 239352, 72287, 184020, 122006, 39612, 89810, 396199, -143693, 406707, 129026, 487259, 101339, -30021, 304799, -125927, 75605, 348999, 339346, 80419, 29806, 142228, 428401, 188123, 316243, 202813, 156284, 5037, -145652, 281156, -53781, 76964, 47124, 222668, 309114, 264022, -105808, 668731, 216944, 234919, -37935, 87408, -67185, 170400, 165707, 31828, 168278, 8090, 270016, 445284, 226455, 292510, 249282, 163670, 37375, -39370, -166240, 440781, 508278, 196018, 139680, 396888, 91315, 235976, 603559, 98265, 329251, 231613, 62249, 45824, 58059, 328401, 340248, -58384, 329548, 33706, -24162, 25035, 345431, 129123, 234373, 88696, 371244, -154537, 474407, 276188, 354761, 252841, 272219]
14958B72219g6561C62507A05455L8413l0590J61231j12015c5188D91819A87891
14947C05573J21081F2181K39755o5010j4310q012L00005j90816K4574J7033A53338
14935A8839L37023L5832A49390J66818R7344k03308J20883r0558n4626A3420M10740
14924D24160A15741R448L9025K4944Q6406R4737R5039j67461J07135m1315J15614
14913D79313j52794H1193R9644K86913N1428A24653J54232A1288K53680R1464
14903C56432n1275h692B29617h2738D86179A53911J08167n7762E5104M30854P0913
14892E56871a12768F9164N238N09581k09841J23318k31608M7442r1136Q6364P8102
14881C86624R1973Q4896j13969r8832K61349B79513j33815N15381B05120J61910
$$ y = [272219, -76561, 362507, 105455, 143868, 113278, 274509, 162494, -35188, 491819, 187891, 305573, 426654, 62181, 301936, 236926, 222616, 214604, 514609, 323793, 348367, 365400, 153338, 18839, 355862, 391694, 149390, 316208, 413552, 210244, 331127, 240569, 185943, 13420, 424160, 115741, 125189, 164214, 189158, 275564, 370301, 465340, 297879, 405014, 363699, 479313, 326519, 81193, 180837, 467750, 519178, 124653, 278885, 11288, 264968, 356432, 305157, -8692, 229617, -82738, 486179, 153911, 262078, 204316, 55104, 485958, 556871, -112768, 69164, 74402, 583983, 374142, 497460, 265852, 313294, 222158, 308522, 386624, 478597, 563493, 449524, 350692, 612041, 279513, 145698, 661079, 205120, 367030]
14871C67030P2617A90726B0604N34121q0395j87098K32815k06589O4848N162J75111
14860E58579P144J2614j31626N7853k1885j74922A43015M74278R3919l42131k3340
14849C45741F8793K93963j11646J05783P0705m1455J646n4798Q0618p6813A03737
14837C08721o7299L46448B2714M00174K7656M55678l11709O1600k1777K32824
14827H67160B72373L03934j98508J74810A14100K69148A88891Q9378M07678A44870
14816B74772J99240j00665m9293K00433k7868q3976n26J09528M5733J97711k33035
14805E32054F1985j6391M12333J26511p3845H1554M19687J19419B22403N80223
14795H02626B78578K01404J5200J11790K11430l22162J3625K07926l57125J58203
$$ y = [367030, 439647, 190726, 20604, 554725, 474330, 287232, 520047, 313458, 378306, 383468, 558579, 565723, 578337, 446711, 504564, 482679, 307757, 143015, 617293, 711212, 369081, 345741, 68793, 362756, 251110, 356893, 427598, 386143, 387789, 332991, 413609, 336796, 103737, 308721, 241422, 587870, 22714, 422888, 450544, 906222, 594513, 656113, 634336, 867160, 272373, 576307, 377799, 552609, 114100, 383248, 188891, 278269, 685947, 144870, 274772, 474012, 373347, 324054, 524487, 496619, 412643, 412117, 521645, 567378, 765089, 532054, 61985, 45594, 457927, 584438, 510593, 81554, 501241, 620660, 222403, 802626, 278578, 479982, 495182, 606972, 818402, 496240, 509865, 717791, 360666, 518869]
14785E18869L47217k69202A79429L85424k00484j3098j1992K74027J03295m4451
14775F72150B90170L25548j67489J92991J2352j89873J10819B01053M06437k3972
14765E83518j67726M76419j72985L1548k5638k15835o1567Q681K9628O1011M89764
14754A036818C84392K18796Q6253j27085q1561K85417o8215J11969J82262m61266
14744E30962j28056M02727m6644l07694Q8474K20797P9002l56803N18576j77251
14734H24090K01612k67005K68585k59289j03364k18921M10055k15463J34856l5060
14724G40096k14843N96217l89165o3646j59694M52300K20983n36655J98943k02044
14714F42492L36683J35142k72484k14084m2081L60616Q6926l99907K89071R20
$$ y = [518869, 866086, 596884, 179429, 564853, 364369, 351271, 339279, 613306, 716601, 672150, 290170, 615718, 448229, 641220, 653572, 463699, 574518, 201053, 607490, 583518, 415792, 892211, 719226, 750774, 725136, 509301, 447734, 456415, 486043, 547054, 1036818, 384392, 603188, 689441, 562356, 480795, 766212, 697997, 809966, 992228, 530962, 402906, 805633, 758989, 451295, 539769, 760566, 839568, 482765, 1001341, 824090, 1025702, 758697, 1027282, 767993, 664629, 445708, 855763, 640300, 775156, 740096, 525253, 1121470, 732305, 668659, 508965, 961265, 1182248, 645593, 844536, 642492, 979175, 1114317, 841833, 627749, 585668, 946284, 1033210, 633303, 922374, 923294]
14704I23294K7233j19861K36062k98306J25758k05604K11086J28255q5675j13954
14694H28288M8266l613N5054k06195J30278j87462M58980J77682j04039K9383
14684A226622q2283j71376N5366r2684n3635J25919k97207J40034P4094K08146
14674A132996j91872N0241l32613L16446j05599n5232L67473l74033J22152j35595
14664G94364J62838J61579r4167K55045k35380k95654K83814r536k2589J66379
14654A166693k8595p7331R2596o0090P7991M6422l09004J99900q1812K49544j40958
14643A135356M2333K97532m13656M38884k1165K16722m14362j0238R8441K76853
14633A646700o22738K39444O4658L814J40385j84388J16004j6051l31342L09738
$$ y = [923294, 950527, 830666, 1066728, 768422, 894180, 688576, 899662, 1027917, 942242, 828288, 876554, 872941, 927995, 721800, 852078, 664616, 1123596, 1301278, 1197239, 1226622, 1144339, 972963, 1028329, 935645, 882010, 1007929, 710722, 850756, 924850, 1132996, 941124, 991365, 658752, 975198, 869599, 814367, 1181840, 807807, 929959, 794364, 957202, 1118781, 1024614, 1279659, 1044279, 748625, 1032439, 1022903, 1000314, 1166693, 1138098, 1060767, 1153363, 1093273, 1171264, 1217686, 908682, 1108582, 1026770, 1276314, 1135356, 1177689, 1475221, 1061565, 1500449, 1479284, 1696006, 1281644, 1271406, 1369847, 1646700, 1023962, 1263406, 1328064, 1331878, 1472263, 1287875, 1403879, 1387828, 1056486, 1366224]
14623A366224j01305L21909l25563N5539J04802K15449j82554k82497M01059J6260
14613A589323l80760M15971j13487O7583j5880p728M8791k4645k25462K36948
14603A590654J39628k58651K50182k70988L08108n7257K67547n63570M21661J1718
14593A839032j62812l85510P27565k84045J76417J34293j30746L5471n11264J85285
14583A623686J03830K74126P356p0228J50411j0465k30628J76199O187P5703M58948
14572B565125l23823j18033K5534N8981J46524P364K95069l27954L40220m05225
14562B263782K52074L07971k54067K38881K87856p2881J2587J04714M18724j12248
14552C447393N65536N08837J169989K192595M343769Q284187J7727242n86561
$$ y = [1366224, 1264919, 1586828, 1261265, 1316804, 1421606, 1637055, 1454501, 1172004, 1573063, 1589323, 1208563, 1624534, 1511047, 1578630, 1562750, 1555022, 1603813, 1579168, 1353706, 1590654, 1730282, 1471631, 1721813, 1450825, 1758933, 1701676, 1969223, 1405653, 1827314, 1839032, 1676220, 1290710, 2018275, 1734230, 1910647, 2044940, 1914194, 1949665, 1438401, 1623686, 1727516, 2001642, 2008998, 1938770, 2089181, 2078716, 1848088, 2024287, 2030474, 2106177, 2565125, 2241302, 2123269, 2148803, 2207784, 2354308, 2361672, 2656741, 2328787, 2669007, 2263782, 2515856, 2823827, 2569760, 2808641, 3096497, 3023616, 3036203, 3140917, 3559641, 3447393, 4012929, 4521766, 5691755, 7884350, 12228119, 20512306, 38239548, 37652987]
14544C7652987j7294862q881615m975762k166628j163992m42984m61564j63377
14536B102203j36598J77058p2579q7511R359J82511k97964K12955p5318K44572
14526B258688k36017K44099o7804L13907l91396O52602n61032J41187K89843J7382
14516B661459k57893L01237Q144J0007r9246M85880n10363L54930K41228m52739
14506B742644K21222o9372R349K9760J43929L03368j81551j50290M85847k21547
14496C313359N3190j99242J54831J27538k94182K1821K59703J74723J67594O8294
14486C847629O6269j89285k64658J53723J42983K60966J8070k45425K93175N5554
14476D139001J66395l79153L60818R4423l55109J01526L70197j0099m21119N56615
$$ y = [37652987, 20358125, 11476510, 6500748, 4334120, 3170128, 2727144, 2265580, 2102203, 1965605, 2142663, 2070084, 1982573, 1991932, 2174443, 1876479, 2089434, 2014116, 2258688, 2022671, 2266770, 2198966, 2512873, 2121477, 2774079, 2213047, 2354234, 2644077, 2661459, 2403566, 2704803, 2712947, 2722954, 2623708, 3109588, 2599225, 2954155, 3195383, 2742644, 2963866, 2894494, 2903843, 2933603, 3077532, 3380900, 3199349, 3049059, 3534906, 3313359, 3366549, 3167307, 3322138, 3449676, 3155494, 3177315, 3437018, 3611741, 3779335, 3847629, 3913898, 3724613, 3459955, 3613678, 3756661, 4017627, 4035697, 3790272, 4083447, 4139001, 4305396, 3926243, 4287061, 4381484, 4026375, 4127901, 4498098, 4487999, 4066880, 4623495]
14466D623495r2824j24701J93297J48410Q4626o8859o1134L24856l25078N88818
14456E290906J68305l11347J76754M8924k46122J15586N18473m67583K38161n6805
14446E475252L07346J62608j44456L96609P1461j88347L77733K3696k64980L63447
14436F580369l49632M54211K15285j53394K58334J75267l88283K27513J48972
14427G168642P0543K48826R9857K52832l08226K63130L37220m4242J90747J65393
14417H444722K2319p1577K94197k15194p9218M79917M84372l05230L07775J21851
14407I483934j40469L95679J66332q9421N41361J34159k12815L57792o5348O22540
14397A1193744k24478O65704r6311K56055k4327N75053q8949K60129N6935K47410
$$ y = [4623495, 4530671, 4405970, 4599267, 4747677, 4832303, 4763444, 4702310, 5027166, 4702088, 5290906, 5459211, 5147864, 5324618, 5373542, 5127420, 5243006, 5761479, 5293896, 5532057, 5475252, 5782598, 5945206, 5800750, 6197359, 6268820, 6080473, 6458206, 6481902, 6216922, 6580369, 6230737, 6684948, 6900233, 6746839, 7005173, 7180440, 6792157, 7019670, 7168642, 7239185, 7488011, 7587868, 7840700, 7532474, 7795604, 8132824, 8088582, 8279329, 8444722, 8467041, 8395464, 8689661, 8474467, 8395249, 8875166, 9359538, 9054308, 9362083, 9483934, 9343465, 9739144, 9905476, 9816055, 10357416, 10491575, 10278760, 10636552, 10571204, 11193744, 10969266, 11634970, 11538659, 11794714, 11770387, 12345440, 12256491, 12516620, 12573555, 12820965]
14387A2820965L05654M25967j41839K65844N29950J86068K67293K92236m4067
14378A4908071K15992O61287J95141K50698N15234K84932L12316j98210R32452
14369A8077913J75834M08112J94163Q38358K89883N21174M09650K0692P57685
14360B1693464L26329L68511Q81315N47298L16156O34807O07337j25927J186748
14351B6436038O33760P97145M64111J158392L96660P22575R20924P55729R26456
14342C3211790O89174J326530O28479R36604J107340J592389L72583J271158J326845
14333D2462892J458976J072785J717178J247530J454626J416966J830223J673966
14325E4335142J750428K191419J867726J949281K387382K117847K266273K770810
$$ y = [12820965, 13126619, 13552586, 13410747, 13676591, 14206541, 14392609, 14659902, 14952138, 14908071, 15124063, 15785350, 15980491, 16231189, 16746423, 17031355, 17343671, 17145461, 18077913, 18253747, 18661859, 18856022, 19694380, 19984263, 20505437, 20915087, 20935779, 21693464, 22019793, 22388304, 23269619, 23816917, 24133073, 24767880, 25375217, 25249290, 26436038, 27069798, 27866943, 28331054, 29489446, 29886106, 30608681, 31529605, 32285334, 33211790, 33900964, 35227494, 35855973, 36792577, 37899917, 39492306, 39864889, 41136047, 42462892, 43921868, 44994653, 46711831, 47959361, 49413987, 50830953, 52661176, 54335142, 56085570, 58276989, 60144715, 62093996, 64481378, 66599225, 68865498, 71636308]
14317G1636308K488416K947555L212912K459621L426600L293856M081932L744253
14309I7291453M095855M039681M531743M711317N408889M835071N570026O332108
14301A36816143O074483O560880P130876P813919P916577Q275167Q807547R331207
14293A98726799R855211J0307630J1543465J1000360J2264095J2357174J3150966
14286B79205700J3731774J3720462J4172524J4638509J4588266J4894830J4560816
14279C79512881J3946522J3470733J2459425J1528334R868534P515674L912720
14272D52214823N18231L29477K33064l670407n239732o640885p449373p030425
14264D23264773q214180j0165273j2203269j3101796j4162950j4407073j4839233
$$ y = [71636308, 74124724, 77072279, 80285191, 82744812, 86171412, 89465268, 93547200, 97291453, 101387308, 105426989, 109958732, 114670049, 120078938, 124914009, 130484035, 136816143, 142890626, 149451506, 156582382, 164396301, 172312878, 180588045, 189395592, 198726799, 208582010, 218889640, 230433105, 241433465, 253697560, 266054734, 279205700, 292937474, 306657936, 320830460, 335468969, 350057235, 364952065, 379512881, 393459403, 406930136, 419389561, 430917895, 440786429, 448302103, 452214823, 452733054, 453062531, 453295595, 449625188, 444385456, 437744571, 430295198, 423264773, 415050593, 404885320, 392682051, 379580255, 365417305, 351010232, 336170999]
14257C36170999j4816400j4898423j4346788j3257705j3683027j3409597j2606369
14250B39152690j1514351j1480306j0625943j0153512r409385q616102q382224
14243A68970867p917002p635502p066440o648284o253083n564213n483587n295127
14235A17107629n642023m445847m346367l844787l622733l798651l569370l629963
14227H4207888l195336l032565l053171k622108k643927k481482k151814k316528
14219F2710957k045567j931025j894195j773190j882948j269902j790829j072475
14211D9050826j910219j612952j195613q32639j170739q30703j341238j767603
14203C8389120n57644j327481k43869j095780r34957j104785q95945r57631m96945
$$ y = [336170999, 321354599, 306456176, 292109388, 278851683, 265168656, 251759059, 239152690, 227638339, 216158033, 205532090, 195378578, 185969193, 177353091, 168970867, 161053865, 153418363, 146351923, 139703639, 133450556, 127886343, 122402756, 117107629, 111465606, 107019759, 102673392, 98828605, 95205872, 91407221, 87837851, 84207888, 81012552, 77979987, 74926816, 72304708, 69660781, 67179299, 65027485, 62710957, 60665390, 58734365, 56840170, 55066980, 53184032, 51914130, 50123301, 49050826, 47140607, 45527655, 44332042, 43499403, 42328664, 41497961, 40156723, 38389120, 37831476, 36503995, 36260126, 35164346, 34229389, 33124604, 32228659, 31271028, 30774083]
14194C0774083p34006p81664n05624j052281l60074r07493o04944n56456l73874
14185B4897667q06477m83265n44291m88816n94644j41833n05086p88571m3265
14176B0501419q56498J15744m90028k88242m34760l77192k64072n81290m09119
14167A6915962k08482k56139l53364k18818l69969l33987j56046m51688k85164
14158A4282305k99565j28738m41605j28160j43358l83438j84988l2070j05583
14149A2434800l66924k29l61337k13224j98131n9095l71972j22516j92419k65577
14139A0283376j73629N5301O9439m24685k00859J68547l65175J76795o25998J69523
14129I132635m38530O0810J05608k4850q58507j4933M86981m39039k3597J45282
$$ y = [30774083, 30040077, 29258413, 28752789, 27700508, 27340434, 26432941, 25827997, 25271541, 24897667, 24091190, 23607925, 23063634, 22574818, 21980174, 21838341, 21333255, 20544684, 20501419, 19644921, 19760665, 19270637, 18982395, 18547635, 18170443, 17906371, 17325081, 16915962, 16707480, 16451341, 16097977, 15879159, 15509190, 15175203, 15019157, 14567469, 14282305, 13982740, 13854002, 13412397, 13284237, 13140879, 12757441, 12572453, 12540383, 12434800, 12067876, 12067647, 11706310, 11493086, 11294955, 11235860, 10863888, 10741372, 10548953, 10283376, 10109747, 10165048, 10234487, 9809802, 9608943, 9777490, 9412315, 9589110, 8963112, 9132635, 8694105, 8754915, 8860523, 8835673, 7977166, 7962233, 8449214, 8010175, 7986578, 8131860]
14119H131860k71520k58515j0983m10085L70361l26558k57752J0797l5921L24939
14109G266623k96979j98658L6392k96972j49603N7264k10786R6342K70305n32568
14099F041360L5778R977k11743Q4850p4792l09185K83614l19435o6693r9820L87138
14088E761049m99704l08749K50914j32084j72688K30073n9671j14006j90791K89743
14078E054086p4974p4550j10501j14503q9752K79519l79425j58544M33628n88941
14068D176043K50903j85005l4917L23896j74846j14591m46244Q0307k13368M49008
14058D111186j87130R214j46347m9671K05849j06715l15367O0876J50392j19942
14048C612345j22616j06348O1134j7118K66988j70213j61321R5787j12150l14967
$$ y = [8131860, 7860340, 7601825, 7590842, 7180757, 7551118, 7224560, 6966808, 6977605, 6941684, 7266623, 6969644, 6770986, 6807378, 6510406, 6360803, 6418067, 6207281, 6303623, 6573928, 6041360, 6077138, 6087115, 5875372, 5960222, 5885430, 5576245, 5859859, 5540424, 5473731, 5373911, 5761049, 5261345, 4952596, 5203510, 5071426, 4898738, 5128811, 5069140, 4955134, 4764343, 5054086, 4979112, 4904562, 4794061, 4679558, 4589806, 4869325, 4489900, 4331356, 4764984, 4176043, 4426946, 4241941, 4207024, 4530920, 4356074, 4241483, 3795239, 3875546, 3662178, 4111186, 3924056, 3933270, 3786923, 3737252, 3943101, 3836386, 3521019, 3581895, 3732287, 3612345, 3489729, 3383381, 3444515, 3427397, 3694385, 3524172, 3362851, 3458638, 3346488, 3031521]
14038C031521M71205m66638K87208l32334M7047o9738q5534K79273k18263J62221
14028C105968l12266K88075K03046m96671K86239k38029J06619K20950n20789
14019B643142J0995J08292k68992K99582l10940K36301k66925L99626m00728L36494
14009B786847k28089k46689L63421n02054L84759r4173j18355J33018l32719K76295
13999B422261m45310L18846M2195n0126j63614J68399k14028K74129j20880R19156
13989C151028J146988K989560P377883J7873740O793586j5783502r606877m197635
13981I744771k648669j420591j199291k78360p51735k49564K28360j53529n37590
13972B733802J34800J35769l97375k04795J07240j97251J68347r4924J34688k53882
$$ y = [3031521, 3502726, 3036088, 3323296, 2990962, 3038009, 2968271, 2882737, 3162010, 2943747, 3105968, 2793702, 3081777, 3284823, 2788152, 3074391, 2836362, 2942981, 3163931, 2643142, 2654137, 2762429, 2493437, 2793019, 2482079, 2718380, 2451455, 2851081, 2450353, 2786847, 2558758, 2312069, 2675490, 2173436, 2558195, 2464022, 2345667, 2478685, 2145966, 2422261, 1976951, 2295797, 2337992, 2287866, 2124252, 2292651, 2078623, 2352752, 2231872, 3151028, 4298016, 7287576, 14665459, 32539199, 39332785, 23549283, 13942406, 9744771, 7096102, 5675511, 4476220, 4197860, 3446125, 3196561, 3424921, 3271392, 2733802, 2868602, 3004371, 2606996, 2402201, 2509441, 2312190, 2480537, 2385613, 2520301, 2266419]
13962B266419k8619J53938m593j42181j64762J6677L8131m4265q2140n2781J53158
13951B108982k56661j49650O4905p5559K59098l6858j79936O7885J37745l40742
13941A599209L29080m2836q4127j56873j65875J98839J91074j00167R0754K685
13931A861763j2630n8445k59895Q5951R1712O1945j66441l35837M3059N31891
13921A843073k53813l9805l10555L78309R9480l31599Q0693O6500n9472L455J3602
13910A489868J76505k89247j76930N02019m31570J93016J13320j20958j79385
13901A276638J72873j58545R029n9008j58468N25574l81485L14842l09772j21737
13891A109941J75633L4831j90557n940Q0587N9018l04420J33543K04337j37818
$$ y = [2266419, 2237800, 2391738, 2387145, 2244964, 2080202, 2096879, 2135010, 2090745, 2008605, 1955824, 2108982, 1852321, 1702671, 1767576, 1692017, 1951115, 1914257, 1734321, 1802206, 1939951, 1599209, 1928289, 1885453, 1801326, 1644453, 1478578, 1677417, 1868491, 1768324, 1859078, 1861763, 1849133, 1790688, 1530793, 1616744, 1708456, 1770401, 1603960, 1268123, 1311182, 1843073, 1589260, 1549455, 1238900, 1617209, 1716689, 1385090, 1465783, 1532283, 1472811, 1476266, 1489868, 1666373, 1377126, 1200196, 1702215, 1270645, 1463661, 1576981, 1456023, 1276638, 1449511, 1290966, 1299995, 1240987, 1082519, 1608093, 1226608, 1541450, 1231678, 1109941, 1285574, 1320405, 1129848, 1123908, 1204495, 1263513, 959093, 1092636, 1296973, 1159155]
13881A159155L93033o08347J61446K1386M66806j50380n72223K75252o4158l6752
13871A045218N121l37445L88322K82439R7929k33002m053j02219j31474L77182
13861A388018n66153L33807l593K07479m12021J66552l294j67455R2573K00750
13851A236663q2274Q0477q1665P8353k59649N2300k18393N39206m02208L23029
13841A265839k08019m09259K80366R1982r232P5714K12088l41105j93133J42422
13831I07663M9903K45238l12118J53355l98022J47896K23444j90053o9009p0899
13821F87398k5365J2103J55720J50170n5233R1183q1881k9090J73584k87701n0704
13810G40184M3699L16037j59153j11438J29354D77574K86354j08160j10989L06837
$$ y = [1159155, 1552188, 943841, 1105287, 1126673, 1593479, 1443099, 870876, 1146128, 1081970, 1045218, 1050339, 712894, 1101216, 1383655, 1481584, 1248582, 1244529, 1142310, 1010836, 1388018, 821865, 1155672, 1152079, 1359558, 947537, 1114089, 1110795, 943340, 1035913, 1236663, 1154389, 1234866, 1153201, 1231554, 971905, 1024205, 805812, 1345018, 942810, 1265839, 1057820, 648561, 928927, 1020909, 1011677, 1087391, 1299479, 958374, 765241, 907663, 957566, 1202804, 890686, 1044041, 646019, 793915, 1017359, 827306, 758297, 687398, 662033, 674136, 829856, 980026, 924793, 1015976, 934095, 905005, 1078589, 790888, 740184, 783883, 1099920, 940767, 829329, 958683, 477574, 763928, 655768, 544779, 851616]
13800H51616k60676L10582j4860k59054L59262Q4145k95985J27645N115P5433
13790I83223j39763l63448O01191m21812J74345j54237N25673n84856R4722K93961
13780A008999l55675j68971L43849j72933J93615J06555m62853P9969j35592M71707
13770I08670l67300L22475r9784k2711Q6854k36514J11157p3184J10887n6195
13760F84355C10932L85248P9407j33177Q227L43303m28779K33692k24030k78105
13750B96718M84797j76510L23927j82349K24247k28520J1099J65004l21832L0967
13740F27548K20608N5920j30663J34079k31304A12092R14378k95225k44516j2860
13730D73869n8916L38502k08927j02163L35394k1912q5644P7625k07509j09275
$$ y = [851616, 590940, 901522, 886662, 627608, 986870, 1071015, 775030, 902675, 907790, 983223, 843460, 480012, 1081203, 659391, 833736, 679499, 1205172, 620316, 715038, 1008999, 653324, 484353, 828202, 655269, 848884, 955439, 492586, 572555, 436963, 908670, 541370, 863845, 764061, 741350, 828204, 591690, 702847, 629663, 740550, 684355, 310932, 696180, 775587, 642410, 650637, 993940, 565161, 798853, 574823, 296718, 781515, 605005, 928932, 746583, 970830, 742310, 753409, 918413, 596581, 627548, 848156, 904076, 773413, 907492, 676188, 112092, 1026470, 731245, 486729, 473869, 414953, 753455, 544528, 442365, 777759, 755847, 670203, 747828, 540319, 431044]
13720D31044K80328J76317m00169J70689k18071L73512j54765j12285p0491K6431
13710E02540Q003K57262P2566l45235L07368j51616R1741j20037l0777M9044k44702
13699C96157J14446k09530L34749j08770L7009n2025L660k4777J35901k50791
13689C76029J57409K19154l00935J15010m1511R9064j25360N3950P1627P1717
13679F96154L2834B84249r0392L10281J14526j98205m9544J815J53550q9452A55221
13667E86527K87394B78530J40742J66987r5512Q1717j97038r718J2682M77562
13657H55952C30705K71216A39953M44084j30431l48M6962Q0265q2505J93598q3590
13646F07988q3262l9787j6825j44598L71776j42628Q7448k17537j80653L06094
$$ y = [431044, 711372, 887689, 487520, 658209, 440138, 813650, 658885, 546600, 476109, 502540, 510543, 767805, 840371, 495136, 802504, 650888, 742629, 622592, 591815, 640859, 396157, 510603, 301073, 635822, 527052, 564061, 512036, 515696, 490919, 626820, 376029, 533438, 752592, 451657, 566667, 525156, 624220, 498860, 552810, 624437, 696154, 728988, 284249, 193857, 504138, 618664, 420459, 370915, 372730, 526280, 436828, 155221, 586527, 873921, 278530, 419272, 586259, 490747, 572464, 375426, 365708, 378390, 855952, 330705, 601921, 139953, 584037, 453606, 453258, 500220, 580485, 497980, 691578, 607988, 524726, 484939, 468114, 323516, 695292, 552664, 640112, 422575, 241922, 548016]
13636E48016B55733P4618K13298B34661k8366L22045O7578A13712L46003m9983
13626D09732k6549J63700j31871K49540l8074k39436J59968J28075A98326J07945
13616C06271J38041j20222o6562J36940R923A86964J48821A65385J97701A60985
13605D42940R5478B22847J71111J1279j36515c0832B42148N25344k54662o8926
13595D43904A7337L59364J702M69246k65650q1590k24969A03408n034Q6959K45204
13584D30537O9131A31388L87875j81961j22479Q9118k9535L72628k35996L982
13574D15020K3856L56470B18389r0849K34645A25922J62095H3768M48180l7755
13564D94193k44762M47723j31705B67833B9697K80168K7183j35069O9233q3885
$$ y = [548016, 255733, 330351, 543649, 234661, 206295, 528340, 595918, 113712, 459715, 409732, 383183, 546883, 415012, 664552, 626478, 387042, 547010, 675085, 198326, 306271, 444312, 324090, 257528, 394468, 404391, 186964, 335785, 165385, 363086, 160985, 442940, 538418, 222847, 393958, 405237, 268722, -30832, 242148, 767492, 512830, 443904, 17337, 376701, 378403, 847649, 581999, 500409, 275440, 103408, 98374, 185333, 430537, 499668, 131388, 519263, 337302, 214823, 303941, 274406, 647034, 411038, 415020, 438876, 795346, 218389, 127540, 362185, 125922, 288017, 83768, 531948, 494193, 249431, 697154, 565449, 267833, 29697, 309865, 337048, 201979, 271212, 187327]
13554A87327K67437J26622d257B10217O494J58110J08073A48236L07490a66645
13543F0910L14488k0990N1703A81447J89745j09936K03309j91254O0623j31876
13533B02058L18527j24381a429C49682R7847k7858p3052n316G7067L07910j65489
13522B19488j06132H032J42522j6951K83288j50256m4857K8067N5083O6971k6834
13511C45065q7344J26569p7161m9751N6120K1950N0675A66372p9410L23208M7214
13500D57384j5642J51885A87638l5440J6842M22946k07585j4956A21998a73361
13489B23654J00800j31601C2986a2302G7786L60982p5918R8613B3385K52511A37125
13477C72464j33421f896A83222r0794K57598K7385j19407J16123O4245l9021A98126
$$ y = [187327, 454764, 581386, -4257, 210217, 216711, 374821, 482894, 148236, 455726, -166645, 60910, 375398, 354408, 406111, 181447, 371192, 261256, 464565, 273311, 333934, 202058, 520585, 396204, -1429, 349682, 447529, 419671, 346619, 341303, 77067, 384977, 219488, 113356, 8032, 150554, 133603, 416891, 266635, 221778, 249845, 304928, 371899, 345065, 257721, 384290, 307129, 257378, 313498, 335448, 386123, 166372, 86962, 410170, 457384, 441742, 593627, 187638, 152198, 169040, 591986, 384401, 369445, 121998, -173361, 223654, 324454, 192853, 32986, -12302, 77786, 438768, 362850, 461463, 23385, 275896, 137125, 372464, 239043, -6896, 183222, 92428, 350026, 377411, 258004, 374127, 438372, 399351, 198126]
13465e8027B57938L7620j12156O03163E4237J42686h3234B68663B1782K46412
13455B68194Q8411l0860K48421B65061d4603A03524P6286N55476k65743B33779
13444a2228k71469A66060d0122J4706H8103J44616J55947j16061n5080O2569H3422
13432C06862L49506A90886A9618K6246b221I8114O6331J39604R1504k7142h9689
13420F6387g7992A43384k203K00739m2921a36852B08472L3850j17496M1995Q5740
13409B52561N93301C15073L24797k55498A30873J8501p334K79121j3481l5025
13399C72655A29370J35654r9614Q601n0044I15Q7004J15068E5167K71992o410
13388C20749k1532b9767C01547m6430E4216L08748m3837H0720K44590p9436K1308
$$ y = [-58027, 257938, 295558, 183402, 786565, 54237, 196923, -83234, 268663, 21782, 268194, 356605, 325745, 574166, 265061, -44603, 103524, 179810, 735286, 469543, 233779, -12228, -283697, 166060, -40122, -25416, 88103, 232719, 388666, 272605, 217525, 280094, 83422, 306862, 656368, 190886, 19618, 45864, -2221, 98114, 164445, 304049, 395553, 368411, -89689, 66387, -77992, 143384, 141181, 341920, 298999, -136852, 208472, 242322, 124826, 166821, 252561, 845862, 315073, 639870, 384372, 130873, 149374, 142040, 421161, 407680, 372655, 129370, 265024, 165410, 174011, 123967, 915, 87919, 202987, 55167, 327159, 320749, 299217, -29767, 301547, 255117, 54216, 362964, 319127, 80720, 325310, 245874, 267182]
13377B67182L7226q3080J07063N2567b85418b3839E47087a06961E08355j81966
13367C26389o560J85507A87402E6047J00783j5447E1531K82266A23011J57469
13357B80480A18876a35269A62369n2271L32076B13378K6567F9980M44027N9169
13347E73176k38015l3176j26785L6452J81201n2921J03478a1945C3011L68123
13337D01134F0243J34029M8029p3379p0023L20932j40131Q0381a6381O251A88669
13325c4901H4497L89491j89627J36714j87745J63866j76525k7491J68841A20479
13314a8960B85010k6615P506j2470E7129j3803A3517K18805o3629A9393a00518
13302C04606j15852a24808B97058p2839K9969F9310M21647B32496D3563J60451
$$ y = [267182, 304408, 221328, 328391, 380958, -285418, -23839, 547087, -106961, 508355, 326389, 319829, 505336, 187402, 56047, 156830, 141383, 51531, 333797, 123011, 280480, 118876, -135269, 162369, 110098, 442174, 213378, 239945, 69980, 514007, 573176, 335161, 301985, 175200, 211652, 392853, 339932, 443410, -11945, 33011, 401134, 60243, 194272, 242301, 168922, 98899, 419831, 279700, 360081, -16381, -10130, 188669, -34901, 84497, 473988, 284361, 421075, 233330, 397196, 220671, 193180, 362021, 120479, -18960, 285010, 258395, 265901, 253431, 57129, 43326, 13517, 232322, 168693, 19393, -100518, 304606, 188754, -124808, 297058, 224219, 254188, 69310, 490957, 232496, 43563, 204014]
13292B04014n1307N5439n8411a66400A55409b58291g0555C08440b0627A54144
13281A61108c5507A07430K28315A20904J07070b4923D76316A27452d0044A42420
13270A87783J15378C2691J56646o2749D6276J33441a32247m5505A50389J67044
13260C17433B4666M1252k09J1878J7717c6475A79071n7880J15215K52067B29351
13248c05210B79687M5304B1060R3554d4885j89662B96665m4994a05619G0655d4800
13236B62084b723C61041H5217a69089D82329i0412c8688C77499A88561a03224
13225B98670D0056J07957A6727M565i0832c395D9467K06687r3919a738j6876k09399
13213b28013C17998A09633L83489c76991d9552B87418q8712B8179O00709d6915
$$ y = [204014, 152707, 208146, 149735, -166400, 155409, -258291, -70555, 308440, -20627, 154144, 161108, -35507, 107430, 335745, 120904, 227974, -24923, 476316, 127452, -40044, 142420, 187783, 303161, 32691, 189337, 126588, 46276, 179717, -132247, -177752, 150389, 317433, 24666, 65918, 65709, 77587, 95304, -36475, 179071, 121191, 236406, 488473, 229351, -305210, 279687, 324991, 21060, 114614, -44885, -234547, 296665, 251671, -105619, 70655, -44800, 262084, -2723, 361041, 85217, -169089, 482329, -90412, -38688, 377499, 188561, -103224, 298670, 40056, 148013, 16727, 21292, -90832, -3395, 49467, 256154, 162235, -1738, -18614, -228013, 317998, 109633, 493122, -376991, -49552, 287418, 198706, 28179, 628888, -46915]
13202A80115M9845r9898D6377a91927f2599A4733L4325a77362A15359h8589j25145
13191b13734F8263R5130n1608P8466D6359a49085H9938J98777I3858N8129K7050
13180A79037c6262A96109l2659B5965J82269O6504j15985m0725f1409E3883Q1619
13169A35502J33682E5712K15272b08148B2960J98052r3349E2195K09530E3296
13158g6913H9342M2312J92335C8173J4027K13Q939K12531a9649A46484m1294e263
13145B87688j06712E2210R1268g6104q0190a9887Q893j19115K2505G5699d1741
13133a00627C3495J02676E5153b0938k3117j50215A67978E8420a84509E34866
13122a64123E6592a15303c7655A21291A7954J40790a89396N5238D20488e54p3331
$$ y = [180115, 229960, 130062, 46377, -191927, -62599, 14733, 49058, -177362, 115359, -88589, -213734, 68263, 163393, 111785, 190251, 46359, -149085, 89938, 288715, 93858, 151987, 179037, -36262, 196109, 163450, 25965, 208234, 274738, 158753, 118028, -61409, 53883, 135502, 269184, 55712, 270984, -208148, 22960, 221012, 127663, 52195, 261725, 53296, -76913, 89342, 131654, 323989, 38173, 52200, 52413, 61352, 273883, -19649, 146484, 105190, -5263, 287688, 180976, 52210, 143478, -76104, -156294, -19887, -10994, -130109, -107604, 75699, -41741, -100627, 33495, 136171, 55153, -20938, -44055, -194270, 167978, 58420, -184509, 534866, -164123, 56592, -115303, -37655, 121291, 17954, 158744, -189396, -134158, 420488, -554, -73885]
13111g3885C24214O4242I8262N295a80242p1506B71486j30281K45148f2422B86289
13099B3448K95874A32751L00661j09351C9403b373k49670A91418f5112A72393
13088I8397K60500a49760A67733i1981H1861N7955J70731j15858a00364B52284
13077B81524J3161f6993A18104B635c25297C08275e7483A90829a38671O3069B19452
13065e7577A57967b1756H8149d3783A72637C9222a10046D60756H3879J02174c2696
13053C3913a17411D86571j94690b20788h3677B47461A02037J82455A39599J76171
13043C15770E8404c92060J6192d6399n3895M9468A23966K14097a94613F3983O3177
13032A27160j6132J33665B4734K70492q5539F2763e5431C011J19994R2946K0818
$$ y = [-73885, 324214, 388456, 98262, 103557, -180242, -251748, 271486, 141205, 386353, -62422, 286289, 23448, 319322, 132751, 433412, 324061, 39403, -2373, -252043, 191418, -65112, 172393, 98397, 358897, -149760, 167733, -91981, 81861, 139816, 310547, 194689, -100364, 252284, 281524, 294685, -66993, 118104, 2635, -325297, 308275, -57483, 190829, -138671, -75602, 219452, -57577, 157967, -21756, 88149, -43783, 172637, 39222, -110046, 460756, 83879, 186053, -32696, 33913, -117411, 486571, 291881, -220788, -83677, 247461, 102037, 284492, 139599, 315770, 58404, -392060, -375868, -46399, -100294, -50826, 123966, 338063, -194613, 63983, 127160, 111028, 244693, 24734, 295226, 209687, 62763, -55431, 3011, 123005, 215951, 236769]
13021B36769o6693E2278e4774A49306Q0989H4988J04906l2256K16583a06047A89943
13009B29710o3158l6404O4372E4848K82644R5159A01996J99502l8173J41829j91212
12998B13942a363A07952R7896K06539j90465k9565E8515M831O1552K0527p1536
12987G3889J75475H7308J14509j5120R0849A17385l772b54778I4705e3567E6727
12975a95233A1099a24503e4263F1653P8341M1274a82326N1593A3784K79186d5672
12963A26764f4176D2680b318l2447J5678C15172E0087J0312L2876e3323j26228
12952a79551A66432k1699A0553a53389c5082B9074K40545b50849A21248a531I1970
12940D40012F5325i3727A97533n1841f5297K1480A33930N4202l002a38928L2066
$$ y = [236769, 170076, 52278, -54774, 149306, 230295, 84988, 189894, 157638, 374221, -106047, 189943, 229710, 166552, 130148, 194520, 54848, 337492, 432651, 101996, 301498, 263325, 405154, 213942, -1363, 107952, 205848, 412387, 221922, 192357, 58515, 63346, 124898, 145425, 73889, 249364, 87308, 201817, 186697, 277546, 117385, 113613, -254778, 94705, -53567, 56727, -195233, 11099, -124503, -54263, 61653, 139994, 181268, -182326, -130733, 13784, 292970, -45672, 126764, -64176, 42680, -2318, -34765, -19087, 315172, 50087, 60399, 93275, -53323, -179551, 166432, 144733, 10553, -153389, -35082, 29074, 269619, -250849, 121248, -1531, 91970, 440012, 65325, -93727, 197533, 145692, -65297, -43817, 133930, 188132, 185130, -138928, -106862]
12929a06862j43921N1117A09592a21289e4809B03520m9866J60472a3556D4572
12918C47858a39961A22562a54230G7689K48146A53895J59582m8025e1353B01130
12907b778D25567B09228a62221A81434J71476d0118A62301K39651a68608H0692
12896a15764B47598a43269D2474Q98K49303d4487B42193a52749f2893A09145o465
12885A02680G427a04188A00021b50190A10238D5432J98811J12151h5768F254K16581
12874B22835f490B03009m1766a14280A22570k5085D8696r094f4460D014e16166
12862g2223A01937b60978C6193K10572B470J29645K88692j80661O5636i980n437
12851a5417B26750r2994P154E7166J07709J76167H6120K03839p8187l2088o3678
$$ y = [-106862, -250783, -199666, 109592, -121289, -54809, 203520, 153654, 314126, -13556, 44572, 347858, -139961, 122562, -154230, 77689, 325835, 153895, 313477, 265452, -51353, 201130, -2778, 425567, 209228, -162221, 181434, 352910, -40118, 162301, 401952, -168608, 80692, -115764, 247598, -143269, 42474, 43372, 292675, -44487, 242193, -152749, -62893, 109145, 102680, 7427, -104188, 100021, -250190, 110238, 45432, 244243, 356394, -85768, 6254, 222835, -6490, 203009, 161243, -114280, 122570, 97485, 48696, 39602, -64460, 4014, -516166, -72223, 101937, -260978, 36193, 246765, 2470, 132115, 420807, 240146, 305782, -9980, -15417, 226750, 133756, 140910, 57166, 164875, 341042, 86120, 289959, 211772, 179684, 116006]
12840A16006G715A144K0366K05186m5196a20950M4754j0293k4662A06676N036
12829A11712D1213J02411a41988k80392A76718C3200R7684J53603A14776M0519
12819A55295i4406A13771d2689j24273L5052B29334b7435l2198C6523g1279B46988
12807A4753e5596A50724C9367e0694A35623h4703j63752R5592p153a7992j87279
12796b05271H0647J7264b9148F7241a81302E60819A83833m1948l723K8437A2563
12784d0739A51136h1708C3861a92856B22694b11063A83715b06424g2893n4917
12774a27810B8977K3329f4918a4782k7823A43295a52040A43406l9707a58676p3803
12763b32479P9221j5087O9325l2573j22839A76759Q4383I718J15577J641a05719
$$ y = [116006, 7715, 1144, 21510, 226696, 181500, -120950, -76196, -86489, -111151, 106676, 111712, 41213, 143624, -141988, -422380, 176718, 33200, 130884, 284487, 114776, 155295, -94406, 113771, -42689, -166962, -131910, 229334, -27435, -59633, 36523, -71279, 246988, 14753, -55596, 150724, 39367, -50694, 135623, -84703, -248455, -152863, -160016, -17992, -205271, 80647, 97911, -29148, 67241, -181302, 560819, 183833, 141885, 138162, 166599, 12563, -40739, 151136, -81708, 33861, -192856, 222694, -211063, 183715, -206424, -72893, -127810, 28977, 52306, -64918, -14782, -42605, 143295, -152040, 143406, 103699, -158676, -232479, -153258, -168345, -99020, -131593, -254432, 176759, 261142, 9718, 125295, 126936, -105719]
12751B74214H417J27453J20276E6392b7405j52363H5547h8625H1734b7363C71759
12739b6631B71269E1897a99892A18679J24822J00265K37753a77306A4913c6477
12728b2119E5866a39135H6341P16J8059A3545a12318A58860b22159A84785a28250
12716B13241n8280J0017C9530d3357B36098F5419k3429B0059J81319J50629j21291
12705B30716n189a13940A78557J72289a04740A31962K8723a00648B87103Q9378
12695C76481J52079a364H9117M4667a00726k91140A64765O4020j7938l1493l5357
12684A43997k2213D2721f1154B50689i8172C16688A44650G1193b7143A90093n57
12673A89536j4317D2492J45849l5532G4719b88240C97479A14091J73993K7333
$$ y = [274214, 8417, 135870, 256146, 56392, -27405, -179768, 85547, -88625, 81734, -27363, 371759, -26631, 271269, 51897, -199892, 118679, 243501, 343766, 581519, -177306, 14913, -36477, -22119, 55866, -139135, 86341, 87057, 105116, 13545, -112318, 158860, -222159, 184785, -128250, 213241, 154961, 164978, 39530, -43357, 236098, 65419, 41990, 20059, 201378, 352007, 230716, 225527, -113940, 178557, 350846, -104740, 131962, 160685, -100648, 287103, 376481, 528560, -1364, 89117, 133784, -100726, -391866, 164765, 228785, 210847, 179354, 143997, 121784, 42721, -61154, 250689, -98172, 316688, 144650, 71193, -27143, 190093, 189536, 175219, 42492, 188341, 152809, 74719, -288240, 397479, 114091, 288084, 315417]
12663C15417A41928K33853j70717J7898H0975g1240H8534J8008K5644g7752n1797
12652a29549B38302i2919I0484N0043J09132C1017h1335A41271f8026C1814K95586
12641C27400b96835f5353f22B94019j20766c1785A35671J1802i3966C50822J85161
12630E35983k35402j24061K39847B01129K80066A03002b16885C183J82750e2818
12619A66749I46d2768A91349a46899A85133G9178J84665E5385A5369J55988f3710
12607C4365J80522b42127A69877l3580c98681A17828R5282J2012r6763J97101
12597C25460n5506n4555n5317a28124D1109K87412M3122G4055g6802j67975E1239
12585D1042J57288H6676a31598o5900A37963a34156A37516a52390B92839a862
$$ y = [315417, 141928, 375781, 205064, 222962, 80975, -71240, 88534, 106542, 132186, -77752, -129549, 238302, -92919, 90484, 140527, 249659, 31017, -81335, 141271, -68026, 31814, 327400, -296835, -65353, -622, 294019, 173253, -31785, 135671, 147473, -93966, 350822, 535983, 300581, 176520, 416367, 201129, 481195, 103002, -216885, 3183, 185933, -52818, 166749, 946, -42768, 191349, -146899, 185133, 79178, 263843, 55385, 15369, 171357, -63710, 34365, 214887, -242127, 169877, 136297, -398681, 117828, 213110, 225122, 128359, 325460, 269954, 215399, 160082, -128124, 41109, 328521, 371643, 74055, -76802, -244777, 51239, 41042, 198330, 86676, -131598, -197498, 137963, -134156, 137516, -152390, 292839, -1862]
12574D0883N9923a04202G3085i0352A78287L13597b7372f034r3305A68922E628
12562a58294L6970M5915l22462a66041M3712e1082a4860l31501a096B6601h6105
12550b78570a00135B1028L94495F135K05434b23722A79213P1959b7078A47505
12539b60505A63482b92578A02645C6584i4616l62220D5906f8240n617o8502r7772
12528b40131j96994B56322l4670A04588p175C3020J58348c13309C61838a40114
12517d0324A0357c06743a28246B10603b8083A06879d2244D51506e8211B7005r19
12506B6086a37768G8895K56871b44105e8551l8875C39106a01354B42626b41275
12495g6735p9406B12902l6548a25495e2467C06708k9857a61741H5896N9591a00008
$$ y = [40883, 100806, -104202, 73085, -90352, 178287, 491884, -27372, -6034, -99339, 168922, 5628, -158294, -121324, -75409, -397871, -166041, -122329, -51082, -14860, -346361, -1096, 26601, -86105, -278570, -100135, 21028, 415523, 6135, 211569, -223722, 179213, 251172, -27078, 147505, -260505, 163482, -292578, 102645, 36584, -94616, -456836, 45906, -68240, -73857, -142359, -240131, -437125, 256322, 221652, 104588, 97413, 33020, 191368, -313309, 361838, -140114, -40324, 10357, -306743, -128246, 210603, -28083, 106879, -42244, 451506, -58211, 27005, 26086, -137768, 78895, 335766, -244105, -58551, -97426, 339106, -101354, 242626, -241275, -76735, -156141, 212902, 176354, -125495, -52467, 306708, 276851, -161741, 85896, 145487, -100008]
12483A37271C0174J7713K48859j12127R1890A15472J17540e3013m8156c0473r0855
12472a21328j147D2750K06746q209J58739a83877K5603O441F4287K95249G3521
12460A80325C8106a43287A99959c43993a42879A23520d7024k8884F2821O6412
12450A29233R1316a84288A72282M9766G0396j0708f7573A59204g4722A03372d6544
12438C7848g191B75975m7507r7887E4222O7735j445b95403J10880P3741A1373
12426a63012G2089O0079f5097A16118b27457F5172l1589f5630A660c8528A2549
12414d07815A09133d0641A96345j5867k7590b6981A14567b0424j97226e4434l4690
12403h9124n1701n5909A31338n2909l4835e869B64367G5647b18936H4326a51025
$$ y = [137271, 30174, 47887, 296746, 184619, 276509, 115472, 233012, -53013, -101169, -30473, -121328, -122475, 42750, 249496, 241287, 400026, -183877, -158274, -151833, 64287, 359536, 73521, 180325, 38106, -143287, 199959, -343993, -142879, 123520, -47024, -75908, 62821, 129233, 220549, -184288, 172282, 222048, 70396, 59688, -67573, 159204, -74722, 103372, -46544, 37848, -7191, 275975, 228468, 130581, 54222, 121957, 120512, -295403, -184523, -110782, 11373, -163012, 72089, 132168, -65097, 116118, -227457, 65172, 33583, -65630, 1660, -38528, 12549, -407815, 109133, -40641, 196345, 180478, 152888, -26981, 114567, -20424, -217650, -54434, -89124, -140825, -196734, 131338, 78429, 43594, -5869, 264367, 75647, -218936, 84326, -151025]
12391d9471A90812b53861a0490C13564N5235o7403n717r125a02942d0192A30507
12379D1597K94364G3439A479f7699e118j42670q1423A66321i7719N505A31825
12367E0800p404b8404r292K997H4027a87652A70711c6720j3726J7750B83799a03750
12354E822c63089B23125j07742a00236j18481g2537B57785a8466B3924a57268
12343f9585A83299a44583O8772j78334B29737b30509a07364B93343J70122A320
12332F3168O3723j4515N9121J10746a31566b2420C59159b40310A13268c49162
12321a23320k03347E800J37783g2126E42835a9126l3247k9845A5182a24574b616
12309A01219L88318j03183d7319F9363a12956A23207g7528E8239b27864O0655
$$ y = [-49471, 190812, -253861, -10490, 313564, 368799, 301396, 295679, 286554, -102942, -40192, 130507, 41597, 335961, 73439, 1479, -67699, -5118, -147788, -229211, 166321, -97719, -92214, 131825, 50800, 43396, -28404, -37696, -34699, 84027, -187652, 170711, -36720, -50446, -32696, 283799, -103750, 5822, -363089, 223125, 115383, -100236, -218717, -72537, 257785, -18466, 23924, -157268, -69585, 183299, -144583, -75811, -254145, 229737, -230509, -107364, 293343, 463465, 1320, 63168, 126891, 112376, 171497, 282243, -131566, -22420, 359159, -240310, 113268, -349162, -123320, -326667, 5800, 143583, -72126, 542835, -19126, -52373, -82218, 15182, -124574, -2616, 101219, 489537, 386354, -47319, 69363, -112956, 123207, -77528, 58239, -227864, -167209]
12299a67209N7423f181A24187L5075J85493i7994L8954A54759a34160A54369J24460
12288B78829E2804c18484J05246J00337A65935g1371l851G4401a0492A30659c8073
12276a18399M8214C90192A15438f5638j29100M3000j26129a08639p6551Q7871
12266i7319A93928l9916J3946d9A72051a44523E3208K1140J38626E7750a94378
12254A17810e2227k73744e9759C30282P6635A04282J92642b50101B78848j29517
12244A49331a9336B20505l2603o7497a17549k31358C2642J13694J86179d5737
12233a3322A50410Q6861m0438b2701A41950f0541p1088f3687A15449R8997L4870
12222B49316K96298c7690l5429E06418o2910d2992H1697L41565C5547d1521A30030
$$ y = [-167209, -109786, -6181, 124187, 159262, 344755, -97994, -59040, 154759, -134160, 154369, 278829, 52804, -318484, -213238, -112901, 165935, -71371, -75222, 74401, -10492, 130659, -38073, -118399, -70185, 390192, 115438, -65638, -194738, -151738, -277867, -108639, -185190, -97319, 193928, 154012, 167958, -49, 172051, -144523, 53208, 74348, 212974, 57750, -194378, 117810, -52227, -325971, -59759, 330282, 406917, 104282, 296924, -250101, 278848, 149331, -19336, 220505, 187902, 120405, -117549, -348907, 32642, 146336, 332515, -45737, -13322, 150410, 237271, 196833, -22701, 141950, -60541, -131629, -63687, 115449, 214446, 249316, 545614, -37690, -73119, 506418, 443508, -42992, 81697, 423262, 35547, -41521, 130030]
12210f590j90636g3509E6187G420K70316k87A13234O8524a09115D25494a9867
12198I5486K62396A05812d3032B83723j17401a84305A23234J43803H8436D038
12187a00202K509A89299b7470C52157D5664J22965j8674h614D8563a23637H1102
12175F2515J14542h0617A15654J00412K0238j05643l5954B8732J47176a15473
12164C98953d7269b757p1715K3789i000k64040A16358L08870A8591J29637E5331
12152H5004e0882j55312g2131K7245A67049d3281o3434B68989a3766A46807b63216
12140a41822C2976i3882K1672A49187a74943e82p0640E6781J08940a18078A56582
12128D111f8364c2963C02580J3405j20700h7868k10316B5888i0954n6957M7594
$$ y = [-6590, -197226, -73509, 56187, 7420, 277736, 277449, 113234, 181758, -109115, 425494, -19867, 95486, 357882, 105812, -43032, 283723, 166322, -184305, 123234, 267037, 88436, 4038, -100202, -97693, 189299, -27470, 352157, 45664, 168629, 149955, -8614, 48563, -123637, 81102, 62515, 177057, -80617, 115654, 216066, 236304, 130661, 94707, 28732, 175908, -115473, 398953, -47269, -2757, -74472, -50683, -9000, -273040, 116358, 425228, 18591, 148228, 55331, 85004, -50882, -206194, -72131, -44886, 167049, -43281, -106715, 268989, -13766, 146807, -263216, -141822, 32976, -93882, -72210, 149187, -174943, -582, -71222, 56781, 165721, -118078, 156582, 4111, -68364, -32963, 302580, 315985, 195285, -87868, -298184, 25888, -90954, -147911, -100317]
12117a00317L501B51021j07984c82723C64673A35691L1569g4606m9114A40703
12106a99256G7788K3984j0890B1267a54422C25429A02257a78345d7840A83647
12095e3467r2194j68891B09688f3666b3422j78973B9286a68798H8339B4504b77927
12083C0950r324J58715a27290D9745P3426k1518L16391A48880a55905l3793f4096
12071h1982A27853c9668j65755B01147o9979a57973j22941b0990C5114d8269A38350
12059b5529b94A59467e2712A37555N2891E8618J95273B7513J14075a99267P2283
12048a26984m1147A7926J4184J28333G3556j8761b49930A5731c22029A89634a75376
12036B44718a42682A6327J41611a34027A18410c8282B54777b03689d0757C4790
$$ y = [-100317, -96816, 251021, 143037, -382723, 364673, 135691, 167260, -74606, -123720, 140703, -199256, 77788, 101772, 90882, 21267, -154422, 325429, 102257, -178345, -47840, 183647, -53467, -145661, -314552, 209688, -63666, -23422, -202395, 29286, -168798, 88339, 24504, -277927, 30950, 21626, 180341, -127290, 49745, 123171, 101653, 418044, 148880, -155905, -189698, -64096, -81982, 127853, -39668, -205423, 201147, 131168, -157973, -280914, -20990, 35114, -48269, 138350, -25529, -294, 159467, -52712, 137555, 190446, 58618, 253891, 27513, 141588, -199267, -126984, -168131, 17926, 32110, 160443, 73556, 54795, -249930, 15731, -322029, 189634, -175376, 244718, -142682, 16327, 157938, -134027, 118410, -38282, 254777, -203689, -40757, 34790]
12025c09337A76930L74655L37128j28754B25231o2420f0176A54125a29794B43481
12014I3567a87776d904j18067B19572p4740f6387a4702G404a15838j31011B00412
12002b12057E0304O788f249A62412M8919i3431k16490h8281F554d0060j96541
11991b36601K6143F4021b93360f9012L0328j09479L2471K1692A79878a02082m13209
11980e15291B03739C8717L36804F9001k4101L14007c8268k67876A89744o1559
11970A28185g8199K5653j04548N288B96208a75741F4406N3573J39012C5428i974
11958F4653f7066A63892l7949b17913B15097g6260I3150h1174A05094g118C5117
11946B30571e868o7319B45160a72740f0813A98533a81024B89946a47242A36085
$$ y = [-309337, 176930, 551585, 888713, 759959, 225231, 162811, -60176, 154125, -129794, 243481, 93567, -187776, -4904, -122971, 219572, 144832, -66387, -14702, 7404, -115838, -246849, 200412, -212057, 50304, 57092, -6249, 162412, 211331, -93431, -309921, -88281, 6554, -40060, -236601, -210458, 64021, -293360, -69012, -38684, -148163, -115692, -94000, 179878, -102082, -515291, 203739, 38717, 375521, 69001, 44900, 358907, -38268, -306144, 189744, 128185, -78199, -52546, -157094, -151806, 296208, -175741, 64406, 117979, 256991, 35428, -9974, 64653, -67066, 163892, 125943, -217913, 215097, -76260, 93150, -81174, 105094, -7118, 35117, 230571, -5868, -73187, 245160, -172740, -60813, 198533, -181024, 289946, -147242, 136085]
11935A57736o6825C8836b55310a9271C29020j64375m6448b7925A56373E92a36561
11923A54834b58241A14800j8195g1738J7374l0959l7107j21266C6854A3667b45970
11911i1451p1784A08964E1248J49196a89468b7050A57503p2814b78832A82585
11900A82489q4270K44345e7806o1435c7055k18686E5467d15418E9183a92571B1632
11888I6591J5251a56073c3222j56325A32808f4164k6817r2210h0380B8024K12818
11877B40842o5361J15799j30511N9139b93188n9467E9617b25148P5062P396B92793
11865f3103C5021a35815A01027R0760l7595a2708I6331f1390A64657f8643k3910
11854i2553h260n7164A36583n7545g3875B7791J59608n7320n8905J87564g503
$$ y = [157736, 90911, 38836, -255310, -19271, 329020, 164645, 118197, -27925, 156373, 592, -136561, 154834, -258241, 114800, 96605, -71738, -54364, -85323, -122430, -243696, 36854, 13667, -245970, -91451, -163235, 108964, 51248, 200444, -189468, -27050, 157503, 84689, -278832, 182585, 182489, 98219, 342564, -57806, -119241, -37055, -255741, 55467, -415418, 59183, -192571, 21632, 96591, 111842, -156073, -33222, -189547, 132808, -64164, -90981, -183191, -80380, 28024, 240842, 175481, 291280, 160769, 219908, -293188, -352655, 59617, -225148, -150086, -142690, 292793, -63103, 35021, -135815, 101027, 191787, 154192, -12708, 96331, -61390, 164657, -68643, -92553, -8260, -65424, 136583, 79038, -73875, 27791, 187399, 130079, 71174, 258738, -7503]
11842B55186a6469A53000L4712a59618A15375b0170j32357A1747g6492n2464q016
11831a36972H4544d37908b4370p9011k17404N3432B37257B8603n002d8730l16008
11820c64738H1622P6216g7846D05135G1513P3374J0771F8342K71519h4898L7821
11809d7077A66429O1105c13341N0503K4359j71459C7638g0910j93235A23820e0634
11797B2911a73941j92360e7565r9193B10673a50792G9638g3526K0943m252j26181
11786a83016A02871R8265e9134p7273B43271R8973r7552H4815i0875G1583b57052
11774e9592a6206k50381O5792F6912b15919I049c85624A76187b8787j00257c0259
11762e6043r3991C04490A18405k0831f0027A80761D485a28461j51123e2780n6061
$$ y = [255186, -16469, 153000, 187712, -159618, 115375, -20170, -152527, 11747, -76492, -128956, -136972, 84544, -437908, -24370, -103381, -320785, -267353, 237257, 28603, 23601, -48730, -364738, 81622, 157838, -77846, 405135, 71513, 144887, 155658, 68342, 339861, -84898, -47077, 166429, 227534, -313341, -262838, -238479, -409938, 37638, -70910, -264145, 123820, -50634, 22911, -173941, -366301, -57565, -156758, 210673, -150792, 79638, -73526, -52583, -56835, -183016, 102871, 201136, -59134, -136407, 243271, 342244, 244692, 84815, -90875, 71583, -257052, -59592, -16206, -266587, -200795, 66912, -215919, 9049, -385624, 176187, -28787, -129044, -30259, -56043, -150034, 304490, 118405, 97574, -60027, 180761, 4485, -128461, -279584, -52780, -108841]
11751a08841G136K4093J15086G2989a67231A87636a34323D4945b48527B00528
11740h1010b2036q5431m9301B47604I0271a87871F7586J4026b3782B48395a0251
11728A84081c20046H9018M1058i363j81913h4726j67455h892l78595K4563A20909
11716b88120A22315m8313K59045D5545f2712l5731B1795M78301j38101j20545
11706B41450C1765c1050A62802K22455j24075A11299L13769j65580b75816c243
11695a3734n2250A04283J39945H6795J44414c52255J18474A15196D6483a1130
11684A45230a61986G8007b7105m3949A77223k0913j0278a33163j18101A95688
11673H2384A9996B320b13102n3728B81922a2011j64903a0532m8444K3566J729
$$ y = [-108841, 7136, 31229, 146315, 72989, -167231, 187636, -134323, 44945, -248527, 200528, -81010, -22036, -107467, -156768, 247604, 90271, -187871, 67586, 81612, -23782, 248395, -10251, 184081, -320046, 89018, 130076, -9363, -191276, -84726, -252181, -8892, -387487, -362924, 120909, -288120, 122315, 74002, 333047, 45545, -62712, -98443, 21795, 500096, 361995, 241450, 31765, -31050, 162802, 385257, 261182, 111299, 425068, 259488, -275816, -3243, -13734, -65984, 104283, 244228, 86795, 231209, -352255, -233781, 115196, 46483, -11130, 145230, -161986, 78007, -27105, -71054, 177223, 156310, 146032, -133163, -251264, 195688, 82384, 19996, 2320, -213102, -266830, 281922, -12011, -176914, -10532, -58976, -35410, -33681]
11662c3681A07722J36862p3558j7959B0405O5649J14311q3784m5033d576B22198
11650C944J41468b40390B01597o9248h239l18015a59779r335A64860o9193c52090
11638c95158B11085h9498A53347d4370A38126J0388e3576A89580e4354A85125
11627C5219M2541K04858a87518A30372h2641C41334A28647N7009N4999c395B8878
11615C7450K63999m8285c261m1708k7476A15027i2946B65584e6980B42616a14473
11603a63020J1725A60186J74040H5951e2315H9364C8420a50671P555f0721B82636
11591I5819b52390C27145E2333N1807K27869a39285B93310E7612L69133A24078
11580e2620G2387a11189A88725K88678g1408p1461B79175G8900g6877d182n2941
$$ y = [-33681, 107722, 244584, 171026, 153067, 20405, 86054, 200365, 116581, 71548, -4576, 222198, 3944, 145412, -240390, 201597, 132349, -8239, -326254, -159779, -169114, 164860, 95667, -352090, -395158, 211085, -89498, 153347, -44370, 138126, 148514, -53576, 189580, -54354, 185125, 35219, 77760, 282618, -187518, 130372, -82641, 341334, 128647, 185656, 240655, -3395, 28878, 37450, 301449, 253164, -3261, -44969, -72445, 115027, -92946, 265584, -56980, 242616, -114473, -163020, -151295, 160186, 334226, 85951, -52315, 89364, 38420, -150671, -143116, -60721, 282636, 95819, -252390, 327145, 52333, 104140, 332009, -139285, 293310, 57612, 426745, 124078, -52620, 72387, -111189, 188725, 477403, -71408, -142869, 279175, 78900, -76877, -4182, -57123]
11569e7123E9482Q8274a25719A20641a02350H5174k7792k0311A5576M0302J95785
11558B51663G3977a64752d4450B5386J77460a95721P7330m9003K4109O7795j93590
11547b69080a13167A67262j8198M4265H8887h2607B56465E983M42907h5347K2101
11536f3246B80415J29772g7413B84495A5680J66221J35530a76002D5535J11497
11526A57032l1819I737f8642l904l9955B83306j06547m437p1284j3763a26438
11514a15793A90812a37118j3395A99640J51037a32244B07648b2675A73969n6538
11504A17431g2556n0176F2640R631R5132a9602I6972l7387L15092e1931B93847
11492A49359j4335J08945m8524f9660b9207k45939B03828j85b6869A53775o5674
$$ y = [-57123, 59482, 147756, -125719, 120641, -102350, 85174, 57382, 37071, 15576, 55878, 251663, 73977, -164752, -44450, 25386, 202846, -195721, -118391, -167394, -143285, -75490, -269080, -113167, 167262, 149064, 193329, 88887, -82607, 256465, 5983, 448890, -85347, -63246, 280415, 410187, -77413, 284495, 15680, 181901, 317431, -176002, 45535, 157032, 125213, 9737, -68642, -72546, -112501, 283306, 176759, 172322, 101038, 87275, -126438, -115793, 190812, -137118, -150513, 199640, 350677, -132244, 207648, -22675, 173969, 117431, -72556, -122732, 62640, 72271, 167403, -19602, 96972, 59585, 374677, -51931, 293847, 149359, 135024, 243969, 195445, -69660, -29207, -275146, 203828, 203643, -26869, 153775, 88101]
11481H8101J39782a36369B13006F1912L03620e4104a9777A2422P6693D122P6150
11470H0272J99698E0580a31664c9541B34115g8940A30503M1631b75201B4470J36104
11459A60574b06825A71283m9668J33922E2284R8991a88184A4479P5434K16953
11449C06866j37647G1924b5806B41034c17535a3389C2097L3023L59212A99346
11438B05757E9199K34952J07443j44971g6326B28395F0545c23724f2177a8025
11427a09460B0141c007j23098O0726A40707d64337A65560C9415J52923b76448
11416F2011B7290a78322a4181k22467R7386d236B428a32167e819j98081B19302
11404G7255g9325j5129B83699j27935a51073A16983a1221p8712F1472K90234j68751
$$ y = [88101, 227883, -136369, 213006, 61912, 365532, -54104, -19777, 12422, 89115, 4122, 80272, 279970, 50580, -131664, -39541, 234115, -78940, 130503, 172134, -275201, 24470, 160574, -206825, 171283, 121615, 255537, 52284, 151275, -188184, 14479, 89913, 306866, 169219, 71924, -25806, 241034, -317535, -13389, 32097, 65120, 424332, 199346, 205757, 59199, 294151, 401594, 256623, -76326, 228395, 60545, -323724, -62177, -18025, -109460, 20141, -3007, -126105, -65379, 140707, -464337, 165560, 39415, 192338, -276448, 62011, 27290, -178322, -14181, -236648, -139262, -4236, 2428, -132167, -5819, -203900, 219302, 77255, -79325, -94454, 283699, 155764, -151073, 116983, -11221, -89933, 61472, 351706, 182955]
11393A82955d4644A11041o206a22341H5308a24161C4233a48077I4507A0595d6430
11381B77754q0493b3840l01489A46806j5669a84157R0859E8899h8858A5586a40404
11369A77043b9731j7340A5005O2913i0974r2392L6563e1095A10889a68918B87534
11357A74923b28170e7835r3325l4561A00520N6567d29842A99249H4322J42866
11347B27188A11545j6499f8761H7917a88621P8078C7966O594K38388C8266e4495
11335G2492Q0694d28781J60769A78396i4485J2893j0583A97997C9325L3230b08368
11323c8012n0659F402h3556I0489c13328l8721j7914F2845K23909a84712A31178
11311a341m4961A48167E8129J18232g2166j20109q1779j9198o3770K3615a6172
$$ y = [182955, -44644, 111041, 104835, -122341, 85308, -124161, 34233, -148077, 94507, 10595, -46430, 277754, 197261, -23840, -325329, 146806, 131137, -184157, -93298, 58899, -88858, 15586, -140404, 177043, -29731, -47071, 15005, 77918, -90974, -183366, -146803, -51095, 110889, -168918, 287534, 174923, -228170, -57835, -151160, -185721, 100520, 157087, -429842, 199249, 84322, 227188, 111545, 95046, -68761, 87917, -188621, -110543, 37966, 44560, 282948, 38266, -54495, 72492, 153186, -428781, -268012, 178396, -94485, -81592, -92175, 197997, 39325, 72555, -208368, -38012, -88671, 6402, -83556, 90489, -313328, -352049, -369963, 62845, 286754, -184712, 131178, -1341, -46302, 148167, 58129, 176361, -72166, -192275, -274054, -293252, -357022, -333407, -16172]
11299D643O3460k7118d1533p9485B17784b1254G3318d47708a28904m7871J5820
11288a60955l6342N1973H6683b16218j75814A5640N7648a780q4938j5842B05993
11276c58852a70090B3070N558a02023C2718d30563P8340B80144b7209G0682b0324
11264e5695j44986B3095a00075l4730p0132E5182O6062m5411k3643e7610j33254
11253a90864d8773H4217J94061K27395b47504i2003J8742j79528J25158A45930
11242A55g5740A08379O6542a1329k6732n1388A56705b24007A52930J5650b00575
11230a52187f9747D2570j8061K6140f0747j51625f7315l775B32251K8087c5962
11218b00457A45158g459D6137b47591E5943K2447b19512i5656j88854J00446E7487
$$ y = [4643, 68103, 40985, -41533, -121018, 217784, -21254, 73318, -447708, -128904, -176775, -160955, -197297, -145324, 86683, -216218, -392032, 15640, 73288, -1780, -86718, -102560, 205993, -358852, -170090, 23070, 28628, -102023, 32718, -430563, -352223, 280144, -27209, 70682, -20324, -55695, -200681, 23095, -100075, -134805, -204937, 55182, 121244, 75833, 52190, -57610, -190864, -48773, 84217, 278278, 505673, -247504, -92003, -73261, -252789, -127631, 145930, 155, -75740, 108379, 174921, -11329, -38061, -89449, 156705, -224007, 152930, 168580, -200575, -152187, -69747, 42570, 24509, 50649, -60747, -212372, -67315, -71090, 232251, 260338, -35962, -200457, 145158, -7459, 46137, -247591, 55943, 78390, -219512, -95656, -284510, -184064, 57487]
11206H3711b61345a8700j94109A3015N8595a58354K4469d73j21243c5568j470
11195c7038l5913i911A53592G4313j1030a13791G2013b96536O2603c8576j56983
11184a95559Q5057l12443a90430Q9328K3225q767j79105f1322j466j38464J3783
11173a87469p4891C189J1043c63769J20164j05873a33792A95175a91378C21604
11162D66929I2557h8113a6443j3353J3342D9896A9200d17825B3781Q2802a42726
11150c56009B69724L5660a5619A07272m8945K05202C4154J16817d4009r0033m2304
11139a76346k5374N2112C2159J57991m2000a49545A02554K3599O773m7179K05091
11128B90838k7976o3441e724o096C23769a38337A74894G8770O8167F1337a53443
$$ y = [83711, -261345, -18700, -212809, 13015, 71610, -158354, -133885, -473, -121716, -35568, -37038, -72951, -9911, 153592, 74313, 63283, -113791, 72013, -296536, -233933, -38576, -195559, -110502, -422945, -190430, -101102, -77877, -86644, -265749, -61322, -62788, -201252, -187469, -262360, 3189, 14232, -363769, -243605, -349478, -133792, 195175, -191378, 321604, 466929, 92557, -88113, -16443, -29796, -16454, 49896, 19200, -417825, 23781, 106583, -142726, -356009, 269724, 305384, -15619, 107272, 58327, 263529, 34154, 150971, -44009, -134042, -176346, -201720, -149608, 32159, 190150, 148150, -149545, 102554, 126153, 132926, 85747, 290838, 262862, 199421, -5724, -11820, 323769, -138337, 174894, 78770, 146937, 61337, -153443]
11116a18501C55203j10395K80351D2439d4357n8452F2743g8569p908G8431L12607
11105C91038A59200d1411A80401m4339l6016K9196b09060A09414K06884j45102
11095A71196J56627j63234D8651a96569A94648q5495c5283G0038J46611J7036
11085B33685b56492A74708o3103K42892A30497R0629H9428L57059A98277K73372
11075D71649d499C60159J00444B02310K51481j28619p9N7090N735p4190N312n3170
11063B65870J11333M8294R267J03075r2807J09053j146J0177K36164j25754j21313
11052E52213p4947J57387J9959J83374K67500l01674l00678L47315C66132o2007
11042C04125M01125l41827M94716P8467k53142m5588J95259k67296L7956L2826
$$ y = [-118501, 355203, 244808, 525159, 42439, -44357, -102809, 62743, -78569, -86477, 78431, 391038, 159200, -41411, 180401, 136062, 100046, 129242, -209060, 109414, 316298, 171196, 327823, 164589, 48651, -196569, 194648, 109153, -35283, 70038, 216649, 233685, -256492, 174708, 111605, 354497, 130497, 221126, 89428, 446487, 198277, 471649, -4499, 360159, 460603, 202310, 453791, 325172, 325093, 382183, 387918, 313728, 319040, 265870, 377203, 425497, 434764, 537839, 445032, 554085, 552939, 563116, 799280, 673526, 552213, 477266, 634653, 654612, 837986, 1105486, 803812, 503134, 850449, 366132, 304125, 705250, 363423, 858139, 936606, 683464, 637876, 833135, 565839, 603795, 636621]
11032F36621J98099k08948j1842B14476M64523J9932J75800l6244l01261L15251
11022H52477k82168P9388l22951L31742j41805J85326p7147k21099K75123j21327
11012E57559J14997k71568K71315C35759L33397R0681J41613k74501K50288m23582
11002D53655J25948J49449k2445r063k61116L13822k68255k20430L08918J12964
10992F83447J96502l48854K33956j50031J40868L11380l37988J46721q8513k70902
10982E16586M82055O9731K19264m8291L91322N7793J51037K65148K08490J83997
10972B497132J43780L00346M3640N6778M40131n81145n29283p9832j66890r7062
10962B027595l82188M5629p9540k44136L90941l94038J99351l50534j35135O3258
$$ y = [636621, 834720, 625772, 613930, 214476, 678999, 698931, 874731, 838487, 537226, 852477, 570309, 649697, 326746, 658488, 516683, 702009, 624862, 403763, 678886, 557559, 672556, 400988, 672303, 335759, 669156, 759837, 901450, 626949, 877237, 453655, 579603, 729052, 706607, 697544, 436428, 750250, 481995, 261565, 570483, 683447, 879949, 531095, 765051, 615020, 755888, 1067268, 729280, 876001, 787488, 516586, 998641, 1068372, 1287636, 1239345, 1630667, 1688460, 1839497, 2104645, 2313135, 2497132, 2640912, 2941258, 2984898, 3041676, 3481807, 2900662, 2371379, 2291547, 2124657, 2027595, 1645407, 1691036, 1611496, 1367360, 1758301, 1364263, 1563614, 1213080, 1077945, 1141203]
10952A141203m08762p5445j53389J74621k53528r4263j40371K03500j16401K09036
10942D86201j98316j06279n2587J12460n9059K44668k09950J5514J6599A15075
10931E8949K27352h3849G2249f4321p5060n5472B34936n0073C6280K38107b23722
10919A1656E441J53215R4751h8033q7192e9450j9995C1316K25061l0166a85870
10907a29357l5015A95180b65149i3151K6273G0181a46304d7659F2431c29452N9773
10896b69679d3265D5603N1762L1855a7378A36046b2772k8361k4805b5459k7831
10885e3290o1720F5441J7353d28766A89529b5734A97282d7574A54471J5704b38305
10873E5340J04273Q1322a54711B1286L6449Q3861d3806A6728K00149J73635b14992
$$ y = [1141203, 732441, 656996, 503607, 678228, 424700, 330437, 190066, 393566, 277165, 486201, 287885, 181606, 129019, 241479, 182420, 427088, 217138, 232652, 249251, 115075, 58949, 286301, -83849, 72249, -64321, -139381, -194853, 234936, 184863, 36280, 274387, -223722, 11656, 5441, 158656, 253407, -88033, -175225, -59450, -79445, 31316, 256377, 226211, -185870, -129357, -164372, 195180, -265149, -93151, -66878, 70181, -146304, -47659, 62431, -329452, -269679, -43265, 45603, 97365, 129220, -17378, 136046, -22772, -51133, -75938, -25459, -53290, -115010, 65441, 82794, -428766, 189529, -25734, 197282, -47574, 154471, 170175, -238305, 55340, 159613, 240935, -154711, 21286, 57735, 141596, -43806, 16728, 216877, 390512, -214992]
10861b13585E8904K97a10007j11303e1721j78878D3796J29917e5808J2887D4304
10849c639A692K00728b02855A10037A2230b17763B09639A0501L68553F3327b56827
10837a95325H2297A5226J38205c9019E5893J8356Q9952a872B84758p1572b82782
10825E2492b33892J04948a7297D2426a75198h1245C16924b68770A19800K15608
10815C35408H1935A310J45375d5470l79953c1855j01603m3695j0601A3531b7429
10803B9120A179R5453a33361n1810A05597a23850d4308l01875A8536c24808O3718
10792b61090a01464B29026c8803q2252e4159a6155n3451I8780b18732B0354K82240
10781C02594e26529f186q1085B6282P936b19921B01328o4325J15582q9242K27661
$$ y = [-213585, 58904, 59201, -110007, -221310, -51721, -230599, 43796, 173713, -55808, -42921, 44304, -3639, 1692, 202420, -202855, 110037, 12230, -217763, 209639, 10501, 379054, 63327, -256827, -195325, 82297, 15226, 153431, -39019, 55893, 74249, 164201, -1872, 284758, 213186, -282782, 52492, -233892, -128944, -17297, 42426, -175198, -81245, 316924, -268770, 119800, 335408, 81935, 1310, 146685, -45470, -425423, -31855, -133458, -177153, -187754, 13531, -27429, 29120, 1179, 96632, -133361, -185171, 105597, -123850, -44308, -346183, 18536, -324808, -261090, -101464, 229026, -38803, -121055, -54159, -16155, -69606, 98780, -218732, 20354, 302594, -526529, -6186, -87271, 26282, 34218, -219921, 201328, 137003, 252585, 163343, 391004]
10770C91004j26056A9100d0711m01456A84199a48689j92172E5746h1002j78252
10760b59254C4803a11622n8215P4397A82147a09936j48880A34795b79700F2901
10749f9044E4104N2109a23195H978c5005J2710n3185m5749A85565a79081j3984
10738a93065A00289c37361b4888A49918b51344a9479j8575j14539O6485o7832
10728a53940j40196I4745a8775m54012a98376O0909L1503J0212A71502q3525k7458
10717F0519K22407m0926b4802j22212F7744Q3191A5147a7387B91036G6499O0325
10706A36824b44373h0330B26983e4605I2106J13009r5767a96785C5232K9013a3301
10694a43718L5343k7278M7419B44926J2467r7465a67173k47637E4603K36426E4377
$$ y = [391004, 264948, 19100, -40711, -442167, 184199, -148689, -340861, 55746, -81002, -259254, 34803, -111622, -169837, -95440, 182147, -109936, -258816, 134795, -279700, 62901, -69044, 54104, 106213, -123195, 8978, -35005, -22295, -75480, -121229, 185565, -179081, -193065, 100289, -337361, -24888, 149918, -251344, -19479, -38054, -152593, -86108, -153940, -294136, 94745, -18775, -472787, -198376, -137467, -105964, -95752, 171502, 87977, 60519, 282926, 242000, -24802, -147014, 67744, 150935, 15147, -17387, 291036, 76499, 136824, -244373, -80330, 226983, -54605, 92106, 205115, 109348, -196785, 35232, 64245, -13301, -143718, -108375, -135653, -88234, 244926, 257393, 159928, -167173, -414810, 54603, 291029, 54377]
10682a43838B68497B0323N1031a35222j60745H918c8337j65624Q9140c3309l682
10671c6991B15588b46821f5778k4902j91595B96827d4791k3109a187G1961a48871
10659i7787r8156F8584K4560a79830e2634A53906c13424g3819A9009J2468h2843
10647a31397l4257b5199H7517A795a27578j09010m8893B19315c30142A04544R0957
10636A95501g4386A80633a08779k32087a16089j13120E4305b14560D39979i4700
10625b7981E9931h1793k208j23935B81740A39903a40939K0725j58726h1110j29873
10614b10983K9652C95106j78173a94504B08598J5530l5388d845j09137A08054
10603A80923k8523k5024f9093l7459j50035J05536k20127a03671j01646o5695
$$ y = [-143838, 268497, 20323, 71354, -135222, -295967, 8918, -38337, -203961, -114821, -33309, -36991, 215588, -246821, -65778, -90680, -282275, 296827, -44791, -67900, -1187, 71961, -148871, -97787, -195943, 68584, 93144, -179830, -52634, 153906, -313424, -73819, 19009, 31477, -82843, -131397, -165654, -25199, 87517, 1795, -127578, -236588, -285481, 219315, -330142, 104544, 195501, -74386, 180633, -108779, -340866, -116089, -229209, 54305, -214560, 439979, -94700, -27981, 59931, -81793, -84001, -207936, 281740, 139903, -140939, -120214, -278940, -81110, -210983, -181331, 395106, 216933, -194504, 208598, 224128, 188740, -4845, -113982, 108054, 180923, 152400, 127376, -69093, -106552, -256587, -151051, -371178, -103671, -205317, -271012]
10593b71012C799b43068e8140l82798a93819F9091d3698l68078b8453j36923g3544
10581d25630A3274b38055J05885K3452A49669a30602F3345g9344G0715c34130
10570C9591a0824k19321J105g5081J6931E30570e3384I3718B2759b71715a30783
10558C6522a97564H3507A1647N4541a27761n4257l9877g2774p3659Q610p9967
10547b17790h8603I2175a14507M3709A84446J47024A00283A9868a05014A36832
10536c21226b1987j93972F50844f369j7271k8307k99206b9964j16869M0827A28163
10524h4654I7245a25098N542A95596D9689b6778k75772g1822l6634B10554a50541
10512A58208h1321A02447a05515A8377K05216L4180a58131A20894j69g372q3608
$$ y = [-271012, 3799, -243068, -58140, -440938, -193819, 69091, -43698, -411776, -28453, -165376, -73544, -425630, 13274, -238055, -132170, -108718, 149669, -130602, 63345, -79344, 70715, -334130, 39591, -10824, -230145, -229040, -75081, -58150, 530570, -53384, 93718, 22759, -271715, -130783, 36522, -197564, 83507, 11647, 66188, -127761, -182018, -221895, -72774, -146433, -137823, -217790, -88603, 92175, -114507, -70798, 184446, 331470, 100283, 19868, -105014, 136832, -321226, -21987, -215959, 650844, -6369, -23640, -51947, -351153, -29964, -146833, -106006, 128163, -84654, 97245, -125098, -119556, 195596, 49689, -26778, -302550, -71822, -108456, 210554, -150541, 158208, -81321, 102447, -105515, 18377, 223593, 257773, -158131, 120894, 120725, -7372, -90980]
10501i0980B08698J8565J5735a2992j37060O9255A09233A1975m689J93189c7103
10489d6916B22661p4341c5332L201B69260p9187l198a24057D1710K54546j30686
10478A65570K29622Q736A53583o3308a30574B03057c1055G365J30248O9187g3003
10466A82823a49943A03080J5475b88712B22546b68780A24848d4236r5434A30682
10455A71464p1564f3100k31791A9151d19387B13338a86874c6026o2848B2192R6767
10444A18959J20299J3787a84378A4485J36790j0942K00717B4736a76587N6599
10434a19988N8703k33886A02498c58778g8603J3360A52925e2105B53747D1317
10423d31278a5286G9870E518f7402A50622b12312C3531j4142K2552Q5910a34734
$$ y = [-90980, 208698, 227263, 242998, -12992, -150052, -80797, 109233, 11975, 7286, 200475, -37103, -46916, 222661, 148320, -35332, -32131, 269260, 190073, 186875, -124057, 41710, 296256, 165570, 395192, 403928, 153583, 90275, -130574, 203057, -31055, 7365, 137613, 206800, -73003, 182823, -149943, 103080, 118555, -288712, 222546, -268780, 124848, -44236, -139670, 130682, 171464, 99900, -63100, -294891, 19151, -419387, 213338, -186874, -36026, -98874, 22192, 118959, 239258, 253045, -184378, 14485, 151275, 140333, 341050, 24736, -176587, -119988, -61285, -295171, 102498, -358778, -78603, -65243, 152925, -52105, 253747, 41317, -431278, -15286, 79870, 5518, -67402, 150622, -212312, 33531, 19389, 41941, 127851, -134734]
10411B8726J4274K37718H7982Q383b73983A10122R3647b02012e6205B12977J67837
10400C80814a13830K1106r3875A08911b59465A00239D7972h7535c5652e862F358
10388D1933K30786p8616b16222J0705K766C58599J32370b43270b1350C52398E5991
10376C38847K30058B02979C6040J62501H0015O2576K70600M3360j99765J27885
10366C84671A12965M85512A54881J10413a08469C00244K78495A23049K41140j66490
10356A97699f657A32601b732F15163k31566k7035J71247J16392A02175O0918C9091
10344C94640m9253M2082M132C4214P2631e3540D11147G773L72761j58669q1653
10333A40212J2864j4763J77278a34211H9695a18323j33669I6235K18712j9862
$$ y = [28726, 43000, 280718, 87982, 96365, -273983, 110122, 203769, -202012, -56205, 212977, 380814, -113830, -92724, -186599, 108911, -259465, 100239, 47972, -87535, -35652, -5862, 6358, 41933, 272719, 194103, -216222, -205517, -202751, 358599, 490969, -243270, -21350, 352398, 55991, 338847, 568905, 202979, 36040, 198541, 80015, 142591, 413191, 456551, 256786, 384671, 112965, 598477, 154881, 265294, -108469, 300244, 578739, 123049, 364189, 197699, -6657, 132601, -2732, 615163, 383597, 356562, 527809, 644201, 102175, 163093, 39091, 394640, 345387, 387469, 391601, 34214, 106845, -53540, 411147, 7773, 380534, 221865, 140212, 153076, 138313, 315591, -134211, 89695, -118323, -251992, 96235, 314947, 295085]
10323B95085r5000L4262N4371e5993j74320H9214K05163j02444o7791M2195a09506
10311a00242b1868p5705b2688k12416b787j09075K3297D6806Q2242b0130J744
10300a8386A66536N4057M3678a00948B46563e7307C62993g4825m13650D4426K1247
10289F5673J39643b2062C16057b34917I390a42105D1522b61047A02860a77135
10278b5621G7170a74008K0922a5983j66592A5674L4439L77644F8373P0268A4517
10266e5405j7545n6043k75262B0327b4878k0386D6172J89131b3448A85421M1765
10255B27186p6995K7007H7073J65724Q8316b16232B0145O832L1927c56588H6912
10243A72803K0610b39447n4183P6146i5285B02451g7687m4641k84811a46775M414
$$ y = [295085, 200085, 234347, 288718, -55993, -230313, 89214, 294377, 191933, 124142, 166337, -109506, -100242, -21868, -97573, -22688, -235104, -2787, -111862, -88565, 46806, 129048, -20130, -18386, 166536, 220593, 264271, -100948, 246563, -57307, 362993, -74825, -488475, 44426, 65673, 205316, -22062, 316057, -234917, 9390, -142105, 41522, -261047, 102860, -177135, -25621, 77170, -174008, -153086, -15983, -182575, 15674, 50113, 427757, 68373, 138641, 14517, -55405, -72950, -128993, -404255, 20327, -24878, -45264, 46172, 235303, -23448, 185421, 227186, 150191, 177198, 87073, 252797, 341113, -216232, 20145, 26977, 58904, -356588, 86912, 172803, 193413, -239447, -293630, -217484, -95285, 202451, -77687, -122328, -407139, -146775, -142361]
10232a42361I22b23703Q1534A43872F5260F15J1210b50637f6809p691A49463c25637
10219D6165M7110c8156l42374A38317b62690m14146i0969k6947r2464n9737E383
10207a24836b8366k1333A276J33708a71996P3177c035k43132M0863N0768b3813
10195e077n613A10895c8j64809A01560b60233A04948D6339c1450A17032b75274
10183B40115f1598j20723C50222D2053a71377B22801c18193m7055a57342K5133
10173a32209B93730b9691j41943A6539b37280R0897M9753r0693j77055Q4630M96
10162b79252A036J08084a41475j98761J19484A11583a84454A93023b52283A09567
10151A3320a03327j27194E8129P9175f3725l9555b2832k5519I7550l3404d5192
$$ y = [-142361, 922, -223703, -142169, 143872, 65260, 615, 11825, -250637, -66809, -74500, 149463, -325637, 46165, 93275, -38156, -380530, 138317, -262690, -676836, -90969, -117916, -210380, -270117, 5383, -124836, -28366, -49699, 1276, 134984, -171996, -98819, -3035, -246167, -205304, -154536, -23813, -5077, -10690, 110895, -38, -164847, 101560, -260233, 104948, 46339, -31450, 117032, -275274, 240115, -61598, -182321, 350222, 42053, -171377, 222801, -318193, -365248, -157342, -132209, 293730, -29691, -171634, 16539, -237280, -146383, -96630, -187323, -364378, -279748, -279252, 1036, 109120, -141475, -340236, -220752, 111583, -184454, 193023, -252283, 109567, 13320, -103327, -230521, 58129, 137304, -63725, -103280, -22832, -48351, 97550, 64146, -45192]
10139A91534c8949k4315q3029p6326m6036b2114A71121b17854G514a35531c6374
10127B72689a45840A55782b59165C55406E1009L0897e1626B68307b74414D4871
10116I8294D1826b03708O5533E9047h6384k2586J168j50141J19179d6029B9654
10104a18018j90505E5020H431N1633g6821j26232a01065p8578E1196a41677I2888
10092h8314c4418I0052k2244J10715a0381j67282j70046A57946K1178n5074E8976
10080A02627J6639a3356j51697k8214I6427i4732B15645D2677i5746n8163b7599
10068c65652A80470a59233A52430l4323b04386F2646c37348a60940A13825P9123
10058A92948b16846g068F6305b00276d5164B13276G9057L2224a04671A05085a1405
$$ y = [191534, -38949, -63264, -146293, -222619, -268655, -22114, 171121, -217854, 7514, -135531, -36374, 272689, -145840, 155782, -259165, 355406, 51009, 81906, -51626, 268307, -274414, 44871, 98294, 41826, -203708, -138175, 59047, -86384, -108970, -107802, -257943, -138764, -46029, 29654, -118018, -308523, 55020, 8431, 60064, -76821, -203053, -101065, -179643, 51196, -141677, 92888, -88314, -34418, 90052, 67808, 178523, -10381, -177663, -347709, 157946, 179124, 124050, 58976, 102627, 119266, -13356, -165053, -193267, 96427, -94732, 215645, 42677, -95746, -153909, -27599, -365652, 180470, -159233, 152430, 118107, -204386, 62646, -337348, -160940, 113825, 192948, -216846, -7068, 66305, -200276, -45164, 213276, 79057, 111281, -104671, 105085, -11405]
10046f27865A92813a86630B0478a70543A00709e0979p2165j21526j03172A31233
10035A99924a89556G689N8218b78857F7501c96835a03257l13566A60946R9771
10025B60717c5376M793j72756i4046a6417j17565j16446a124l00509A09661C4751
10013b4396I3710b83639G7529M0192Q4000d1848j1940a3202k06538a8560k41792
10002b60352M0376I8285k9062J6383i4136I3167f7962m0639n5295J7549D06789
9990a83546f2619j60437j62608B2986d58594e2532E9423f1102k69048A07074l5151
9979G1923a12603B10225n1855b59414f1134A14518A8695b06743R0734j01847f3852
9967G6288a89408M0976k0627j32854I5286a13724L2292A55020a81862L7161j32599
$$ y = [-627865, 192813, -186630, 20478, -170543, 100709, -50979, -123144, -244670, -347842, 131233, 199924, -189556, 7689, 65907, -278857, 67501, -396835, -103257, -416823, 160946, 260717, -35376, -30583, -203339, -94046, -16417, -133982, -250428, -1124, -301633, 109661, 34751, -24396, 93710, -283639, 77529, 117721, 201721, -41848, -53788, -13202, -219740, -18560, -260352, -219976, 98285, 69223, 85606, -94136, 93167, -67962, -108601, -163896, -146347, 406789, -183546, -62619, -223056, -385664, 22986, -458594, -52532, 59423, -61102, -330150, 107074, 71923, -112603, 210225, 158370, -259414, -61134, 114518, 18695, -206743, -116009, -217856, -63852, 76288, -189408, -148432, -169059, -301913, 95286, -113724, -81432, 155020, -181862, -144701, -277300]
9956b77300J0316J18886N6846q4I5079f1998r6193C7752a69544L9755C6022R0467
9944A26489a78376C2792i1062j02074M5833d2730H2345C2406h1267a7920j15568
9933a33488A1292c10911k55530h8180j29934p0267C53997c02243b0830l45584
9923c66414P0828E0651A0774c27664a06648b3665l10374a65311P0188B74920a7452
9911E92M02971A35467g9028j20299q7702m0302g9482A56473c50532J01319a09170
9899c82563A17940b14505A97486I6149a94421A86764j5912G0189b80202D72265
9888A07156b9032o2465B8376a61381q4874B5210h1115A7051a92750f3953b4636
9876a88442O8051r4758L5444K8249q3784L8131K8443j8263h731I7884n172a79614
$$ y = [-277300, -266984, -148098, -91252, -91336, 95079, -61998, -158191, 37752, -169544, -129789, 36022, 126489, -178376, 32792, -91062, -193136, -147303, -42730, 82345, 32406, -81267, -17920, -133488, 11292, -310911, -566441, -88180, -218114, -288381, 353997, -302243, -20830, -366414, -295586, 50651, 10774, -327664, -106648, -23665, -334039, -165311, -95123, 274920, -17452, 592, 403563, 135467, -79028, -199327, -287029, -327331, -79482, 156473, -350532, -249213, -109170, -382563, 117940, -214505, 197486, 96149, -194421, 186764, 170852, 70189, -280202, 472265, 107156, -29032, -91497, 28376, -161381, -246255, 25210, -81115, 17051, -192750, -63953, -24636, -188442, -120391, -215149, -179705, -151456, -235240, -197109, -168666, -186929, -8731, 97884, 92712, -179614]
9863a00468j80291a12111L973j0999k41350a1646K52C4473h1079k0455j7086q0755
9851a99375Q3900C3145i0125A20007b06342n1034e7452j09289n7882G3076e0370
9839F5102b10743N6768H5414a8868k28442B8550r321P9980P0329b1661k3903p5123
9827a20687H6723A4282a83796e6631n3393j87104B03975c03549J05263a3887j72293
9816a86180g3067B16794a11439q272E6536a78879Q1457d4003J4020j34368A06179
9804F3291J22725a94667r7906E417K0289j0817e4416k78288A33247b14864A1773
9792I0139K83171a13991K5315H8456b94930I0085i0495A09704a24127L7652d1218
9780C411a91845G1074b7937k89887a29130j5175A91776a40277O6054b1937j79608
$$ y = [-100468, -280759, -112111, -108138, -119137, -360487, -11646, -11394, 34473, -81079, -101534, -118620, -199375, -115475, 33145, -90125, 120007, -206342, -257376, -57452, -166741, -224623, 73076, -50370, 65102, -210743, -153975, 85414, -18868, -247310, 28550, 19229, 99209, 169538, -21661, -45564, -120687, 86723, 14282, -183796, -56631, -110024, -297128, 203975, -303549, -198286, -13887, -186180, -73067, 216794, -111439, -119711, 56536, -178879, -97422, -44003, -29983, -164351, 106179, 63291, 186016, -194667, -292573, 5417, 25706, 14889, -54416, -332704, 133247, -214864, 11773, 90139, 373310, -113991, -88676, 88456, -294930, 90085, -90495, 109704, -124127, -86475, -41218, 3411, -191845, 71074, -27937, -317824, -129130, -144305, 191776, -140277, -74223, -21937, -201545]
9769b01545p0826O9803N8215j03504A35173J46997a25460J1281B52663A09722
9758b30666b2717A21830b48236M1901D3873N9369M6109C8807a81076j09405a42254
9746a30418l07603c6922k07801h8488l48801a46820B7101b67750A81692p6634
9736A05058O6952p7504A366b08678B1159a27769j88108A26339c45782J70501P6767
9725i8514J2498o4398M8574q1637q829j48065a1142l09203c7258I0079Q7710p2244
9713A05545a42488A03027b2091j17191H1648C5588a68273k58195C0963a64362
9702a56185J2254r0429M4729q3087O1543A88402B4728b21446J05513a9139B30898
9690d7529E8673K9545c1322A55937G5254e3365k1251L4918k34364H0799b02815
$$ y = [-201545, -272371, -202568, -144353, -247857, 135173, 282170, -125460, -114179, 252663, 109722, -230666, -22717, 121830, -248236, -206335, 43873, 103242, 149351, 38807, -181076, -290481, -142254, -130418, -438021, -36922, -244723, -88488, -437289, -146820, 27101, -267750, 181692, 105058, 172010, 94506, 1366, -208678, 21159, -127769, -315877, 126339, -345782, -175281, -98514, -86016, -150414, -101840, -183477, -192306, -340371, -11142, -320345, -37258, 90079, 177789, 105545, -142488, 103027, -22091, -139282, 81648, 35588, -168273, -426468, 30963, -164362, -156185, -143931, -234360, -189631, -272718, -211175, 188402, 24728, -221446, -115933, -19139, 230898, -47529, 58673, 88218, -31322, 155937, 75254, -53365, -74616, -39698, -274062, 80799, -202815]
9678a95737D2674Q9253c1095A72301J73628c18401J31362G2587a76038A68868
9667B24535i0661L8580l02629E1961Q6627h9593n1351a4928G9939b6921L054A64862
9654H6145a63454c3845k44283B29065f4704H0011B8557a78269A71737R613C5272
9642c15337h2023L5820A37839a24934r6644j68526J79967O3292C52575d404k79801
9631b84205c3023k54475A08426f4668j16494A01345g5054r2322Q308b5087F4909
9619c5891j05572m0958E7225j4693b730j52870L2911A9504J363b25814G6945h1898
9606A05760D8261h2353k10590a2314k70352Q8825j366M8508A38190b00399J8937
9595a81462J8789N4592E7007a48291o0157R7175A8846k981a36763g827k9854o9288
$$ y = [-195737, 42674, 131927, -31095, 172301, 345929, -318401, -187039, 72587, -176038, 168868, 224535, -90661, -52081, -354710, 51961, 138588, -89593, -140944, -14928, 79939, -26921, -23867, 164862, 86145, -163454, -33845, -278128, 229065, -64704, 80011, 28557, -178269, 171737, 181350, 35272, -315337, -82023, -46203, 137839, -124934, -221578, -390104, -210137, -146845, 352575, -4404, -284205, -33023, -287498, 108426, -64668, -181162, 101345, -75054, -167376, -159068, -25087, 64909, -35891, -141463, -182421, 57225, 42532, -2730, -155600, -122689, 19504, 20867, -225814, 76945, -81898, 105760, 48261, -82353, -292943, -12314, -282666, -193841, -195207, -146699, 138190, -200399, -181462, -162673, -108081, 57007, -148291, -208448, -111273, 18846, 15865, -136763, -7827, -37681, -106969]
9583a06969A08003q127Q5161c40975M5242a04442n4028C68L00031N968h2654A56305
9570b49519a16575A14159E5408A5274a21749F4345d00984E9866J46470D0806d8498
9558g2880I5264D0640f2566F1558h203j36569a2650k38582Q3715A67709C6991
9546a00724q1804l71608K03527A8409J26054b38068A17063a69024m5044p1766
9536b85834A16959a64249M4579B91003A834a80377A70996b15631B24983c25186
9525B53639G2708P6971K44009a39929A24741b53420K5695o8519c971A08813a71726
9513b48309K1446R8681m9983h1302K9872j55989b8579B69760e1509I0519a92094
9501E343a70819g1612k02612A14119b34578A81542o4138b65411F9508J12026a49426
$$ y = [-106969, 108003, 99876, 185037, -340975, -295733, -104442, -158470, 368, 300399, 306367, -82654, 156305, -249519, -116575, 114159, 55408, 15274, -121749, 64345, -400984, 59866, 206336, 40806, -48498, -72880, 95264, 40640, -62566, 61558, -8203, -144772, -12650, -251232, -167517, 167709, 36991, -100724, -182528, -554136, -350609, 18409, 144463, -238068, 117063, -169024, -214068, -285834, 116959, -164249, -119670, 291003, 1834, -180377, 170996, -215631, 224983, -325186, 253639, 72708, 149679, 393688, -139929, 124741, -253420, -227725, -296244, -3971, 108813, -171726, -248309, -226863, -128182, -178165, -81302, -51430, -207419, -28579, 269760, -51509, 90519, -192094, 5343, -170819, -71612, -274224, 114119, -234578, 181542, 117404, -265411, 69508, 181534, -149426]
9489D929i35l16255b826o1743B10323G4346M7470b30429A20670b59453A32084
9477c11739A12013c56862f1026A32852M4517A3850a434k49607Q3865m3273c3109
9465b2189o4856n3213e1091k30445J25683C79067d95306a07123A29155A0780b38655
9453b40592c4028J6440D1892a26697C52841h1706C01114b89882a03228A421b68814
9441a16802j25782c4884C8926f4434A13031c5374j48162P8188G3110a91298o4629
9430b55927G0443d6929C87068c8823j24234F1345h8532j43117C5928a12559a8602
9418A65319f1340B12832Q8173j45578c03484J49133J4028m866b9906L556l1619
9407e7969k4368j18991P2477j24515b9346B5252K78286a25694j80264a01512L9750
$$ y = [4929, -935, -317190, -2826, -64569, 210323, 74346, 121816, -230429, 120670, -259453, 132084, -311739, 112013, -356862, -61026, 132852, 177369, 13850, -1434, -251041, -167176, -210449, -33109, -22189, -87045, -140258, -51091, -281536, -155853, 379067, -495306, -107123, 129155, 10780, -238655, -240592, -34028, -17588, 41892, -126697, 352841, -81706, 301114, -289882, -103228, 1421, -268814, -116802, -242584, -34884, 38926, -64434, 113031, -35374, -183536, -105348, 73110, -191298, -255927, 70443, -46929, 387068, -38823, -163057, 61345, -88532, -231649, 35928, -112559, -18602, 165319, -61340, 212832, 301005, 155427, -303484, -154351, -140323, -145189, -29906, -26350, -57969, -82337, -201328, -128851, -253366, -29346, 25252, 303538, -125694, -305958, -101512, -61762]
9396f1762g261l76132J47451J0238f4333A31643J3812a17403d2573B0052a639
9384a21554k5696A53171d03490f6589A44497d6573k35997h9181j78246a15403
9373a9077j10058r6294R7936n09k77190e0364j44412f4805G305a09012B43664
9361B53539j05575K4623C5043J85514j06438c70565i9470I1845J61586b75252
9350A56282B3313a41811C0411K30475a33114A40465c90182J93253E053e5304o18781
9339f74085b00111g9248l1653D1502d8561A4124d20756g1857g854F2154i5191
9327e3422A02818a76779G7494b27286M348D1273b86316Q904A79550p2405a36288
9315H066J6280J7121a39354O3944A55179G5404f5535A90776E1390a76354B59661
$$ y = [-61762, -7261, -383393, -235942, -225704, -64333, 131643, 145455, -117403, -42573, 20052, -1639, -121554, -147250, 153171, -403490, -66589, 144497, -46573, -282570, -89181, -267427, -115403, -19077, -129135, -225429, -127493, -128002, -405192, -50364, -194776, -64805, 7305, -109012, 243664, 253539, 147964, 172587, 35043, 220557, 114119, -370565, -99470, 91845, 253431, -275252, 156282, 23313, -141811, 30411, 260886, -133114, 140465, -390182, -196929, 5053, -55304, -674085, -200111, -79248, -110901, 41502, -48561, 14124, -420756, -71857, -7854, 62154, -95191, -53422, 102818, -176779, 77494, -227286, -222938, 41273, -286316, -277412, 179550, 107145, -136288, 8066, 24346, 41467, -139354, -75410, 155179, 75404, -65535, 190776, 51390, -176354, 259661]
9303c84087J66863A43247a84737Q8082a0608A66503a90010g957j38902A42533
9292C5660R3904b49813J7947C6243f6826c3005j00521D5826N7730g6743j36204
9281b12947c3528m6768m6606k8525j24410A55981a75431b8557r2841A17853c8643
9269b32668a06788n6822g612l7766q7149j13224C72105a13790K4081j97987E2080
9257A76644e5222C2728J27748F3689K39827A13900j3291h8770k46167J32462K5756
9246a76719N8759A28598B4336b01439A56799b70499N0265J08437A55162b36545
9235g0748D4582a91965d5117j87395h400j03291j72190j9680c4162j01290n3810
9224a89262e3427j5180E190d29655J48221d1926n53304B64756m6956i0627B291
$$ y = [-384087, -217224, 143247, -184737, -96655, -10608, 166503, -190010, -7957, -146859, 142533, 35660, 129564, -249813, -231866, 36243, -66826, -33005, -133526, 45826, 103556, -76743, -212947, -33528, -80296, -126902, -155427, -279837, 155981, -175431, -28557, -121398, 117853, -38643, -232668, -106788, -163610, -7612, -45378, -132527, -245751, 372105, -113790, -89709, -287696, 52080, 176644, -55222, 32728, 160476, 63689, 303516, 113900, 100609, -88770, -334937, -202475, -176719, -117960, 128598, 24336, -201439, 156799, -270499, -220234, -111797, 155162, -236545, -70748, 44582, -191965, -45117, -232512, -8400, -111691, -283881, -303561, -34162, -135452, -189262, -53427, -68607, 5190, -429655, -281434, -41926, -595230, 264756, 217800, -90627, 2291]
9212i1389L2673k0065l1099n3646A3976a41533d7733k64691N3497c4522H1774
9200a05009E1861j6170c9132D58664G384J59317a19685N6837A07379a15985d2565
9188C14535b87826F5256l1749Q4018j8962R3139b73782C7090R8089m5642M8158
9177A37695e5688B0468a64484d8701A73727M7364a13320j48581A98717b79684
9166d4683j9115A45714B0989e26117J24631e8010A08767l0572a77284c6921H2803
9154A37237b57334b0825k35617M4414B28753l2207p7134R5443a12669D560J02446
9143A07006J17627i0385l35590C41757F5201M7762K39859e4580J9327j83140B93911
9131A71677d8338J0365j01223e7418B51180f7590r9972G8269K78394A02561c4955
$$ y = [-91389, -58716, -78781, -109880, -163526, 13976, -141533, -47733, -312424, -258927, -34522, 81774, -105009, 51861, 35691, -39132, 458664, 7384, 166701, -119685, -62848, 107379, -115985, -42565, 314535, -287826, 65256, 33507, 117525, 98563, 191702, -273782, 37090, 135179, 89537, 137695, -55688, 20468, -164484, -48701, 173727, 221091, -113320, -261901, 198717, -279684, -44683, -63798, 145714, 20989, -526117, -401486, -58010, 108767, 78195, -177284, -36921, 82803, 137237, -257334, -20825, -256442, -212028, 228753, 196546, 119412, 214855, -112669, 4560, 107006, 224633, -90385, -425975, 341757, 65201, 112963, 352822, -54580, -35253, -218393, 293911, 171677, -48338, -37973, -139196, -57418, 251180, -67590, -167562, 78269, 356663, 102561, -34955]
9119B76932b78599a37066k35969f5108j1607j26674f3453k58966c4717j0694B26093
9107i2877A50604b01853i9078l10560f8747k52249a4823I4726a71637B65305a95260
9095b8953m6307A55456b37620r7494N4360M1820A38552b19738O3555A91811n3419
9084A38392a69888L3297l3330G4297b54036A41663J91746E6436a17145A70191
9073A27865K691b74660A00143J08625b68272q3344j30225A47491J3798m0822R9529
9062B19996D0758b30250d5572R493J6811A0868b1621B7039a78241B35825a76772
9050b38635J00063a5034l25274L9644A17142b02628A29235K19214A32943b87378
9039b32684B7058i6865j809K0173A95553I4836q045b9511j25090A27732J92485
$$ y = [276932, -278599, -137066, -373035, -65108, -76715, -203389, -63453, -322419, -34717, -45411, 226093, -92877, 150604, -201853, -99078, -409638, -68747, -320996, -14823, 94726, -171637, 265305, -195260, -28953, -75260, 155456, -237620, -335114, -280754, -238934, 138552, -219738, -156183, 191811, 138392, -169888, -136591, -169921, 74297, -254036, 141663, 333409, 56436, -117145, 170191, 127865, 130556, -274660, 100143, 208768, -268272, -351616, -481841, 147491, 161289, 120467, 219996, 40758, -230250, -45572, -36079, -19268, 10868, -21621, 27039, -178241, 235825, -176772, -238635, -138572, -15034, -340308, -300664, 117142, -202628, 129235, 348449, 132943, -287378, -232684, 27058, -96865, -98674, -78501, 195553, 94836, 86791, -29511, -154601, 127732, 320217]
9028C20217h9784k54339g8287F065a72540k37945J00786g115k88820H6454a7696
9016b98331c0196B37273c33883e2063K3471o1762j01832l6172a05482B9645J58438
9005A88083n6360f1101j03568c7431I0472f0687A27531h6116r5060l0650B15511
8993A27227d14236h9957o5791h920A25613K8281a73700A2326Q4131f5482k71657
8982c37139A9011h0318j14863K848H4783a65369k9244A63663b30886J04148k31488
8971c58226C44294a65066j64321A2364i4344B8060h610E5722b82312h5968I697
8959b65910D9307P4111C8259a72299A52210c30379a03601K2933j60787e4426C9417
8947a49873a6021k966p3223D51734h8791q4814B7069b07233K8273E6426a59415
$$ y = [320217, -89784, -344123, -78287, 6065, -172540, -410485, -309699, -7115, -295935, 86454, -17696, -298331, -30196, 237273, -333883, -52063, -28592, -90354, -192186, -228358, -105482, 29645, 188083, 131723, -61101, -164669, -37431, 90472, -60687, 127531, -86116, -181176, -211826, 215511, 127227, -414236, -89957, -155748, -8920, 125613, 153894, -173700, 12326, 96457, -65482, -337139, 19011, -80318, -195181, -192333, 84783, -165369, -194613, 163663, -230886, -126738, -358226, 344294, -165066, -329387, 12364, -94344, 28060, -8610, 55722, -282312, -85968, 9697, -265910, 49307, 123418, 38259, -172299, 152210, -330379, -103601, -80668, -241455, -54426, 39417, -149873, -16021, -18987, -92210, 451734, -88791, -173605, 27069, -207233, -178960, 56426, -159415]
8935D7174L53787A86551i6331C2144n953f0691C19058A7988O1154M31917K76800
8924G87859J016539K446446J1618426p354748B955247A296235k40197D52377B15678
8914B58302a8401F2421a05709N630D4458J50809M0388L8656j8086C6494h0384
8902a67427c1677k26588R5902B34530p0273h9548A99000c68753h6439A70821b75670
8890G1466b18731M2891f0978D0313L34637a53995m273f5007a4481B30628h5399
8878B6354J90a64268L9114E8302K05656b86519B8279K52905J26976a34396j2211
$$ y = [47174, 400961, 186551, -96331, 32144, 26191, -60691, 319058, 17988, 79142, 511059, 787859, 1804398, 4250844, 15869270, 8514522, 2955247, 1296235, 1056038, 452377, 215678, 258302, -18401, 62421, -105709, -100079, 44458, 195267, 235655, 274311, 256225, 36494, -80384, -167427, -31677, -258265, -162363, 234530, 164257, -89548, 199000, -368753, -86439, 170821, -275670, 71466, -218731, -175840, -60978, 40313, 374950, -153995, -158268, -65007, -14481, 230628, -85399, 26354, 26544, -164268, -125154, 58302, 263958, -286519, 28279, 281184, 408160, -134396, -146607]
$$ [...]
##END NTUPLES=NMR SPECTRUM
##END=
