##TITLE=AC1549_ROEFFECT0014_8268862_wcNlsfVCId
##JCAMPDX= 6.0         $$ Bruker NMR JCAMP-DX V2.0
##DATA TYPE= NMR SPECTRUM
##DATA CLASS= NTUPLES
##ORIGIN= BRUKER
##OWNER= Administrator
$$ 1.72 TOPSPIN		Version 2.1
$$ 2013-10-11 22:51:24.430 -0700  Administrator@X
$$ Compression mode = diff/dup
##.OBSERVE FREQUENCY= 400.02188249412
##.OBSERVE NUCLEUS= ^1H
##.ACQUISITION MODE= SIMULTANEOUS (DQD)
##.ACQUISITION SCHEME= undefined
##.AVERAGES= 64
##.DIGITISER RES= 22
##SPECTROMETER/DATA SYSTEM= spect
##.PULSE SEQUENCE= noesygpps1d.comp
##.SOLVENT NAME= COFFEE_meoh
##.SHIFT REFERENCE= INTERNAL, COFFEE_meoh, 1, 14.96075
##AUDIT TRAIL= $$ (NUMBER, WHEN, WHO, WHERE, PROCESS, VERSION, WHAT)
$$ ##TITLE= Audit trail, TOPSPIN		Version 2.1
$$ ##JCAMPDX= 5.01
$$ ##ORIGIN= Bruker BioSpin GmbH
$$ ##OWNER= Administrator
$$ $$ E:\/data/COFFEE/nmr/AC1549_ROEFFECT0014_8268862_wcNlsfVCId/12/pdata/1/auditp.txt
$$ ##AUDIT TRAIL=  $$ (NUMBER, WHEN, WHO, WHERE, PROCESS, VERSION, WHAT)
(   1,<2013-10-11 22:51:19.446 -0700>,<Administrator>,<X>,<go>,<TOPSPIN 2.1>,
      <created by zg
	started at 2013-10-11 22:39:50.008 -0700,
	POWCHK enabled, PULCHK disabled,
       configuration hash MD5:
       C8 4E 4E 5D D3 5C D8 9E 9F 52 82 E0 59 8A DE 15
       data hash MD5: 64K
       EF 18 A5 E3 B6 D5 10 A7 65 B5 01 9A ED 29 45 04>)
(   2,<2013-10-11 22:51:22.383 -0700>,<Administrator>,<X>,<proc1d>,<TOPSPIN 2.1>,
      <Start of raw data processing
       efp LB = 0.3 FT_mod = 6 PKNL = 1 PHC0 = 0 PHC1 = 0 SI = 128K 
       data hash MD5: 128K
       B8 07 46 A8 19 C2 57 A6 D1 73 FA C4 7D FE AC F7>)
(   3,<2013-10-11 22:51:23.430 -0700>,<Administrator>,<X>,<proc1d>,<TOPSPIN 2.1>,
      <pk PHC0 = -83.63892 PHC1 = 0 
       data hash MD5: 128K
       B2 FA C2 5D 11 7C C5 B9 CA D8 DD AC D8 A7 59 B7>)
(   4,<2013-10-11 22:51:23.852 -0700>,<Administrator>,<X>,<proc1d>,<TOPSPIN 2.1>,
      <abs ABSG = 1 
       data hash MD5: 128K
       B9 6C A3 B1 08 3F AF 54 08 41 9F C9 C4 D9 AA D9>)
(   5,<2013-10-11 22:51:23.992 -0700>,<Administrator>,<X>,<proc1d>,<TOPSPIN 2.1>,
      <abs ABSG = 2 
       data hash MD5: 128K
       8F 98 50 E1 FD 34 57 F9 C0 30 FA B0 71 2A B7 37>)
(   6,<2013-10-11 22:51:24.071 -0700>,<Administrator>,<X>,<proc1d>,<TOPSPIN 2.1>,
      <abs ABSG = 3 
       data hash MD5: 128K
       B3 E4 02 F9 24 C4 7D 32 96 3D 07 7A 1E 2B 32 4D>)
(   7,<2013-10-11 22:51:24.180 -0700>,<Administrator>,<X>,<proc1d>,<TOPSPIN 2.1>,
      <abs ABSG = 4 
       data hash MD5: 128K
       56 17 25 6F 1E 06 08 06 06 43 D2 AC 4F AE 72 24>)
(   8,<2013-10-11 22:51:24.258 -0700>,<Administrator>,<X>,<proc1d>,<TOPSPIN 2.1>,
      <abs ABSG = 5 
       data hash MD5: 128K
       C0 6B D7 F5 82 7D FD A0 BE 53 9E 19 54 FE CE 9C>)
$$ ##END=
$$ 
$$ $$ hash MD5
$$ $$ D6 86 40 ED F5 9B CD F9 EB 4C 70 F8 78 B4 3F 33
##$RELAX= 
##$RELAX= 
##$RELAX= 
##$RELAX= 
##$RELAX= 
##$RELAX= 
##$RELAX= 
##$RELAX= 
$$ Bruker specific parameters
$$ --------------------------
##$DU= <E:\>
##$EXPNO= 12
$$ [...]
##$TP07= 0
##$TPNAME0= <>
##$TPNAME1= <>
##$TPNAME2= <>
##$TPNAME3= <>
##$TPNAME4= <>
##$TPNAME5= <>
##$TPNAME6= <>
##$TPNAME7= <>
##$TPOAL= (0..7)
0.5 0.5 0.5 0.5 0.5 0.5 0.5 0.5
##$TPOFFS= (0..7)
0 0 0 0 0 0 0 0
##$TUNHIN= 0
##$TUNHOUT= 0
##$TUNXOUT= 0
##$USERA1= <user>
##$USERA2= <user>
##$USERA3= <user>
##$USERA4= <user>
##$USERA5= <user>
##$V9= 5
##$VALIST= <valist>
##$VCLIST= <CCCCCCCCCCCCCCC>
##$VD= 0
##$VDLIST= <DDDDDDDDDDDDDDD>
##$VPLIST= <PPPPPPPPPPPPPPP>
##$VTLIST= <TTTTTTTTTTTTTTT>
##$WBST= 1024
##$WBSW= 4
##$XGAIN= (0..3)
0 0 0 0
##$XL= 0
##$YL= 0
##$YMAX_a= 6175343
##$YMIN_a= -13146844
##$ZGOPTNS= <>
##$ZL1= 120
##$ZL2= 120
##$ZL3= 120
##$ZL4= 120
##$ABSF1= 14.96075
##$ABSF2= -5.597432
##$ABSG= 5
##$ABSL= 3
##$ALPHA= 0
##$AQORDER= 0
##$ASSFAC= 0
##$ASSFACI= 0
##$ASSFACX= 0
##$ASSWID= 0
##$AUNMP= <proc_prof1d_extract.lims>
##$AXLEFT= 0
##$AXNAME= <>
##$AXNUC= <1H>
##$AXRIGHT= 0
##$AXTYPE= 0
##$AXUNIT= <>
##$AZFE= 0.1
##$AZFW= 0.1
##$BCFW= 0
##$BC_mod= 0
##$BYTORDP= 0
##$COROFFS= 0
##$CY= 15
##$DATMOD= 1
##$DC= 0
##$DFILT= <>
##$DTYPP= 0
##$F1P= 0
##$F2P= 0
##$FCOR= 0.5
##$FTSIZE= 131072
##$FT_mod= 6
##$GAMMA= 0
##$GB= 0
##$INTBC= 1
##$INTSCL= 1
##$ISEN= 128
##$LB= 0.3
##$LEV0= 0
##$LPBIN= 0
##$MAXI= 10000
##$MC2= 0
##$MEAN= 0
##$ME_mod= 0
##$MI= 0
##$NCOEF= 0
##$NC_proc= -2
##$NLEV= 6
##$NOISF1= 0
##$NOISF2= 0
##$NSP= 0
##$NTH_PI= 0
##$NZP= 0
##$OFFSET= 14.96075
##$PC= 1
##$PHC0= -83.63892
##$PHC1= 0
##$PH_mod= 1
##$PKNL= yes
##$PPARMOD= 0
##$PPDIAG= 0
##$PPIPTYP= 0
##$PPMPNUM= 2147483647
##$PPRESOL= 1
##$PSCAL= 4
##$PSIGN= 0
##$PYNMP= <proc.py>
##$REVERSE= no
##$SF= 400.020009738689
##$SI= 131072
##$SIGF1= 0
##$SIGF2= 0
##$SINO= 400
##$SIOLD= 131072
##$SPECTYP= <>
##$SREGLST= <1H.CDCl3>
##$SSB= 0
##$STSI= 131072
##$STSR= 0
##$SW_p= 8223.68421052631
##$SYMM= 0
##$S_DEV= 0
##$TDeff= 65536
##$TDoff= 0
##$TI= <>
##$TILT= no
##$TM1= 0
##$TM2= 0
##$TOPLEV= 0
##$USERP1= <user>
##$USERP2= <user>
##$USERP3= <user>
##$USERP4= <user>
##$USERP5= <user>
##$WDW= 1
##$XDIM= 131072
##$YMAX_p= 310221542
##$YMIN_p= -17309
##$CURPLOT= <Network HP LaserJet P1505>
##$CURPRIN= <$Network HP LaserJet P1505>
##$DFORMAT= <normdp>
##$LAYOUT= <+/1D_H.xwp>
##$LFORMAT= <normlp>
##$PFORMAT= <normpl>
##$SURQMSG= 1
$$ End of Bruker specific parameters
$$ ---------------------------------
##NTUPLES= NMR SPECTRUM
##VAR_NAME=  FREQUENCY,     SPECTRUM/REAL,   SPECTRUM/IMAG
##SYMBOL=    X,             R,               I
##VAR_TYPE=  INDEPENDENT,   DEPENDENT,       DEPENDENT
##VAR_FORM=  AFFN,          ASDF,            ASDF
##VAR_DIM=   131072,        131072,          131072
##UNITS=     HZ,            ARBITRARY UNITS, ARBITRARY UNITS
##FACTOR=    0.0627417313425164, 1,          1
##FIRST=     8223.62146879497, 5209,         -64522
##LAST=      0,             6314,            -64167
##MIN=       0,             -17309,          0
##MAX=       8223.62146879497, 310221542,    0
$$ Real data points
##PAGE= N=1
##DATA TABLE= (X++(R..R)), XYDATA
$$ [...]
67654 79779 80055 80054 79578 78727 78039 78001 78469 78821 78615 77774 76374 74708 73480 73295 73918 74532 74794 75067 75539
67635 75539 75776 75493 75192 75585 76800 78478 80223 81524 81771 80980 80201 80534 81834 82947 83173 82948 83080
67618 83080 83839 84923 85864 86273 86075 85697 85780 86494 87286 87450 86832 85954 85568 86080 87184 88009 87801 86575
67600 86575 85017 83788 83070 82702 82463 82130 81484 80436 79106 77783 76865 76687 77144 77564 77258 76291 75397
67583 75397 75059 74965 74555 73758 72924 72230 71550 70828 70234 69902 69792 69906 70387 71286 72394 73481 74520 75487
67565 75487 76049 75770 74670 73316 72279 71734 71703 72288 73311 73989 73555 72224 71076 70819 71082 71067 70483 69541
67547 69541 68465 67460 66891 67026 67709 68632 69800 71301 72790 73713 74028 74230 74604 74927 74999 75017 75152 75143 74620
67528 74620 73613 72508 71635 71027 70498 69864 69181 68727 68581 68394 67904 67573 68178 69713 71231 71969 72124 72301
67510 72301 72735 73375 74251 75186 75534 74782 73304 72073 71729 72294 73482 74817 75621 75540 75077 75046 75448 75359 74109
67491 74109 72137 70502 69860 70075 70502 70499 69856 68927 68223 67909 67886 68264 69333 70995 72593 73504 73655 73390
67473 73390 73095 73055 73349 73729 73863 73836 74082 74708 75248 75280 74972 74755 74779 75017 75565 76433 77267 77733 77988 78325
67453 78325 78466 77778 76253 74769 74217 74694 75684 76675 77373 77648 77594 77509 77577 77684 77701 77777 78086 78450 78493 78133
67433 78133 77602 77019 76319 75645 75402 75655 75847 75531 75167 75577 76641 77122 76093 74131 72694 72580 73379 74208
67415 74208 74488 74095 73316 72816 73215 74454 75827 76725 77110 77157 76834 76095 75187 74441 73891 73336 72685 72070 71778
67396 71778 72189 73483 75216 76488 76833 76733 76934 77471 77788 77601 77159 76729 76323 75979 75873 76042 76364 76859
67378 76859 77657 78550 78957 78515 77456 76299 75422 75007 75034 75214 75245 75255 75616 76191 76270 75525 74598 74276 74511 74749
67358 74749 74942 75531 76522 77297 77449 77268 77146 76960 76356 75362 74398 73865 73921 74519 75362 75973 76095 76018 76291 77100
67338 77100 78138 79107 80054 81119 82136 82825 83290 83982 85061 86107 86716 87141 87880 88751 88925 88007 86573
67321 86573 85356 84357 83256 82309 82157 82859 83777 84464 85029 85470 85405 84872 84778 85824 87297 87681 86464 84690
67303 84690 83598 83347 83372 83439 83758 84295 84583 84369 84048 84209 84939 85772 86206 86140 85877 85894 86544 87785 89142
67284 89142 90086 90531 90801 91048 90936 90119 88874 87960 87834 88289 88940 89769 90961 92388 93569 94138 94156 93962
67266 93962 93870 94055 94571 95362 96272 97103 97703 98090 98542 99445 100895 102478 103618 104111 104149 103826 102927 101386
67248 101386 99673 98442 97879 97677 97594 97720 98159 98827 99711 101023 102776 104372 104993 104400 103146 102002 101414
67231 101414 101480 102129 103082 103876 104142 103855 103251 102652 102470 103142 104771 106873 108655 109574 109585 109029 108501 108638
67213 108638 109639 110948 111685 111540 111039 110918 111462 112475 113525 114048 113579 112245 110857 110189 110244 110489 110637
67196 110637 110801 111063 111408 112136 113736 116106 118347 119729 120517 121394 122382 122941 123010 123236 123979 124662 124487 123383
67178 123383 121885 120400 119124 118481 118980 120501 122174 123218 123617 123832 124190 124801 125735 126871 127703 127741 127136
67161 127136 126594 126641 127266 128269 129567 130910 131703 131528 130737 130185 130335 130913 131454 131859 132274 132692 132975 133129
67143 133129 133324 133598 133766 133692 133578 133909 135111 137159 139411 140943 141334 141185 141624 143115 144952 146073 146242
67126 146242 146167 146561 147427 148366 149273 150442 152052 153794 155158 155991 156638 157504 158557 159405 159813 159916 159906 159771
67108 159771 159535 159538 160152 161337 162723 164090 165485 166956 168519 170351 172539 174639 175904 176124 175825 175549
67092 175549 175389 175495 176406 178399 180932 183228 185151 186974 188645 189926 191092 192739 194908 196977 198455
67077 198455 199326 199652 199510 199407 200028 201306 202409 202931 203442 204515 205903 207220 208797 211080 213609 215408
67061 215408 216172 216364 216277 215864 215482 215990 217789 220336 222882 225188 227259 228948 230288 231813 233999 236539
67045 236539 238707 240365 242157 244575 247213 249230 250398 251401 253089 255605 258387 260876 263017 265080
67031 265080 267234 269447 271622 273602 275172 276342 277598 279596 282525 285984 289568 293280 297138 300656
67017 300656 303121 304499 305764 308096 311751 315858 319333 321921 324290 327218 330773 334270 336925 338601
67003 338601 340024 342275 345880 350330 354641 358443 362328 366988 372231 377149 381173 384641 388300 392560
66989 392560 397418 402842 408849 415140 420989 425817 429936 434426 440076 446519 452674 457957 462767 467836
66975 467836 473523 479909 487120 495111 503346 511174 518503 525773 533285 540897 548390 555833 563472 571542
66961 571542 580233 589613 599487 609521 619564 629704 639979 650267 660512 670906 681777 693434
66949 693434 706006 719227 732367 744749 756444 768250 780916 794659 809479 825512 842725
66938 842725 860513 878024 894998 912039 929970 948972 968488 987965 1007592 1028083 1049744
66927 1049744 1072053 1094374 1116829 1140102 1164611 1190327 1217305 1245781 1275635 1306316 1337525
66916 1337525 1369470 1402166 1434972 1467254 1499238 1531812 1565735 1601366 1638833 1677962 1718130
66905 1718130 1758645 1799307 1840400 1882259 1925059 1968783 2013059 2057180 2100636 2143552 2186351
66894 2186351 2229168 2271948 2314838 2357935 2400714 2442296 2482378 2521465 2560085 2598155 2635222
66883 2635222 2670882 2704780 2736548 2765977 2793037 2817623 2839488 2858523 2874777 2888180 2898543
66872 2898543 2905946 2910720 2912885 2911984 2907750 2900584 2891025 2878990 2863976 2845876 2825257 2802756 2778485
66859 2778485 2752021 2722851 2690813 2656239 2619711 2581686 2542425 2502173 2461147 2419291 2376414
66848 2376414 2332697 2288713 2244737 2200402 2155449 2110494 2066572 2024024 1982292 1940722 1899070
66837 1899070 1857250 1815157 1772998 1731417 1691034 1652021 1614267 1577697 1542234 1507608 1473400
66826 1473400 1439252 1405042 1371048 1337905 1306140 1275691 1246132 1217312 1189401 1162261 1135364
66815 1135364 1108594 1082655 1058248 1035228 1013004 991369 970368 949661 928823 908208 888768
66804 888768 870816 853612 836409 819345 802968 787368 772190 757169 742271 727537 713156
66793 713156 699433 686346 673330 659844 645934 631993 618224 604721 591816 579868 568832
66782 568832 558501 548985 540457 532516 524365 515660 506688 497727 488811 480221 472507 465679 458861 451226
66768 451226 442969 434975 427756 421145 414852 408882 403366 398271 393326 388151 382467 376321 370073 364126
66754 364126 358732 354024 350044 346623 343400 339991 336068 331323 325610 319208 312708 306579 301003 296026
66740 296026 291537 287141 282543 278103 274518 271790 269066 265745 262228 259247 256936 254935 252902 250495
66726 250495 247350 243644 240248 237688 235354 232434 229257 226834 225285 223649 221265 218477 215860 213549
66712 213549 211549 209934 208456 206574 204251 202127 200586 199216 197548 195778 194289 192875 191028 188741
66698 188741 186548 184850 183547 182252 180625 178584 176385 174438 172951 171875 171087 170383 169363 167752 165863
66683 165863 164289 163056 161623 159829 158233 157246 156555 155800 155206 155020 154783 153819 152106 150127 148114 145976
66667 145976 143725 141474 139259 137393 136606 137159 138051 137908 136576 135108 134234 133646 132903 132165 131652 131071 130065
66650 130065 128818 127731 126861 126025 125191 124380 123429 122227 121058 120327 120031 119817 119537 119409 119555 119614 119023 117634
66632 117634 115924 114557 113769 113279 112721 111987 111128 110162 109165 108362 107860 107423 106779 106057 105571 105271 104752 103858
66614 103858 102904 102227 101798 101400 100886 100155 99179 98284 98086 98797 99705 99724 98548 97036 96326 96667 97329 97580
66596 97580 97513 97678 98159 98463 98339 98150 98120 97714 96394 94777 94276 95488 97450 98711 98763 98168 97643 97337
66578 97337 96842 95681 93855 91963 90664 90058 89775 89593 89587 89694 89585 89114 88502 87863 87000 85952 85354 85811
66560 85811 87111 88388 88945 88628 87640 86417 85606 85733 86751 88073 89035 89249 88652 87519 86439 85986 86254
66543 86254 86741 86717 85784 84219 82777 82033 81861 81683 81250 80928 81114 81630 81881 81471 80582 79888 80112 81266
66525 81266 82266 81761 79691 77575 76872 77444 78081 78124 77876 77626 77188 76503 75953 75727 75399 74561 73584 73258
66507 73258 73820 74613 74760 74047 73157 73027 73947 75303 76298 76774 77127 77601 78044 78302 78418 78356 77936 77185 76419
66488 76419 75786 75019 73885 72561 71319 70174 69192 68936 69995 72039 73762 74089 73237 72370 72286 72769 73272
66471 73272 73839 74871 76089 76378 75074 72999 71643 71424 71372 70571 69328 68618 68867 69690 70577 71383 72150
66454 72150 72756 72877 72268 71162 70234 69917 69786 69045 67684 66678 66764 67504 68003 68128 68426 69097 69776 70344
66436 70344 71240 72720 74298 75304 75736 76152 76826 77328 77077 76157 75424 75620 76475 76954 76515 75801 75811 76661
66418 76661 77562 77880 77695 77374 77132 77170 77670 78409 78722 78173 76997 75660 74323 72972 71756 70797 69951 69159
66400 69159 68835 69453 70862 72450 73917 75344 76505 76699 75648 74152 73436 73903 74823 75210 74766 73995 73582
66383 73582 73826 74599 75674 76852 77802 78005 77172 75648 74151 73131 72625 72683 73538 75212 77267 79179 80700
66366 80700 81666 81773 80966 79838 79195 79233 79503 79656 79792 80049 80260 80202 79862 79287 78541 77975 78138 79088 80087
66347 80087 80380 80058 79744 79701 79711 79667 79688 79603 79005 77995 77363 77746 78971 80434 81702 82476 82480 81827 81119 80690
66327 80690 80124 79065 78158 78373 79508 80191 79537 78059 76743 75952 75646 75938 76701 77079 76233 74529 73331
66310 73331 73561 74910 76507 77762 78410 78299 77552 76663 76033 75565 75036 74751 75378 77048 78924 79948 79881
66293 79881 79386 79205 79503 80018 80474 80688 80584 80429 80855 82195 83922 85174 85820 86447 87215 87412 86544 85239
66275 85239 84466 84228 83769 82903 82339 82612 83335 83735 83422 82456 81151 80055 79709 80129 80805 81417 82164 83209
66257 83209 84251 84969 85465 85874 85912 85389 84895 85332 86790 88397 89314 89424 89001 88189 87124 86252 86199 87250
66239 87250 89027 90699 91666 92080 92545 93188 93400 92742 91745 91273 91344 91216 90578 89839 89132 87930 86134 84850
66221 84850 85277 87189 89203 90381 90870 91045 90844 90205 89549 89376 89669 90072 90413 90753 91053 91199 91278 91515
66203 91515 91879 92001 91589 90751 89884 89370 89436 90052 90807 91094 90643 89844 89309 89174 89092 88882 88846 89284 90055 90888
66183 90888 91885 93289 94854 95911 96166 96057 96117 96281 96132 95603 95050 94648 94144 93343 92556 92270 92507 92784
66165 92784 92698 92327 91998 91956 92385 93502 95230 96839 97385 96692 95680 95419 96012 96628 96582 96043 95637 95598 95519
66146 95519 94919 93871 92947 92603 92813 93379 94291 95460 96332 96376 95992 96247 97433 98562 98835 98955 100056 101791
66128 101791 102646 102125 101421 101517 101772 101140 99923 99293 99484 99574 99010 98452 98833 100198 101764 102745 102842 102217 101314
66109 101314 100585 100224 100181 100409 100962 101814 102698 103241 103318 103299 103851 105266 106961 107972 108033 107898 108390 109452 110407
66090 110407 110782 110480 109494 107965 106358 105043 103885 102744 102210 103036 104840 106164 106103 105215 104434 103770 102684
66073 102684 101262 100299 100301 101008 101882 102625 103169 103534 103835 104247 104861 105671 106603 107432 107761 107320 106282 105115
66055 105115 104187 103596 103270 103039 102726 102467 102848 104365 106636 108476 108965 108294 107433 107100 107283 107624 107971 108374
66037 108374 108762 108866 108482 107674 106677 105752 105164 105124 105558 106040 106149 105902 105683 105798 106307 107207 108459 109737
66019 109737 110461 110292 109487 108624 108132 108196 108843 109854 110764 111267 111577 112106 112840 113383 113710 114470 116251 118679
66001 118679 120607 121185 120576 119611 119019 119112 119912 121216 122588 123637 124446 125443 126784 128126 129233 130451
65985 130451 132226 134362 136180 137360 138146 138720 138892 138614 138332 138509 139022 139325 138992 137905 136175 134241
65969 134241 132857 132577 133221 134022 134285 133747 132511 130913 129381 128134 127042 126025 125457 125876 127277 129057
65953 129057 130726 132358 134197 136177 138099 140057 142337 144961 147675 150443 153578 157170 160629 163197
65939 163197 164864 166405 168358 170337 171616 172115 172434 173059 173961 175015 176327 177978 179730 181222 182345
65924 182345 183370 184819 187070 189821 192022 192832 192694 192953 194317 196242 198032 199817 201959 204149 205837
65909 205837 207182 208793 210650 212061 212659 212829 213043 213360 213749 214398 215440 216667 217639 217942 217403 216361
65893 216361 215558 215357 215128 213983 212040 210350 209450 208631 206901 204167 201069 198109 195382 192921 190903
65878 190903 189520 188789 188402 187832 186856 186010 186163 187538 189499 191300 192595 193176 192931 192358 192482 193674 194943
65861 194943 194975 193626 191910 190742 190139 189465 188021 185554 182567 179978 178104 176232 173605 170565 168158
65846 168158 166788 165919 165071 164465 164474 164931 165277 165149 164621 164104 164071 164699 165728 166794 167761 168481 168534 167776 167071
65827 167071 167787 170345 173734 176691 178881 180666 182282 183770 185389 187499 190081 192767 195289 197557
65813 197557 199354 200410 200823 201060 201427 201831 202162 202637 203576 205127 207429 210790 215265 220125 224194 226881
65797 226881 228605 230102 231595 232841 233675 234118 234171 233937 233904 234685 236385 238533 240680 242776 244916 247152
65781 247152 249680 252808 256506 260297 263850 267378 271214 275402 279950 285112 290892 296567 301230 304718
65767 304718 307602 310411 313289 316210 319002 321219 322530 323315 324495 326787 330517 336051 343800 353721
65753 353721 365325 378330 392874 409077 426957 446864 469284 493844 519130 543956 568380
65742 568380 592975 617522 640953 662280 680947 696450 708239 716005 719593 718621 712607 701550
65730 701550 686005 666582 643745 618201 591056 563374 535821 508873 483006 458436 434887
65719 434887 412078 390411 370847 353969 339340 325939 313157 301249 290849 282197 274833 267955
65707 267955 261071 254397 248654 244384 241445 239234 237360 235905 235035 234648 234525 234551 234642 234718 234987 235933 237671
65690 237671 239630 241291 242981 245350 248335 251362 254582 259047 265420 273209 281703 291049 301939 314644
65676 314644 328920 344588 361735 380465 400831 422905 446647 471899 498737 527518 558307
65665 558307 590490 623252 656102 688617 719996 749391 776468 801229 823467 842747 858688
65654 858688 870914 879101 883661 886088 887886 889241 889357 888045 886208 884628 882983 880270 875624 868459
65640 868459 858388 845467 830164 812717 792732 769636 743276 713887 681842 647778 612751
65629 612751 577947 544229 512085 481792 453384 426652 401414 377807 356211 336924 320012
65618 320012 305356 292758 281994 272741 264493 256748 249477 243206 238312 234357 230553 226859 224092
65605 224092 222745 222157 221209 219584 217992 217225 217290 217535 217458 217212 217248 217641 218093 218643 219915 222353 225655 229458
65587 229458 234161 240348 247669 255178 262812 271606 282261 294451 307857 322956 340232 359397 380092
65574 380092 402670 427464 453783 480512 507367 534766 562703 590474 617238 642066 663619
65563 663619 680675 692984 700945 704484 703036 696550 685626 670533 650948 626935 599445 569575
65551 569575 538078 505974 474777 445556 418300 392722 369112 347790 328309 310049 293315
65540 293315 279053 267561 258178 250153 243160 236938 231218 226262 222823 221163 220488 219746 218627 217419
65526 217419 216162 214500 212293 209895 207711 205772 203936 202248 200905 199986 199384 198927 198424 197684 196701 195808
65510 195808 195491 195992 197170 198698 200210 201306 201661 201292 200565 199898 199541 199588 199899 199956 199254 198072 197483 198210
65492 198210 199762 201150 202237 203805 206375 209654 213290 217527 222711 228498 233962 238318 241270 242835
65478 242835 243168 242545 241308 239813 238378 237055 235371 232599 228496 223611 218709 214152 210058 206693 204216
65463 204216 202178 199811 196886 193922 191501 189740 188490 187646 187023 186320 185543 185207 185717 186711 187487 188059
65447 188059 189241 191477 194029 195799 196693 197632 199286 201350 203206 204827 206635 208823 211250 213841 216631
65432 216631 219435 221803 223352 223939 223666 223044 223012 224250 226375 228270 229274 229616 229615 229165 228368 228001 228701
65415 228701 230029 231026 231474 231939 232658 233180 233191 233031 233038 232966 232460 231727 231268 231099 230654 229424 227450 225233 223363
65396 223363 222220 221833 222037 222764 224101 225999 228125 230179 232214 234435 236724 238528 239207 238446 236492
65381 236492 234138 232263 231088 229980 228216 225879 223712 222188 221166 220467 220258 220583 220992 221168 221698 223669
65365 223669 227434 232240 237152 241885 246519 250862 254660 258318 262804 268625 275248 281826 288322 295556
65351 295556 304132 313612 322905 331266 338743 345722 352322 358273 363154 366542 368061 367505 365001 361032
65337 361032 356262 351293 346378 341175 334903 327070 318149 309375 301726 295211 289209 283304 277612 272454
65323 272454 268052 264580 262248 261075 260584 259904 258309 255720 252605 249382 246023 242329 238421 234679 231164
65308 231164 227477 223319 218950 214865 211287 208211 205724 203870 202297 200501 198445 196645 195530 195015
65294 195015 194803 194825 195280 196493 198791 202199 206029 209039 210343 210094 209114 207983 206725 205273 203879 202978
65278 202978 202831 203440 204694 206379 208087 209380 210307 211689 214495 218731 223237 226862 229656 232546 236076
65263 236076 240012 244145 248736 253878 258929 263099 266327 269214 272220 275243 277796 279239 279018 277040
65249 277040 273805 269907 265494 260448 254911 249273 243715 238116 232476 227099 222319 218258 214913 212315
65235 212315 210557 209741 209814 210368 210815 210971 211243 211958 212775 213188 213305 213539 213706 213183 212099 211491 211905 212476
65217 212476 211966 210269 208333 206914 206034 205579 205759 206842 208759 211080 213184 214522 214986 215012 215081 215226 215269
65200 215269 215374 215845 216408 216238 214930 213002 211189 209604 207931 206116 204432 203029 201906 201237 201274 201918
65184 201918 202787 203810 205308 207285 209062 209978 210222 210605 211605 212940 213938 214018 212963 211106 209288 208211
65168 208211 207715 206952 205352 203118 200734 198459 196497 195284 195149 195845 196759 197488 198001 198303 198261 197739 196791
65151 196791 195738 195130 195487 196888 199011 201700 205211 209673 214621 219517 224513 230143 236326 242313 247779
65136 247779 253418 260178 268199 276821 285374 293675 301916 310369 319196 328355 337656 346956 356307 365956
65122 365956 376148 386755 396939 405472 411721 416165 419575 421754 421571 418265 412251 404544 395868 386466
65108 386466 376282 365047 352629 339618 327213 316231 306551 297774 289918 282981 276318 269220 261929
65095 261929 255412 250141 245714 241681 238088 234983 231932 228465 224705 221262 218641 217005 216345 216568 217366
65080 217366 218158 218314 217595 216432 215637 215658 216190 216648 216882 217157 217597 218104 218849 220397 223073 226534 230247
65063 230247 234145 238451 243010 247196 250531 253072 255071 256549 257419 257871 258328 259006 259752 260337 260694 260738
65047 260738 260185 258867 257124 255530 254221 252742 250694 248278 246092 244663 244293 245018 246339 247210 246657
65032 246657 244428 240851 236276 230989 225536 220627 216556 213068 209915 207221 205177 203633 202292 201154
65018 201154 200498 200460 200786 201061 201084 201034 201286 202060 203258 204659 206257 208375 211500 215996 221876 228758 236063
65001 236063 243317 250149 256059 260543 263696 266381 269394 272577 275133 276695 277606 278234 278657 279238 280847
64986 280847 284049 288433 293223 298298 304057 310340 316012 319736 320932 319945 317641 314927 312323 309620
64972 309620 306072 301150 295124 288818 282847 277262 271964 267211 263483 260872 258849 256847 254981 253993
64958 253993 254468 256186 258248 259703 260148 259911 259749 260185 261039 261702 261898 261936 262110 262137 261516 260300 259136 258493
64940 258493 258243 258123 258255 258851 259661 260199 260522 261280 262733 264161 264645 264205 263625 263259 262561 260948 258578
64923 258578 255924 253025 249648 246012 242802 240449 238762 237362 236172 235375 235044 234961 234791 234470 234390 235029
64907 235029 236344 237839 239422 241803 245664 250823 256790 263798 272468 282518 292676 302149 311471 321531
64893 321531 332390 343493 354501 365369 375978 386269 396506 406915 417228 426957 435915 444045
64881 444045 450944 456020 459001 459842 458285 454066 447566 439805 431644 423276 414551 405596 397029 389699
64867 389699 384074 379709 375501 370737 365711 361018 356513 351427 345299 338227 330303 321492 312177 303234
64853 303234 295270 288145 281389 274719 267992 261097 254177 247673 241887 236734 232090 228138 225177 223273
64839 223273 222177 221372 220217 218456 216704 216044 216856 218353 219423 219587 218956 217748 216245 214885 213960 213442
64823 213442 213460 214629 217436 221473 225741 229631 233282 237124 241510 246628 252284 257774 262470 266620 271232
64808 271232 276997 283644 290386 296666 302315 307241 311196 313838 314978 314831 313888 312458 310533 308293 306370
64793 306370 305090 303689 301019 297092 293325 291005 290064 289652 289422 289765 291066 293197 295625 297720 299112
64778 299112 300076 301458 303915 307313 311052 314821 318760 323016 327581 332524 338087 344456 351643 359609
64764 359609 368318 377659 387487 397746 408421 419343 430203 440767 450968 460854 470571 480342 490289
64751 490289 500287 510119 519682 528884 537436 544919 550966 555208 557121 556230 552394 545711 536281 524469
64737 524469 511287 498033 485407 473393 462133 452453 445147 440019 436047 432371 428861 425816 423494
64724 423494 421938 420984 420357 419923 419961 421107 423953 428599 434509 440809 446949 453148 460048 467789 475533
64709 475533 482035 486551 489068 489776 488537 484843 478250 468878 457526 445115 431956 417798 402701
64696 402701 387561 373517 361024 349793 339480 330056 321610 314169 307755 302432 298270 295425 294054
64683 294054 293923 294308 294658 295246 296764 299416 302836 306741 311025 315205 318537 321004 323564 327026 331104
64668 331104 334975 338264 341037 343227 344663 345439 345666 345025 343110 340148 336878 333753 330749 327945 325662
64653 325662 323931 322357 320824 319943 320424 322242 324770 327570 330803 334854 339820 345460 351545 358171 365663
64638 365663 374197 383581 393425 403367 413095 422430 431596 441167 451364 461532 470687 478441 484942 489931
64624 489931 492471 491789 487914 481233 471946 460387 447514 434526 422044 410039 398437 387419 377179
64611 377179 367793 359428 352353 346591 341722 337189 332740 328556 324993 322213 320046 318209 316628 315400
64597 315400 314515 313894 313740 314502 316269 318551 320989 323969 328100 333300 338974 344985 351922 360378 370527
64582 370527 382493 396408 411780 427334 442052 456068 470143 484461 498351 511028 522054
64571 522054 531141 537934 542132 543525 541850 536865 528629 517605 504490 490141 475435 460800 445934
64558 445934 430433 414834 400551 388508 378183 368427 358968 350624 344143 339360 335677 332910 331319
64545 331319 330991 331622 332912 334821 337226 339569 341227 342240 343288 344751 346016 346011 344365 341699 338773
64530 338773 335653 331897 327331 322383 317703 313644 310094 306741 303469 300473 297977 295906 293999 292247
64516 292247 291013 290625 291087 292247 294008 296197 298433 300462 302498 304989 308094 311651 315531 319696 323951
64501 323951 327993 331851 336014 340997 346932 353623 360769 367963 374738 380855 386501 391998 397371 402256
64487 402256 406156 408709 409846 409860 409363 409038 409367 410546 412585 415351 418508 421406 423183 423189 421453 418588
64471 418588 415126 411080 406416 401735 398027 395665 394108 392801 391947 392035 392878 393655 393838 393618 393279 392544
64455 392544 390774 387655 383408 378397 372811 366835 360916 355568 350909 346670 342810 339815 338155 337680
64441 337680 338003 339325 342369 347419 353965 361431 369751 378994 389019 400060 413202 429627 449507
64428 449507 472141 497084 524620 555165 588794 625471 665366 708763 755938 807150 862474
64417 862474 921591 983886 1048602 1114524 1179635 1241754 1299645 1353136 1402104 1445809 1483226
64406 1483226 1513334 1534852 1546411 1547573 1539217 1522485 1497735 1464939 1424557 1377163 1322644 1260833
64394 1260833 1193100 1122433 1051617 981926 913936 848853 788314 733187 683331 638571 599297
64383 599297 565836 537643 513487 492338 473806 457803 444118 432495 422950 415704 410713 407373
64371 407373 404797 402311 399610 396489 392603 387562 381226 373821 365795 357581 349521 341924 335056 328974
64357 328974 323454 318253 313417 309259 306020 303705 302253 301663 301850 302549 303518 304698 305997 307036 307376
64342 307376 306987 306179 304958 302716 298857 293655 288245 283713 280345 277783 275653 273859 272460 271589 271489
64327 271489 272358 274057 276262 278982 282624 287228 291979 295919 299091 302559 307273 313307 320219 327650
64313 327650 335274 342537 348785 353506 356293 356869 355474 352928 349855 345930 340382 333184 325295 317642
64299 317642 310329 303136 296370 290718 286406 282949 279842 277165 275294 274244 273634 273265 273401 274300 275685
64284 275685 276994 278082 279393 281335 283774 286291 288742 291298 294079 297021 300085 303321 306680 309965
64270 309965 313057 316037 318905 321330 322858 323369 323210 322878 322695 322784 323149 323624 323856 323563 322802 321803 320594
64253 320594 319019 317127 315164 313014 310042 305834 300821 295750 290761 285538 280199 275359 271214 267268
64239 267268 263221 259540 256720 254467 252115 249557 247244 245554 244651 244770 245996 247773 249119 249409 248697
64224 248697 247365 245853 244644 243991 243623 243077 242383 242005 242113 242316 242211 241744 240936 239664 237956 236116 234353
64207 234353 232547 230578 228616 226949 225849 225725 226955 229317 232000 234472 237023 240141 243793 247770
64193 247770 252332 257857 264073 270314 276479 283068 290272 297732 305396 313879 323426 333003 341027 346823
64179 346823 350851 353656 355146 354922 352805 348846 343141 335895 327492 318372 309037 300236 292807 286982
64165 286982 282080 277260 272470 268277 264814 261511 258000 254758 252375 250578 248555 246161 244225 243558
64151 243558 244167 245667 248030 251488 255882 260598 265180 269663 274101 278031 280691 281825 282071 282425 283346
64136 283346 284437 284913 284235 282292 279231 275394 271357 267799 265171 263546 262786 262742 263212 263874 264467 265159
64120 265159 266605 269448 273681 278556 283272 287645 292005 296589 301380 306515 312352 318883 325437 331377
64106 331377 336815 342200 347405 351761 355009 357635 360143 362477 364450 366338 368674 371611 374738 377390
64092 377390 379024 379496 379135 378342 376958 374262 369812 364064 357965 352137 346724 341798 337476 333697 330238
64077 330238 326997 324059 321472 319117 316800 314333 311619 308848 306543 305150 304616 304562 304771 305266 305926 306379
64061 306379 306338 305811 304869 303389 301251 298697 296368 294854 294190 293770 292861 291295 289570 288237 287314 286471
64045 286471 285613 285062 285241 286377 288389 290811 292965 294615 296382 299080 302613 305973 308484 310486 312532
64030 312532 314443 315726 316635 318077 320437 323052 325046 326280 327239 328333 329687 331442 333821 336710 339376
64015 339376 340812 340525 338982 337155 335528 333666 330924 327486 324293 321846 319406 315755 310553 304635
64001 304635 299081 294397 290577 287522 285155 283391 282254 281853 282058 282390 282514 282721 283650 285562 288066 290529
63985 290529 292417 293297 292923 291591 290250 289889 290749 292198 293431 294227 294948 295883 296750 297019 296683 296463 297089
63968 297089 298487 299878 300603 300611 300282 300078 300467 301907 304650 308555 313168 317975 322651 327280 332345 338385
63952 338385 345555 353592 362228 371516 381757 393171 405699 419075 433182 448388 465399 484626
63940 484626 505846 528738 553543 580797 610500 642005 674718 708394 742615 776525 809459
63929 809459 841477 872826 902999 930547 953773 971553 983744 990978 993907 992562 986599 976069
63917 976069 961486 943156 921072 895597 867619 837717 805915 772775 739983 709024 679837
63906 679837 651596 624411 599246 576461 555561 536333 519148 503995 490303 478091 468286 461404
63894 461404 456712 453192 450626 449140 448396 448011 448219 449321 450862 452149 453333 455209 458084 461597 465633
63879 465633 470636 476902 484204 492415 501939 513203 526093 540237 555598 572435 590864 610835
63867 610835 632565 656719 684016 714691 748382 784555 822958 863728 907133 953363 1002478
63856 1002478 1054409 1108958 1165896 1225050 1286129 1348498 1411330 1473966 1535863 1596147 1653539
63845 1653539 1706946 1755895 1800283 1839849 1873961 1901627 1921648 1933176 1936413 1932404 1921794 1904096
63833 1904096 1878456 1844839 1804035 1756913 1704332 1647526 1587838 1525972 1462099 1396854 1331667
63822 1331667 1267886 1205994 1145911 1087665 1031523 977824 927028 879703 836135 796047 758871
63811 758871 724220 691998 662241 635048 610535 588700 569391 552406 537480 524141 511792
63800 511792 500097 489139 479140 470169 462146 454878 448028 441289 434751 428834 423793 419490 415660 412108
63786 412108 408536 404684 400808 397558 395011 392309 388737 384765 381398 378796 376277 373489 370767 368301
63772 368301 365807 363298 361377 360347 359737 359291 359812 362266 366361 370834 375022 379323 384033 388519 391899
63757 391899 393953 394953 395014 394112 392437 390139 386799 381683 374706 366826 359272 352586 346527 340733 335236
63742 335236 330400 326597 323986 322482 321835 321783 322189 323049 324370 326036 327856 329741 331819 334303 337248
63727 337248 340484 343861 347543 351948 357293 363187 368773 373335 376802 379628 382255 384769 387096 389296
63713 389296 391512 393644 395239 395768 394967 392952 390139 387087 384287 381985 380210 378945 378144 377571 376812
63698 376812 375596 374069 372609 371465 370586 369750 368717 367429 366222 365750 366453 368026 369592 370432 370487 370160
63682 370160 369837 369643 369537 369524 369759 370398 371324 372191 372994 374425 377247 381195 384896 387138 388055 388865 390663
63665 390663 393674 397388 401022 403945 406053 407771 409379 410366 409875 407883 405458 403531 401742 399043 395283
63650 395283 391618 389231 388165 387789 388053 389645 392922 397241 401625 405779 410137 415135 420831 427180 434207
63635 434207 441800 449601 457296 464840 472268 479439 486123 492202 497651 502443 506633 510469 514328 518603
63621 518603 523707 529995 537580 546308 556065 566945 579046 592310 606787 622881 641023 661246
63609 661246 683323 707120 732397 758379 784090 809249 834376 859718 884351 906598 925112
63598 925112 939383 949536 955963 958974 958453 954022 945881 935367 924225 913232 901873 889338 875455
63585 875455 860481 844452 827131 808484 788873 768887 749247 730735 713764 697950 682507
63574 682507 667380 653737 642980 635325 629668 624851 620707 617724 616108 615596 616063 617823 621170 625917
63560 625917 631675 638478 646911 657627 670845 686334 703803 723268 745053 769362 795878 823938
63548 823938 853216 884093 917210 952885 991268 1032785 1077644 1124422 1169434 1208021 1236618
63537 1236618 1253720 1259542 1255563 1244346 1228791 1210819 1190873 1168963 1145922 1123224 1101784 1081422
63525 1081422 1061416 1041011 1019375 995678 969711 942172 914037 885802 857629 829996 803748
63514 803748 779429 756889 735703 715784 697444 680884 665826 651739 638402 626083 615021
63503 615021 604830 594749 584511 574645 565690 557483 549538 541811 534521 527373 519687 511455 503671
63490 503671 497224 491972 487368 483605 481477 481214 482088 483307 484798 486939 489958 493837 498430 503320 507811
63475 507811 511513 514883 518870 524020 530142 536712 543241 549238 554240 558122 561166 563669 565685 567312
63461 567312 568975 571094 573600 576069 578274 580333 582330 584163 585814 587458 589102 590362 590884 590935 591416
63446 591416 593352 597444 603981 612968 624293 637902 653835 672057 692346 714457 738401 764478
63434 764478 793073 824568 859455 898265 940959 986032 1030115 1068754 1098137 1116666 1125224 1126146
63422 1126146 1121878 1114299 1104828 1094875 1086077 1080103 1078131 1080531 1087090 1097464 1111233 1127627 1145426
63409 1145426 1163152 1179124 1191489 1198797 1200827 1198491 1192625 1183228 1170225 1154525 1137653 1120407
63397 1120407 1102448 1083169 1062374 1040034 1016042 990544 964104 937169 909692 881625 853529
63386 853529 826235 800002 774401 749145 724828 702743 684010 668841 656585 646478 638324 632358
63374 632358 628554 626432 625653 626509 629572 635080 642947 653215 666131 681740 699734 719766 741788
63361 741788 766032 792762 822019 853418 886228 919913 954641 991016 1029095 1067781 1105394
63350 1105394 1140817 1173958 1205035 1233486 1257663 1275604 1286182 1289657 1287328 1280749 1271226 1259832
63338 1259832 1247567 1235214 1222885 1209813 1194864 1177398 1157569 1135758 1111975 1086121 1058748
63327 1058748 1031125 1004412 978970 954597 931214 909097 888673 870465 855335 844539 839063
63316 839063 838404 839650 838039 829219 811655 787000 758136 727094 694843 662378 631174 602487
63304 602487 576716 553645 533020 514748 498775 485027 473358 463425 454709 446720 439158 431918
63292 431918 425095 418946 413580 408699 403861 399093 394922 391686 389074 386563 384068 381867 380083 378570
63278 378570 377235 376130 375204 374275 373341 372716 372774 373697 375468 377829 380192 381949 383136 384519 386656 389008
63262 389008 390402 390418 389922 390093 391287 393140 395468 398568 402684 407611 412927 418300 423441 428053 432117
63247 432117 436036 440192 444474 448571 452678 457532 463577 470350 476947 482978 488888 495420 502986 511524
63233 511524 520701 530124 539527 548961 558828 569607 581465 594168 607347 620727 634104 647245
63221 647245 660001 672470 684886 697287 709453 721250 732880 744618 756332 767394 777031 784648
63209 784648 789917 792805 793637 792879 790636 786398 779491 769847 758254 745861 733518 721567 710029
63196 710029 698821 687859 677222 667301 658699 651832 646644 642783 640075 638821 639606 642850 648512 656179
63182 656179 665435 676107 688141 701263 714887 728402 741506 754206 766577 778552 789850 799938
63170 799938 808215 814410 818808 821887 823742 824074 822745 820029 816209 811169 804549 796108 785711 773220
63156 773220 758684 742531 725185 706528 686115 664044 641301 619096 598066 578298 559854
63145 559854 542906 527408 512984 499317 486584 475390 466306 459439 454313 450071 445825 441019 435641
63132 435641 430179 425326 421558 418892 416998 415515 414210 412944 411667 410528 409860 409905 410542 411343 411880 411931
63116 411931 411530 410997 410904 411744 413521 415757 417974 420052 422036 423877 425599 427585 430330 433901 438008
63101 438008 442640 448269 455144 462723 470126 476995 483640 490541 498080 506552 515900 525424 534245 542153
63087 542153 549491 556018 560500 561846 560245 556732 551987 546112 539332 532189 525024 517838 510871 504832
63073 504832 500411 497885 497267 498398 500766 503764 507430 512480 519243 527000 534933 543375 553441 565496
63059 565496 578726 592380 606797 622844 640818 660383 681349 703950 728358 754339 781582
63048 781582 810084 839927 870754 901734 932200 962284 992849 1024735 1058031 1091915 1125061
63037 1125061 1156278 1185134 1212236 1238809 1265734 1292887 1319428 1344471 1367238 1386811 1402350
63026 1402350 1413708 1421354 1425360 1424781 1418410 1405991 1388400 1366875 1342426 1315735 1287099 1256570
63014 1256570 1224708 1193176 1163941 1137777 1114134 1092694 1074339 1060193 1050388 1044452 1042409 1044592
63002 1044592 1050585 1059260 1069906 1082561 1097025 1112402 1127972 1143846 1160163 1176180 1190875 1204159
62990 1204159 1216802 1229217 1241053 1252042 1262569 1272938 1282446 1289683 1293708 1294556 1292621 1287865 1279823
62977 1279823 1268174 1252975 1234356 1212283 1186796 1158256 1127145 1093791 1058632 1022693 987333
62966 987333 953305 920321 887753 855603 824586 795497 768791 744654 723078 703761 686115
62955 686115 669545 653755 638760 624656 611351 598602 586351 574936 564741 555649 547128 538930
62943 538930 531319 524394 517604 510364 502981 496439 491265 487077 483327 480075 477696 476060 474329 471684
62929 471684 468116 464502 461878 460606 460199 459873 459234 458493 458212 458850 460350 462066 463363 464456 466403 469946
62913 469946 474559 478950 482387 485180 487996 491174 494681 498209 501137 502773 502950 502178 501098 499977 498862
62898 498862 497869 497077 496364 495648 495203 495461 496507 497936 499168 499804 499682 498787 497189 495097 492946 491298
62882 491298 490525 490538 490959 491555 492382 493549 494922 496060 496297 495043 492333 489066 486405 484756 483548 482027
62866 482027 479976 477559 474842 471822 468797 466394 465131 464992 465365 465438 464868 464101 463889 464428 465266 466074 467135
62849 467135 468749 470492 471511 471532 471254 471699 473337 475767 478046 479335 479486 479061 478750 478785 479025 479432 480237
62832 480237 481651 483598 485822 488167 490762 493926 497854 502292 506598 510206 513037 515450 517941 520913
62818 520913 524468 528160 531043 532307 531965 530835 529786 529117 528611 528058 527581 527538 528170 529407 531009 532825
62802 532825 534929 537558 541024 545571 551200 557719 565124 573751 583775 594709 605897 617509 630560
62789 630560 645705 662571 680614 700180 722152 746823 773631 802041 832225 864916 900920
62778 900920 940652 983730 1028970 1075152 1121857 1169241 1217002 1264028 1309200 1352150 1392934
62767 1392934 1431190 1465902 1495875 1520196 1538270 1549606 1553750 1550496 1540123 1523223 1500170 1470964
62755 1470964 1435817 1395726 1352118 1306027 1258006 1208804 1159575 1111197 1063855 1017661 973368
62744 973368 932011 893963 858773 825957 795575 767931 743062 720763 700954 683637 668497
62733 668497 654854 642220 630808 621273 613947 608486 604235 600695 597541 594494 591482 588874 587344
62720 587344 587444 589305 592619 596787 601237 605767 610529 615671 621196 627357 634815 644070 654944 667107
62706 667107 680942 697326 716541 738005 761236 786489 814144 844021 875752 909412 945115
62695 945115 982149 1019150 1055237 1090550 1125632 1160679 1195468 1229498 1261849 1291258 1316798
62684 1316798 1338334 1355847 1368345 1374011 1371724 1362169 1347111 1327726 1303997 1275605 1242887 1206786
62672 1206786 1168278 1128213 1087481 1046929 1007150 968550 931552 896506 863487 832442 803470
62661 803470 776703 751937 728672 706618 685994 667313 650979 637014 624933 613942 603481
62650 603481 593583 584492 576105 568152 560831 554687 549748 545257 540528 535609 530878 526469 522485 519369
62636 519369 517486 516587 516200 516266 516826 517294 516860 515695 514991 515432 516232 516148 514967 513507 512500 512066 512077 512345
62618 512345 512498 512238 511885 512110 512998 513867 514304 514833 516153 518141 520161 522117 524595 528064 532470 537661
62602 537661 543682 550567 558364 567428 578209 590529 603601 617014 631221 646791 663686 681711
62590 681711 701184 722501 745295 768581 791530 813587 834008 851923 866861 878765 887514 892919
62578 892919 895084 894213 890079 882268 870984 857028 840917 822674 802617 781696 760689 739652
62566 739652 718512 697707 677812 658954 640998 623933 607706 592118 577373 564294 553392
62555 553392 543977 534895 525987 518164 512018 507028 502343 497858 494138 491589 489992 488839 487874 487279 487329
62540 487329 487956 488786 489605 490621 492125 494048 496001 497618 498772 499669 500877 502984 505966 509089 511743
62525 511743 514231 517496 522259 528719 536861 546593 557654 569823 583182 597797 613268 629151 645872
62512 645872 664561 685632 707983 730015 751232 772446 794595 817735 841039 863243 883018
62501 883018 899375 912147 922033 929876 935835 939400 940189 938541 935192 930638 925031 918568 911686 904821
62487 904821 898265 892258 887021 882601 878962 876294 874988 875202 876708 879219 882471 885743 887720 887342 884670
62472 884670 880518 875314 868623 859716 848229 834247 818017 799714 779411 757287 733918 710228
62460 710228 687017 664700 643494 623513 604502 585936 567807 551044 536693 524958 515459 508045
62448 508045 502602 498364 494302 490235 486733 483868 480994 478022 475929 475370 475578 475433 475037 475325 476477
62433 476477 477700 478497 479191 480017 480555 480491 480267 480417 480617 479973 478169 475846 473905 472789 472422 472363 471899 470401
62415 470401 467999 465719 464558 464419 464292 463519 462558 462288 462886 463682 464013 463903 463915 464573 465963 467716 469369
62398 469369 470849 472649 475370 479115 483386 487552 491342 494946 498735 502824 506854 510372 513575 517335
62384 517335 522195 527574 532451 536682 541057 546065 551276 556286 561660 568376 576621 585735 595267 605498
62370 605498 616763 628767 641024 653802 668210 685253 705055 727140 751164 777060 804705
62359 804705 834033 865561 900245 938415 979197 1021368 1064472 1108636 1153551 1198225 1241617
62348 1241617 1282878 1320901 1354242 1381667 1402447 1416144 1422652 1422606 1417163 1406990 1391841 1371340
62336 1371340 1345844 1316339 1283902 1249535 1214030 1177592 1139933 1101167 1062370 1024894 989346
62325 989346 955599 923522 893271 864979 838584 813885 790545 768204 746884 727129 709411
62314 709411 693508 678700 664387 650319 636525 623420 611774 602136 594367 588018 582886 578828
62302 578828 575366 572108 569336 567537 566421 565180 563779 563214 564128 565823 567101 567669 568199 569286 570883
62287 570883 572690 574631 576814 579306 582091 585156 588480 591862 594903 597332 599428 601878 605018 608402
62273 608402 611395 614029 616941 620650 625328 631229 638748 647953 658630 671053 686213 704890 726856
62260 726856 751365 778114 807301 839112 873725 911627 953209 997911 1044272 1091015 1137634
62249 1137634 1183709 1228061 1268984 1305094 1335571 1359672 1376521 1385534 1386827 1381067 1368991 1351148
62237 1351148 1327973 1299978 1267874 1232497 1194550 1154480 1112813 1070631 1029450 990354 953437
62226 953437 918317 885095 854495 827131 803009 781742 762881 745925 730503 716788 705302
62215 705302 695885 687166 677649 667257 657311 648931 641934 635410 628886 622596 616890 611768 606977 602286
62201 602286 597691 593497 590184 588086 587194 587352 588570 590970 594410 598358 602293 606194 610498 615618 621668
62186 621668 628691 636823 645952 655397 664377 672840 681419 690437 699359 707544 715195 723080 731500 740052
62172 740052 748420 756968 766437 777417 790299 805459 823181 843486 866225 891326 918860 948776
62160 948776 980539 1012984 1044663 1074448 1101723 1125938 1146163 1161382 1171215 1176090 1176683 1173338
62148 1173338 1166093 1155068 1140673 1123428 1103580 1081036 1055908 1029167 1002449 976960 952889
62137 952889 930228 909875 893300 881140 872641 866681 862939 861925 864277 870332 880134 893508 910090
62124 910090 929410 951016 974592 1000052 1027293 1055650 1083804 1110641 1136155 1161074 1185559
62113 1185559 1208653 1229037 1245839 1258641 1267255 1271850 1273013 1271433 1267744 1262787 1257664 1253238 1249843
62100 1249843 1247620 1246847 1247784 1250533 1255377 1262945 1273778 1287839 1304570 1323158 1342687 1362494 1382669
62087 1382669 1403801 1426001 1448537 1470737 1492717 1514809 1536648 1557478 1577188 1596609 1616904
62076 1616904 1638970 1663111 1688837 1715168 1741518 1768071 1794963 1821489 1846650 1870075 1891787
62065 1891787 1911389 1928311 1942695 1955284 1966551 1976820 1987158 1999067 2012986 2027889 2042661
62054 2042661 2057000 2070693 2083032 2093749 2103710 2113682 2122697 2128477 2129310 2124760 2114732 2098732 2076235
62041 2076235 2047081 2011218 1968565 1919483 1865077 1806706 1745300 1681348 1615332 1547954 1480034
62030 1480034 1412432 1346077 1281919 1220766 1163197 1109606 1060205 1014938 973449 935276 900108
62019 900108 867818 838244 811090 786158 763550 743460 725720 709738 694975 681419 669508
62008 669508 659633 651793 645701 641068 637649 635110 633191 632197 633031 636265 641202 646276 650366 653209 654550
61993 654550 653786 650891 646892 642595 637410 630364 621845 613202 604776 595613 585325 574926 565296 555941
61979 555941 546088 536152 527122 519180 511909 505482 500553 497107 494365 491888 489997 488966 488507 488201 487860
61964 487860 487299 486301 485098 484450 484969 486601 488883 491456 494270 497630 502102 508057 515212 522894 530795
61949 530795 539142 548163 557845 568337 580056 593140 607213 622042 638112 656164 676353 698203
61937 698203 721229 745174 769634 793862 817131 839202 860222 880160 898483 914608 928673
61926 928673 941520 953628 964236 971961 976263 977923 978046 977042 974782 971326 967146 962858 959037 956133
61912 956133 954342 953651 954236 956666 961448 968457 977085 986900 997951 1010330 1023537 1036371 1047512
61899 1047512 1056278 1062717 1066834 1067921 1064963 1057664 1046585 1032256 1014696 994111 971558 948391
61887 948391 925345 902588 880399 859158 838775 818821 799334 781002 764286 748766 733653
61876 733653 718738 704554 691762 680582 670816 662259 655004 649306 645185 642305 640389 639631 640518 643398
61862 643398 648427 655780 665564 677587 691560 707567 725929 746604 769144 793435 820045 849461
61850 849461 881234 914296 948033 982733 1018894 1056291 1093751 1129766 1163391 1194620 1223803
61839 1223803 1250668 1274058 1292758 1306496 1315972 1322046 1325096 1325164 1322576 1318347 1314005 1311034 1310457 1312902
61825 1312902 1318775 1328000 1339580 1351861 1363532 1374226 1383995 1392396 1398327 1400458 1397578 1388798 1373969
61812 1373969 1353898 1329708 1301915 1270387 1235241 1197338 1157841 1117690 1077760 1039083 1002444
61801 1002444 967860 934851 903210 873296 845615 820429 797789 777694 759993 744245 729853
61790 729853 716371 703626 691554 680004 668736 657636 646928 637119 628617 621328 614640 607859
61778 607859 600751 593659 587110 581318 576140 571472 567459 564179 561239 557999 554286 550660 547802 545757
61764 545757 544015 542254 540713 539725 539186 538787 538634 539205 540565 541992 542732 542934 543430 544675 546361 548207
61748 548207 550611 554130 558647 563514 568456 573815 579864 586290 592530 598411 604298 610745 618091 626258
61734 626258 634940 644042 653795 664211 674614 684190 692888 701279 709503 717046 723788 730479 737668 744782
61720 744782 750971 756334 761445 766025 769150 770740 771748 772585 772340 770078 766136 761475 756375 750541 744108
61705 744108 737705 731688 726058 721059 717130 714116 711135 707491 703358 699423 696255 694175 693297 693342 693644
61690 693644 693658 693372 693050 692733 692177 691159 689647 687788 685890 684354 683386 682707 681672 679707 676566 672269
61674 672269 666973 661053 655167 649926 645390 641060 636575 632307 628902 626281 623565 620192 616616 613506
61660 613506 610665 607332 603394 599624 596727 594756 593582 593278 593737 594404 594768 594821 594724 594381 593679 592866 592333
61643 592333 592178 592310 592753 593520 594337 594802 594746 594245 593421 592398 591180 589379 586435 582431 578390 575325 573261
61626 573261 571577 569913 568167 565959 562914 559429 556458 554462 553173 552405 552403 553268 554711 556545 558746
61611 558746 560799 561701 561026 559433 557719 555922 553793 551566 549691 548253 547271 547229 548563 550815 552945
61596 552945 554532 556158 558613 562109 566239 570252 573338 574996 575244 574377 572628 570241 567573 564790 561573
61581 561573 557541 552783 547661 542253 536429 530295 524068 517560 510361 502559 494787 487458 480368 473173
61567 473173 465877 458790 452339 446999 442943 439650 436261 432470 428715 425325 421911 417882 413232 408572
61553 408572 404610 401820 400346 399865 399627 398876 397266 394903 392195 389686 387849 386871 386768 387625 389512 392122
61537 392122 394872 397463 400049 402766 405434 407851 409985 411626 412194 411270 409162 406675 404423 402560 400991
61522 400991 399607 398342 397141 395862 394243 392121 389679 387167 384419 381049 377262 373973 371850 370580
61508 370580 369373 367861 366166 364397 362560 360758 359108 357517 355878 354345 353134 352148 351103 349882
61494 349882 348541 347066 345442 343869 342674 342081 342169 342872 343846 344646 345270 346214 347691 349171 350115 350747 351587
61477 351587 352532 353099 353389 354044 355216 356284 356759 356902 357267 358111 359356 360724 361744 362056 361867 361711 361714 361493
61459 361493 360897 360333 360199 360478 361086 362138 363582 365054 366423 368088 370316 372614 374156 374691 374741 375072
61443 375072 376171 377983 379950 381535 382965 385191 388853 393576 398513 403285 407994 412601 416765 420246
61429 420246 423061 425258 426840 427975 429117 430824 433380 436465 439248 441221 442975 445641 449354 452773
61415 452773 454601 455148 455804 457291 459100 460489 461226 461259 460369 458522 456101 453408 450166 445882 440644 435300
61399 435300 430727 426961 423102 418201 412251 406171 400834 396442 393017 390977 390682 391543 392219 391785 390356
61384 390356 388575 386926 385608 384613 383671 382388 380688 378993 377873 377603 378028 378664 378979 378874 378903 379750 381459
61367 381459 383415 385021 386133 386939 387875 389633 392691 396635 400366 403249 405774 408941 413342 418956 425362
61352 425362 431881 437931 443574 449458 456011 463134 470836 479569 489456 499729 509648 519588 530456 542182
61338 542182 553559 563583 572208 579712 586014 590928 594582 597216 598871 599416 598621 596118 591708 585866
61324 585866 579585 573507 567577 561744 556533 552564 549787 547595 545531 543539 541707 540075 538663 537429
61310 537429 536296 535373 534961 535116 535425 535558 535905 537216 539693 542817 546140 549884 554590 560447 567112 573920
61294 573920 580124 585124 588766 591354 593183 594068 593508 591338 588011 584111 579772 574898 569938 565990 563743
61279 563743 562598 561374 559875 559106 559714 560865 561263 560922 561226 563333 567117 571729 576552 581356 586051
61264 586051 590733 595774 601604 608470 616490 625685 635753 646096 656282 666366 676677 687458 698821
61251 698821 710722 722756 734227 744627 753802 761435 766717 768956 768289 765376 760528 753674 745072
61238 745072 735509 725591 715284 704355 692990 681785 671386 662322 654931 649165 644602 640907 638213
61225 638213 636895 637040 638295 640185 642428 644988 648006 651752 656477 662224 668757 675678 682591 689172
61211 689172 695202 700631 705602 710316 714838 719122 723310 727954 733758 741096 749869 759887 771239 784244
61197 784244 799181 816128 834943 855323 877018 900030 924465 950179 976853 1004476 1033406
61186 1033406 1063684 1094614 1125336 1155478 1184826 1212576 1237569 1259270 1278043 1294355 1308159
61175 1308159 1319115 1326983 1331640 1333114 1331779 1328122 1322119 1313137 1300705 1285044 1266613 1245430 1221194
61162 1221194 1193959 1164407 1133546 1102236 1070871 1039393 1007746 976397 946225 917896 891632
61151 891632 867581 845957 826669 809275 793638 780173 769152 760195 752942 747781 745243 744919 745694
61138 745694 747011 749228 752638 756806 761222 766153 772445 780710 791029 803264 817304 833039 850375
61125 850375 869501 891049 915775 943968 975255 1009141 1045630 1085023 1127126 1171124 1216423
61114 1216423 1263238 1311976 1362288 1413058 1463103 1511487 1557404 1600332 1640344 1677842 1712828
61103 1712828 1744601 1772193 1794870 1812250 1824179 1830569 1831304 1826402 1816255 1801365 1781709 1756811
61091 1756811 1726707 1692335 1654520 1613189 1568296 1521012 1472982 1424639 1375410 1325590 1276786
61080 1276786 1230236 1185832 1143408 1103893 1068308 1036297 1006654 978922 953616 931173 911507
61069 911507 894524 880265 868438 858355 849499 841825 835486 830596 827274 825624 825693 827593 831560 837660
61055 837660 845594 855001 865721 877545 890112 903547 918895 937294 958739 982216 1007035 1033494
61043 1033494 1062128 1092869 1125182 1158666 1193244 1229002 1266053 1304378 1343612 1383122 1422443
61032 1422443 1461571 1500757 1540105 1579396 1618215 1656247 1693565 1730642 1768002 1805856 1844142
61021 1844142 1882879 1922442 1963555 2007112 2054032 2105465 2163402 2231091 2312504 2411313 2530629
61010 2530629 2673661 2844100 3045750 3282482 3558989 3880985 4254109 4682889 5170717
61001 5170717 5719624 6329282 6997641 7724572 8514914 9377408 10322607 11364081 12516549
60992 12516549 13778046 15099402 16370204 17449378 18229513 18686512 18876388 18891085 18817871
60983 18817871 18726108 18663046 18634496 18582666 18397926 17973832 17266271 16309469 15183972 13972808
60973 13972808 12738832 11524720 10359500 9262683 8247340 7322922 6495710 5767366
60965 5767366 5134650 4590805 4126760 3731864 3395323 3107685 2860939 2647958 2462961
60956 2462961 2302084 2162275 2039754 1930697 1833185 1747081 1671657 1604567 1543510 1487775
60946 1487775 1437443 1391918 1349976 1310650 1273438 1237924 1203757 1170783 1138892 1108015 1078401
60935 1078401 1050421 1023904 998208 973257 949933 929001 910086 892199 874838 858082 841959
60924 841959 826409 811714 798333 786219 774687 763074 751372 740196 730250 721697 713953 706234
60912 706234 698422 691135 684884 679493 674548 670007 666028 662519 659220 656010 652784 649216 645009 640166
60898 640166 634736 628569 621733 614920 608887 603653 598654 593542 588318 582825 576758 570263 563956 558153
60884 558153 552521 546633 540507 534452 528721 523541 519188 515787 513201 511177 509445 507669 505635 503532
60870 503532 501780 500515 499592 499148 499752 501738 504678 507747 510465 512929 515587 518900 523054 527806 532726
60855 532726 537604 542364 546630 549867 552113 554145 556614 559340 561725 563472 564534 564744 564030 562753 561292
60840 561292 559377 556310 551805 546176 539772 532764 525500 518524 512045 505789 499568 493669 488446 483865
60826 483865 479671 475770 472289 469469 467675 467123 467344 467244 466121 464496 463583 464038 465607 467884 470823
60811 470823 474364 478033 481346 484420 487832 491930 496527 501279 506042 510779 515336 519522 523388 527209
60797 527209 531104 534816 537967 540537 542911 545336 547471 548714 549004 549013 549351 549720 549209 547354 544569 541464
60781 541464 538133 534358 530209 526005 521807 517338 512414 507122 501559 495756 489985 484782 480473 476899
60767 476899 473702 470623 467393 463766 460018 457121 455934 456297 457251 458048 458546 458773 458652 458306 458148 458402
60751 458402 458833 459164 459482 459958 460425 460657 460977 462267 465228 469723 474837 479479 482994 485444 487410 489463
60735 489463 491744 493991 495949 497711 499656 502069 504817 507437 509629 511659 514156 517469 521292 524898
60721 524898 527632 529224 529873 530208 530967 532368 533778 534207 533280 531618 530141 529073 527799 525720 523064
60706 523064 520656 518960 517574 515737 513143 510084 506947 503804 500446 496610 492225 487677 483655 480436
60692 480436 477386 473697 469691 466759 465680 465528 464840 463470 462565 462899 464060 465400 466955 469007 471361
60677 471361 473601 475709 477866 479911 481594 483293 485864 489673 494126 498287 501649 504269 506553 509026
60663 509026 511944 514955 517449 519479 521931 525393 529016 531014 530351 527743 524939 523191 522432 521773 520664
60648 520664 519552 519344 520300 521745 522885 523563 523940 523850 523016 521790 521033 521085 521259 520629 519089 517459 516780
60631 516780 517506 519162 520662 521257 521290 521782 523232 525222 527286 529658 532746 536236 539251 541320 542819
60616 542819 544485 546742 549414 551884 553622 554744 555940 557742 560028 562422 564838 567420 570247 573434
60602 573434 577129 581005 584123 585879 586847 588100 589977 592125 594506 597389 600408 602623 603857 605182
60588 605182 607640 611041 614381 616899 618332 618639 618029 616985 615869 614738 613677 612875 612130 610793 608618
60573 608618 606244 604426 603252 602517 602415 603339 605313 608132 611692 615742 619760 623717 628476 634696 641634
60558 641634 647903 653144 658024 662708 666472 669049 671319 674084 676915 678930 680313 682378 686267 691929
60544 691929 698307 704270 709464 714478 720119 726546 733284 739996 746842 753969 761082 767785 774085 780334
60530 780334 786865 793872 801437 809526 818151 827595 838245 850084 862659 875708 889546 904623 920930
60517 920930 938064 955637 973497 991728 1010586 1030199 1050213 1070050 1089721 1110024 1131606
60506 1131606 1154032 1176103 1196908 1216284 1234505 1251952 1269049 1286034 1302629 1318011 1331185
60495 1331185 1341390 1348426 1352849 1355646 1357390 1357689 1355659 1350781 1342970 1331961 1317174 1298387 1276169
60482 1276169 1251310 1224039 1194081 1161507 1127267 1092824 1059337 1027288 996795 968069 941330
60471 941330 916331 892294 868622 845598 824130 804720 786902 769827 753155 737141 721981
60460 721981 707535 693879 681727 671789 663709 656093 647743 638583 629241 620187 611596 603664 596425
60447 596425 589402 582078 574750 568321 563048 558096 552666 547050 542081 537814 533366 527993 521891 515893
60433 515893 510745 506729 503661 501098 498690 496448 494536 492808 490724 487865 484426 481073 478317 476111
60419 476111 474094 472153 470615 469851 469829 470256 471045 472366 474108 475593 476031 475235 473771 472468 471865 472064
60403 472064 472862 473942 474970 475673 475970 476017 476016 475940 475651 475342 475536 476436 477592 478599 479833 481935 484741 487369
60385 487369 489354 490974 492343 492964 492635 492119 492307 493065 493487 493034 491963 490859 490207 490236 490684 490786 489919
60368 489919 488202 486270 484660 483718 483770 484800 486089 486664 486154 484948 483659 482785 482672 483329 484336 485279
60352 485279 486184 487210 488195 488986 489933 491448 493252 494797 496270 498418 501367 504430 507255 510304 513933
60337 513933 517747 521356 525123 529608 534736 540056 545427 550921 556324 561264 565645 569523 572700 574792
60323 574792 575618 575217 573647 570994 567440 563112 558123 552936 548398 545114 543029 541953 542137 543909 547012
60308 547012 550841 555165 560178 565954 572370 579519 587607 596370 605070 613254 621049 628469 634754 638775
60294 638775 639964 638609 635321 630469 624167 616628 608335 599835 591409 583097 575023 567512 560834 555042
60280 555042 550209 546606 544330 542871 541362 539317 536883 534369 531823 529200 526687 524592 522920 521260
60266 521260 519204 516903 515139 514748 515927 518150 520769 523540 526552 529818 533189 536605 540224 544204
60252 544204 548438 552509 555900 558274 559609 560032 559597 558306 556345 554081 551732 549229 546485 543600 540603
60237 540603 537257 533433 529643 526876 525810 526313 527672 529222 530761 532546 534950 538093 541776 545694
60223 545694 549511 552804 555303 557443 560320 564713 570188 575507 579860 583426 586911 590951 595902 601724
60209 601724 607884 613712 618980 623942 628805 633507 638049 642649 647355 651829 655737 659078 661944 664297
60195 664297 666204 667973 669771 671401 672740 674045 675332 675855 674891 672961 671473 670990 670516 668849 666007
60180 666007 662872 659955 657229 654797 652864 651002 648301 644624 641097 638959 638313 638457 638961 639788 640636
60165 640636 641031 641162 641947 643955 646780 649795 653066 657016 661555 666121 670435 674666 678868 682810 686490
60150 686490 690353 694694 699167 703205 706753 710282 714220 718702 723868 730004 737158 744800 752170 759085
60136 759085 766264 774680 784489 794629 803567 810510 815875 820547 824727 827635 828362 826838 823773 819733
60122 819733 814705 808724 802589 797456 793759 790973 788466 786190 784372 782993 781935 781353 781443 781924 782131
60107 782131 781658 780646 779463 778322 777221 775990 774420 772527 770738 769596 769276 769527 770008 770482 770817 771134
60091 771134 771936 773696 776298 779174 782074 785303 789166 793612 798622 804421 810913 817256 822472 826281
60077 826281 828851 829956 828992 825892 821380 816078 809833 802369 794247 786540 779552 772377 764009 754498
60063 754498 744705 735231 726108 717489 709919 703620 697922 691952 685687 679897 675179 671489 668546 666125
60049 666125 663874 661409 658938 657379 657498 659151 661642 664585 668074 672229 676906 681776 686390 690260
60035 690260 693165 695319 697041 698361 699084 699028 697953 695522 691733 687147 682182 676258 668232 657767 645867
60020 645867 633915 622631 612082 602206 592967 584259 575995 568179 560755 553621 546915 541068 536416
60007 536416 532960 530578 529083 527951 526525 524881 524107 525157 527653 530327 532514 534649 537399 540898
59993 540898 544952 549370 553880 558170 562312 566786 571809 576921 581512 585465 588997 592166 594880 597119
59979 597119 598763 599384 598686 597012 594943 592448 588991 584574 580120 576507 573599 570654 567396 564259 561658
59964 561658 559447 557211 554806 552481 550578 549192 548033 546621 544739 542684 540945 539660 538608 537730
59950 537730 537410 537952 538965 539604 539500 539172 539305 539756 539590 538142 535754 533259 530932 528294 524908 521058
59934 521058 517459 514582 512415 510712 509198 507661 506141 505022 504640 504805 504941 504763 504570 504810 505656 507116
59918 507116 509223 511836 514480 516680 518340 519637 520763 522113 524412 528080 532465 536327 539268 542194
59904 542194 546085 550785 555434 559650 563660 567450 570554 572848 574988 577721 581097 584653 588104 591579
59890 591579 595353 599617 604402 609517 614650 619721 624954 630415 635702 640458 645017 650071 655697 661189
59876 661189 665962 670186 674216 677784 680153 680873 679956 677423 673163 667365 660731 654015 647492 641040 634622
59861 634622 628495 623000 618282 614284 610957 608436 606941 606461 606582 606843 607247 608254 610165 612720 615539
59846 615539 618845 623427 629842 637797 646388 654684 661972 667725 671726 674227 675780 676877 677932 679551
59832 679551 682414 686634 691408 695583 698482 700000 700047 698333 694803 689963 684457 678406 671364 662960 653422
59817 653422 643477 633839 624811 616255 607861 599527 591585 584694 579393 575660 572927 570604 568579 567105
59803 567105 566255 565681 565004 564257 563714 563354 562713 561319 559079 556193 552821 548954 544621 540195 536415 533928
59787 533928 532677 531854 530677 529173 528042 527869 528748 530510 532846 535120 536594 537136 537415 538105 539145 540059
59771 540059 540767 541686 543152 545086 547164 549028 550425 551428 552522 554162 556229 558136 559515 560599 561942
59756 561942 563939 566575 569447 572074 574344 576563 578990 581494 583887 586251 588538 590131 590439 589873 589635
59741 589635 590456 592040 593781 595433 596892 598023 599039 600499 602511 604383 605483 605986 606290 606234 605564 604777
59725 604777 604699 605381 606186 606894 607917 609332 610511 611042 611329 611856 612387 612438 612199 612429 613583 615440 617461
59708 617461 619179 620355 621143 622052 623362 624571 624723 623405 621192 619098 617764 617149 616708 615802 614234 612546
59692 612546 611572 611558 611902 611932 611677 611596 611745 611648 611033 610301 610098 610662 611755 612990 613991 614405 614059 613074 611680
59673 611680 609989 608128 606402 605044 603832 602326 600476 598709 597364 596410 595800 595747 596411 597707 599646
59658 599646 602496 606226 610026 612876 614478 615238 615466 615146 614552 614513 615695 617851 619984 621181 621247 620747
59642 620747 620519 620881 621157 620270 617975 615294 613507 612950 613062 613327 613743 614459 615500 617055 619612 623421
59626 623421 627936 632092 635285 637917 640923 644828 649386 653999 658184 661497 663278 662965 660792 657860
59612 657860 655293 653452 652143 651324 651237 651938 653138 654640 656575 659004 661562 663817 665798 667783 669552
59597 669552 670252 669200 666634 663428 660190 656824 652947 648474 643723 639078 634728 630688 626969 623616
59583 623616 620561 617484 613959 609930 606003 603083 601572 600993 600441 599308 597563 595533 593664 592376 591876
59568 591876 592018 592523 593367 594820 597024 599728 602553 605374 608319 611474 614814 618394 622359 626657 630819
59553 630819 634275 636972 639635 643181 647778 652582 656577 659686 662891 667306 673328 680657 688829 697496
59539 697496 706460 715807 726077 738077 752433 769219 787778 806615 823715 837527 847968 856343
59527 856343 864141 872034 880026 888176 896761 905826 914972 923717 931808 938963 944529 947740 948390 946976
59513 946976 943965 939067 931542 921261 909155 896458 883773 871149 858881 847725 838243 830238
59501 830238 823019 816075 809498 804038 800835 800750 803653 808519 814379 820988 828516 837004 846491 857247
59487 857247 869357 882271 895379 908971 924035 941098 959847 979967 1001674 1025158 1050123
59476 1050123 1076245 1103535 1131754 1159946 1187064 1212635 1236215 1256667 1272835 1284848 1293975
59465 1293975 1301285 1307317 1313194 1321111 1333226 1350568 1373415 1402080 1436750 1477031 1522274 1572174
59453 1572174 1626473 1684207 1743788 1803875 1863919 1923997 1984457 2045382 2105518 2161211 2206493
59442 2206493 2234582 2239839 2219368 2173989 2108156 2028424 1941254 1851617 1762957 1677625 1597042
59431 1597042 1521838 1452257 1388503 1330771 1279255 1234333 1196552 1166204 1142955 1126014 1114627
59420 1114627 1108332 1106821 1109656 1116117 1125311 1136407 1148689 1161333 1173476 1184793 1195726 1206459
59408 1206459 1215426 1219425 1215677 1203799 1185667 1163770 1139951 1115264 1090399 1066207 1044199 1026316
59396 1026316 1013555 1004483 995470 982840 965027 942949 918766 894442 871085 849079 828509 809408
59384 809408 791694 775187 759937 746468 735387 726698 719742 713884 708952 704860 701149 697346 693684
59371 693684 691054 690032 690147 690333 690051 689833 690655 692981 696585 701199 706984 714224 722945 733240 745760
59356 745760 761317 779867 800335 821678 843759 866971 891432 916992 943739 971886 1001095
59345 1001095 1030385 1058854 1086177 1112242 1136453 1157606 1174421 1186290 1193553 1196970 1196714 1191952
59333 1191952 1181633 1165661 1145054 1121032 1094297 1065174 1033975 1001091 967076 932962 900201
59322 900201 869962 842547 817698 795267 775336 757778 742099 727863 715111 704184 695193 687787
59310 687787 681586 676744 673774 672715 672816 673408 674784 677659 681963 686908 692294 698858 706929 715579 723764
59295 723764 731643 739834 747713 753434 755753 755087 752717 749607 746192 742683 739266 736282 734370 734165 735828
59280 735828 739245 744543 751919 761055 771407 783181 797286 813996 832300 850932 869468 887988
59268 887988 906230 923673 940032 955003 967765 977303 983147 985385 984121 979419 971679 961654 950074
59255 950074 937515 924487 911322 898117 885071 872717 861497 851363 842216 834545 829144 826275
59243 826275 825554 826550 829004 832591 837079 842805 850454 860165 871214 882663 893897 904418 913561 920727
59229 920727 925579 927864 927343 924025 918135 909652 898196 883651 866687 848405 829636 810787 792130
59216 792130 773902 756160 738833 722046 706360 692606 681414 672704 665664 659323 653215 647437
59204 647437 642205 637563 633435 629639 625879 622021 618442 615731 613928 612394 610616 608784 607319 606112
59190 606112 604667 602870 601269 600582 601147 602916 605688 609220 613259 617694 622736 628799 636060 644158 652535
59175 652535 661127 670530 681396 693859 707744 722999 739525 756757 773908 790689 807372 824109
59163 824109 840556 856235 870773 883594 893821 900875 904917 906401 905363 901410 894294 884273 872052
59150 872052 858527 844449 830184 815852 801725 788167 775133 762084 748682 735259 722337
59139 722337 710003 698101 686762 676322 666838 658103 650100 643066 637152 632373 628855 626772 625965
59126 625965 626007 626775 628672 632087 636779 641999 647212 652590 658761 666078 674203 682505 690813 699499 708776
59111 708776 718289 727620 736882 746425 756154 765633 774824 784222 794112 804049 813286 821458 828643 834954
59097 834954 840325 844654 848006 850587 852496 853448 852905 850703 847531 844495 842074 839681 836379 831845 826497
59082 826497 820837 814977 808743 801930 794328 785707 776004 765530 754805 744182 733784 723845 714827
59069 714827 706997 699985 693061 685874 678705 672061 666258 661380 657329 653812 650585 647776 645662 644044
59055 644044 642242 639947 637607 635586 633324 629867 625071 619778 614906 610820 607488 604691 602027 599202
59041 599202 596511 594640 593884 593924 594441 595483 597089 598972 600938 603274 606423 610508 615481 621478 628685
59026 628685 637071 646550 657247 669225 682045 694966 707571 719935 732205 744288 755910 766613
59014 766613 775693 782592 787615 791977 796820 802222 807389 811767 815738 820173 825519 831581 838224 846018
59000 846018 855857 867919 881298 894910 908539 922677 937402 951825 964788 975801 985113 993094
58988 993094 999812 1005057 1008441 1009515 1008001 1004010 997941 990217 981283 971721 962078 952556 943169 934287
58974 934287 926800 921557 918765 918035 918899 921176 924973 930446 937512 945715 954466 963419 972449 981295 989492
58959 989492 996749 1003115 1008583 1012754 1015043 1014956 1012041 1005953 996922 985843 973458 959693 944283 927868
58945 927868 911934 897708 885489 874995 865865 857918 851419 847058 845104 844536 843541 840926 836520 830292
58931 830292 821930 811577 800176 788567 776834 764991 753722 743738 734811 726151 717555 709658 703237
58918 703237 698735 696293 695716 696538 698507 701838 706583 712038 717371 722723 729170 737611 748158 760470
58904 760470 774100 788510 803418 819340 837295 857713 879969 903147 926894 951272 976112
58893 976112 1000979 1025731 1050881 1077290 1105593 1135896 1167975 1201589 1236434 1271785 1306399
58882 1306399 1338875 1367944 1392533 1411962 1426247 1435729 1440088 1438031 1428348 1411047 1387152 1357793
58870 1357793 1323906 1286522 1246800 1205917 1165278 1126479 1090479 1057018 1025425 995811 968871
58859 968871 944770 922982 903120 885130 868628 852887 837692 823513 810642 798781 787706
58848 787706 777629 768562 759973 751508 743562 736647 730563 724599 718264 711538 704696 698226 692605 687852
58834 687852 683488 679102 674676 670211 665512 660616 656016 652095 648673 645530 643130 642338 643474 645937
58820 645937 648686 650995 652908 655151 658437 662695 667146 671149 674684 677931 680776 682939 684257 684632
58806 684632 684075 683044 682334 682288 682366 681823 680515 678719 676524 673897 671205 669184 668299 668349 668674 668640 668122 667742
58788 667742 668457 670720 674163 678202 682698 687842 693695 700115 706870 713487 719254 723813 727686 731827
58774 731827 736622 741491 745449 747936 749238 750223 751582 753162 754205 754297 753854 753531 753458 753327 752992 752672 752665
58757 752665 753125 754136 755826 758414 762098 766758 771865 776927 781966 787163 792128 796162 799414 803134
58743 803134 808354 814805 821544 828148 834713 841078 846818 852006 857428 863876 871424 879381 886883 893672
58729 893672 900464 908309 917447 927091 936484 945679 955023 964431 973656 982797 991958 1000793 1008995 1016927
58715 1016927 1025069 1033042 1039964 1045641 1050672 1055368 1059327 1062198 1064108 1065024 1064263 1061074 1055393 1047625
58701 1047625 1037894 1025855 1011230 994314 975860 956405 935827 913834 890979 868873 849079
58690 849079 831994 817031 803542 791148 779404 767805 756213 744872 734004 723685 714099 705529
58678 705529 698093 691783 686697 682944 680386 678781 678155 678717 680488 683354 687430 693046 700396 709462 720120
58663 720120 731946 744097 755822 767048 778013 788327 796894 802829 806136 807491 807710 807383 806584
58650 806584 804865 801884 798041 794112 790267 785979 781009 776053 772071 769327 767323 765575 764224 763928
58636 763928 765220 767994 771658 775777 780372 785544 791092 796641 801823 806202 809470 812069 815047 818782
58622 818782 822345 824907 827362 831691 838848 848212 859080 871664 886348 902818 920352 938337 956054
58609 956054 972489 986826 998835 1008511 1015686 1020248 1022425 1022593 1021092 1018443 1015443 1012761 1010560 1008612
58595 1008612 1006631 1004534 1002638 1001541 1001585 1002561 1004338 1007414 1012278 1018465 1025140 1032523 1041759 1053148
58581 1053148 1065543 1077904 1090525 1104004 1117805 1130755 1142441 1153201 1163054 1171584 1178891 1185802
58569 1185802 1192886 1199836 1206163 1212159 1218820 1226892 1236223 1246064 1255938 1266065 1276885 1288265 1299336
58556 1299336 1308965 1316177 1320287 1321105 1319091 1314921 1308757 1300228 1289282 1276700 1263530 1250290 1236941
58543 1236941 1223423 1209883 1196435 1182893 1168809 1153862 1138298 1122913 1108460 1095176 1083047
58532 1083047 1072262 1063043 1055270 1048745 1043760 1040873 1040145 1041058 1043150 1046262 1050263 1055163 1061467 1069625
58518 1069625 1078916 1087598 1094573 1100372 1106125 1112057 1117435 1121549 1124308 1126132 1127742 1129902 1133065 1137220
58504 1137220 1142058 1147137 1152043 1156838 1162297 1169203 1177381 1185958 1194513 1203274 1212122 1220289 1227389 1233906
58490 1233906 1240139 1245332 1248443 1249227 1247990 1244860 1240022 1234306 1228762 1223825 1219439 1215809 1213407 1212348
58476 1212348 1212288 1212899 1213949 1214933 1215068 1213778 1210911 1206372 1199804 1190786 1179406 1166584 1153623 1141196
58462 1141196 1128938 1116325 1103765 1092252 1082039 1072387 1062832 1054047 1047110 1042412 1039617 1038214 1037735
58449 1037735 1037754 1038034 1038426 1038523 1037835 1036375 1034557 1032378 1029346 1025503 1021826 1019215 1017665 1016880 1017055 1018564
58433 1018564 1021384 1025388 1030788 1037712 1045757 1054464 1063949 1074634 1086652 1099807 1113730 1127763 1141189
58420 1141189 1153895 1166255 1177981 1187751 1194549 1198827 1201739 1203711 1204393 1203509 1201049 1196975 1191384 1184725
58406 1184725 1177344 1169153 1160162 1150969 1142261 1134368 1127752 1123302 1121421 1121333 1121950 1122979 1124553 1126370 1128079
58391 1128079 1129957 1132266 1134228 1134580 1132871 1129444 1124479 1118058 1110875 1103759 1096505 1088175 1078697 1069233
58377 1069233 1060692 1052773 1044907 1037567 1032056 1029181 1028459 1028683 1029223 1030721 1034259 1039913 1046565 1053278 1060230
58362 1060230 1068024 1076769 1086399 1097271 1109652 1122951 1136071 1148263 1159115 1168109 1174837 1179418
58350 1179418 1182233 1183547 1183855 1184133 1185216 1187198 1189905 1193451 1197905 1203026 1208877 1216107 1225011 1235051
58336 1235051 1245987 1258684 1273823 1290496 1307117 1323223 1339290 1355280 1370560 1384978 1398879
58325 1398879 1412170 1424312 1435176 1445081 1454167 1462486 1470536 1478938 1487774 1496919 1506693 1517532 1529350
58312 1529350 1541882 1555185 1569153 1583252 1597503 1613073 1630887 1650217 1669582 1688481 1707314
58301 1707314 1726275 1745402 1765077 1785373 1805483 1824804 1843900 1863364 1882695 1901529 1920972
58290 1920972 1942124 1964195 1985829 2007477 2030575 2055034 2079654 2104602 2131307 2159984 2189373
58279 2189373 2219017 2249853 2282321 2315667 2349445 2384182 2420303 2457789 2496985 2538384 2581650
58268 2581650 2626232 2672733 2722251 2774637 2828991 2885586 2945513 3008599 3073472 3139622 3207710
58257 3207710 3277998 3350177 3424497 3501336 3579920 3659400 3740794 3825900 3914688 4006012 4100596
58246 4100596 4200893 4308085 4421499 4540902 4667008 4799811 4938878 5085394 5241660
58237 5241660 5408660 5586360 5775975 5979324 6196349 6426179 6670363 6932088 7212588
58228 7212588 7511623 7831272 8175702 8547309 8946947 9378209 9847687 10360575 10919852
58219 10919852 11530392 12200323 12938161 13752667 14656057 15663643 16790647 18054299 19479932
58210 19479932 21101218 22955572 25085810 27547585 30410444 33751770 37655111 42212342
58202 42212342 47516875 53650158 60678369 68659528 77642330 87653186 98687622 110709465
58194 110709465 123648675 137410626 151918083 167162721 183216084 200198908 218234835
58187 218234835 237330194 257079052 276294259 292943259 304685409 309795615 307844418
58180 307844418 299679092 286828042 270823851 252830260 233625017 213775249 193813559
58173 193813559 174294834 155728792 138483637 122756366 108612334 96032653 84938759
58166 84938759 75212736 66723417 59341085 52936034 47379815 42555844 38364205 34715586
58158 34715586 31528534 28734876 26280474 24117411 22200371 20491851 18964380 17594563
58150 17594563 16359310 15239405 14221494 13293997 12444924 11665374 10950847 10296899 9696701
58141 9696701 9144244 8636256 8169280 7738156 7338871 6969699 6627975 6308808 6008477
58132 6008477 5726283 5461738 5212773 4978109 4758446 4553621 4361040 4178488 4006223
58123 4006223 3844792 3692967 3549350 3414054 3287307 3167966 3054790 2947764 2847170
58114 2847170 2752617 2663693 2580179 2501173 2425526 2353503 2286272 2223513 2163420 2105359 2050396
58103 2050396 1998761 1949041 1900614 1854637 1811695 1770537 1730201 1691410 1654754 1619280 1584134
58092 1584134 1550004 1517798 1487292 1458059 1430357 1404196 1378919 1354501 1331862 1311083 1290769
58081 1290769 1269997 1249385 1229421 1209334 1188637 1168253 1148976 1130176 1111169 1092568 1075122
58070 1075122 1058392 1041744 1025624 1010700 996683 983070 970201 958618 948083 938055 928410
58059 928410 919024 909500 899900 890886 882519 873836 864188 854015 843846 833669 823790 815067 807588
58046 807588 800365 793019 786487 781253 776269 770615 764928 760091 755696 750991 746222 741740 736802 730685
58032 730685 724156 718477 713521 708199 702254 696440 691243 686491 681925 677248 672062 666594 662078 659479
58018 659479 658221 656896 654807 652069 648802 645157 641791 639379 637856 636793 636152 636042 636106 635833 635230 634652
58002 634652 634304 634329 634888 635742 636287 636474 637026 638301 639647 640397 640726 640837 640134 637998 634670 630545 625280
57985 625280 618536 611087 604289 598834 594688 591617 589013 585825 581641 577398 574228 572035 569936 567514
57971 567514 564806 561686 558244 555288 553447 552180 550612 548927 547875 547260 546045 543855 541423 539587
57957 539587 538590 538238 538003 537175 535547 533679 531868 529325 525236 520211 515745 512457 509800 507260 504881
57942 504881 502738 500785 499180 498023 496936 495676 494949 495735 497945 500592 503046 505301 507155 508200 508603
57927 508603 508960 509318 509170 508408 507409 506169 504279 501867 499695 498116 496711 495137 493562 492030 490146
57912 490146 487693 484988 482331 479602 476603 473377 470056 466793 463889 461561 459577 457554 455492 453523
57898 453523 451351 448546 445331 442376 439887 437577 435482 433965 432873 431522 429715 428033 426871 425819
57884 425819 424331 422470 420723 419500 418979 419002 419070 418873 418812 419394 420145 419856 418025 415361 412664 409964 407073
57867 407073 404215 401634 399126 396467 393896 391753 389969 388323 386899 385903 385312 384996 384981 385272 385688 386200
57851 386200 387253 389405 392617 396132 399128 401493 403966 407421 411890 416467 420248 423147 425603 427803
57837 427803 429643 431154 432419 433117 432664 430818 427777 423819 419339 415090 411706 408941 405912 402218 398347
57822 398347 394958 392274 390239 388765 387664 386745 386038 385599 385215 384801 384868 385846 386971 386649 384101 380018
57806 380018 375450 370783 365978 360929 355253 348445 340785 333507 327639 323178 319694 317028 314897 312489
57792 312489 309219 305431 301780 298330 294887 291800 289598 288053 286421 284567 283187 282832 283310 284167 285280
57777 285280 286773 288702 291014 293584 296169 298508 300561 302557 304743 307200 309851 312502 314910 316946
57763 316946 318730 320438 322013 323168 323713 323777 323648 323370 322588 320868 318251 315437 313298 312165 311636 311056
57747 311056 310152 309237 308779 308720 308338 307054 305350 304414 304681 305191 304769 303374 301773 300294 298616 296578 294438
57730 294438 292317 290193 288518 288098 289060 290586 291940 293210 294717 296243 297367 298171 299108 300292 301265
57715 301265 301382 300267 298028 295160 292155 289170 286217 283541 281417 279677 277891 276071 274716 274082 273850
57700 273850 273570 273004 271997 270573 269201 268369 267805 266794 265436 264820 265615 267281 269088 271117 273664 276440
57684 276440 279232 282840 288427 296202 305530 316155 328557 343136 359671 377574 396175 414887
57672 414887 433615 452948 473550 495562 519101 544885 573304 602631 628840 647570 656142 653959
57660 653959 641945 622009 596498 567489 536542 505126 474848 446991 422060 400015 380736
57649 380736 364048 349532 336729 325529 316197 308906 303371 298965 295175 291901 289325 287530 286282
57636 286282 285160 283833 282232 280556 279056 277725 276270 274586 273154 272634 273049 273724 274074 274088 273902 273338
57620 273338 272175 270508 268480 265971 262996 260210 258489 257987 257930 257396 256127 254610 253589 253439 253824 254023
57604 254023 253654 252951 252285 251695 251095 250630 250491 250632 250959 251534 252225 252455 251758 250434 249128 247880 246140
57587 246140 243731 241241 239340 238185 237639 237605 237870 237935 237330 235960 234025 231817 229748 228277 227523 227033
57571 227033 226191 224786 223092 221459 220038 218880 218060 217566 217166 216600 215990 215982 217254 219834 222940 225521
57555 225521 226890 226967 226216 225451 225452 226475 228101 229662 230780 231518 232251 233445 235295 237343 238722 239110 239287
57538 239287 240379 242554 244808 246124 246550 246933 247875 249201 250432 251369 252030 252228 251682 250664 250115 250755
57522 250755 252262 253770 255025 256560 258761 261334 263820 266101 268141 269727 270851 271959 273446 275250
57508 275250 277282 279787 282817 285677 287543 288443 289080 289819 290464 290984 291716 292644 293065 292341 290624 288496
57492 288496 286187 283583 280874 278766 277865 278108 278989 280222 281859 283754 285275 285893 285832 285760 285955 286202 286440
57475 286440 286946 287761 288511 289038 289718 290808 291943 292651 293020 293444 294049 294731 295432 296010 296214 296177 296551 297695
57457 297695 299149 300457 302039 304545 307687 310549 312858 315037 317064 318238 318357 318340 319297 321471 324383
57442 324383 327484 330369 332774 334818 337052 339951 343411 346803 349460 351152 352344 353921 356393 359375
57428 359375 362081 364229 366160 368219 370438 372790 375317 377972 380660 383462 386509 389707 392867 395927
57414 395927 398698 400686 401765 402796 404864 407961 411080 413588 415736 417838 419857 422022 424975 428826
57400 428826 432732 435881 438315 440355 441910 443002 444456 447327 451768 456982 462154 466937 471280 475293
57386 475293 479279 483485 487801 491895 495622 499152 502789 506805 511274 515942 520461 524874 529581 534716
57372 534716 539818 544386 548479 552559 556959 561718 566655 571402 575616 579513 583965 589698 596442 603093
57358 603093 608725 613318 617634 622509 628170 634096 639603 644608 649737 655686 662568 669815 676594 682437
57344 682437 687697 693247 699477 705822 711640 717239 723431 730320 737325 744386 752189 760945 769785 777810
57330 777810 785110 792328 799785 807473 815323 823009 829992 836245 842550 849649 857508 865760 874329 883159
57316 883159 891826 899940 907582 914977 922231 929733 938151 947461 956591 964678 972130 979846 988036 996594
57302 996594 1005917 1016323 1027127 1037350 1047056 1057032 1067511 1078308 1089847 1102775 1116650 1130301
57290 1130301 1143596 1157533 1172389 1187080 1200838 1214423 1229033 1244900 1261470 1278073 1293872
57279 1293872 1308068 1320924 1333892 1347995 1362604 1376423 1389126 1401370 1413819 1426927 1441184
57268 1441184 1456673 1472636 1488196 1503309 1518460 1533749 1548988 1564433 1580625 1597623 1615083
57257 1615083 1632987 1651603 1670816 1690214 1709864 1730208 1751129 1771870 1792080 1812214 1832612
57246 1832612 1852883 1872634 1892201 1912144 1932509 1953150 1974399 1996723 2019907 2043223 2066335
57235 2066335 2089402 2112238 2134076 2154539 2174481 2195455 2218397 2243002 2268173 2292936 2317148
57224 2317148 2341559 2367124 2394084 2421817 2449616 2477354 2505173 2532896 2560251 2587518 2615309
57213 2615309 2643575 2671294 2697442 2721914 2745256 2767880 2789912 2811550 2833109 2854783 2876770
57202 2876770 2899511 2923450 2948589 2974708 3002015 3031114 3062138 3094335 3126704 3158679 3190007
57191 3190007 3220360 3249484 3277434 3304147 3328879 3350618 3369225 3385828 3401941 3418391 3435160
57180 3435160 3451951 3468692 3485736 3503839 3523855 3546211 3570685 3596787 3624214 3652823 3682369
57169 3682369 3712578 3743338 3774461 3805278 3834889 3862924 3889728 3915640 3940379 3963278 3983845
57158 3983845 4001951 4017749 4031663 4044121 4054992 4063538 4069274 4072668 4074627 4075515 4075010 4072658 4068057
57145 4068057 4060682 4050188 4036971 4021952 4005771 3988602 3970776 3953055 3936218 3920894 3907910
57134 3907910 3898240 3892402 3890255 3891502 3895907 3902963 3911980 3922710 3935320 3949495 3964198 3978710 3993261
57121 3993261 4008210 4023315 4038642 4055867 4077959 4107711 4147077 4197642 4261072 4339187 4434287
57110 4434287 4549624 4689322 4857953 5060538 5302985 5592470 5937754 6349385 6838896
57101 6838896 7416666 8089728 8861320 9732519 10705315 11786359 12989882 14337603 15855107
57092 15855107 17566689 19491185 21640416 24021953 26646429 29534004 32711387 36197844
57084 36197844 39988673 44042462 48267385 52503438 56516354 60027333 62778667 64600525
57076 64600525 65439579 65341654 64412038 62779656 60574372 57915005 54905412 51637106 48194824
57067 48194824 44660641 41114680 37632774 34281926 31115282 28169108 25463248 23003996
57059 23003996 20787416 18802350 17033383 15463577 14076084 12854228 11780795 10837863
57051 10837863 10007787 9274654 8624987 8047385 7531862 7069614 6653071 6275842 5932641
57042 5932641 5619284 5332505 5069440 4827230 4603132 4394844 4200682 4019681 3851599
57033 3851599 3696429 3553498 3421111 3297379 3181268 3072603 2971123 2876070 2786981 2704511
57023 2704511 2629778 2562226 2497981 2430641 2354414 2267143 2170700 2068765 1964340 1859142 1754640
57012 1754640 1652974 1556584 1467096 1384861 1309649 1241483 1180436 1125761 1075916 1029820 987649
57001 987649 949983 916504 886047 857698 831211 806527 783598 762736 744486 728952 715682
56990 715682 704299 694650 686272 678383 670763 664123 659292 656359 654798 653866 652554 649649 644383 636804
56976 636804 627300 616111 603549 590307 577116 564420 552668 542574 534639 528667 524101 520675
56964 520675 518462 517553 517956 519624 522370 525991 530591 536418 543219 550046 555752 559155 558825 553672 544272
56949 544272 532851 521300 509783 497780 485712 474607 464864 456388 449606 445257 443399 443625 446110
56936 446110 451324 458686 466632 474390 482785 492858 504349 515792 525390 531405 532478 528264 519519
56923 519519 507244 492000 474309 455237 436136 417969 401128 385679 371565 358679 346939
56912 346939 336182 326063 316360 307378 299719 293637 288952 285544 283399 282116 280924 279491 278284 277956
56898 277956 278775 280843 284350 289233 294991 301282 308392 316696 325905 335306 344630 354268 364676 375858
56884 375858 387339 398322 407867 415215 420011 422199 421841 419312 415548 411785 408941 407377 407243 408850
56870 408850 412595 418676 427009 437426 449849 464260 480571 498633 518409 540080 563829 589408
56858 589408 615766 640963 662545 678270 686838 688161 683205 673695 661712 649008 636502 624723
56846 624723 614803 608509 607001 610077 617084 628109 643618 663295 686175 711889 740967 773721
56834 773721 809535 847426 886327 924082 956660 979346 989109 985786 971316 948220 918789 885192
56822 885192 849823 815115 782814 753589 727640 705616 688609 677298 671497 670623 674252 682113
56810 682113 693960 709643 728979 751294 775243 798975 820016 835007 840455 834631 818672 795529
56798 795529 767912 737422 705165 672485 640971 612081 586775 565281 547231 532248 520388
56787 520388 511906 506761 504581 505026 507887 512904 519720 527904 536649 544401 549087 548951 543189 531879
56773 531879 515584 495203 472089 447974 424448 402274 381243 360861 341217 323043 306961
56762 306961 292887 280271 268657 257874 247934 238998 231310 224913 219500 214746 210658 207327 204440
56749 204440 201438 198268 195685 194522 194714 195269 195197 194281 192903 191366 189689 187980 186591 185681 184961 184140
56733 184140 183435 183220 183298 183026 182200 181346 180928 180699 180128 179160 178195 177513 177113 177003 177263 177782 178257 178610 179186
56714 179186 180380 182118 183837 185000 185536 185798 186183 186906 188056 189589 191155 192150 192209 191594 190901 190469 190282
56697 190282 190291 190507 190778 190840 190701 190702 191057 191527 191619 191033 189925 188928 188783 189615 190599 190707 189825 188770 188209 188097
56677 188097 188216 188609 189144 189258 188746 188397 189170 190904 192375 192622 191711 190277 188840 187722 187171 187270 187927
56660 187927 189053 190620 192488 194374 196050 197337 197874 197306 195939 194922 195264 196652 197682 197468 196659
56645 196659 196514 197251 197897 197768 197409 197707 198642 199518 200107 200804 201702 202248 202093 201677 201644 202042 202448 202588 202462
56626 202462 202164 201979 202474 204009 206118 207663 207728 206325 204240 202349 201055 200290 199897 199837 199957 199794 198948
56609 198948 197643 196575 196153 196165 196239 196330 196568 196901 197072 196868 196313 195815 196038 197351 199266 200709 201054 200774
56591 200774 200982 202424 204840 207140 208285 208213 207784 207649 207524 207044 206848 207970 210268 212420 213604 214312
56575 214312 215234 216293 217222 218271 219707 221262 222720 224477 226906 229685 232306 234800 237385 239923 242337
56560 242337 245072 248435 251990 255317 258835 263008 267159 270054 271425 271973 272129 271780 271141 270816 270848 270596
56544 270596 269778 268885 268387 268258 268378 268675 268635 267489 265246 262951 261588 261227 261448 261950 262364 262067 260748
56527 260748 258872 257139 255723 254326 252790 251319 250208 249548 249088 248278 246671 244434 242329 241070 240690
56512 240690 240550 239949 238830 237934 238045 238986 239710 239570 238994 238589 238160 237264 236188 235499 234895 233578 231685
56495 231685 230293 229832 229506 228642 227751 227683 228423 229295 229902 230351 230831 231433 232148 232790 233158 233416 233999 234994 236001
56476 236001 236723 237317 238047 239029 240421 242309 244239 245456 245824 245938 246111 245912 245168 244740 245663 247891 250394
56459 250394 252201 252917 252640 251963 251772 252500 253681 254623 255270 255989 256788 257283 257292 257007 256624 256206 255821 255449 254834
56440 254834 253874 253080 253213 254338 255599 256094 255751 255223 255083 255331 255665 256042 256807 258279 260441 263047 265752
56423 265752 267986 269070 268882 268143 267609 267204 266573 266119 266646 267924 268617 267937 266527 265330 264413 263537 263085
56406 263085 263582 264702 265621 266142 266736 267564 268154 268120 267731 267649 268358 269834 271559 272943 273909 274917 276257
56389 276257 277603 278513 279067 279641 280288 280711 280747 280606 280727 281548 283211 285274 287000 288095 288914 289772 290500
56372 290500 290943 291357 291900 292183 291888 291477 291717 292750 294147 295646 297240 298732 299782 300338 300602 300703 300782
56355 300782 301179 302018 302810 302964 302539 301987 301427 300789 300472 301076 302528 304196 305885 307957 310350 312312 313452
56338 313452 314372 315751 317351 318454 318973 319611 321070 323500 326605 329905 332856 335046 336442 337394 338324
56323 338324 339384 340408 341200 341859 342737 344069 345740 347439 348875 349779 350043 350080 350756 352534 354765 356238
56307 356238 356484 356279 356785 358492 360988 363498 365517 367081 368623 370554 373022 376028 379574 383488 387221
56292 387221 390100 391841 392705 393228 393973 395530 398433 402804 408093 413339 417869 421764 425564 429564 433672
56277 433672 438002 443123 449283 455690 461195 465615 469832 474634 480112 486245 493205 500779 508255 515371
56263 515371 522819 531342 540812 550674 560783 571293 582243 593876 606925 621891 638351 655653
56251 655653 674067 694578 717761 743434 771273 801116 832737 865906 900605 936778 973972
56240 973972 1011625 1049456 1087067 1123460 1157567 1189045 1217913 1243554 1264731 1280481 1290445 1294464
56228 1294464 1292528 1285084 1272763 1255843 1234473 1209268 1181014 1150017 1116500 1081564 1046843 1013047
56216 1013047 979633 946152 913216 881834 852435 824905 799108 774998 752569 731975 713489
56205 713489 697246 683211 671290 661108 651842 642869 634562 627829 622740 618232 613368 608316 603839
56192 603839 600267 597360 594861 592833 591494 590912 590841 590967 591372 592443 594088 595414 595669 595180 594863 595147
56176 595147 596019 597795 600836 604596 607865 610169 612202 614674 617512 620379 623298 626457 630024 634390
56162 634390 639971 646432 652697 658152 663393 669471 676740 684756 692921 700960 709031 717604 727029 737155
56148 737155 747631 758550 770425 783555 797829 813117 829485 847115 866447 888162 912467
56137 912467 938612 965919 995153 1028070 1065636 1107648 1154090 1205693 1262733 1324224 1388786
56126 1388786 1455462 1523092 1589637 1652853 1711243 1763940 1810287 1850181 1884363 1913666 1938069
56115 1938069 1956799 1969095 1974562 1973192 1965518 1952608 1935631 1915493 1892853 1868025 1840565 1809254
56103 1809254 1772798 1730594 1683096 1631900 1579394 1527682 1477682 1429619 1384243 1342954 1306741
56092 1306741 1275731 1249910 1229488 1214232 1203100 1194940 1189189 1185680 1184178 1184306 1185640 1187859 1191140
56079 1191140 1196194 1203334 1211704 1220185 1228870 1238782 1250228 1262464 1275080 1288606 1303415 1318939
56067 1318939 1334448 1349878 1365528 1381623 1398432 1416151 1434454 1452785 1471238 1490479 1510698
56056 1510698 1531429 1552443 1573987 1596040 1618158 1640170 1662168 1683860 1704938 1726093 1748520
56045 1748520 1772318 1796566 1821152 1847288 1875866 1906501 1938466 1971473 2005252 2039557 2074885
56034 2074885 2112031 2150765 2190216 2230683 2273543 2319102 2366203 2414346 2464479 2517109 2571346
56023 2571346 2626614 2683661 2743080 2804445 2867810 2934500 3005373 3079663 3156401 3235639 3317606
56012 3317606 3402209 3490170 3583012 3681109 3783366 3889604 4001379 4119542 4243052 4371371
56002 4371371 4506047 4648632 4798977 4956990 5124115 5301583 5489067 5686668 5896375
55993 5896375 6119987 6357427 6608741 6875900 7161023 7464786 7788360 8135071 8508463
55984 8508463 8910651 9344252 9813938 10324540 10880019 11486124 12151695 12885600 13695213
55975 13695213 14590236 15585642 16699184 17949535 19359990 20961789 22792360 24894782
55967 24894782 27322991 30145188 33439756 37290815 41788516 47026046 53088871 60047252
55959 60047252 67958975 76870776 86808942 97768098 109707160 122549541 136194311
55952 136194311 150555824 165618344 181458233 198216443 216044363 234991767 254741760
55945 254741760 274237278 291528205 304190264 310221542 308828464 300560445 286817632
55938 286817632 269211854 249183739 227909028 206325152 185167238 164998347 146229633
55931 146229633 129122598 113792094 100232608 88357576 78029182 69079586 61334429
55924 61334429 54632179 48828436 43792925 39411737 35590761 32251258 29323217 26745658
55916 26745658 24469360 22453749 20662104 19062439 17629955 16344319 15185899 14137269
55908 14137269 13185858 12321558 11533363 10811055 10148050 9539436 8978793 8459747 7978918
55899 7978918 7534401 7122715 6739897 6384153 6054664 5748901 5463645 5197631 4950692
55890 4950692 4721144 4506372 4305205 4117529 3942235 3777618 3623177 3479106 3344572
55881 3344572 3218262 3099998 2990015 2887097 2789040 2694566 2603429 2515220 2429558 2346934
55871 2346934 2267995 2192404 2119564 2049816 1983703 1920658 1859760 1801293 1746413 1695607 1648469
55860 1648469 1604381 1562503 1521766 1481858 1443656 1407845 1373896 1341223 1310299 1281513 1253906
55849 1253906 1226308 1198909 1172445 1146659 1120925 1095748 1072188 1050258 1029165 1008639 988825
55838 988825 969385 949999 931366 914396 898758 883474 868630 855228 843432 832169 820471
55827 820471 808282 796027 784256 773643 764434 755921 747068 737515 727468 717077 706627 696877
55815 696877 688357 680655 673110 665800 659088 652734 646435 640837 637040 635339 635324 636846 639904 643781 647354
55800 647354 650261 653035 656119 659436 662800 665920 668034 668184 665974 661682 655797 648814 641191 632987
55786 632987 623829 613671 603288 593591 584822 576750 569136 561524 553191 543898 534177 524426 514434 504386
55772 504386 495492 488757 483849 480127 477995 478076 479572 480700 480489 479125 476895 473926 470790 468188 466056
55757 466056 463833 461478 459342 457290 454875 452166 449333 445573 439598 431239 421578 411413 400555 388780
55743 388780 376562 364611 353445 343608 335638 329572 324995 321637 319343 317529 315370 312729 310348
55730 310348 308960 308541 308400 307639 305703 302923 300349 298636 297344 295712 293670 291530 289262 286899 285214
55715 285214 285006 285918 286838 287258 287347 287026 286004 284644 283731 283308 282715 281859 281448 281767 282060 281432 279663 276925
55697 276925 273386 269313 265075 260857 256786 253266 250687 248855 247210 245481 243680 241739 239759 238273
55683 238273 237602 237329 237140 237634 239314 241302 242323 242609 243426 244797 245221 243824 241452 239364 238088 237893
55667 237893 239021 240930 242430 243112 243645 244270 244210 243187 242355 242933 244792 247172 249899 253092 256416 259523
55651 259523 262682 266206 269684 272437 274348 275716 276733 277542 278279 278636 277916 275930 273222 270067 266107
55636 266107 261558 257797 255802 254621 252427 248673 244279 240025 235851 231659 227812 224573 221675 218732
55622 218732 215683 212727 210153 208289 207284 206799 206062 204377 201692 198727 196408 194890 193263 190601 187205
55607 187205 184290 182496 181336 180154 178885 177627 176263 174931 174195 174201 174192 173368 171809 170087 168390 166576
55591 166576 164763 163323 162512 162436 163090 164053 164485 163901 162765 161990 162046 162725 163492 163839 163710 163750 164699 166306
55573 166306 167368 167164 166282 165698 165656 165903 166412 167204 167901 168157 168290 168911 170151 171699 173316 174834 175929
55556 175929 176360 176277 175947 175453 174949 174738 174774 174559 173960 173578 173783 173978 173453 172441 171563 170737 169502 168085
55538 168085 167137 166573 165598 163921 162138 160837 160032 159579 159537 159967 160775 161782 162568 162438 161101 159255 157926
55521 157926 157307 156819 156179 155686 155468 155208 154734 154272 153968 153766 153833 154413 155018 154483 152243 149069 146196 144170
55503 144170 142919 142394 142498 142662 142208 141211 140555 140995 142424 144158 145668 146806 147530 147806 147872 148286 149384
55486 149384 150840 151988 152508 152531 152205 151585 150911 150553 150572 150723 150926 151267 151485 151037 149912 148837 148417 148559
55468 148559 148941 149423 149712 149418 148874 149114 150377 151424 151203 150488 150799 152189 153300 153385 153065 153095 153479 154013
55450 154013 154734 155529 156021 156138 156154 156087 155690 155114 154808 154627 153798 152037 150001 148338 146965 145569 144203
55433 144203 143063 142276 142187 143239 145131 146676 146990 146442 146059 146366 147171 148088 148828 149245 149477 149888 150657 151607
55415 151607 152518 153301 153809 153977 154248 155292 157040 158543 159078 158865 158371 157529 156193 154755 153619 152432
55399 152432 150624 148456 146756 145690 144552 142959 141591 141384 142355 143580 144178 144056 143723 143585 143531 143207
55383 143207 142543 141854 141452 141390 141650 142300 143282 144244 144787 144839 144676 144670 145050 145760 146468 146900 147207 147810 148747 149461
55363 149461 149448 148885 148386 148239 148138 147628 146658 145697 145372 145932 147017 147986 148474 148574 148560 148623 148786 148869 148541 147696
55343 147696 146730 146174 146001 145677 144982 144403 144497 145172 145811 145899 145396 144690 144357 144720 145537 146265 146729 147210 147878
55324 147878 148515 148984 149579 150600 151870 152943 153567 153737 153511 152998 152322 151419 150132 148656 147533 147022 146867
55307 146867 146933 147568 148877 150044 150009 148669 146902 145595 145111 145524 146695 148063 148938 149202 149299 149479 149456 149031
55289 149031 148597 148722 149390 149980 149873 148977 147707 146625 146091 146170 146762 147674 148562 148977 148664 147796 146844 146297
55271 146297 146491 147400 148440 148752 148050 146987 146388 146266 145985 145306 144755 144921 145818 147090 148470 149845 151107
55254 151107 152212 153190 153969 154353 154354 154395 154944 155944 156782 156861 156140 155091 154146 153277 152196 150918 149877 149435
55236 149435 149496 149829 150512 151639 152719 152964 152351 151908 152532 153807 154464 153967 153146 153105 153889 154546 154344 153508
55218 153508 152709 152215 151820 151395 151114 151100 151219 151418 151959 153028 154254 154865 154400 153138 151873 151339 151721 152500
55200 152500 152824 152241 151149 150417 150614 151642 152970 154016 154406 154132 153512 152885 152363 151981 151882 152077 152197 151918
55182 151918 151621 152142 153731 155655 157036 157689 157872 157676 157085 156371 155898 155661 155472 155543 156357 157912 159567
55165 159567 160793 161663 162426 163022 163364 163751 164561 165625 166288 166164 165525 164932 164680 164680 164693 164546 164191 163700 163187
55146 163187 162774 162547 162477 162365 161980 161341 160709 160277 160042 160059 160525 161387 162135 162354 162276 162409 162777 162956 162778 162492
55126 162492 162246 161900 161401 160818 159970 158638 157342 157187 158489 160157 160906 160635 160090 159652 159189 158748 158653 158981
55108 158981 159558 160352 161325 162025 162012 161600 161584 162258 163228 164149 164939 165315 164933 164164 163967 164703 165741 166490 167154
55089 167154 168057 168859 168953 168182 166734 164805 162814 161496 161205 161461 161630 161734 162087 162595 162991 163430 164150 164770
55071 164770 164630 163787 162973 162562 162240 161811 161685 162294 163511 164949 166417 167758 168525 168271 167051 165408 163914
55054 163914 162911 162605 163086 164172 165406 166378 166999 167324 167224 166434 165055 163706 162949 162708 162495 162089 161661
55037 161661 161436 161633 162603 164428 166330 167120 166492 165351 164638 164365 164139 164058 164527 165600 167005 168495 169735
55020 169735 170253 170027 169795 170168 170763 170804 170260 169666 169106 168232 167196 166663 166803 167070 167137 167350 168000 168816 169504
55001 169504 170211 171142 172171 173105 173909 174462 174576 174470 174745 175621 176650 177461 178272 179297 180208 180623 180718 180864
54983 180864 181060 181228 181708 182806 184118 184917 185114 185192 185213 184577 182981 181103 179997 180073 180894 181769 182308 182502
54965 182502 182505 182423 182316 182296 182480 182790 183037 183319 184122 185688 187443 188436 188359 187785 187354 187069 186567 185770 185001 184626
54945 184626 184810 185558 186676 187761 188477 188928 189571 190653 191853 192636 192873 192995 193579 194920 196978 199517
54929 199517 202223 204808 207150 209352 211615 214019 216436 218634 220553 222565 225339 229266 233972 238590
54915 238590 242476 245512 247739 249087 249531 249158 247836 245184 241177 236523 231998 227667 223147 218551 214611
54900 214611 211834 209944 208301 206574 204886 203517 202609 202035 201580 201320 201615 202530 203557 204350 205428 207470
54884 207470 210023 211752 212208 212602 214356 217422 220595 223044 224977 227020 229545 232535 235637 238310 240224
54869 240224 241539 242571 243242 243033 241392 238045 233176 227588 222495 218689 215936 213409 210637 207757 205042
54854 205042 202627 200644 199220 198212 197279 196264 195205 194012 192559 191188 190676 191405 192875 194230 194948
54839 194948 194788 193539 191354 189103 187743 187319 187075 186629 186464 186991 187723 187873 187418 186989 186874 186814 186823 187499
54821 187499 189177 191233 192668 193150 193132 193198 193671 194663 196010 197211 197834 198012 198263 198807 199418 199876 200200 200394
54803 200394 200371 200279 200529 201278 202138 202588 202463 201894 201003 199909 198866 198131 197739 197529 197335 197143 197133 197583 198554
54784 198554 199701 200626 201358 202150 202873 203115 203042 203586 205356 207820 210092 212231 215092 218960 223011 226394
54768 226394 229311 232629 236675 240844 244465 247670 251185 255397 259842 263666 266352 267846 268165 267205 264910
54753 264910 261399 256892 251727 246439 241558 237240 233325 229786 226805 224301 221780 218936 216177 214237
54739 214237 213366 213135 212928 212459 211872 211588 212006 213223 215005 217036 219102 221102 223084 225274 227868 230751
54723 230751 233656 236602 239820 243220 246320 248796 250681 251933 252346 252134 251958 251893 250946 248216 244123 239812
54707 239812 235657 231211 226504 222481 219849 218172 216439 214150 211573 209267 207640 206716 206116 205337 204225
54692 204225 203074 202264 201924 201900 201861 201472 200660 199716 199027 198778 199000 199663 200466 200789 200224 198995 197566 196040
54674 196040 194390 192999 192369 192339 192248 191884 191724 192142 193007 194120 195396 196346 196095 194384 192119 190434 189527
54657 189527 188866 188202 187882 188280 189374 190868 192429 193803 194889 195681 196101 196094 196000 196492 197856 199570 200894
54640 200894 201644 202095 202308 202040 201263 200400 199925 199948 200238 200419 200134 199269 198175 197556 197925 199141 200503 201359
54622 201359 201666 201906 202428 202993 203126 202785 202396 202303 202487 202884 203538 204266 204558 204133 203395 202996 203136 203567 204104
54603 204104 204682 205007 204604 203390 201878 200650 199781 198925 197855 196751 196016 195902 196347 197107 197995 198910 199668
54586 199668 199944 199477 198334 196909 195694 195052 195098 195699 196558 197339 197755 197671 197245 196833 196587 196241 195541 194816
54568 194816 194751 195522 196488 196967 197017 197243 198033 199180 200090 200202 199371 198080 197147 197000 197373 197830 198285 198747 198867
54549 198867 198224 197052 196150 195937 195943 195413 194269 193232 193091 193967 195317 196551 197503 198297 198954 199444 200023 201060
54531 201060 202370 203170 203018 202501 202544 203300 204213 204995 205909 207046 207939 208201 208138 208399 209199 210155 210750 210770 210414
54512 210414 210089 210048 210153 210117 209951 209953 210259 210631 210794 210762 210712 210764 211009 211544 212327 213126 213726 214011 213811 213002 211902
54491 211902 211250 211435 211949 211893 210934 209494 208186 207333 206945 206772 206439 205850 205462 205768 206542 206990 206749 206302
54473 206302 206152 206036 205327 204019 202864 202569 203152 204099 204837 205004 204522 203589 202576 201834 201610 202053 203150
54456 203150 204643 206113 207100 207147 205925 203611 201118 199576 199449 200316 201510 202689 203737 204550 205223 206145
54440 206145 207512 208871 209571 209597 209515 209636 209730 209696 210032 211218 212890 214042 214067 213317 212638 212575 213066 213720 214273
54421 214273 214785 215428 216147 216628 216667 216440 216304 216380 216446 216184 215462 214433 213463 212917 212852 212934 212753 212265 211825 211800
54401 211800 212242 212906 213484 213769 213726 213514 213398 213585 214065 214626 215036 215244 215407 215691 216058 216307 216351 216372 216640 217221
54381 217221 217965 218747 219622 220610 221375 221309 220179 218658 217898 218340 219201 219475 219278 219626 220877 222043 222062 221222
54363 221222 220734 221135 221803 222022 221884 221901 222238 222648 222874 222835 222626 222558 223018 224054 225234 226060 226400 226396 226212 226093
54343 226093 226403 227251 228217 228749 228722 228340 227600 226301 224546 222787 221303 220012 218977 218661 219414 220977 222743
54326 222743 224284 225360 225722 225351 224736 224490 224697 224957 225038 225097 225250 225354 225345 225387 225465 225212 224485 223876 224183 225459
54306 225459 226947 227971 228579 229201 229968 230624 230981 231177 231383 231415 230901 229905 229159 229367 230339 231114 231048 230499 230254
54287 230254 230514 230721 230324 229440 228740 228806 229588 230443 230770 230551 230080 229262 227691 225641 224373 224858 226487 227701
54269 227701 227784 227403 227384 227750 228171 228674 229398 230048 230111 229451 228351 227103 225863 224778 223968 223380 222813 222105
54251 222105 221340 220992 221729 223664 225833 226918 226666 226065 225932 225936 225453 224772 224706 225383 226215 226899 227638 228429 228968
54232 228968 229361 230174 231483 232598 233126 233698 235070 236947 238351 238903 239123 239484 239721 239222 237748 235656
54216 235656 233638 232336 231986 232295 232776 233166 233372 233102 231956 230101 228510 228137 228901 229796 230006 229588 229069
54199 229069 228795 228891 229471 230426 231209 231308 230914 230654 230659 230465 230012 230130 231584 234004 236306 237934 239119 240030
54181 240030 240316 239682 238482 237478 237173 237468 237792 237548 236697 235921 235914 236496 236754 236216 235580 235992 237804 240294
54163 240294 242458 243843 244655 245352 246213 247197 248078 248705 249115 249422 249704 250067 250729 251933 253651 255345 256181
54146 256181 255705 254344 253014 252144 251356 250232 249002 248059 247137 245600 243540 241939 241536 241980 242364 242217
54130 242217 241697 241161 240875 240985 241465 242177 243057 244039 244691 244342 242901 241252 240478 240820 241753 242792 243764 244501
54112 244501 244948 245673 247633 251058 254888 257730 259177 259896 260574 261195 261364 260966 260257 259534 259013 258950 259507
54095 259507 260363 260759 260192 258951 257658 256431 254886 253018 251572 251229 251695 251988 251549 250741 250212 250078 249879
54078 249879 249285 248646 248715 249772 251151 251835 251550 251098 251562 253310 255784 258021 259330 259788 260184 261166 262259
54061 262259 262124 260155 257448 255702 255419 255730 255823 255790 255993 256371 256777 257519 259039 261293 263832 266335 268805
54044 268805 271361 274158 277406 281159 285191 289257 293425 297934 302795 307717 312290 316119 319009 321391
54030 321391 324304 328495 333526 338279 342318 346160 350055 353284 355201 356390 357983 360076 361660 362203
54016 362203 362459 363353 364675 365400 364907 363322 360924 357835 354316 350813 347517 344107 340060 335113 329479
54001 329479 323808 318925 315273 312531 310016 307387 304749 302104 299213 296167 293680 292443 292319 292399 291755
53986 291755 289990 287298 284258 281469 279157 277154 275359 274020 273425 273484 273836 274217 274470 274415 274007 273524 273244
53969 273244 273019 272511 271767 271199 270969 270817 270540 270255 270057 269851 269750 270250 271639 273478 274990 275790 275957 275681
53951 275681 275284 275427 276736 279109 281848 284537 287317 290151 292438 293848 295104 297225 300152 302846 304844
53936 304844 306935 309935 313433 316415 318776 321483 325334 330191 335481 340783 345741 350054 353940 358144
53922 358144 363024 368047 372641 377187 382503 388580 394531 399822 404809 409820 414359 417691 419892 421869
53908 421869 424501 428005 431936 435470 437845 438884 439098 439038 438627 437389 435225 432585 429814 426719 422995
53893 422995 418840 414847 411291 407725 403342 397707 391134 384465 378498 373572 369548 366053 362775 359601
53879 359601 356590 353781 350953 347652 343593 339073 334895 331733 329538 327539 324832 321080 316770 312814
53865 312814 309804 307570 305499 303257 301118 299534 298562 297884 297253 296696 296286 295929 295480 294878 294089 293091 292056
53848 292056 291374 291295 291618 291963 292233 292606 293084 293383 293286 292875 292300 291586 290788 290155 289946 290165 290639 291183 291554
53829 291554 291399 290557 289395 288600 288553 289032 289552 289868 290153 290803 292096 293940 295862 297285 297886 297752 297320
53812 297320 297209 297958 299730 302201 304832 307244 309369 311378 313603 316413 319972 324089 328417 332750 336998
53797 336998 340998 344528 347554 350272 352881 355457 358009 360446 362448 363630 363936 363760 363565 363483 363317 362819
53781 362819 361957 361040 360524 360474 360180 358625 355511 351605 347938 344960 342564 340550 338635 336326 333371 330262
53765 330262 327801 326140 324762 323406 322408 321829 320906 318930 316333 314231 313071 312364 311753 311586 312154 312980
53749 312980 313369 313323 313366 313632 313666 313145 312374 311866 311729 311677 311531 311549 312246 313874 316050 318024 319442 320743 322586
53730 322586 325024 327552 329856 332068 334284 336362 338401 340925 344175 347529 350124 351942 353853 356627
53716 356627 360184 363830 366922 369334 371557 374338 377974 381977 385681 389152 393241 398758 405916 414579
53702 414579 424637 435968 448347 461667 476112 491972 509442 528619 549445 571486 594067
53691 594067 616862 640162 664297 688858 712546 733453 749203 757245 755889 745436 728057 706287
53679 706287 681788 655597 629041 603760 580775 559992 540854 523189 507199 492925 480184
53668 480184 469015 459748 452460 446663 441718 437338 433535 430284 427441 424795 422019 418777 415122 411554
53654 411554 408407 405425 402274 399274 397182 396359 396530 397162 397620 397192 395669 393894 393021 393141 393323 393129
53638 393129 393232 394239 395758 397200 398715 400562 402231 403160 403996 406041 409522 413280 416277 418602 420832
53623 420832 423199 425750 428711 432259 436249 440445 444719 448864 452622 456111 459880 464221 468706 472608
53609 472608 475549 477627 479258 481071 483642 487043 490891 494929 499183 503393 506820 509087 510844 513108
53595 513108 516102 519103 521253 522105 521637 520316 519041 518445 518164 517183 515024 512186 509369 506687 503862
53580 503862 500791 497657 494639 491824 489250 486873 484570 482320 480294 478623 477165 475586 473649 471350
53566 471350 468889 466614 464923 464053 463852 463764 463115 461565 459365 457163 455514 454638 454571 455261 456371 457296 457688
53549 457688 457892 458536 459789 461400 463354 465980 469312 472863 476286 479871 484020 488596 493171 497778 502977
53534 502977 509211 516419 524249 532391 540709 549307 558499 568550 579470 591202 603882 617660 632291
53521 632291 647178 661894 676570 691768 708055 725644 744230 763272 782574 802533 823648
53510 823648 845934 869067 892902 917455 942447 967326 991868 1016320 1040858 1065280 1089437
53499 1089437 1113567 1137903 1162199 1185961 1209021 1231661 1254259 1277012 1299892 1322718 1345379
53488 1345379 1368047 1390938 1413754 1435620 1455833 1474437 1491877 1508322 1523727 1538333 1552689
53477 1552689 1567132 1581596 1595927 1610082 1623911 1637033 1649118 1660179 1670487 1680224 1689260 1697273
53465 1697273 1704150 1710295 1716425 1722895 1729159 1733704 1734292 1728453 1714416 1692065 1662877 1628709 1590871
53452 1590871 1550468 1509022 1468077 1428411 1390240 1354083 1320765 1290491 1262556 1236176 1211204
53441 1211204 1187904 1166498 1147199 1130324 1116044 1104189 1094396 1086244 1079250 1073175 1068402 1065621
53429 1065621 1064941 1065721 1067491 1070631 1075826 1083211 1092361 1102834 1114437 1127260 1141747 1158443 1177363
53416 1177363 1197865 1219477 1242476 1267330 1293903 1321732 1350833 1381670 1414465 1448989 1484968
53405 1484968 1522242 1560648 1600216 1641450 1684974 1730891 1778844 1828570 1879939 1932582 1986074
53394 1986074 2040464 2095977 2152176 2208104 2263464 2318931 2374890 2430517 2484653 2537072 2588202
53383 2588202 2637894 2685231 2729527 2770827 2809244 2844279 2875064 2901035 2922175 2938748 2950961
53372 2950961 2958792 2962107 2960952 2955676 2946588 2933541 2916026 2893712 2866780 2835665 2800632 2761749
53360 2761749 2719285 2674019 2626985 2578746 2528955 2476864 2422353 2366306 2309874 2253658 2197878
53349 2197878 2143054 2089950 2038865 1989448 1941355 1894628 1849193 1804521 1760277 1717013 1675650
53338 1675650 1636362 1598583 1562098 1527406 1494736 1463338 1432423 1402512 1375172 1351337 1330449
53327 1330449 1311360 1293591 1277327 1262493 1248442 1234668 1221513 1209855 1200210 1192314 1185687 1180339
53315 1180339 1176680 1174782 1174118 1174213 1175289 1177962 1182459 1188542 1196164 1205725 1217514 1231216 1246318 1262791
53301 1262791 1281083 1301426 1323434 1346501 1370393 1395225 1420774 1446077 1470071 1492708 1515048
53290 1515048 1537942 1560932 1582843 1603188 1622419 1640906 1658469 1675005 1690764 1705580 1718489
53279 1718489 1728689 1736373 1741973 1745064 1744866 1741654 1736782 1731215 1724717 1716593 1706562 1694606 1680595
53266 1680595 1664459 1646400 1626596 1604970 1581575 1556924 1531621 1505766 1478986 1450955 1421675
53255 1421675 1391359 1360199 1328257 1295501 1262057 1228456 1195497 1163734 1133183 1103548 1074616
53244 1074616 1046393 1019013 992570 967009 942246 918470 896090 875100 854700 834046 813352
53233 813352 793731 775851 759301 743411 728132 713686 699901 686437 673355 660929 649075
53222 649075 637510 626350 615984 606352 596841 586969 576746 566319 555717 545168 535275 526594
53210 526594 519185 512705 506704 500701 494393 488107 482761 478906 475838 472089 466852 460579 454130 447808
53196 447808 441540 435646 430824 427365 424814 422532 420254 417945 415523 413046 410914 409477 408552 407610 406358
53181 406358 404784 402775 400177 397277 394770 393120 392218 391755 391540 391332 390771 389760 388605 387567 386573 385559
53165 385559 384725 384149 383479 382404 381157 380184 379540 379039 378717 378620 378329 377303 375760 374601 374341 374620 374942
53148 374942 375404 376402 377993 379914 381998 384229 386531 388811 391175 393933 397395 401704 406696 411812 416332
53133 416332 419915 422743 424957 426072 425286 422361 418011 413352 409148 405580 402474 399496 396228 392390
53119 392390 388143 384099 380852 378463 376508 374585 372688 371099 370119 369890 370235 370541 370100 368834 367513
53104 367513 366980 367246 367678 367921 368168 368547 368829 369013 369714 371494 374056 376539 378499 380191 381915 383523
53088 383523 384735 385622 386535 387700 389067 390558 392241 394215 396353 398291 399747 400765 401489 401756 401172
53073 401172 399783 398332 397530 397175 396344 394472 391905 389334 387028 384799 382357 379433 375863 371898 368316
53058 368316 365823 364313 363022 361401 359600 358062 356949 356046 355050 353825 352559 351680 351437 351512 351310 350652
53042 350652 349905 349375 348929 348433 348162 348472 349324 350447 351659 352644 352705 351393 349293 347610 346914 346757 346544
53025 346544 346213 345925 345631 345283 345057 345079 345275 345663 346394 347252 347633 347409 347318 347978 348933 349346 349317 349711 350760
53006 350760 351703 351907 351609 351299 351047 350862 351110 352030 353164 353850 354103 354571 355681 357248 358847 360173 361026
52989 361026 361391 361642 362398 363936 365864 367495 368446 368864 369276 370288 372274 375115 378251 381090 383348 385015
52973 385015 386154 386956 387874 389389 391493 393564 394910 395315 395020 394327 393475 392736 392280 391934 391351 390482 389635
52956 389635 388997 388320 387182 385263 382319 378341 374014 370608 368818 367895 366431 363983 361430 359716 358800
52941 358800 358027 357026 355847 354525 352969 351249 349713 348738 348448 348630 348844 348716 348175 347346 346257 344903
52925 344903 343646 343135 343555 344136 343825 342468 341044 340640 341367 342395 342974 343229 343870 345192 346575 347141 346780
52908 346780 346233 346181 346581 346983 347172 347281 347507 348000 348788 349551 349670 348853 347631 346882 346897 347285 347730 348376 349334
52889 349334 350238 350582 350274 349605 348806 347865 346669 345152 343400 341745 340621 340101 339700 338882 337749 336973 337036
52872 337036 337735 338472 338836 338845 338817 339155 340091 341434 342613 343068 342660 341722 340809 340438 340852 341813 342683 342931 342641
52853 342641 342399 342647 343277 343945 344592 345415 346336 346752 346076 344516 343131 342872 343646 344472 344555 343971 343229 342524
52835 342524 341725 340926 340496 340516 340579 340399 340345 341107 342901 345234 347377 348938 350012 350936 351852 352489 352466 351885
52817 351885 351382 351499 352219 353300 354765 356740 359024 361272 363527 366186 369465 373319 377834 383074 388370
52802 388370 392274 393634 392465 389501 385271 379981 373974 367772 361703 355940 350900 347154 344794 343198
52788 343198 341580 339628 337537 335673 334268 333235 332119 330453 328310 326401 325417 325361 325665 325857 325952 326219
52772 326219 326754 327337 327613 327472 327261 327548 328468 329372 329371 328298 326937 326189 326185 326358 326183 325635 325009 324581 324465
52753 324465 324618 324895 325209 325669 326500 327852 329732 331940 333890 334764 334317 333475 333623 335129 336995 338150
52737 338150 338550 338670 338458 337518 336120 335271 335681 337122 338892 340448 341442 341612 340956 339782 338382 336820
52721 336820 335133 333476 331942 330486 329176 328288 327973 328021 328138 328259 328433 328589 328612 328519 328405 328390 328711 329648
52703 329648 331134 332620 333564 333971 334260 334695 335140 335281 334956 334309 333740 333592 333780 333838 333444 332754 332138 331772
52685 331772 331617 331556 331407 331082 330944 331728 333749 336370 338610 340097 341107 341860 342327 342722 343580 345143 346999
52668 346999 348562 349606 350212 350472 350535 350722 351260 352021 352765 353601 354955 357015 359421 361626 363390 364771
52652 364771 365760 366218 366278 366511 367433 368916 370372 371454 372177 372381 371616 369871 368015 367073 367202 367740 368038
52635 368038 367891 367359 366726 366546 367238 368536 369850 371182 373134 375885 378687 380662 381589 381596 380686 379144 377979
52618 377979 378178 379562 381015 381845 382345 382945 383449 383456 383059 382660 382368 381974 381385 380729 380073 379374 378620 377728 376409
52599 376409 374492 372492 371444 371977 373755 375927 377863 379347 380424 381420 382865 384968 387179 388630 389026
52584 389026 388870 388798 388972 389159 389169 389121 389385 390227 391413 392325 392711 393129 394228 395755 396816 397088 397089 397164 396944
52565 396944 396179 395426 395351 395821 396271 396603 397087 397673 398033 398124 398095 397854 397416 397517 399004 401519 403486 403715 402485
52546 402485 400879 399668 399111 399251 399916 400750 401552 402362 403046 403269 403128 403376 404552 406227 407526 408186 408712
52529 408712 409665 411153 412880 414310 414913 414620 414024 413955 414898 416949 419975 423466 426475 428214 428762 428849 429004
52512 429004 429285 429790 430991 433281 436453 439759 442396 443895 444270 443893 443086 441741 439497 436305 432675
52497 432675 429247 426274 423629 421180 418943 416910 414988 413273 412248 412417 413621 414898 415231 414408 413077
52482 413077 412070 411847 412428 413515 414636 415509 416341 417511 418928 420065 420779 421654 423201 425029 426289 426788
52466 426788 427282 428616 430904 433601 436108 438197 439953 441447 442536 443023 442983 442706 442267 441387 439826 437704
52450 437704 435290 432733 430191 427929 426011 424127 422076 420210 419064 418682 418677 418790 418948 418866 418110 416670
52434 416670 415116 414087 413828 414193 414806 415250 415425 415734 416594 417838 418904 419579 420147 420808 421437 422018 422880
52417 422880 424313 426332 428964 432418 436742 441571 446372 450720 454383 457531 460852 465036 469990 475101
52403 475101 480330 486350 493252 499774 504375 506586 506769 505114 501675 497080 492286 487606 482635 477161
52389 477161 471527 466040 460680 455654 451686 449399 448649 448656 448626 448272 448070 448972 451428 454594 456931 457789 458012
52372 458012 458885 460936 463895 467302 470714 473736 476252 478400 480060 480723 480251 479380 478913 478640 477704 475938
52356 475938 474209 473333 473249 473484 473921 474741 475888 477080 478284 479918 482474 486010 489975 493527 496212 498384
52340 498384 500873 504180 508151 512481 517243 522746 529031 535823 542919 550342 558101 566070 574261 583048
52326 583048 592922 604088 616367 629414 642815 656029 668484 679920 690568 700845 710940 720859
52314 720859 730844 741442 752992 765150 777170 788670 800005 811857 824563 837883 851335 864663
52302 864663 877892 890952 903364 914547 924493 933882 943195 951848 958509 962364 963823 963953 963481 962457
52288 962457 960626 957859 954368 950640 947122 943836 940494 937082 934088 931896 930160 928200 925956 924200
52274 924200 923736 924717 926797 929592 932799 936193 939829 944155 949664 956448 964208 972582 981326 990302 999551
52259 999551 1009346 1019948 1031293 1043084 1055140 1067402 1079500 1090669 1100339 1108733 1116534 1123952
52247 1123952 1130352 1134958 1137750 1139435 1140595 1141129 1140657 1139266 1137628 1136362 1135517 1134779 1134050 1133537 1133305 1132940
52231 1132940 1131907 1130166 1128242 1126624 1125256 1123768 1122105 1120738 1120245 1120809 1122179 1123927 1125689 1127273
52217 1127273 1128748 1130408 1132583 1135433 1138892 1142778 1146969 1151589 1156965 1163258 1170137 1177043 1183821 1190823
52203 1190823 1198281 1205922 1213423 1220902 1228564 1236113 1243017 1249279 1255440 1261809 1268122 1274047 1279562 1284748
52189 1284748 1289619 1294302 1298839 1302589 1304382 1303696 1301379 1298789 1296480 1294009 1290617 1285648 1278714 1270119
52175 1270119 1260964 1252293 1244269 1236701 1230083 1225318 1222461 1220554 1218924 1217902 1217990 1219034 1220634 1222798
52161 1222798 1225691 1229162 1232995 1237157 1241393 1245010 1247658 1249875 1252260 1254515 1256073 1257333 1259266 1261876
52147 1261876 1264063 1265215 1265969 1267029 1268150 1268900 1269626 1270725 1271437 1270340 1267065 1262767 1258851 1255884 1253817
52132 1253817 1252561 1251964 1251640 1251299 1251137 1251692 1253484 1256949 1262533 1270577 1281108 1293839 1308346 1324227
52118 1324227 1341263 1359491 1378974 1399456 1420384 1441312 1462102 1482661 1502695 1521874 1540078
52107 1540078 1557393 1574033 1590360 1606784 1623448 1640159 1656713 1673035 1688878 1703711 1717250
52096 1717250 1729838 1741942 1753400 1763521 1771795 1778091 1782222 1783806 1782707 1779272 1774062 1767627 1760580
52083 1760580 1753532 1746834 1740698 1735667 1732593 1731912 1733202 1735614 1738499 1741484 1744353 1747196 1750497 1754773
52069 1754773 1760181 1766654 1774158 1782583 1791577 1800757 1809934 1818890 1827156 1834360 1840684 1846568 1852091 1856980
52055 1856980 1861173 1864954 1868471 1871501 1873821 1875507 1876668 1877064 1876150 1873445 1868895 1863010 1856667 1850551
52041 1850551 1844686 1838589 1831858 1824563 1817162 1810263 1804353 1799474 1795116 1790670 1785995 1781343 1776776 1771969
52027 1771969 1766645 1760841 1754613 1747757 1740062 1731682 1723071 1714624 1706473 1698513 1690547 1682514 1674647 1667296
52013 1667296 1660566 1654287 1648294 1642503 1636666 1630357 1623433 1616290 1609417 1602717 1595327 1586068 1574103 1559404
51999 1559404 1542666 1524596 1505271 1484475 1462672 1441222 1421394 1403454 1386934 1371433 1356706
51988 1356706 1342315 1327781 1313074 1298515 1284195 1269908 1255739 1242282 1229999 1218607 1207294
51977 1207294 1195384 1182618 1168970 1154537 1139659 1125037 1111511 1099591 1089153 1079729 1071236 1064340
51965 1064340 1059915 1058118 1058108 1058710 1059242 1059707 1060426 1061563 1062866 1063694 1063279 1061066 1056835 1050515 1041963 1031122
51949 1031122 1018468 1005219 992805 981913 972141 962832 954170 947165 942532 939949 938544 937733 937253
51936 937253 936792 936037 934911 933237 930292 925265 918223 910092 901550 892401 882263 871304 859909 848054
51922 848054 835611 823104 811521 801278 791872 782780 774321 767324 762099 758135 754873 752516 751864
51909 751864 753362 756567 760680 765452 771367 778974 788298 798913 810296 821940 833370 844288 854549
51896 854549 863769 871080 875548 876738 874641 869178 860241 848337 834793 821057 807985 795987 785563
51883 785563 777316 771554 768225 767274 768741 772498 778196 785706 795418 807824 822826 839551 856750
51870 856750 873205 887866 899880 908572 913372 913808 909793 901906 891187 878502 864279 848865 832959
51857 832959 817555 803610 791885 782831 776429 772262 769921 769153 769415 769654 769060 767896 767037 766653 765952
51842 765952 764336 762146 759846 757075 753205 748512 744080 740529 737421 734081 730532 727451 725541 725128
51828 725128 726060 727719 729309 730313 730603 730070 728419 725482 721542 717139 712726 708666 705410 703352 702537
51813 702537 702678 703456 704695 706280 708057 709842 711363 712201 711866 710050 706799 702418 697211 691287 684699
51798 684699 677729 670944 664842 659548 654992 651270 648541 646587 644868 643186 642036 642108 643598 646134 649151
51783 649151 652155 654845 657253 659674 662274 664960 667800 671277 675797 681162 686965 693324 700751 709312
51769 709312 718461 727796 737608 748483 760686 774023 787906 801345 813127 822329 828497 831309 830335
51756 830335 825357 816665 804891 790762 775141 758958 742816 726908 711600 697861 686681 678157
51744 678157 671466 665772 660934 657424 655812 656354 658840 662791 667814 673749 680444 687630 695095 702639
51730 702639 709510 714211 715446 713324 709234 704459 699255 693353 686969 680969 676123 672437 669202 665700
51716 665700 661900 658475 656096 654834 654408 654878 656726 660173 664704 669498 674226 679329 685592 693621 703698
51701 703698 715947 730277 745931 761172 773887 782875 788518 792103 794698 796827 798869 801227 804183
51688 804183 807931 812608 817781 821937 823096 820272 814055 805707 796115 785779 775283 765317 756478 749332
51674 749332 744378 741530 739808 737928 735193 731635 727568 723355 719452 716155 713267 710360 707520 705511
51660 705511 705041 706006 707551 708772 709359 709775 710911 713432 717354 722245 727789 733989 740864 748147 755351
51645 755351 761894 767001 769668 769115 765389 759368 752051 743906 734947 725227 714966 704283 693151 681812
51631 681812 670934 661062 652040 643336 634907 627452 621692 617628 614619 611936 609123 606041 602815 599692
51617 599692 596779 593951 591103 588487 586686 586222 587142 588940 590883 592539 594010 595594 597304 598880 600234
51602 600234 601648 603459 605736 608345 611201 614418 618347 623502 630267 638610 648263 659173 671481 684967
51588 684967 698789 711942 723905 734766 745040 755525 767121 780534 796142 814107 834437
51577 834437 856986 881783 909489 941223 977720 1018886 1064180 1113053 1164941 1219495 1277240
51566 1277240 1339415 1406498 1477083 1548709 1619528 1688799 1756306 1822213 1887328 1952495 2017415
51555 2017415 2080524 2139905 2193406 2237650 2268015 2280597 2274043 2249108 2206903 2148319 2074994
51544 2074994 1990004 1897179 1799940 1700879 1602106 1505570 1413017 1325840 1245151 1171922 1106829
51533 1106829 1049840 1000190 956992 919837 888529 862391 840246 821238 805334 792842 783610
51522 783610 776896 771882 768088 765340 763477 762183 761141 760381 760282 760982 761816 761687 760070 757319 753846 749351
51506 749351 743169 735139 725753 715526 704619 693176 681738 671093 661751 653638 646280 639315 632842
51493 632842 627274 622808 619170 615999 613366 611680 611061 611053 611064 610888 610589 609995 608649 606285 603178 599896
51477 599896 596836 594022 591225 588222 585091 582266 580054 577993 575104 571057 566736 563241 560659 558345
51463 558345 556179 554781 554515 555062 556153 558045 560939 564543 568582 573225 578611 584512 590858 598119 606652
51448 606652 616191 626467 637842 650757 665096 680784 698462 718750 741181 764575 787925 809940
51436 809940 828282 840738 847291 849920 850380 849366 847799 847180 847742 847380 843462 835251 824033 811673
51422 811673 799741 789356 780925 774224 769198 766335 765896 767392 770255 774400 779534 784672 789111 793383
51408 793383 798388 804032 809540 814680 819672 824216 827671 830225 832939 836502 840768 845655 851853 860391
51394 860391 872013 887079 905588 927279 952229 981451 1016379 1057763 1105514 1159562 1220149
51383 1220149 1287213 1360259 1439131 1524338 1616205 1713969 1815877 1919788 2023564 2125226
51373 2125226 2222774 2313364 2392727 2456223 2500891 2525963 2531225 2515829 2479378 2423463 2351100
51362 2351100 2264985 2167309 2061178 1950984 1840735 1732581 1627498 1526905 1432894 1346996
51352 1346996 1269397 1199556 1137080 1081731 1032953 989880 951719 917793 887280 859291 833315
51341 833315 809311 787350 767493 749976 735020 722256 710795 700185 690863 683287 677010 671092
51329 671092 665124 659314 653843 648798 644625 641873 640382 639285 637987 636693 635868 635686 636180 637436 639360
51314 639360 641602 643948 646452 649008 651191 652791 654188 655864 657760 659367 660302 660599 660681 661201 662599
51299 662599 664491 665732 665404 663609 661038 657890 653606 647704 640635 633706 628223 624670 622628 621413
51285 621413 620785 620977 622133 624010 626325 629229 633213 638540 644804 651024 656216 659979 662570 664448 665951
51270 665951 667469 669605 672753 676601 680413 683795 686887 689865 692631 695019 696925 698188 698656 698341 697125
51255 697125 694437 689791 683722 677573 672172 667299 662633 658431 654798 651086 646822 642751 640066 638779
51241 638779 637748 636309 635084 634900 635566 636116 635932 635268 634822 635111 636284 638388 641653 646341 652313 658990
51225 658990 665947 673343 681539 690389 699111 706710 712379 715703 716811 716155 713895 709631 703105 694935
51211 694935 686275 677947 670365 664052 659462 656249 653464 650789 649002 648859 650016 651501 652803 653998
51197 653998 655144 656170 657228 658555 660038 661437 663098 665847 669955 674668 679077 683113 687290 691811
51183 691811 696415 700990 705765 710752 715409 719070 721437 722482 722209 720845 718998 717130 714945 711745
51169 711745 707415 702675 698236 694126 690097 686332 683290 680987 678860 676417 673721 671120 668728 666353
51155 666353 663810 661052 657957 654166 649347 643629 637575 631624 625675 619457 613202 607650 603287 599828
51141 599828 596578 593205 590056 587805 586924 587356 588608 590186 591957 594038 596446 599110 602202 606081 610783
51126 610783 615867 620949 626052 631243 636240 640764 645029 649369 653505 656595 658051 657950 656617 654191
51112 654191 650749 646555 641972 637272 632670 628400 624622 621360 618557 616147 614048 612297 611231 611312 612650
51097 612650 614811 617269 619978 623300 627433 632105 636860 641427 645655 649241 651942 654110 656611 659805
51083 659805 662863 664630 665133 665630 667000 668658 669522 669569 669771 670789 672480 674758 678157 683128 689297 695913
51067 695913 702839 710569 719211 727815 734963 739940 743177 745550 747464 748747 749223 749001 748106 746219 743163
51052 743163 739434 735887 732932 730390 728105 726339 725444 725474 726285 727825 730147 733253 737077 741488 746293
51037 746293 751358 756862 763214 770569 778474 786169 793187 799560 805451 810698 814772 817111 817455 815842
51023 815842 812398 807345 801204 794795 788801 783417 778591 774535 771784 770815 771794 774692 779412 785778 793550
51008 793550 802499 812316 822534 832760 843014 853594 864548 875476 885867 895370 903675 910466
50996 910466 915712 919754 922802 924460 924091 921655 917986 914154 910743 907896 905905 905456 907149 910970 916534
50981 916534 923854 933529 946012 960960 977641 995912 1016415 1039726 1065512 1092636 1119940 1146900
50969 1146900 1173619 1200329 1227028 1253700 1280774 1308953 1338414 1368491 1398502 1428649 1459685
50958 1459685 1491924 1525024 1558649 1592728 1626962 1660528 1692454 1721920 1748197 1770817 1790052
50947 1790052 1806792 1821697 1834788 1846004 1855685 1864251 1871815 1878415 1884152 1888655 1890719 1888915 1882451
50934 1882451 1871233 1855523 1835969 1813596 1789215 1762984 1734870 1705263 1674587 1642650 1609075
50923 1609075 1574229 1538978 1503537 1467310 1430040 1392423 1355297 1318772 1282587 1246953 1212637
50912 1212637 1180392 1150570 1123107 1097739 1074366 1053292 1034802 1018500 1003475 989346 976664
50901 976664 966017 957174 949502 942811 937236 932557 928334 924644 922009 920491 919425 918290 917306 916832
50887 916832 916594 916051 915363 915420 916879 919566 923008 927167 932288 938188 944186 949832 955397 961401 967891
50872 967891 974527 981322 988881 997732 1007679 1018118 1028876 1040507 1053708 1068645 1084973 1102415
50860 1102415 1121268 1142363 1166513 1193993 1224563 1258016 1294584 1334771 1378931 1427210 1479787
50849 1479787 1536870 1598382 1663922 1733161 1806037 1882296 1961050 2041192 2122279 2204655 2288452
50838 2288452 2372615 2455177 2534371 2609208 2678927 2742273 2797659 2844008 2881169 2909524 2929511
50827 2929511 2941735 2947260 2947413 2943250 2935437 2924660 2911866 2897986 2883628 2869181 2854946 2840904
50815 2840904 2826414 2810414 2791848 2769801 2743374 2711767 2674555 2631685 2583254 2529508 2471036
50804 2471036 2408687 2343248 2275492 2206573 2138029 2071262 2007246 1946865 1891179 1841033 1796639
50793 1796639 1757855 1724720 1697450 1676067 1660352 1650047 1644686 1643294 1644686 1648154 1653566 1660608
50781 1660608 1668188 1674782 1679288 1681491 1681804 1680638 1677914 1673140 1665961 1656526 1645180 1631943 1616550
50768 1616550 1599000 1579709 1559048 1536948 1513129 1487635 1461051 1434306 1408203 1382998 1358447
50757 1358447 1334391 1311236 1289656 1269902 1251743 1235072 1220222 1207593 1197373 1189797 1185319 1184234
50745 1184234 1186293 1190978 1197980 1207225 1218595 1231993 1247638 1266085 1287849 1313052 1341379 1372403
50733 1372403 1406048 1442759 1483033 1526725 1572972 1620880 1670119 1720748 1772634 1825102 1876997
50722 1876997 1927013 1974202 2018260 2059264 2097191 2131859 2163098 2190400 2212468 2227871 2236482
50711 2236482 2239739 2239213 2235575 2229371 2222061 2215343 2209785 2204929 2200521 2196751 2193340 2189371 2184287 2178317
50697 2178317 2171537 2163102 2151832 2137127 2118874 2096843 2070714 2040647 2007493 1972456 1936666 1900990
50685 1900990 1866096 1832701 1801778 1774401 1751442 1733582 1721493 1715629 1715853 1721686 1733081 1750601
50673 1750601 1774628 1804691 1839818 1879271 1922608 1969208 2018029 2067765 2117018 2164377 2208559
50662 2208559 2248667 2284372 2315922 2343909 2368868 2391004 2410342 2427034 2441303 2453214 2462814
50651 2462814 2470477 2476823 2482190 2486491 2489716 2492409 2495601 2500453 2507925 2518454 2531926 2548245 2567885
50638 2567885 2591468 2618777 2648738 2680518 2714102 2749455 2785686 2821477 2855982 2888854 2919724
50627 2919724 2948121 2973549 2994928 3009931 3015536 3009586 2991871 2963984 2928516 2888298 2845905 2803460
50615 2803460 2762718 2725091 2691543 2662675 2638986 2620626 2606761 2595664 2585862 2576744 2567689 2557160
50603 2557160 2543414 2525708 2503974 2477523 2445103 2406295 2361970 2313125 2260137 2203534 2144655
50592 2144655 2084857 2024519 1963454 1902069 1841597 1783410 1728520 1677620 1631183 1589450 1552477
50581 1552477 1520131 1491934 1467132 1445201 1426173 1410407 1398111 1389200 1383442 1380683 1381126 1385358
50569 1385358 1393674 1405292 1418684 1432948 1448549 1466550 1487545 1511587 1538624 1568440 1600582
50558 1600582 1634928 1672171 1713097 1757459 1803999 1851585 1899804 1948395 1996581 2043193 2087270
50547 2087270 2128427 2166812 2202735 2236264 2267324 2296308 2324346 2352645 2381830 2412280 2444909
50536 2444909 2481034 2521523 2566517 2615961 2669872 2728064 2790200 2856363 2927168 3003104 3084054
50525 3084054 3169581 3259271 3352585 3448697 3546610 3645123 3742569 3836964 3926564 4009872 4085041
50514 4085041 4149839 4202579 4242557 4269215 4281390 4278013 4259113 4225561 4178121 4117625 4046040
50503 4046040 3966626 3882831 3797434 3712752 3631005 3554221 3484253 3423094 3372714 3334224 3307480
50492 3307480 3291699 3286086 3289530 3300081 3315181 3332139 3347880 3358411 3359302 3347103 3320205 3278419
50480 3278419 3222198 3152493 3071018 2980203 2882801 2781522 2678762 2576373 2475740 2378263
50470 2378263 2285670 2199593 2120842 2049300 1984468 1925867 1872974 1825227 1782341 1744365 1711177
50459 1711177 1682208 1656896 1635068 1616340 1599228 1581516 1561778 1540251 1518059 1495906 1473832
50448 1473832 1451916 1430712 1410910 1392857 1376597 1362238 1350094 1340395 1332960 1327325 1323220 1320766
50436 1320766 1320107 1320984 1322904 1325583 1329091 1333703 1339885 1348238 1359044 1371972 1386609 1403171 1422201
50423 1422201 1443581 1466522 1490684 1516732 1545544 1577521 1612858 1651794 1694089 1738932 1786002
50412 1786002 1836045 1889750 1946556 2005403 2066084 2128860 2193026 2257013 2319828 2381265 2440559
50401 2440559 2496036 2546486 2591913 2632343 2666750 2693750 2712708 2723448 2725451 2718087 2701286 2675424
50389 2675424 2640944 2598748 2550655 2498816 2444892 2390341 2337202 2287717 2243187 2203951 2170626
50378 2170626 2144675 2127293 2118147 2115576 2117862 2123917 2132730 2142480 2150518 2154366 2152610 2144667 2129853
50365 2129853 2107193 2076263 2037805 1993161 1943393 1889253 1831721 1772058 1711394 1650548 1590271
50354 1590271 1531440 1475062 1422103 1373035 1327424 1284417 1243989 1207297 1175286 1147315 1121790
50343 1121790 1097968 1076439 1057888 1042157 1028631 1016915 1006822 998203 991113 985793 982184 979724
50331 979724 977898 976808 976988 978773 981976 986046 990410 994787 999227 1003792 1008281 1012488 1016572 1020861
50317 1020861 1025309 1029485 1033124 1036321 1039173 1041605 1043655 1045588 1047645 1050002 1053049 1057270 1062624 1068414
50303 1068414 1073996 1079361 1084798 1090224 1095112 1098911 1101423 1102954 1104180 1105610 1107084 1108080 1108582 1109190 1110105
50288 1110105 1110377 1108522 1103739 1096369 1087493 1078391 1070056 1062776 1056168 1049872 1044075 1039211 1035428 1032663
50274 1032663 1031040 1030796 1031902 1034054 1037023 1040782 1045420 1051088 1057909 1065635 1073483 1080550 1086352 1090819
50260 1090819 1094013 1096194 1097997 1100158 1102938 1105970 1108618 1110311 1110671 1109538 1106879 1102551 1096330 1088427
50246 1088427 1079744 1071258 1063223 1055183 1046730 1037990 1029560 1022255 1016819 1013505 1011900 1011314 1011308 1011757 1012726
50231 1012726 1014585 1017906 1022820 1028669 1034749 1041183 1048481 1056479 1064375 1071780 1078935 1085827 1091848 1096564
50217 1096564 1100117 1102554 1103407 1102345 1099623 1095454 1089491 1081444 1071700 1060798 1048744 1035502 1021735
50204 1021735 1008281 995152 981773 968059 954515 941427 928822 917291 907851 900654 894555 888486
50192 888486 882695 878136 875108 873168 872090 872173 873489 875414 877211 878914 881372 885360 890747 896668 902522
50177 902522 908645 915794 924124 933049 942054 951196 960644 970129 979159 987474 995036 1001805 1007863 1013613
50163 1013613 1019554 1025955 1032899 1040415 1048300 1056039 1063264 1070102 1076777 1083138 1089041 1095014 1101919 1109869
50149 1109869 1117970 1125154 1130814 1134628 1136427 1136501 1135489 1133576 1130185 1124831 1117982 1110704 1103694 1097028
50135 1097028 1090634 1084583 1079032 1074224 1070432 1067580 1064955 1061552 1056679 1050123 1042019 1032878 1023600 1014982
50121 1014982 1007176 999861 992839 986207 980058 974393 969331 965084 961729 959213 957574 956920 957227 958353
50107 958353 960121 962190 964089 965683 967367 969339 970977 971587 971585 972131 973547 974920 975507 975731 976388 977624
50091 977624 979305 981802 985654 990758 996586 1002999 1010260 1018371 1027037 1036280 1046497 1057829 1069933
50078 1069933 1082525 1095833 1110348 1126364 1143886 1162879 1183566 1206543 1232406 1261141 1292104
50067 1292104 1324857 1359769 1397443 1437822 1480342 1524726 1570948 1618395 1665789 1712166 1757384
50056 1757384 1801429 1843802 1884074 1922578 1959992 1996472 2031781 2066160 2100369 2134558 2167324
50045 2167324 2196096 2218335 2232398 2237625 2233981 2221645 2200803 2171820 2135693 2094296 2050012 2005057
50033 2005057 1961183 1919843 1882169 1848481 1818030 1789775 1763555 1740209 1720419 1703766 1689109
50022 1689109 1675575 1662848 1650818 1639473 1629060 1619864 1611684 1603828 1595618 1586597 1576209 1563799
50010 1563799 1549244 1533265 1516789 1500212 1483547 1467072 1451394 1436872 1423457 1411335 1401542
49999 1401542 1395643 1394749 1398889 1407296 1419142 1433827 1450546 1467778 1483555 1496488 1506548 1514783
49987 1514783 1522309 1529590 1536474 1542472 1546820 1548570 1547151 1543049 1537687 1532400 1527565 1522873 1518323 1514700
49973 1514700 1513066 1514043 1517645 1523582 1531644 1541929 1554829 1570698 1589536 1611082 1635204 1661998
49961 1661998 1691606 1724276 1760651 1801526 1847104 1896842 1950295 2007815 2070054 2137158 2208879
49950 2208879 2285186 2366118 2451029 2538503 2627016 2715262 2801803 2885014 2963700 3037464 3106315
49939 3106315 3170217 3229179 3283365 3332748 3376838 3415052 3447300 3474028 3495712 3512362 3523316
49928 3523316 3527303 3522754 3508139 3482078 3443375 3391403 3326683 3250917 3166328 3075057 2979152 2880792
49916 2880792 2782128 2684869 2590032 2498000 2408865 2322994 2241426 2165590 2096620 2035156 1981689
49905 1981689 1936620 1899768 1870238 1847100 1829944 1818529 1812243 1810257 1811829 1815899 1820568 1823638
49893 1823638 1823752 1820535 1813558 1801772 1784258 1761131 1733264 1701297 1665289 1625278 1581835 1536036
49881 1536036 1489120 1442336 1396948 1354131 1314673 1278644 1245349 1213826 1183647 1155339 1129951
49870 1129951 1108191 1090076 1075423 1064410 1057383 1054202 1054118 1056427 1060983 1067907 1077028 1087980 1100786
49857 1100786 1116059 1134539 1156546 1181796 1209463 1238396 1267550 1296351 1324450 1351049 1374845
49846 1374845 1394909 1411468 1425492 1437524 1447175 1453788 1457274 1458145 1456934 1453930 1449493 1444412 1439792
49833 1439792 1436801 1436703 1440904 1450458 1465454 1485345 1510169 1541053 1579123 1624201 1675116 1731109
49821 1731109 1792244 1858342 1928154 1999948 2072477 2145074 2217152 2288120 2357658 2425622 2491512
49810 2491512 2554171 2612024 2663519 2707344 2742166 2766123 2776746 2771767 2750094 2711876 2657832
49799 2657832 2589114 2508006 2418135 2323415 2226822 2130353 2035748 1944783 1858959 1779255 1706089
49788 1706089 1639306 1578370 1522951 1473280 1429700 1392014 1359517 1331475 1307286 1286295 1267835
49777 1267835 1251432 1236812 1223896 1213099 1205358 1201332 1200631 1202246 1205653 1211029 1218345 1226774 1235181
49764 1235181 1242807 1249241 1253987 1256397 1256031 1253029 1248126 1242080 1234863 1225532 1213122 1197492 1179020
49751 1179020 1157797 1133798 1107738 1080954 1054294 1027742 1001428 976348 953670 933839 916772
49740 916772 902418 890537 880350 871185 863356 857814 854966 854331 855248 857364 860527 864818 870803 879063
49726 879063 889219 899994 910602 921642 934176 948363 963553 979419 996237 1013975 1031732
49715 1031732 1048381 1063358 1076480 1087294 1095011 1099097 1099710 1097554 1093444 1087837 1080516 1070683 1057700
49702 1057700 1041855 1024345 1006426 988759 971597 955326 940462 927210 915371 904777 895642
49691 895642 888309 882864 879229 877554 878237 881465 886956 894264 903161 913524 925023 937198 949801
49678 949801 962791 976020 989297 1002836 1017262 1032845 1049081 1065366 1081772 1098636 1115394
49667 1115394 1130398 1142048 1149798 1154023 1155348 1154290 1151207 1146292 1139684 1131593 1122006 1110224 1095195
49654 1095195 1076658 1055654 1033559 1010878 987345 963039 938913 916273 896005 878268 862585
49643 862585 848187 834538 821649 809853 799431 790534 783245 777443 772741 768758 765333 762294 759287
49630 759287 756118 753006 750108 746971 742963 738155 733372 729305 725933 722803 719545 716127 712945 710638
49616 710638 709521 709263 709396 709926 711017 712311 713238 713951 715203 717154 719061 720364 721393 722607 723819
49601 723819 724644 725171 725528 725248 723818 721712 720174 719923 720488 720861 720437 719331 718144 717521 717624 717992 718007
49584 718007 717527 717003 717017 717788 718999 720125 721134 722836 726137 730926 736213 741575 747818 755823 765352
49569 765352 775608 786419 798024 810154 822290 834675 848001 861991 875289 886924 896905 905059
49557 905059 910371 912247 911597 909792 907046 902802 897342 892001 887664 883916 879910 875480 871127 867402
49543 867402 864599 862788 861832 861448 861372 861386 861247 860875 860603 860951 862120 863996 866665 870538 875813 882153 889140
49526 889140 896710 904816 912933 920392 927220 934308 942667 952581 963483 974357 984234 992502 998969 1003725
49512 1003725 1007029 1009293 1010995 1012423 1013556 1014268 1014573 1014559 1014238 1013589 1012566 1010812 1007530 1002005 994292
49497 994292 985148 975371 965445 955747 946595 937993 929780 922250 916211 912043 908952 905602 901436 897072
49483 897072 893434 890773 888553 886000 882657 878588 874294 870516 867930 866795 866705 866865 866898 867381 869239 872643
49467 872643 876867 881306 886145 891831 898336 905360 912922 921306 930600 940640 951182 961734 971462
49454 971462 979730 986597 992404 997037 1000056 1001312 1000879 998585 994287 988558 982336 975743 967971 958595
49440 958595 948389 938527 929484 921092 913241 906160 900368 896591 895376 896503 899114 902619 907126 912814
49426 912814 919483 927062 935905 946041 956632 966928 977402 989227 1002651 1016396 1028517 1037357
49414 1037357 1041949 1042312 1039582 1035443 1031285 1028054 1026598 1027602 1031280 1037678 1047223 1060309 1076309 1093683
49400 1093683 1111373 1129605 1148993 1169296 1189433 1208441 1226014 1242241 1257123 1270309 1281205
49389 1281205 1289324 1294539 1296857 1296053 1291852 1284554 1275136 1264548 1253071 1240455 1226551 1211768 1197167
49376 1197167 1184085 1173369 1164863 1157871 1152167 1148204 1146213 1145587 1145443 1145409 1145512 1145531 1144917 1143261 1140447
49361 1140447 1136349 1130687 1123269 1114269 1104313 1094309 1084930 1076006 1066565 1055800 1043935 1031995 1020912
49348 1020912 1011146 1002927 996196 990270 984147 977509 971102 965770 961442 957477 953726 950673 948529 946772
49334 946772 944847 942871 941343 940451 940177 940870 943095 946804 951143 955375 959658 964707 970973 978530 987414
49319 987414 997543 1008331 1018941 1029029 1038950 1049146 1059718 1070631 1081812 1092799 1102729 1111168
49307 1111168 1118693 1126252 1134139 1141978 1149447 1156440 1162536 1167015 1169607 1170804 1171184 1170850 1169845 1168699
49293 1168699 1168075 1168021 1167967 1167382 1166118 1164240 1161919 1159453 1157000 1154256 1150749 1146523 1142173 1138126 1134283
49278 1134283 1130583 1127521 1125784 1125616 1126854 1129417 1133449 1139104 1146442 1155376 1165454 1175850 1185896
49265 1185896 1195562 1205158 1214692 1223803 1232160 1239475 1245255 1248985 1250568 1250321 1248663 1246363 1244931 1245937
49251 1245937 1249661 1255028 1261073 1267798 1275176 1282097 1287076 1289615 1290118 1288787 1285429 1280258 1274070 1267492
49237 1267492 1260729 1254254 1249038 1245758 1244199 1243871 1244864 1247740 1252793 1259797 1268347 1278097 1288765 1300211
49223 1300211 1312584 1326142 1340779 1355777 1370136 1383207 1395034 1406039 1416379 1425702 1433663 1440531
49211 1440531 1447032 1453619 1460123 1466179 1471794 1477392 1483569 1490942 1500052 1511061 1523525 1536639 1549820
49198 1549820 1562924 1575777 1587581 1597053 1603375 1606975 1609162 1610862 1611768 1610767 1607125 1601211 1594226
49185 1594226 1587337 1580990 1574969 1569214 1564531 1562213 1562822 1565633 1569561 1574360 1580630 1588914 1599361 1612252
49171 1612252 1628226 1647723 1670423 1695350 1721173 1746210 1768549 1786683 1800157 1809561 1816059 1821015
49159 1821015 1825768 1831344 1838215 1846426 1855989 1867024 1879568 1893381 1908130 1923745 1940440 1958235
49147 1958235 1976526 1994355 2011221 2027421 2043500 2059488 2074844 2088955 2101470 2112256 2121403
49136 2121403 2129294 2136461 2143250 2149689 2155592 2160597 2164185 2165927 2165799 2164191 2161652 2158749 2156055 2154010
49122 2154010 2152807 2152560 2153575 2156328 2161322 2169125 2180387 2195523 2214475 2237024 2263153 2292800 2325457
49109 2325457 2360427 2397393 2436347 2477124 2519508 2563506 2608630 2652733 2692565 2726249 2754914
49098 2754914 2781248 2806242 2827301 2839319 2837837 2822104 2795759 2764232 2730889 2695519 2656356
49087 2656356 2612980 2567005 2520731 2476039 2434382 2396960 2364518 2337189 2314670 2296447 2281932
49076 2281932 2270624 2262098 2255693 2250345 2245058 2239538 2234214 2229641 2225928 2222649 2219221 2215601 2212717 2211897
49062 2211897 2213593 2216860 2220306 2223278 2225887 2228240 2230199 2231786 2233293 2234834 2236150 2237017 2237697 2238882
49048 2238882 2241206 2244776 2249119 2253675 2258371 2263563 2269485 2276144 2283885 2293562 2305809 2320579 2337756
49035 2337756 2357839 2381402 2408092 2436781 2466627 2497468 2529234 2561501 2593708 2625274 2655337
49024 2655337 2682657 2705817 2723287 2733595 2736130 2731883 2722909 2710915 2696735 2681085 2665040 2649526
49012 2649526 2634913 2621536 2610101 2601051 2593884 2587670 2582160 2577961 2575652 2575073 2575549 2576549 2578037 2580275
48998 2580275 2583330 2586799 2590100 2592947 2595295 2596810 2596723 2594430 2590128 2584686 2579038 2573701 2568642 2563386
48984 2563386 2557488 2551118 2545036 2539781 2534993 2529814 2523816 2517330 2510944 2505018 2499748 2495353 2491920 2489126
48970 2489126 2486349 2483195 2479952 2477480 2476614 2477596 2480072 2483613 2488245 2494465 2502796 2513263 2525313 2538243
48956 2538243 2551728 2565879 2580785 2596112 2611298 2626053 2640611 2655547 2671405 2688392 2706300
48945 2706300 2724821 2744011 2764294 2785882 2808480 2831830 2856404 2883179 2912739 2944922 2979337
48934 2979337 3015879 3054718 3096124 3140358 3187440 3236908 3288040 3340382 3393825 3448193 3503200
48923 3503200 3558898 3615790 3674347 3734739 3797128 3861630 3927568 3993083 4055950 4114663 4168592
48912 4168592 4217561 4261939 4302965 4342254 4380701 4418120 4453960 4488040 4520478 4551329 4580600
48901 4580600 4608482 4635295 4661243 4686324 4710473 4733704 4756036 4777345 4797301 4815541 4831889
48890 4831889 4846357 4858984 4869838 4879216 4887608 4895219 4901619 4906015 4907883 4907222 4904293 4899284 4892243
48877 4892243 4883201 4872198 4859101 4843287 4823450 4797817 4764658 4722770 4671837 4612725 4547450
48866 4547450 4478413 4407417 4335466 4263497 4192842 4124727 4059671 3997746 3939187 3884397 3833583
48855 3833583 3786850 3744474 3706544 3672450 3641336 3613196 3588937 3569120 3553085 3539586 3527848
48844 3527848 3517696 3509027 3501722 3495940 3491986 3489820 3488941 3488734 3488751 3488703 3488496 3488314 3488496 3489313 3491002 3493942
48828 3493942 3498554 3505061 3513573 3524379 3537821 3553813 3571788 3591288 3612404 3635504 3660720 3687918
48816 3687918 3716959 3747671 3779577 3811895 3843903 3875299 3906339 3937838 3970967 4006752 4045491
48805 4045491 4086614 4129143 4172364 4216164 4260789 4306350 4352614 4399325 4446489 4493967 4540652
$$ [...]
##END NTUPLES=NMR SPECTRUM
##END=
