##TITLE=AC1550_ROEFFECT0014_8268818_sxCLHr4sEz
##JCAMPDX= 6.0         $$ Bruker NMR JCAMP-DX V2.0
##DATA TYPE= NMR SPECTRUM
##DATA CLASS= NTUPLES
##ORIGIN= BRUKER
##OWNER= Administrator
$$ 1.72 TOPSPIN		Version 2.1
$$ 2013-10-13 00:14:37.690 -0700  Administrator@X
$$ Compression mode = diff/dup
##.OBSERVE FREQUENCY= 400.02188249412
##.OBSERVE NUCLEUS= ^1H
##.ACQUISITION MODE= SIMULTANEOUS (DQD)
##.ACQUISITION SCHEME= undefined
##.AVERAGES= 8
##.DIGITISER RES= 22
##SPECTROMETER/DATA SYSTEM= spect
##.PULSE SEQUENCE= zg30
##.SOLVENT NAME= COFFEE_meoh
##.SHIFT REFERENCE= INTERNAL, COFFEE_meoh, 1, 14.98509
##AUDIT TRAIL= $$ (NUMBER, WHEN, WHO, WHERE, PROCESS, VERSION, WHAT)
$$ ##TITLE= Audit trail, TOPSPIN		Version 2.1
$$ ##JCAMPDX= 5.01
$$ ##ORIGIN= Bruker BioSpin GmbH
$$ ##OWNER= Administrator
$$ $$ E:\/data/COFFEE/nmr/AC1550_ROEFFECT0014_8268818_sxCLHr4sEz/10/pdata/1/auditp.txt
$$ ##AUDIT TRAIL=  $$ (NUMBER, WHEN, WHO, WHERE, PROCESS, VERSION, WHAT)
(   1,<2013-10-13 00:14:31.253 -0700>,<Administrator>,<X>,<go>,<TOPSPIN 2.1>,
      <created by zg
	started at 2013-10-13 00:13:25.760 -0700,
	POWCHK enabled, PULCHK disabled,
       configuration hash MD5:
       C8 4E 4E 5D D3 5C D8 9E 9F 52 82 E0 59 8A DE 15
       data hash MD5: 64K
       7B 2D C6 F1 2C A7 EA 28 AB B9 0D 67 D3 E6 01 E4>)
(   2,<2013-10-13 00:14:34.071 -0700>,<Administrator>,<X>,<proc1d>,<TOPSPIN 2.1>,
      <Start of raw data processing
       efp LB = 0 FT_mod = 6 PKNL = 1 PHC0 = 0 PHC1 = 0 SI = 32K 
       data hash MD5: 32K
       E7 BB 48 89 2E 17 41 B1 75 E7 03 03 30 C5 DD F1>)
(   3,<2013-10-13 00:14:34.392 -0700>,<Administrator>,<X>,<proc1d>,<TOPSPIN 2.1>,
      <pk PHC0 = 93.16956 PHC1 = 0 
       data hash MD5: 32K
       DB D6 3A 40 88 8D 54 47 6D 5E 35 7C 86 C8 4B 81>)
(   4,<2013-10-13 00:14:34.484 -0700>,<Administrator>,<X>,<proc1d>,<TOPSPIN 2.1>,
      <abs ABSG = 1 
       data hash MD5: 32K
       3E 44 7E 6E 41 B4 D2 A3 33 38 26 D9 0E 9F D8 8B>)
(   5,<2013-10-13 00:14:34.530 -0700>,<Administrator>,<X>,<proc1d>,<TOPSPIN 2.1>,
      <abs ABSG = 2 
       data hash MD5: 32K
       49 31 08 BD 45 82 D4 E6 25 B9 26 D8 C3 00 23 67>)
(   6,<2013-10-13 00:14:34.592 -0700>,<Administrator>,<X>,<proc1d>,<TOPSPIN 2.1>,
      <abs ABSG = 3 
       data hash MD5: 32K
       3D 10 56 1F A1 CA A0 62 DB FE F5 75 60 60 28 3B>)
(   7,<2013-10-13 00:14:34.653 -0700>,<Administrator>,<X>,<proc1d>,<TOPSPIN 2.1>,
      <abs ABSG = 4 
       data hash MD5: 32K
       03 AA F9 64 20 5E 2A 5A 6C 0C 27 AF F1 F5 7F B2>)
(   8,<2013-10-13 00:14:34.699 -0700>,<Administrator>,<X>,<proc1d>,<TOPSPIN 2.1>,
      <abs ABSG = 5 
       data hash MD5: 32K
       B1 9E 4F D3 7F 31 E8 3D 1F 9D 67 BF 7B B5 39 54>)
$$ ##END=
$$ 
$$ $$ hash MD5
$$ $$ FE EA BF D4 34 94 BF 0C F1 47 3B 5F 93 D7 AF 8F
##$RELAX= 
##$RELAX= 
##$RELAX= 
##$RELAX= 
##$RELAX= 
##$RELAX= 
##$RELAX= 
$$ Bruker specific parameters
$$ --------------------------
##$DU= <E:\>
##$EXPNO= 10
$$ [...]
##$TP= (0..7)
150 150 150 150 150 150 150 150
##$TP07= 0
##$TPNAME0= <>
##$TPNAME1= <>
##$TPNAME2= <>
##$TPNAME3= <>
##$TPNAME4= <>
##$TPNAME5= <>
##$TPNAME6= <>
##$TPNAME7= <>
##$TPOAL= (0..7)
0.5 0.5 0.5 0.5 0.5 0.5 0.5 0.5
##$TPOFFS= (0..7)
0 0 0 0 0 0 0 0
##$TUNHIN= 0
##$TUNHOUT= 0
##$TUNXOUT= 0
##$USERA1= <user>
##$USERA2= <user>
##$USERA3= <user>
##$USERA4= <user>
##$USERA5= <user>
##$V9= 5
##$VALIST= <valist>
##$VCLIST= <CCCCCCCCCCCCCCC>
##$VD= 0
##$VDLIST= <DDDDDDDDDDDDDDD>
##$VPLIST= <PPPPPPPPPPPPPPP>
##$VTLIST= <TTTTTTTTTTTTTTT>
##$WBST= 1024
##$WBSW= 4
##$XGAIN= (0..3)
0 0 0 0
##$XL= 0
##$YL= 0
##$YMAX_a= 635777
##$YMIN_a= -538875
##$ZGOPTNS= <>
##$ZL1= 120
##$ZL2= 120
##$ZL3= 120
##$ZL4= 120
##$ABSF1= 14.98509
##$ABSF2= -5.573092
##$ABSG= 5
##$ABSL= 3
##$ALPHA= 0
##$AQORDER= 0
##$ASSFAC= 0
##$ASSFACI= 0
##$ASSFACX= 0
##$ASSWID= 0
##$AUNMP= <proc_prof1d_extract_pilot.lims>
##$AXLEFT= 0
##$AXNAME= <>
##$AXNUC= <1H>
##$AXRIGHT= 0
##$AXTYPE= 0
##$AXUNIT= <>
##$AZFE= 0.1
##$AZFW= 0.1
##$BCFW= 0
##$BC_mod= 0
##$BYTORDP= 0
##$COROFFS= 0
##$CY= 15
##$DATMOD= 1
##$DC= 0
##$DFILT= <>
##$DTYPP= 0
##$F1P= 0
##$F2P= 0
##$FCOR= 0.5
##$FTSIZE= 32768
##$FT_mod= 6
##$GAMMA= 0
##$GB= 0
##$INTBC= 1
##$INTSCL= 1
##$ISEN= 128
##$LB= 0
##$LEV0= 0
##$LPBIN= 0
##$MAXI= 10000
##$MC2= 0
##$MEAN= 0
##$ME_mod= 0
##$MI= 0
##$NCOEF= 0
##$NC_proc= -8
##$NLEV= 6
##$NOISF1= 0
##$NOISF2= 0
##$NSP= 0
##$NTH_PI= 0
##$NZP= 0
##$OFFSET= 14.98509
##$PC= 1
##$PHC0= 93.16956
##$PHC1= 0
##$PH_mod= 1
##$PKNL= yes
##$PPARMOD= 0
##$PPDIAG= 0
##$PPIPTYP= 0
##$PPMPNUM= 2147483647
##$PPRESOL= 1
##$PSCAL= 4
##$PSIGN= 0
##$PYNMP= <proc.py>
##$REVERSE= no
##$SF= 400.02
##$SI= 32768
##$SIGF1= 0
##$SIGF2= 0
##$SINO= 400
##$SIOLD= 32768
##$SPECTYP= <>
##$SREGLST= <1H.CDCl3>
##$SSB= 0
##$STSI= 32768
##$STSR= 0
##$SW_p= 8223.68421052631
##$SYMM= 0
##$S_DEV= 0
##$TDeff= 65536
##$TDoff= 0
##$TI= <>
##$TILT= no
##$TM1= 0
##$TM2= 0
##$TOPLEV= 0
##$USERP1= <user>
##$USERP2= <user>
##$USERP3= <user>
##$USERP4= <user>
##$USERP5= <user>
##$WDW= 1
##$XDIM= 32768
##$YMAX_p= 439497741
##$YMIN_p= -691148
##$CURPLOT= <Network HP LaserJet P1505>
##$CURPRIN= <$Network HP LaserJet P1505>
##$DFORMAT= <normdp>
##$LAYOUT= <+/1D_H.xwp>
##$LFORMAT= <normlp>
##$PFORMAT= <normpl>
##$SURQMSG= 1
$$ End of Bruker specific parameters
$$ ---------------------------------
##NTUPLES= NMR SPECTRUM
##VAR_NAME=  FREQUENCY,     SPECTRUM/REAL,   SPECTRUM/IMAG
##SYMBOL=    X,             R,               I
##VAR_TYPE=  INDEPENDENT,   DEPENDENT,       DEPENDENT
##VAR_FORM=  AFFN,          ASDF,            ASDF
##VAR_DIM=   32768,         32768,           32768
##UNITS=     HZ,            ARBITRARY UNITS, ARBITRARY UNITS
##FACTOR=    0.250966925370066, 1,           1
##FIRST=     8223.43324360094, -56454,       80151
##LAST=      0,             -44539,          2839
##MIN=       0,             -691148,         0
##MAX=       8223.43324360094, 439497741,    0
$$ Real data points
##PAGE= N=1
##DATA TABLE= (X++(R..R)), XYDATA
$$ [...]
19565e6426k17433c4536F7681a30315k09036D0196c40612a26336D2225A4297J16356
19554A30653o3903c9618l5398C1942c0193B87549d68565a08538l8289n1841A21823
19542E3888Q8798f1543a5787p987j98068F101b32595E4680a89822I712a31914
19530F0024b31800B1612K5594P1761d361F3820b58862C01410d196j9650o6201
19519i0047E4225a60274N4361C41761c8202J2853A61743h2780K5105A25388a42895
19507A17572g6458J534p5686p9784E7489f4863j02824a7348B04447b37126Q4549
19496a52577g3478B7132b06373Q3392K6005C2929M8156J37211P1039b9831r6852
19485a26683J3719G7385a04920j58834a30900m8266E3283f5721p9550A9718J02815
$$ y = [-56426, -273859, -34536, 67681, -130315, -339351, 40196, -340612, -126336, 42225, 14297, 130653, 66750, -39618, -75016, 31942, -30193, 287549, -468565, -108538, -146827, -198668, 121823, 53888, 142686, -61543, -15787, -23774, -221842, 6101, -232595, 54680, -189822, 9712, -131914, 60024, -231800, 21612, 47206, 118967, -4361, 63820, -258862, 301410, -4196, -23846, -90047, 54225, -160274, -105913, 341761, -38202, -25349, 161743, -82780, -57675, 125388, -142895, 117572, -76458, -74924, -150610, -230394, 57489, -64863, -167687, -17348, 204447, -237126, -152577, -73478, 27132, -206373, -122981, -96976, 32929, 81085, 218296, 289335, -29831, -126683, -112964, 77385, -104920, -263754, -130900, -179166, 53283, -65721, -145271, 19718, 122533]
19474A22533a10080a6186l8443j42051b1598e470E0446d9739A46863a3107l87589
19463d00696B60489c0646p1139r5159L0426H9125g6534B55449I3060f15646I587
19451a12760m1273E3502b60848J8778f8349F647J53375a48463C4967a99543B15406
19439i0404j97854J22660j01176b7595j91615F482b4204j90333G7032i9389A18746
19427B7444i9611j6881A77735f1381E3586K4291b77080B3338K06286a29387o2481
19416a91868j7841o668A62997d9775m29474H2843C7793J62956G6529c7865A9443
19404A07914R3005F4839R5029F8852a64985J5320l15171H4860k452a9103j77155
19393a96258M7144C9862K1038e0016A6721b48426H582b01032H3815A623f6310
$$ y = [122533, -110080, -16186, -54629, -196680, -21598, -5470, 50446, -49739, 146863, -13107, -400696, 260489, -30646, -101785, -196944, -166518, 89125, -76534, 255449, 93060, -615646, 9587, -112760, -154033, 53502, -260848, -242070, -68349, 6647, 160022, -148463, 34967, -199543, 215406, -90404, -288258, -165598, -266774, -27595, -219210, 6482, -24204, -214537, 77032, -99389, 118746, 27444, -99611, -116492, 177735, -61381, 53586, 77877, -277080, 23338, 229624, -129387, -191868, -209709, -216377, 162997, -49775, -479249, 82843, 37793, 200749, 76529, -37865, 19443, 107914, 200919, 64839, 159868, 68852, -164985, -149665, -464836, 84860, 82408, -19103, -196258, -149114, 39862, 60900, -50016, 16721, -248426, 8582, -201032, 83815, 1623, -66310]
19381c51851I2909K32402A07253b31463f1506K7882E3396b00705k3044i5852K7049
19370f8803r16q1751A20009e7678j46506I1534a34979e9387k62716a6659k02191
19359b18850n2186k06955B16307D6244b07576o2933A15431J84027h9859A27887
19348b16458h6395c9851c343j23024l17502C00163a73701C06563a39675O5585
19338g4090j15268l2807a01540p5824B0059f6922j15152a7996I6544d7845j19985
19327a67830I1832b48447N9184a5391k72017A015a60328A51711a66515H5262b18537
19315f8633B25570A2976f5651C4843a03303b4864n011k6199A57887h1922J9465
19304f2457o9728c8518l6364j24615n7953B5880a86751f0191k47102B03742a50657
$$ y = [-351851, 92909, 325311, 107253, -231463, -61506, -33624, 53396, -200705, -223749, -95852, -68803, -69719, -151470, 120009, -57678, -204184, 91534, -134979, -59387, -322103, -16659, -218850, -271036, -477991, 216307, 46244, -207576, -270509, 115431, 299458, -89859, 127887, -216458, -86395, -39851, -3343, -126367, -443869, 300163, -173701, 306563, -139675, -74090, -189358, -222165, -101540, -177364, 20059, -66922, -182074, -17996, 96544, -47845, -167830, 91832, -248447, -189263, -15391, -287408, 1015, -160328, 151711, -166515, 85262, -218537, -68633, 225570, 12976, -65651, 34843, -103303, -24864, -29875, -56074, 157887, -81922, -62457, -132185, -38518, -74882, -199497, -257450, 25880, -186751, -60191, -307293, 203742, -150657]
19292B38329A0556a11666M3377D2658b01456A83411a11464j31820N2722J7715
19282a72847p8912R1897I427c11553P4967R6016l33790J98842F6780a94812d0182
19270H4736a98354B37119b69180i3283M3627B26001D8219a63359a4453j42369
19260a56822N8049O68A77637G211c02828B7013c03529p0898J37210E431J5528
19249B0959a40789A73388a87614c6004j36574O4840j50111a28370F014e9082J2707
19238d6375f429k8294j05567j2344A34983b01578b743B42237a73825H8578A8949
19226b142m86741a19183A37085P5302i9970A47189p2178a36180B6505a22668M1351
19215h1317q6186E4698c39111A56540g795j17281A23926k9856C6682a46964H0486
$$ y = [238329, 10556, -111666, -68289, 42658, -201456, 183411, -111464, -243284, -190562, -172847, -251759, -159862, 9427, -311553, -236586, -140570, -474360, -275518, 66780, -194812, -40182, 84736, -198354, 237119, -269180, -93283, -49656, 226001, 48219, -163359, -14453, -156822, -98773, -98105, 177637, 7211, -302828, 27013, -303529, -374427, -237217, 5431, 20959, -140789, 173388, -187614, -36004, -172578, -107738, -257849, -128370, 6014, -59082, -46375, -6429, -34723, -140290, -152634, 134983, -201578, -2743, 242237, -173825, 88578, 18949, -2142, -488883, -119183, 137085, 212387, -99970, 147189, 75011, -136180, 26505, -122668, -81317, -167503, 54698, -339111, 156540, -7795, -125076, 123926, 94070, 36682, -146964, 80486]
19203b72035j64339A02086D2258a11454o5911C832J39591b00855Q7591M6199b5307
19191g9748E537M2805d4636n8351R304j07909A34048h2206j84164A19632c34891
19179b29172B67984H6766d8075C8546j6882K96193j13240p6858a68433A34499
19168c06621A71183a44664j5298A12427J29901b24106l35027a19675E2478f8214
19157B55160a82296B04272E9542k4286L7040j8860a0913q1376q5652j86688O4205
19146c00424A25304c32302h7498B50596a74149e2286j53565C24J9922c23127A81670
19134H4390a58748A2361e2936D2560a37471K8254j45992j2996f1933j55944G3996
19122d245A94613a21463E2020p86a07220F1398J31660b65197p6344I2727b36681
$$ y = [-272035, -436374, 102086, 42258, -111454, -177365, 3832, 143423, -200855, -113264, -67065, -25307, -79748, 5537, 48342, -44636, -102987, -93683, -201592, 134048, -82206, -266370, 119632, -334891, -229172, 267984, 86766, -48075, 38546, 21664, 317857, 204617, 127759, -168433, 134499, -306621, 171183, -144664, -159962, 112427, 242328, -224106, -559133, -119675, 52478, -68214, 255160, -182296, 204272, 59542, 35256, 72296, 53436, -10913, -92289, -177941, -364629, -300424, 125304, -332302, -87498, 250596, -174149, -52286, -205851, 324, 20246, -323127, 181670, 84390, -158748, 12361, -52936, 42560, -137471, -109217, -255209, -268205, -61933, -217877, 73996, -4245, 194613, -121463, 52020, 51234, -107220, 61398, 193058, -265197, -341541, 92727, -236681]
19110A2805a44189b2886B2394a7604B41369a0417p2036R398q7129j19974A61419
19098I506b03043A39374c4475A4298J23460Q6989h4545J2865J277B9614d3753
19086g248F2786b6082k06702F3934L3940J80854g0492A3330K91293a96764B1333
19074D8728i2359H1006a47104g1907B9550K6951d32428D34703A81096J0674e9334
19062i3607m5609E0156a44050A1468K2957i4079B31797B476e13555A1729K7698
19051C9427N3843J46039b37875L8034A22116c608j86907e3661l16245l5903b381
19039b64394J4922b2368B7593c7609G6888a76910M9982j02701j03863C3736f0938
19027B72873B657f5818j6804c2340A93450a67802r2945e0596j69767e4484A3294
$$ y = [12805, -144189, -22886, 22394, -17604, 241369, -10417, -82453, -73055, -160184, -280158, 161419, 9506, -203043, 139374, -34475, 14298, 137758, 224747, -84545, -71680, -70403, 29614, -43753, -7248, 62786, -26082, -232784, 63934, 97874, 278728, -70492, 13330, 304623, -196764, 21333, 48728, -92359, 81006, -147104, -71907, 29550, 56501, -432428, 434703, 181096, 191770, -59334, -93607, -139216, 50156, -144050, 11468, 34425, -94079, 231797, 2476, -513555, 11729, 39427, 93270, 239309, -237875, -199841, 122116, -3608, -190515, -53661, -369906, -405809, -2381, -264394, -249472, -22368, 27593, -37609, 76888, -176910, -126928, -229629, -333492, 33736, -60938, 272873, 2657, -65818, -82622, -32340, 193450, -167802, -260747, -50596, -220363, -54484, 13294]
19015A84973k7924E7351a56934c216k89158k969A03963h0465j39926a06731l298
19004a10029j3128E6937J04128A561R1101c66037a12110F8975M653P7995R7340
18993B48963R5640B3118a50261o5032r1818f4720A77367F950a21295q3830C28417
18981a47489F3091j3453a07524b1970r9314N3952c2624A58382a3861C8666j8436
18970B0230c38088D1016i0492B8515c34473J51152C0475b30412q4030D8724d6633
18958A53399d07420A20329a98660d7327k8078A60337d13724a88038c686l93980
18948c97666B1112b93028h2395j77849b6234j15135L6600k69166a07493K8127
18938g9366k73979J01789f4425j81048E5971j4085K09250c2996B05740I7168D5564
$$ y = [184973, 157049, 57351, -156934, -3216, -292374, -295343, 103963, -80465, -220391, -106731, -110029, -123157, 56937, 161065, 1561, 92662, -366037, -112110, 68975, 73628, 151623, 248963, 344603, 23118, -150261, -215293, -307111, -64720, 177367, 6950, -121295, -205125, 328417, -147489, 63091, 49638, -107524, -21970, -121284, -67332, -32624, 158382, -13861, 38666, 20230, -338088, 41016, -90492, 28515, -334473, -183321, 30475, -230412, -314442, 48724, -46633, 153399, -407420, 120329, -198660, -47327, -75405, 160337, -413724, -188038, -3686, -397666, 21112, -293028, -82395, -260244, -26234, -141369, -104769, -373935, -107493, -79366, -353345, -251556, -64425, -245473, 55971, 41886, 251136, -32996, 205740, 97168, 45564]
18926b5599m8901J3251j90671O5884j3165R6246B54486B3697a81651N5374O816
18915a19461E7779a46257p3019E2712c45544h4125B50636b44054D225K0075K436
18904B6736h0049k44215a34789f3920A2513b8528k45718D6579K47953h8840j1655
18893a00495C9818e07j80091I7594a60634d2510m7949j06988P7019j60452B7056
18881a76325A60046e9186n5746E7010N9940b22114a8505C5742b1976A86332g0984
18869b31524B8933a2891m18211I2270K849B9548h6005d259k41934h3874l18236
18858d02110f3713F546M213a03229D9598J48445A8287d4826j14034C43717a33381
18846b08977C104K76279A00427j0329a58191N1934F8306b60706e8305A17002n3399
$$ y = [-25599, -74500, -61249, -251920, -186036, -199201, -102955, 254486, 23697, -181651, -126277, -119461, 57779, -146257, -219276, 52712, -345544, -84125, 250636, -244054, 4225, 24300, 26736, -80049, -324264, -134789, -63920, 12513, -28528, -274246, 46579, 294532, -88840, -100495, 39818, -507, -180598, 97594, -160634, -42510, -90459, -197447, -120428, -280880, 27056, -176325, 160046, -59186, -114932, 57010, 116950, -222114, -18505, 35742, -21976, 186332, -70984, -231524, 28933, -12891, -431102, 92270, 95119, 29548, -86005, -4259, -246193, -83874, -402110, -63713, 6546, 10759, -103229, 49598, 198043, 18287, -44826, -158860, 343717, -133381, -208977, 3104, 279383, 100427, 90098, -158191, -106257, 68306, -260706, -58305, 117002, 63603]
18835F3603i8574n842D842i0847B94643a24953C7082j1067J17528a88620I4747
18823C78586H2384J93796A6748J67239D3672L6105f6868C01936H8985J2866J06490
18812B08341E482L56545j29342H9323d9941j19231r1910A28948a58287q0633e6561
18800B28001a51441j60159G3518a66641D6102a10135c9609a2615j79526q426d3675
18788A52b46785i5034A74371D4183L33450b23290A517L0305b55320A50353g3640
18776b34844d1440D5629a3305G688J9965a1849C3216a7241I1715k0956a97343
18764b71708a02243o7822F6559p497a82497q8515J31450f8277j02851D6951e4374
18752G1259a04668E983K9403a31857F2482a19377n3744P0905I0163C204e0266
$$ y = [63603, -98574, -104416, 4842, -90847, 294643, -124953, 37082, 26015, 143543, -188620, 94747, 378586, 82384, 276180, 16748, 183987, 43672, 79777, -66868, 301936, 88985, 101851, 208341, 5482, 362027, 232685, 89323, -49941, -169172, -261082, 128948, -158287, -238920, -56561, 228001, -151441, -311600, 73518, -166641, 46102, -110135, -39609, -12615, -192141, -200567, -43675, 152, -246785, -95034, 174371, 44183, 377633, -223290, 1517, 31822, -255320, 150353, -73640, -234844, -41440, 45629, -13305, 7688, 27653, -11849, 33216, -17241, 91715, 70759, -197343, -271708, -102243, -170065, 66559, 59062, -182497, -271012, -139562, -68277, -171128, 46951, -54374, 71259, -104668, 5983, 35386, -131857, 62482, -119377, -173121, -102216, 90163, 3204, -50266]
18740b8260C49815a00748F286J66808b67678h5806B2855J75555a09688C4697h2275
18728b36920I3123a76387E2066a50096o1058C0899g8028r3789I3574b7657l2279
18717e9936A97545a59541M1673I7868a18040A20287E101J96249a12373N2148l55218
18706d15443a51499j7991L2176M2942c3479H4972R579b65887P1969M0486n4854
18695b08286R1692c0009m8692O240k02051j6194B5863b7910c847C7228O5742C794
18682b39341Q2598C62487b27253h798I2478h9994B97981d8217r5844d9493A7983
18670h9872D73257a87392k8097K0828I9857m5573J17409q1909a28811R327k79254
18659c98738a60961A9859a94751f5036A06650b5646C69832h598B69e2191l51830
$$ y = [-28260, 349815, -100748, 6286, 173094, -267678, -85806, 22855, 198410, -109688, 34697, -82275, -236920, 93123, -176387, 52066, -150096, -211154, 30899, -78028, -171817, 93574, -27657, -59936, 197545, -159541, -117868, 97868, -118040, 120287, 5101, 201350, -112373, -60225, -415443, -151499, -169490, -137314, -94372, -33479, 84972, 94551, -265887, -193918, -153432, -208286, -116594, -30009, -78701, -72461, -274512, -290706, 25863, -27910, -3847, 37228, 102970, 3794, -239341, -156743, 362487, -227253, -8798, 92478, -89994, 297981, -48217, -144061, -49493, 17983, -89872, 473257, -187392, -215489, -194661, 99857, 54284, 171693, 89784, -128811, -119484, -398738, -160961, 19859, -194751, -65036, 106650, -25646, 369832, -8598, 269, -52191, -404021]
18648d04021g4286j04801L6764e0008C9279K22379a91431m3060E9347i204A23381
18636a19560A57396L159c12277g3914L130a6357j63505B92740d90839D7667J59597
18625B07264B2690R9896A8072b40578G7939L03092G0421d17880a15384r6997D6399
18613G6213b20769q309a04107k545j62838O7666e8202D1567a02037j685C02039
18601I9603K3708c02578C89522c0845r032H017b80011a34499M7846A70832C4725
18589A67333G6571j2360J69196a60204I9608J99799d14492I5513a39352I9334
18578a44521B97559I2128P667b7431j27200A93568b20782e5092B6513c6860l9171
18567g6031m4514J4095K0835j32210E625a41336a7073r6530A40290e5262B63550
$$ y = [-404021, -74286, -179087, -142323, -50008, 39279, 261658, -191431, -234491, 59347, -9204, 123381, -119560, 157396, 160555, -312277, -73914, -70784, -16357, -179862, 292740, -490839, 47667, 207264, 22690, 122586, 18072, -240578, 77939, 381031, 70421, -417880, -115384, -212381, 46399, 76213, -220769, -229078, -104107, -106652, -269490, -201824, -58202, 41567, -102037, -103722, 302039, 99603, 123311, -302578, 389522, -30845, -39877, 8017, -280011, -134499, -86653, 170832, 34725, 167333, 76571, 64211, 233407, -160204, 99608, 299407, -414492, 95513, -139352, 99334, -144521, 297559, 92128, 99795, -27431, -154631, 193568, -220782, -55092, 26513, -36860, -76031, -120545, -106450, -85615, -217825, 5625, -141336, -17073, -113603, 140290, -55262, 263550]
18555d2992r0320c3901B4619e9669b8566h445k10268A2691b11622Q8101j56285
18544b79806C90683d8611j2535m06248J00174d6440j32748E7946b504j84268c3541
18532I9886f3555A90185a42481P0324L326F2848K37946j10419M4510b65539L5359
18521b30180A60379b25318J00168B71504A4470a71403c7390n6055C51007b76635
18510a3569B31617a22772j04404M0044d6847H0300O0596o7158b86525D5123J12417
18499A57540C8224a39314M4017j17377I5073B1958a67917R815j50340A84706c32877
18487e29967b13964N0406f1061p5376n7405r3155J36755C5864d3003j0761D4248
18475c50880j94C02089b22595D2353b66652K1455h1561j19486F9911d84657A57508
$$ y = [-42992, -133312, -33901, 24619, -59669, -28566, -8445, -218713, 12691, -211622, -123521, -279806, 390683, -48611, -61146, -467394, -367220, -46440, -179188, 57946, -2504, -186772, -33541, 99886, -63555, 190185, -142481, -72157, -68831, 62848, 300794, 190375, 234885, -265539, -230180, 160379, -225318, -125150, 271504, 14470, -171403, -37390, -93445, 351007, -276635, -13569, 231617, -122772, -227176, -187132, -46847, 80300, 140896, 73738, -286525, 45123, 157540, 38224, -139314, -95297, -212674, 95073, 21958, -167917, -158102, -308442, 184706, -332877, -529967, -213964, -163558, -61061, -136437, -193842, -286997, -150242, 35864, -43003, -53764, 44248, -350880, -351074, 302089, -222595, 42353, -266652, -245197, -81561, -201047, 69911, -484657, 157508]
18463b59967i0214A43888c4042j26551K1560F4812a20954B26183Q830F1066a26411
18451b29969G5714i4125j02690A35457a12325r6842P4740C9422h6081j36872A37461
18439F0277a65602f753l27502F5360f7302B16794q4591c13979d0008q4337j01482
18428b25827A5175b1065C24607a34376p2198B95952A8035b75061B54806c53855
18417f8795F0901a96161B6320c3678k2400J2336b0024E4924b1671B07575J13019
18406C20594c21862d9353j73471A74134g9166n8017q1707A50109D952c46177A40357
18394a42079b1405j7582B11078o0549a73776e3486H7805b17668k09120C0865d1708
18382e3784j58083A50818a4025j5934B67388m287b03576K9406E689a30315A05371
$$ y = [-259967, -90214, 143888, -34042, -160593, -139033, 64812, -120954, 226183, 235013, 61066, -126411, -229969, 75714, -94125, -196815, 135457, -112325, -209167, -134427, 39422, -86081, -222953, 137461, 60277, -165602, -6753, -334255, 65360, -67302, 216794, 132203, -313979, -40008, -124345, -225827, 15175, -21065, 324607, -134376, -206574, 295952, 18035, -275061, 254806, -353855, -68795, 60901, -196161, 26320, -33678, -56078, -43742, -20024, 54924, -21671, 207575, 320594, -321862, -49353, -222824, 174134, -79166, -137183, -218890, 150109, 4952, -346177, 140357, -142079, -21405, -38987, 211078, 150529, -173776, -53486, 87805, -217668, -426788, 30865, -41708, -53784, -211867, 150818, -14025, -29959, 267388, 263101, -203576, -174170, 5689, -130315, 105371]
18370A08260J77731o4159b77962I1177h3501m06B70124c69254f9505a2477j60638
18359a73115G4518B1122f1264m8953d8109j53000E3350a8297j18783o8389d9087
18347a43429A05494E0226b2393A03762b4978e770j87005h7458I962D695i0162
18335D5262i9382C0009M8911J55583h5664L0961j33775A22698J61247f9578e813
18323e1824D1076N9639l9844b19285P6676C09442f9697j88311e8898I9651A6789
18311c70576A41960m0094l261a4897p0053A74276F3692J6622L5178n6303a92025
18299a37908B01065a33846j79621b4846E0804M5202b05916A1516l933a14507B24368
18287b77337B20184a39413j74226a13739B56762g7950G3244c21686J9308R7641
$$ y = [108260, 285991, 221832, -277962, 91177, -83501, -83907, 270124, -369254, -69505, -12477, -173115, 74518, 21122, -61264, -110217, -48109, -201109, 53350, -18297, -137080, -205469, -49087, -143429, 105494, 50226, -22393, 103762, -24978, -5770, -192775, -87458, 9962, 4695, -90162, 45262, -99382, 30009, 78920, 234503, -85664, -54703, -188478, 122698, 283945, -69578, -5813, -51824, 41076, 100715, 60871, -219285, -142609, 309442, -69697, -258008, -58898, 99651, 16789, -370576, 141960, 101866, 98605, -14897, -84950, 174276, 63692, 80314, 115492, 59189, -192025, -137908, 201065, -133846, -313467, -24846, 50804, 96006, -205916, 11516, 7583, -114507, 224368, -277337, 220184, -139413, -313639, -113739, 256762, -77950, 73244, -321686, -302378, -204737]
18277b04737A40729F8968a79092o6856A29483l2079O092p864a10041A57500a32102
18265c60136c8661k26475f9027L0306j7849j79000m0324a24544o3494a5044l6204
18254e1248F9818K17277E8921e4334A7534f4998j89641f3977C12729F299g8584
18242a91793b3685l44364a0780C95479c24702F0573j641K25884a13153A98143
18231A84094m3081a07436M1757q8758H1447j7658A162O8222M7669g1601R976j00405
18219a62030n0589j70526A54379d27742d548B65637a93161d7934j4900L1371A05603
18207a04238K9062p2333o8310F0213B8503L7029a92625f8779j64700I8425b94341
18195I2709b67153H9510N5483C869b16937O9693B00455o4612b7550A05165a19123
$$ y = [-204737, 140729, 68968, -179092, -245948, 129483, 97404, 103496, 95632, -110041, 157500, -132102, -360136, -38661, -265136, -69027, -38721, -56570, -235570, -275894, -124544, -188038, -15044, -51248, 69818, 287095, 58921, -54334, 17534, -64998, -254639, -63977, 312729, 6299, -78584, -191793, -23685, -368049, -10780, 395479, -324702, 60573, 58932, 284816, -113153, 198143, 184094, 141013, -107436, -65679, -154437, 81447, 63789, 1162, 69384, 117053, -71601, -61625, -162030, -212619, -383145, 154379, -427742, -4548, 265637, -193161, -47934, -62834, -31463, 105603, -104238, -75176, -147509, -215819, 60213, 28503, 65532, -192625, -68779, -233479, 98425, -294341, 92709, -267153, 89510, 144993, 3869, -216937, -147244, 200455, 135843, -27550, 105165, -119123]
18183e30268C55008F7796h17j61813j88801h9663A69930O5742a7235A33256a98836
18171b03021H7088b20028d6258m27958a90100E8911b71877g0037p9967m7092E7086
18159B40553J22452i7280k7622A07106b5411A1941h6647o3324A24279d8989K891
18148d6098A84297l5428F7487b15248a06669B72868a77620B221c00620R1692C6878
18136b15678P5496d6419B90127f1714n8773n4053j22127H4383d4723A63783J10886
18125B74669b38776j53013j1770A12096a05142B80314g9222m102B6605b0720H449
18113C10200b68068a31160B33931a48486P2549q091j53469A13829R995b96412
18102D7124J54342r2160b96836l3381h0035j09206A40971D0319A8052a13998H8919
$$ y = [-530268, 355008, 67796, -817, -162630, -351431, -89663, 169930, 235672, -17235, 133256, -198836, -203021, 87088, -220028, -46258, -474216, -190100, 58911, -271877, -70037, -150004, -197096, 57086, 240553, 363005, -97280, -124902, 107106, -25411, 11941, -86647, -149971, 124279, -48989, -46098, 184297, 148869, 67487, -215248, -106669, 272868, -177620, 2221, -300620, -208928, 36878, -215678, -140182, -46419, 290127, -61714, -120487, -174540, -296667, 84383, -44723, 163783, 274669, -238776, -391789, -403559, 112096, -105142, 280314, -79222, -83324, 26605, -20720, 8449, 310200, -268068, -131160, 233931, -148486, -75937, -84028, -237497, 113829, 123824, -296412, 47124, 201466, 109306, -296836, -330217, -80035, -189241, 140971, 40319, 18052, -113998, 88919]
18090B49947b92437a40547C58855A30390a37279C17447c7023j17521H2940G05
18079A40896P0534a20897A19827C1858d41476C74152a90367j20969a07069k7079
18069a34148A78549C7348O453K29122D0699a64892b5543B01959a57548D1473L16825
18058C58298a632p4791H4983Q9650N774a37252F9351f0166F67L1717q506b1445
18045c3929m6129l7749R77N524k58894f4807n727p8978k5940K4137A63193B176
18032G8261R0989e7493D5612i367A56055G887b27381l7665A16850R5864f406q9652
18020i6058j43356C6165K5011K4912e7930p4525d6613r121K2518A64477G9369
18008a6873p9506B363a02692A54374i8431A31018i7276F1494J07426a50713A20248
$$ y = [249947, -292437, -140547, 358855, 130390, -137279, 317447, -37023, -154544, 82940, 705, 140896, 211430, -120897, 119827, 31858, -441476, 374152, -190367, -311336, -107069, -134148, 178549, 37348, 43801, 272923, 40699, -164892, -25543, 201959, -157548, 41473, 358298, -1632, -76423, 84983, 174633, 180407, -137252, 69351, -60166, 667, 32384, 23878, -21445, -33929, -80058, -117807, -116830, -111306, -370200, -64807, -70534, -149512, -175452, -151315, 163193, 2176, 78261, 169250, -57493, 45612, -9367, 156055, 7887, -227381, -265046, 116850, 212714, -6406, -96058, -239414, 36165, 61176, 86088, -57930, -132455, -46613, -55734, -33216, 164477, 79369, -16873, -96379, 2363, -102692, 154374, -98431, 131018, -97276, 61494, 168920, -150713, 120248]
17996F7415a46729G543L27168b48897H9755b04746H811f2666m4404A87905I0844
17984B2031K9960O5487D4446O8714d7042k58366m1792a28141A40918a86328g9635
17972B0605a24535C41307h7720r3505E1906O686g0416L0424k6439H729Q4854f281
17959e6893C6021J7761i4664c7809l02463a25089J5839L9434G1462J56535I4572
17947B74466e1972l2772A28809b80207C01924I9390d23096b06496C2736b5440
17936A20655C0605e01834d5563A31670C6966J25721h9735A9282b7339A67836C1997
17924g354n27654A56921d2310r3809G7363c9596d727G8880K76485a69543b9125
17912b12004A36589b8825D2904j7062a79272B05601r2961h359A00985L540E0875
$$ y = [67415, -146729, 7543, 334711, -248897, 89755, -204746, 8811, -62666, -107070, 187905, 90844, 22031, 51991, 117478, 44446, 113160, -47042, -305408, -347200, -128141, 140918, -186328, -79635, 20605, -124535, 341307, -87720, -181225, 51906, 58592, -70416, -39992, -66431, 8729, 93583, -6281, -56893, 36021, 53782, -94664, -37809, -340272, -125089, -109250, -69816, 71462, 227997, 94572, 274466, -51972, -84744, 128809, -280207, 301924, 99390, -423096, -206496, 32736, -25440, 120655, 30605, -501834, -45563, 131670, 36966, 162687, -89735, 19282, -27339, 167836, 31997, -7354, -535008, 156921, -42310, -136119, 77363, -39596, -4727, 78880, 355365, -169543, -29125, -212004, 136589, -28825, 42904, 25842, -179272, 205601, 112640, -8359, 100985, 104525, 50875]
17900d9079D49525j96633k5952c0047f496k19194E3927a76786A43147E4059g313
17888I5896i0528A71753a78875L6019K7171k1393B60207r361I4621a84801A81151
17876d1877k15553D8647a85674A71152G4777b0199l6978o9931A79R2213c37542
17864a1311B97219B3485a5801I004K98193a15907b2535N71j50515A56265m7892
17853A08373D4441g144B7873a41503C0967b00543L880r8536d5347j82283B82215
17841A74486Q2289j18104J04665A4414J17294b1236m7040F3570K3616a81607q7568
17830b69175c329B8930a7426k8155A14374h9489A74695D3179J43804k3237e7965
17818b50776f1119j17631j40412a34578O678F7384b17384I0332A2338b41585a05918
$$ y = [-49079, 449525, 252892, 226940, -30047, -6496, -225690, 53927, -176786, 143147, 54059, -7313, 95896, -90528, 171753, -178875, -142856, -115685, -137078, 260207, 250846, 94621, -184801, 181151, -41877, -257430, 48647, -185674, 171152, 74777, -20199, -57177, -127108, 179, 92392, -337542, -11311, 297219, 23485, -15801, 9004, 307197, -115907, -22535, -21964, -172479, 156265, 108373, 44441, -7144, 27873, -141503, 30967, -200543, -196663, -295199, -45347, -227630, 282215, 174486, 256775, 138671, 243336, 14414, 131708, -21236, -68276, 63570, 87186, -181607, -269175, -3329, 28930, -17426, -45581, 114374, -89489, 174695, 43179, 186983, 163746, -57965, -250776, -61119, -178750, -319162, -134578, -127900, 67384, -217384, 90332, 12338, -241585, -105918]
17806a47945L6221d3167D8941j8079b0806j00107B44338o1662b44948a10047A10995
17794A72620O2805h2887C5856c91806B3616c2806A8632a04587L6237A62242g1388
17782A0682K44988b17528A83714a10349j45561A54854p5760l8330f9856l5908
17772a05764A25201d0022H5675f2041A50234a0426k5881j47000q3695B41839h3604
17760a78685I4404D2480H98h9668j0436b0843a137A31421n6575h348A69618B4777
17747g9596I5250a30741E7706J22152a570k57748A02776d1478l1425C8125K015
17736D0140a25352d0299A42224b64116f5923P445A13693a96404A42429J0088q986
17725A43531c62893a08138d7088C2888K78752a85024o7015C27184a42330A57043
$$ y = [-147945, -111724, -43167, 48941, 30862, -20806, -120913, 244338, 182676, -244948, -110047, 110995, 172620, 235425, -82887, 35856, -391806, 23616, -32806, 18632, -104587, -68350, 162242, -71388, 10682, 255670, -217528, 183714, -110349, -255910, 154854, 79094, 40764, -69856, -105764, 125201, -40022, 85675, -62041, 150234, -10426, -36307, -183307, -267002, 241839, -83604, -178685, 94404, 42480, 898, -89668, -100104, -20843, -1137, 131421, 74846, -8348, 169618, 24777, -79596, 95250, -130741, 57706, 179858, -1570, -259318, 102776, -41478, -72903, 38125, 40140, -125352, -40299, 142224, -264116, -65923, -58478, 113693, -196404, 142429, 152517, 143531, -362893, -108138, -47088, 32888, 311640, -185024, -252039, 327184, -142330, 157043]
17714B57229a67070p4452F1908f8468A28635E7161c262I4058K14077k7265j01047
17703A79823i9577E9252J45843b9348a3957j94969B97611a04610I4219h5876K9220
17692e6656j1384F5164l0343K1435K7895b7078j00881F5136Q5133a4539G7886
17680a13820B83403j08376A9043a74243K4520a7028A7282M5b71832B7062Q6497
17669A13559R266K39867H2206Q8439a82816B37067c7585B3422b4869I9303c5968
17657b3032k54004H4883c61398C9376J9016a02432p9108e5904K1343B0102M23182
17646D43284a30573d4157D77569a36839D16164b27224e0269l6136k8449j02955
17636b17809J01962a2517B9633O0320L89667A49682Q04F9751d9396C04738b95490
$$ y = [257229, -167070, -241522, 61908, -68468, 128635, 57161, -3262, 94058, 308135, 280870, 179823, -99577, 59252, 205095, -29348, -13957, -208926, 297611, -104610, 94219, -85876, -56656, -68040, 65164, 34821, 56256, 84151, -27078, -127959, 65136, 150269, -14539, 77886, -113820, 283403, 175027, 19043, -174243, -149723, -17028, 17282, 17327, -271832, 27062, 113559, 122825, 362692, 82206, 170645, -182816, 237067, -37585, 23422, -24869, 99303, -35968, -23032, -277036, 84883, -361398, 39376, 58392, -102432, -181540, -55904, -34561, 20102, 443284, -130573, -44157, 477569, -136839, 416164, -227224, -50269, -86405, -114854, -217809, -115847, -12517, 29633, 89953, 479620, 149682, 150486, 69751, -49396, 304738, -295490]
17624B46745b03677J7130g4571D287i5200n2051C2676H688K96377A36443K63660
17613D00103h9240L520r3650J1958B93212F5649a38134A74292a45371L5293A34825
17601B31765m8881a33862e7048F9870g833A70761L6365F9422a10152k91476A84429
17589B26981a0816C435K88336o3747e1688H2918g0567D7346j5782J26893C2602
17577d20546Q8619A0919J50776J96882j49902G324b41055b2801O595k6332A71406
17565F6449b20655B35551A9510a15342l9347B91077D7113g1550B34132o9728F0324
17553C9790L551L82353E3132c085j9119A79952a68897O6246d2271C0988l219a41503
17540C9138N6148A7523L14387A65840a10320E01502I6509J22061r8107J35154
$$ y = [246745, -203677, -186547, -74571, 4287, -95200, -147251, 32676, 8688, 305065, 136443, 400103, -89240, -85720, -179370, -167412, 293212, 65649, -138134, 174292, -145371, -110078, 134825, 231765, 182884, -133862, -57048, 69870, -7833, 170761, 207126, 69422, -110152, -401628, 184429, 226981, -10816, 3435, 291771, 228024, -51688, 82918, -70567, 47346, 31564, 158457, 32602, -420546, -331927, 10919, 161695, 358577, 208675, 7324, -241055, -22801, -16206, -42538, 171406, 66449, -220655, 235551, 19510, -115342, -154689, 291077, 47113, -71550, 234132, 164404, 60324, 39790, 43341, 425694, 53132, -3085, -22204, 179952, -168897, -102651, -42271, 30988, 27769, -141503, 39138, 95286, 17523, 331910, 165840, -110320, 501502, 96509, 218570, 120463, 255617]
17530B55617A7398K80218q8736K0106b17815B74424O169G2155Q7083c1928a1540
17518A42665E3266c0179D10008E9241d8436B04209C6011K34878f2181m3899B05419
17506A55237a87333c588k30578B35929b15075A97523n6652B541J60151J17140
17496B79832L664e5305A16834J72824a12411j3601A53874e0160A4864J93543q7577
17485A20830a94478A31155k9011J6513e7098B0263K96483j02227R2754b5523B54845
17473B98908h4310A62236J36427Q6452j07036E0015A6758K56570B6279a06436
17462A23449A8211M39198e3775m802P072J1821m5229D64640j42453n0880J37627
17451D08934j32591h1242A17664L83603j28289j25546p515K22368A39123j0821
$$ y = [255617, 17398, 297616, 208880, 228986, -217815, 274424, 280593, 72155, 159238, -31928, -11540, 142665, 53266, -30179, 410008, 59241, -48436, 204209, 36011, 270889, -62181, -106080, 205419, 155237, -187333, -3588, -234166, 235929, -215075, 197523, 140871, 2541, 162692, 279832, 283496, -55305, 116834, 289658, -112411, -126012, 153874, -50160, 14864, 208407, 120830, -194478, 131155, 102144, 118657, -57098, 20263, 316746, 214519, 307273, -25523, 254845, 298908, -84310, 162236, 298663, 385115, 278079, 50015, 16758, 273328, 26279, -106436, 123449, 18211, 457409, -53775, -58577, -51505, -39684, -84913, 464640, 322187, 271307, 408934, 276343, -81242, 117664, 501267, 372978, 247432, 239917, 462285, 139123, 128302]
17441A28302h841F9200B2295e9455B84397d4155B42143r1804J13986K07292b10838
17429a55428C28631j25860o5354K03186D2127M14331k24455K53747j88742A09357
17418B38869i3418C95588G8716L29907A58084A855c0636D15389E1952c96553i7763
17406I1011i3715I5776J03879o2142o0793d866E3623K06719a62714g616l17308
17395c24924A99479g9700A74311D744K24493o1166o9942J3441i7210c0425g773
17383i0814r7980C0415f9144B26001E4794a14452B09874j1233P4471K29283i7577
17371B2520L39125m3937D9173J25268G2466L21787I9327J38887a11487a5996k23782
17360b39778Q5392B60199i5896B07440r285M5685a27346K2207C1439a05192c8238
$$ y = [128302, -8841, 69200, 22295, -59455, 284397, -44155, 242143, 150339, 264325, 471617, -210838, -155428, 328631, 202771, 137417, 340603, 42127, 456458, 232003, 485750, 297008, 109357, 238869, -93418, 395588, 78716, 408623, 158084, 1855, -30636, 415389, 51952, -396553, -97763, 91011, -93715, 95776, 199655, 137513, 76720, -4866, 53623, 260342, -162714, -7616, -324924, 199479, -79700, 174311, 4744, 229237, 168071, 98129, 111570, -97210, -30425, -7773, -90814, -188794, 30415, -69144, 226001, 54794, -114452, 209874, 198641, 273112, 502395, -97577, 22520, 361645, 317708, 49173, 174441, 72466, 394253, 99327, 238214, -111487, -15996, -239778, -154386, 260199, -95896, 207440, 198155, 243840, -127346, -105139, 31439, -105192, -38238]
17348B35356I4530J20640K99282j58429j29119d6682j84430B25407K08174A37511
17337B34684J0668o4349G3120k8254m54N3209a33780b5799A08859D2194f0359
17325A5186J22762j8197J54279J30923A96512a87492A19356A2768i7228D27411
17314D15015A10609a07494E55311A06312M7038O5303c20359B13730F9425J88028
17304B57453r8383O610a69511B09143o5762M0638j8831K34605A55159B0007L12720
17293C32727j65763p655a7204A18726D3043A7549J13578Q2334m2895d3417D08242
17281c195B4522P4259K37175E7782L32916j46325a0259G7904a13358B39372q4378
17270A54994Q4402I7872b3058r641A69642b60838b4593B44402C3927J48428p1749
$$ y = [235356, 94530, 215170, 514452, 356023, 226904, -46682, -231112, 225407, 433581, 137511, 234684, 245352, 181003, 73120, 44866, 44412, 97621, -133780, -25799, 108859, 42194, -60359, 15186, 137948, 119751, 274030, 404953, 196512, -187492, 119356, 12768, -97228, 427411, 415015, 110609, -107494, 555311, 106312, 153350, 218653, -320359, 213730, 69425, 257453, 159070, 165680, -169511, 209143, 143381, 184019, 165188, 399793, 155159, 20007, 332727, 166964, 159309, -17204, 118726, 43043, 17549, 131127, 213461, 170566, -43417, 408242, -3195, 24522, 98781, 335956, 57782, 390698, 244373, -10259, 77904, -113358, 239372, 154994, 239396, 97872, -23058, -32699, 169642, -260838, -24593, 244402, 33927, 182355, 110606]
17259A10606J92127F3079M09156k32025A16274L8195K03619G1062M501O35094
17249G10657B93417L1950o6012E5191L83100j74431b7421C14148O5267j3000A24548
17237A66777o0371J0597B7407J85361a70849D16266f8200B4404J89230k6506J35917
17226C23045i088D55907j30906E9112a83240D5533J65345j01858D1483g9568A54187
17214B4704L35293E1983q069J59485L8169m5219c5745B14771M0142K6507k1889
17203B59531j21229k2098K76261p7634N3233G4436K81169Q325i3998D65230j69228
17192B96002g2373A49220K44633j57963O8388m6676J08448H2387N8670F4595M36634
17181E01229j48733C0181J13283D4566L63458j52606J82101j65723q5350a12229
$$ y = [110606, 302733, 63079, 472235, 240210, 116274, 154469, 358088, 71062, 75563, 710657, 293417, 325367, 259355, 55191, 438291, 263860, -27421, 314148, 379415, 366415, 124548, 166777, 106406, 117003, 27407, 212768, -170849, 416266, -68200, 24404, 213634, 187128, 323045, -9088, 455907, 325001, 59112, -183240, 45533, 210878, 109020, 41483, -79568, 154187, 24704, 359997, 51983, 43914, 203399, 241568, 196349, -35745, 214771, 254913, 281420, 259531, 138302, 116204, 392465, 314831, 368064, 74436, 355605, 363930, -93998, 465230, 296002, -72373, 149220, 393853, 235890, 304278, 257602, 366050, 82387, 141057, 64595, 501229, 352496, 30181, 143464, 44566, 408024, 255418, 437519, 271796, 186446, -112229]
17170A13448J40307f5774k547C65836K1174J07693B43771K19735j85925r9385
17160A78196J55154J8622K3238K00565k32201f6445C10506J3521j04011l7821
17150A82195K95037j82957j28363L5251o91M7883l6058K67406N0177j62091n7902
17139C09887A33569N14157k1193q7203A20568J14224J46634G8701K93287j48655
17129B23333R5865o9296Q9791A63621L44861J432B19182L61882j47454A58074
17118E82686o5303B44724K72156B57152l1730Q1902k1479K05991j09257M2026
17108D24605J41210B42581m7539K18338L8339K90130k82283L0305A52760l8535
17098A14225N4858a04725D59018P6412P2881B85548J94919k21278L9319O5024
$$ y = [113448, 253755, -65774, -68321, 365836, 387010, 494703, 243771, 463506, 277581, 178196, 333350, 351972, 375210, 575775, 343574, -66445, 310506, 324027, 220016, 182195, 477232, 294275, 165912, 201163, 200472, 248355, 212297, 479703, 529880, 367789, 309887, 133569, 647726, 626533, 539330, 120568, 234792, 381426, 78701, 371988, 223333, 319198, 249902, 339693, 163621, 508482, 509914, 219182, 581064, 433610, 158074, 582686, 517383, 244724, 516880, 257152, 225422, 307324, 285845, 491836, 382579, 424605, 565815, 242581, 195042, 413380, 451719, 741849, 459566, 489871, 152760, 114225, 169083, -104725, 459018, 535430, 608311, 285548, 480467, 259189, 298508, 363532]
17088C63532n6366J5079l9364R6660j23222K44176j19689J33514j65014K38107
17078E87413n0923j80488A19002J79705j14722L99171B80256P5097Q1892J40813
17068E78058j4240O4828r3001A23641K33909j7500J04873q3845r1101K38427j0117
17057D98287Q6542J14769C12279Q1956j9361A12302K75447M16865j92498r8441
17047E13675o1130R2363j14094L69567A24413M30318q9178A62571M32724q3656
17037E11639M941j63412J29677K98578k68143j59942K26611P3902K16317N2535
17027I22703l25527j52647L14638k57073p9167K87220l28357K48697p9486j44170
17017D06831J14564L42741j62805j65874J25946r9899K07902j10692R6264k97587
$$ y = [363532, 307166, 322245, 282881, 379541, 256319, 500495, 380806, 514320, 349306, 587413, 536490, 356002, 119002, 298707, 183985, 583156, 280256, 355353, 437245, 578058, 563818, 628646, 535645, 123641, 357550, 340050, 444923, 361078, 269977, 508404, 498287, 584829, 699598, 312279, 394235, 374874, 112302, 387749, 804614, 612116, 513675, 452545, 544908, 430814, 800381, 124413, 554731, 465553, 162571, 595295, 511639, 516580, 353168, 482845, 781423, 513280, 353338, 579949, 653851, 870168, 922703, 597176, 444529, 759167, 502094, 422927, 710147, 381790, 630487, 551001, 406831, 521395, 864136, 701331, 535457, 661403, 561504, 769406, 658714, 754978, 457391]
17007D57391K59544A93173N80861l76876K40615k51926J67830K65589j37738j58371
16997E23157L03839j69390P162K50512j42364l4144j96858l3646R7922K00890
16987H07080k4748O4655l71173L03776o7822j8906J64517J06380l08689J17852
16977G72922j64196L71575k52311J64961m01311L67386J12787q4181k27938K69106
16967I28800l29451M18190r9851j32965K17759J760j77438L78012k98495K77486
16957A183807l93662k18164J49734L30743j06439J64480l66127J72412M3110q6047
16947H73847R533m9340L97587j11961m33259M32719J85987k02100O8771J0094
16937A181878o9436l0448j90291K10684j20519K1281K21148j89992j3528K75161
$$ y = [457391, 716935, 193173, 774034, 397158, 637773, 385847, 553677, 819266, 681528, 523157, 826996, 657606, 664768, 915280, 772916, 738772, 541914, 508268, 606190, 807080, 782332, 846987, 475814, 779590, 711768, 692862, 857379, 963759, 655070, 772922, 608726, 980301, 727990, 892951, 491640, 859026, 971813, 887632, 659694, 928800, 599349, 1017539, 917688, 784723, 1002482, 1004242, 826804, 1204816, 906321, 1183807, 790145, 571981, 721715, 1052458, 946019, 1110499, 744372, 916784, 959894, 873847, 883380, 834040, 1231627, 1119666, 686407, 1119126, 1305113, 1103013, 1171784, 1181878, 1112442, 1081994, 891703, 1102387, 981868, 1003149, 1224297, 1034305, 1020777, 1295938]
16927A295938K75686k80079q4800k6577L92251j74728l28778M49615m12440J27102
16917A233190o6025M19985M6587l66770L12840k39744J56504J74380j00307K97616
16907A868256p95062L85537L7195L44486n2400j71074j60499M45450j62726j25151
16897A614012K54658o3715j00817K40415m99112J61533K28993n9853O2983K033
16887A841130j25309j35105O61265o51815J49921L44398k52191n1649j3533L15937
16877B083049k09175j20439L46404R6391L52421m74765J84562j91998J73253P6926
16867B316629l27890L93184L59660k64806k90285K88149J43775q726j10548M05652
16857B904794l12849L3212K41554Q1695N5387l16047O8732N94480n9461m11119
$$ y = [1295938, 1571624, 1291545, 1206745, 1180168, 1572419, 1397691, 1068913, 1518528, 1106088, 1233190, 1167165, 1587150, 1633737, 1266967, 1579807, 1340063, 1496567, 1670947, 1570640, 1868256, 1073194, 1458731, 1495926, 1840412, 1788012, 1616938, 1456439, 1901889, 1739163, 1614012, 1868670, 1804955, 1704138, 1944553, 1445441, 1606974, 1835967, 1776114, 1839097, 1841130, 1715821, 1580716, 2241981, 1590166, 1740087, 2084485, 1832294, 1780645, 1767112, 2083049, 1873874, 1753435, 2099839, 2196230, 2548651, 2073886, 2258448, 2066450, 2239703, 2316629, 1988739, 2381923, 2741583, 2476777, 2186492, 2474641, 2618416, 2609690, 2499142, 2904794, 2591945, 2625157, 2866711, 2948406, 3003793, 2687746, 2756478, 3350958, 3291497, 2880378]
16847B880378k4562J83278J60986n0405K24841O2709q6559K94492K43735l33212
16837C555681O5281J36771Q1624N1715j62163R4561N06908n49618J01022K69007
16827D150789M71605N5760k10641R527K08088j00281K89443J10795J31680K59688
16817E376453O1706L40996m47309R532L13653K57857J18534O8007k24892M46952
16807F321489J91097p2601M25165J5843Q4880o6900K34924N01053j09746J55025
16797G680229K99911K95714K38090J80792M6160L03805L39645P3838L49949L20865
16787A0128998L01956N2693M90886J37757O27845n1900P97357P7287M72465O02025
16777A3637369K72172O25204M45325L05887R97526J81804N74668L88954J046440
$$ y = [2880378, 2855816, 3039094, 3200080, 3149675, 3374516, 3437225, 3350666, 3645158, 3888893, 3555681, 3620962, 3757733, 3839357, 3891072, 3728909, 3823470, 4330378, 3780760, 3881782, 4150789, 4622394, 4678154, 4467513, 4477040, 4685128, 4584847, 4874290, 4985085, 5116765, 5376453, 5438159, 5779155, 5331846, 5341378, 5655031, 5912888, 6031422, 6099429, 5874537, 6321489, 6512586, 6439985, 6865150, 6880993, 6965873, 6898973, 7133897, 7634950, 7525204, 7680229, 7980140, 8275854, 8513944, 8694736, 8740896, 9044701, 9384346, 9458184, 9808133, 10128998, 10430954, 10483647, 10974533, 11112290, 11740135, 11688235, 12485592, 12562879, 13035344, 13637369, 13909541, 14534745, 14980070, 15285957, 16283483, 16465287, 17039955, 17428909, 18475349]
16768A8475349P12677N37609R91134J062034K74441J224094J127405Q21389J340747
16759B6566879R99839J181494J125949J284599J737079J527884J914509J776899
16751C8115131J616107K236465K094576K610646K360277K859019K848733L314206
16743E8055160L512040L708099M170581M509283M261921N050672N368928N601919
16735I4238603O233167O651952O699422P556847P639886P700246Q059757P834374
16727A52614254Q345992P346079P915611O220756N813335N166930L508341K630880
16719A99562178J028747j3212j207093k872873m111973m932397o287389o602306
16711A74563682p732076p765650p912075q824588p778633q086323p511698p762689
$$ y = [18475349, 19188026, 19725635, 20716769, 21778803, 22053244, 23277338, 24404743, 25226132, 26566879, 27566718, 28748212, 29874161, 31158760, 32895839, 34423723, 36338232, 38115131, 39731238, 41967703, 44062279, 46672925, 49033202, 51892221, 54740954, 58055160, 61567200, 65275299, 69445880, 73955163, 78217084, 83267756, 88636684, 94238603, 100471770, 107123722, 113823144, 121379991, 129019877, 136720123, 144779880, 152614254, 160960246, 168306325, 176221936, 182442692, 188256027, 193422957, 196931298, 199562178, 200590925, 200577713, 199370620, 196497747, 192385774, 187453377, 181165988, 174563682, 166831606, 159065956, 151153881, 142329293, 134550660, 126464337, 118952639, 111189950]
16703A11189950o857046o541609n908464n992242n334346m393756m825208m494624
16695F6842655l851316l689302l389449l359992k722038k555875k865531k288752
16687D2120400j758171k316801j857633j775492j507508j574098j572258j412149
16679B8346290j185606j183952j002275j109798n78366j420846o94407n65116
16671B0605924j232770o23098m83795p47673n73493r65661m42681l94164n27618
16662A4614971n21036m98885k13856o51180o4790p19102j61952n71541P4922l55975
16652A0931576o75256k20378k14234n55907L4967l62243m1266j05880m62558L5676
16642H364497l06597m65534m64337k86294M21378l64476o37596L37340k87776
$$ y = [111189950, 104332904, 97791295, 91882831, 85890589, 80556243, 76162487, 71337279, 66842655, 62991339, 59302037, 55912588, 52552596, 49830558, 47274683, 44409152, 42120400, 40362229, 38045428, 36187795, 34412303, 32904795, 31330697, 29758439, 28346290, 27160684, 25976732, 24974457, 23864659, 23286293, 21865447, 21171040, 20605924, 19373154, 18750056, 18266261, 17518588, 16945095, 15979434, 15536753, 15142589, 14614971, 14093935, 13595050, 13381194, 12730014, 12665224, 11946122, 11784170, 11212629, 11287551, 10931576, 10256320, 10035942, 9821708, 9265801, 9300768, 8938525, 8897259, 8791379, 8328821, 8364497, 8057900, 7592366, 7128029, 6841735, 7263113, 6898637, 6261041, 6598381, 6310605]
16633F310605m38930J63601j85782l10398j4776k96224J69362n8624n47091M71175
16623E262918j69500l11952N3558m94771K02165l51022L10626m90893L50755k33274
16613D128610k05510Q764L13778k93490j63464j47155k13390J83673l65077K51146
16603C497885k32353O335M9546o72402M24026q9264k642J26515p6806j14237m541
16592B912062j57173j3332j48590L20437k50779j83272j20519N28487m75011J54096
16582B566406j86267K65596n99925o673L92266k8993q6134k68219J53092l20444
16572A880705P5008J41926L2990J5407l08786n664n4633q006J24922l34939k056
16561A556874o8976L72586l67296n8211K19329K42959l07687J4655o0774K59866
$$ y = [6310605, 5871675, 6035276, 5849494, 5539096, 5524320, 5228096, 5397458, 5338834, 4791743, 5262918, 5093418, 4781466, 4835024, 4340253, 4542418, 4191396, 4502022, 4011129, 4361884, 4128610, 3923100, 3931864, 4245642, 3952152, 3788688, 3641533, 3428143, 3611816, 3246739, 3497885, 3265532, 3271867, 3321413, 2649011, 3073037, 2983773, 2981131, 3107646, 3030840, 2916603, 2912062, 2754889, 2741557, 2592967, 2913404, 2662625, 2479353, 2358834, 2887321, 2412310, 2566406, 2380139, 2645735, 2045810, 2039137, 2431403, 2402410, 2316276, 2048057, 2201149, 1880705, 1955713, 2097639, 2130629, 2146036, 1837250, 1831586, 1776953, 1768947, 1893869, 1558930, 1556874, 1487898, 1860484, 1493188, 1434977, 1654306, 1897265, 1589578, 1604233, 1543459, 1803325]
16551A803325l28625L77729j38774l44971k3259q2535K24805j43479L29071m87664
16541A185623M57787n6856l55498M50760n58707P0813o641J94277k36586J85649
16531A330621k4470l73706L32183j16549l22790K12045R1093K9417K4536K6377
16521A208757m04443L37336m1852N2560L1730l41387o0114J92020l14009L54700
16511A015298Q8871j30711k66714L1903M20254j51808n8838k62255L62215m0759
16501A007456J90044m53481J04388j45558m3244k5412J63567l5954J38120j54525
16491G45401J49804k77470L39722k19756j00968K8128J32755L63420k25870j58046
16481G77120k19613O8484L3608J89219j43642J69397l07031M72164m1529k05039
$$ y = [1803325, 1474700, 1852429, 1713655, 1368684, 1345425, 1262890, 1487695, 1344216, 1673287, 1185623, 1643410, 1586554, 1231056, 1681816, 1123109, 1193922, 1187281, 1381558, 1144972, 1330621, 1306151, 932445, 1264628, 1148079, 825289, 1037334, 1128427, 1157844, 1182380, 1208757, 804314, 1141650, 1099798, 1152358, 1184088, 842701, 782587, 974607, 660598, 1015298, 1104169, 973458, 706744, 738647, 1158901, 1007093, 948255, 686000, 1048215, 1007456, 1197500, 744019, 848407, 702849, 659605, 634193, 797760, 761806, 899926, 745401, 895205, 617735, 957457, 737701, 636733, 664861, 797616, 1161036, 935166, 777120, 557507, 625991, 659599, 848818, 705176, 874573, 567542, 1039706, 998177, 793138]
16471G93138n6545l5270L06648k83900k33220Q8467J39208j4860K79395l55669
16461F27392J19759L74380m74340K62126j79475L9603r4458C16417L04802R866
16451F31085k56059n997L13168j57024K28339j28403B68118L76366j78015J90043
16441F56512l12442n2751r5577K41649Q3870K22485B43756K76205m3246J38730
16431F15445j17961J54022r1082K15311C12548L24901j77865J49120K30696j79016
16421F60384j89253Q6393J92779l38312L71942C85686M2299p6869L1568K96970
16411F79654p0588L5938K126j28687j1128j94160L18096A18458M67203m3668k31014
16400C10979L26856q5164B38448L61821I8650M49723R2439R5111C48692L4338
$$ y = [793138, 736593, 701323, 1007971, 724071, 490851, 579318, 718526, 703666, 983061, 627392, 747151, 1121531, 647191, 909317, 729842, 769445, 674987, 316417, 621219, 631085, 375026, 369029, 682197, 525173, 753512, 625109, 268118, 644484, 466469, 656512, 344070, 291319, 195742, 437391, 521261, 743746, 243756, 519961, 476715, 615445, 497484, 651506, 560424, 775735, 312548, 637449, 459584, 608704, 839400, 660384, 471131, 557524, 750303, 411991, 783933, 385686, 427985, 351116, 382684, 679654, 609066, 645004, 647130, 518443, 507315, 313155, 631251, 118458, 585661, 541993, 310979, 637835, 552671, 238448, 600269, 98650, 548373, 640812, 735923, 348692, 383030]
16390C83030J54820j89182J45213R1662q2443M5049k32574j46187Q8357j1339
16380B46406J49404p566J07513N7027A97494M48101k76341J11765k17673J79728
16370D43074j61126n3009A06208K32620p1554K23928n2911j22502j50301J61660
16360C27148L12896q8645j4060k09636D0268P6451M38658B72157M43498A03954
16349I2817M18342p7434G9503L12653r8101j09870J03016j24711L57214A97079
16338C87932j43393p4530j0658B0048N32330l8941B37150J29993o8650A42347
16327B63499K6137J40082B0198K85102A09035f0976G4413L52464A34854d1760
16316C60371j27797k9579J32918J46179q4153j91513J61225j0182k8757o7215
$$ y = [383030, 537850, 348668, 493881, 585543, 503100, 548149, 315575, 169388, 257745, 246406, 395810, 388244, 495757, 552784, 197494, 645595, 369254, 481019, 263346, 443074, 281948, 228939, 106208, 338828, 267274, 491202, 438291, 315789, 165488, 327148, 640044, 551399, 537339, 327703, 40268, 116719, 555377, 272157, 715655, 103954, 92817, 511159, 433725, 79503, 392156, 294055, 184185, 287201, 162490, 519704, 197079, 387932, 244539, 170009, 159351, 20048, 552378, 513437, 237150, 367143, 298493, 142347, 263499, 289636, 429718, 20198, 305300, 109035, -60976, 74413, 426877, 134854, -41760, 360371, 232574, 202995, 335913, 482092, 397939, 206426, 367651, 357469, 328712, 261497]
16306B61497J29576A57006J31811P9469C7704K39153J53922k0251A33047R3126
16296B26173L6414J69623F3788J59151r127J24273j31330b3049D96103j44697
16286C51406j53319M16946B15367J04442K00253J13069B72182K27478A35187J84620
16276C19807L4681j48947N8663d537F08730G5923P3020K31301P4726k08636J09507
16265C55841J8425j5020A70918J03645j05691N0301K85424B37671E2824K69350
16255C22174J38130B26166a16877A76510J50028H4996M7564K63694H0578j5711
16245F4867K79680N2808a0250A26003l4349L714l4698d0740O068B15390R4363
16234C09753A00010a92815A93529m240P8785P3023O9473F9609A0400c78797A80247
$$ y = [261497, 391073, 157006, 288817, 368286, 37704, 276857, 430779, 410528, 133047, 226173, 262587, 432210, 63788, 222939, 213812, 338085, 206755, -23049, 496103, 351406, 198087, 615033, 215367, 319809, 520062, 633131, 272182, 499660, 135187, 319807, 354488, 205541, 264204, -4537, 608730, 75923, 148943, 380244, 454970, 246334, 355841, 374266, 359246, 170918, 274563, 168872, 219173, 504597, 237671, 52824, 322174, 460304, 226166, -116877, 176510, 326538, 84996, 132560, 396254, 80578, 64867, 344547, 397355, -10250, 126003, 91654, 95368, 60670, -40740, -34672, 215390, 309753, 100010, -192815, 193529, 189289, 268074, 341097, 410570, 69609, 10400, -378797, 180247]
16222B41405M4164J49474B09047K5248A808J02787m8337Q2906J53463l9628C2571
16210b46545A20289E8041h9135A81315p0064J90717A05457O3852c7131a6596A89312
16198c7785A56204J72038o7984K7543n2317J67798B6040K23883E0341b42398B78029
16186c62096A84930l211J37243c9659o353C723M1060J12864n5317e6363B60034
16174B72677R118A17136c9314l9802B01588p3856c7945G0099a46248B28106q0872
16163A47234D1430c32692a7736A82007p8642J70552j35183a4598A00614Q2648
16153A83262f9809m7066p7087B30079E8128c9276n2994D8095L41619j58559A10755
16141A45192a8564I059R8288j4103m3115K48777a31555a63B46396h6456J9084
$$ y = [241405, 285569, 435043, 209047, 234295, 1808, 104595, 56258, 139164, 292627, 252999, 32571, -246545, 120289, 58041, -89135, 181315, 111251, 301968, 105457, 169309, -37131, -16596, 189312, -37785, 156204, 328242, 260258, 287801, 235484, 403282, 26040, 249923, 50341, -242398, 278029, -362096, 184930, 181719, 318962, -39659, -46012, 3723, 44783, 157647, 102330, -56363, 260034, 272677, 281795, 117136, -39314, -79116, 201588, 127732, -37945, 70099, -146248, 228106, 147234, 41430, -332692, -17736, 182007, 103365, 273917, 138734, -14598, 100614, 183262, -69809, -116875, -193962, 230079, 58128, -39276, -92270, 48095, 389714, 231155, 110755, 145192, -18564, 9059, 107347, 93244, 50129, 298906, -131555, -163, 246396, -86456, -67372]
16130f7372a60A09519L0694N3466p2949P8722f2811k598B9611i0848A96717c6557
16117B12155b1896H7853b28361B2681B959a73914B2812J82265E9006K09608a08723
16105a20399A67843R1457b3243B3801J80247k4746a86030D0862K41248C2182K05656
16094B37838D570J70211a20152D60094A49292A2886a82707B5087a13847A20044
16083C54484n5251E4219j9013J03851n4457B1219c53462c260j47449A60656G707
16071B98034b32133f8795D14400a83665d4364j32365A06927d4854m553a4229l70593
16060c84822A90276i4816B3896K9532L9662a60415k52851a71181g3208A00657
16049a75919B75432j936E2572A2711K1501J63399M275l2561l2650a3499K612B59294
$$ y = [-67372, -160, 109519, 140213, 193679, 120730, 199452, -62811, -65409, 29611, -90848, 196717, -36557, 212155, -21896, 87853, -228361, 22681, 2959, -173914, 22812, 205077, 59006, 268614, -108723, -120399, 167843, 259300, -23243, 23801, 204048, 179302, -186030, 40862, 282110, 32182, 237838, 4570, 174781, -120152, 460094, 149292, 12886, -182707, 25087, -113847, 120044, 354484, 299233, 54219, 35206, 139057, 84600, 21219, -353462, -3260, -150709, 160656, 7707, 298034, -232133, -68795, 414400, -183665, -44364, -176729, 106927, -44854, -49407, -14229, -384822, 190276, -94816, 23896, 53428, 93090, -160415, -413266, -171181, -73208, 100657, -175919, 275432, 273496, 52572, 12711, 34212, 197611, 201886, 169325, 136675, -13499, -10887, 259294]
16036a17134A88398a0622q3023k3412A6001K11961a3174m9021a5267B89740j16016
16025A73724m8339b24256F3266J49212N5874i6883p4A94935p8534n6257b9238
16013c36574B87784N8161a58738L8004A80628a35382b4292k72521N9515c6910
16002a24271B78721A01699c70092B02212C833K35775G520L29998a36584M3174
15992i3410B00230b03263a0580j10241k04215i5172A24603b9978j80310A11570
15981i8233k33182B30324a73872j05693d8945C4870K9987K10864D9073d6506B03003
15969A81628a3882j62268k41020A98979a4106B01162b35297A45500K1615J6326
15959A83441a5447j09516I4743N5606O1523r9484a47628p934A72268a30134L3201
$$ y = [-117134, 188398, -10622, -93645, -117057, 16001, 227962, -13174, -62195, -15267, 289740, 173724, 125385, -224256, 63266, 212478, 268352, -96883, -96957, 194935, 116401, 60144, -29238, -336574, 287784, 345945, -158738, -120734, 180628, -135382, -24292, -296813, -237298, -36910, -124271, 278721, 101699, -370092, 202212, 3833, 239608, 7520, 337518, -136584, -93410, 200230, -203263, -10580, -120821, -325036, -95172, 124603, -29978, -210288, 111570, -98233, -331415, 230324, -173872, -279565, -48945, 34870, 64857, 275721, 49073, -46506, 203003, 181628, -13882, -176150, -417170, 198979, -14106, 201162, -235297, 145500, 167115, 183441, -15447, -124963, 94743, 150349, 211872, 112388, -147628, -155562, 172268, -130134, -96933]
15948i6933j8585k075J889j89386a27990A37035b03983K445f107j70633A81417
15936a82426e8420C0031k389R9115g9994l4649r1336b0013I3875c99330C9354
15924A86352q7322b43388b7957E0733e204F5489b58870a2141j78129k28130e5097
15912c1965A77413b13629L746C4871N0283B4290b14880b3105Q879A91897E3936
15900b33663d9068J7250j09587A70992c02727c7380j83444D2609K2902P5278i2752
15888C00260a33053N4040k00119G4078C0813a61064C27102c7874B13039b27375
15877A01989l471b37001k98085G5753a41808p3643K6529E0015j0373K51634A8065
15865a42374j31410B2365J86558a26575M4509p8316G4156J05757i4228A9775b23164
$$ y = [-96933, -115518, -117593, -115704, -305090, -127990, 137035, -203983, -201538, -6107, -176740, 181417, -182426, -58420, 30031, 27642, 126757, -79994, -114643, -205979, -20013, 93875, -399330, 39354, 186352, 99030, -243388, -27957, 50733, -5204, 65489, -258870, -12141, -190270, -418400, -55097, -31965, 177413, -213629, -209883, 34871, 85154, 24290, -214880, -23105, -14226, 191897, 53936, -233663, -49068, -31818, -141405, 170992, -302727, -37380, -220824, 42609, 65511, 140789, -92752, 300260, -133053, -79013, -279132, 74078, 30813, -161064, 327102, -37874, 213039, -227375, 101989, 98518, -237001, -535086, 75753, -141808, -215451, -188922, 50015, 39642, 291276, 18065, -142374, -273784, 22365, 208923, -126575, -82066, -160382, 74156, 179913, -94228, 19775, -223164]
15853D0776G254N69L3683M897G130a39200b3551C17427h7372k22186j36696K6168
15841d20086H2159J96580d1328j04350b5274o9178j38641A49193i133j10848n7862
15830a77843g5926C6565K87032q4822c28520J32832k146j77773A54945J21552
15820B76497a15006A28730f3509d477j84862d7177B1712O3542P7450a51256J1458
15809a39798e5577j00205F142K06619K22154j12531A23728b02233H3264c6192
15798C1662P9063h1169j00036j12345I1610b0400j8113l996I038R4244f6646D1869
15785c42686C6773j1140K383e3603j21563m4893A04224b02982j6300M3956L7452
15774a37874r6313J16924A69056g629k06908M7566M1590B0415J32925h06r4472
$$ y = [40776, 7254, 7823, 41506, 46403, 7130, -139200, -23551, 317427, -87372, -309558, -446254, -420086, 82159, 278739, -41328, -145678, -25274, -94452, -233093, 149193, -9133, -119981, -177843, -75926, 36565, 323597, 238775, -328520, -195688, -197834, -375607, 154945, 276497, -115006, 128730, -63509, -4477, -189339, -47177, 21712, 85254, 162704, -151256, -139798, -55577, -155782, 6142, 212761, 434915, 322384, 123728, -202233, 83264, -36192, 31662, 110725, -81169, -181205, -293550, 91610, -20400, -38513, -42509, 9038, 103282, -66646, 41869, -342686, 36773, 25633, 28016, -53603, -175166, -220059, 104224, -202982, -219282, -175326, -137874, -234187, -117263, 169056, -7629, -214537, -166971, -125381, 20415, 153340, -806, -95278]
15763i5278j3669h472G7238c513C0621c20196J51200a0360k29609K4957g7219
15751C5504b58894k6164L6933a0037G1267J69791j6963b13839d1652j98173B13144
15739i276j37919K4499j899A27221k6773b57739a25173K3944G3203a48113D6173
15727b36405D56756H0183b88059J38847d2941j71679M9338I6357b3446m924B51429
15715c66296B00970a11994C99538l5851E1102h695A8071J56325b15476k28531
15705d44007C28149F8793a15374j03743A86098C0955J15426J07309n0905r2288
15695A10497b00457C06277D141h7219A27264O768K08971D34c22466A88396G126
15683A90676a69154N4248q6976c9819k2668a7592B2358g5874A09484D9783K74237
$$ y = [-95278, -108947, -8472, 77238, -3513, 30621, -320196, -168996, -10360, -239969, -215012, -77219, 35504, -258894, -285058, -248125, -10037, 71267, 241058, 224095, -213839, -41652, -239825, 213144, -9276, -147195, -122696, -124595, 127221, 100448, -257739, -125173, -101229, 73203, -148113, 46173, -236405, 456756, 80183, -288059, -149212, -42941, -214620, -165282, 96357, -23446, -28370, 251429, -366296, 200970, -111994, 399538, 363687, 51102, -8695, 18071, 174396, -215476, -444007, 328149, 68793, -115374, -219117, 186098, 30955, 146381, 253690, 202785, 110497, -200457, 306277, 4141, -87219, 127264, 134032, 343003, 434, -322466, 188396, 7126, 190676, -169154, -114906, -201882, -39819, -62487, -17592, 22358, -75874, 109484, 49783, 324020]
15672C24020c80670a30945A46706a05023O837j88496a09057A03642a23961J7364
15662a06597C33798a88035G1296J43012a66246e6391B5107Q2476q729a4318k18068
15651b32386d7934A64780c13430B10388a15025k6027a0718p9630B05233D123i0801
15639i1027d3182k08186j22564e660j28143o8439K1493O7633a8854B33755O7115
15628C00870b42777l5614F5990O5598F2898c56977B05353a68457I3984m4919K8462
15617G7527O5333d1771l20614M0344P2165c6379B08992h2604p2040P6936l24492
15606d02200B01453a54194D0331d80175J73306h7166d0021j52199j24294g1251
15595b9709G8457g9986j18228P8632k5153F0700G846N5312b35391I2000R4688
$$ y = [324020, -380670, -130945, 146706, -105023, -98186, -286682, -109057, 103642, -123961, -106597, 333798, -188035, 71296, 214308, -166246, -56391, 25107, 107583, 98854, -14318, -232386, -47934, 164780, -313430, 210388, -115025, -141052, -10718, -90348, 205233, 4123, -90801, -91027, -43182, -251368, -373932, -5660, -133803, -202242, -180749, -113116, -18854, 233755, 300870, -242777, -278391, 65990, 131588, 62898, -356977, 205353, -168457, 93984, 49065, 77527, 142860, -41771, -362385, -322041, -249876, -36379, 208992, -82604, -154644, -77708, -402200, 201453, -154194, 40331, -480175, -306869, -87166, -40021, -192220, -316514, -71251, -29709, 78457, -79986, -198214, -119582, -144735, 60700, 7846, 63158, -235391, 92000, 186688]
15584A86688g1786D2235A6995J76197d5222A93326I3158c36695A63444J08111
15574B71555o8064J02632b7382j01961c9426o4011o7241C0875J7234a13849L9543
15563g4306I4549C4731N145K21130a47302k57406D39477a55127l59886F120J08639
15552A14759d87486a94264o8638E3659j9568N3928B6157d9490l5167I1895Q4072
15541A75967g8765q6810c2567k6800A99941J7084a38884F4304J1244J80b45420
15529B46369B4279h8837B41998a1428B92717D5572K81262q1379B7229b22722a06168
15517E3060a3439I5952k2004L1191J08377q7840K34721g7421C8640a5009G7436
15505D7944E29h8970C54735j52646E9893j1865M5604a72410b1864e166H2843l1172
$$ y = [186688, -71786, 42235, 16995, 193192, -45222, 193326, 93158, -336695, 163444, 271555, 203491, 306123, -27382, -129343, -39426, -103437, -170678, 30875, 48109, -113849, -74306, 94549, 34731, 39876, 261006, -147302, -404708, 439477, -155127, -515013, 6120, 114759, -487486, -194264, -262902, 53659, 34091, 88019, 26157, -49490, -84657, 91895, 175967, -78765, -165575, -32567, -59367, 199941, 217025, -138884, 64304, 75548, 75728, -245420, 246369, 24279, -88837, 241998, -11428, 292717, 45572, 326834, 245455, 27229, -222722, -106168, 53060, -13439, 95952, 73948, 105139, 213516, 125676, 360397, -77421, 38640, -15009, 77436, 47944, 529, -88970, 354735, 202089, 59893, 48028, 93632, -172410, -21864, -5166, 82843, 51671]
15493E1671P0352a18789L1447j34023C4846J34849L9794G1843a62575A51825a5857
15481G1629b24857e0400B14580b19612a01455J0252n3435E399a6814E7043O8987
15470A26030b38122g1477a0323j02148m0602K2635J160B5864d01409a10883K3329
15459h7554D6038j3810J60444c67679j606i9396B30627J17541D866d4597K762
15448d1835l8155C5184b821G8339a38168c5725A38936a45602H5034b9062j37035
15437a66097k19440g0981A93309P5392b40851C0164J24103h0186A18156C7222
15426A75104b95165J24584O8825B18031a98581B3286i4101m682I7156b08798J02409
15415a06389k35848A66253E77d6671A23829C4037c0892C97141b52704a05630K5672
$$ y = [51671, 122023, -118789, -87342, -221365, 34846, 169695, 209489, 71843, -162575, 151825, -15857, 71629, -224857, -50400, 214580, -219612, -101455, -91203, -144638, 5399, -16814, 57043, 126030, -238122, -71477, -10323, -112471, -153073, -130438, -129278, 25864, -401409, -110883, -87554, 46038, 32228, 192672, -367679, -369285, -99396, 230627, 348168, 4866, -44597, -41835, -79990, 35184, -2821, 78339, -138168, -35725, 138936, -145602, 85034, -29062, -166097, -385537, -70981, 193309, 268701, -240851, 30164, 154267, -80186, 118156, 37222, 175104, -295165, -170581, -101756, 218031, -198581, 23286, -94101, -98783, 97156, -208798, -106389, -342237, 166253, 577, -46671, 123829, 34037, -30892, 397141, -252704, -105630, -79958]
15404g9958C1479e45703a0015I3627a76913h2374B15837q2654C2677J61918c08516
15392a45345A8714P3524k6800K64858E8245d657G9628l3869K5309J39274e518
15380b5161N379B90169A06301a92398A59685O1503F1602L2562N0259a19148A38168
15368A98359b80938B05237a38011A77590J22649A04916K7662C9744M72219H4697
15357D8078i7790A84464b85184A31350L0951p7110b02815B70352a18024A38902
15346d042B5394a64788F9229e5036j3439B7783K12344J59138A29199i6703A94501
15334a48780c1929C2452O8539J6526N1807l5327J85237a04974o1506I8505d854
15322a25878B87089f2685A91088E8843i9501l5636D361J80621I246m597c25057
$$ y = [-79958, 31479, -545703, -10015, 93627, -176913, -82374, 215837, 133183, 32677, 194595, -308516, -145345, 18714, 92238, 65438, 330296, 58245, -4657, 79628, 45759, 71068, 210342, -5518, -25161, -19782, 290169, 106301, -192398, 159685, 221188, 61602, 94164, 144423, -119148, 138168, 198359, -280938, 205237, -138011, 177590, 300239, 104916, 132578, 39744, 511963, 84697, 48078, -97790, 184464, -285184, 131350, 162301, 85191, -202815, 270352, -118024, 138902, -4042, 25394, -164788, 69229, -55036, -68475, 27783, 240127, 399265, 129199, -96703, 194501, -148780, -31929, 32452, 100991, 117517, 169324, 133997, 319234, -104974, -166480, 98505, -4854, -125878, 287089, -62685, 191088, 58843, -99501, -135137, 4361, 184982, 9246, 4649, -325057]
15310C14084b3252D2200a02476F2110B5103L85341e6702B45518a18539p4947h5879
15298C31150a64032L7551C9939K14711e2373C02676m8944g8722A49784C0299R2503
15287A22802b48761i816B11316g5618n2021f336j05897l3397j48546J32661C74415
15275A33169P2085d3604B64590K3626a64880I9766a62146E65189C6855d9743A48062
15263A265a07749D56893D283a51851L8169B10150F2279a14709A09843j8272d3553
15251B55239G3730R8045N34701J82784J52545J62232j74200k49305k73825A13153
15240F169h1724o311e902A62012n3611k1850Q0767m7430J58686n9649e5867A1666
15227B88509l957j28526C7524c05639A25564J91094A18360E8062a94501A40070
$$ y = [314084, -23252, 42200, -102476, 62110, 25103, 410444, -56702, 245518, -118539, -193486, -85879, 331150, -164032, -126481, 39939, 254650, -52373, 302676, 253732, -78722, 149784, 30299, 122802, -248761, -9816, 211316, -75618, -127639, -6336, -112233, -145630, -294176, -161515, 374415, 133169, 205254, -43604, 264590, 288216, -164880, 99766, -162146, 565189, 36855, -49743, 148062, 1265, -107749, 456893, 4283, -151851, -113682, 210150, 62279, -114709, 109843, 91571, -43553, 255239, 73730, 171775, 706476, 889260, 1041805, 1204037, 1029837, 780532, 506707, 113153, 6169, -81724, -88035, -5902, 162012, 108401, 86551, 167318, 119888, 278574, 218925, -55867, 11666, 288509, 284552, 156026, 37524, -305639, 125564, 316658, 118360, 58062, -194501, 140070]
15216E3396K7678q656J89593A1947J89897r6999J61566f0106k12796A4768O0173
15205G4941R6160G6734e5814j0126j12912A75430j4451O4471k9694f6573G8513
15193a41809A77212P024p9742K20401D6994M4329E481g4142A44546P8433A08414
15181d9060a3945A80274H1558K0013e55F29960B78393A13183k6962a39980B42960
15169B01768F0652J07176B9526b2100H1476h3464B98856M5200H8584h7038c7772
15157A05319Q0667o3125J552j2700b32409e3295A86582J71654I4760B4631J26281
15146A50912J50131j26026g6422C65496a27259C89711a9714F8435k9595N1046
15136H9886i9636C51570j9651a46469O4721C75467n743A31130J07890I0856J0499
$$ y = [53396, 81074, 72418, 262011, 11947, 201844, 104845, 266411, -60106, -272902, 14768, 74941, 171101, 76734, -55814, -65940, -178852, 175430, 160979, 225450, 195756, -66573, 78513, -141809, 177212, 184236, 104494, 324895, 46994, 91323, 5481, -74142, 144546, 222979, 108414, -49060, -13945, 180274, 81558, 101571, -555, 629960, 278393, 113183, 86221, -139980, 242960, 201768, 60652, 167828, 29526, -22100, 81476, -83464, 298856, 344056, 88584, -87038, -37772, 105319, 185986, 122861, 124413, 111713, -232409, -53295, 186582, 358236, 94760, 24631, 150912, 301043, 175017, -76422, 365496, -127259, 389711, -19714, 68435, 38840, 89886, -99636, 351570, 331919, -146469, -81748, 375467, 369724, 131130, 239020, 90856, 101355]
15125A01355P5521J2303a56196j00357C49176C713M8283a7500H6405j2787J04223
15114A77841P6301K32431B26371f6069j4595F1266i8780L0321C59874B7444L42974
15103C70418G6340a25474A95462J99651A59589K18880a5184A51184J07795D8583
15092a40797a932A89264a15345e6094B68557d667E5482J21049c8674F4999Q5235
15081A50234a19602c9490A19279L3548R4517a04771B77959d025j4077A03624E1291
15069h2048j55355C1121J9499J07982e684B72250A29064b94416B1559a13981B58779
15057a0431A56628E2145Q1848b23498a01210K8970F9596J48192q7483a39940A51061
15045A54689J09174A07939K76571a04203B73742o8315m2097J44032I6137J0867
$$ y = [101355, 176876, 189179, -156196, -256553, 349176, 3713, 51996, -17500, 86405, 73618, 177841, 254142, 486573, 226371, -66069, -80664, 61266, -98780, -68459, 359874, 27444, 370418, 76340, -125474, 195462, 395113, 159589, 378469, -15184, 151184, 258979, 48583, -140797, -1932, 189264, -115345, -56094, 268557, -4667, 55482, 176531, -38674, 64999, 150234, -119602, -39490, 119279, 152827, 247344, -104771, 277959, -4025, -18102, 103624, 51291, -82048, -237403, 31121, 50620, 158602, -5684, 272250, 129064, -294416, 21559, -113981, 258779, -10431, 156628, 52145, 133993, -223498, -101210, -72240, 69596, 217788, 130305, -139940, 151061, 154689, 263863, 107939, 384510, -104203, 273742, 205427, 163330, 307362, 96137, 107004]
15035A07004P011M7692B5266J42271J09107F014K36243j13819P8732J81484j05498
15024B83156g8459C27931J63507A5653N1917J52091K81816A78418l3757L24906
15014D69567D9352J80571a4906k8835B15455o012l4641n20K68976o0687j88360
15003A94211L19607A56987M4785J63340j04264B9516O4197L3962J00979J38828
14993C67482o2063a64246c9593B05033B3874K42090A18454K14889k0993A40616
14982a85267A47453K73797B5713K16398n1815L42861o1578q4931J54069d4993
14971a47763d5746A49327p2585k1411J06762F4075i1348D8288L14806K02447H9828
14959C59685n3999J09968j09655n6460D0058L09796d6900A50851l9126K36245
$$ y = [107004, 114015, 161707, 25266, 167537, 276644, 6014, 242257, 128438, 207170, 388654, 283156, -78459, 327931, 491438, 15653, 67570, 219661, 501477, 178418, 144661, 469567, 49352, 229923, -14906, -43741, 215455, 209443, 174802, 174282, 443258, 382571, 194211, 513818, 156987, 201772, 365112, 260848, 29516, 93713, 127675, 228654, 367482, 305419, -164246, -39593, 205033, 23874, 265964, 118454, 333343, 312350, 140616, -185267, 147453, 421250, 25713, 242111, 190296, 533157, 471579, 386648, 540717, -44993, -147763, -45746, 149327, 76742, 55331, 162093, 64075, -91348, 48288, 363094, 565541, 89828, 359685, 305686, 415654, 305999, 249539, 40058, 349854, -46900, 150851, 111725, 347970]
14949C47970R1819j13770L4493L7446j38371R3006n3234J7549J2654L0941A15422
14937B46450P7602i158C17636A08911P2689J68285P2291A25185L23677k04900
14927B43962K7214d9638C03791a64744D21420N0889k14667J32438A37646J18272
14917B55918N0131M5346J31075n9276j58976m5947I2157M4651L4757L93591J6425
14906E81581B38814K10911b5886C29116J97159B03806f7604D08733A78811Q9826
14896B68637a86948A89959L58885J7103n6418j84220A55188J38821p9374m4437
14886A70198O9854K24531o3626j25999F4915J98239L53012k15572A45372K89648
14876D35020j18302L1324A44117L59387J88969j67095A3478O29208n7934k74761
$$ y = [347970, 439789, 326019, 360512, 397958, 259587, 352593, 299359, 316908, 329562, 360503, 115422, 246450, 324052, -9158, 317636, 108911, 181600, 349885, 422176, 125185, 448862, 243962, 271176, -49638, 303791, -164744, 421420, 472309, 257642, 390080, 137646, 255918, 306049, 351395, 482470, 423194, 264218, 218271, 92157, 136808, 171565, 565156, 581581, 238814, 449725, -25886, 329116, 526275, 203806, -67604, 408733, 178811, 268637, -186948, 189959, 548844, 565947, 509529, 325309, 155188, 294009, 214635, 170198, 240052, 464583, 400957, 274958, 64915, 263154, 616166, 400594, 145372, 435020, 316718, 348042, 144117, 503504, 692473, 525378, 13478, 642686, 584752, 309991]
14866C09991N09903l75619r3957L09863k73242J10353j58549O8859O9553J19199
14856E96354K31284m02012j57990J59413O2987J01522B37732J57344L10744k53628
14846D52192K92417J30145B43262Q3488o3247H8284M21480L21008B00634n6234
14836A44400K48504j46707K23596A47267J09742L27720k4309L2287j18856J70055
14826F43906B95145K9397J67212j09615O4392K7671l7620J2511j25846L22211
14816F45458k10855J2241j37160N1116J95672J22764R8182A08166Q4670K60342
14806D53178J02250q7837j68473J53454j49031M36467k80731M9385o6570R2899
14796E34991J9888J31403p5476p6043J21053J43335k05385k1858L65534C35694
$$ y = [309991, 819894, 444275, 350318, 660181, 386939, 497292, 338743, 407602, 477155, 596354, 827638, 425626, 267636, 427049, 490036, 591558, 237732, 395076, 705820, 452192, 744609, 874754, 243262, 326750, 263503, 88284, 509764, 830772, 200634, 144400, 392904, 246197, 469793, 147267, 257009, 584729, 560420, 592707, 473851, 643906, 295145, 324542, 491754, 382139, 446531, 474202, 436582, 449093, 323247, 645458, 434603, 446844, 309684, 360800, 556472, 679236, 777418, 108166, 192836, 453178, 555428, 467591, 299118, 452572, 303541, 740008, 459277, 508662, 442092, 534991, 554879, 686282, 610806, 534763, 655816, 799151, 593766, 571908, 937442, 335694]
14785E75518r8420j3172J1357M1395J03662J95701j64879K7547m8849r6254J4232
14774E47838J18468B62537M06127M5617l4031J74C28926L85003j41809J34906
14764G07026K06386j02024j94905J88760j76369L07946l20284p6126K57707J454
14754G99571k00072o9944J86723K02008n1260j84214J19266j22596M6226l1440
14744F94268q9694N3467M91335m01410L19783j39723M0317j0645j05158B95835
14733H80048k9926k23498K1316P8494k54419L38322j32555r932K63286m13072
14723E18064M87417D90243M47356m7796L12064k67842K50968n92044L59453k40913
14713G11489J10135k37177j44388O65616n64j51832j36912J20999j97957r5914
$$ y = [575518, 477098, 463926, 475283, 516678, 620340, 816041, 651162, 678709, 629860, 533606, 547838, 666306, 262537, 668664, 714281, 680250, 680424, 328926, 713929, 572120, 707026, 913412, 811388, 616483, 805243, 628874, 936820, 616536, 540410, 798117, 799571, 599499, 529555, 716278, 918286, 867026, 682812, 802078, 679482, 725708, 694268, 604574, 658041, 1149376, 747966, 1067749, 928026, 968343, 957698, 852540, 295835, 880048, 850122, 626624, 647940, 726434, 472015, 810337, 677782, 667850, 931136, 518064, 1005481, 490243, 937599, 889803, 1201867, 934025, 1184993, 592949, 952402, 711489, 821624, 584447, 440059, 1105675, 1105111, 953279, 816367, 937366, 739409, 643495]
14703F43495L15627l01734Q5499L9385J80523L2625K8721K1091l54615L02625
14693I93242N8315j57619J39144j88854J15610J5793l16370R7504J79758J05902
14683A042425j15919K7878k1493K00436j73957J73489j18805P8339R117m11427
14673F90083M33668l33149M35439l31654J59290P3722J74152l43468P1161L09672
14663A338916k91865L00035l37322L2430K90316j8912l57891J69988q2775k8200
14653A014720J68057O5365p3192O6598P9198k24144k72q9283L53221J05784j44767
14642A321285J33131m7933N127k96736j83870L52668J12483l26920M69930m9282
14632A489883j49231J08802N3681n71035K33165L24406Q5015O3411n32737K09261
$$ y = [643495, 959122, 657388, 742887, 782272, 962795, 995420, 1024141, 1045232, 690617, 993242, 1051557, 893938, 1033082, 844228, 959838, 975631, 659261, 756765, 936523, 1042425, 926506, 954384, 932891, 1133327, 959370, 1132859, 1014054, 1092393, 1101510, 690083, 1123751, 790602, 1226041, 894387, 1053677, 1127399, 1301551, 958083, 1029244, 1338916, 1047051, 1347086, 1009764, 1042194, 1332510, 1313598, 955707, 1125695, 1042920, 1014720, 1182777, 1248142, 1174950, 1241548, 1320746, 1096602, 1096330, 1007047, 1360268, 1466052, 1321285, 1454416, 1406483, 1411610, 1114874, 931004, 1283672, 1396155, 1069235, 1539165, 1489883, 1340652, 1449454, 1503135, 932100, 1165265, 1489671, 1574686, 1638097, 1105360, 1314621]
14622A314621J87456j64525M5338K32273m4411k15523J35378J00171p1863l07403
14612A211512L47436j46544K11615k18424K80860P443O2421k83761J14698Q9084
14602A676340L6389j39528k03829L39399k55994J97509K09268N0259l8301n9124
14592A812388p3761q8829J6810J50280k46935j1401J33896M35137j81303k00356
14582A745926O0907r0653K21848N9361l0455J71978K27302l34284K75756k54130
14572B053556O5099J11164k07765L20197l6513M0679r5424L14772j54342K07974
14562B619397q0599K97082o6606J0752J10716J61323J99461L25947J9436O29585
14552D226494Q84804K051420K809398K846173K576551M381328Q411689J439214
$$ y = [1314621, 1502077, 1337552, 1382890, 1615163, 1570752, 1355229, 1490607, 1590778, 1518915, 1211512, 1558948, 1412404, 1624019, 1405595, 1686455, 1693898, 1756319, 1472558, 1587256, 1676340, 1712729, 1573201, 1369372, 1708771, 1452777, 1650286, 1859554, 1909813, 1871512, 1812388, 1738627, 1649798, 1666608, 1816888, 1569953, 1558552, 1692448, 2127585, 1946282, 1745926, 1806833, 1716180, 1938028, 1997389, 1966934, 2138912, 2366214, 2031930, 2307686, 2053556, 2118655, 2229819, 2022054, 2342251, 2305738, 2346417, 2250993, 2565765, 2411423, 2619397, 2538798, 2835880, 2769274, 2780026, 2890742, 3052065, 3251526, 3577473, 3596909, 4226494, 5111298, 7162718, 9972116, 12818289, 15394840, 19776168, 28187857, 29627071]
14544B9627071m734854j1785226F409931k287175j318415m32625J86249m37660
14536B120305k8642J9211Q438R8012j66904J30119K64901m6350j6541J17919k8257
14525B472211k04840O9864M04856j13691k6931j3453j57493K61371K35576p1285
14515B856185O0424P3114j18042P7788K44018j25872Q6759k01105J74569j13938
14505C013900K81970k19271j26363J21173K84768l6186J62j91903K31006J86012
14495C545268j62813L3581R7103P4241j60151K63210j1633J7537M65053k35924
14485C925472l01281L63969k17550J63048J7059J45578q137n8908L47424q799
14475D367875L0645j36666K82038J94855k07116j41999K20553l77835K67929L62818
$$ y = [29627071, 24892217, 13106991, 6409931, 4122756, 2804341, 2371716, 2557965, 2120305, 2091663, 2110874, 2119312, 2217324, 2050420, 2180539, 2445440, 2399090, 2382549, 2500468, 2472211, 2267371, 2337235, 2742091, 2628400, 2601469, 2588016, 2430523, 2691894, 2927470, 2856185, 2916609, 2989723, 2871681, 2949469, 3193487, 3067615, 3154374, 2953269, 3127838, 3013900, 3295870, 3076599, 2950236, 3071409, 3356177, 3319991, 3320153, 3128250, 3359256, 3545268, 3382455, 3416036, 3513139, 3587380, 3427229, 3690439, 3678806, 3696343, 4161396, 3925472, 3624191, 3988160, 3770610, 3933658, 3950717, 4096295, 4088158, 4029250, 4376674, 4367875, 4398520, 4261854, 4543892, 4738747, 4531631, 4389632, 4610185, 4232350, 4500279, 4863097]
14465D863097l24729P0466J72903j53700J79628J41956M3977m3698M78648O4196
14455E492744j85409R4631R1614P7789m18840J81464K47219j86185q0219M39445
14445E754253R2423j30459K93474K1386j6443J46236j20047M44086J18810J543
14435F605262o2790K42625j07514M1105M11261J54231k05848q5821K60345P5598
14425G328454O9415J01922o3358N97632r6322J77714K19550l24187N36336k0682
14415H526474N44508l45149J71892J98182J81178j97050J51831M58634j25825
14406I564675P6773M65889j8313J94885J06289N67345m75751M70267j36678L49061
14396A1164442J3266M85460J21383J73869J37791K84210o6262P58344K405L72022
$$ y = [4863097, 4538368, 4608834, 4781737, 4628037, 4807665, 4949621, 4993598, 4949900, 5428548, 5492744, 5307335, 5401966, 5493580, 5571369, 5152529, 5333993, 5581212, 5395027, 5314808, 5754253, 5846676, 5716217, 6009691, 6031077, 6014634, 6160870, 6040823, 6484909, 6603719, 6605262, 6542472, 6785097, 6677583, 6718688, 7129949, 7284180, 7078332, 6992511, 7252856, 7328454, 7397869, 7499791, 7436433, 8034065, 7937743, 8115457, 8335007, 8010820, 8547156, 8526474, 9070982, 8725833, 8897725, 9095907, 9277085, 9080035, 9231866, 9690500, 9564675, 9641448, 10107337, 10089024, 10283909, 10390198, 10957543, 10481792, 10952059, 10815381, 11164442, 11177708, 11663168, 11784551, 11958420, 12096211, 12380421, 12314159, 13072503, 13074908, 13446930]
14386A3446930K51203K03470L17110Q8584K73104K0196O92203J47506N1615K40258
14376A5732179J72967N38093L10241N74243J15514K07420K84299N34012M21877
14367A8890845J89457O07958M05413N46469K06243M59713O94470M50222L51247
14358B2802037M22568P51614O53626L32146O01238J71008M00689J106642P42756
14349B7984324J190074J44174N63662R81078O39652Q84178P71130J152500P50903
14340C5061675Q01090J333807N81903J492552J107445R73295J199318J488169
14332D4039254R40692J892726J089565J963137J346618J632596J778007J924572
14324E6607167J896748J850782K265945K157934K595353K472559K301291K789378
$$ y = [13446930, 13698133, 13901603, 14218713, 14307297, 14580401, 14600597, 15292800, 15440306, 15491921, 15732179, 15905146, 16443239, 16753480, 17327723, 17443237, 17650657, 17934956, 18468968, 18890845, 19080302, 19688260, 20093673, 20640142, 20846385, 21306098, 22000568, 22450790, 22802037, 23224605, 23976219, 24629845, 24961991, 25563229, 25734237, 26134926, 27241568, 27984324, 29174398, 29318572, 29882234, 30863312, 31502964, 32387142, 33158272, 34310772, 35061675, 35862765, 37196572, 37778475, 39271027, 40378472, 41351767, 42551085, 44039254, 44979946, 46872672, 47962237, 49925374, 51271992, 52904588, 54682595, 56607167, 58503915, 60354697, 62620642, 64778576, 67373929, 69846488, 72147779, 74937157]
14316G4937157L058223K801287L156279L324366L607443L853176M045885M144656
14308A02928472M250199M517524N241728N040883N638558O055318N877264O919559
14300A46469505P130920P427566P685072Q604708Q988046R236484R707788J0587756
14292B15837845J0781521J1843014J2284430J2344700J3301755J3619654J4370231
14285C04383150J4696642J4708543J4892158J4909614J4574069J3947396J3012164
14278D05123736J2411473J0482591Q421731L058210p804432l499926J585997L741574
14270D33520954L676370q19505J76039j39799m485739q553267j1209401j2191680
14262C99973972j3231443j3091851j4368499j5138302j5051917j5231695j4745931
$$ y = [74937157, 77995380, 80796667, 83952946, 87277312, 90884755, 94737931, 98783816, 102928472, 107178671, 111696195, 116937923, 121978806, 127617364, 133672682, 139549946, 146469505, 153600425, 161027991, 168713063, 177317771, 186305817, 195542301, 205250089, 215837845, 226619366, 238462380, 250746810, 263091510, 276393265, 290012919, 304383150, 319079792, 333788335, 348680493, 363590107, 378164176, 392111572, 405123736, 417535209, 428017800, 436439531, 439497741, 431693309, 428193383, 429779380, 433520954, 437197324, 436377819, 436553858, 436414059, 431928320, 423375053, 412165652, 399973972, 386742529, 373650678, 359282179, 344143877, 329091960, 313860265, 299114334]
14255B99114334j4070797j3676766j3227008j2692518j2353627j1158858j0823751
14248B11111009j0437128r783959r160317q517402q082890p471151p252864o856719
14240A43548579o380893o149660n793154n252068m980012m928755m491717m273950
14232A01298370m104420l637464l368102l687989l264576k977489l205831k877664
14224G4174835k494480k661739k140493k385712k208746j889688j975481j875244
14216E6543252j819076j747578j517908j237951j634516j761672j215550j199114
14208D4409887j149215j266540p26314j515623j320621j043622p88211r41260
14200C5658481p03989p69549j345565o44062q16902q98305m98261o08062j123568
$$ y = [299114334, 285043537, 271366771, 258139763, 245447245, 233093618, 221934760, 211111009, 200673881, 190889922, 181729605, 173212203, 165129313, 157658162, 150405298, 143548579, 137167686, 131018026, 125224872, 119972804, 114992792, 110064037, 105572320, 101298370, 97193950, 93556486, 90188384, 86500395, 83235819, 80258330, 77052499, 74174835, 71680355, 69018616, 66878123, 64492411, 62283665, 60393977, 58418496, 56543252, 54724176, 52976598, 51458690, 50220739, 48586223, 46824551, 45609001, 44409887, 43260672, 41994132, 41267818, 39752195, 38431574, 37387952, 36599741, 35658481, 34954492, 34184943, 32839378, 32195316, 31378414, 30480109, 29981848, 29373786, 28250218]
14191B8250218p18852n11609p98248o56975o75392n76138n82347r6411q98872
14182B2735374l58996m13361m77311m47272j202826M92657p99436k11582n82433
14173A8734814l8230l54894n72270k97646m98255K99070q17308k22719j17806
14164A6114756o32217J37870n89260l48836l4260k53063k88952n34993l74963
14155A3196082J61097m26236L9592n40584j51343k1722k10252N016n67695k12723
14145A1271232K581j61096j81460k14472m3837l03165n99342J65748J61303l79882
14135I717610k03144m043P3880n67328K00476l59521p5107J21811j76041l59328
14125H369265n2611j04310k81424O7417n0007J88293l88048l34023k8734J4423
$$ y = [28250218, 27531366, 27019757, 26221509, 25564534, 24889142, 24313004, 23730657, 23634246, 22735374, 22376378, 21963017, 21485706, 21038434, 19835608, 20328265, 19528829, 19317247, 18734814, 18696584, 18341690, 17769420, 17471774, 16973519, 17272589, 16455281, 16232562, 16114756, 15482539, 15620409, 15031149, 14682313, 14648053, 14394990, 14106038, 13571045, 13196082, 13357179, 12930943, 12970535, 12429951, 12278608, 12256886, 12046634, 12051650, 11483955, 11271232, 11273813, 11112717, 10931257, 10716785, 10672948, 10369783, 9770441, 9936189, 10097492, 9717610, 9514466, 9510423, 9584303, 9016975, 9217451, 8857930, 8782823, 8904634, 8728593, 8369265, 8316654, 8212344, 7930920, 7998337, 7948330, 8136623, 7748575, 7414552, 7385818, 7400241]
14115G400241r3014j22925R2958l00594J07141k65766K11641j68809j93073r9501
14105F568299J41164j08666j62001m45685K73377l33277Q2779K37851l00221j63491
14095E790129j42078K61241m85505j7039M5204R6040N6730l22863k49755J03981
14085E136085k8498j85553p8205l1406K08187j2585r7570k75415j12577k16819
14075D305644M85501j73528Q9951m71678J96073k68459n3888J26441K06614l06282
14065D136389l4083L0280j56079L37454l52032j65524L1176q6969P9634P3761
14055C894007j60103r0331j84108J00296O2572k64497j55960L50228J06404k66076
14045C392432j11078K0200L06149l10365M5703k01216P6357k57159M9354j22778
$$ y = [7400241, 7307227, 7184302, 7277260, 6976666, 7083807, 6818041, 7029682, 6860873, 6667800, 6568299, 6709463, 6600797, 6438796, 5993111, 6266488, 5933211, 6015990, 6253841, 5953620, 5790129, 5648051, 5909292, 5423787, 5406748, 5451952, 5547992, 5604722, 5281859, 5032104, 5136085, 5107587, 4922034, 4843829, 4812423, 5020610, 5008025, 4910455, 4635040, 4522463, 4305644, 4791145, 4617617, 4707568, 4235890, 4431963, 4163504, 4109616, 4236057, 4442671, 4136389, 4102306, 4132586, 3976507, 4313961, 3961929, 3796405, 3827581, 3740612, 3820246, 3894007, 3733904, 3643573, 3459465, 3559761, 3622333, 3357836, 3201876, 3552104, 3658508, 3392432, 3281354, 3301554, 3607703, 3297338, 3343041, 3141825, 3218182, 2961023, 3010377, 2887599]
14035B887599k7978L63228k51018J61955j12797R946L13870m82854j30096l4710
14025B697145J49211m8116m5422k00566K43094R622o89022N92104j11641r4560
14015B501849P504j17630K77035n0855l54202J99736j34955Q3737j71077K77155
14005B518297n52955L80870l13811K81656p1703j64369K64117j07384l79163J62007
13995B017562K7707L82417J35590M73592J124316K590549K383949K608529L667961
13986A5412172Q712081M799288l252215q619097p295688l211225j757246l79708
13978D408362n23070m21867m42120K02829n46064J71330k43876j85756Q7163k17677
13968B289254L52534l02280J36787l77943J26624l32967K00752k12730Q1833J49350
$$ y = [2887599, 2859621, 3222849, 2971831, 3133786, 3020989, 3030935, 3344805, 2861951, 2731855, 2697145, 2846356, 2798240, 2752818, 2552252, 2795346, 2804968, 2115946, 2708050, 2596409, 2501849, 2509353, 2391723, 2668758, 2617903, 2263701, 2463437, 2328482, 2412219, 2241142, 2518297, 1965342, 2346212, 2032401, 2314057, 2242354, 2077985, 2342102, 2234718, 1855555, 2017562, 2045269, 2427686, 2563276, 3036868, 4161184, 6751733, 9135682, 11744211, 15412172, 24124253, 28923541, 25671326, 17052229, 9756541, 6545316, 4788070, 4408362, 3885292, 3463425, 3021305, 3224134, 2678070, 2849400, 2605524, 2419768, 2506931, 2289254, 2641788, 2339508, 2476295, 2098352, 2224976, 1892009, 2092761, 1880031, 1961864, 2111214]
13958B111214K7760l79691N19837m24131L1666Q3307J55161j7963k76438J15364
13948A946086n2776P1179J17359j92535J14585p5015l33912K41252j20328Q3149
13938A799044J2935J66686j87870j27873j49206L84966n22051L92012K33727j63040
13928A839330k23326j50655l7242K58468k04202j81832K45363j86771K99612j43778
13918A514967J13416k11268r994P5681L81062n15392J66382k43547M69224k50299
13908A490232Q0400k65960K4915k11992M63681P277n1534k05694q3411L05691
13898A553605l1117J08199o16159M30575j40299P7960k2575n19703K43465K10938
13888A294889j47716J46282j75148K62159k38957M7438K3830K0220m2690j89544
$$ y = [2111214, 2138974, 1759283, 2279120, 1854989, 1886655, 1969962, 2125123, 2107160, 1830722, 1946086, 1893310, 1964489, 2081848, 1889313, 2003898, 1928883, 1594971, 1836223, 1715895, 1799044, 1811979, 1978665, 1790795, 1662922, 1513716, 1898682, 1376631, 1768643, 2002370, 1839330, 1616004, 1465349, 1428107, 1686575, 1482373, 1300541, 1545904, 1359133, 1658745, 1514967, 1628383, 1417115, 1407121, 1482802, 1863864, 1348472, 1514854, 1271307, 1740531, 1490232, 1570632, 1304672, 1329587, 1117595, 1581276, 1588553, 1537019, 1331325, 1247914, 1553605, 1522488, 1630687, 1014528, 1445103, 1304804, 1382764, 1360189, 840486, 1083951, 1294889, 1147173, 1293455, 1118307, 1380466, 1141509, 1188947, 1212777, 1232997, 1190307, 1000763]
13878A000763K57354K15716j32518j27386l0436q8055j52308K29732m18553O85210
13868A439519k38465q5280J46284L27321l93568r0930j60544n3374O32924l07309
13858A216578R6896j80682j80485J00631l30893J96529j06935n5050L19519k08731
13848H67377j01430O1119J33020n1184j03320J70237P7605k12490K54550J25295
13838A220779n25730M38174j62433k2786k44852L89726J43365n35854L67676L1539
13828A099604L0815k94195M3023M8072k5635j18907Q7429J68903j09623l33165
13818E96321M04319k59460k02826K58111o0825L03574E17315L60282j04765L2449
13808H05281K67597C61582L92922L9439J29619K43255m96121K72730k37875l11165
$$ y = [1000763, 1258117, 1473833, 1341315, 1213929, 1183493, 1095438, 943130, 1172862, 754309, 1439519, 1201054, 1115774, 1262058, 1589379, 1195811, 1104881, 944337, 890963, 1523887, 1216578, 1313474, 1132792, 952307, 1052938, 722045, 918574, 811639, 756589, 1076108, 867377, 765947, 827066, 960086, 908902, 805582, 975819, 1053424, 840934, 1095484, 1220779, 695049, 1133223, 970790, 948004, 703152, 1092878, 1236243, 700389, 1068065, 1099604, 1130419, 836224, 879247, 927319, 901684, 782777, 870206, 1039109, 929486, 596321, 1000640, 741180, 538354, 796465, 735640, 1039214, 517315, 877597, 772832, 805281, 1072878, 361582, 754504, 793943, 923562, 1166817, 670696, 943426, 705551, 394386]
13798C94386L20320L32894n07475K0020M7935J39529Q1138k10406K7161k36767
13788D08735K68903L3755m2114K30697L5068k397k62449m5514R5529M6740j95979
13777E70974K97783k46736j033M37838j29475j50669J13274K0191l4807q6432
13767G90908j14208k70841K36523j09519J26140J35504k3182m0193J9738n5309
13757F95561l8611o9567l6921J46197k50541K54812O0125j95690M39366D18967
13746D65645A93883L13709J75376j43051R5426k56155K51524k95088L43499n0003
13736F29120R0691C38762M07974M6251l10419L10947j76050j5911o3260K47602
13726G85896l30273J52705P4164r1772J74252n627k50859o4505M3076B36353J72693
$$ y = [394386, 714706, 1047600, 540125, 560145, 608080, 747609, 828747, 618341, 645502, 408735, 677638, 711393, 669279, 899976, 935044, 932647, 670198, 624684, 720213, 766953, 570974, 868757, 622021, 620988, 1058826, 929351, 778682, 891956, 912147, 877340, 790908, 676700, 405859, 642382, 532863, 659003, 794507, 771325, 731132, 750870, 695561, 656950, 587383, 550462, 696659, 446118, 700930, 761055, 565365, 1004731, 418967, 465645, 193883, 507592, 682968, 539917, 635343, 379188, 630712, 335624, 679123, 629120, 719811, 338762, 746736, 792987, 482568, 793515, 617465, 601554, 538294, 785896, 455623, 608328, 682492, 590720, 764972, 759345, 508486, 443981, 487057, 236353, 409046]
13715D09046K50747m2861L9389L1188r5879j78681J06610K5579k5710L11885K0140
13704H51453j99592k21880B04709N09228O5480l25748K89659k30558J0970O6673
13694E90413j89011R7773J4091j32489R7157j41045L21764j6356B87644P4752
13684C62396J97914L7966k05758A36652K3989L25019J30370n4802j76496J79007
13674E63739O4199B17554J34146J74705Q1787j30334L4285k1535n5272K80745
13664G16081k32266j35620J53579j89477M7268J10696j08751L09902j47922j80215
13654C43275k9880q709K5847J86521B45313J78379J9482j09208k5489j36475K51668
13643D23670r2630L24102j30506p9790P488J57052j18692j95028K93817B00619
$$ y = [409046, 659793, 616932, 656321, 687509, 591630, 412949, 519559, 545138, 519428, 831313, 851453, 651861, 429981, 204709, 713937, 779417, 453669, 743328, 512770, 523740, 590413, 401402, 499175, 513266, 380777, 477934, 336889, 658653, 642297, 287644, 362396, 560310, 598276, 392518, 136652, 160641, 485660, 616030, 561228, 384732, 563739, 627938, 217554, 351700, 526405, 608192, 477858, 512143, 490608, 435336, 716081, 483815, 348195, 501774, 312297, 359565, 470261, 361510, 671412, 523490, 343275, 313395, 304686, 330533, 517054, 245313, 423692, 443174, 333966, 308477, 172002, 423670, 331040, 655142, 524636, 444846, 452334, 609386, 490694, 295666, 589483, 200619]
13632D40477P7679k31127L30202k57364J72712k24181L9592q8639F0153L83874
13622D44027K74388C09809F4804J54968K2069L04984j10312o7324F7742N12331
13612E80073J4855A75181Q4032K39216R3113l0564k6122A67752K64807n2318q7229
13601B93012J76547N9061B52048K52011j15219k9587m2235N0395p4402R6128J12988
13590E02127N5153j30255K33446B57112j4343J00061A59367L94153j56750A76316
13579D21926j99674J740C7244L38419N1164A86484j47L00647j90251j15282M0761
13568B22212O0487K36191j00884B02849K74771j33327J58812j79465j04501M111
13558B23250H2651J71617K4363B5496L15589J73924A59143R8107P3908p5132K49454
$$ y = [440477, 518156, 287029, 617231, 359867, 532579, 308398, 347990, 259351, 60153, 444027, 718415, 309809, 64804, 219772, 241841, 546825, 436513, 369189, 67742, 580073, 594928, 175181, 259213, 498429, 591542, 560978, 534856, 167752, 432559, 380241, 293012, 469559, 528620, 252048, 504059, 388840, 359253, 317018, 367413, 293011, 389139, 502127, 557280, 427025, 660471, 257112, 242769, 342830, 159367, 553520, 396770, 176316, 421926, 222252, 223992, 37244, 375663, 426827, 186484, 186337, 486984, 296733, 181451, 222212, 282699, 518890, 418006, 202849, 477620, 344293, 503105, 323640, 219139, 223250, 82651, 254268, 278631, 25496, 341085, 515009, 159143, 257250, 331158, 256026, 505480]
13547E05480H7401J25422O9924J54079A51760G3307J68121K6374L04971B67535
13536f5124B88186J30755A55878L11191n3386j82155R0493A56357K38927j4198
13526C81086j12398K46241j14375M3693j80715p6066K46112o4368A54031F2433
13515D89242j92780q921K06956A37168c784C61968q255r751j56834J05504m6492
13504B46140K95838B03444R4125G7841J09892j4042K16562q5413L2392K57790
13494E95022A75523K05194b30807B04652n8673L83156A27088L01634K39835j10801
13484E57756b2384C67790j61699Q6491p6021h7445A87890k0742R6985J05273L1068
13473D00474j00016k6792J53927K1708k22624m458J34344j5864q5503A05373P65
$$ y = [505480, 87401, 212823, 282747, 436826, 151760, 73307, 241428, 267802, 572773, 267535, -65124, 288186, 418941, 155878, 467069, 413683, 231528, 322021, 156357, 395284, 381086, 268688, 514929, 400554, 444247, 263532, 187466, 433578, 369210, 154031, 62433, 489242, 296462, 287541, 494497, 137168, -3784, 361968, 353713, 343962, 187128, 292632, 246140, 541978, 203444, 297569, 77841, 187733, 173691, 390253, 304840, 337232, 595022, 175523, 380717, -230807, 204652, 145979, 529135, 127088, 428722, 668557, 557756, -22384, 367790, 206091, 292582, 216561, -87445, 187890, 167148, 264133, 369406, 400474, 300458, 273666, 427593, 449301, 226677, 222219, 356563, 340699, 255196, 105373, 106138]
13462A06138J27543l8751L9280j03443J82114C7266Q7681j9095L83238A03633
13451B79307L3290G0375K35606a789D84054Q3845B52232m6376b0524C47736m892
13440C42844F3768C036K76967j10913G9389J32873G0761J57096r2166O6950K08359
13429D11000o9892N8507l0625A42157E1522h6475D70891a4090E4665b0753B74676
13417A7057L25714J90783B04056a14494G3092K41738A24795K2386E3071P2428
13407A25499B6543O5255L2686J59210d376D30181D9326O4694J0204J18986N4656
13396B97866p4188J42251B7890f3031C51338a20792B08023j9190l9788J630M10103
13385E60778j38679A67474L48968C1454K57664J64850j61749O4083a0900B01650
$$ y = [106138, 233681, 194930, 234210, 130767, 312881, 37266, 124947, 105852, 489090, 103633, 279307, 312597, 70375, 305981, -1789, 484054, 567899, 252232, 205856, -20524, 347736, 342844, 63768, 3036, 280003, 169090, 79389, 212262, 70761, 227857, 135691, 202641, 411000, 341108, 399615, 368990, 142157, 51522, -86475, 470891, -14090, 54665, -20753, 274676, 17057, 342771, 533554, 204056, -114494, 73092, 314830, 124795, 147181, 53071, 125499, 26543, 91798, 124484, 283694, -4376, 430181, 49326, 114020, 124224, 243210, 297866, 223678, 365929, 27890, -63031, 351338, -120792, 208023, 188833, 149045, 150675, 560778, 422099, 167474, 516442, 31454, 289118, 453968, 292219, 356302, -10900, 201650]
13374D11115j48450K16126L8854D8936e0381B67347j8615n7614J3743a12090B35469
13362B23202J04011g426I6795J10253a32260C93408A5451Q3609k8245K12269r1182
13351A91902l5001L23L05893J10638K7771K542k84844c3611B79057R6095o8131
13340C07021Q917N7736B3550K93060R8700B06651j5278n2878J02853o0189J11278
13329B92437N1076j66166a11795G2588c6966B90269A27181K7404C3788a06744
13318A38001K50175C9228N2624J2364J94177N5574j1507O7075k0514R0983j18446
13307C61558A67436A3526L87754A60227O7525E3923K95320O3643J2060A37926
13296C41977j66485F6668J04630j8428m7879h5734b607A98077k8490R9845h9128
$$ y = [411115, 262665, 478791, 517645, 48936, -50381, 267347, 248732, 191118, 204861, -112090, 235469, 223202, 327213, -7426, 96795, 207048, -132260, 393408, 15451, 99060, 70815, 283084, 191902, 156901, 157224, 463117, 573755, 601526, 604068, 319224, -33611, 279057, 375152, 307021, 315938, 373674, 23550, 316610, 415310, 206651, 191373, 138495, 241348, 181159, 292437, 343513, 177347, -111795, 72588, -36966, 290269, 127181, 154585, 33788, -106744, 138001, 388176, 39228, 91852, 104216, 298393, 353967, 342460, 409535, 389021, 480004, 361558, 167436, 13526, 401280, 160227, 227752, 53923, 349243, 412886, 424946, 137926, 341977, 175492, 66668, 171298, 152870, 104991, -85734, -2607, 198077, 169587, 269432, -89128]
13284A98065J88353j57441q8411P7656A08052R3321o6511j1440N0120A4902J14981
13273A29883J76926a24318M6796B92055A43631J34658A11848F313g1184A3943
13262a74347B54029i1656E7416J53139p9302a46803A48842c5387k9763B64445
13251C54977A15348K65216a71490A15184a82963L2620E2741J51255a02998e248
13240E59073a18183A3847b1377A69843G302J64838i8384B80966f8905a0055r4644
13229a04699A10957R4636H4843M6732L52257A37190a95370E8589a8365B89498
13218A87814C6978O3375K87986D1291c1569B1669K06173q4409n3955J02980e9136
13206A62848k4430R5610E042J0759a6065N784B18176b794j38051E00890k29346
$$ y = [198065, 386418, 228977, 140566, 218222, 108052, 201373, 134862, 123422, 173542, 14902, 129883, 306809, -124318, -77522, 292055, 143631, 278289, 111848, 6313, -71184, 13943, -174347, 254029, -91656, 57416, 210555, 131253, -146803, 148842, -35387, -65150, 264445, 354977, 115348, 380564, -171490, 115184, -182963, -150343, 52741, 203996, -102998, -5248, 559073, -118183, 13847, -21377, 169843, 7302, 172140, -98384, 280966, -68905, -10055, -104699, 110957, 205593, 84843, 131575, 483832, 137190, -195370, 58589, -18365, 289498, 187814, 36978, 100353, 388339, 41291, -31569, 21669, 227842, 143433, 89478, 192458, -59136, 162848, 138418, 234028, 5042, 15801, -16065, -10281, 218176, -2794, -140845, 500890, 271544]
13195B71544A26254J12829j08316K16604G3116a85151b469A42970a00012C58771
13184C66816r7695a11386a9727C99450A80447D8401K0141K7836K20919c04273
13173C18286F0651b931C4227J16373o0984a25857C44192A15099a05694F6471i3942
13161b06849j06928h3085H3550C0731M3598M4864L36048A52514l986J42321j31396
13150A59453c4474A5682b09078c2091A52466Q9552d478F1152K61921j49693k5675
13139A47705e13913H1460f4829G9501F712R7697M4954O5753k2460J11292F9270
13127A09607n779a0604B83251B1963i7133C26608e3407A19798n1488K91768A35745
13115H0686O4631i0900B38403A05120a10152H8954d5135e026n5250j16166c4853
$$ y = [271544, 126254, 239083, 130767, 347371, 73116, -185151, -2469, 142970, -100012, 358771, 366816, 269121, -111386, -19727, 399450, 180447, 48401, 68542, 96378, 317297, -304273, 318286, 60651, -2931, 34227, 150600, 89616, -125857, 344192, 115099, -105694, 66471, -93942, -206849, -313777, -83085, 83550, 30731, 74329, 119193, 455241, 152514, 148528, 290849, 159453, -34474, 15682, -209078, -32091, 152466, 242018, -4478, 61152, 323073, 173380, 147705, -513913, 81460, -64829, 79501, 6712, 104409, 149363, 215116, 192656, 303948, 69270, 109607, 103828, -10604, 283251, 21963, -97133, 326608, -53407, 119798, 68310, 360078, 135745, 80686, 145317, -90900, 238403, 105120, -110152, 88954, -45135, -5026, -60276, -176442, -34853]
13103A02877f2047o9484B41813i1666C62885A35615M8117c8416k37208a05777
13092d5090B22154H3392h1905J1296c2532l4597F5699R9534A6667J70912c8291
13080c058A87446a04683E4106M08633p4186B0167L00546a57955E3747a2039A21607
13068A78860J09316A18875b3860H3600J38070J46942A68010o9106a04459C18982
13057A96818a8604C07609A28348b2589j03877q3496A07867a33903B35732n8123
13047A77609f8795J2850C2353m892O6911O0466B3857a71656F6682J77680r0390
13036A53972L9086a7260A82527a08422C40688o9391D4843E70J94879I5767K37947
13025C33714a01188G1983i9207D0543J54577b34678A07463a2890A26949G887b55073
$$ y = [102877, -62047, -131531, 241813, -91666, 362885, 135615, 183732, -38416, -275624, -105777, -45090, 222154, 83392, -81905, -70609, -32532, -67129, 65699, 165233, 16667, 187579, -38291, -3058, 187446, -104683, 54106, 462739, 388553, 20167, 320713, -157955, 53747, -12039, 121607, 178860, 288176, 118875, -23860, 83600, 221670, 368612, 168010, 98904, -104459, 318982, 196818, -18604, 307609, 128348, -22589, -126466, -209962, 107867, -133903, 235732, 177609, -68795, -55945, 32353, 27461, 94372, 154838, 23857, -171656, 66682, 244362, 153972, 193058, -17260, 182527, -108422, 340688, 271297, 44843, 570, 195449, 95767, 333714, -101188, 71983, -99207, 40543, 195120, -234678, 107463, -12890, 126949, 7887, -255073]
13013C05277B4787K8949a06051A61715a6114B33448C8905a1754C27220A53599
13002A58084a0858C3867Q2053c0026A99821a94336B02712a53704A90889a5350
12991D7894a83412g1220b3210k61281A88115G8197J04127C8965c6287A86611K75291
12980D61902c9144C8771a2190k01328A46897L46514j44279g3344A32054d0054
12969B67673b16133A18172K7285J65436b77246E07658E7319H879M9441L15857
12959C74177F2731b56381k11871e0796n2499B04178G7531b40313a4979F1101b64005
12947E22919A38637m5281M0075f308A01025Q2037a14613C00962A45969B3033d2363
12935a34062I4597n278b06934A27883a71052A26458A8574R6848K38790q9353i1750
$$ y = [305277, 24787, 53736, -106051, 161715, -16114, 233448, 38905, -11754, 327220, 153599, 158084, -10858, 33867, 115920, -30026, 199821, -194336, 202712, -153704, 190889, -15350, 47894, -183412, -71220, -23210, -284491, 188115, 78197, 182324, 38965, -36287, 186611, 461902, -39144, 38771, -12190, -213518, 146897, 493411, 349132, -73344, 132054, -40054, 267673, -216133, 118172, 145457, 310893, -277246, 507658, 57319, 8879, 58320, 374177, 62731, -256381, -468252, -50796, -103295, 204178, 77531, -240313, -14979, 61101, -264005, 522919, 138637, 93356, 133431, -6308, 101025, 183062, -114613, 300962, 145969, 23033, -42363, -134062, 94597, 89319, -206934, 127883, -171052, 126458, 18574, 115422, 354212, 264859, -91750]
12923e687j0950j0793A61669R0236H2418q941b03308D5561L44619c8781o6872
12912a05653B32689P439d4056A64419c68137H2328F819K0803g1069o6241A78214
12900C79006c2665A46595F5076f4632D7739q582J8128a15799A90385c055A10008
12888C83612A88619O3996a26078H7572J03990j6179n6582b07307A21593i0106
12877b43213J00905o7810C50951c8399A40282c7130F8064K94615j26878h506F3245
12865b88428A50385J2500E7624e0434R132o3727N860A19676j7576b14254A14317
12853g7011k26018F4244a08822A46828J36073c1611G1922B3186J73194d1225A88380
12841A66118D4685J41613q7847A090P8737g9051C6350L99081j15078B8618M5748
$$ y = [-5687, -16637, -27430, 161669, 251905, 82418, 73477, -203308, 45561, 390180, -38781, -105653, 232689, 240128, -44056, 164419, -368137, 82328, 6819, 27622, -71069, -137310, 178214, 379006, -32665, 146595, 65076, -64632, 47739, 39157, 57285, -115799, 190385, -3055, 110008, 383612, 188619, 252615, -126078, 87572, 191562, 175383, 118801, -207307, 121593, -90106, -243213, -142308, -210118, 350951, -38399, 140282, -37130, 68064, 362679, 235801, -8506, 63245, -288428, 150385, 162885, 57624, -50434, -41302, -105029, -99169, 119676, 102100, -214254, 114317, -77011, -303029, 64244, -108822, 146828, 282901, -31611, 71922, 23186, 196380, -41225, 188380, 166118, 44685, 186298, 98451, 1090, 79827, -79051, 36350, 435431, 320353, 28618, 74366]
12830G4366a50622d5028A26025i3712c1577H3113J89361b77116a4702q3736G3253
12818A80950i541B42070d5283k8455B16135A1067g392p6464A83547c6226B382
12806A71087A1759L63222B1244M8605B5899K41928A31719a23720G9670C8372l063
12795C5309a5191k59820A13503a63801P2996p1201c0408H071M2702b0056m4400
12784f4456C11974L2096a30583K003k74767B19565I3874A8116J81269d7668B1901
12772A88637M2793H4269b2319j09836A81610a52703B69051c9944I0496b24801
12761a55003B61446a58153n4316B54684c6299k57042E9589J85706b17540A72910
12750B45751m6542f4310c1141H0456J44700a9039A1023J54433m6440e2567l7787
$$ y = [74366, -150622, -45028, 126025, -93712, -31577, 83113, 272474, -277116, -14702, -98438, 73253, 180950, -9541, 242070, -45283, -73738, 216135, 11067, -7392, -83856, 183547, -36226, 2382, 171087, 11759, 374981, 21244, 69849, 25899, 267827, 131719, -123720, 79670, 38372, 35309, -15191, -275011, 113503, -163801, -90805, -162006, -30408, 8071, 50773, -20056, -64456, 311974, 344070, -130583, -128580, -403347, 219565, 93874, 18116, 199385, -47668, 21901, 188637, 231430, 84269, -22319, -132155, 181610, -152703, 269051, -39944, 90496, -224801, -155003, 261446, -158153, -212469, 254684, -36299, -293341, 59589, 245295, -217540, 172910, 245751, 199209, -64310, -31141, 80456, 225156, -19039, 11023, 165456, 119016, -52567, -90354]
12739i0354A90454O4457a7577B37590a04319E9035a9129o1193A00829e3183K4871
12728b8312o6546l04530B0688C207a71983F8469N2278l8675C2121J94576b20421
12716F51355A0795b5785j00398A69203E5434i8334F255R8183K52295D289L85206
12705C89495A39621j0575K57879j36075a40252j7570A40787a05990o8209F6R527
12694I593J82610Q9556J28145F233K41445r2523o3995a3003A61607c3646j2173
12683d5819D75029I2675a4039A53769o2072k6642a3089j02587B29403f153B57423
12671I9070N3089O2113J4122q8096m5888N3142M8588a8677F1752N2533g0573A35302
12658D20911A78265Q0572m1704j05982J84681j24667j7984J17149A24864J36141
$$ y = [-90354, 190454, 254911, -17577, 237590, -104319, 59035, -19129, -80322, 100829, -53183, -28312, -94858, -399388, 20688, 3207, -171983, 68469, 120747, 82072, 32121, 226697, -220421, 651355, 10795, -25785, -126183, 169203, 55434, -98334, 6255, 104438, 356733, 4289, 389495, 139621, 129046, 386925, 250850, -140252, -157822, 140787, -105990, -174199, 66, 9593, 192203, 281759, 409904, 6233, 247678, 155155, 91160, -13003, 161607, -33646, -45819, 475029, 92675, -14039, 153769, 91697, 65055, -13089, -115676, 229403, -6153, 257423, 99070, 152159, 214272, 228394, 140298, 94410, 147552, 196140, -18677, 61752, 114285, -70573, 135302, 420911, 178265, 258837, 217133, 111151, 295832, 171165, 153181, 270330, 124864, 261005]
12648B61005c47605a154q8563j32057F2030K4485L28831C53L20671a00338A21868
12636A83156p6395h8535o3558B84344p5234J28635l9033A06292b91945J08264
12626a83681B27483c6542j30918B50093G6194K01603d0359D55163a45776B65884
12615c9174B1980l489J53906Q3593I9910g2656n2173m8779H3826R2533d34366
12603b3017C7475e7088B33804k8484A2458c59720B4617K1364J47792O8315K8172
12592B90260a9036A74621a17618j85694R911G0946O2666L2175J03461h7926I4146
12580e027A90799f1960B44859b89140A94070a3533m1396A31895g717A86378E6492
12568B71430i0060j42803r9291a09747j58578R1992j66627A42271J9515j9973
$$ y = [261005, -347605, -1154, -89717, -221774, 62030, 86515, 415346, 353, 321024, -100338, 121868, 183156, 106761, -88535, -152093, 284344, 209110, 337745, 298712, 106292, -291945, -183681, 227483, -36542, -167460, 250093, 76194, 277797, -40359, 455163, -145776, 265884, -39174, 21980, 18491, 172397, 255990, 99910, -72656, -124829, -173608, 83826, 176359, -434366, -23017, 37475, -57088, 233804, 205320, 12458, -359720, 24617, 45981, 193773, 262088, 290260, -19036, 174621, -117618, -303312, -293401, 70946, 133612, 165787, 269248, -87926, 94146, -5027, 190799, -61960, 244859, -289140, 194070, -13533, -54929, 131895, -7717, 186378, 56492, 271430, -90060, -232863, -332154, -109747, -268325, -176333, -342960, 142271, 161786, 141813]
12558A41813J58519r9117b31505E2810c0662B73752J03247E0088N1456c1815l6693
12547f8508A45258F9210a57626C50281A0704b7236A24001f4744j48363A25962
12536A70435q0669B1385J29457C5198L12396A54563n226A3563a60402C42867b651
12524A64402N7420a69073A66523H2645J22378i9935j19254D2061c53426B4006
12513C16979K1520a58235k5888A67593K924m8198n7054A5869b36443A15093K22657
12502C37750g5432a2811r8619B2208M87026A37770c09800A08433K19891j13947
12492B14377A1736J17482L4940b6852j6456a4802B49124J2371I6155M63274r7398
12481D62031H5156b6002B60574N3809D3744g0851Q867A47263j3768m7183J8799
$$ y = [141813, 300332, 201215, -231505, 52810, -30662, 273752, 376999, 50088, 101544, -31815, -68508, 145258, 69210, -157626, 350281, 10704, -27236, 124001, -64744, -213107, 125962, 170435, 89766, 21385, 150842, 35198, 347594, 154563, 149337, 13563, -160402, 342867, -2651, 164402, 221822, -169073, 166523, 82645, 205023, -99935, -219189, 42061, -353426, 24006, 316979, 338499, -158235, -184123, 167593, 170517, 122319, 65265, 15869, -236443, 115093, 337750, -75432, -12811, -111430, 22208, 509234, 137770, -309800, 108433, 328324, 214377, 11736, 129218, 164158, -26852, -43308, -14802, 249124, 261495, 96155, 559429, 462031, 85156, -26002, 260574, 314383, 43744, -70851, -61984, 147263, 133495, 86312, 105111]
12470A05111J7943G147a56067H7526h9250o3841K4357A47567c60121i0399j99481
12459b89880J05721f7922K6434j95693e6219B693L7600J54677H9782a9386B33005
12447b5393l11797C08343a74011H5689L6747i9955g877k7007j13101B16021K48301
12436D64322D5075K665c52206D7887d4305a6990j09246A67772o9463a85969A24072
12424b8051A12376O819g0750C08263b72354B8108e0836C78083A52473c02489d2469
12412b52131B62838I1402f5536G176d6120k66158J20749j14147a17084p2996J3443
12401a76637p940a908C95638a30147n0710a8678m20852C1551K16249D4916h43
12389a20893B40891C656e6740k9179A7581K50066A03488D2336g8618B51270A1530
$$ y = [105111, 123054, 7147, -156067, 87526, -89250, -153091, -128734, 147567, -360121, -90399, -289880, -184159, -67922, -41488, -237181, -56219, 2693, 40293, 194970, 89782, -19386, 233005, -25393, -337190, 308343, -174011, 85689, 122436, -99955, -7877, -34884, -147985, 216021, 464322, 45075, 47740, -352206, 47887, -44305, -16990, -126236, 167772, 98309, -185969, 124072, -28051, 112376, 119195, -70750, 308263, -272354, 28108, -50836, 378083, 152473, -302489, -42469, -252131, 262838, 91402, -65536, 7176, -46120, -312278, -191529, -305676, -117084, -190080, -176637, -184577, -1908, 395638, -130147, -180857, -18678, -439530, 31551, 247800, 44916, -843, -120893, 240891, 3656, -56740, -85919, 17581, 267647, 103488, 42336, -78618, 251270, 11530]
12377B40447b4922F0024J86756I6909d34093C9822j9447c67766J40800F5461a07029
12365B87541D322c20751d5759I7604J07496A9231K6836J32447f2646E5560c42207
12353b78052I4328f0247D24591E7788a22686q1078B65337g2539M580k30984B73887
12341A49594l9880b33618A35411a98673N2129D5765I647a82107A52086a88147
12330a69887o5948p3209C66846j83046b11153A99527j9383J01426C5307g5434
12319B45430f7803r045A31447a33267d642B70717h8349A7818q49g894p7010H0287
12306b54745C58184A08641J86706A41915D1498a01180m9224A24698b81797O9839
12296b11958e2762J4441n0865F6723Q7272J1924J37213A43436N2151l3164j0403
$$ y = [240447, -24922, 60024, 246780, 96909, -434093, 39822, 20375, -367766, -226966, 65461, -107029, 287541, 4322, -320751, -45759, 97604, 205100, 19231, 46067, 178514, -62646, 55560, -342207, -278052, 94328, -60247, 424591, 57788, -122686, -203764, 265337, -72539, -67959, -298943, 273887, 149594, 109714, -233618, 135411, -198673, -146544, 45765, 9647, -182107, 152086, -188147, -169887, -235835, -309044, 366846, 183800, -211153, 199527, 180144, 281570, 35307, -75434, 245430, -67803, -76848, 131447, -133267, -4642, 270717, -88349, 17818, 16969, -7894, -84904, 80287, -254745, 358184, 108641, 295347, 141915, 41498, -101180, -150404, 124698, -281797, -211958, -52762, -38321, -89186, 66723, 153995, 165919, 303132, 143436, 195587, 162423, 152020]
12285A52020L3525D0623Q2302b44430F337b93559a35966A1250M98106A60210a38486
12273A27509D191K84210A15955J17704Q684F2350j0420L5692J33973L2372j17429
12262A36538E0190g3716J621A8421j250M1889a45826a7530A34431e097k49768
12251b54865H1823R9908L3543e479D13940k06331G3146b27179A78377a9344A2641
12239C50559p5983g7432A25822n5279B9288K52724I5204K48007A64948m6746l3769
12228H4433R3107N1220K27110A63469n4558b48328B22470R0810n6380r592p4165
12217A73143J3329c05609i2736A86078J52415A09608a4092C2809d6954D22999
12206B35159b2160C22728f9723A64086c13553F5203J68447I2480e5945j40495
$$ y = [152020, 185545, 40623, 122925, -244430, 6337, -293559, -135966, 11250, 509356, 160210, -138486, 127509, 4191, 288401, 115955, 233659, 242343, 62350, 51930, 87622, 221595, 253967, 136538, 50190, -73716, -72095, 18421, 17171, 59060, -145826, -17530, 134431, -5097, -254865, 81823, 181731, 215274, -5479, 413940, 207609, 73146, -227179, 178377, -19344, 12641, 350559, 274576, -77432, 125822, 70543, 29288, 282012, 95204, 343211, 164948, 118202, 84433, 177540, 228760, 455870, 163469, 108911, -248328, 222470, 313280, 256900, 247308, 173143, 186472, -305609, -92736, 186078, 338493, 109608, -14092, 32809, -46954, 422999, 235159, -22160, 322728, -69723, 164086, -313553, 65203, 233650, 92480, -55945, -196440]
12196a96440B62356c7542A26705K5862J00270q7408L13725A75996h095B76715
12185A82037O8004A3740J01270p058a63922F6718k8553K96232E9588d8390D53096
12173A1077N8552k530j2460J53884o693M2112j02646K9947o4736D3443j6276J00787
12161A27954a78679A72468C4963L5534M78540k62846r2218c9074F4634R5928K6612
12150A87174G6913J69120a7300o3240B09082b58521C68348d4250B19748D9574
12139a80633B43178a92550C8385a56642g2298B90232o5179m5577b78629h3916
12128H1161J80080j5207l8302I3252g0398j18372A77263J38010A10448R8857O7560
12117B76865i4519A15808a22437B05889e938j27071m2178I2331a74117A92367
$$ y = [-196440, 262356, -37542, 126705, 152567, 252837, 165429, 479154, 175996, -8095, 276715, 182037, 250041, 13740, 115010, 107952, -163922, 66718, 38165, 334397, 59588, -48390, 453096, 11077, 69629, 67099, 54639, 208523, 201830, 243942, 141296, 171243, 106507, 43443, 27167, 127954, -178679, 172468, 34963, 70497, 549037, 286191, 193973, -39074, 64634, 160562, 187174, 76913, 246033, -17300, -80540, 209082, -258521, 368348, -44250, 219748, 49574, -180633, 243178, -192550, 38385, -156642, -72298, 290232, 225053, 179476, -278629, -83916, 81161, 261241, 246034, 207732, 93252, -70398, -188770, 177263, 315273, 110448, 209305, 276865, -94519, 115808, -122437, 205889, -5938, -133009, -175187, 92331, -174117, 192367]
12106b41983J02971a9806B27595D6366c6505n5450A21088c0129j53843m8897f7839
12094B04242F9314a17811M4475A70296k2254G1711a39449C68382C8676N455a0769
12082A66378c31816E299K93979a52555L0073l24435J79311B21697f4756D1396
12071b45852G223i5206p5091L5720j39589A23101j2748a15931j6993E6769b70286
12059B36161p5767f2819A34098d0139j62572g0251k80453F3975q309K19101a52305
12047I4722h3480B15251c938j65795C5382a3430k31591F5883P0333g9770L7894
12036d1876A42269F0509Q6924a20749M3984A78326a86844l2248A83605d0478C56207
12024B54064Q2874A67884L78939g541E834J01665j0667K12649F0804a1157A65976
$$ y = [-241983, -139012, -19806, 227595, 46366, -36505, -91955, 121088, -30129, -183972, -232869, -67839, 204242, 69314, -117811, -73336, 170296, 148042, 71711, -139449, 368382, 38676, 44131, -10769, 166378, -331816, 5299, 299278, -152555, -122482, -446917, -267606, 221697, -64756, 41396, -245852, 7223, -95206, -170297, -134577, -274166, 123101, 110353, -115931, -132924, 56769, -270286, 236161, 160394, -62819, 134098, -40139, -202711, -70251, -350704, 63975, 55666, 274767, -152305, 94722, -83480, 215251, -3938, -169733, 35382, -13430, -245021, 65883, 136216, -79770, -41876, 142269, 60509, 147433, -120749, -76765, 178326, -186844, -219092, 183605, -40478, 356207, 254064, 336938, 167884, 546823, -7541, 5834, 107499, 96832, 309481, 60804, -11157, 165976]
12012D0655J49756p0204E0061J4583f6393j11687A07068g7348A07477J3802J03996
12001B25275f17q9616o5838A11700b23563A75045b70915F4477j1775J11428B4447
11989b64015a03395e264k52177A69671c31028f9674l19967E2193a81867D5087
11978a19279q184o6409G3821a85821B07499i3242F1352N3321k3104f1879j14476
11967a76355H9168a34647M897d2626j06000j5482I9712g440j01783B5165a86007
11955c24050c5455l52037A01478R7412h6691g642j31153E7918K29462j38054m7989
11944A01337l2267R013M2996c05515A17650J8951g4523a8624m0603A82664M81
11933A83145d9136p1888A59572E1228Q0225C0301a65219A79693F0577b69305a7246
$$ y = [40655, 190411, 120207, 50061, 64644, -66393, -178080, 107068, -77348, 107477, 121279, 225275, -617, -90233, -156071, 111700, -223563, 175045, -270915, 64477, 52702, 164130, 24447, -264015, -103395, -5264, -257441, 169671, -331028, -69674, -389641, 52193, -181867, 45087, -119279, -127463, -193872, 73821, -185821, 207499, -93242, 61352, 114673, 91569, -61879, -176355, 89168, -134647, -129750, -42626, -148626, -164108, 99712, -7440, -109223, 25165, -186007, -324050, -35455, -387492, 101478, 198890, -86691, -7642, -138795, 57918, 287380, 149326, 101337, 69070, 78083, 121079, -305515, 117650, 136601, -74523, -18624, -59227, 182664, 183145, -49136, -121024, 159572, 51228, 131453, 30301, -165219, 179693, 60577, -269305, -17246]
11921i4059B38668A3103Q759a59149A9827L90587a14686A59568b34499K0847D4504
11909A04402k2196a07305E38155e2054A73752c61019G4099J58274a57082A90429
11898c0442B7776J49774p0893e1980D2828a05753e1116B95514B7784c3456k24584
11887b58040f895k7388C03676b10997R0504G0832G068i2233A97131j7482i7078
11875H7592M2713a85302C21228A16663L5041G3827a84875K6664B43559H9519E126
11863b01011F8662a58034O1220l28053F685h6926a274D3765A9651L20721a52509
11851G531N4272f4923B21664e7345D2495a53714k16436a72543A45941f7037k39914
11840c06951e1821A09797a37702r6317l8011d529m7292H7253a06439q000A66813
$$ y = [-94059, 238668, 13103, 21862, -159149, 19827, 410414, -114686, 159568, -234499, -213652, 44504, 104402, 82206, -107305, 538155, -52054, 173752, -361019, 74099, 232373, -157082, 190429, -30442, 27776, 177550, 106657, -51980, 42828, -105753, -51116, 295514, 27784, -33456, -258040, -6895, -34283, 303676, -210997, -120493, 70832, 7068, -92233, 197131, 179649, -97078, 87592, 130305, -185302, 321228, 116663, 151704, 73827, -184875, -158211, 243559, 89519, 5126, -201011, 68662, -158034, -96814, -424867, 6685, -86926, -1274, 43765, 19651, 340372, -152509, 7531, 61803, -64923, 221664, -57345, 42495, -153714, -370150, -172543, 145941, -67037, -306951, -51821, 109797, -137702, -234019, -272030, -4529, -51821, 87253, -106439, -114439, 166813]
11828b8653o0674A68720N3143b29597O1617r4423b1877A07177b39215A88805a11195
11816a03367c7308j14739o111P7938J7091H5525l170J9545J1759a63229h0856
11804H5422L9086D4153a1645l97639B31084H6892A2155a19074A23942O4807b718
11792d1354A93848G6754k9749J19537c84812g3256A75205b61533i142B70454a20740
11780a40055A02635J7838K92454a43005e8429C51304b23362G6806Q9835D0705
11769a65808L997I0282k3067a66321j7335j16018A63762b3265A8660b0737A08999
11757A55864E5648a12541G420L2785c44705F7501b59785a1659j08121M4332A763
11745F1759f9279A09022b9893j99439F8559j9034a18804I4607k5796b91050a06579
$$ y = [-28653, -89327, 168720, 221863, -229597, -167980, -262403, -21877, 107177, -239215, 188805, -111195, -103367, -37308, -152047, -158158, -80220, -63129, 85525, 82355, 101900, 113659, -163229, -80856, 85422, 124508, 44153, -11645, -409284, 231084, 86892, 12155, -119074, 123942, 188749, -2718, -41354, 193848, 76754, 47005, 166542, -384812, -73256, 175205, -261533, -9142, 270454, -120740, -140055, 102635, 120473, 412927, -143005, -58429, 351304, -223362, 76806, 166641, 40705, -165808, -161811, 90282, 67215, -166321, -183656, -299674, 163762, -23265, 18660, -20737, 108999, 155864, 55648, -112541, 7420, 40205, -344705, 67501, -259785, -11659, -119780, -75448, 1763, 61759, -69279, 109022, -29893, -229332, 68559, 49525, -118804, 94607, 68811, -291050, -106579]
11733c45143I4342K44607J16673b491j12652B18226a95700P2711I910K25375j07746
11722A27539C9562b00745B2157M75909d7178h017l73821h6745k52634a38413O873
11711a31540g011k55108a19247o7964j04940A785K07742c01238I850c8120j5479
11700e3599A7201f267k20312A68366g3744K4387K0124A14663C5092e3002B70470
11688A28374g7326A83067c9703A75957K40261A30293B1338O7273d9703l09156
11678c58859g6475k23099j44225D0015J24861a30560j4502B9830N6931J4988a02771
11666a18681A99567a87827P0086g077A28491a1667A9716g3633j27366F5699B7862
11654g3488C13594a57582L5983F5119K44723b32173D0511a63937F6636B4135h5108
$$ y = [-345143, 94342, 338949, 455622, -2491, -115143, 218226, -195700, -122989, 9910, 235285, 127539, 39562, -200745, 22157, 498066, -47178, -8017, -381838, -86745, -339379, -138413, -131540, -7011, -262119, -119247, -187211, -292151, 1785, 209527, -301238, 9850, -38120, -53599, 17201, -6267, -226579, 168366, -73744, -49357, -29233, 114663, 35092, -53002, 270470, 128374, -77326, 183067, -39703, 175957, 416218, 130293, 21338, 88611, -49703, -358859, -76475, -299574, -443799, 40015, 164876, -130560, -145062, 29830, 86761, 101749, -102771, -118681, 199567, -187827, -117741, -7077, 128491, -11667, 19716, -73633, -200999, 65699, 27862, -73488, 313594, -157582, -121599, 65119, 309842, -232173, 40511, -163937, 66636, 24135, -85108]
11642b60030d6994B61541A06186c6411A33966k5247b43619D11553E1438A5484
11631a24915C19884a62360C5185g4089A58597J2077b59743a04364C2480e8717
11620A08252b77541A64086E5003a66526A57892J469b7714l38171C7926K440a83163
11608A79350g0764o5284f5049j80165A19415c6353l0440j27697f8211j9540E3675
11596A61626A7916b15921B5313P8686m1967M21386k36072G2244K4260O5422m0740
11585A21186e0107B57833a09936D2414O1318J85282a87763B92478c7623k2511
11575f0134p146B38763d0521A29632R9386I1956R6455K14036l7699F6515K33551
11564C00066I5758a51750e7461A34461a03923A03108b4372k5142A25182a36084
$$ y = [-260030, -46994, 261541, 106186, -36411, 133966, 108719, -243619, 411553, 51438, 15484, -124915, 319884, -162360, 35185, -74089, 158597, 170674, -259743, -104364, 32480, -58717, 108252, -277541, 164086, 55003, -166526, 157892, 159361, -27714, -365885, 37926, 40366, -183163, 179350, -70764, -136048, -65049, -245214, 119415, -36353, -66793, -194490, -68211, -87751, 53675, 161626, 17916, -215921, 25313, 103999, 62032, 483418, 247346, 72244, 96504, 161926, 121186, -50107, 257833, -109936, 42414, 103732, 289014, -187763, 292478, -37623, -60134, -67280, 238763, -40521, 129632, 229018, 91956, 188411, 402447, 364748, 66515, 300066, 95758, -151750, -57461, 134461, -103923, 103108, -24372, -49514, 125182, -136084]
11553a85895C3589Q7049e6788a7694A68413b1224A16918A9278i4538A55844O9692
11542B25536q065J13718e8457H7149J06361R9614a27296M6664A80529i2637D25039
11530b52598B7015g3755A18537E2887K52788f6649a3974A02886a40320B2054P1822
11519I3876L0421J66484a10686D8301J40688J65545b11898b9693o6841A72766
11508G0591J74989D71L09330A35441C61J12843P3373O6832m7582k1876a23094
11496I5207L90826c2769G1012i5573I9587J13812j04254K25123a31181C75129
11485G7305K09144A38329b025D6263F619J9492M28034a79253A77212c7353q1192
11474a18545D8943c6764l8832A42368J73576A19903E1817J16880K03758j71245
$$ y = [-185895, 33589, 120638, -56788, -17694, 168413, -21224, 116918, 19278, -94538, 155844, 225536, 217471, 331189, -58457, 87149, 193510, 293124, -127296, -80632, 180529, -92637, 425039, -252598, 27015, -73755, 118537, 52887, 305675, -66649, -13974, 102886, -140320, 22054, 93876, 124297, 290781, -110686, 48301, 188989, 354534, -211898, -29693, -96534, 172766, 70591, 245580, 471, 309801, 135441, 361, 113204, 186577, 253409, 205827, 183951, -123094, 95207, 486033, -32769, 71012, -95573, 99587, 213399, 109145, 334268, -131181, 375129, 77305, 286449, 138329, -2025, 46263, 6619, 26111, 454145, -179253, 177212, -37353, -118545, 48943, -36764, -75596, 142368, 315944, 119903, 51817, 168697, 372455, 201210]
11464B01210c0691j90068A64536b03126l50249B59434p0449d3386o0909d8022
11453B01804H7264d7441k15606B11918P0084I223a07619A82228d1038j57223q4392
11442b82653D19510C7881J13408a18490f682j83749B22622K26890A79146h4052
11431A02210b07358l2252B21073L7588G5806J08160R0994a15459E6028K24714
11421B80742Q2878i9509j18413H3081c6529r546A60886c05111G4278f2156n28
11410f2684j43056I6893k1588J107L8301b12998C51131H1828K6641D2997K9394
11399G2391J542a33940A01125b01474A55302C2734b2401m4034B07884B2430q365
11388A4065J89989d9945A53963c4047B84605q005F9663R1866a08312k30038D802
$$ y = [201210, -30691, -220759, 164536, -203126, -553375, 259434, 188985, -43386, -104295, -48022, 201804, 87264, -47441, -263047, 211918, 282002, 9223, -107619, 182228, -41038, -198261, -282653, 419510, 37881, 151289, -118490, -6682, -190431, 222622, 449512, 179146, -84052, 102210, -207358, -239610, 221073, 258661, 75806, 183966, 274960, -115459, 56028, 280742, 363620, -99509, -217922, 83081, -36529, -46075, 160886, -305111, 74278, -62156, -62684, -205740, 96893, 75305, 76412, 114713, -212998, 351131, 81828, 108469, 42997, 72391, 73933, -133940, 101125, -201474, 155302, 32734, -22401, -66435, 207884, 22430, 14065, 204054, -49945, 153963, -34047, 284605, 276600, 69663, 161529, -108312, -338350, 4802]
11376A02658K66831I8452b9228E6152J1872J28700d9258c660j46479I3403a49053
11364e3286o13A95266m0081e5714k38954a35473F5232J89092c169E5193b06966
11352I7022a45189c2000C02396j5936b07k41615G1122J12621a58729A55402a81267
11340A62810g2778j50733o1767a8598j20685D27786E1206K996p670b91820a00592
11328e20060d9216j21108B26926A5997d01362E2117a88088a5669A36306j1954
11318A24352O5093b92224a39203d1778m9878p1723q4919k46552d586B4291J10239
11307A34530a04310M8773B9465h7750j6661A06357P6398l7445D9892K5965f5587
11295d38524A34554q30F0160K60329d3473A878J24579a38787O5717C80146A29843
$$ y = [102658, 369489, 98452, -29228, 56152, 68024, 196724, -49258, -3660, -150139, 93403, -149053, -53286, -53899, 195266, 155185, -55714, -294668, -135473, 65232, 254324, -3169, 55193, -206966, 97022, -145189, -32000, 302396, 286460, -207, -241822, 71122, 183743, -158729, 155402, -181267, 162810, -72778, -223511, -285278, -18598, -139283, 427786, 51206, 54202, 46532, -291820, -100592, -520060, -49216, -170324, 226926, 15997, -401362, 52117, -188088, -15669, 136306, 124352, 189445, -292224, -139203, -41778, -91656, -163379, -248298, -494850, -4586, 24291, 134530, -104310, -55537, 29465, -87750, -104411, 106357, 182755, 145310, 49892, 75857, -65587, -438524, 134554, 133724, 60160, 320489, -43473, 1878, 126457, -138787, -73070, 380146, 129843]
11283A59732i5765A76805c0667j52837R1290C1728g1566E2505n003f4463F561
11271f3674A19518f6147j15500j05821B62833r324c32140C3448J38201P2902h3794
11259h0197c0344r1263B46186r5681b80273J15665A03520d3224B14365p2506J85112
11248C26971A24951e0376n56997D9463P5490b6851l94667J99599A10465k2650
11238H7815a53320B3265a61585B02432r0886A3841a80368j05262A00771d4460
11227A02558b6762g111k689I8615c02400G8119i7960M4553j20953m9749C6630
11215B64691h1497A50258C0481g9334A39741c4311B763J98127E4552b5254k07927
11204b33181J10729r7078J04690G6605b9219j10068j82551A23901c24282A80205
$$ y = [159732, -95765, 176805, -30667, -183504, -92214, 31728, -71566, 52505, 47502, -64463, 6561, -63674, 119518, -66147, -181647, -287468, 262833, 253509, -332140, 33448, 171649, 244551, -83794, -80197, -30344, -121607, 246186, 150505, -280273, -164608, 103520, -43224, 214365, 141859, 326971, 124951, -50376, -607373, 49463, 124953, -26851, -421518, -221919, 110465, 87815, -153320, 23265, -161585, 202432, 111546, 13841, -180368, -285630, 100771, -44460, 102558, -26762, -7111, -9800, 98615, -302400, 78119, -97960, -53407, -174360, -224109, 36630, 264691, -81497, 150258, 30481, -79334, 139741, -34311, 2763, 200890, 54552, -25254, -233181, -122452, -219530, -114840, 76605, -29219, -139287, -321838, 123901, -324282, 180205]
11193A83527c2375a1232n1134E0072e37343b51753l1055j87795B0769h206k56373
11182b64579M2309A1547a53907A42609Q2834f8761H1780a05628A01045A5925b41173
11170B8581d23335B35583o9457a56272I7740e692k14481Q8058A77930K603p8742
11159A01791K299a14323b0675A30657k5693c78631B27604N2452j31643a62225
11148b12578h768B03964D7680b8409n8334A10943a94178Q0035k39880a7391j38018
11137a55409F0126g7530k7852B45154e9545M178A94810G6513a51634E5583J89491
11126B45074p5155F699L02310c054k04611e5981D3525L92195j98905a02461E7192
11114c39310g1244j71888g7955m8402D05277c942j27182C12795a62099A51359
$$ y = [183527, -32375, -11232, -62366, 50072, -537343, -251753, -282808, -470603, 20769, -8206, -264579, -222270, 11547, -153907, 142609, 225443, -68761, 81780, -105628, 101045, 15925, -241173, 28581, -423335, 235583, 166126, -156272, 97740, -5692, -220173, -132115, 177930, 180533, 101791, 104090, -114323, -20675, 130657, 104964, -378631, 227604, 280056, 148413, -162225, -212578, -8768, 203964, 47680, -28409, -86743, 110943, -194178, -114143, -354023, -17391, -155409, 60126, -77530, -105382, 245154, -59545, -55367, 194810, 76513, -151634, 55583, 245074, 169919, 6699, 309009, -3054, -207665, -55981, 43525, 435720, 236815, -102461, 57192, -339310, -71244, -243132, -77955, -126357, 405277, -3942, -131124, 312795, -162099, 151359]
11103C02751a72337H995L66290b84488I7665c4246D89042A49340D3703K97184
11093C40887b2863D6757J53601K09322k03420B6270K59416o3864B1873b305A73405
11081B90066i3808B96456k3759J27622e7140C20734K07617B31110o7001m0732
11071A23377J51339j22623K77026O6108o0885I5745h799F51558C07220R9716r7691
11060C09245K13799o768j5974J26987j33734L56657q7587k37730K63670n1712
11050G36853C46816L74651r5801J85833k4444j91907Q2091j72627r121p2280K84788
11039G07999k8083k11642O0180j2137O6226J43167p7252J21802M3514k20396M9568
11028F42946Q1472J04385k63297R4787Q4579j15497l614L7093j21657j06500J02999
$$ y = [302751, -172337, 8995, 375285, -284488, 97665, -34246, 489042, 149340, 43703, 340887, -22863, 46757, 200358, 409680, 206260, 26270, 285686, 221822, 21873, -2305, 173405, 290066, -93808, 296456, 272697, 400319, -57140, 320734, 528351, 231110, 164109, 123377, 274716, 152093, 429119, 495227, 434342, 95745, -8799, 651558, 307220, 406936, 309245, 523044, 516276, 500302, 627289, 493555, 850212, 762625, 524895, 788565, 736853, 346816, 721467, 625666, 811499, 787055, 595148, 677239, 504612, 495491, 423211, 707999, 679916, 468274, 528454, 516317, 582543, 725710, 648458, 770260, 813774, 593378, 642946, 724418, 828803, 565506, 660293, 744872, 629375, 625761, 662854, 541197, 434697, 537696]
11017E37696j97630L71489k53529K3512J02569B88601J71135q079K21728k14531
11007D58854J43543k53949K59704m8775M53014B97133J57223K03898L0529J1453
10997G00236O4199N3514j11876o9670o0209O8921j49693J39044j06866K29987
10987G57587K13969j29298k07415J51589M48732Q999j22806L0901M98736k38802
10977A412192K37354o2710N08703J54326J22202K45601J37677l3302L08869m78396
10967B552516O6627n9982o93095j2947J57833l36065J17536J05079l40286m5378
10957A511838j01662j77727L8571j90345j32255L21725E95333j78517P7659j02482
10947C91993L39A33465M16883k58159M928l1267D2404a47137B22995N2708P7381
$$ y = [537696, 340066, 711555, 458026, 481538, 584107, 288601, 459736, 451657, 673385, 458854, 602397, 348448, 608152, 559377, 1012391, 297133, 454356, 658254, 688783, 700236, 764435, 817949, 706073, 636403, 576194, 645115, 495422, 634466, 527600, 757587, 971556, 842258, 634843, 786432, 1235164, 1244163, 1121357, 1152258, 1650994, 1412192, 1649546, 1586836, 2095539, 2249865, 2372067, 2617668, 2755345, 2722043, 3030912, 2552516, 2619143, 2559161, 1866066, 1853119, 2010952, 1674887, 1792423, 1897502, 1557216, 1511838, 1410176, 1232449, 1271020, 1080675, 948420, 1270145, 595333, 416816, 494475, 391993, 392332, 133465, 550348, 292189, 297117, 265850, 42404, -147137, 222995, 275703, 353084]
10936C53084A10312a52450B1477c76218J60230A97584a76453F9335b40978B70020
10925d1473B03633g6500D1807b20343J07238I2028k9497i6505j9821j76464a40819
10913a90262H0500e6668D4410N3648J0280C0475e2343g513A8328P5536J3052C4425
10900g5316E9735f2010j96388A87412q3872b46768J19118l2058g909K873j98549
10889b03585A28584A6677a94294F5025b4953C66320D7884f3810A00175a30664
10878a80008j30479B040b4658F9415J5856e6609J9540k68400F8655c5826k32669
10867b68495c5789C2972Q9346d0216D1327c36628B0104a63697A3917f5440j42275
10856b07715I1653J12856n0075a55083g892D01774m9037i381m9404C4513b8688
$$ y = [353084, 110312, -152450, 21477, -376218, -215988, 197584, -176453, 69335, -240978, 270020, -41473, 203633, -76500, 41807, -220343, -113105, 92028, 62531, -96505, -116326, -292790, -140819, -190262, 80500, -56668, 44410, 98058, 108338, 30475, -52343, -7513, 18328, 93864, 106916, 34425, -75316, 59735, -62010, -258398, 187412, 103540, -246768, -127650, -159708, -7909, -5036, -203585, 128584, 16677, -194294, 65025, -24953, 366320, 47884, -63810, 100175, -130664, -180008, -310487, 2040, -24658, 69415, 85271, -56609, -37069, -305469, 68655, -35826, -268495, -35789, 32972, 122318, -40216, 41327, -336628, 20104, -163697, 13917, -65440, -207715, 91653, 204509, 154434, -155083, -7892, 401774, 352737, -9381, -58785, 34513, -28688]
10844a30468E0482h4293j35992D03931A27620c03549A46027c18913B5029g2117
10833a93878A03380d3049m2188A32570D9057J46298B0546g6760k07592B04726
10822b75667I4405d7480q5698b0818D3437a45260k10727g2238b3337A60535A4981
10810A17369J005M7516a68478A0233a73274B7150a3370j76620j08334C4114K1885
10799E5999c501E892O8891b55373c3913A28894a7702C38228E3088j3265p173b5238
10786b84329Q7390m0470j7495i5754A09140f0416A09866a36996j04042j07586
10776c48624A74131i2952c1844C6978b03409j4426A88857F8979P3370a15645C39221
10764c2162B5398e8945r5188e7535A53873G4802P2468c9422j06552M1254j905
$$ y = [-130468, 50482, -84293, -220285, 403931, 127620, -303549, 146027, -318913, 25029, -72117, -193878, 103380, -43049, -85237, 132570, 49057, 195355, 20546, -76760, -284352, 204726, -275667, 94405, -47480, -133178, -20818, 43437, -145260, -355987, -72238, -23337, 160535, 14981, 117369, 118374, 165890, -168478, 10233, -173274, 27150, -13370, -189990, -298324, 34114, 55999, -3501, 5892, 74783, -255373, -33913, 128894, -17702, 338228, 53088, 39823, 32650, -25238, -284329, -196939, -237409, -254904, -95754, 109140, -60416, 109866, -136996, -241038, -348624, 174131, -92952, -31844, 36978, -203409, -217835, 188857, 68979, 142349, -115645, 339221, -32162, 25398, -58945, -154133, -57535, 153873, 74802, 147270, -39422, -145974, -104720, -106625]
10753a06625j20418F0954A2671a13266e4473A1554b62373j03022i3825I0240B2155
10741A39750a76766m8088k7827f7320F872c13496B15529e7279b0763E6980A6569
10729b09199O0839F9381h4345q4471A13289l2140J3932k5764B8004P2560l3784
10718F6780A3500a85860K9549k01213I3628J4527K15266D9225a84258j05798J29104
10707a60952A58174c95437a52271n625D28322a54403B8614D394h152k84298A63252
10695e652j11269A14241b7905a2469m01877g3708j3662r0519h4966G0828K0266
10684I1094e2035j96863B26097h0006B04589b28250r408g571A20117J05087b66563
10672B18829c25822B95313a3036j41606k69199E8470a46294C6373c59535M2502
$$ y = [-106625, -227043, 60954, 12671, -113266, -54473, 11554, -262373, -365395, -93825, 90240, 22155, 139750, -176766, -224854, -252681, -67320, 6872, -313496, 215529, -57279, -20763, 56980, 16569, -209199, -148360, 69381, -84345, -168816, 113289, 81149, 95081, 69317, 28004, 100564, 66780, 13500, -185860, -156311, -357524, 93628, 108155, 323421, 49225, -184258, -290056, -160952, 158174, -395437, -152271, -157896, 428322, -154403, 28614, 4394, -8152, -292450, 163252, -5652, -116921, 114241, -27905, -12469, -414346, -73708, -87370, -177889, -84966, 70828, 91094, -52035, -248898, 226097, -80006, 204589, -228250, -237658, -7571, 120117, 225204, -266563, 218829, -325822, 295313, -13036, -154642, -423841, 58470, -146294, 36373, -359535, -317033]
10662c17033B15929b36467A28874d5779k59508D4126q751b06828B2391j834J25401
10651A45958A606K4415J29119b04421q737A42799f7345q3612B9111K64801e7425
10639A12192a18714E07613c20376J0045A55838d2630j0315k26293G5941J8301
10629I4242a64414H5019a59440d7324p7601o7294k32851A12683L1991K39800d8909
10617f7744B00010f3212p2291C2828e4200l4276j44796C12699c45359A62107a16305
10605B17925d3383I9462b8207B0624i0494j01450C0508J47777a39043A24906E1335
10593a8546F2130K5873a16658A55193d9838q0311j93941J59164D9590L45045H6421
10581B63931j16198R673c2063A3579b28184f0675B01026G4337J18179l3757d19621
$$ y = [-317033, 215929, -236467, 128874, -45779, -305287, 44126, 35375, -206828, 22391, 20557, 145958, 1606, 26021, 155140, -204421, -213158, 142799, -67345, -150957, 29111, 293912, -57425, 112192, -118714, 507613, -320376, -310331, 155838, -42630, -52945, -279238, 75941, 94242, -164414, 85019, -159440, -47324, -124925, -192219, -425070, 112683, 144674, 384474, -48909, -67744, 200010, -63212, -135503, 32828, -54200, -88476, -233272, 312699, -345359, 162107, -116305, 217925, -43383, 99462, -28207, 20624, -90494, -191944, 30508, 178285, -139043, 124906, 51335, -18546, 62130, 88003, -116658, 155193, -49838, -130149, -324090, -164926, 49590, 394635, 86421, 263931, 147733, 157406, -32063, 13579, -228184, -60675, 201026, 74337, 192516, 158759, -419621]
10569c64552C29031E1203a40157F9438J11280c18946i7789l936C10521a82824
10558a19465j0728j39324B24631a48517A37403b03285j53683h621A78205E3711
10547a99714G6527g3093o4653N7321F9203l4535R3217a24320I2365a80066B17170
10535a66180e7441r3596M5657j72604A36660a67201H4075c38550a06272I860b2673
10523A01766i035k59960A64552b1335H2170c7705D655b14856H362L01781G2741
10511C02049a897B756a58675h96r9420k90691b461k78539Q6295A35191a91143
10499g5348r1514D9071b58224J23105B76098i4851l3477j43518j59411Q2117c4985
10487A06448a77956F1054R2411J30142f4637A82364i5953A74628J27622J0081
$$ y = [-364552, 329031, 51203, -140157, 69438, 180718, -318946, -97789, -101725, 310521, -182824, -119465, -130193, -269517, 224631, -148517, 137403, -203285, -356968, -8621, 178205, 53711, -199714, 76527, -73093, -137746, -80425, 69203, 34668, 127885, -124320, 92365, -180066, 217170, -166180, -57441, -151037, -105380, -277984, 136660, -167201, 84075, -338550, -106272, 9860, -22673, 101766, -9035, -268995, 164552, -21335, 82170, -37705, 4655, -214856, 8362, 310143, 72741, 302049, -1897, 2756, -158675, -896, -100316, -391007, -2461, -281000, -194705, 135191, -191143, -75348, -166862, 49071, -258224, -135119, 276098, -94851, -128328, -271846, -431257, -349140, -34985, 106448, -177956, 61054, 153465, 283607, -64637, 182364, -95953, 174628, 302250, 312331]
10477C12331E0771k3560a4212A26919h562F7032e2639I445J04032J31015c80696
10465B2384R2844P0338k7320i8604r9096B60980b12858A74583J12093o1145a66261
10453B72742b50995h6718B00278c00366J09212F528d430q3639q8483l04230a49022
10441A39940B7219O9839a84971g1640l33020B7772K0697L7652A5763J09058E7457
10429A24024j5114R9563K4826f1042A48597K0449O519J0844k6879J02476a17822
10417a16173C90278b288j13071o8727N9415M7095B14288f1056o6222M7575H4001
10405a81616D5161K27166l9938H1000a74933K3262A38014n7517f4425D1754N3945
10394I5699h6366D42602b38159A54805n5669P6138p585j4207D5058e2533A94444
$$ y = [312331, 50771, 27211, -14212, 126919, -8562, 67032, -52639, 9445, 113477, 244492, -380696, 22384, 115228, 185566, 158246, -98604, -197700, 260980, -212858, 174583, 286676, 225531, -166261, 272742, -250995, -86718, 200278, -300366, -191154, 6528, -4430, -88069, -176552, -480782, -149022, 139940, 27219, 97058, -184971, -71640, -404660, 27772, 48469, 86121, 15763, 124821, 57457, 124024, 108910, 208473, 233299, -61042, 148597, 169046, 175565, 186409, 159530, 262006, -117822, -116173, 390278, -2288, -115359, -184086, -124671, -77576, 214288, -61056, -127278, -79703, 84001, -181616, 45161, 272327, 232389, 81000, -174933, -151671, 138014, 80497, -64425, 41754, 95699, -86366, 442602, -238159, 154805, 99136, 175274, 167689, 153482, 45058, -52533, 194444]
10382a34297B29134C5716O7791P0097i25C53557f8108D6761c2888D03920j23469
10371B80451m5149n5414c8582B38555D679L82733J15784E028O31153j08221H733
10359D79159f531A08478J39570J07941A57810q825D0636J64772M7565M51745k94049
10348D10669M4027C5028K09811M79287C07026R556a48312H3618M594L19167B00407
10336I094K28637M4405j17230a3622G3297O1191J6381F6118J92424m3661K91033
10325E05914a79266B51010J34298A10079K77545A71414p9333J30974b00197b8380
10314B92007j35641a47382A51832a35293c4571C01145A7288c61477H4924E77b98680
10302b45062A05456L6532c16442B47717j13904b05440A23135J49005f109l1857
$$ y = [-134297, 229134, 35716, 103507, 173604, -925, 353557, -68108, 46761, -32888, 403920, 280451, 235302, 179888, -38582, 238555, 4679, 387412, 503196, 5028, 636181, 527960, 8733, 479159, -6531, 108478, 248048, 355989, 157810, 148985, 40636, 205408, 252973, 704718, 410669, 454696, 35028, 244839, 724126, 307026, 316582, -148312, 83618, 88212, 407379, 200407, 9094, 237731, 282136, 164906, -13622, 73297, 134488, 150869, 66118, 258542, 214881, 505914, -179266, 251010, 385308, 110079, 387624, 171414, 92081, 223055, -200197, -28380, 292007, 156366, -147382, 151832, -135293, -34571, 301145, 17288, -361477, 84924, 577, -298680, -245062, 105456, 141988, -316442, 247717, 133813, -205440, 123135, 272140, -6109, -37966]
10292c7966A14924j4919a48190A52301k0986A1997N513L3854J26605b74176a34451
10280a07388m0033j37396a14597p7218f1649j91336a14816J9375o3257g8312j40947
10269b19259B25314o5506N917D1640a43534b1890j83938c6547I2657M18816A04396
10257C59165j43121J81728A43487D7038f7851E9714Q2799b7435q250k61949e893
10245B43389H2100c47620a36103A2393b81441B75704G531J13468D2220c26982
10234b5629R644j65695h7840j8486c4753b286j42893A80980a6037m0539j64761
10223b21337B14336a45204j99044J69274I5598a50225C16867B4593a89445A5579
10212E0714b92709b0726n4319H299g8851o5729J6317a0629q3342r8617L9254C595
$$ y = [-37966, 114924, 100005, -148190, 152301, 131315, 11997, 17510, 51364, 177969, -274176, -134451, -107388, -147421, -284817, -114597, -191815, -61649, -252985, -114816, -95441, -158698, -78312, -219259, 225314, 159808, 165725, 41640, -143534, -21890, -205828, -36547, 92657, 511473, 104396, 359165, 216044, 397772, 143487, 47038, -67851, 59714, 142513, -27435, -35685, -297634, -5893, 243389, 82100, -347620, -136103, 12393, -281441, 275704, 7531, 120999, 42220, -326982, -25629, -15985, -181680, -87840, -106326, -34753, -2286, -145179, 180980, -16037, -56576, -221337, 214336, -145204, -344248, -174974, 95598, -150225, 316867, 24593, -189445, 15579, 50714, -292709, -20726, -75045, 8299, -78851, -144580, -128263, -10629, -93971, -192588, -153334, 3595]
10199a6410m8782A46085b02154B0190a80792k3211B2835a99228A92613e8543b4167
10187a96503g1039j49350P7478c4378r961k20643C3871a26092j38299R7335I8335
10175i6301A10491b40697g3761l0795k8088H6658a46055C27533a52690A70309
10164F2990C823R8547M9379e5100C6622b96847N0197a14629k2108B14574b76001
10152c26721B34032G9849a2685j65245E11a82907P4369j46542A27255D2727L9447
10141H2174J03a45735H292J3438c30099J39428f0768k25487c9427j51319h7521
10129G4711a80967B38125b21441a04494a558j55125k19795I8147c04186i3565
10118A9742b7167I1961j9922K56238f676k53558b7651A5422c7366m70844H8661
$$ y = [-16410, -65192, 146085, -202154, 20190, -180792, -204003, 22835, -199228, 192613, -58543, -24167, -196503, -71039, -220389, -142911, -34378, -44339, -264982, 33871, -126092, -264391, -167056, 98335, -96301, 110491, -240697, -73761, -104556, -132644, 86658, -146055, 327533, -152690, 170309, 62990, 3823, 102370, 151749, -55100, 36622, -296847, -246650, -114629, -136737, 214574, -276001, -326721, 234032, 79849, -12685, -177930, 511, -182907, -108538, -255080, 127255, 42727, 82174, 82277, -145735, 8292, 21730, -330099, -190671, -60768, -286255, -39427, -190746, -87521, 74711, -180967, 238125, -221441, -104494, -1558, -156683, -376478, 98147, -304186, -93565, 19742, -27167, 91961, 72039, 328277, -6676, -260234, -27651, 15422, -37366, -508210, 88661]
10106B80121a95282H8464c08396R0987M6365M389d7703j16341G4953a18931f41
10094e4722j01413A03761J45566b28163O6944N5435j57054A73164F1128f2119
10083A75333b03902B37580A14152b914B67074F9014J12325c44849J22967e7628
10072E7314b79065H7580B5020a7088A15429b36854j8825j59514g8199A83822b45846
10060a92444K4067m310G5465J06565G9893c07113h4382A33891i3797k81622J06302
10049b69117i7312j46548A61831p1824d7440A5964e8912K3983A74031F1282c36021
10037A85625a48790K2865B32381I7526C8443e9306B20899a86576D0486K16741
10027B57227e6513m94462e7894b4654k56159e9007A96676a89344R3623A22272
$$ y = [280121, -195282, 88464, -308396, -217409, -171044, -166655, -47703, -164044, 74953, -118931, -641, -54722, -156135, 103761, 249327, -228163, -161219, -105784, -262838, 173164, 61128, -62119, 175333, -203902, 237580, 114152, -2914, 267074, 69014, 181339, -344849, -221882, -57628, 57314, -279065, 87580, 25020, -17088, 115429, -236854, -255679, -415193, -78199, 183822, -245846, -192444, -168377, -172687, 75465, 182030, 79893, -307113, -84382, 133891, -93797, -375419, -269117, -97312, -243860, 161831, 90007, -47440, 15964, -58912, -34929, 174031, 61282, -336021, 185625, -148790, -125925, 232381, 97526, 38443, -59306, 220899, -186576, 40486, 257227, -56513, -550975, -57894, -24654, -280813, -59007, 196676, -189344, -95721, 122272]
10016g7630G8268l0255c60797J13817J9743D51519b29004H7822a80392b5298l45869
10005c71167O958F58b24607B0128e2429n3642j99076q2862E8238a98219j06768
9994c04987A18805a701k87677Q6984A18412a67345A59667a68739E7580M4846a15831
9982D5825k1191a83980r7643G243b7099j26677k76378A28486b58389f1915p7148
9971a39063O5382j53270C7656a59452A46300c66551a58254O0939J6681I1176l7853
9960E3323c30456a07661M5224j36576b0383A99519a1354A30692j7961e383A64526
9948G5539g9675b060k87389J32585B6274g7329n9659k4027j58636A20940f0925
9936a00780o5996j85747f2315k8172H1610K75225b24658P0196j24351d7742c720
$$ y = [-77630, 78268, 48013, -360797, -246980, -227237, 451519, -229004, 87822, -180392, -25298, -371167, -364209, 658, -224607, 20128, -52429, -106071, -305147, -388009, 58238, -198219, -304987, 118805, -1701, -289378, -202394, 118412, -167345, 159667, -168739, 57580, 102426, -115831, 45825, 24634, -183980, -281623, 7243, -27099, -153776, -430154, 128486, -258389, -61915, -139063, -73681, -226951, 37656, -159452, 146300, -366551, -158254, -97315, -80634, 91176, 53323, -330456, -107661, -62437, -199013, -20383, 199519, -11354, 130692, 112731, -5383, 164526, 75539, -79675, -2060, -289449, -156864, 26274, -77329, -136988, -161015, -319651, 120940, -60925, -100780, -166776, -352523, -62315, -90487, 81610, 356835, -224658, -154462, -278813, -47742, -3720]
9924a27646a3053G4399L422k1137a3762j72937p3200l0265l6560b7792n6459B44810
9911a09060B41177c20623D5265J0543b02041b7700j67708d5357o6602j80214b0740
9899a44839c8208k29102G408J33327c18068F16f0193j61322h512j25804F9103
9887I6671j7922J40270G7755J93501d20464C3141O3557a69831l03979A57563g0720
9875A8423a65003A58634b28917h3836A09238a80968o2064b8957q6206A80114L40773
9864E20887G0017a86461b2218D8122A4804K0530a00985b3929q6103b0718q1777
9853a02495k5119B1502O6605a20858D3574b74262J9107H9031K23685h6411C981
9841c31575J37325a591j5909k65792g9160l81470a89106J2989J3610E7306d14712
$$ y = [-127646, -13053, 74399, 77821, 56684, -13762, -186699, -259899, -290164, -326724, -27792, -84251, 244810, -109060, 241177, -320623, 45265, 55808, -202041, -27700, -195408, -45357, -111959, -292173, -20740, -144839, -38208, -267310, 7408, 140735, -318068, 616, -60193, -221515, -8512, -134316, 69103, 96671, 78749, 219019, 77755, 271256, -420464, 33141, 96698, -169831, -473810, 157563, -70720, 18423, -165003, 158634, -228917, -83836, 109238, -180968, -243032, -28957, -115163, 180114, 520887, 70017, -186461, -22218, 48122, 14804, 35334, -100985, -23929, -110032, -20718, -102495, -127614, 21502, 88107, -120858, 43574, -274262, -255155, 89031, 312716, -86411, 3981, -331575, -194250, -1591, -17500, -283292, -79160, -460630, -189106, -176117, -162507, 57306, -414712]
9829b067r9968l5733k13771a0208D7661a90376K3656m4154j61435f3880j99793
9818b63673A36618f3433C20296c839A15590b46168L9965k68626a79673B2788N737
9807B8525b13628H7950e0777g026n3527C3826a03645A48399R4875F9160c00442
9795D7448a75574F1868K6661b10065b3101j98248l1136j52254a65499r7977N1499
9784b11977A58988a62716M8927B72181a16352K6465A08753b21637h2498b503k37057
9773b39560r9167m7217d5416B4940b75624j9994E9171k1408a07847o900G1525
9761a41372A64430J8456h8301j03127p8439B51757B1224K1322O2821P4319K6082
9750B05768b56737b4670j97100d5423a992n506k7646A30860E6239A4848c34056
$$ y = [-2067, -102035, -137768, -351539, -10208, 47661, -190376, -166720, -210874, -372309, -63880, -263673, 136618, -63433, 320296, -3839, 115590, -246168, -206203, -474829, -179673, 22788, 28525, -213628, 87950, -50777, -7026, -60553, 33826, -103645, 148399, 243274, 69160, -300442, 47448, -175574, 61868, 88529, -210065, -23101, -221349, -252485, -404739, -165499, -263476, -211977, 158988, -162716, -113789, 272181, -116352, -89887, 108753, -221637, -82498, -2503, -239560, -338727, -385944, -45416, 24940, -275624, -295618, 59171, 37763, -107847, -114747, 71525, -141372, 164430, 182886, -88301, -191428, -269867, 251757, 21224, 42546, 105367, 179686, 205768, -256737, -24670, -221770, -45423, -1992, -7498, -35144, 130860, 56239, 14848, -334056]
9738f3524C16307E1121P3000d8046H7282a72278B29637e0127j22833c7377k23449
9727b60826J20402L1140B65911A19999a09891B291J0785J69127g4878k62341Q9621
9716b47598b0656C8903J11072b97055B2855b89439J13545k9088h137j33554G5085
9704C2966f7742l2438A07755A3268J43218a0345C9546a70006Q4067B8751j544
9693B7207b03975B32758e14157J95437a01899j6315k09712A53290b8430r9697
9683a28127F8289B1114R2015d7097o3800j48681J27512f1948m0703n2353I937
9671c6919l79126C12757A15165b3306l68817B1721a03366P66j8490E9934A7288
9659c3618j4545p740A06989g2596k66126A54997Q2593c33797e7502A8287b07522
$$ y = [-63524, 316307, 51121, 124121, -48046, 87282, -172278, 229637, -50127, -172960, -37377, -260826, -140424, -109284, 265911, 119999, -109891, 2291, 13076, 182203, -74878, -337219, -247598, -20656, 38903, 149975, -297055, 22855, -289439, -175894, -204982, -8137, -141691, 75085, 32966, -67742, -100180, 107755, 13268, 156486, -10345, 39546, -170006, -85939, 28751, 27207, -203975, 232758, -514157, -318720, -101899, -118214, -327926, 153290, -28430, -128127, 68289, 21114, 113129, -47097, -110897, -259578, -132066, -61948, -102651, -155004, 9937, -36919, -416045, 312757, 115165, -23306, -392123, 21721, -103366, -102600, -121090, 59934, 17288, -33618, -48163, -55903, 106989, -72596, -338722, 154997, 237590, -333797, -57502, 18287, -207522]
9647H5877A1526g2220c0737B36336a21708F1570g4965b8399A29717a35471A09329
9635g7202H3078b08648i4130A67971a57271j11804a08713A81096d16916B12293
9624a50429j07202J1461A37191Q9012b35453j65160d6431j0836A56852a2030F4792
9612E258b23803G6027B6654a8155A09676h2331l3396B5646a45191A32988A3670
9600g8395l4528h404j94734K0441f3559B00766p6303b26570A6089J10589k5043
9589A01635L89511a95105B3681b48274I1203J66369A01917g0953A32273b0635
9578B26145F0208K0479d04272N1263B31560a96695f5525d175a418l32829c9821
9566C5998i6619K7749A51078a80899A32866A4615d3633j89497J08026G2650b608
$$ y = [85877, 11526, -72220, -30737, 236336, -121708, 61570, -74965, -28399, 129717, -135471, 109329, -77202, 83078, -208648, -94130, 167971, -157271, -269075, -108713, 181096, -416916, 212293, -150429, -257631, -246170, 137191, 226203, -235453, -400613, -46431, -57267, 156852, -12030, 64792, 5258, -223803, 76027, 26654, -18155, 109676, -82331, -115727, 25646, -145191, 132988, 13670, -78395, -112923, -8404, -203138, -182697, -63559, 200766, 124463, -226570, 16089, 126678, 101635, 491146, -195105, 23681, -248274, 91203, 257572, 101917, -70953, 132273, -20635, 226145, 60208, 80687, -404272, -353009, 231560, -196695, -65525, -4175, -1418, -334247, -39821, 35998, -96619, -68870, 151078, -180899, 132866, 14615, -43633, -233130, -125104, 72650, -2608]
9554d7359k08816d318j08656N6352A9884J08005a59097k6757c7361A91351d7659
9542e9118b0775E5651a19184k14560F859a36319N9636A50478J19015e4425J5247
9531c9178F7444a58591D7683M8915h1423l1985H0115c2943j60849E9813a50814
9519a16391c6369k32291q1173a8846E7782b24175j4707j9097F7605J02872b0409
9507b9511j29637G1475a51006k2532b9183k06476e2035j6069D0833i3444k8671
9496a22115m9215j8821o5655A87889E237g9248G3000K2352e22133G037a68184
9484C21894a71644j1322A1513P568h9304J8342C78190b16965E3441a9580j90997
9473b10577M9708I02a14520C60860a07006o3309G1382l5065F333a64760j70263
$$ y = [-47359, -256175, -4318, -112974, -56622, 19884, 127889, -159097, -185854, -37361, 191351, -47659, -59118, -20775, 55651, -119184, -333744, 6859, -136319, -76683, 150478, 269493, -54425, -39178, 67444, -158591, 47683, 96598, -81423, -113408, 80115, -32943, -193792, 59813, -150814, -116391, -36369, -268660, -349833, -18846, 57782, -224175, -238882, -257979, 67605, 170477, -20409, -29511, -159148, 71475, -151006, -173538, -29183, -235659, -52035, -68104, 40833, -93444, -122115, -171330, -190151, -255806, 187889, 5237, -79248, 73000, 95352, -522133, 7037, -168184, 321894, -171644, -182966, 11513, 19081, -89304, -70962, 378190, -216965, 53441, -19580, -210577, -160869, 902, -114520, 360860, -107006, -170315, 71382, 36317, 6333, -164760, -335023]
9462c35023i8708C9126r627c12897a2469A53033h9255A78253c8412l07338Q9303
9451b56447a22699E7096e2315A44472c51149b4255q142j52136B17224b4757A18055
9439h4550C5343a29999F2988a6589m3336k41443C31003A49070h3342C7071a34175
9427A84890b62581h134B3610K128a10878j28882o7840B73868d3994k93163B08308
9415b76215A80693j7441d51889J38302a114C29573a72397A20801a02973B10598
9404g6264e869G258c5397A5470j3P8746J21501a51718o1807P5180B372a06168
9391b24357N2851A35170K01959c19981a13604a9041A03348k5644M569c80018C053
9379F3511m708a36412j24112a16681L4051I123a30192A53638B6801i3410I4692
$$ y = [-335023, -98708, 39126, 29499, -312897, -12469, 153033, -89255, 178253, -38412, -345750, -256447, -122699, 57096, -52315, 144472, -351149, -24255, -32397, -184533, 217224, -24757, 118055, -84550, 35343, -129999, 62988, -16589, -59925, -301368, 331003, 149070, -83342, 37071, -134175, 184890, -262581, -8134, 23610, 25738, -110878, -239760, -307600, 273868, -43994, -337157, 208308, -276215, 180693, 163252, -451889, -313587, -1114, 329573, -172397, 120801, -102973, 210598, -76264, -5869, 7258, -35397, 15470, 15457, 94203, 215704, -151718, -213525, -138345, 2372, -106168, -224357, -171506, 135170, 337129, -319981, -113604, -19041, 103348, 77704, 82273, -380018, 3053, 63511, 58803, -136412, -260524, -116681, -82630, 9123, -130192, 153638, 26801, -93410, 94692]
9367a03060r3539d4904r5777d764A83532a30621l55290A07091J50147M8925B6006
9355i8781A66700L1213a30175j02157O1859A00154J93313e8432j7750C9175L0967
9344G0142J5971J5587b99487D478J02865b00328j64661e7940r5323C0207c31516
9332i4464L6599A15808c58835R7685K0687a04501j30644f7532k30243i7188k1248
9321a18436G546K6847L4863c46502B64038K2175b01809B01520i1609b467l59335
9310c61802C66875e4424C22718a68596g8458A37926o4727i9534H9827a3632l4034
9299d7666j37408r1834l20968c3173O158j88209A47420G2402R0313l3777B3414
9287A17784a60444M0120q1996j40392Q0075G0201g6757E6983a89384A25867a47408
$$ y = [-103060, -196599, -44904, -140681, -4764, 183532, -130621, -485911, 107091, 257238, 306163, 26006, -98781, 166700, 197913, -130175, -232332, -170473, 100154, 293467, -58432, -76182, 39175, 70142, 86113, 101700, -299487, 4478, 107343, -200328, -364989, -57940, -153263, 30207, -331516, -94464, -57865, 115808, -358835, -261150, -240463, -104501, -235145, -67532, -297775, -97188, -118436, 7546, 34393, 69256, -346502, 264038, 286213, -201809, 201520, -91609, -2467, -361802, 366875, -54424, 322718, -168596, -78458, 137926, 73199, -99534, 89827, -13632, -47666, -185074, -276908, -597876, -33173, -27015, -215224, 147420, 72402, 162715, 128938, 23414, 117784, -160444, -120324, -202320, -342712, -262637, 70201, -76757, 56983, -189384, 125867, -147408]
9275a72649P2156B3608b76300e7270J2813k62077p9804A56601Q8947a08241A08633
9263a94229h7451j35711h2168B896b16907P9023n3776l9332C0630b27477i4564
9251F5411g762j90923p2937o7949n9686a08822a9664o6999j85017A57310A1265
9239I9318Q9382b38031r7409a57281e1394A25706b32441f1151j74369j7188a21849
9227E2378n412b9110A88869a20635a682A2601a91580f5028p6083j65633J35185
9216a71559E9385G96J1097a59473j00604f0550G5988a09582B4185c37748a37109
9204D4987b96376m032A94413d04341G3485k9348d24929G48g0963q3304B9293Q272
9192C7565a81729C2468J42587g564n6473b3670G8232M5725h1505F7188J32339
$$ y = [-172649, -100493, 23608, -276300, -57270, -44457, -306534, -386338, 156601, 245548, -108241, 108633, -194229, -87451, -223162, -82168, 2896, -216907, -137884, -191660, -230992, 30630, -227477, -94564, 65411, -7762, -198685, -271622, -339571, -399257, -108822, -19664, -86663, -271680, 157310, 11265, 99318, 188700, -238031, -335440, -157281, -51394, 125706, -232441, -61151, -235520, -252708, -121849, 52378, 46966, -29110, 188869, -120635, -1682, 12601, -191580, -65028, -141111, -306744, -171559, 59385, 796, 11893, -159473, -260077, -60550, 75988, -109582, 24185, -337748, -137109, 44987, -296376, -300408, 194413, -404341, 73485, 44137, -424929, 748, -70963, -154267, 29293, 37565, -181729, 32468, 175055, -7564, -64037, -23670, 78232, 123957, -81505, 67188, 199527]
9181A99527b26751Q5449H2532g9956B85625b20187A0404K62075A06129a40304
9170d0002J3206A115J88623p2146a01340K6593E5408K854b99188J46572f6357
9158c0486B7683p44c0651m6830j25292I000J91241a07132o3100b7954j70609j74064
9146c72627G9233a22613D7765b28822e89B58981G4063b48397m5556H326e4938
9134a17764i832k91274B789H85O5626Q8452b61249q8873R3252J08642b5833q5410
9122a11243R832j39963j9654A24223C4975b39870A59692c89156a52844A02341
9111B48057b08567A82438c46113i5488j35470j83816f3308j41396A67249a46097
9100d4831j74837A63519b12231K1158R5362k9647a3320r997k8403C2115J97791
$$ y = [199527, -226751, -141302, 82532, -79956, 285625, -220187, 10404, 272479, 106129, -140304, -40002, -26796, 1115, 189738, 117592, -101340, -74747, 55408, 58262, -299188, -152616, -66357, -30486, 27683, 26939, -30651, -77481, -202773, 9000, 200241, -107132, -170232, -27954, -198563, -372627, 79233, -122613, 47765, -228822, -589, 258981, 74063, -248397, -293953, 8326, -54938, -117764, -9832, -301106, 2789, 885, 66511, 154963, -261249, -350122, -256870, -148228, -25833, -111243, -101411, -241374, -261028, 124223, 34975, -239870, 159692, -389156, -152844, 102341, 248057, -208567, 182438, -346113, -95488, -230958, -414774, -63308, -204704, 167249, -146097, -44831, -219668, 163519, -212231, -191073, -95711, -125358, -13320, -23317, -51720, 32115, 229906]
9089B29906a02126d958l63978a19030A32015k5980J07970a78927A67003h2644
9078a57054m4647k9688e2566j50679A90949a54281A86162P373a94271k46225c1887
9066B04639a99199h3865m1910B24454r1216i1858j3283F5977c67387A6122i8839
9054c3985F0679g421j64817p3683A1906b5848o9329B03212C1697a49643D7303
9042b22937Q7092c7552p8846B16765b92366c3087j12850A07492a38302H0787b13044
9030C06210A50738b64026B30594b22789A6336g9116j95253A77274e530l91688
9020c97218Q6224I0509b2705L913m34888a65020B41795a22297G0626j9676a80238
9008D2928c36599h5656m7625m64034a13941k2518r6343c7763q3192q2516B19002
$$ y = [229906, -102126, -4958, -368936, -119030, 132015, 106035, 214005, -178927, 167003, -82644, -157054, -201701, -231389, -52566, -203245, 190949, -154281, 186162, 193535, -194271, -440496, -31887, 204639, -199199, -83865, -125775, 224454, 133238, -91858, -105141, 65977, -367387, 16122, -98839, -33985, 60679, -7421, -172238, -245921, 11906, -25848, -95177, 203212, 31697, -149643, 47303, -222937, -135845, -37552, -116398, 216765, -292366, -33087, -145937, 107492, -138302, 80787, -213044, 306210, 150738, -264026, 230594, -222789, 16336, -79116, -274369, 177274, -5530, -397218, -310994, 90509, -22705, -18792, -453680, -165020, 241795, -122297, 70626, 50950, -180238, 42928, -336599, -85656, -133281, -597315, -113941, -136459, -232802, -37763, -120955, -203471, 219002]
8996b17292b2117D6020N4494b532A96501n4264E5297a99250A05032a03346j30378
8985b33724C2081a90767C2478a33260e6884F6302b03596H9086b21296m0900J5613
8974b46583n5728b5256l64877B45758b6605C23777a30788j48682A10472J51106
8964B61578E5122c77771B34973E693a69477G1333h0366r9671D6930c24583c1256
8952I2188c03394a35965k5302A76730n9336a5515l8986J1449A60579m8020c30864
8940a3592A63241J51279h322E32221k31113j20511J54223H1416B2814a1286A5218
8928A84005D0981P88849O56171P34372N51631K108033M061201k157649j874536
8919D909053A118707k93510A51554J89233I1843g3954A97171b3290j3880n2056
$$ y = [-217292, -22117, 46020, 100514, -2532, 196501, 142237, 55297, -199250, 105032, -103346, -233724, 32081, -190767, 32478, -133260, -56884, 66302, -203596, 89086, -221296, -262196, -246583, -302311, -25256, -390133, 245758, -26605, 323777, -130788, -279470, 110472, 261578, 55122, -377771, 234973, 5693, -169477, 71333, -80366, -180037, 46930, -324583, -31256, 92188, -303394, -135965, -161267, 176730, 117394, -15515, -54501, -43052, 160579, 112559, -330864, -13592, 163241, 314520, -8322, 532221, 301108, 180597, 334820, 81416, 22814, -11286, 15218, 184005, 40981, 829830, 1486001, 2220373, 2772004, 4880037, 8941238, 6783589, 4909053, 1118707, 825197, 151554, 340787, 91843, -73954, 197171, -23290, -37170, -89226]
8909h9226l03160A18756L9905b15511a00082C22069a26766F5591b5434k55107
8899b80541M0468c7514k33784J10724K6874o7922A23367c56393a48564o3093d4759
8887e08660h8850F731g8263I5781C1216a44495m4345j44915h2640r291F839a01170
8874a46210A23636a24314J5504C63492c03149B15771a2921r7294B237J81944i606
8862D6343J02923O9286c6925r5277J9394A02514P1453b16581A28743g6360C168
$$ y = [-89226, -392386, 118756, 158661, -215511, -100082, 322069, -126766, 65591, -25434, -280541, -240073, -37514, -271298, -160574, -133700, -201622, 123367, -356393, -148564, -211657, -44759, -508660, -88850, 6731, -78263, 95781, 31216, -144495, -188840, -333755, -82640, -91931, 6839, -101170, -146210, 123636, -124314, -108810, 363492, -303149, 215771, -12921, -110215, 2237, 184181, -9606, 46343, 149266, 218552, -36925, -132202, -112808, 102514, 173967, -216581, 128743, -76360, 3168]
$$ [...]
##END NTUPLES=NMR SPECTRUM
##END=
