##TITLE=AC1550_ROEFFECT0014_8268818_sxCLHr4sEz
##JCAMPDX= 6.0         $$ Bruker NMR JCAMP-DX V2.0
##DATA TYPE= NMR SPECTRUM
##DATA CLASS= NTUPLES
##ORIGIN= BRUKER
##OWNER= Administrator
$$ 1.72 TOPSPIN		Version 2.1
$$ 2013-10-13 00:27:37.265 -0700  Administrator@X
$$ Compression mode = diff/dup
##.OBSERVE FREQUENCY= 400.02188249412
##.OBSERVE NUCLEUS= ^1H
##.ACQUISITION MODE= SIMULTANEOUS (DQD)
##.ACQUISITION SCHEME= undefined
##.AVERAGES= 64
##.DIGITISER RES= 22
##SPECTROMETER/DATA SYSTEM= spect
##.PULSE SEQUENCE= noesygpps1d.comp
##.SOLVENT NAME= COFFEE_meoh
##.SHIFT REFERENCE= INTERNAL, COFFEE_meoh, 1, 14.96068
##AUDIT TRAIL= $$ (NUMBER, WHEN, WHO, WHERE, PROCESS, VERSION, WHAT)
$$ ##TITLE= Audit trail, TOPSPIN		Version 2.1
$$ ##JCAMPDX= 5.01
$$ ##ORIGIN= Bruker BioSpin GmbH
$$ ##OWNER= Administrator
$$ $$ E:\/data/COFFEE/nmr/AC1550_ROEFFECT0014_8268818_sxCLHr4sEz/12/pdata/1/auditp.txt
$$ ##AUDIT TRAIL=  $$ (NUMBER, WHEN, WHO, WHERE, PROCESS, VERSION, WHAT)
(   1,<2013-10-13 00:27:32.546 -0700>,<Administrator>,<X>,<go>,<TOPSPIN 2.1>,
      <created by zg
	started at 2013-10-13 00:16:03.213 -0700,
	POWCHK enabled, PULCHK disabled,
       configuration hash MD5:
       C8 4E 4E 5D D3 5C D8 9E 9F 52 82 E0 59 8A DE 15
       data hash MD5: 64K
       71 C1 EE 1E FA FE 6A 34 E3 21 6E E8 3E BD B4 BD>)
(   2,<2013-10-13 00:27:35.468 -0700>,<Administrator>,<X>,<proc1d>,<TOPSPIN 2.1>,
      <Start of raw data processing
       efp LB = 0.3 FT_mod = 6 PKNL = 1 PHC0 = 0 PHC1 = 0 SI = 128K 
       data hash MD5: 128K
       C4 B8 4F 7D 93 0D 2F FE 9F 58 A6 D1 DC B2 76 40>)
(   3,<2013-10-13 00:27:36.390 -0700>,<Administrator>,<X>,<proc1d>,<TOPSPIN 2.1>,
      <pk PHC0 = -84.28162 PHC1 = 0 
       data hash MD5: 128K
       0C A0 6C E4 EF 77 8C ED DF 51 04 28 C6 6F 5A D6>)
(   4,<2013-10-13 00:27:36.765 -0700>,<Administrator>,<X>,<proc1d>,<TOPSPIN 2.1>,
      <abs ABSG = 1 
       data hash MD5: 128K
       71 08 0C 66 0F 44 08 5D E5 AE D8 77 FF 13 7E 8E>)
(   5,<2013-10-13 00:27:36.859 -0700>,<Administrator>,<X>,<proc1d>,<TOPSPIN 2.1>,
      <abs ABSG = 2 
       data hash MD5: 128K
       59 67 B3 01 2E 22 02 80 95 58 FE 33 74 48 C6 C7>)
(   6,<2013-10-13 00:27:36.937 -0700>,<Administrator>,<X>,<proc1d>,<TOPSPIN 2.1>,
      <abs ABSG = 3 
       data hash MD5: 128K
       ED A5 B5 28 C1 E2 E5 30 7C CA 6E 06 0D B5 14 58>)
(   7,<2013-10-13 00:27:37.015 -0700>,<Administrator>,<X>,<proc1d>,<TOPSPIN 2.1>,
      <abs ABSG = 4 
       data hash MD5: 128K
       CE A9 AC 76 4B CD C3 70 59 3B 9B F8 AE E4 59 FB>)
(   8,<2013-10-13 00:27:37.093 -0700>,<Administrator>,<X>,<proc1d>,<TOPSPIN 2.1>,
      <abs ABSG = 5 
       data hash MD5: 128K
       DA EB E7 0F 59 59 0B 9E 68 46 B9 8E 16 4B DD F3>)
$$ ##END=
$$ 
$$ $$ hash MD5
$$ $$ E0 B5 97 3E 4E B6 24 D3 C9 6C 4D 11 5A 50 EE D9
##$RELAX= 
##$RELAX= 
##$RELAX= 
##$RELAX= 
##$RELAX= 
##$RELAX= 
##$RELAX= 
##$RELAX= 
$$ Bruker specific parameters
$$ --------------------------
##$DU= <E:\>
##$EXPNO= 12
$$ [...]
##$TP07= 0
##$TPNAME0= <>
##$TPNAME1= <>
##$TPNAME2= <>
##$TPNAME3= <>
##$TPNAME4= <>
##$TPNAME5= <>
##$TPNAME6= <>
##$TPNAME7= <>
##$TPOAL= (0..7)
0.5 0.5 0.5 0.5 0.5 0.5 0.5 0.5
##$TPOFFS= (0..7)
0 0 0 0 0 0 0 0
##$TUNHIN= 0
##$TUNHOUT= 0
##$TUNXOUT= 0
##$USERA1= <user>
##$USERA2= <user>
##$USERA3= <user>
##$USERA4= <user>
##$USERA5= <user>
##$V9= 5
##$VALIST= <valist>
##$VCLIST= <CCCCCCCCCCCCCCC>
##$VD= 0
##$VDLIST= <DDDDDDDDDDDDDDD>
##$VPLIST= <PPPPPPPPPPPPPPP>
##$VTLIST= <TTTTTTTTTTTTTTT>
##$WBST= 1024
##$WBSW= 4
##$XGAIN= (0..3)
0 0 0 0
##$XL= 0
##$YL= 0
##$YMAX_a= 6032029
##$YMIN_a= -12164304
##$ZGOPTNS= <>
##$ZL1= 120
##$ZL2= 120
##$ZL3= 120
##$ZL4= 120
##$ABSF1= 14.96068
##$ABSF2= -5.597502
##$ABSG= 5
##$ABSL= 3
##$ALPHA= 0
##$AQORDER= 0
##$ASSFAC= 0
##$ASSFACI= 0
##$ASSFACX= 0
##$ASSWID= 0
##$AUNMP= <proc_prof1d_extract.lims>
##$AXLEFT= 0
##$AXNAME= <>
##$AXNUC= <1H>
##$AXRIGHT= 0
##$AXTYPE= 0
##$AXUNIT= <>
##$AZFE= 0.1
##$AZFW= 0.1
##$BCFW= 0
##$BC_mod= 0
##$BYTORDP= 0
##$COROFFS= 0
##$CY= 15
##$DATMOD= 1
##$DC= 0
##$DFILT= <>
##$DTYPP= 0
##$F1P= 0
##$F2P= 0
##$FCOR= 0.5
##$FTSIZE= 131072
##$FT_mod= 6
##$GAMMA= 0
##$GB= 0
##$INTBC= 1
##$INTSCL= 1
##$ISEN= 128
##$LB= 0.3
##$LEV0= 0
##$LPBIN= 0
##$MAXI= 10000
##$MC2= 0
##$MEAN= 0
##$ME_mod= 0
##$MI= 0
##$NCOEF= 0
##$NC_proc= -2
##$NLEV= 6
##$NOISF1= 0
##$NOISF2= 0
##$NSP= 0
##$NTH_PI= 0
##$NZP= 0
##$OFFSET= 14.96068
##$PC= 1
##$PHC0= -84.28162
##$PHC1= 0
##$PH_mod= 1
##$PKNL= yes
##$PPARMOD= 0
##$PPDIAG= 0
##$PPIPTYP= 0
##$PPMPNUM= 2147483647
##$PPRESOL= 1
##$PSCAL= 4
##$PSIGN= 0
##$PYNMP= <proc.py>
##$REVERSE= no
##$SF= 400.020009765649
##$SI= 131072
##$SIGF1= 0
##$SIGF2= 0
##$SINO= 400
##$SIOLD= 131072
##$SPECTYP= <>
##$SREGLST= <1H.CDCl3>
##$SSB= 0
##$STSI= 131072
##$STSR= 0
##$SW_p= 8223.68421052631
##$SYMM= 0
##$S_DEV= 0
##$TDeff= 65536
##$TDoff= 0
##$TI= <>
##$TILT= no
##$TM1= 0
##$TM2= 0
##$TOPLEV= 0
##$USERP1= <user>
##$USERP2= <user>
##$USERP3= <user>
##$USERP4= <user>
##$USERP5= <user>
##$WDW= 1
##$XDIM= 131072
##$YMAX_p= 317099067
##$YMIN_p= -11045
##$CURPLOT= <Network HP LaserJet P1505>
##$CURPRIN= <$Network HP LaserJet P1505>
##$DFORMAT= <normdp>
##$LAYOUT= <+/1D_H.xwp>
##$LFORMAT= <normlp>
##$PFORMAT= <normpl>
##$SURQMSG= 1
$$ End of Bruker specific parameters
$$ ---------------------------------
##NTUPLES= NMR SPECTRUM
##VAR_NAME=  FREQUENCY,     SPECTRUM/REAL,   SPECTRUM/IMAG
##SYMBOL=    X,             R,               I
##VAR_TYPE=  INDEPENDENT,   DEPENDENT,       DEPENDENT
##VAR_FORM=  AFFN,          ASDF,            ASDF
##VAR_DIM=   131072,        131072,          131072
##UNITS=     HZ,            ARBITRARY UNITS, ARBITRARY UNITS
##FACTOR=    0.0627417313425164, 1,          1
##FIRST=     8223.62146879497, -2003,        -59985
##LAST=      0,             -841,            -61351
##MIN=       0,             -11045,          0
##MAX=       8223.62146879497, 317099067,    0
$$ Real data points
##PAGE= N=1
##DATA TABLE= (X++(R..R)), XYDATA
$$ [...]
61644E64024Q05J111R77P81Q10J101J468J536J031J89m08o30j037k082l430m315
61628E61931m400m008l706l844m285m438l779k432j024J7P06J088J075Q57R00
61613E34658J332J769J903J763J284K44j038j695j421r50r73j232j224j091j056
61598E32273o00P76K462L371L389L192K886J991P56K61Q32J366Q40l87j379k118
61582E49911l309n009o307o500o017n873o483p287p559p306p097p186p216o877
61568D59885o397o100n865n413m862m510m306m012l706l659l850m025m137m233
61554C94810m120l683l313l359l380k721j690j234j425j329n91n5l02n83M2J240
61538C68307J981K028J934J924J717J378J478K222L041L229K585J387J03q23j242
$$ y = [564024, 564829, 565940, 566917, 567698, 568508, 569609, 571077, 572613, 573644, 573833, 573425, 572795, 571758, 569676, 566246, 561931, 557531, 553523, 549817, 545973, 541688, 537250, 533471, 531039, 530015, 530032, 530738, 531826, 532901, 533758, 534658, 535990, 537759, 539662, 541425, 542709, 542953, 541915, 540220, 538799, 537849, 536876, 535644, 534420, 533329, 532273, 531673, 532449, 534911, 538282, 541671, 544863, 547749, 549740, 550496, 550757, 551589, 552955, 553795, 553408, 552029, 549911, 546602, 541593, 535286, 528786, 522769, 516896, 510413, 503126, 495567, 488261, 481164, 473978, 466762, 459885, 453488, 447388, 441523, 436110, 431248, 426738, 422432, 418420, 414714, 411055, 407205, 403180, 399043, 394810, 390690, 387007, 383694, 380335, 376955, 374234, 372544, 371310, 369885, 368556, 367965, 367910, 367608, 367025, 367067, 368307, 370288, 372316, 374250, 376174, 377891, 379269, 380747, 382969, 386010, 389239, 391824, 393211, 393314, 392491, 391249]
61523C91249j472j976k829l720m356m626m421l643k445j269o26p73j502k142k101
61508C53348j583j395j836k210j842j120q43j012j076j111j732k761l029j973
61494C29825n16R1k64q04r92p58j27P13J205J034P00Q92J411J427P16l6k21N0
61476C34346M30Q12J067R02L68O3M09J007J150P12J13l37o01o02k82O2k2m83p31
61457C38383m24Q8K93K55M99J263K096K266J523M79R8P17J649J978J669J507J950
61440C56289K504K502K109K099K791L652M043L925L695L571L402L030K648K657
61426C98917L150L624L414K462J436R94J144J493J901K450K966L032K595K150
61412D31728K142K426K526K210J543N67p80k456m146n348n668n163m412m067m253
$$ y = [391249, 389777, 387801, 384972, 381252, 376896, 372270, 367849, 364206, 361761, 360492, 359866, 359093, 357591, 355449, 353348, 351765, 350370, 348534, 346324, 344482, 343362, 342519, 341507, 340431, 339320, 337588, 334827, 331798, 329825, 329309, 329400, 329136, 328332, 327340, 326582, 326455, 327168, 328373, 329407, 330107, 330999, 332410, 333837, 334553, 334517, 334296, 334346, 334776, 335588, 336655, 337557, 337925, 337988, 338397, 339404, 340554, 341266, 341379, 341042, 340441, 339839, 339557, 339619, 339597, 339114, 338383, 337959, 338047, 338340, 338595, 339094, 340357, 342453, 344719, 346242, 346721, 346819, 347536, 349185, 351163, 352832, 354339, 356289, 358793, 361295, 363404, 365503, 368294, 371946, 375989, 379914, 383609, 387180, 390582, 393612, 396260, 398917, 402067, 405691, 409105, 411567, 413003, 413997, 415141, 416634, 418535, 420985, 423951, 426983, 429578, 431728, 433870, 436296, 438822, 441032, 442575, 443142, 442362, 439906, 435760, 430412, 424744, 419581, 415169, 411102, 406849]
61397D06849m599m785m791m498l611k278j362j559k453k985k716k107j580j005
61383C66520k44L57L94p0p08j265j485j087k46L18J73j81k1N20O74K03k74j90
61365C63388L80J104J866K576L023L156L119K821J990R29O46J777L696N258O102
61350D01831O619O981P013O973P566Q887J0013J0139R625R450R945J0578J0778
61337E16398J0454R767Q838P856P022O240N064L194R24j070k301k751k813l072
61323E63750l973n331o234n854m509l499l651m362m449l680k843k441k039j133
61309E09752j4O60P45O26O29Q69J405K132K657K761K836L427M460N366N850O050
61293E50211N993N439M297K748Q90j152k847l534l290k937k995l208l293l503
$$ y = [406849, 402250, 397465, 392674, 388176, 384565, 382287, 380925, 379366, 376913, 373928, 371212, 369105, 367525, 366520, 366276, 366633, 367027, 366957, 366249, 364984, 363499, 362412, 362166, 362484, 362657, 362476, 362455, 362975, 363649, 363852, 363578, 363388, 363768, 364872, 366738, 369314, 372337, 375493, 378612, 381433, 383423, 384352, 384998, 386775, 390471, 395729, 401831, 408450, 415431, 422444, 429417, 436983, 445870, 455883, 466022, 475647, 485097, 495042, 505620, 516398, 526852, 536619, 545457, 553313, 560335, 566575, 571639, 574833, 575757, 574687, 572386, 569635, 566822, 563750, 559777, 554446, 548212, 542358, 537849, 534350, 530699, 526337, 521888, 518208, 515365, 512924, 510885, 509752, 509738, 510398, 511143, 511769, 512398, 513267, 514672, 516804, 519461, 522222, 525058, 528485, 532945, 538311, 544161, 550211, 556204, 561643, 565940, 568688, 569578, 568426, 565579, 562045, 558755, 555818, 552823, 549615, 546322, 542819]
61279E42819m034m380l891k643j240o5Q79J570J916K019K146K488L100L892M540
61264E49116M750M764N207O152O838O745O470O928Q115R301J0123J0743J1220
61251F46472J1455J1685J2214J2635J2145J0646Q786O797M130N62l086n826p587
61238G21028q955j0255j1392j2195j2528j2181j1101r615q222p165o357n542m460
61225F01060l118j916j187o21M86K249L960M966N367N582N758N854N947O012N768
61210F46167N097M319L777L470L371L631M091M182L824L923N223P133Q534R408
61196G16150J0659J2494J4155J5393J7061J9681K2437K4355K5731K7534K9785
61185I35435L1455L1890L1509L0940L0143K8670K6446K3881K1387J8960J6295
$$ y = [542819, 538785, 534405, 530514, 527871, 526631, 526566, 527445, 529015, 530931, 532950, 535096, 537584, 540684, 544576, 549116, 553866, 558630, 563837, 569989, 576827, 583572, 590042, 596970, 605085, 614386, 624509, 635252, 646472, 657927, 669612, 681826, 694461, 706606, 717252, 726038, 732835, 736965, 737527, 734441, 728615, 721028, 712073, 701818, 690426, 678231, 665703, 653522, 642421, 632806, 624584, 617419, 611062, 605520, 601060, 597942, 596026, 594839, 594218, 594704, 596953, 600913, 605879, 611246, 616828, 622586, 628440, 634387, 640399, 646167, 651264, 655583, 659360, 662830, 666201, 669832, 673923, 678105, 681929, 685852, 691075, 698208, 706742, 716150, 726809, 739303, 753458, 768851, 785912, 805593, 828030, 852385, 878116, 905650, 935435, 966890, 998780, 1030289, 1061229, 1091372, 1120042, 1146488, 1170369, 1191756, 1210716, 1227011]
61174A227011J3217R984P042M490J957q57l803o657r614j3015j6655j9870k2332
61161A170898k4412k6532k8610l0263l1288l1657l1320l0338k9001k7546k5907
61150H54024k4013k2125k0543j9056j7164j4769j2224r756p358n311m087l476
61138F94142k441m43J603K431K218K371L581N012N725O087P124Q987J0926J2595
61124G59918J4537J7275K0508K3635K6570K9646L2906L5991L8714M1241M3658
61113A084599M5693M7115M8079M8796M9073M8562M7386M6048M4693M2852M0101
61102A592997L6568L2581K8181K3325J8265J3295Q257K771l120q976j4636k0348
61090A709160k6123l1416l5742l9269m2463m5344m7460m8535m8824m8768m8479
$$ y = [1227011, 1240228, 1250212, 1257254, 1261744, 1263701, 1262844, 1259041, 1252384, 1242770, 1229755, 1213100, 1193230, 1170898, 1146486, 1119954, 1091344, 1061081, 1029793, 998136, 966816, 936478, 907477, 879931, 854024, 830011, 807886, 787343, 768287, 751123, 736354, 724130, 714374, 707016, 701705, 697618, 694142, 691701, 691258, 692861, 695292, 697510, 699881, 703462, 708474, 714199, 720286, 727410, 736397, 747323, 759918, 774455, 791730, 812238, 835873, 862443, 892089, 924995, 960986, 999700, 1040941, 1084599, 1130292, 1177407, 1225486, 1274282, 1323355, 1371917, 1419303, 1465351, 1510044, 1552896, 1592997, 1629565, 1662146, 1690327, 1713652, 1731917, 1745212, 1753469, 1756240, 1753120, 1744144, 1729508, 1709160, 1683037, 1651621, 1615879, 1576610, 1534147, 1488803, 1441343, 1392808, 1343984, 1295216, 1246737]
61079A246737m7692m6127m3830m1154l8452l5830l3193l0413k7401k4118k0713
61068H57814j7569j4968j2709j0299p640n290l864l279k852k069j018K0J196K977
61054G80450N381P665R081R744J0405J1522J2968J4648J6770J9274K1621K3563
61042I43092K5618K8221L0889L2864L4249L5744L7497L9039M0213M1294M2172
61031A330892M2333M1879M1682M2217M2993M3437M3558M3394M2629M1358M0442
61020A796814M0556M1506M3159M6295N1655N8748O6628P5456Q6398J00283J17392
61009B524890J38446J64844J97873K38304K86499L41981M03316M69895N43847
61000E309895O28568P25091Q31704R47572J072543J197782J295803J326110J259873
$$ y = [1246737, 1199045, 1152918, 1109088, 1067934, 1029482, 993652, 960459, 930046, 902645, 878527, 857814, 840245, 825277, 812568, 802269, 794629, 789339, 785475, 782196, 779344, 777275, 776257, 776277, 777473, 780450, 785831, 793496, 802577, 812321, 822726, 834248, 847216, 861864, 878634, 897908, 919529, 943092, 968710, 996931, 1027820, 1060684, 1094933, 1130677, 1168174, 1207213, 1247426, 1288720, 1330892, 1373225, 1415104, 1456786, 1499003, 1541996, 1585433, 1628991, 1672385, 1715014, 1756372, 1796814, 1837370, 1878876, 1922035, 1968330, 2019985, 2078733, 2145361, 2220817, 2307215, 2407498, 2524890, 2663336, 2828180, 3026053, 3264357, 3550856, 3892837, 4296153, 4766048, 5309895, 5938463, 6663554, 7495258, 8442830, 9515373, 10713155, 12008958, 13335068, 14594941]
60991A4594941J104665R04834P13872N62430M48895L55014K64435J65586M4781
60982A9159453j11720l03395n06656o86655q21234r14469r88518j063449j142014
60973A2621343j208312j238290j214437j135824j017618q81690p46513o23146
60965D555513n16711m28594l57308k99552k52102k12958j81032j55412j35140
60956B016704j19034j05490r3098q1663p1990o4331n7767n1459m5701m1060l7226
60945A247885l3624l0618k8951k8268k7357k5876k4652k4118k3559k2389k1095
60934I57378k0281j9579j8332j6717j5501j4991j4896j4884j4746j4310j3650
60923G79491j3070j2571j1736j0501r466q979q544p718o969o906p247p369p265
$$ y = [14594941, 15699606, 16604440, 17318312, 17880742, 18329637, 18684651, 18949086, 19114672, 19159453, 19047733, 18744338, 18237682, 17551027, 16729793, 15815324, 14826806, 13763357, 12621343, 11413031, 10174741, 8960304, 7824480, 6806862, 5925172, 5178659, 4555513, 4038802, 3610208, 3252900, 2953348, 2701246, 2488288, 2307256, 2151844, 2016704, 1897670, 1792180, 1699082, 1617419, 1545429, 1481098, 1423331, 1371872, 1326171, 1285111, 1247885, 1214261, 1183643, 1154692, 1126424, 1099067, 1073191, 1048539, 1024421, 1000862, 978473, 957378, 937097, 917518, 899186, 882469, 866968, 851977, 837081, 822197, 807451, 793141, 779491, 766421, 753850, 742114, 731613, 722147, 713168, 704624, 696906, 689937, 683031, 675784, 668415, 661150]
60910F61150p099o372m738l131k815l499l738l114k615k799k988k757k817l768
60896F08900n037n772n918n768n317m739m723n568o531o801o492o083n527m709
60882E29915m134m325m923n230n289n602o009n777m667l194j864p63N0M23M22
60867D79033L32K95K44J79J48J53L60J135K502L808M428M540M709M898M571L700
60851E15035K978K955L394L669L402K645J686Q08P3n85j106j391j768k828m470
60836E24497n678n764n386n596o294o556o157n828n867n613m629l486k910k753
60822D51980k415j846j562j823k269k337j761p11M17J337K022K549K953L323L821
60807D53678M384M681M634M670M996N051M296L279L090L790M373M312M212M523
$$ y = [661150, 654051, 647679, 642941, 639810, 636995, 633496, 629758, 626644, 624029, 621230, 618242, 615485, 612668, 608900, 603863, 598091, 592173, 586405, 581088, 576349, 571626, 566058, 559527, 552726, 546234, 540151, 534624, 529915, 525781, 521456, 516533, 511303, 506014, 500412, 494403, 488626, 483959, 480765, 478901, 478138, 478188, 478611, 479033, 479365, 479660, 479904, 480083, 480231, 480384, 480744, 481879, 484381, 488189, 492617, 497157, 501866, 506764, 511335, 515035, 518013, 520968, 524362, 528031, 531433, 534078, 535764, 536572, 536645, 536060, 534954, 533563, 531795, 528967, 524497, 518819, 513055, 507669, 502073, 495779, 489223, 483066, 477238, 471371, 465758, 461129, 457643, 454733, 451980, 449565, 447719, 446157, 444334, 442065, 439728, 437967, 437256, 437673, 439010, 441032, 443581, 446534, 449857, 453678, 458062, 462743, 467377, 472047, 477043, 482094, 486390, 489669, 492759, 496549, 500922, 505234, 509446, 513969]
60793E13969M521L296J220l37n79l5J93m29j495k192k177j895j938k265k464k567
60777E04826l007l752m216m231m346m848n182m838m202l939m051m189m359m608
60763D45058m444l459k234j716j817j531n81J34Qk50K58J178J374O10j27OP28
60746D33195J344J848K753L981M639M102K829J823J503J581J748J935J955J553
60732D66789R86J033K045L422M306M434M048L397K757K503K676K706K155J443
60718E04700J281J512J265K38q22j133q21n22n53q40j369k233l264l927l800l054
60702D86658k408k451k968l210k841k350k235k237j856j372j570k501l259l273
60688D52127l053l218l426k898j660n34lK79P89J524K182K572K637K416K161K255
$$ y = [513969, 518490, 521786, 523006, 522669, 522090, 522055, 522248, 521819, 520324, 518132, 515955, 514060, 512122, 509857, 507393, 504826, 501819, 498067, 493851, 489620, 485274, 480426, 475244, 470406, 466204, 462265, 458214, 454025, 449666, 445058, 440614, 437155, 434921, 433205, 431388, 429857, 429276, 429410, 429418, 429168, 429426, 430604, 431978, 432588, 432461, 432467, 433195, 434539, 436387, 439140, 443121, 447760, 451862, 454691, 456514, 458017, 459598, 461346, 463281, 465236, 466789, 467775, 468808, 470853, 474275, 478581, 483015, 487063, 490460, 493217, 495720, 498396, 501102, 503257, 504700, 505981, 507493, 508758, 508996, 508174, 507041, 506220, 505698, 505145, 504305, 502936, 500703, 497439, 493512, 489712, 486658, 484250, 481799, 478831, 475621, 472780, 470430, 468195, 465958, 464102, 462730, 461160, 458659, 455400, 452127, 449074, 445856, 442430, 439532, 437872, 437338, 437335, 437614, 438403, 439927, 442109, 444681, 447318, 449734, 451895, 454150]
60672D54150K775L331L565L609L846M286M463M011L129K389K177K400K649K546
60658D99326J972J093K64j75j20K05M65N00L72J40k88q83j252r55j18N48N56J96
60640E01846L5O2k12q41j242j112j005j513k214k090r12M17R95R34R10J179J435
60623D96672J477J576K145L173M079M192L461K649K559L075L267K597J599J170
60609E33691J490J961K062J774J406J286J607K223K624K448J948J688J821K021
60595E60050K071K139K379K633K692K535K190J655J140J103J654K113J596J36
60581E86086j155j208j97O71N34l19j109j706k501l301l069j230J235K678K553
60566E77962J840J693K271L034L591L922M088M084L882L420K697J983J771K271
$$ y = [454150, 456925, 460256, 463821, 467430, 471276, 475562, 480025, 484036, 487165, 489554, 491731, 494131, 496780, 499326, 501298, 502391, 502655, 502480, 502360, 502565, 503030, 503530, 503902, 504042, 503754, 502871, 501619, 500664, 500546, 501094, 501650, 501846, 501881, 501943, 501731, 500890, 499648, 498536, 497531, 496018, 493804, 491714, 490802, 491219, 492214, 493148, 494058, 495237, 496672, 498149, 499725, 501870, 505043, 509122, 513314, 516775, 519424, 521983, 525058, 528325, 530922, 532521, 533691, 535181, 537142, 539204, 540978, 542384, 543670, 545277, 547500, 550124, 552572, 554520, 556208, 558029, 560050, 562121, 564260, 566639, 569272, 571964, 574499, 576689, 578344, 579484, 580587, 582241, 584354, 585950, 586086, 584931, 583723, 583526, 584197, 584731, 584412, 583303, 581597, 579096, 575795, 572726, 571496, 572731, 575409, 577962, 579802, 581495, 583766, 586800, 590391, 594313, 598401, 602485, 606367, 609787, 612484, 614467, 616238, 618509]
60552F18509L057L384K831J704Q53J128K648M539N589N369M554M087M264M815
60538F67331N517O342P114P430P096O461O138O399O913P179P138P235P787Q557
60524G64637R133R583J0304J1366J2402J3229J4076J5051J5856J6297J6733J7595
60512I26262J8725J9630K0179K0692K1365K1993K2251K1991K1273K0322J9478
60501A154161J8991J8840J8777J8462J7550J5925J3995J2432J1380J0175Q126
60490A318814N286K070j578n958j0753j5061j8425k1349k4492k7847l0945l3476
60478A136286l5337l6312l6068l4556l2224k9837k7997k6732k5549k4046k2484
60467H05144k1368k0581j9314j7173j4909j3650j3507j3378j2230j0258q647q277
$$ y = [618509, 621566, 624950, 627781, 629485, 630338, 631466, 634114, 638653, 644242, 649611, 654165, 658252, 662516, 667331, 672848, 679190, 686304, 693734, 700830, 707291, 713429, 719828, 726741, 733920, 741058, 748293, 756080, 764637, 773770, 783353, 793657, 805023, 817425, 830654, 844730, 859781, 875637, 891934, 908667, 926262, 944987, 964617, 984796, 1005488, 1026853, 1048846, 1071097, 1093088, 1114361, 1134683, 1154161, 1173152, 1191992, 1210769, 1229231, 1246781, 1262706, 1276701, 1289133, 1300513, 1310688, 1318814, 1324100, 1326170, 1324592, 1318634, 1307881, 1292820, 1274395, 1253046, 1228554, 1200707, 1169762, 1136286, 1100949, 1064637, 1028569, 994013, 961789, 931952, 903955, 877223, 851674, 827628, 805144, 783776, 763195, 743881, 726708, 711799, 698149, 684642, 671264, 659034, 648776, 640129, 631852]
60455F31852q832r248q829p829o946o557o565o772p008p011o538n757n245n402
60441E33313o007o472o398n828n166m835m837m625l729k513j966k453l154l080
60427D72250k304j683j619j702j648j839k562l201k824j471k89k11q85j292j131
60412D47589j022j345j481o70P02J401R19R7j11N4k87j129j382l61J165J866J435
60395D47440P60O40Q98R47P56Q09J337J981K318K328K224K088J874J564J208Q80
60379D70052O64M77j12j444k993l487k256j49J319J488P88j85j068j435r44M4
60363D60759O97P49O38N35Oj007j695j427o35p4K84Q90J632J974J823J586J503
60346D68238J557J850K412K783K460J705J345J765K645L561M305M679M649M654
$$ y = [631852, 623020, 613772, 604943, 597114, 590168, 583611, 577046, 570274, 563266, 556255, 549717, 543960, 538715, 533313, 527306, 520834, 514436, 508608, 503442, 498607, 493770, 489145, 485416, 482903, 480937, 478484, 475330, 472250, 469946, 468263, 466644, 464942, 463294, 461455, 458893, 455692, 452868, 451397, 451108, 450897, 450012, 448720, 447589, 446567, 445222, 443741, 443071, 443773, 445174, 446093, 446190, 446079, 446133, 445846, 444717, 443335, 442974, 444139, 446005, 447440, 448200, 448840, 449738, 450685, 451441, 452250, 453587, 455568, 457886, 460214, 462438, 464526, 466400, 467964, 469172, 470052, 470716, 471193, 471081, 469637, 466644, 463157, 460901, 460752, 462071, 463559, 464347, 464162, 463094, 461659, 460715, 460759, 461456, 462205, 462843, 463378, 463384, 462377, 460682, 459255, 458620, 458546, 458830, 459720, 461352, 463326, 465149, 466735, 468238, 469795, 471645, 474057, 476840, 479300, 481005, 482350, 484115, 486760, 490321, 494626, 499305, 503954, 508608]
60332E08608N159N875O094N724N298M956M235K997J702N37q65k447l387l268k853
60317E38365l031l600l854l744l644l395k438p65J071K727M157N152N579N989
60303E38569P179Q968J0194J0156R330Q450P430N784L585J428l62k019l812n687
60289E99193p457r032j0306j0963j0673r504p919o295m587k762j293q12j183j518
60275E14889j316j088j405j905j855j383j236j464j299n07K3l93j061p43O52J960
60259E01869K289J997K088K987M194M893M716L946L100K416J824J254P54K39n30
60244E38036j554k480l096l664m460n150n119m343l486l043k809k304j360j31
60230D95037J180K301K900K895K613K352J996J427J121J744L161M338M502L983
$$ y = [508608, 513767, 519642, 525736, 531460, 536758, 541714, 545949, 548946, 550648, 551185, 550320, 547873, 544486, 541218, 538365, 535334, 531734, 527880, 524136, 520492, 517097, 514659, 513894, 514965, 517692, 521849, 527001, 532580, 538569, 545748, 554716, 564910, 575066, 584396, 592846, 600276, 606060, 609645, 611073, 610711, 608692, 604880, 599193, 591736, 582704, 572398, 561435, 550762, 541258, 533339, 527044, 522457, 519695, 518402, 517590, 516407, 514889, 513573, 512485, 511080, 509175, 507320, 505937, 504701, 503237, 501938, 501431, 501454, 501061, 500000, 499257, 499909, 501869, 504158, 506155, 508243, 511230, 515424, 520317, 525033, 528979, 532079, 534495, 536319, 537573, 538327, 538566, 538036, 536482, 534002, 530906, 527242, 522782, 517632, 512513, 508170, 504684, 501641, 498832, 496528, 495168, 495037, 496217, 498518, 501418, 504313, 506926, 509278, 511274, 512701, 513822, 515566, 518727, 523065, 527567, 531550]
60216E31550L650L863M311M575M475L996L314K875L029L637M299M906N622O359
60202E90461O690O366N534M410L138K124J965K746L684L856L157K238J731J648
60188F39748J485P23n81j644j686r11m58j049k124k683k608k612l094l647l732
60173F15127l357k876k499k099j482p40l57p16j401j353o1J750K977L397L554
60158F09864L757L932M219M877N515N302M127K909K415K416K401K436K815L330
60144F60315L503L310L256L864N349P427R243R883R440R103R711J0558J0278Q628
60130G63868O642N184M057K675R12r74k751m253n307n918o247o264n695m545l327
60115G38057k571k202j752j038l47K8J63L20N67P09O12M15L75N18N93M22J74J62
$$ y = [531550, 535200, 539063, 543374, 547949, 552424, 556420, 559734, 562609, 565638, 569275, 573574, 578480, 584102, 590461, 597151, 603517, 609051, 613461, 616599, 618723, 620688, 623434, 627118, 630974, 634131, 636369, 638100, 639748, 641233, 641956, 641375, 639731, 638045, 637134, 636676, 635627, 633503, 630820, 628212, 625600, 622506, 618859, 615127, 611770, 608894, 606395, 604296, 602814, 602074, 601717, 601001, 599600, 598247, 598186, 599936, 602913, 606310, 609864, 613621, 617553, 621772, 626649, 632164, 637466, 641593, 644502, 646917, 649333, 651734, 654170, 656985, 660315, 663818, 667128, 670384, 674248, 679597, 687024, 696267, 706150, 715590, 724693, 734404, 744962, 755240, 763868, 770510, 775694, 779751, 782426, 783338, 782364, 779613, 775360, 770053, 764135, 757888, 751624, 745929, 741384, 738057, 735486, 733284, 731532, 730494, 730147, 730175, 730338, 730658, 731225, 731934, 732546, 732961, 733336, 733854, 734447, 734869, 735043, 735205]
60097G35205M11N78L29k95q92j027n16M61J496K296K910L620M502N216N328M855
60081G64477M287M014L906L555K830J897Q32m59j821k845l502m396n944p644q678
60066G50509r033r327r638r360q425p796q182q917q854p937p086o713o254n277
60052F37710m220l685l576l371k883k246j439k99R76J838K034J929K074K639L417
60037F30898M156M659M781M543M183L814L147J909M52n34j032j797l241m821o007
60022F45110p249r140j1086j1850j1318j0719j0808j0956j0350r202q161p287
60010E26984o415n794n609n265m078k366j027k75L54R46J079P87P24J175J684
59995E02904J905K151K678L109L083K953L328M200N003N362N369N210M874M274
$$ y = [735205, 735616, 736194, 736523, 736228, 735336, 734309, 733793, 734254, 735750, 738046, 740956, 744576, 749078, 754294, 759622, 764477, 768764, 772778, 776684, 780239, 783069, 784966, 785798, 785339, 783518, 780673, 777171, 772775, 766831, 759187, 750509, 741476, 732149, 722511, 713151, 704726, 696930, 688748, 679831, 670977, 663040, 655954, 649241, 642987, 637710, 633490, 629805, 626229, 622858, 619975, 617729, 616290, 615991, 616967, 618805, 620839, 622768, 624842, 627481, 630898, 635054, 639713, 644494, 649037, 653220, 657034, 660181, 662090, 662542, 662008, 660976, 659179, 655938, 651117, 645110, 637861, 628721, 617635, 605785, 594467, 583748, 572940, 561984, 551634, 542432, 534271, 526984, 520569, 514775, 509166, 503901, 499823, 497457, 496430, 496155, 496509, 497455, 498534, 499321, 500045, 501220, 502904, 504809, 506960, 509638, 512747, 515830, 518783, 522111, 526311, 531314, 536676, 542045, 547255, 552129, 556403]
59981E56403L462K668K138J854J471O86l87j338j984k485k997l458l819m174m529
59966E43511m640m238l360k336j566j254j230j152r44q89j104j200q75n34p93
59951E17396j459j645j008k03O1j44l94o13r34j203j128p74n34o59j040j312j206
59934E03201q94j048k122l564m191l498k239j450j374j604j715j409n10O23J130
59919D79336O52J4K42J225J942J956J897K441L380L965L748K960K296K339K914
59904E11307L221K858K498K961L848L942K980K128K363L138L331K846K560K989
59890E52970L765M396M868N350N844O273O596O661O291N687N408N714O137N968
59876F31928N104M150L732L878M004L371J624q94l317m929n715o162o598o964
$$ y = [556403, 559865, 562533, 564671, 566525, 567996, 568682, 568295, 566957, 564973, 562488, 559491, 556033, 552214, 548040, 543511, 538871, 534633, 531273, 528937, 527371, 526117, 524887, 523735, 522791, 521902, 520798, 519598, 518723, 518189, 517396, 515937, 514292, 513284, 513081, 513142, 512998, 512604, 511991, 511057, 509854, 508726, 507952, 507418, 506759, 505719, 504407, 503201, 502307, 501259, 499137, 495573, 491382, 487884, 485645, 484195, 482821, 481217, 479502, 478093, 477583, 478206, 479336, 479988, 480002, 480244, 481469, 483411, 485367, 487264, 489705, 493085, 497050, 500798, 503758, 506054, 508393, 511307, 514528, 517386, 519884, 522845, 526693, 530635, 533615, 535743, 538106, 541244, 544575, 547421, 549981, 552970, 556735, 561131, 565999, 571349, 577193, 583466, 590062, 596723, 603014, 608701, 614109, 619823, 625960, 631928, 637032, 641182, 644914, 648792, 652796, 656167, 657791, 656897, 653580, 648651, 642936, 636774, 630176, 623212]
59862F23212p242p662q193q252p304n680m300l534k814j524R9J360K042K593L466
59847E76267M675O018P319Q308Q584P968O807N608M501L316K207J760K292L246
59833F48876L648L063J874P49J32J55N15M87m88k063l338m157n312p129q660q963
59817F19389q583q745r451r550q594p449o759o041m778l448k667k178j450p22
59803E38974n42p17o38m07p01j521j957j415m50r4p50k004l193l895m072l909
59787E12709l528k911k162j614j432j330q65N5J197K259K910K847K140J374J048
59772E12697J074J126J195J347J263P00J17K60J106J879K091K020K109K446K869
59757E34299L133K931K226J539J415J638J556J116Q03O68K22m51n35K29R61R64
$$ y = [623212, 615970, 608308, 600115, 591863, 584559, 578879, 574579, 571045, 568231, 566707, 566806, 568166, 570208, 572801, 576267, 580942, 586960, 594279, 602587, 611171, 619139, 625946, 631554, 636055, 639371, 641578, 643338, 645630, 648876, 652524, 655587, 657461, 658210, 658342, 658497, 659012, 659499, 659011, 656948, 653610, 649453, 644141, 637012, 628352, 619389, 610806, 602061, 592610, 583060, 574466, 567017, 560258, 554217, 549439, 545991, 543324, 541146, 539696, 538974, 538432, 537715, 537077, 536670, 535969, 534448, 532491, 531076, 530626, 530532, 529782, 527778, 524585, 520690, 516618, 512709, 509181, 506270, 504108, 502494, 501062, 499732, 498867, 498922, 500119, 502378, 505288, 508135, 510275, 511649, 512697, 513771, 514897, 516092, 517439, 518702, 519402, 519519, 519779, 520885, 522764, 524855, 526875, 528984, 531430, 534299, 537432, 540363, 542589, 544128, 545543, 547181, 548737, 549853, 550656, 551324, 551546, 551095, 550560, 550789, 551750, 552714]
59741E52714Q04J341K292K674K273J817J806J993J955J586R54K12l06l38l1K39
59725E71985M03O26Q76R24P47N40M30M88Q76J525J808J183Q6m15N6Q14J212J414
59707E85578J689J683J012J18j82J44L39j2n09p19q41j242j780k040j961j755
59691E79522j377o05L31P48L88r7L2N96Q29N16K64N35R81J065Q64P92P66K66p47
59672E85669j599j820j878k468l379l612k722j486q95q71n57L59J207J399J245
59657E68592J356J718J882J845K007K327K166J217O7m53j38N62J108J165O18l38
59641E85701j244j710j690j288n87J54M45Q5l97k50O10J607K332K942L614M066
59625E94390L980L606L577M115M768M938M464L565K437J148j38j153j804k278
$$ y = [552714, 553518, 554859, 557151, 559825, 562098, 563915, 565721, 567714, 569669, 571255, 572209, 572421, 572115, 571777, 571746, 571985, 572388, 573014, 573890, 574814, 575561, 576101, 576531, 577019, 577895, 579420, 581228, 582411, 582497, 582082, 582138, 582952, 584164, 585578, 587267, 588950, 589962, 590080, 589898, 590042, 590381, 590369, 589860, 589141, 588300, 587058, 585278, 583238, 581277, 579522, 578145, 577540, 577871, 578619, 579007, 578910, 578942, 579538, 580367, 580883, 581147, 581682, 582663, 583728, 584592, 585384, 586150, 586416, 585669, 584070, 582250, 580372, 577904, 574525, 570913, 568191, 566705, 565810, 564939, 564382, 564741, 565948, 567347, 568592, 569948, 571666, 573548, 575393, 577400, 579727, 581893, 583110, 583177, 582724, 582586, 583148, 584256, 585421, 586039, 585701, 584457, 582747, 581057, 579769, 579182, 579336, 579781, 579866, 579469, 579219, 579829, 581436, 583768, 586710, 590324, 594390, 598370, 601976, 605553, 609668, 614436, 619374, 623838, 627403, 629840, 630988, 630850, 629697, 627893, 625615]
59611F25615k669k709k091r93L4O97J219J830K293K221J706J367J673K388K728
59596F35309K105O54r61k223l164m042m831n211n032m520m027l756l779m102m556
59581E87864m823m664m124l453k917k638k464k045j190k01L67L27j0k28j62K16
59565E59855Q82J645K213K522K756K968K983K797K755L033L364L443L351L271
59551E97838L160L041L313M269N445N984N613M910M652N168O286P503Q301Q708
59537F74191R511J1415J3881J5321J4706J2703J0956J0466J0892J1231J0793R628
59525H15694Q331P587P733Q598R699J0594J1018J0727R448P142M299J657m70k390
59511I09667m433o428q040r403j0903j2441j3418j3583j3291j2793j1773r944
$$ y = [625615, 622946, 620237, 618146, 617153, 617187, 617884, 619103, 620933, 623226, 625447, 627153, 628520, 630193, 632581, 635309, 637414, 638068, 637107, 634884, 631720, 627678, 622847, 617636, 612604, 608084, 604057, 600301, 596522, 592420, 587864, 583041, 578377, 574253, 570800, 567883, 565245, 562781, 560736, 559546, 559345, 559712, 560039, 560029, 559801, 559639, 559855, 560737, 562382, 564595, 567117, 569873, 572841, 575824, 578621, 581376, 584409, 587773, 591216, 594567, 597838, 600998, 604039, 607352, 611621, 617066, 623050, 628663, 633573, 638225, 643393, 649679, 657182, 665483, 674191, 683702, 695117, 708998, 724319, 739025, 751728, 762684, 773150, 784042, 795273, 806066, 815694, 824025, 831612, 839345, 847943, 857642, 868236, 879254, 889981, 899429, 906571, 910870, 912527, 912057, 909667, 905234, 898806, 890766, 881363, 870460, 858019, 844601, 831018, 817727, 804934, 793161, 783217]
59499G83217p628n362l379j719m60N99K049M052N828O562O639P230Q777J0594
59485H16999J2012J3238J4863J7035J9344K1256K2501K3349K4495K6333K8354
59474A039779K9620K9711K8853K7140K4238K0014J4957R837N334K026K49j96K50
59461A231812J669M722R756J6262K3396L0669L7896M4853N1308N7071O1951O5948
59449A637313O9576P3381P6787P7813P4253O5004N0231L1016R326j2256l1662
59438B120782m8263o2414p4294q3555q9840r3034r3022q9696q3399p5143o6213
59427A261909n7560m9481m1795l4407k7535k1262j5122q598k056L512P786J1431
59415A026822J4859J7520J9038K0176K1656K2495K0653J5393Q089O49n922j1263
$$ y = [783217, 775589, 770227, 766848, 765129, 764669, 765268, 767317, 771369, 777197, 783759, 790398, 797628, 806405, 816999, 829011, 842249, 857112, 874147, 893491, 914747, 937248, 960597, 985092, 1011425, 1039779, 1069399, 1099110, 1127963, 1155103, 1179341, 1199355, 1214312, 1224149, 1229483, 1231509, 1231758, 1231562, 1231812, 1233481, 1238203, 1247959, 1264221, 1287617, 1318286, 1356182, 1401035, 1452343, 1509414, 1571365, 1637313, 1706889, 1780270, 1857057, 1934870, 2009123, 2074127, 2124358, 2155374, 2164700, 2152444, 2120782, 2072519, 2010105, 1935811, 1852256, 1762416, 1669382, 1576360, 1486664, 1403265, 1328122, 1261909, 1204349, 1154868, 1113073, 1078666, 1051131, 1029869, 1014747, 1006149, 1004093, 1007605, 1015391, 1026822, 1041681, 1059201, 1078239, 1098415, 1120071, 1142566, 1163219, 1178612, 1186701, 1187350, 1181428, 1170165]
59403A170165j5032j7276j8778k0283k1518k1555k0132j8232j7277j7873j9352
59392I62857k0500k0629k0070j9625j9857k0823k2174k3131k2685k0363j6854
59381G36146j3519j1201r776q739p764o698n529m543m103m064l782k907j844j117
59367F50560o74r0P57J576K072K241K415L186M994P498R670J0862J1593J2867
59353G19527J4936J7239J9370K1480K3664K5602K7126K8586L0187L1359L1338
59342I90414L0163K8596K7046K5120K2293J8458J3691Q000J737m190r155j3634
59330A138539j8622k4124k8857l1666l2731l3093l3401l3502l3019l1749k9619
59319H08156k6820k4017k1962k0621j9067j6549j3440j0751q859p173n112k936
$$ y = [1170165, 1155133, 1137857, 1119079, 1098796, 1077278, 1055723, 1035591, 1017359, 1000082, 982209, 962857, 942357, 921728, 901658, 882033, 862176, 841353, 819179, 796048, 773363, 753000, 736146, 722627, 711426, 701650, 692911, 685147, 678449, 672920, 668377, 664274, 660210, 656428, 653521, 651677, 650560, 649886, 649796, 650553, 652129, 654201, 656442, 658857, 662043, 667037, 674535, 684205, 695067, 706660, 719527, 734463, 751702, 771072, 792552, 816216, 841818, 868944, 897530, 927717, 959076, 990414, 1020577, 1049173, 1076219, 1101339, 1123632, 1142090, 1155781, 1163781, 1165518, 1161328, 1152173, 1138539, 1119917, 1095793, 1066936, 1035270, 1002539, 969446, 936045, 902543, 869524, 837775, 808156, 781336, 757319, 735357, 714736, 695669, 679120, 665680, 654929, 646070, 638897, 633785, 630849]
59307F30849j257m7J393L445N630P258Q217Q866R383R615R397Q651P242N187K939
59292G16768J045n46k335m364n975o733p014p229o986n611l248q52R28K334L946
59277F74128O014Q434J0949J3259J5144J6667J8102J9547K0778K1449K1328K0410
59265H66209J8946J7305J5567J3375J0336O494K241k076o137r537j2100j4221
59253I06402j6307j7954j8252j7064j5379j4127j3125j1558r188o551m200k175
59241G60522j62K087M586P072R130J0518J1438J2337J3351J3991J3526J1761R333
59228H79490P031M809J866k098o105q884j0447j2044j4475j7128j8880j9407j9165
59215G64563j8569j7768j6955j6285j5492j4067j1993r964q683q128p676o801
$$ y = [630849, 629592, 629545, 630938, 634383, 640013, 647271, 655488, 664354, 673737, 683352, 692749, 701400, 708642, 713829, 716768, 717813, 717267, 714932, 710568, 704593, 697860, 690846, 683617, 676631, 671020, 667772, 666920, 667848, 670182, 674128, 680142, 688576, 699525, 712784, 727928, 744595, 762697, 782244, 803022, 824471, 845799, 866209, 885155, 902460, 918027, 931402, 941738, 948232, 950473, 948397, 942260, 932723, 920623, 906402, 890095, 872141, 853889, 836825, 821446, 807319, 794194, 782636, 773448, 766897, 762697, 760522, 760360, 762447, 767033, 774105, 783235, 793753, 805191, 817528, 830879, 844870, 858396, 870157, 879490, 886521, 891330, 893196, 891098, 884993, 876109, 865662, 853618, 839143, 822015, 803135, 783728, 764563, 745994, 728226, 711271, 694986, 679494, 665427, 653434, 643470, 634787, 626659, 618983, 612182]
59203F12182n544m264l189k344j870k052k856l659l775l170k376j737j174o80
59189E73492n01o16n55l2O23J061J620K795M258N010M636L937M033N155O671Q028
59173F19615R281J0645J1888J2586J2891J3621J5246J7097J8000J7677J7025J6871
59161G92443J6970J6585J5540J4129J2246R367N467J369k149n166q166j1060j3185
59148H44390j4250j4759j5347j6008j6331j6204j5859j5343j4434j3169j2020
59137F80666j1319j0867j0412j0065r891r432q217o508m983l783k507j078R3Q91
59123E92588J760K985M294N396O350P171P594P633P809Q473R343J0048J0617J1000
59109F93061J0744R770Q913Q955R482R456Q747Q175Q177Q185P560O457N507M990
$$ y = [612182, 606638, 602374, 599185, 596841, 594971, 592919, 590063, 586404, 582629, 579459, 577083, 575346, 574172, 573492, 572991, 572375, 571820, 571788, 572411, 573472, 575092, 577887, 582145, 587155, 591791, 595728, 599761, 604916, 611587, 619615, 628896, 639541, 651429, 664015, 676906, 690527, 705773, 722870, 740870, 758547, 775572, 792443, 809413, 825998, 841538, 855667, 867913, 877280, 882747, 884116, 881967, 876801, 868635, 857575, 844390, 830140, 815381, 800034, 784026, 767695, 751491, 735632, 720289, 705855, 692686, 680666, 669347, 658480, 648068, 638003, 628112, 618680, 610463, 603955, 598972, 595189, 592682, 591604, 591697, 592588, 594348, 597333, 601627, 607023, 613373, 620544, 628138, 635771, 643580, 652053, 661396, 671444, 682061, 693061, 703805, 713575, 722488, 731443, 740925, 750381, 759128, 767303, 775480, 783665, 791225, 797682, 803189, 808179]
59095H08179M608L899K749J600J005Q69M48o59j898k546k706k934l255l366l589
59080H02404m730o867r041j0367j0890j1080j1154j1131j1062j0905j0467r741
59068F84969q958q237p538p003o879o968o686n767m540l371k383j770j818k341
59054F10710k644k408k125k302k724k889k784k740k814k723k266j489o11j8q8
59039E80085p67j546j975j992j633q16L80J588K576L472M381N169N802O495P277
59024F08496P888Q379R265J0739J2222J3177J3820J4486J4802J4129J2532J0585
59012G50520Q549O474M819M137M163L984L236K489K374K936L987N557P628R827
58998H20680J1619J2703J3122J3245J3534J4117J4573J4348J3311J1699R655P207
$$ y = [808179, 812787, 816686, 819435, 821035, 822040, 822909, 823357, 822698, 820800, 818254, 815548, 812614, 809359, 805993, 802404, 797674, 790807, 781766, 771399, 760509, 749429, 738275, 727144, 716082, 705177, 694710, 684969, 676011, 667774, 660236, 653233, 646354, 639386, 632700, 626933, 622393, 619022, 616639, 614869, 613051, 610710, 608066, 605658, 603533, 601231, 598507, 595618, 592834, 590094, 587280, 584557, 582291, 580802, 580191, 580173, 580085, 579318, 577772, 575797, 573805, 572172, 571356, 571736, 573324, 575900, 579372, 583753, 588922, 594724, 601219, 608496, 616384, 624763, 634028, 644767, 656989, 670166, 683986, 698472, 713274, 727403, 739935, 750520, 759069, 765543, 770362, 774499, 778662, 782646, 785882, 788371, 790745, 793681, 797668, 803225, 810853, 820680, 832299, 845002, 858124, 871369, 884903, 899020, 913593, 927941, 941252, 952951, 962606, 969813]
58986I69813M523J840p71l248n305o719p742q780r810j0482j0652j0397r674q404
58972H84192o741m805k457K20K517L923N030O702Q601R560R455R499J0369J1149
58958I47214J0642Q806O363L790J307r08l140o056r545j2334j3508j3808j4547
58945I04276j5754j6363j5774j4203j1830q712n500l221k144j695j572k126l480
58932H01902n128o665q167r578j0427j0545j0431j0527j0623j0391r953r455q611
58919F81401p169n482m055k777j210N88K064K916L397L944M865O259P901R240
58905G01882R966J0472J1349J2532J3533J4426J5885J8022J9904K0711K0842K1253
58893H90777K2084K2697K3021K3929K6022K8642L0663L1917L3199L4949L6467
$$ y = [969813, 974336, 976176, 975405, 972157, 966852, 960133, 952391, 943611, 933801, 923319, 912667, 902270, 892596, 884192, 877451, 872646, 870189, 870409, 872926, 876849, 881879, 888581, 897182, 906742, 916197, 925696, 936065, 947214, 957856, 966662, 973025, 976815, 978122, 977214, 974074, 968018, 958473, 946139, 932631, 918823, 904276, 888522, 872159, 856385, 842182, 830352, 821640, 816140, 812919, 810775, 809080, 807508, 805382, 801902, 796774, 790109, 781942, 772364, 761937, 751392, 740961, 730434, 719811, 709420, 699467, 690012, 681401, 674232, 668750, 664695, 661918, 660708, 661296, 663360, 666276, 669673, 673617, 678482, 684741, 692642, 701882, 711848, 722320, 733669, 746201, 759734, 774160, 790045, 808067, 827971, 848682, 869524, 890777, 912861, 935558, 958579, 982508, 1008530, 1037172, 1067835, 1099752, 1132951, 1167900, 1204367]
58882A204367L6580L4770L1394K7117K2361J7222J1553N132k090r743j7121k3587
58870A337955k8927l3262l6712l9127m0244m0025l8789l6946l4645l1907k8956
58859I48415k6226k3863k1548j9029j6665j5045j4149j3304j2104j0944j0366
58848G65172j0235r981r472r105q997q626p537o053m892m329m109m072m398n113
58834F68253n772n859n329m572l971l680l719l999m250m121l474k526j635q91
58820F14455K8J493L324M708N002M554M416N037N654N271L977K844K594K805K512
58805F68674J273n40k182l068l131k799k581k526k264j636r87p36q39r18p48l94
58789F44598jL22N42Q30J581K946M397N111M921M539M649N053N058M536M102M153
$$ y = [1204367, 1240947, 1275717, 1307111, 1334228, 1356589, 1373811, 1385364, 1390496, 1388406, 1378663, 1361542, 1337955, 1309028, 1275766, 1239054, 1199927, 1159683, 1119658, 1080869, 1043923, 1009278, 977371, 948415, 922189, 898326, 876778, 857749, 841084, 826039, 811890, 798586, 786482, 775538, 765172, 754937, 744956, 735484, 726379, 717382, 708756, 701219, 695166, 690274, 685945, 681836, 677764, 673366, 668253, 662481, 656622, 651293, 646721, 642750, 639070, 635351, 631352, 627102, 622981, 619507, 616981, 615346, 614455, 614483, 615976, 619300, 624008, 629010, 633564, 637980, 643017, 648671, 653942, 657919, 660763, 663357, 666162, 668674, 669947, 669407, 667225, 664157, 661026, 658227, 655646, 653120, 650856, 649220, 648233, 647497, 646658, 645740, 644992, 644598, 644597, 644919, 645461, 646291, 647872, 650818, 655215, 660326, 665247, 669786, 674435, 679488, 684546, 689082, 693184, 697337]
58773F97337M249L754K809K180K186K332K110J667J340R75K19o89j114r75r58
58758G17422j539k270k333j470p9J349K536L357L837M170M547N002N558O333P216
58743G53636P664P262O364N812N950O287O246N864N560N458N359N231N423O210
58729H38326P359Q286Q663Q654Q602Q618Q625Q620Q638Q542Q147P588P264P265
58715I53197P218O875O603O905P682Q337Q486Q141P253N596L233P04j523l624
58701A025083o167r357j2687j5372j7106j8358j9734k1102k1617k0830j9417j8359
58689H24977j7731j6864j5581j4396j3460j2251j0695r722r912j0296r527p910
58677F76632p077p591q003o757m140j691k12Q00K050L551M952O186P530R233J1140
$$ y = [697337, 701586, 705340, 708149, 710329, 712515, 714847, 716957, 718624, 719964, 720939, 721158, 720469, 719355, 718380, 717422, 715883, 713613, 711280, 709810, 709731, 711080, 713616, 716973, 720810, 724980, 729527, 734529, 740087, 746420, 753636, 761300, 768562, 774926, 780738, 786688, 792975, 799221, 805085, 810645, 816103, 821462, 826693, 832116, 838326, 845685, 853971, 862634, 871288, 879890, 888508, 897133, 905753, 914391, 922933, 931080, 938668, 945932, 953197, 960415, 967290, 973893, 980798, 988480, 996817, 1005303, 1013444, 1020697, 1026293, 1029526, 1030230, 1028707, 1025083, 1018916, 1009559, 996872, 981500, 964394, 946036, 926302, 905200, 883583, 862753, 843336, 824977, 807246, 790382, 774801, 760405, 746945, 734694, 723999, 714277, 704365, 694069, 684542, 676632, 669555, 661964, 653961, 647204, 643064, 641373, 641161, 641961, 644011, 647562, 652514, 658700, 666230, 675463, 686603]
58662F86603J2659J3075J2227J0764R583Q948Q368P272N585L586J516m65k121
58649G77600l179l589l636l712l886l832l292k639k608l318l816l047j100R30
58635G36876K280L120L839M374M601M837N346N724N337M301L382L006K865K563
58621G92451K131J838J964K910N036Q115J1282J3824J5696J7090J7861J7806J7153
58608I25157J6304J5252J3648J1442R016O681M415K153N7j642k848l531l658l327
58594I89119k873k687k958l474l611k657m76K110L912M545M852O003Q282J0888
58580A010975J2787J3577J3566J3247J2795J1970J0568Q866P466O632O039N391
58568A133879N024N498O656P660Q054Q339R193J0547J1767J2453J2557J1970J0615
$$ y = [686603, 699262, 712337, 724564, 735328, 744911, 753859, 762227, 769499, 775084, 778670, 780186, 779721, 777600, 774421, 770832, 767196, 763484, 759598, 755766, 752474, 749835, 747227, 743909, 740093, 737046, 735946, 736876, 739156, 742276, 746115, 750489, 755090, 759927, 765273, 770997, 776334, 780635, 784017, 787023, 789888, 792451, 794582, 796420, 798384, 801294, 806330, 814445, 825727, 839551, 855247, 872337, 890198, 908004, 925157, 941461, 956713, 970361, 981803, 990819, 997500, 1001915, 1004068, 1004125, 1002483, 999635, 996104, 992446, 989119, 986246, 983559, 980601, 977127, 973516, 970859, 970383, 972493, 976405, 980950, 985802, 991805, 1000087, 1010975, 1023762, 1037339, 1050905, 1064152, 1076947, 1088917, 1099485, 1108351, 1115817, 1122449, 1128488, 1133879, 1138903, 1144401, 1151057, 1158717, 1166771, 1175110, 1184303, 1194850, 1206617, 1219070, 1231627, 1243597, 1254212]
58555A254212Q862P232N632L455N42k546n367q057j0588j2278j2676j2369j2276
58542A203778j2485j2535j2568j3226j4489j5429j5383j4700j4118j3903j3851
58531A051091j3570j2546j0486p810n387l508j609P22L023M653N755O969Q438
58518A025735R596R801Q854P091N291M307M359M757M601L731K754K362K781L746
58504A099766M748N403N772O262P154Q412R887J1355J2322J2264J1287J0117R235
58491A213984Q439P421O161M479J973j096l531m569m905n622o597o894o369n730
58477A197144n172m106k412r53n02q47j379j910k615l710n477q089j1069j3377
58463A135526j4374j4372j4031j3552j2759j1559j0054q394o708n009l184j335
$$ y = [1254212, 1263074, 1270306, 1275938, 1279393, 1279935, 1277389, 1272022, 1263965, 1253377, 1241099, 1228423, 1216054, 1203778, 1191293, 1178758, 1166190, 1152964, 1138475, 1123046, 1107663, 1092963, 1078845, 1064942, 1051091, 1037521, 1024975, 1014489, 1006679, 1001292, 997784, 996175, 996897, 999920, 1004573, 1010328, 1017297, 1025735, 1035331, 1045132, 1053986, 1061077, 1066368, 1070675, 1075034, 1079791, 1084392, 1088123, 1090877, 1093239, 1096020, 1099766, 1104514, 1109917, 1115689, 1121951, 1129105, 1137517, 1147404, 1158759, 1171081, 1183345, 1194632, 1204749, 1213984, 1222423, 1229844, 1236005, 1240484, 1242457, 1241361, 1237830, 1233261, 1228356, 1222734, 1216137, 1209243, 1202874, 1197144, 1191972, 1187866, 1185454, 1184501, 1183999, 1183152, 1181773, 1179863, 1177248, 1173538, 1168061, 1159972, 1148903, 1135526, 1121152, 1106780, 1092749, 1079197, 1066438, 1054879, 1044825, 1036431, 1029723, 1024714, 1021530, 1020195]
58451A020195k7K65j03k94o8L0l27q41j361k307l897n472o161n758m556k778p36
58434I85804R13J743K224L167M649O084P258Q580J0209J1670J2616J3384J4270
58421A082571J4736J4018J2427J1211J0857J0302Q364N456L035J561N9k152m313
58408A168132n373n490n556n848o008o012o188o387o055n178m323l607k446n67
58394A099094J383K589K901K704K363K003J417J11k137m736o829q360r982j1798
58380A070723j2970j2899j2059j1178j0170q411n736k715m2J987L546N019O576
58367A011671P991Q985R628J0162J0593J0880J1281J1959J2498J2481J2264J2432
58355A142825J2604J1817R995Q037O347M437K247O23Kk86p93r96k62J115K611
$$ y = [1020195, 1020168, 1020433, 1020330, 1020036, 1019968, 1019998, 1019671, 1018830, 1017469, 1015162, 1011265, 1005793, 999632, 993874, 989318, 986540, 985804, 986717, 988460, 990684, 993851, 998500, 1004584, 1011842, 1020422, 1030631, 1042301, 1054917, 1068301, 1082571, 1097307, 1111325, 1123752, 1134963, 1145820, 1156122, 1164486, 1169942, 1172977, 1174538, 1174597, 1172445, 1168132, 1162759, 1157269, 1151713, 1145865, 1139857, 1133845, 1127657, 1121270, 1115215, 1110037, 1105714, 1102107, 1099661, 1099094, 1100477, 1103066, 1105967, 1108671, 1111034, 1113037, 1114454, 1114565, 1112428, 1107692, 1100863, 1092503, 1082521, 1070723, 1057753, 1044854, 1032795, 1021617, 1011447, 1003036, 997300, 994585, 994543, 996530, 1000076, 1005095, 1011671, 1019662, 1028647, 1038275, 1048437, 1059030, 1069910, 1081191, 1093150, 1105648, 1118129, 1130393, 1142825, 1155429, 1167246, 1177241, 1185278, 1191625, 1196062, 1198309, 1198932, 1198934, 1198648, 1197855, 1196859, 1196597, 1197712, 1200323]
58340A200323M342O480Q498R885J0954J2210J3452J4256J4816J5449J5867J5702
58328A342234J5292J5115J4844J3762J1857R771Q007O795O449P057Q060Q747R019
58315A477009R246R651J0245J1070J2051J2942J3762J4798J5968J6769J7220J8078
58303A638809J9608K0951K1254K0753K0081J9331J8477J7926J7887J7890J7651
58292A850618J7711J8462J9346J9813K0234K1032K1815K2349K3346K5197K6883
58281B086806K7446K7571K8344K9320K9431K9063K9491L0775L1921L2775L4062
58270B417005L5740L7045L8130M0041M2988M5985M8410N0578N2764N4840N6940
58259B920466N9422O2115O4586O6987O9628P2031P3562P4597P6013P7944Q0176
$$ y = [1200323, 1204665, 1211145, 1219643, 1229528, 1240482, 1252692, 1266144, 1280400, 1295216, 1310665, 1326532, 1342234, 1357526, 1372641, 1387485, 1401247, 1413104, 1422875, 1430882, 1437677, 1444126, 1451183, 1459243, 1467990, 1477009, 1486255, 1495906, 1506151, 1517221, 1529272, 1542214, 1555976, 1570774, 1586742, 1603511, 1620731, 1638809, 1658417, 1679368, 1700622, 1721375, 1741456, 1760787, 1779264, 1797190, 1815077, 1832967, 1850618, 1868329, 1886791, 1906137, 1925950, 1946184, 1967216, 1989031, 2011380, 2034726, 2059923, 2086806, 2114252, 2141823, 2170167, 2199487, 2228918, 2257981, 2287472, 2318247, 2350168, 2382943, 2417005, 2452745, 2489790, 2527920, 2567961, 2610949, 2656934, 2705344, 2755922, 2808686, 2863526, 2920466, 2979888, 3042003, 3106589, 3173576, 3243204, 3315235, 3388797, 3463394, 3539407, 3617351, 3697527]
58248C697527Q3185Q7381R1927R5844R9805J05220J12037J19133J26368J34413
58238D752840J42984J51291J59963J70449J82571J94693K06387K18994K33472
58229F413644K49540K67055K86503L08024L31569L57900L87846M20963M56623
58220I479667M95898N40498N90569O45765P07706P78938Q60299R52133J057517
58211A6108990J181397J327170J497250J696503J932133K211064K540924K932780
58203C1428211L399371L951927M602403N366056O255025P269243Q399066R636443
58195H0307745J0978496J2421847J3959454J5580577J7265631J8976859K0637606
58188A90128215K2069965K2903909K2582107K0588453J6810425J1716828O128351
$$ y = [3697527, 3780712, 3868093, 3960020, 4055864, 4155669, 4260889, 4372926, 4492059, 4618427, 4752840, 4895824, 5047115, 5207078, 5377527, 5560098, 5754791, 5961178, 6180172, 6413644, 6663184, 6930239, 7216742, 7524766, 7856335, 8214235, 8602081, 9023044, 9479667, 9975565, 10516063, 11106632, 11752397, 12460103, 13239041, 14099340, 15051473, 16108990, 17290387, 18617557, 20114807, 21811310, 23743443, 25954507, 28495431, 31428211, 34827582, 38779509, 43381912, 48747968, 55002993, 62272236, 70671302, 80307745, 91286241, 103708088, 117667542, 133248119, 150513750, 169490609, 190128215, 212198180, 235102089, 257684196, 278272649, 295083074, 306799902, 312928253]
58181C12928253P45986m154344q641134j2822313j6622884j9782045k1994282
58174B29657237k3064851k2999582k1996573k0353036j8354116j6215585j4089017
58167I2584477j2083085j0269352q682261p327385o192075n251373m474107l831487
58159C4473352l300897k862836k498914k194299j938576j722908j538919j380859
58151A7035144j245594j129486j027730r37053q56341p84073p17760o56368o00658
58142I080081n50434n03883m60167m20312l84938l53189l24647l00075k79394
58133E503042k60823k42896k25828k10197j95813j82478j70411j59378j48711
58124C706507j38575j29887j22635j15728j08844j02899r8252r3910q9130q4463
$$ y = [312928253, 313674239, 309519895, 300878761, 288056448, 271433564, 251651519, 229657237, 206592386, 183592804, 161596231, 141243195, 122889079, 106673494, 92584477, 80501392, 70232040, 61549779, 54222394, 48030319, 42778946, 38304839, 34473352, 31172455, 28309619, 25810705, 23616406, 21677830, 19954922, 18416003, 17035144, 15789550, 14660064, 13632334, 12695281, 11838940, 11054867, 10337107, 9680739, 9080081, 8529647, 8025764, 7565597, 7145285, 6760347, 6407158, 6082511, 5782436, 5503042, 5242219, 4999323, 4773495, 4563298, 4367485, 4185007, 4014596, 3855218, 3706507, 3567932, 3438045, 3315410, 3199682, 3090838, 2987939, 2889687, 2795777, 2706647, 2622184]
58114B622184q0546p7060p3580p0335o7487o4619o1542n8772n6635n4689n2440
58103A904479m9984m7554m5221m3257m2020m1205l9996l8188l6416l5104l4002
58092A451532l2951l2161l1445l0075k7842k5496k3726k2382k1133k0149j9718
58081A164454j9629j9419j8871j8047j7169j6620j6606j6753j6440j5636j4897
58070I74367j4531j4268j3834j3298j2753j2151j1560j1136j0763j0116r157q251
58058H32549p804q009q798r628r642q529p090o471o937p830q429q400p738o808
58044G20436o243o195o037n290m444m272m758n372n864o049n472m239l556m317
58030F48328n616n921n250m788m753m297l398l046l378l386k891l049m187m769
$$ y = [2622184, 2541638, 2464578, 2390998, 2320663, 2253176, 2188557, 2127015, 2068243, 2011608, 1956919, 1904479, 1854495, 1806941, 1761720, 1718463, 1676443, 1635238, 1595242, 1557054, 1520638, 1485534, 1451532, 1418581, 1386420, 1354975, 1324900, 1297058, 1271562, 1247836, 1225454, 1204321, 1184172, 1164454, 1144825, 1125406, 1106535, 1088488, 1071319, 1054699, 1038093, 1021340, 1004900, 989264, 974367, 959836, 945568, 931734, 918436, 905683, 893532, 881972, 870836, 860073, 849957, 840800, 832549, 824745, 816736, 807938, 798310, 788668, 780139, 773049, 766578, 759641, 751811, 743382, 734982, 727244, 720436, 714193, 707998, 701961, 696671, 692227, 687955, 683197, 677825, 671961, 665912, 660440, 656201, 652645, 648328, 642712, 636791, 631541, 626753, 622000, 617703, 614305, 611259, 607881, 604495, 601604, 598555, 594368, 589599]
58016E89599l612j828j275k039k713k531j949j440r34m17k35m66n98q5R10J524
58000E71911J093J9n02N7Q07O36k73r31j242k035l415m294l949l064k687k971
57984E49160l473l956m353m523m512m560m485l755k496j718k010k696k907k802
57970E00914l028l443l284k349j272o46m40l19j66r7k00l50l92m67r22j681k083
57953D79775j735j246j477k345l093l544m135m764m645l575k407j908j939k104
57939D40858k358k545k099p83Q09J957K505K627K462K253K245K204J730J118J133
57924D54116J652J563L77j035j744j880j920j853j768k245l320l962l495k735
57910D31751k729l160l038k376j985k075k184k170k294k477k396k140k022k041
$$ y = [589599, 585987, 584159, 582884, 580845, 578132, 575601, 573652, 572212, 571278, 570861, 570626, 570160, 569562, 569477, 570387, 571911, 573004, 573023, 572521, 572578, 573385, 574021, 573748, 572817, 571575, 569540, 566125, 561831, 557882, 554818, 552131, 549160, 545687, 541731, 537378, 532855, 528343, 523783, 519298, 515543, 513047, 511329, 509319, 506623, 503716, 500914, 497886, 494443, 491159, 488810, 487538, 486892, 486452, 486133, 485967, 485870, 485670, 485320, 484928, 484461, 483539, 481858, 479775, 478040, 476794, 475317, 472972, 469879, 466335, 462200, 457436, 452791, 449216, 446809, 444901, 442962, 440858, 438500, 435955, 433856, 433073, 433882, 435839, 438344, 440971, 443433, 445686, 447931, 450135, 451865, 452983, 454116, 455768, 457331, 457708, 456673, 454929, 453049, 451129, 449276, 447508, 445263, 441943, 437981, 434486, 431751, 429022, 425862, 422824, 420448, 418463, 416388, 414204, 412034, 409740, 407263, 404867, 402727, 400705, 398664]
57896C98664k185k809l929m561l864k502j807j895j710q29P6N41R07J357J432
57881C76886R40M27L06K65r1o25j118j687k334k613k246j736j889k851l917m286
57865C53431l799k999k533k515k543k313j947j639j321q99n08j75M28J518K720
57850C34906L504L779L775L611L388L374L561L452K814K268K439K899K760J994
57836C78524J313Q79J59r19j695j910k238l193m233m417l610k625k363l028l943
57821C46701m099l160j926j494j911k161j406J24J578K301K117J146k99j883l395
57806C32233m666n481n801n924o099o138n769n178m778m601m393m153m080m073
57792B61099l878l599l547l603l311k628j951j461r91n58l86l71r3N04R69J054
$$ y = [398664, 396479, 393670, 389741, 385180, 381316, 378814, 377007, 375112, 373402, 372573, 372649, 373190, 374097, 375454, 376886, 377826, 378253, 378559, 378824, 378733, 378108, 376990, 375303, 372969, 370356, 368110, 366374, 364485, 361634, 357717, 353431, 349632, 346633, 344100, 341585, 339042, 336729, 334782, 333143, 331822, 330923, 330415, 330240, 330668, 332186, 334906, 338410, 342189, 345964, 349575, 352963, 356337, 359898, 363350, 366164, 368432, 370871, 373770, 376530, 378524, 379837, 380716, 380875, 379956, 378261, 376351, 374113, 370920, 366687, 362270, 358660, 356035, 353672, 350644, 346701, 342602, 339442, 337516, 336022, 334111, 331950, 330544, 330668, 332246, 334547, 336664, 337810, 337511, 335628, 332233, 327567, 322086, 316285, 310361, 304262, 298124, 292355, 287177, 282399, 277798, 273405, 269252, 265172, 261099, 257221, 253622, 250075, 246472, 243161, 240533, 238582, 237121, 236130, 235572, 235186, 234815, 234722, 235226, 236195, 237249]
57776B37249R32P25L54M6L67J511K953M018M374M019L291K907L336M016L811K458
57760B76367Q40k19q08j234j346j041q08j151j842k262k205j908j610j451j519
57745B57803j681j580j167r29j313k059k395j787m11Q93J173J99j212k009j959
57730B41566j519r11p1N67K63q13j465j040k88j05k69j08K69K72j29n31r07j431
57712B33350j811j605j068r14j271j603j624j643j912k237k382k368k293k135
57698B08484j835j286l48P73J367R52N9k54K82Q75P97L05K13R07K033K966L407
57681B19697L658M363N921Q063J0205J2130J4147J6646J9670K2953K6180K9256
57669C92889L2356L5516L7926L7946L4223K6862J7285P071k736j1507j8861k4870
$$ y = [237249, 238181, 238906, 239260, 239306, 239673, 241184, 244137, 248155, 252529, 256548, 259839, 262746, 266082, 270098, 273909, 276367, 277207, 276988, 276180, 274946, 273600, 272559, 271751, 270600, 268758, 266496, 264291, 262383, 260773, 259322, 257803, 256122, 254542, 253375, 252446, 251133, 249074, 246679, 244892, 244481, 245374, 246547, 246746, 245534, 243525, 241566, 240047, 239136, 239065, 239632, 239895, 239082, 237617, 236577, 236289, 236184, 235915, 235807, 236076, 236348, 236219, 235688, 234781, 233350, 231539, 229934, 228866, 227952, 226681, 225078, 223454, 221811, 219899, 217662, 215280, 212912, 210619, 208484, 206649, 205363, 205015, 205788, 207155, 208107, 208166, 207912, 208194, 209069, 209866, 210171, 210384, 211291, 213324, 216290, 219697, 223355, 227718, 233639, 241702, 251907, 264037, 278184, 294830, 314500, 337453, 363633, 392889, 425245, 460761, 498687, 536633, 570856, 597718, 615003, 622074, 619338, 607831, 588970, 564100]
57657E64100k9890l3917l6324l6502l4586l1356k7525k3396j9197j5430j2635
57646B63342j0831r432p879o170m665l491k541j918j864k140k015j170j76K41
57632B09291R5j39k77m35n27m10l63q01j521j818j446q90n98n07n46j034k138
57615A95936l234l376k321q33L1j78j042j685j537q06j91j06l39m97n82q12j094
57598A77334r64j99P06R17J20j182k231k751k952k988k788k398k121k091k038
57583A54374j738j461j581j918j922j480j097j161j430j446j178r70j030j247
57569A34715j441j585j704j720j479r42l23N1K2k49m66m51k26Q9L65N21N76N82
57551A26335M38n9q36j369j141k50O51J069J086J067J140J105P62K06j56Q2R33
$$ y = [564100, 534210, 500293, 463969, 427467, 392881, 361525, 334000, 310604, 291407, 275977, 263342, 252511, 243079, 235200, 229030, 224365, 220874, 218333, 216415, 214551, 212411, 210396, 209226, 209050, 209291, 209386, 209247, 208970, 208535, 208008, 207598, 207235, 206434, 204913, 203095, 201649, 200759, 200161, 199654, 199108, 198074, 195936, 192702, 189326, 187005, 186172, 186203, 186025, 184983, 183298, 181761, 180955, 180764, 180658, 180319, 179822, 179240, 178428, 177334, 176370, 176171, 176877, 177794, 177914, 176732, 174501, 171750, 168798, 165810, 163022, 160624, 158503, 156412, 154374, 152636, 151175, 149594, 147676, 145754, 144274, 143177, 142016, 140586, 139140, 137962, 136992, 135962, 134715, 133274, 131689, 129985, 128265, 126786, 125844, 125521, 125572, 125594, 125345, 124879, 124428, 124202, 124291, 124656, 125177, 125753, 126335, 126773, 126714, 125878, 124509, 123368, 123118, 123769, 124838, 125924, 126991, 128131, 129236, 129998, 130204, 130048, 130130, 131063]
57534A31063J884K246J719O16l93p67l70N21J405J802J482N45n34j106p39L84
57518A39758J549K064J766J015L50Q8J20J5m30q09n34L12R32Q13L23N4m5l38o97
57499A46306o67l33k97p64j270j523j819k381k802k614j980j395j003p13p16j225
57483A24804j867j949j413j029j372k042k222j679r15m27k33j21o6k11m78m85
57467A08295%N55L78p44j964k174j221J9P39R28R16P18K49k08k55L4K60L09M17
57448A07251O14O34L61j2l48o94r46q93o63n89n65j08O88J029O20K45N48R14M55
57429A08541m76q03m37k86o19o01K24J123J244O98O6m47p64n36L69J349J655J208
57411A11508M19m23j159j524j400j017n36J97J061J377P64j36l89J6L89M43M99
$$ y = [131063, 132947, 135193, 136912, 137528, 137135, 136368, 135998, 136519, 137924, 139726, 141208, 141753, 141219, 140113, 139374, 139758, 141307, 143371, 145137, 146152, 146502, 146590, 146710, 146725, 146295, 145486, 144952, 145264, 146196, 147009, 147332, 147386, 147341, 147003, 146306, 145639, 145306, 145009, 144245, 142975, 141452, 139633, 137252, 134450, 131836, 129856, 128461, 127458, 126745, 126029, 124804, 122937, 120988, 119575, 118546, 117174, 115132, 112910, 111231, 110316, 109889, 109656, 109535, 109469, 109258, 108780, 108295, 108295, 108850, 109228, 108484, 106520, 104346, 103125, 103144, 103883, 104811, 105727, 106445, 106694, 106486, 106231, 106265, 106525, 106834, 107251, 107865, 108499, 108860, 108848, 108500, 107806, 106860, 105967, 105304, 104715, 104150, 104042, 104730, 105759, 106379, 106624, 107172, 108086, 108541, 108065, 107262, 106825, 106539, 105920, 105319, 105543, 106666, 107910, 108608, 108674, 108227, 107463, 106927, 107296, 108645, 110300, 111508, 111927, 111504, 110345, 108821, 107421, 106404, 105868, 106065, 107126, 108503, 109267, 109131, 108742, 108758, 109147, 109590, 110089]
57394A10089O93P21M19J6k28k65j39n4l57j012j295o55L23N76R4K0R97K277K715
57375A14935K133J242P07O71Q46P78K61l52m82j12J58n0l95l48J39P19J083J059
57357A22992O85L28M11Q02Q97M82Q2J47L81L23J58L39P32P49K62k14k83j35j58
57338A28980m59q91j235j266r07m06j39j73k49k50m20r65j689k146k111j670j041
57321A12963m79j98k24l10j96N0J27j12n31r90j446j681j268k28N81K43r86j809
57303A03506j495q43j095k215k861k034j99J373J917J618J010L71k45p48r72r40
57287I6148r46j170j346j072m52l8oJ53Q64J727J998J579J095J208K208M022O008
57270A11980O995O330M897M298M857N279M605L563L313L599L194J799M28k11o17
$$ y = [110089, 110782, 111503, 111922, 111938, 111710, 111445, 111306, 111252, 110895, 109883, 108588, 107933, 108256, 108832, 108926, 108946, 109943, 112220, 114935, 117068, 118310, 119017, 119688, 120534, 121312, 121573, 121221, 120739, 120627, 120785, 120735, 120340, 119992, 120131, 120850, 121933, 122992, 123677, 124005, 124416, 125218, 126115, 126597, 126679, 126826, 127207, 127530, 127688, 128027, 128759, 129508, 129770, 129556, 129273, 129138, 128980, 128521, 127630, 126395, 125129, 124222, 123816, 123677, 123504, 123255, 123005, 122585, 121620, 119931, 117785, 115674, 114004, 112963, 112484, 112286, 112062, 111752, 111556, 111606, 111733, 111621, 111090, 110100, 108654, 106973, 105705, 105477, 106058, 106301, 105315, 103506, 102011, 101168, 100073, 97858, 94997, 92963, 92764, 94137, 96054, 97672, 98682, 99053, 98808, 98060, 97088, 96148, 95202, 94032, 92686, 91614, 91162, 91124, 91118, 91271, 92135, 93862, 95860, 97439, 98534, 99742, 101950, 105972, 111980, 118975, 125305, 130202, 134500, 139357, 144636, 149241, 152804, 156117, 159716, 162910, 164709, 165137, 164926, 164309]
57255A64309j380k011j641n01K27%m22k05L57M10o2k02L94J075J113O97N23P97
57237A63478J136J261J259J275J305J283J173J020J062J587K410K896K748K430
57223A86323K366K166J281Q5m85j91L78Q63J500K428L430M499N845P223Q019Q238
57207B33968Q506Q967Q992Q382P869P938Q103Q004Q302R597J1152J1833J1834
57194C53447J2341J3754J5289J6308J7106J8154J9324K0150K0362J9971J9171
57183E45377J8329J7792J7671J7878J8276J8617J8694J8782J9540K0975K2052
57172G53983K1839K0699J9661J9083J8691J8617J9223J9978J9648J7963J6160
57161I65545J5481J5852J6533J7414J8973K1368K4162K6797K8975L0613L1760
$$ y = [164309, 162929, 160918, 159277, 158776, 159003, 159003, 158581, 158376, 158733, 159143, 159081, 158879, 159273, 160348, 161461, 162158, 162681, 163478, 164614, 165875, 167134, 168409, 169714, 170997, 172170, 173190, 174252, 175839, 178249, 181145, 183893, 186323, 188689, 190855, 192136, 192221, 191736, 191545, 191923, 192786, 194286, 196714, 200144, 204643, 210488, 217711, 225730, 233968, 242474, 251441, 260433, 268815, 276684, 284622, 292725, 300729, 309031, 318628, 329780, 341613, 353447, 365788, 379542, 394831, 411139, 428245, 446399, 465723, 485873, 506235, 526206, 545377, 563706, 581498, 599169, 617047, 635323, 653940, 672634, 691416, 710956, 731931, 753983, 775822, 796521, 816182, 835265, 853956, 872573, 891796, 911774, 931422, 949385, 965545, 981026, 996878, 1013411, 1030825, 1049798, 1071166, 1095328, 1122125, 1151100, 1181713, 1213473]
57150A213473L2468L2664L2292L1612L1100L0937L0858L0662L0619L1267L2929
57139A560881L5475L8290M0556M1811M2355M2856M3663M4794M6404M8589N0668
57128B036342N1348N0102M8068M7226M8744N2211N6235N9734O2919O7173P3756
57117B653858Q2612R2676J03180J14102J25383J36513J47329J58612J71416J86158
57107C971839K02835K21832K44072K70657L02866L42317L90665M49170N18900
57098F915153O01317O98232Q10903R38889J079349J227308J377079J523884J664005
57089A6836119J793375J906658J998423K065329K107059K125610K123937K104059
57081C3060569K064205J996376J887447J725029J504888J234164R27162N96500
$$ y = [1213473, 1245941, 1278605, 1310897, 1342509, 1373609, 1404546, 1435404, 1466066, 1496685, 1527952, 1560881, 1596356, 1634646, 1675202, 1717013, 1759368, 1802224, 1845887, 1890681, 1937085, 1985674, 2036342, 2087690, 2137792, 2185860, 2233086, 2281830, 2334041, 2390276, 2450010, 2512929, 2580102, 2653858, 2736470, 2829146, 2932326, 3046428, 3171811, 3308324, 3455653, 3614265, 3785681, 3971839, 4174674, 4396506, 4640578, 4911235, 5214101, 5556418, 5947083, 6396253, 6915153, 7516470, 8214702, 9025605, 9964494, 11043843, 12271151, 13648230, 15172114, 16836119, 18629494, 20536152, 22534575, 24599904, 26706963, 28832573, 30956510, 33060569, 35124774, 37121150, 39008597, 40733626, 42238514, 43472678, 44399840, 44996340]
57073D4996340K46758j24172n17772r28432j342223j739369k097026k391940k604444
57064C3497720k722981k746468k683640k550666k368034k156631j934159j713725
57056A4621416j504589j312907j141644r90989q59992p47810o53331n74427n08422
57047F327305m53186m07299l69368l37785l11172k88607k69210k51762k35057
57038C403859k18632k02962j88619j75224j61415j46160j29790j13397r7467q1647
57028A888546o5650m9739l4422k0709j0882p876j2871k3792l6689m8321n7218
57017A520377o3272o7403p1052p4818p7500p7268p3717o7930o0898n3008m5088
57006G88423l8555l3933l0230k6450k2865k0177j8259j6574j5198j4497j4148
$$ y = [44996340, 45243098, 45118926, 44601154, 43672722, 42330499, 40591130, 38494104, 36102164, 33497720, 30774739, 28028271, 25344631, 22793965, 20425931, 18269300, 16335141, 14621416, 13116827, 11803920, 10662276, 9671287, 8811295, 8063485, 7410154, 6835727, 6327305, 5874119, 5466820, 5097452, 4759667, 4448495, 4159888, 3890678, 3638916, 3403859, 3185227, 2982265, 2793646, 2618422, 2457007, 2310847, 2181057, 2067660, 1970193, 1888546, 1822896, 1773157, 1738735, 1718026, 1707144, 1699268, 1686397, 1662605, 1625916, 1577595, 1520377, 1457105, 1389702, 1318650, 1243832, 1166332, 1089064, 1015347, 947417, 886519, 833511, 788423, 749868, 715935, 685705, 659255, 636390, 616213, 597954, 581380, 566182, 551685, 537537]
56995E37537j3474j2491j1706j1008r738p889o283n366m588l360j908q01j79M1
56981D48787l25j525l340n270p033q571r760j0472j0822j1049j1133j0879j0149
56968C48459q829o687l736o72J505K461K879L702N310P520R875J1614J1706R598
56954C94705O025K530m5k214m838p845j0398j1972j2630j2368j0971q718o583
56941C14678n237m214k502K68L583O723R241J0991J2180J3334J4649J5402J4480
56928D03576J1583P527L305o83m430p885j0994j3764j6036j7467j7972j7834j7170
56915C01756j5701j3419j1089r580q844q055o751n368m540m217l737k623j163
56902B06669j33L3k34r8P77J954K895L602M390N271N999O556P245Q236R351J0423
$$ y = [537537, 524063, 511572, 499866, 488858, 479120, 471231, 464948, 459582, 454994, 451634, 449726, 448925, 448746, 448787, 448462, 446937, 443597, 438327, 431294, 422723, 412963, 402491, 391669, 380620, 369487, 358608, 348459, 339630, 332943, 329207, 328535, 330040, 332501, 335380, 339082, 344392, 351912, 361787, 373401, 385107, 394705, 400730, 403260, 403215, 401001, 396163, 388318, 377920, 365948, 353318, 340950, 329979, 321261, 314678, 309441, 305227, 302725, 302993, 306576, 313299, 322540, 333531, 345711, 359045, 373694, 389096, 403576, 415159, 422686, 425991, 425308, 420878, 412993, 401999, 388235, 372199, 354732, 336760, 318926, 301756, 286055, 272636, 261547, 251967, 243123, 235068, 228317, 222949, 218409, 214192, 210455, 207832, 206669, 206536, 206569, 206335, 206237, 207014, 208968, 211863, 215465, 219855, 225126, 231125, 237681, 244926, 253162, 262513, 272936]
56886B72936J1469J2329J2342J0785P685L918M48k355m509n874o215n781n258
56873C01920m913m070j923J349M701P443R875J2680J6085J9790K3385K6586K9201
56860D42109L1026L1614L0174K6061J9620J2290N548j59n269j0075j4129j6671
56848E52139j7381j6532j4509j1375p036j679M208J0304J6596K2943K8821L3873
56836F00372L8366M2642M6252M8005M6695M1487L2096J9460N995n818j5364k3694
56824H76494l1386l7572m1245m2500m1828l9085l4019k7221j9823j2557n586J060
56812E44732P498J3932K0146K5441K9451L2305L3420L1065K4200J4232L918n232
56800G75108j3431k0982k7424l2349l5880l8046l8483l7013l3799k9004k2975
$$ y = [272936, 284405, 296734, 309076, 319861, 327546, 331464, 331912, 329557, 325048, 319174, 312959, 307178, 301920, 297007, 292937, 291014, 292363, 297064, 304507, 314382, 327062, 343147, 362937, 386322, 412908, 442109, 473135, 504749, 534923, 560984, 580604, 592894, 598442, 598283, 593014, 582939, 568810, 552139, 534758, 518226, 503717, 492342, 485306, 483627, 487835, 498139, 514735, 537678, 566499, 600372, 638738, 681380, 727632, 775637, 822332, 863819, 895915, 915375, 921370, 915552, 900188, 876494, 845108, 807536, 766291, 723791, 681963, 642878, 608859, 581638, 561815, 549258, 543672, 544732, 552230, 566162, 586308, 611749, 641200, 673505, 706925, 737990, 762190, 776422, 780340, 775108, 761677, 740695, 713271, 680922, 645042, 606996, 568513, 531500, 497701, 468697, 445722]
56789D45722j6814j1798p945l977R56O166J0359J2991J4316J4597J3757J1483
56777D89813P475J922m174r557j3779j7356k0800k3915k6095k6839k5959k3750
56765C06986k1063j8698j6722j4786j2965j1612j0474q907p031n745n330m957
56753A68696m060l209l044l093k524j541j128j666k491k849k708k588k858l214
56739A31723k913j659k01L90j8n73p09o77p27n77j01J87p5m87n71m93n09l29K83
56720A21964Q40Q10N54P35J189J202O77K18J21J38K21O46J295J508R81K32q7K0
56702A33264J40J57L49Q65J426J650J490J186Q05J09q76j535j279l36N35J010
56686A38960J240J124L68o62j046n90j00j4K58J036J450P20m27p32k08J57J10
$$ y = [445722, 428908, 417110, 409165, 405188, 406144, 412310, 422669, 435660, 449976, 464573, 478330, 489813, 497288, 499210, 495036, 485479, 471700, 454344, 433544, 409629, 383534, 356695, 330736, 306986, 285923, 267225, 250503, 235717, 222752, 211140, 200666, 191759, 184728, 178983, 173653, 168696, 164636, 161427, 158383, 155290, 152766, 151225, 150097, 148431, 145940, 143091, 140383, 137795, 134937, 131723, 128810, 127151, 126950, 127340, 127322, 126749, 126040, 125363, 124636, 124059, 123958, 124145, 124070, 123583, 123012, 122519, 122010, 121681, 121964, 122804, 123614, 124168, 124903, 126092, 127294, 127971, 128189, 128310, 128448, 128669, 129315, 130610, 132118, 133099, 133331, 133244, 133264, 133404, 133561, 133910, 134775, 136201, 137851, 139341, 140527, 141332, 141441, 140565, 139030, 137751, 137415, 137950, 138960, 140200, 141324, 141692, 141030, 139984, 139394, 139294, 139280, 139538, 140574, 142024, 142744, 142317, 141585, 141377, 141534, 141644]
56669A41644L22R55J266P99J24K1N67J202J242M03q16j355p27K97O97N75P77J405
56651A49398J676J169L26l78q89j062n92L05R26J029J018J029O74m4m08p7L49
56634A54449L68L91R14J483J319N66N2N7O8k79p09q66q34q29p70m18J55N22L72
56615A56011m4j57K06N69M22o1k97j80j95o68j235j278o48K63Q72Q49L85Q6L21
56596A55221O87M85k49o48j33Q45J415J287Q45M93L42L35L61K82O7r3P6O25J315
56577A63558J787J807J441J058J053J472J942J988J480P46L24M93J131J996L010
56562A85286M031M520M026L046K745L479M158L673K346J359J137J197J295J677
56548B23975K175K033J020k4j83N17J310J480Q07l85j334j460j040q58j169j468
$$ y = [141644, 141966, 142921, 144187, 144986, 145110, 145131, 145698, 146900, 148142, 148545, 147729, 146374, 145647, 145944, 146641, 147216, 147993, 149398, 151074, 152243, 152569, 152191, 151302, 150240, 149648, 149953, 150879, 151908, 152926, 153955, 154629, 154585, 154177, 154100, 154449, 154817, 155208, 156122, 157605, 158924, 159490, 159542, 159599, 159667, 159388, 158679, 157813, 156979, 156150, 155380, 154962, 155117, 155639, 156011, 155967, 155810, 156016, 156585, 157007, 156946, 156649, 156469, 156274, 155606, 154371, 153093, 152445, 152708, 153580, 154429, 154814, 154900, 155221, 155908, 156393, 156144, 155496, 155363, 156208, 157623, 158910, 159755, 160248, 160590, 160925, 161286, 161568, 161635, 161542, 161618, 162243, 163558, 165345, 167152, 168593, 169651, 170704, 172176, 174118, 176106, 177586, 178332, 178656, 179149, 180280, 182276, 185286, 189317, 193837, 197863, 200909, 203654, 207133, 211291, 214964, 217310, 218669, 219806, 221003, 222298, 223975, 226150, 228183, 229203, 229179, 228996, 229513, 230823, 232303, 233110, 232725, 231391, 229931, 228891, 228033, 226864, 225396]
56532B25396j361j053p73m05N2K36n2n76j212k161l251l731l297k690k619k616
56516A99887j808m22L99J86l45m32j52Q9K65N13O25L11k50n43l95k06l38n98n25
56497A96261m6L56J81n62j408j758j262j35P95Q33K93J79P95J222O16n27j104
56480A94729q85n16l59k01L6J90M47J147J942K079J521R58O31J20n56p16k30J55
56462B00492J19L19J104J705J458Q46N30K69k91o33k60K19ln27m68K8J39j12o0
56443B04874K11M8l29J0R94J408P82J33L20Q25P93L29K5n0r8P0O90J405J621J238
56423B15299N99nl73l14R1M34N42P53J236J496J037J46m76o06m42K6Q72J640J587
56404B23542O62l69q49p77m05J04M71L19k23m64o2M99P30R02J445J998J863J213
$$ y = [225396, 224035, 222982, 222209, 221804, 221856, 222092, 222040, 221464, 220252, 218091, 214840, 211109, 207812, 205122, 202503, 199887, 198079, 197657, 198056, 198242, 197897, 197465, 197313, 197402, 197667, 198180, 198805, 199116, 198866, 198323, 197928, 197722, 197384, 196786, 196261, 196215, 196571, 196752, 196190, 194782, 193024, 191762, 191627, 192422, 193255, 193548, 193727, 194522, 195744, 196360, 195833, 194729, 193844, 193328, 192969, 192768, 192804, 192994, 193441, 194588, 196530, 198609, 200130, 201088, 201719, 201839, 201283, 200567, 200337, 200492, 200611, 200930, 202034, 203739, 205197, 206043, 206573, 206842, 206551, 205918, 205658, 205877, 205874, 205347, 204879, 204907, 205046, 204934, 204874, 205085, 205133, 204804, 204814, 205808, 207216, 207998, 208131, 208451, 209276, 210069, 210398, 210423, 210373, 210275, 210345, 211035, 212440, 214061, 215299, 215898, 215893, 215520, 215206, 215297, 215731, 216273, 217026, 218262, 219758, 220795, 220941, 220465, 219859, 219417, 219443, 220315, 221955, 223542, 224204, 223835, 222986, 222209, 221804, 221908, 222379, 222698, 222475, 222011, 221949, 222448, 223178, 224080, 225525, 227523, 229386, 230599]
56386B30599R32J280J558J263P67N19L58J22K09R03J680J926J878K069K241J765
56370B50069Q46L91O90J148J365J551J740J475O06l22q07q67o06L8P77R69N00
56353B59563j7j80k46k49L32J443J972J255L32O14J809K376J721P84M59N32M75
56336B72975L38M38P96J237J675J963J874J453J108J069J017N72o9k23M57J478
56320B88158J979J703J252J200J289R30L22L08J066J704J561J168J328J832J849
56305C07649J265P82Q00R88J044J207J734K349K531K220J969K323L108L468K785
56290C36222J460N01M15Q97J553K351L206L822M134M431M737M685M263M058M334
56275C81069M605M480M326M574N078N700O700P919Q452P934P355P630Q168P985
$$ y = [230599, 231531, 232811, 234369, 235632, 236399, 236918, 237276, 237398, 237607, 238510, 240190, 242116, 243994, 246063, 248304, 250069, 250915, 251306, 251996, 253144, 254509, 256060, 257800, 259275, 259881, 259559, 258752, 257885, 257279, 257317, 258094, 259063, 259563, 259546, 259366, 259120, 258871, 259203, 260646, 262618, 263873, 264205, 264819, 266628, 269004, 270725, 271509, 271968, 272500, 272975, 273313, 273751, 274547, 275784, 277459, 279422, 281296, 282749, 283857, 284926, 285943, 286515, 286446, 286223, 286680, 288158, 290137, 291840, 293092, 294292, 295581, 296511, 296833, 297141, 298207, 299911, 301472, 302640, 303968, 305800, 307649, 308914, 309696, 310496, 311484, 312528, 313735, 315469, 317818, 320349, 322569, 324538, 326861, 329969, 333437, 336222, 337682, 338183, 338598, 339495, 341048, 343399, 346605, 350427, 354561, 358992, 363729, 368414, 372677, 376735, 381069, 385674, 390154, 394480, 399054, 404132, 409832, 416532, 424451, 432903, 440837, 448192, 455822, 463990, 471975]
56261D71975P493P819Q828R332R023Q799R269J0187J1477J3468J6015J8536K1051
56248F23272K4082K7370K9894L1462L3062L5341L7768L9683M1051M1781M1381
56237A006147L9879L8124L6516L4315L0740K5978K0484J4147O906m49o939j2455
56225A233393j7553k2521k7160l1160l4202l6043l6829l7048l6914l6198l4867
56214H82898l3326l1813l0072k8025k6126k4666k3232k1335j9068j6753j4446
56203F14036j2269j0686r848r129p857o262n058m396l798l035k437k296k337j967
56189E32661r07M79J447J558J045M14j33o62r91p48O6R44J401J378J107R00R84
56172E40943J255J306J087J208K097L143L401K927K641K989L646M308M844M728
$$ y = [471975, 479468, 487287, 496115, 505447, 514470, 523269, 532538, 542725, 554202, 567670, 583685, 602221, 623272, 647354, 674724, 704618, 736080, 769142, 804483, 842251, 881934, 922985, 964766, 1006147, 1046026, 1084150, 1120666, 1154981, 1185721, 1211699, 1232183, 1246330, 1253236, 1252787, 1245848, 1233393, 1215840, 1193319, 1166159, 1134999, 1100797, 1064754, 1027925, 990877, 953963, 917765, 882898, 849572, 817759, 787687, 759662, 733536, 708870, 685638, 664303, 645235, 628482, 614036, 601767, 591081, 581233, 572104, 564247, 557985, 552927, 548531, 544733, 541698, 539261, 536965, 534628, 532661, 531754, 532233, 533680, 535238, 536283, 536697, 536564, 535902, 534911, 534163, 534229, 535173, 536574, 537952, 539059, 539959, 540943, 542198, 543504, 544591, 545799, 547896, 551039, 554440, 557367, 560008, 562997, 566643, 570951, 575795, 580523]
56158E80523L545K182K349M402O748P807P711P525P772Q343R086R778J0122J0223
56144F78116J0509J0896J0899J0899J2149J4989J8111K0443K2824K6772L2443
56133H69050L8834M5365N2022N8355O3542O7288O9779P0833O9952O7185O3196
56122A535401N8567N3611M8675M3891L8691L2255K4578J6657R554L652j322n876
56110A858334j0382j4817j8987k3131k8037l4142m0716m6296m9849n1417n1795
56099A488765n1779n1527n0458m7961m4132l9625l4839k9695k4226j8848j4029
56088A081646j0053p108n081l310j199R71K485L388M404N675O548O771O980P718
56074A099835Q847J0134J1539J2672J2928J2470J2233J2682J3458J4404J5812
$$ y = [580523, 584068, 586250, 588599, 593001, 599749, 607556, 615267, 622792, 630564, 638907, 647993, 657771, 667893, 678116, 688625, 699521, 710420, 721319, 733468, 748457, 766568, 787011, 809835, 836607, 869050, 907884, 953249, 1005271, 1063626, 1127168, 1194456, 1264235, 1335068, 1405020, 1472205, 1535401, 1593968, 1647579, 1696254, 1740145, 1778836, 1811091, 1835669, 1852326, 1861880, 1865532, 1864210, 1858334, 1847952, 1833135, 1814148, 1791017, 1762980, 1728838, 1688122, 1641826, 1591977, 1540560, 1488765, 1436986, 1385459, 1335001, 1287040, 1242908, 1203283, 1168444, 1138749, 1114523, 1095675, 1081646, 1071593, 1064485, 1059404, 1056094, 1054895, 1055866, 1058351, 1061739, 1066143, 1071818, 1078366, 1085137, 1092117, 1099835, 1108682, 1118816, 1130355, 1143027, 1155955, 1168425, 1180658, 1193340, 1206798, 1221202, 1237014]
56063A237014J7394J8197J8028J7833J8241J8750J8900J9060J9553K0015K0191
56052A443176K0318K0330J9851J9296J9651K0774K1415K1355K1876K3432K4710
56041A676184K4905K5127K6391K7933K8854K9792L1527L3410L4651L5775L7324
56030B011873L8524L8749L8957M0086M1476M2450M4027M7160N0624N2684N3812
56019B500422N5794N8996O2353O5273O7848P0009P2015P4935P9162Q3543Q7240
56008C277590R1099R5709R9908J03005J06697J12623J19668J26021J32222J39704
55998D404246J47927J55642J63625J73370J84319J95160K06522K19712K34065
55989F084588K48528K64438K83688L05560L28491L53534L82694M15346M49922
$$ y = [1237014, 1254408, 1272605, 1290633, 1308466, 1326707, 1345457, 1364357, 1383417, 1402970, 1422985, 1443176, 1463494, 1483824, 1503675, 1522971, 1542622, 1563396, 1584811, 1606166, 1628042, 1651474, 1676184, 1701089, 1726216, 1752607, 1780540, 1809394, 1839186, 1870713, 1904123, 1938774, 1974549, 2011873, 2050397, 2089146, 2128103, 2168189, 2209665, 2252115, 2296142, 2343302, 2393926, 2446610, 2500422, 2556216, 2615212, 2677565, 2742838, 2810686, 2880695, 2952710, 3027645, 3106807, 3190350, 3277590, 3368689, 3464398, 3564306, 3667311, 3774008, 3886631, 4006299, 4132320, 4264542, 4404246, 4552173, 4707815, 4871440, 5044810, 5229129, 5424289, 5630811, 5850523, 6084588, 6333116, 6597554, 6881242, 7186802, 7515293, 7868827, 8251521, 8666867, 9116789]
55980I116789M87767N31521N80990O34673O94150P62999Q42508R32735J036630
55971A5620762J158908J302166J468568J664031J896300K170928K494410K879365
55963C0655438L341209L891955M543001N309827O204492P224612Q358126R597496
55955G9126156J0941076J2383432J3914689J5526990J7210414J8941040K0663510
55948A88707307K2232221K3303012K3296873K1599490J7949087J2695126O654159
55941C16437275O61792m800363r644709j3958710j7765326k0917314k3142565
55934B26870080k4189095k3981670k2686918k0644891j8232255j5758250j3430115
55927H7946886j1359300r581060q083024o834397n800892m946991m239333l652294
$$ y = [9116789, 9604556, 10136077, 10717067, 11351740, 12045890, 12808889, 13651397, 14584132, 15620762, 16779670, 18081836, 19550404, 21214435, 23110735, 25281663, 27776073, 30655438, 33996647, 37888602, 42431603, 47741430, 53945922, 61170534, 69528660, 79126156, 90067232, 102450664, 116365353, 131892343, 149102757, 168043797, 188707307, 210939528, 234242540, 257539413, 279138903, 297087990, 309783116, 316437275, 317099067, 312298704, 302653995, 288695285, 270929959, 250012645, 226870080, 202680985, 178699315, 156012397, 135367506, 117135251, 101377001, 87946886, 76587586, 67006526, 58923502, 52089105, 46288213, 41341222, 37101889, 33449595]
55919C3449595l166570k763302k424391k137278j894191j687114j507855j351906
55911A6516988j217477j100949r97314r04368q22427p50283o85188o26400n74899
55902H837683n29760m88175m49027m13215l80632l49956l21267k95840k73413
55893E336398k52437k32905k16126k01680j87475j73034j59962j48934j38770
55884C625075j28907j20333j13476j07352j01449r6597r3269r0591q7612q4257
55874B601232q0831p7724p5639p4765p3900p1658o8352o5297o2662n9643n6387
55863A834374n3918n2178m9925m6708m3374m0548l8118l6230l5241l4601l3318
55852A370215l1550l0320k9605k8337k6438k5176k5176k5520k5310k4781k4392
$$ y = [33449595, 30283025, 27519723, 25095332, 22958054, 21063863, 19376749, 17868894, 16516988, 15299511, 14198562, 13201248, 12296880, 11474453, 10724170, 10038982, 9412582, 8837683, 8307923, 7819748, 7370721, 6957506, 6576874, 6226918, 5905651, 5609811, 5336398, 5083961, 4851056, 4634930, 4433250, 4245775, 4072741, 3912779, 3763845, 3625075, 3496168, 3375835, 3262359, 3155007, 3053558, 2956961, 2863692, 2773101, 2685489, 2601232, 2520401, 2442677, 2367038, 2292273, 2218373, 2146715, 2078363, 2013066, 1950404, 1890761, 1834374, 1780456, 1728278, 1678353, 1631645, 1588271, 1547723, 1509605, 1473375, 1438134, 1403533, 1370215, 1338665, 1308345, 1278740, 1250403, 1223965, 1198789, 1173613, 1148093, 1122783, 1098002, 1073610]
55841A073610k4036k3526k2856k1753k0000j8320j7692j7729j6994j5154j3493
55830H62057j2910j2746j2110j1104j0202r426q758q533q798r062r077r167r543
55817G30621r990j0472j1181j1742j1343r945q498p625o911n908m867l977k774
55804F25388r75Q15J873K303K685L187L618L931M191M279M005L316K192N88j338
55789F60058l152m522n465o207o927p610q037q062q025q593r840j0984j1410j1484
55775E49740j1746j1837j1107r820q774p890o291l837j559l67j37k41l19k74j62
55760D75379k53p59j450j947k266k550k576k209k098l028m705o011o445o475o591
55745D26016o857p302p918q264p929p324p053o750n587l820k660k563k859l116
$$ y = [1073610, 1049574, 1026048, 1003192, 981439, 961439, 943119, 925427, 907698, 890704, 875550, 862057, 849147, 836401, 824291, 813187, 802985, 793559, 784801, 776268, 767470, 758408, 749331, 740164, 730621, 720631, 710159, 698978, 687236, 675893, 665948, 657450, 649825, 642914, 637006, 632139, 628162, 625388, 624413, 625228, 627101, 629404, 632089, 635276, 638894, 642825, 647016, 651295, 655300, 658616, 660808, 661396, 660058, 656906, 652384, 646919, 640712, 633785, 626175, 618138, 610076, 602051, 593458, 583618, 572634, 561224, 549740, 537994, 526157, 515050, 505230, 496456, 488566, 482275, 478438, 476879, 476512, 476375, 476134, 475815, 475541, 475379, 475126, 474367, 472917, 470970, 468704, 466154, 463578, 461369, 459271, 456243, 451538, 445527, 439082, 432607, 426016, 419159, 411857, 403939, 395675, 387746, 380422, 373369, 366619, 361032, 357212, 354552, 351989, 349130, 346014]
55731C46014l585m111l973l180k665k757k734k363k494l486m295m024l186k626
55717C00535k230j684j384j569j455m39O33O22j18l25K72Q25Q51O62M24j62j158
55700B94300k147k771k951k720k378k551l478m462m642m091l577l434l387l216
55686B48495k873k053n13J184J985J616R21P88J128J196N06p20j820k241j964
55671B45635j442j133j148j387j759k111k197j948j546j107n54K0K61R9N3O39
55655B30375J682K530K777K567K425K902M065N178N251M140K678J540N82m26j067
55640B67199q95l15j81q31j942l071l770l637k840k332k813l721l879l073k220
55625B31679k026k125j813j124q32j509k836l925m263m172m091l782k794j617
$$ y = [346014, 342429, 338318, 334345, 331165, 328500, 325743, 323009, 320646, 318152, 314666, 310371, 306347, 303161, 300535, 298305, 296621, 295237, 293668, 292213, 291774, 292407, 293029, 292911, 292586, 292858, 293683, 294534, 295196, 295620, 295458, 294300, 292153, 289382, 286431, 283711, 281333, 278782, 275304, 270842, 266200, 262109, 258532, 255098, 251711, 248495, 245622, 243569, 243056, 244240, 246225, 247841, 248762, 249550, 250678, 251874, 252380, 251660, 249840, 247599, 245635, 244193, 243060, 241912, 240525, 238766, 236655, 234458, 232510, 230964, 229857, 229303, 229323, 229584, 229683, 229736, 230375, 232057, 234587, 237364, 239931, 242356, 245258, 249323, 254501, 259752, 263892, 266570, 268110, 268692, 268266, 267199, 266304, 265989, 265808, 264977, 263035, 259964, 256194, 252557, 249717, 247385, 244572, 240851, 236972, 233899, 231679, 229653, 227528, 225715, 224591, 223759, 222250, 219414, 215489, 211226, 207054, 202963, 199181, 196387, 194770]
55611A94770j400k282k977k531j616j383j786j921j512j027p83p85j145j748j861
55596A70013r98N2J18p12j358j478j720k263k346j571n57O1L68M69J10n82q18
55579A56788k47L63K15m08p36o55m98k07N21J371J485M95r53j801j481k71J072
55562A55053J911K060J586N84o63j495j405o15K04P50J126J183O02l49q76o97
55546A58959l87m01m95m08l84n54n15o7K24r9n44m10O1J33j95k19L31J002J399
55527A57431J534J385P72k25j223j986k450k352j451j62O02M67l5k90l75p96j770
55510A49076k920l487k803j037O44J124N87J99M75P18K82l68m73j32L6m4M0L28
55492A42245M22K29M6k1j46k11P1M60L11m15r00n99L2L27L15L29K76j6j15M54
$$ y = [194770, 193370, 191088, 188111, 185580, 183964, 182581, 180795, 178874, 177362, 176335, 175552, 174767, 173622, 171874, 170013, 169015, 169067, 169185, 168473, 167115, 165637, 163917, 161654, 159308, 157737, 157180, 157241, 157609, 158078, 158188, 157606, 156788, 156541, 156904, 157119, 156711, 155975, 155320, 154822, 154615, 155136, 156507, 157992, 158487, 157534, 155733, 154252, 153981, 155053, 156964, 159024, 160610, 161194, 160531, 159036, 157631, 157016, 157220, 157970, 159096, 160279, 160881, 160532, 159656, 158959, 158572, 158171, 157676, 157268, 156884, 156330, 155815, 155748, 155972, 155873, 155329, 154919, 154980, 155113, 154918, 154699, 155030, 156032, 157431, 158965, 160350, 161122, 160897, 159674, 157688, 155238, 152886, 151435, 151273, 151875, 152342, 152307, 152017, 151642, 150846, 149076, 146156, 142669, 139866, 138829, 139473, 140597, 141184, 141383, 141858, 142576, 142858, 142490, 142017, 141885, 141921, 141877, 141917, 142245, 142667, 142896, 142942, 142921, 142775, 142564, 142635, 143095, 143406, 142991, 142091, 141492, 141524, 141851, 142166, 142495, 142771, 142755, 142640, 143094]
55472A43094J266J415Q63M62N79O16J73j60K35R19J020M69n1k23m20r71j686k134
55454A45466k063j467o82l08o57j200j091k23O72J073J255J568J683J093M2o51
55438A44510o45m52o26j018j099p32l31k36k97j54K33N48N88N10N45O29N13J62
55420A42648j82l02k36j15M3K89N61O28K91k97o10k23N73Q78J26j131j784j406
55402A39751o21k03k06k34j81k83o06q51p75m71j75K8J18j2m21q29p72j52N07
55383A33612O06K28Q6N70J110Q45k16j130j212q62q86j328j423p21K91Q57Q63
55366A31290P30P04O29L97J55k3l10p39r01l70P22J737K132J775Q49k08p59m38
55348A37372L60P62M07j90l96j88P9K75M41M12l7p09j090r90o86m21q2M14P71
$$ y = [143094, 144360, 145775, 146638, 147100, 147679, 148295, 148468, 148308, 148543, 149462, 150482, 150951, 150900, 150677, 150257, 149286, 147600, 145466, 143403, 141936, 141254, 140946, 140289, 139089, 137998, 137775, 138447, 139520, 140775, 142343, 144026, 145119, 145161, 144510, 143865, 143413, 142787, 141769, 140670, 139938, 139607, 139371, 139074, 138920, 139153, 139701, 140289, 140799, 141344, 141973, 142486, 142648, 142466, 142164, 141928, 141813, 141856, 142145, 142706, 143334, 143625, 143328, 142718, 142495, 143068, 143946, 144072, 142941, 141157, 139751, 139130, 138927, 138721, 138487, 138306, 138023, 137417, 136566, 135791, 135320, 135145, 135173, 135291, 135279, 134858, 134029, 133257, 133105, 133612, 134218, 134446, 134532, 135102, 136212, 137057, 136841, 135711, 134499, 133637, 132751, 131423, 130000, 129279, 129570, 130427, 131290, 132020, 132724, 133353, 133750, 133905, 133882, 133572, 132833, 131932, 131562, 132284, 134021, 136153, 137928, 138777, 138569, 137810, 137372, 137732, 138494, 138901, 138711, 138315, 138127, 138206, 138481, 138922, 139334, 139297, 138588, 137498, 136508, 135822, 135401, 135319, 135733, 136504]
55329A36504N68j72r12j101o84j09J52R7J13M02O72N54J02l10n24o54p06m78P6
55310A33590O30Q16N54L3m34n56l18j12l52q09p45R3R55R16O8o17n02R6N46P48
55290A34600R91J334J469J222Q02M93L44K39Q9j30l62l62J20Q58J098M05o66j172
55272A41372r32m77K1R52K169K582J555O1m76j24k20j362k554k674j839q97j91
55255A36966M66J072J306J046N65J72o5k91p20j349j776j450l35Q96J500J282
55239A39285M97n27j360j470p40J83N46M04M32Q53J087O78O6P2Q20J557J538P74
55221A44695j32p10r77j201j452j522j200n02L59J119J486J179J98r11j333p02
55205A38394M55J194J117O74M16K62j64o70n51L17J025O84l91j106j004o32n28
$$ y = [136504, 137072, 136900, 135988, 134887, 134203, 134094, 134246, 134343, 134456, 134858, 135530, 136084, 136186, 135876, 135352, 134698, 133992, 133514, 133590, 134220, 135036, 135590, 135623, 135189, 134633, 134315, 134203, 133851, 133042, 132297, 132390, 133345, 134261, 134329, 133712, 133210, 133306, 133852, 134600, 135591, 136925, 138394, 139616, 140418, 140911, 141255, 141494, 141583, 141453, 141091, 140729, 140849, 141707, 142805, 143210, 142544, 141372, 140440, 139963, 139984, 140936, 143105, 145687, 147242, 147303, 146827, 146703, 146483, 145121, 142567, 139893, 138054, 137157, 136966, 137432, 138504, 139810, 140856, 141421, 141593, 141528, 141237, 140517, 139168, 137392, 135942, 135607, 136503, 138003, 139285, 139782, 139255, 137895, 136425, 135685, 135868, 136414, 136818, 137250, 138103, 139190, 139868, 139934, 140006, 140826, 142383, 143921, 144695, 144563, 143853, 142876, 141675, 140223, 138701, 137501, 136999, 137358, 138477, 139963, 141142, 141340, 140429, 139096, 138394, 138849, 140043, 141160, 141834, 142250, 142512, 142348, 141678, 141127, 141444, 142469, 143153, 142762, 141656, 140652, 140020, 139492]
55188A39492n27k50K24N66P45R57J200J249R68M28k08p77j143j245j052n05K75
55171A40397Q44P69K29j09Q2M47O20P73J194J711J985K069K187K141J527M84k60
55154A57090k08L87Q89Q84L87k90p85r75j071j300j575j656j534j358j148q49
55138A46888o26p07r36q84m31J02M51O73Q46Q31N38J30j99m10m51j65M28R23Q94
55119A47895L45k84n25k57J77K08m06j248j626j310o21J24Q41J296J110M25O0
55102A46204N45J286J291N07j37OO00R49Q59N61K36j27n23q94j164j188p40K44
55084A48515J423K146J905P38o60j414j227p07o21r16p60K86J546J970J289J82
55068A53695o03q29o25j88K08K63p5n09p13o88o58p19p32n83l53j80lL78R58J412
$$ y = [139492, 138965, 138715, 138939, 139505, 140250, 141207, 142407, 143656, 144624, 145052, 144844, 144067, 142924, 141679, 140627, 140122, 140397, 141241, 142010, 142239, 142130, 142212, 142659, 143279, 144052, 145246, 146957, 148942, 151011, 153198, 155339, 156866, 157350, 157090, 156882, 157269, 158158, 159042, 159429, 159139, 158354, 157379, 156308, 155008, 153433, 151777, 150243, 148885, 147737, 146888, 146262, 145555, 144619, 143735, 143304, 143406, 143857, 144530, 145376, 146207, 146745, 146875, 146676, 146266, 145815, 145650, 146078, 147001, 147895, 148240, 147956, 147431, 147174, 147351, 147559, 147153, 145905, 144279, 142969, 142348, 142472, 143313, 144609, 145719, 146144, 146204, 146749, 148035, 149326, 149833, 149696, 149702, 150302, 151251, 152110, 152671, 152907, 152780, 152257, 151363, 150199, 149011, 148271, 148515, 149938, 152084, 153989, 154727, 154067, 152653, 151426, 150719, 150098, 149182, 148422, 148708, 150254, 152224, 153513, 153695, 153092, 152263, 151638, 151450, 151658, 151921, 151846, 151337, 150624, 149936, 149278, 148559, 147827, 147244, 146891, 146711, 146708, 147086, 148044, 149456]
55048A49456J420J071P53O82P21P09O48N62M07K01Kl62j113j902j879q57J28K5
55030A50672q04j115n54Q7K88M07O47M92k55p82m10K65K73k92n82m50m93q24p90
55011A45780m3Q96J381J347J062P09L88J26j84n41n82J3R34J559J743J743J561
54994A57892J026M82N17J003J216J059J189J726J825J059J88l0J4l31p60n71L9
54977A67543K59o1l64m16n21p04n19K35J088J408R38j06j116j418q35J28Q75J253
54959A67667J255O98k86q98m99M88J141J242J180J046O80M49R54J914K250J519
54943A80800M42j88l87m39k53L22R93J338J249Q54L67Q9J78L35J95K3M19J249
54925A87586J654J299Q78J029J535K022K717L872M997N417N136M591L936L147
$$ y = [149456, 150876, 151947, 152700, 153382, 154103, 154812, 155460, 156022, 156429, 156630, 156632, 156270, 155157, 153255, 151376, 150519, 150647, 150672, 149868, 148753, 148199, 148286, 148574, 148981, 149628, 150120, 149865, 149083, 148673, 148938, 149211, 148919, 148337, 147887, 147394, 146570, 145780, 145737, 146633, 148014, 149361, 150423, 151132, 151520, 151646, 151462, 150921, 150339, 150352, 151286, 152845, 154588, 156331, 157892, 158918, 159400, 159917, 160920, 162136, 163195, 164384, 166110, 167935, 168994, 169182, 169152, 169166, 168835, 168075, 167504, 167543, 167802, 167741, 167377, 166961, 166440, 165736, 165217, 165452, 166540, 167948, 168886, 168780, 167664, 166246, 165411, 165539, 166414, 167667, 168922, 169620, 169334, 168436, 167937, 168425, 169566, 170808, 171988, 173034, 173714, 174163, 175117, 177031, 179281, 180800, 181242, 181054, 180667, 180228, 179975, 180297, 181290, 182628, 183877, 184731, 185098, 185187, 185365, 185700, 185895, 185918, 186337, 187586, 189240, 190539, 191417, 192446, 193981, 196003, 198720, 202592, 207589, 213006, 218142, 222733, 226669, 229816]
54911B29816K401J745O99j037k789l575l464l470m123m832m862m255l521k940
54897A95793k498k223k149k086j753j175p37o98p02j26J052J945J760R01N14R61
54881A88779J451J407J390K144L332L998L915L699L775L962M066M093L828K872
54867B32711J360O3n22p97j484k717l985m756m898m616m188l753l305k867k591
54852A93655k546k568k448k199j938j712j628j901k416k505j655l18N21N49L14
54837A71205K25L9l92n72n0P84J149Q75M68L33L92M58N21N75M77J48k12l00r1
54818A76032J00J1j59J00R25J717J758J081L70K6k18o23r14p55l50n1K75R84J757
54799A82066J695M57j171k141k178j693j047l63J02J6m83p25k66N24Q90O00J26
$$ y = [229816, 232217, 233962, 234661, 233624, 230835, 227260, 223796, 220326, 216203, 211371, 206509, 202254, 198733, 195793, 193295, 191072, 188923, 186837, 185084, 183909, 183172, 182474, 181772, 181646, 182698, 184643, 186403, 187304, 187818, 188779, 190230, 191637, 193027, 195171, 198503, 202501, 206416, 210115, 213890, 217852, 221918, 226011, 229839, 232711, 234071, 234134, 233612, 232815, 231331, 228614, 224629, 219873, 214975, 210359, 206171, 202418, 199113, 196246, 193655, 191109, 188541, 186093, 183894, 181956, 180244, 178616, 176715, 174299, 171794, 170139, 169821, 170342, 170891, 171205, 171430, 171469, 171077, 170505, 170455, 171239, 172388, 173263, 173731, 174064, 174456, 174914, 175435, 176010, 176487, 176635, 176423, 176123, 176032, 176132, 176143, 175984, 176084, 177009, 178726, 180484, 181565, 181935, 181961, 181743, 181120, 180206, 179451, 179101, 179050, 179325, 180309, 182066, 183761, 184218, 183047, 180906, 178728, 177035, 175988, 175625, 175727, 175743, 175260, 174535, 174269, 174793, 175683, 176283, 176409]
54782A76409rK30N24O96Q43J144J606K041K239K160J995J983K226K679L311M051
54766B04128M702N034N086N109N168M955M218L189K423K202K257K032J143l54
54752B51292k006l325m157m692n104n332n288n080m823m386l557k381j159k05
54738A99797K72J54m80j278j866k141k130j731q33L23J236J633J689J713J914
54723A98272K462L485M789N773N834M920L621K657K306K240J964J327N07l95j487
54708B38275k635l330l364l316l919n032n755n549m746l924l267k724k288j848
54694A86578j129j09P32Q91L76m39j196j621j473q34k43j49l58l37J9K74J14k19
54676A80877k45K31R05J218Q02q7o56l36N23J015P84M55P63J481J663Q39l48r36
$$ y = [176409, 176400, 176630, 177154, 177850, 178693, 179837, 181443, 183484, 185723, 187883, 189878, 191861, 194087, 196766, 200077, 204128, 208830, 213864, 218950, 224059, 229227, 234182, 238400, 241589, 244012, 246214, 248471, 250503, 251646, 251292, 249286, 245961, 241804, 237112, 232008, 226676, 221388, 216308, 211485, 207099, 203542, 201161, 200002, 199797, 200069, 200223, 199743, 198465, 196599, 194458, 192328, 190597, 189764, 190087, 191323, 192956, 194645, 196358, 198272, 200734, 204219, 209008, 214781, 220615, 225535, 229156, 231813, 234119, 236359, 238323, 239650, 240157, 239762, 238275, 235640, 232310, 228946, 225630, 221711, 216679, 210924, 205375, 200629, 196705, 193438, 190714, 188426, 186578, 185449, 185340, 186072, 186963, 187339, 186900, 185704, 184083, 182610, 181776, 181533, 181384, 181026, 180689, 180708, 180982, 181096, 180877, 180632, 180863, 181768, 182986, 183788, 183701, 183045, 182709, 183232, 184247, 185031, 185486, 186249, 187730, 189393, 190232, 189884, 188948]
54658A88948p69m88n40o27l22J81L22L0j65J23O50R39Q72O64M76K40j59o90j125
54639A88560j167p34r7M07O91P67M35m46j395j543p09K56M83R6k24k06j38k40
54621A84796m74q23j227j330p90J27P04O16K23PJ23N11J010J230P86j09p02o21
54603A84057l64o08j235j495r79j15L49Q3n38p96k79P36J543J674J215N17j13
54586A83652l95r7O21J073O71l69j143j027l46qn02j338j513n77Q24J580J240
54569A82346L32l38m88l85m15p55j227j324o41N37J336J220N71J50K04M48O53
54552A82224P40N33p4p09q00l25J74L80M96O26M41k56j026j258q32k0R70J914
54534A83198K368K026J217O10M25L07l1l89m24j28J96K48pk88j77M37J137J310
$$ y = [188948, 188179, 187691, 187151, 186524, 186202, 186383, 186705, 186735, 186570, 186693, 187343, 188282, 189154, 189818, 190294, 190534, 190375, 189685, 188560, 187393, 186659, 186562, 186969, 187660, 188427, 188862, 188416, 187021, 185478, 184769, 185025, 185508, 185604, 185380, 185174, 185036, 184796, 184322, 183499, 182272, 180942, 180152, 180279, 180983, 181599, 181822, 181829, 181952, 182463, 183473, 184703, 185489, 185380, 184678, 184057, 183693, 183085, 181850, 180355, 179376, 179261, 179610, 179693, 179155, 178359, 178080, 178816, 180359, 182033, 183248, 183765, 183652, 183257, 183160, 183781, 184854, 185525, 185156, 184013, 182986, 182640, 182632, 182130, 180792, 179279, 178702, 179526, 181106, 182346, 182678, 182340, 181852, 181467, 181052, 180297, 179070, 177746, 177105, 177642, 178978, 180198, 180769, 180919, 181123, 181571, 182224, 182964, 183497, 183423, 182714, 181914, 181589, 181763, 182143, 182639, 183265, 183706, 183450, 182424, 181166, 180334, 180314, 181284, 183198, 185566, 187592, 188809, 189419, 189844, 190151, 190120, 189731, 189307, 189179, 189375, 189623, 189616, 189328, 189151, 189588, 190725, 192035]
54516A92035P08l51j252j396n65P25J434R78n8o31n32m55p51r17n45r5j66m92
54498A87674l17M43J079J046M90j13m08k25K79N32J00o42q33k96J95L2l66k16
54480A88454N34J237J467J349J077N95j02p41r89p96m02j03m4r6l1J63J94r1l25
54461A91350K1Q97J580J459P09kk87l59n89r57j045o39j75l50j169j672j025L41
54443A88088J089O19k19k81M53J070R99N14P5k38m47l82P2O62R82R18O85N55N97
54424A95811O50N09K38K56Q52J605J664P77l05p04l89K0J14n1l31o61q70p98n60
54405A97827m01k40J72O94Q25M11j08l32l76m74n02k14K63N27M24K60M59J122
54387B00337J820J894J135J36l76m59p60j363j482o55M19P48L37K4L04R37J498
$$ y = [192035, 192743, 192392, 191140, 189744, 189179, 189904, 191338, 192316, 192258, 191627, 191095, 190640, 189889, 188972, 188427, 188332, 188166, 187674, 187357, 187800, 188879, 189925, 190415, 190302, 189894, 189669, 189948, 190480, 190580, 189938, 189105, 188809, 189004, 189036, 188670, 188454, 188988, 190225, 191692, 193041, 194118, 194713, 194611, 193870, 192881, 192085, 191683, 191580, 191536, 191440, 191409, 191572, 191766, 191675, 191350, 191371, 192268, 193848, 195307, 196016, 196014, 195727, 195368, 194779, 193822, 192777, 192138, 191963, 191613, 190444, 188772, 187747, 188088, 189177, 189796, 189577, 189296, 189749, 190819, 191818, 192332, 192407, 192169, 191722, 191340, 191412, 192074, 193056, 193974, 194659, 195214, 195811, 196461, 196970, 197208, 197464, 198316, 199921, 201585, 202362, 202057, 201353, 200964, 200984, 201098, 201047, 200716, 200055, 199185, 198387, 197827, 197426, 197186, 197358, 198052, 198877, 199288, 199180, 198848, 198472, 197998, 197496, 197282, 197545, 198072, 198496, 198756, 199215, 200337, 202157, 204051, 205186, 205322, 204946, 204487, 203727, 202364, 200882, 200227, 200646, 201394, 201731, 201755, 202059, 202996, 204494]
54370B04494J710J343M55l43m38j4K55K44M27Q13O78k68j235j362q70n69n81k97
54352B04442N01J137R26J43k50K60J111J298N49l72o36l37k02m93p25n10j75k17
54334B06450n59p48o08m06l73m13k66J48N78N71n8q97j249r06l33mJ34L72P19
54315B02152J013J282J625J833J543P85J00j0L50N66J89n31q44l84L08L77k79
54298B10075q59o79Q0P35Q48M36j74m42j0P77J053N70J19M41J109J111K80n90
54280B14880q72o45j72M76J096J284Q93J77o11j393j928j848j180m12J25N47Q85
54263B11302Q14K21m10n75m36m67p10q07o54n64p49r98r61n14K19R96J576J834
54245B09117J826J665J306O15l31j103j254p71m8N42R69J247J103L01p28j050
$$ y = [204494, 206204, 207547, 208002, 207659, 207221, 207207, 207462, 207706, 208133, 208946, 209624, 209356, 208121, 206759, 205889, 205320, 204739, 204442, 204943, 206080, 207006, 207149, 206899, 207159, 208270, 209568, 210117, 209745, 209109, 208772, 208570, 208077, 207352, 206842, 206667, 206450, 205891, 205143, 204535, 204129, 203756, 203343, 203077, 203225, 203803, 204374, 204316, 203419, 202170, 201264, 200931, 200927, 201061, 201433, 202152, 203165, 204447, 206072, 207905, 209448, 210233, 210333, 210323, 210673, 211239, 211428, 210897, 210053, 209669, 209977, 210354, 210075, 209216, 208537, 208617, 209352, 210200, 210636, 210462, 210020, 210010, 210787, 211840, 212410, 212529, 212970, 214079, 215190, 215470, 214880, 214008, 213363, 213191, 213667, 214763, 216047, 216940, 217117, 216506, 215113, 213185, 211337, 210157, 209745, 209870, 210417, 211302, 212116, 212337, 211927, 211352, 210916, 210449, 209739, 208932, 208278, 207714, 206965, 205967, 205006, 204492, 204711, 205707, 207283, 209117, 210943, 212608, 213914, 214529, 214198, 213095, 211841, 211070, 211022, 211564, 212533, 213780, 214883, 215184, 214456, 213406]
54229B13406l13P15J089Q59P82J094J226Q10K65P9J20j4l08m74n15o68r67j202
54211B15984j269j219r53k68P62J663J957J536O38m13j346j975k161j789q48L57
54195B10656J258J435J006M83K35J89R2j45l91m69k74K36R32J475J531J175Q51
54178B20275P99P46L65j26k56j03k09o07n55L81J522J947J730J635J851J864J474
54161B32733J123J048Q86M17J5M0L04N39P99J084J082P22M60N01K96n50j425j517
54143B38557j112j161j820k324k232j828j294m33M86O69j2n69l10P1m23j487j940
54126B22838j362l86M53J153J527J117J59k27O02J821K145J398M68N2J34M84R58
54109B33334J274J158Q24Q00J106J130N09l29p57o10o2P03J311J186K02r03j277
$$ y = [213406, 213093, 213808, 214897, 215756, 216538, 217632, 218858, 219668, 219933, 220012, 220132, 220118, 219810, 219336, 218821, 218153, 217186, 215984, 214715, 213496, 212543, 212275, 213037, 214700, 216657, 218193, 218831, 218418, 217072, 215097, 212936, 211147, 210299, 210656, 211914, 213349, 214355, 214838, 215073, 215262, 215354, 215209, 214818, 214349, 214075, 214311, 215243, 216718, 218249, 219424, 220275, 221074, 221820, 222185, 222059, 221803, 221700, 221491, 220884, 220329, 220710, 222232, 224179, 225909, 227544, 229395, 231259, 232733, 233856, 234904, 235790, 236207, 236222, 236262, 236566, 237105, 237904, 238988, 240070, 240792, 241252, 241753, 242049, 241499, 240074, 238557, 237445, 236284, 234464, 232140, 229908, 228080, 226786, 226353, 226839, 227508, 227496, 226927, 226617, 226688, 226265, 224778, 222838, 221476, 221090, 221543, 222696, 224223, 225340, 225499, 225272, 225874, 227695, 229840, 231238, 231706, 231758, 231892, 232376, 233334, 234608, 235766, 236590, 237390, 238496, 239626, 240135, 239806, 239049, 238439, 238377, 239080, 240391, 241577, 241779, 240876, 239599]
54092B39599r27n18m62o06o81n65j81L79P28N62P4l17m92n01k51J98L15k56r66
54073B35132j046o62o02r18r41o28p31j337j459n78M84Q84R37J167J204O25J37
54056B31668O21J565J669P95Q3K43Q50J430K095K877L299L069K518K105K017K388
54040B59292L246M125M368M063M043M714N464N558N048M446M011L722L584L511
54026C19195L258K820K600K872L296L251K509J382L38l30o16p22q09q18p38q18
54010C36670j267j831k172k503l295m371m963m792m443m391m359l961l401l096
53996B87825l011k852k566k311k148k116k249k296j866j133q66j329j724j243
53982B60115k06M67M84J55m33j332k030j760p07l6m76j394j662r61N2N36J77o64
$$ y = [239599, 238672, 238154, 237692, 237086, 236405, 235840, 235659, 236038, 236766, 237328, 237402, 237085, 236593, 236092, 235841, 236039, 236354, 236098, 235132, 234086, 233424, 232822, 231904, 230963, 230335, 229604, 228267, 226808, 226230, 226714, 227598, 228535, 229702, 230906, 231531, 231668, 232289, 233854, 235523, 236318, 236401, 236644, 237494, 238924, 241019, 243896, 247195, 250264, 252782, 254887, 256904, 259292, 262538, 266663, 271031, 275094, 279137, 283851, 289315, 294873, 299921, 304367, 308378, 312100, 315684, 319195, 322453, 325273, 327873, 330745, 334041, 337292, 339801, 341183, 341521, 341191, 340575, 339853, 339044, 338226, 337488, 336670, 335403, 333572, 331400, 328897, 325602, 321231, 316268, 311476, 307033, 302642, 298283, 294322, 290921, 287825, 284814, 281962, 279396, 277085, 274937, 272821, 270572, 268276, 266410, 265277, 264411, 263082, 261358, 260115, 259909, 260376, 260860, 261015, 260582, 259250, 257220, 255460, 254753, 254717, 254241, 252847, 251185, 250224, 250276, 250812, 250989, 250325]
53964B50325j229r99k65J46j65o66n19L93J301J431Q78M74Q14J605K072J890J382
53947B58868R49P10P57J294K222L024L339L341L241K834K042J485J861K945L846
53932B92758M166M255M344M217L851L727M126M681M959N058N261N415N156M556
53918C56530M137M249M685M947M777M430M442N034N665N501M341K931K167K145
53904D15981K203J721P31k57q30j062j371k007k763l287l583l949m478m917n123
53889C87009n371n933o567o692o029m872l781l157l118l533m077m404m374m133
53875C20968l876l596l148k556k083j920j951k012k177k559k891k740k167j755
53861B85537j832k043j996j871k003k184j967j453j155j143q93j92M47M70k5n03
$$ y = [250325, 249096, 248097, 247832, 247978, 247813, 247147, 246628, 247021, 248322, 249753, 250631, 251105, 251919, 253524, 255596, 257486, 258868, 259817, 260527, 261284, 262578, 264800, 267824, 271163, 274504, 277745, 280579, 282621, 284106, 285967, 288912, 292758, 296924, 301179, 305523, 309740, 313591, 317318, 321444, 326125, 331084, 336142, 341403, 346818, 351974, 356530, 360667, 364916, 369601, 374548, 379325, 383755, 388197, 393231, 398896, 404397, 408738, 411669, 413836, 415981, 418184, 419905, 420636, 420379, 419549, 418487, 417116, 415109, 412346, 409059, 405476, 401527, 397049, 392132, 387009, 381638, 375705, 369138, 362446, 356417, 351545, 347764, 344607, 341489, 337956, 333879, 329475, 325101, 320968, 317092, 313496, 310348, 307792, 305709, 303789, 301838, 299826, 297649, 295090, 292199, 289459, 287292, 285537, 283705, 281662, 279666, 277795, 275792, 273608, 271641, 270188, 269033, 267890, 266997, 266805, 267252, 267722, 267697, 267194]
53845B67194o12l25K42Q27J086R08N64L77L52K85J20jK6J45K08J19m6j03m9j45
53825B71172n63j012j053p29n20n74m15L92J507K094J724Q30L03P14J807K775
53809B78452L083K995L080L363L330K754K083J870K257L121M266N318N747N368
53795C27087M561L749L015K341J852J509R99L05l7K79O71L99l16n82j82P7n16
53778C45211j676k586k853k715k575k636k840l007l039k976k872k690k475k496
53764C07775k913l375l315k661j913j445j048l62M54Q25M43l50r29j029r49j080
53748B88128j381j436j006l25K57O22Q36R20Q61P46O32M93M09O05J093J517J635
53731B94606J679J865J892J415Q76J158K370L512L609K750J809J501J902K554
$$ y = [267194, 266582, 266257, 266499, 267326, 268412, 269320, 269884, 270261, 270613, 270898, 271018, 271017, 271043, 271188, 271396, 271515, 271469, 271366, 271317, 271172, 270609, 269597, 268544, 267815, 267295, 266721, 266306, 266698, 268205, 270299, 272023, 272853, 273156, 273870, 275677, 278452, 281535, 284530, 287610, 290973, 294303, 297057, 299140, 301010, 303267, 306388, 310654, 315972, 321719, 327087, 331648, 335397, 338412, 340753, 342605, 344114, 345113, 345418, 345381, 345660, 346331, 346730, 346414, 345832, 345650, 345727, 345211, 343535, 340949, 338096, 335381, 332806, 330170, 327330, 324323, 321284, 318308, 315436, 312746, 310271, 307775, 304862, 301487, 298172, 295511, 293598, 292153, 291105, 290743, 291197, 292022, 292465, 292115, 291186, 290157, 289208, 288128, 286747, 285311, 284305, 283980, 284237, 284859, 285695, 286615, 287476, 288222, 288854, 289347, 289756, 290361, 291454, 292971, 294606, 296285, 298150, 300042, 301457, 302333, 303491, 305861, 309373, 312982, 315732, 317541, 319042, 320944, 323498]
53717C23498K838K480J914J920K685L535L769L487L329L595M008M265M439M772
53703C70534N283N844O501P610R423J1659J3658J5087J6270J7662J9253K0781
53691E19565K2345K4235K6128K6966K5855K2768J8197J2539O200l7n265r240j2625
53678F77631j6307k0471k4300k6607k6789k5238k2817k0087j7180j4274j1763
53667D51798r899q554p471o574n880n359m990m803m763m744m652m361l640k458
53653C73650j333r09j112j200q28n65r42j575j705j287r46r85j036o91L4Q78J638
53636C61086K167K313K006J345O56M50J084K211K935K773K291K341K878L107K687
53621C92330K165K141K506K778K802K795K929L179L465L755M004M126L998L597
$$ y = [323498, 326336, 328816, 330730, 332650, 335335, 338870, 342639, 346126, 349455, 353050, 357058, 361323, 365762, 370534, 375817, 381661, 388162, 395772, 405195, 416854, 430512, 445599, 461869, 479531, 498784, 519565, 541910, 566145, 592273, 619239, 645094, 667862, 686059, 698598, 704798, 704761, 699496, 690256, 677631, 661324, 640853, 616553, 589946, 563157, 537919, 515102, 495015, 477835, 463561, 451798, 441899, 433345, 425874, 419300, 413420, 408061, 403071, 398268, 393505, 388761, 384109, 379748, 376108, 373650, 372317, 371408, 370296, 369096, 368268, 367703, 366761, 365186, 363481, 362194, 361248, 360263, 359227, 358536, 358570, 359448, 361086, 363253, 365566, 367572, 368917, 369573, 370023, 371107, 373318, 376253, 379026, 381317, 383658, 386536, 389643, 392330, 394495, 396636, 399142, 401920, 404722, 407517, 410446, 413625, 417090, 420845, 424849, 428975, 432973, 436570]
53607D36570L171L094L438L809L855L735L750L727L255K436J854J736J665J325
53593D77420R69R03Q90N26j87r88j821k702l305l161k338j507j255j509j719j487
53577D58729r57o09o99r53j055j265k166l606m410l645j886o94q41j682k214k261
53561D29786k224k185j832j149o59p59j113r79j53P25R52O43N54J051J624J630
53545D25912J151Q48J096J724K490L337M144M600M627M571M748N009N045M964
53531D74266N224O107P474Q982J0296J1150J1473J1494J1476J1439J1375J1629
53519E92385J2640J4232J5625J6321J6656J7171J7835J8246J8300J8300J8588
53508G76299J9426K1025K3164K4943K5487K4926K4139K3523K2742K1749K1250
$$ y = [436570, 439741, 442835, 446273, 450082, 453937, 457672, 461422, 465149, 468404, 470840, 472694, 474430, 476095, 477420, 478389, 479292, 480182, 480708, 480521, 479533, 477712, 475010, 471705, 468544, 466206, 464699, 463444, 461935, 460216, 458729, 457772, 457163, 456464, 455511, 454456, 453191, 451025, 447419, 443009, 439364, 437478, 436784, 435943, 434261, 432047, 429786, 427562, 425377, 423545, 422396, 421737, 420978, 419865, 418886, 418733, 419458, 420410, 421053, 421607, 422658, 424282, 425912, 427063, 427911, 429007, 430731, 433221, 436558, 440702, 445302, 449929, 454500, 459248, 464257, 469302, 474266, 479490, 485597, 493071, 502053, 512349, 523499, 534972, 546466, 557942, 569381, 580756, 592385, 605025, 619257, 634882, 651203, 667859, 685030, 702865, 721111, 739411, 757711, 776299, 795725, 816750, 839914, 864857, 890344, 915270, 939409, 962932, 985674, 1007423, 1028673]
53497A028673K1658K2242K2120K1551K1474K1914K1882K0918J9843J9542J9711
53486A261528J9441J8602J7906J7703J7436J6508J5153J4032J3321J2633J1788
53475A436051J1173J1174J1618J2027J2145J1899J1074R575P887O786O461O403
53463A554273O258O195O086M966J910k918q529j4110j9164k3060k5447k7074k9330
53450A430056l2644l5914l7800l7976l6828l4633l1611k8401k5692k3513k1368
53439A083676j9098j7118j5682j4383j2639j0493q532p017n429l225p80Q95J482
53426I71657J841K887M544O322Q378J1101J3913J5600J5941J6092J6995J8375
53414A103646J9642K0920K2509K4090K5309K6554K8352L0368L1896L2965L4178
$$ y = [1028673, 1050331, 1072573, 1094693, 1116244, 1137718, 1159632, 1181514, 1202432, 1222275, 1241817, 1261528, 1280969, 1299571, 1317477, 1335180, 1352616, 1369124, 1384277, 1398309, 1411630, 1424263, 1436051, 1447224, 1458398, 1470016, 1482043, 1494188, 1506087, 1517161, 1526736, 1534623, 1541409, 1547870, 1554273, 1560531, 1566726, 1572812, 1577778, 1579688, 1576770, 1568241, 1554131, 1534967, 1511907, 1486460, 1459386, 1430056, 1397412, 1361498, 1323698, 1285722, 1248894, 1214261, 1182650, 1154249, 1128557, 1105044, 1083676, 1064578, 1047460, 1031778, 1017395, 1004756, 994263, 985731, 978714, 973285, 970060, 969280, 970175, 971657, 973498, 976385, 980929, 987251, 995629, 1006730, 1020643, 1036243, 1052184, 1068276, 1085271, 1103646, 1123288, 1144208, 1166717, 1190807, 1216116, 1242670, 1271022, 1301390, 1333286, 1366251, 1400429]
53403A400429L5679L7128L8536M0229M2055M3524M4756M6414M8561N0428N1597
53392A879336N2522N3523N4081N3672N2660N1743N0954M9881M8495M7102M5583
53381B439552M3383M0289L6769L3469L0550K7570K3888J9281J4339J0016O617
53370B725723L381o07n348j0043j4207j8123k2170k6221k9948l3503l7374m1579
53358B489981m5328m7801m9118n0178n1484n2526n2595n1829n0958n0229m9236
53347A938699m7831m6539m5756m5091m3943m2369m0864l9607l8337l6847l5164
53336A476351l3367l1597l0128k9067k7999k6351k4080k1709j9721j8222j7125
53325A196985j6255j5306j4123j3057j2541j2329j1634j0141q319o543m557k250
$$ y = [1400429, 1436108, 1473236, 1511772, 1552001, 1594056, 1637580, 1682336, 1728750, 1777311, 1827739, 1879336, 1931858, 1985381, 2039462, 2093134, 2145794, 2197537, 2248491, 2298372, 2346867, 2393969, 2439552, 2482935, 2523224, 2559993, 2593462, 2624012, 2651582, 2675470, 2694751, 2709090, 2719106, 2725723, 2729104, 2728497, 2723149, 2713106, 2698899, 2680776, 2658606, 2632385, 2602437, 2568934, 2531560, 2489981, 2444653, 2396852, 2347734, 2297556, 2246072, 2193546, 2140951, 2089122, 2038164, 1987935, 1938699, 1890868, 1844329, 1798573, 1753482, 1709539, 1667170, 1626306, 1586699, 1548362, 1511515, 1476351, 1442984, 1411387, 1381259, 1352192, 1324193, 1297842, 1273762, 1252053, 1232332, 1214110, 1196985, 1180730, 1165424, 1151301, 1138244, 1125703, 1113374, 1101740, 1091599, 1083280, 1076737, 1072180, 1069930]
53313A069930l06O08J004K051M035O060P380Q310R500J1012J2530J4110J6014
53300A162238J8056J9618K0423K0815K1229K1657K1842K1699K1418K1239K1254
53289A391488K1370K1412K1265K0860K0011J8494J6454J4583J3494J2909J1868
53278A584208R839P302N079L345J578o86l287n614p209q291r684j2025j4989j7564
53264A532002j9217k0400k1751k3229k4435k5423k6553k7725k8340k8209k7938
53253A258782k8200k8995k9829l0333l0440l0143k9383k8208k6859k5653k4790
53242I45949k4258k3878k3422k2669k1503k0114j9040j8636j8475j7771j6479
53231G19704j5513j5441j5563j4848j3358j2032j1306j0780j0144r597r294r115
$$ y = [1069930, 1069624, 1070232, 1071236, 1073287, 1077322, 1083382, 1090762, 1099072, 1108572, 1119584, 1132114, 1146224, 1162238, 1180294, 1199912, 1220335, 1241150, 1262379, 1284036, 1305878, 1327577, 1348995, 1370234, 1391488, 1412858, 1434270, 1455535, 1476395, 1496406, 1514900, 1531354, 1545937, 1559431, 1572340, 1584208, 1594047, 1601349, 1606428, 1609773, 1611351, 1610665, 1607378, 1601764, 1594555, 1586264, 1576580, 1564555, 1549566, 1532002, 1512785, 1492385, 1470634, 1447405, 1422970, 1397547, 1370994, 1343269, 1314929, 1286720, 1258782, 1230582, 1201587, 1171758, 1141425, 1110985, 1080842, 1051459, 1023251, 996392, 970739, 945949, 921691, 897813, 874391, 851722, 830219, 810105, 791065, 772429, 753954, 736183, 719704, 704191, 688750, 673187, 658339, 644981, 632949, 621643, 610863, 600719, 591122, 581828, 572713]
53219E72713r120r496r945r879r365r087r159q836p822o887o660o581n865m761
53205D59250m126m203m627n149n578n438m612l938m286n262n728n359m790m327
53191C91827l596k529j672j339j304j478k069k816l014k533k044j845j435o86
53177C63467m75j378k502k579j678r54r90j278j258r70o39l26j23j60k73j77p
53160C47700j93o57o87P3R69J077L52l85m98j67O0j5j44q9P1J09K2J00O36J541
53140C49875K287K318J658J055J343K562L900M573M524M187L809L254K394J313
53126C89052K07o58j046j037j107j616k322k821l221l910m673m789m050l032k211
53111C52766j402m67J24q5p87j322j437j243q23l69k73m89k46R69K428K970K532
$$ y = [572713, 563593, 554097, 544152, 534273, 524908, 515821, 506662, 497826, 490004, 483117, 476457, 469876, 464011, 459250, 455124, 450921, 446294, 441145, 435567, 430129, 425517, 421579, 417293, 412031, 406303, 400944, 396154, 391827, 388231, 385702, 384030, 382691, 381387, 379909, 377840, 375024, 372010, 369477, 367433, 365588, 364153, 363467, 362992, 361614, 359112, 356533, 354855, 353901, 352911, 351633, 350375, 349405, 348766, 348440, 348317, 348157, 347884, 347707, 347700, 347507, 346850, 346163, 346236, 347205, 348282, 348634, 348249, 347751, 347584, 347644, 347629, 347485, 347396, 347467, 347576, 347598, 347698, 348334, 349875, 352162, 354480, 356138, 357193, 358536, 361098, 364998, 369571, 374095, 378282, 382091, 385345, 387739, 389052, 389259, 388601, 387555, 386518, 385411, 383795, 381473, 378652, 375431, 371521, 366848, 362059, 358009, 354977, 352766, 351364, 350897, 351021, 350936, 350149, 348827, 347390, 346147, 345324, 344955, 344682, 344193, 343947, 344916, 347344, 350314, 352846]
53094C52846K037J886J654J267J389K170K587J792M76O6R20K111K742K754K399
53079C79096J665N27o88j534j850j785j533j230j053j205j762k521l039k955k379
53064C57754j827j721j991k316k528k659k664k437k078j877j934k009j897j725
53050C28091j673j548r74j0P11O79J44j49J75O87O88nq89j328j096m59J57M20
53032C23621J76m91j174j340q54k38j87p52j298j277p97k60K33P65J122R57L99
53015C18605Q9L83R44J230J120Q73P66R73J500J989J895J148L95K54N93Q36P51
52998C34344M89J7q13j731k118j764j110o10k67R4N19J097K015L169M035M186
52982C41552L701K876J896J032P12J006J376J379J327J716K300K364J873J573
$$ y = [352846, 354883, 356769, 358423, 359690, 361079, 363249, 365836, 367628, 368104, 368170, 369090, 371201, 373943, 376697, 379096, 380761, 381288, 380600, 379066, 377216, 375431, 373898, 372668, 371615, 370410, 368648, 366127, 363088, 360133, 357754, 355927, 354206, 352215, 349899, 347371, 344712, 342048, 339611, 337533, 335656, 333722, 331713, 329816, 328091, 326418, 324870, 323896, 323886, 324597, 325276, 325420, 325271, 325446, 326133, 326821, 326816, 325927, 324599, 323503, 323044, 323201, 323621, 323797, 323306, 322132, 320792, 319938, 319700, 319513, 318761, 317463, 316186, 315389, 315129, 315362, 316127, 317249, 318206, 318605, 318694, 319077, 320021, 321251, 322371, 323244, 324010, 324983, 326483, 328472, 330367, 331515, 331910, 332164, 332757, 333593, 334344, 334833, 334850, 334037, 332306, 330188, 328424, 327314, 326704, 326437, 326531, 327050, 328147, 330162, 333331, 337366, 341552, 345253, 348129, 350025, 351057, 351769, 352775, 354151, 355530, 356857, 358573, 360873, 363237, 365110, 366683]
52968C66683J852K165J854R84J3q63j637k089k061j864j976k415k798k944k940
52953C51964k725k080j150n13m91p77r35j033j464k288l019l014k027m58Q00R88
52937C31778J50q85j314j025l93K66P75Q40K40p47j491j689j624j555j248m00
52921C21678O52J065M28o41j077m82M81R09O64L87O11J169J541J488J129O38J37
52904C30777k37m35n37n76m52k54l57p96q85n1J086J216L4j282j539q54j37J80
52886C24901K95L12L1n78j212j582j650j540j370j152p72k04K10Op27j258j066
52869C12644m09J50M25M52J52l59n05J15J048J527J435J158P84J89k83o8P15J322
52851C20492J403J203P60j63j216j467p39p6l69j150j418j057o62m87k63J84P90
$$ y = [366683, 368535, 370700, 372554, 373538, 373551, 372688, 371051, 368962, 366901, 365037, 363061, 360646, 357848, 354904, 351964, 349239, 347159, 346009, 345496, 345005, 344228, 343293, 342260, 340796, 338508, 335489, 332475, 330448, 329990, 330790, 331778, 331928, 331043, 329729, 328704, 328311, 328577, 329352, 330192, 330432, 329685, 328194, 326505, 324881, 323326, 322078, 321678, 322330, 323395, 323823, 323182, 322105, 321623, 322104, 323013, 323677, 324064, 324675, 325844, 327385, 328873, 330002, 330640, 330777, 330540, 330105, 329568, 328992, 328540, 328286, 327929, 327133, 326248, 326197, 327283, 328499, 328533, 327251, 325712, 324858, 324721, 324901, 325196, 325508, 325539, 324961, 323749, 322167, 320517, 318977, 317607, 316455, 315683, 315479, 315689, 315695, 314968, 313710, 312644, 312235, 312385, 312810, 313262, 313414, 313055, 312550, 312665, 313713, 315240, 316675, 317833, 318617, 318806, 318523, 318455, 319170, 320492, 321895, 323098, 323858, 323695, 322479, 321012, 320273, 320197, 319828, 318678, 317260, 316203, 315541, 315054, 314791, 314975, 315765]
52834C15765J544K355K746K315J397P69P41R03Q14M23r0n15o49m50j82j13j66
52817C27607j42j13k64m35k38M16J277K186L183M197M961N260N028M267L171K188
52801C62549J564R67k1j198k066k721l702m958n692n507m970m695m474l819k831
52786C18426k005j499j157r79j025j025o52j16K3l92r34j159r29k54O88J334J084
52769C09429O8q25r79o88n39n48l19J89N87O54N31K88k03q08r86m47L37O34L66
52750C06741Q1J53L78M93O56J120J667J697R40k08j015j039m46J66K93p8n99j022
52732C09978j322j363q08L20J308J387N92l66r70j186r65j63R08J363O52o62j466
52715C07237j222k82O58J097Q50J26o16j042j204j166o88L46J376J598J003M57
$$ y = [315765, 317309, 319664, 322410, 324725, 326122, 326891, 327632, 328535, 329349, 329772, 329682, 329167, 328518, 328068, 327886, 327773, 327607, 327465, 327352, 327088, 326653, 326415, 326831, 328108, 330294, 333477, 337674, 342635, 347895, 352923, 357190, 360361, 362549, 364113, 365080, 365059, 363861, 361795, 359074, 355372, 350414, 344722, 339215, 334245, 329550, 325076, 321257, 318426, 316421, 314922, 313765, 312786, 311761, 310736, 310084, 309968, 309991, 309599, 308665, 307506, 306577, 306323, 307011, 308345, 309429, 309497, 308672, 307693, 307005, 306466, 305918, 305599, 305788, 306375, 307029, 307560, 307848, 307645, 306837, 305851, 305404, 305741, 306375, 306741, 306822, 306975, 307353, 307846, 308502, 309622, 311289, 312986, 313926, 313718, 312703, 311664, 311218, 311384, 311677, 311599, 311000, 309978, 308656, 307293, 306485, 306805, 308113, 309500, 310092, 309726, 308756, 307570, 306605, 306442, 307350, 308713, 309365, 308703, 307237, 306015, 305733, 306391, 307488, 308338, 308464, 307848, 306806, 305602, 304436, 303748, 304094, 305470, 307068, 308071, 308528]
52699C08528O07J127J326J040O20L18J05r4l10n61p38n62K9N87O20K80K08P05
52681C13835J400J815J862J611J016J61m93m94K5N15O88P88J113J541J699J420
52665C28502R37N95M37J76l34o81j75J268K735L142K364J315Q90J127J488J603
52649C45389J456J077M20l68q83q46m57j64j12n9J18J37k34o30n00l0l9p39j194
52630C42342n26P74J507J424J380J847K233J954J335R25O26J49k52k43j65n51
52614C54759j067q91j9O22M95Q4L1L14O44R92J372J511J226P31L12j6k35j49K04
52595C60920L60Q7j62J31P68J152J154J081J023Q11N18L88L24K5l55l39R6M43
52577C68425N21P19J101J024J01j009j358q95k62K14O34Q29M17l82p18j80O15
$$ y = [308528, 309135, 310262, 311588, 312628, 313248, 313566, 313671, 313577, 313267, 312706, 311968, 311406, 311435, 312022, 312642, 312922, 313130, 313835, 315235, 317050, 318912, 320523, 321539, 321700, 321207, 320713, 320738, 321253, 321941, 322729, 323842, 325383, 327082, 328502, 329439, 330034, 330471, 330647, 330313, 329632, 329457, 330725, 333460, 336602, 338966, 340281, 341171, 342298, 343786, 345389, 346845, 347922, 348342, 347974, 347091, 346245, 345788, 345624, 345512, 345453, 345571, 345708, 345474, 344844, 344344, 344314, 344275, 343536, 342342, 341816, 342590, 344097, 345521, 346901, 348748, 350981, 352935, 354270, 355195, 355821, 355970, 355718, 355475, 355310, 354759, 353692, 352801, 352782, 353404, 353899, 353983, 354014, 354328, 354972, 355964, 357336, 358847, 360073, 360804, 361116, 361100, 360865, 360716, 360920, 361280, 361367, 361205, 361336, 362104, 363256, 364410, 365491, 366514, 367325, 367843, 368231, 368555, 368580, 368225, 367886, 367982, 368425, 368946, 369665, 370766, 371790, 371891, 370882, 369524, 368629, 368367, 368581, 369215, 370044, 370461, 370079, 369361, 369181, 369796]
52560C69796Q30L33m34j070j299q74R0R49J146Q96Q48J189J540J605J426J030
52544C78001L88j66p3O01J011N62k88p03n61l79l60j68M09J094J523J572J163
52527C83626K59p71j259r72m21q6K74J144K318K990K813K271J928J748J420J051
52511C98333J085J663K389K803K745K251J391L98k86m22l60p13j596k467k787
52496D04427k612k402k394k411k133j479p01k30k82n97p14n50m95p44q75m20M45
52479C85833J090J169P71O5p70j281j047k52M39P53J047J626K294K689K681K253
52463C99360J523J052J515K693L352K619J047k26q69j283j551j356q14n97j010
52448D05455j626j910j757j337q53o31r03j407j587j299r17o90m77k86m39r78
$$ y = [369796, 370626, 370959, 370525, 369455, 368156, 367282, 367372, 368321, 369467, 370363, 371211, 372400, 373940, 375545, 376971, 378001, 378389, 378223, 378150, 378751, 379762, 380324, 380036, 379333, 378772, 378393, 378033, 377865, 378274, 379368, 380891, 382463, 383626, 383885, 383114, 381855, 380883, 380462, 380376, 380650, 381794, 384112, 387102, 389915, 392186, 394114, 395862, 397282, 398333, 399418, 401081, 403470, 406273, 409018, 411269, 412660, 413058, 412772, 412350, 411990, 411277, 409681, 407214, 404427, 401815, 399413, 397019, 394608, 392475, 390996, 390295, 390065, 389783, 389186, 388472, 387922, 387427, 386683, 385808, 385388, 385833, 386923, 388092, 388863, 388928, 388158, 386877, 385830, 385578, 386017, 386770, 387817, 389443, 391737, 394426, 397107, 399360, 400883, 401935, 403450, 406143, 409495, 412114, 413161, 412935, 412066, 410783, 409232, 407876, 407062, 406465, 405455, 403829, 401919, 400162, 398825, 397972, 397341, 396438, 395031, 393444, 392145, 391228, 390538, 390061, 389775, 389336, 388358]
52432C88358j303q42K49J312J826J647R72L35K46N79O34P9n59o58l12J0K57O74
52414C93504J266J907K733L818M754N165N472O363P687Q596Q810Q773Q506P332
52400D74686N153K997J577J55k253n101o850p053o781o936p107o522n272m051
52386D26642l229k773k688k912k916k104o03P39J307J358J613K385L324L890L947
52371D27980L867M050M418M540M150L373K317Q67q23k013k067j370r14j003r57
52356D46415k93M29M62j1k32j1J73R8J49O22J280J795K154K410K503K616L245
52339D63804M499N677O016N657N356N414N505N599O305P992R990J1210J1350J1091
52325E65465J1149J1560J1991J2335J2717J3070J3070J2575J1944J1705J1941
$$ y = [388358, 387055, 386213, 386462, 387774, 389600, 391247, 392219, 392554, 392800, 393379, 394013, 394092, 393533, 392875, 392563, 392573, 392830, 393504, 394770, 396677, 399410, 403228, 407982, 413147, 418619, 424982, 432669, 441265, 450075, 458848, 467354, 474686, 479839, 482836, 484413, 484568, 482315, 477214, 470364, 463311, 456530, 449594, 442487, 435965, 430693, 426642, 423413, 420640, 417952, 415040, 412124, 410020, 409417, 410156, 411463, 412821, 414434, 416819, 420143, 424033, 427980, 431847, 435897, 440315, 444855, 449005, 452378, 454695, 455562, 454739, 452726, 450659, 449289, 448375, 447372, 446415, 446122, 446551, 447013, 447002, 446770, 446759, 446932, 447030, 447179, 447801, 449081, 450876, 453030, 455440, 457943, 460559, 463804, 468303, 473980, 479996, 485653, 491009, 496423, 501928, 507527, 513832, 521824, 531814, 543024, 554374, 565465, 576614, 588174, 600165, 612500, 625217, 638287, 651357, 663932, 675876, 687581, 699522]
52314F99522J2218J2105J1673J1317J1289J1493J1751J1946J1975J1760J1538
52303H28587J1771J2517J3040J2491J0977R505Q687P972O555M584K910J830P59
52290I32185p66k413l644m389m801m817m504m424m990n642n345l913k315j489
52276H78733j440j552j370p24L72J692K893L916N060O415P566Q172Q459Q815R192
52261I36199R394R642J0278J0983J1029J0395J0044J0699J1840J2333J1771J0666
52249A065273R512Q248O748N285M116K984J518k9j014j344j657k376l110l383
52235A090771l407l590l665l064j980j257j220j387j457j724k203k175j262k08
52221A062172J03j2M72J795L208M079M481M700M844N046N458N962O280O401O457
$$ y = [699522, 711740, 723845, 735518, 746835, 758124, 769617, 781368, 793314, 805289, 817049, 828587, 840358, 852875, 865915, 878406, 889383, 898888, 907575, 915547, 922102, 926686, 929596, 931426, 932185, 931419, 929006, 925362, 920973, 916172, 911355, 906851, 902427, 897437, 891795, 886450, 882537, 880222, 878733, 877293, 875741, 874371, 873647, 874019, 875711, 878604, 882520, 887580, 893995, 901561, 909733, 918192, 927007, 936199, 945593, 955235, 965513, 976496, 987525, 997920, 1007964, 1018663, 1030503, 1042836, 1054607, 1065273, 1074785, 1083033, 1089781, 1095066, 1099182, 1102166, 1103684, 1103655, 1102641, 1101297, 1099640, 1097264, 1094154, 1090771, 1087364, 1083774, 1080109, 1077045, 1075065, 1073808, 1072588, 1071201, 1069744, 1068020, 1065817, 1063642, 1062380, 1062172, 1062275, 1062263, 1062735, 1064530, 1067738, 1071817, 1076298, 1080998, 1085842, 1090888, 1096346, 1102308, 1108588, 1114989, 1121446]
52206A121446O388O197O335P138P988P859O766N815N693N898N797N572N579N559
52192A210030N119M497M226M347M457M285L752K837J688N51p48k695n090o799
52178A230457p157o986p390q070p909o856o076o185o472o119n195m057k740j401
52164A147844n77k70N72K801N654P396P307O386N985O302O422N539L841K226J332
52149A208760R45M30m16j156j353j037m36L85J235J458M25j565l312l840l347
52134A197176k795k795l149l399l363k948j835J62K553M608O381Q689J1765J4578
52120A225628J6083J6724J7831J9768K1499K2086K1745K1181K0645K0099J9697
52109A442986J9482J9040J8031J6790J5851J5187J4423J3638J3274J3345J3326
$$ y = [1121446, 1127834, 1134031, 1140366, 1147504, 1155492, 1163351, 1170117, 1175932, 1181625, 1187523, 1193320, 1198892, 1204471, 1210030, 1215149, 1219646, 1223872, 1228219, 1232676, 1236961, 1240713, 1243550, 1245238, 1245789, 1245041, 1242346, 1237256, 1230457, 1223300, 1216314, 1208924, 1200854, 1192945, 1186089, 1180013, 1173828, 1167356, 1161237, 1156042, 1151985, 1149245, 1147844, 1147267, 1146997, 1147569, 1150370, 1156024, 1163420, 1170727, 1177113, 1183098, 1189400, 1195822, 1201361, 1205202, 1207428, 1208760, 1209705, 1210135, 1209719, 1208563, 1207210, 1206173, 1205737, 1206122, 1207357, 1208815, 1209240, 1207675, 1204363, 1200523, 1197176, 1194381, 1191586, 1188437, 1185038, 1181675, 1178727, 1176892, 1177054, 1179607, 1184215, 1190596, 1199285, 1211050, 1225628, 1241711, 1258435, 1276266, 1296034, 1317533, 1339619, 1361364, 1382545, 1403190, 1423289, 1442986, 1462468, 1481508, 1499539, 1516329, 1532180, 1547367, 1561790, 1575428, 1588702, 1602047, 1615373]
52098A615373J2927J2440J2145J1832J1130R971Q436O500M184J812k77k192m323
52085A699958o716q765r720r370q094o334m252k011p3J140J850K771M239N796
52071A660419O882P607Q441R436J0209J0625J0968J1329J1307J0582R489Q659
52059A775953Q274P939P253O205N023L864K774J761Q17j37j162k214l269m493
52045A808588o077p809r058r459r463r840j0632j1007j0294q735p037n579m387
52032A699211l596l343l405l399l386l784m714n836o844p696q275q394q262q479
52018A619798r278j0188j0728j0908j0735r813q052o395n987o746p506p521p147
52005A508794o923o951p436q983j1649j4315j5803j6345j7155j8628j9804j9672
$$ y = [1615373, 1628300, 1640740, 1652885, 1664717, 1675847, 1685818, 1694254, 1700754, 1704938, 1706750, 1706473, 1704281, 1699958, 1693242, 1684477, 1674757, 1665387, 1657293, 1650959, 1646707, 1644696, 1644623, 1645763, 1647613, 1650384, 1654623, 1660419, 1667301, 1674908, 1683349, 1692785, 1702994, 1713619, 1724587, 1735916, 1747223, 1757805, 1767294, 1775953, 1784227, 1792166, 1799419, 1805624, 1810647, 1814511, 1817285, 1819046, 1819863, 1819726, 1818564, 1816350, 1813081, 1808588, 1802511, 1794702, 1785644, 1776185, 1766722, 1756882, 1746250, 1735243, 1724949, 1716214, 1709177, 1703598, 1699211, 1695615, 1692272, 1688867, 1685468, 1682082, 1678298, 1673584, 1667748, 1660904, 1653208, 1644933, 1636539, 1628277, 1619798, 1610520, 1600332, 1589604, 1578696, 1567961, 1558148, 1550096, 1543701, 1537714, 1530968, 1523462, 1515941, 1508794, 1501871, 1494920, 1487484, 1478501, 1466852, 1452537, 1436734, 1420389, 1403234, 1384606, 1364802, 1345130]
51993A345130j8339j6611j5055j3863j3190j3100j3277j3270j2928j2434j1988
51982A191075j1720j1728j1983j2228j2251j2201j2417j2965j3524j3704j3361
51971A052993j2634j1805j1054j0218q965p293n652m316k920j014J062K477K978
51958I83639L149L412L302K126l3k431m601o769r234j1619j2985j2765j1552j0651
51944I12988j0640j0598r188o409l786k601k554k392j456j33R16J435J434Q24
51930H67840o25k995n872q417j0012j0864j1661j2636j3296j3237j2738j2262
51918G53225j1785j1017r921q676p348o022m971m333l753k744j187P71K973N106
51904F90318O693P747R012J0931J2819J3742J3868J4033J4141J3053J0153O184
$$ y = [1345130, 1326791, 1310180, 1295125, 1281262, 1268072, 1254972, 1241695, 1228425, 1215497, 1203063, 1191075, 1179355, 1167627, 1155644, 1143416, 1131165, 1118964, 1106547, 1093582, 1080058, 1066354, 1052993, 1040359, 1028554, 1017500, 1007282, 998317, 991024, 985372, 981056, 978136, 977122, 978184, 980661, 983639, 986788, 990200, 993502, 995628, 995595, 993164, 988563, 981794, 972560, 960941, 947956, 935191, 923639, 912988, 902348, 891750, 882562, 876153, 872367, 869766, 867212, 864820, 863364, 863231, 864147, 865582, 867016, 867840, 867215, 864220, 858348, 849931, 839919, 829055, 817394, 804758, 791462, 778225, 765487, 753225, 741440, 730423, 720502, 711826, 704478, 698456, 693485, 689152, 685399, 682655, 681468, 682239, 685212, 690318, 697011, 704758, 713770, 724701, 737520, 751262, 765130, 779163, 793304, 806357, 816510, 822694]
51892H22694K292j055m036o999j0178j3328j5510j5951j5083j3985j2752j0414
51880G05695o689k714M91L297O447R706J2350J4335J6028J7224J7403J6608J5242
51867H25423J3196J0061N997J692k463o426r919j2515j4299j5694j6599j6341
51855G62113j4674j2228r851p830n882l596r31J462K587K140R88J87j64n46r92
51840G12783j275j785l149m913n721n086m029l558l351k566j204P6J025J892K603
51825F81742K579J445m53k354l656m290m604m939n273n331m910l926k311j64K021
51810F45576L656M505M611L986K803J616P78j38j677l490m821n816p197q652q827
51795F26913p340n574m823m760m500m055l695k910j226O38J639J963K470L108
$$ y = [822694, 824986, 823931, 819895, 812896, 802718, 789390, 773880, 757929, 742846, 728861, 716109, 705695, 699006, 696292, 696783, 700080, 706527, 716233, 728583, 742918, 758946, 776170, 793573, 810181, 825423, 838619, 848680, 854677, 856369, 853906, 847480, 837561, 825046, 810747, 795053, 778454, 762113, 747439, 735211, 725360, 717530, 711648, 708052, 707121, 708583, 711170, 713310, 714298, 714485, 714321, 713775, 712783, 711508, 709723, 706574, 701661, 695940, 690854, 686825, 683267, 679916, 677350, 676146, 676222, 677247, 679139, 681742, 684321, 685766, 685313, 682959, 679303, 675013, 670409, 665470, 660197, 654866, 649956, 646030, 643719, 643555, 645576, 649232, 653737, 658348, 662334, 665137, 666753, 667531, 667393, 665716, 662226, 657405, 651589, 644392, 635740, 626913, 619573, 613999, 609176, 604416, 599916, 595861, 592166, 589256, 588030, 588668, 590307, 592270, 594740, 597848]
51781E97848L148K727K750L378L864L887L820L740L369L135L898N514O919P968
51767F55965R732J2526J5052J6203J6420J6357J5481J3121R811O397K640j900
51755G87805o411r699j2060j4756j7806j9822j9993j8892j7183j4891j2291j0165
51743F13836q590o573l658r31M40R74K175M479O798Q017Q137P852P601P271O561
51728F54389N418M046K574Q07j432l803n660o837p842r070j0097j0062q519n839
51714E98073k980r62k02j17L23J492K850L924N001O525Q260R624J0576J1532J2506
51699F66425J2843J2009J0282Q566P604P358P057O002M435L387L458M022L888
51686G57336K527L67j853l696n150o508p990r302r840r479q744p890o440m193
$$ y = [597848, 600996, 603723, 606473, 609851, 613715, 617602, 621422, 625162, 628531, 631666, 635564, 641078, 647997, 655965, 665697, 678223, 693275, 709478, 725898, 742255, 757736, 770857, 780668, 787065, 789705, 787805, 781394, 771695, 759635, 744879, 727073, 707251, 687258, 668366, 651183, 636292, 624001, 613836, 605246, 598673, 595015, 594084, 594524, 595498, 597673, 602152, 608950, 616967, 625104, 632956, 640557, 647828, 654389, 659807, 663853, 666427, 667234, 665802, 661999, 656339, 649502, 641660, 632590, 622493, 612431, 603912, 598073, 595093, 594131, 593929, 593812, 594135, 595627, 598477, 602401, 607402, 613927, 622187, 631811, 642387, 653919, 666425, 679268, 691277, 701559, 710125, 717729, 725087, 732144, 738146, 742581, 745968, 749426, 753448, 757336, 759863, 760230, 758377, 754681, 749531, 743023, 735033, 725731, 715891, 706412, 697668, 689778, 683338, 679145]
51672F79145k058j028p67k62L59p5j851l727m531m348l700k631j291n02p75j389
51656F50569j247k45R67K115L381M697N755O595P343P544O545M557K550J022m99
51641G01649k494m703o569p992r245j0345j0807j0073q225o261n347n527n621
51628F08440m714l459l103l633l797l033k358k897m294n205m962m091l416l212
51614E56266l221l104k726k136j420o00K28Q26J098J299J671J955J707J114R55
51599E53912J554K303K557K601L278M902O905Q527R457R855R913R626Q915Q031
51585F42336P584Q011R036R982J0644J1439J2784J4696J7150K0329K4262K8561
51573H16814L2723L6397L9294M1383M3427M6683N1513N6649O0390O2260O3054
$$ y = [679145, 677087, 676059, 675292, 675030, 675389, 675314, 673463, 669736, 665205, 660857, 657157, 654526, 653235, 652733, 651958, 650569, 649322, 649077, 650044, 652159, 655540, 660237, 665992, 672587, 679930, 687474, 694019, 698576, 701126, 702148, 701649, 699155, 694452, 687883, 679891, 670646, 660301, 649494, 639421, 631196, 624935, 619588, 614061, 608440, 603726, 600267, 597164, 593531, 589734, 586701, 584343, 581446, 577152, 571947, 566985, 562894, 559478, 556266, 553045, 549941, 547215, 545079, 543659, 543059, 543287, 544113, 545211, 546510, 548181, 550136, 551843, 552957, 553912, 555466, 557769, 560326, 562927, 566205, 571107, 578012, 586539, 595996, 605851, 615764, 625390, 634305, 642336, 649920, 657931, 666967, 676949, 687593, 699032, 711816, 726512, 743662, 763991, 788253, 816814, 849537, 885934, 925228, 966611, 1010038, 1056721, 1108234, 1164883, 1225273, 1287533, 1350587]
51562A350587O3691O4704O6543O9454P2931P5809P7132P6479P3437O7323N7755
51551B115845M5125L0298J4003l330k1420l9927n8166p4869q8502r8041j03428
51540A717588j05334j04557j01606r6606q9616q1091p1989o3152n4777m6681l8996
51529H63183l2213k6628k2126j8466j5410j2589r697o904m719l318k355j460n38
51516G06760M57J512K209J961P96n40j559k633m198n946p280q228r242j0312j0890
51501F52867j0650r877r133q870r205r655r257p507n160l517k939k592j728n87
51487E62190J73L93L27J59m5j79k94o93j506k371k835k913k949l117l353l564
51471E39423l631l380k904k660k864k993k462j594j273j618j704q55L73R44O97
$$ y = [1350587, 1414278, 1478982, 1545525, 1614979, 1687910, 1763719, 1840851, 1917330, 1990767, 2058090, 2115845, 2160970, 2191268, 2205271, 2201941, 2180521, 2140594, 2082428, 2007559, 1919057, 1821016, 1717588, 1612254, 1507697, 1406091, 1309485, 1219869, 1138778, 1066789, 1003637, 948860, 902179, 863183, 830970, 804342, 782216, 763750, 748340, 735751, 726054, 719150, 714431, 711113, 708758, 707298, 706760, 707217, 708729, 710938, 712899, 713695, 713155, 711596, 708963, 704765, 698819, 691539, 683311, 674069, 663757, 652867, 642217, 632340, 623207, 614337, 605132, 595477, 586220, 578713, 573553, 570036, 567097, 564505, 562777, 562190, 562363, 562756, 563083, 563242, 563197, 563018, 562724, 562031, 560525, 558154, 555319, 552406, 549457, 546340, 542987, 539423, 535792, 532412, 529508, 526848, 523984, 520991, 518529, 516935, 515662, 514044, 512340, 511485, 511858, 512802, 513499]
51456E13499N04J237K861M506N245M962M582N216O984Q977J0492J1838J3654J5985
51442F10542J8464K0951K3230K4424K3534K0656J6992J3602J0726Q403O832N716
51430H04072L963P46l423p213r786j1098j1263j0317q740p526p308p676p583o319
51416G10529l978j148J604L875N358N904N742N378N103M727M017L229K849K795
51402G55984K377J238q7p31m38M87J761L376N327P505R892J2639J5906J9768K4210
51387H59214K9154L4533M0453M7144N4686O2876P1435Q0117Q8575R6428J03618
51376A568233J10237J15652J18170J16110J09129R8113Q4060O7478M8714K8116
51366B464012N903j7497m0732o1778p9237r3124j04059j12075j16564j17203j14553
$$ y = [513499, 514003, 515240, 518101, 522607, 527852, 532814, 537396, 542612, 549596, 558573, 569065, 580903, 594557, 610542, 629006, 649957, 673187, 697611, 721145, 741801, 758793, 772395, 783121, 791524, 798356, 804072, 808035, 808781, 805358, 798145, 788359, 777261, 765998, 755681, 746941, 739415, 732107, 724431, 716848, 710529, 706551, 705403, 707007, 710882, 716240, 722144, 727886, 733264, 738367, 743094, 747111, 750340, 753189, 755984, 758361, 759599, 759512, 758781, 758343, 758830, 760591, 763967, 769294, 776799, 786691, 799330, 815236, 835004, 859214, 888368, 922901, 963354, 1010498, 1065184, 1128060, 1199495, 1279612, 1368187, 1464615, 1568233, 1678470, 1794122, 1912292, 2028402, 2137531, 2235644, 2319704, 2387182, 2435896, 2464012, 2469915, 2452418, 2411686, 2349908, 2270671, 2177547, 2073488, 1961413, 1844849, 1727646, 1613093]
51355A613093j09659j03224r5269q5728p5334o5672n7938n1808m5970l9788l3981
51344H48722k9485k6264k3559k1039j9040j7778j6791j5403j3500j1594j0147
51333F44122r057p917o666n645m998m391l533k695k320k305k148j693j239r02
51319E88613m14L71J178J737K142K542K870L099L384L709L759L355K780K389K174
51304F23688J967J770J555J068K32n42q93j181k135l832n472o263o210n972o104
51289E91676o505o482n419l440j353J76J185K043K867L573M212M842N232N137
51275E97744M793M650M681M465L913L442L268L132K918L055L834M715M848M142
51261F53600L325K877K385J165p62k630l757m149m272m529n085n941o877p348
$$ y = [1613093, 1503434, 1400210, 1304941, 1219213, 1143879, 1078207, 1020269, 968461, 922491, 882703, 848722, 819237, 792973, 769414, 748375, 729335, 711557, 694766, 679363, 665863, 654269, 644122, 635065, 627148, 620482, 614837, 609839, 605448, 601915, 599220, 596900, 594595, 592447, 590754, 589515, 588613, 588199, 588570, 589748, 591485, 593627, 596169, 599039, 602138, 605522, 609231, 612990, 616345, 619125, 621514, 623688, 625655, 627425, 628980, 630048, 630280, 629738, 628845, 627664, 625529, 621697, 616225, 609962, 603752, 597780, 591676, 585171, 578689, 573270, 569830, 568477, 568653, 569838, 571881, 574748, 578321, 582533, 587375, 592607, 597744, 602537, 607187, 611868, 616333, 620246, 623688, 626956, 630088, 633006, 636061, 639895, 644610, 649458, 653600, 656925, 659802, 662187, 663352, 662590, 659960, 656203, 652054, 647782, 643253, 638168, 632227, 625350, 618002]
51247F18002o839n400l622k017p15J53K09n84j490j699j359j298j696j708o90
51232E89247Q48K013K790L856N295O257O099N363N242O285P888Q908Q560O860
51218F65511M473K154K49j327k712l874m880n981p201q022p937p151o328n697
51204F11277m924l902l055k546j823m06J251K276K460K257J950J592J580K521
51190F10508M233N624N907N459N096N042N003M869M826M891M864M656M334L849
51176F79161L042J908O66m44j352k176l114m243n301n863n765n218m471l622k773
51161F40435k078j518r64n89q42j782k848l523l930m460n163n814o280o450o135
51146E88059n475n060n240n536n220m248l158k302j682j315j138p76O2J019J547
$$ y = [618002, 611163, 605763, 602141, 600124, 599409, 599562, 599771, 599187, 597697, 595998, 594639, 593341, 591645, 589937, 589247, 590095, 592108, 594898, 598754, 604049, 610306, 616405, 621768, 627010, 633295, 641183, 650091, 658651, 665511, 669984, 672138, 672387, 671060, 668348, 664474, 659594, 653613, 646412, 638390, 630453, 623302, 616974, 611277, 606353, 602451, 599396, 596850, 595027, 594621, 595872, 598148, 600608, 602865, 604815, 606407, 607987, 610508, 614741, 620365, 626272, 631731, 636827, 641869, 646872, 651741, 656567, 661458, 666322, 670978, 675312, 679161, 682203, 684111, 684777, 684333, 682981, 680805, 677691, 673448, 668147, 662284, 656519, 651301, 646830, 643208, 640435, 638357, 636839, 635875, 635286, 634444, 632662, 629814, 626291, 622361, 617901, 612738, 606924, 600644, 594194, 588059, 582584, 577524, 572284, 566748, 561528, 557280, 554122, 551820, 550138, 548823, 547685, 546909, 546971, 547990, 549537]
51131E49537J738K194L076L993M687N223N485N207M615M354M598M818M590M020
51117F08135L229K091P40k92q37j341k121k840l113l061k895k537k093k106k757
51102E88202l276k826j610n15L9K76L98M43O90J474K532L214L411L710M440N048
51086F05650M801L767K750K340K342K114J344L12m47o38k86M81J444K241K630
51071F30845K858L385M180M711M774M901N561O336O330N277L854K958K876L110
51057F91956K865J814L92q27j904l202m364m419l207j837j194p34L99J777K282
51042F79797J942J927K761L658L863L673L786M449N548O907Q084Q481Q030P212
51028G50118O204M664K573N88r90k774n170p351q208p852p334p073o487n105l222
$$ y = [549537, 551275, 553469, 556545, 560538, 565225, 570448, 575933, 581140, 585755, 590109, 594707, 599525, 604115, 608135, 611364, 613455, 614195, 613903, 613066, 611725, 609604, 606764, 603651, 600590, 597695, 595158, 593065, 590959, 588202, 584926, 582100, 580490, 579975, 580014, 580290, 580688, 581131, 581821, 583295, 585827, 589041, 592452, 596162, 600602, 605650, 610451, 614218, 616968, 619308, 621650, 623764, 625108, 625420, 624973, 624335, 624049, 624530, 625974, 628215, 630845, 633703, 637088, 641268, 645979, 650753, 655654, 661215, 667551, 673881, 679158, 683012, 685970, 688846, 691956, 694821, 696635, 697027, 696200, 694296, 691094, 686730, 682311, 679104, 677267, 676073, 675339, 675738, 677515, 679797, 681739, 683666, 686427, 690085, 693948, 697621, 701407, 705856, 711404, 718311, 726395, 734876, 742906, 750118, 756322, 760986, 763559, 764147, 763157, 760383, 755213, 747862, 739654, 731802, 724468, 717395, 710908, 705803, 702581]
51013G02581j289O17K537M364O083P852R578J0840J1466J1849J2439J3177J3674
51000H05768J3666J3027J1555R183O384L978K434J472N15o59j792k582l025l285
50986H56639l359k995j887P8K675N323P385Q751J0157J2586J6184J9934K2652
50973I54123K4119K5066K6227K7625K8745K9068K8440K7187K6034K5729K6513
50962A248876K7978K9481L0742L1989L3507L5053L5878L5470L4275L3274L2761
50951A609284L1788K9246K5334K1517J8990J7565J6200J4283J2121J0347R178
50940A815853Q190O612L895K06l649o915r535j1975j4609j7418k0310k3360k6551
50927A700434k9487l1667l3037l4072l5250l6566l7652l8276l8601l8917l9176
$$ y = [702581, 701292, 701909, 704446, 708810, 714893, 722745, 732323, 743163, 754629, 766478, 778917, 792094, 805768, 819434, 832461, 844016, 853199, 859583, 863561, 865995, 867467, 867982, 867323, 865531, 862949, 859924, 856639, 853280, 850285, 848398, 848476, 851151, 856474, 863859, 872610, 882767, 895353, 911537, 931471, 954123, 978242, 1003308, 1029535, 1057160, 1085905, 1114973, 1143413, 1170600, 1196634, 1222363, 1248876, 1276854, 1306335, 1337077, 1369066, 1402573, 1437626, 1473504, 1508974, 1543249, 1576523, 1609284, 1641072, 1670318, 1695652, 1717169, 1736159, 1753724, 1769924, 1784207, 1796328, 1806675, 1815853, 1824043, 1830655, 1834550, 1834756, 1831107, 1824192, 1814657, 1802682, 1788073, 1770655, 1750345, 1726985, 1700434, 1670947, 1639280, 1606243, 1572171, 1536921, 1500355, 1462703, 1424427, 1385826, 1346909, 1307733]
50916A307733l8930l7792l5923l3946l2343l1056k9703k8041k6021k3607k0842
50905I69529j8063j5699j3761j1811r730q111p542p672p430o220m537l294k879
50892H52780l013l167k885j934n02Q70J721K023J989J751J476J577K369L546M398
50877H62999M658M765N183N805O254O520O914P555Q238Q883R726J0942J2181J2878
50863I73501J2985J3209J4320J6316J8518K0532K2728K5605K8984L2317L5600
50852A214615L9366M3722M8004N1765N5550O0128O5392P0627P5553Q0297Q4429
50841A889448Q7014Q7968Q8448Q9345Q9894Q8496Q4482P8394P0801O1801N1723
50830B767814M1508L1972K3167J4828P014N5n811j0384j3364j4620j4536j3833
$$ y = [1307733, 1268803, 1231011, 1195088, 1161142, 1128799, 1097743, 1068040, 1039999, 1013978, 990371, 969529, 951466, 935767, 922006, 910195, 900465, 892354, 884812, 877140, 869710, 863490, 858953, 855659, 852780, 849767, 846600, 843715, 841781, 841279, 842149, 843870, 845893, 847882, 849633, 851109, 852686, 855055, 858601, 862999, 867657, 872422, 877605, 883410, 889664, 896184, 903098, 910653, 918891, 927774, 937500, 948442, 960623, 973501, 986486, 999695, 1014015, 1030331, 1048849, 1069381, 1092109, 1117714, 1146698, 1179015, 1214615, 1253981, 1297703, 1345707, 1397472, 1453022, 1513150, 1578542, 1649169, 1724722, 1805019, 1889448, 1976462, 2064430, 2152878, 2242223, 2332117, 2420613, 2505095, 2583489, 2654290, 2716091, 2767814, 2809322, 2841294, 2864461, 2879289, 2886303, 2886358, 2880547, 2870163, 2856799, 2842179, 2827643, 2813810]
50818B813810j3072j2534j2370j2646j3389j4781j7217k0958k5885l1746l8387
50807B600825m5490n2349n8322o3423o8008p1947p4520p5196p4098p1636o8051
50796A877785o3496n8113n1902m4793l7089k9539k2672j6353j0279m701k42K855
50784A541461M918O356P329P888Q054P665O441M395K030j19k025m115o690r528
50770A574060j2101j4188j6097j8290k0794k3185k5063k6397k7342k7952k8212
50759A334439k8133k7657k6625k5028k3174k1333j9351j6902j4071j1381r194
50748A111590p388n637l725j547R60L710O495R200J1883J4598J7335K0115K3009
50735A200598K6046K9309L2977L6968M0607M3213M5095M7385N0520N3461N4808
$$ y = [2813810, 2800738, 2788204, 2775834, 2763188, 2749799, 2735018, 2717801, 2696843, 2670958, 2639212, 2600825, 2555335, 2502986, 2444664, 2381241, 2313233, 2241286, 2166766, 2091570, 2017472, 1945836, 1877785, 1814289, 1756176, 1704274, 1659481, 1622392, 1592853, 1570181, 1553828, 1543549, 1538848, 1538606, 1541461, 1546379, 1552735, 1560064, 1567952, 1576006, 1583671, 1590112, 1594507, 1596537, 1596418, 1594393, 1590278, 1583588, 1574060, 1561959, 1547771, 1531674, 1513384, 1492590, 1469405, 1444342, 1417945, 1390603, 1362651, 1334439, 1306306, 1278649, 1252024, 1226996, 1203822, 1182489, 1163138, 1146236, 1132165, 1120784, 1111590, 1104202, 1098565, 1094840, 1093293, 1094253, 1097963, 1104458, 1113658, 1125541, 1140139, 1157474, 1177589, 1200598, 1226644, 1255953, 1288930, 1325898, 1366505, 1409718, 1454813, 1502198, 1552718, 1606179, 1660987]
50724A660987N4409N3303N2363N1557N0291M7900M3935L8565L2743K7398K2401
50713B135852J6862J0512M231r35m754p481r180r778r493q739p731o454m875l046
50699B094991j264k99j050l703p530j1809j6505k1625k6447l0173l3100l6258
50687A905228l9756m2264m2397m0113l6444l2350k8231k4062j9428j3647o375
50676A580161J779R634J6501K2677K8808L4997M0656M5130M8254N0280N1362N1311
50664A981550M9895M7234M3697L9517L4737K9557K4471J9939J6046J2580R393
50653B308616O534M144K251P23o45j928l002l721m089m078l315j280K079O107
50639B308396J0071J3846J7809K2064K6098K9235L1284L2594L3560L4324L4788
$$ y = [1660987, 1715396, 1768699, 1821062, 1872619, 1922910, 1970810, 2014745, 2053310, 2086053, 2113451, 2135852, 2152714, 2163226, 2167457, 2166522, 2161768, 2154287, 2145107, 2135329, 2125836, 2117097, 2109366, 2102912, 2098037, 2094991, 2093727, 2093428, 2092378, 2088675, 2081145, 2069336, 2052831, 2031206, 2004759, 1974586, 1941486, 1905228, 1865472, 1823208, 1780811, 1740698, 1704254, 1671904, 1643673, 1619611, 1600183, 1586536, 1580161, 1581940, 1591574, 1608075, 1630752, 1659560, 1694557, 1735213, 1780343, 1828597, 1878877, 1930239, 1981550, 2031445, 2078679, 2122376, 2161893, 2196630, 2226187, 2250658, 2270597, 2286643, 2299223, 2308616, 2315150, 2319294, 2321545, 2322268, 2321623, 2319695, 2316693, 2312972, 2308883, 2304805, 2301490, 2300210, 2302289, 2308396, 2318467, 2332313, 2350122, 2372186, 2398284, 2427519, 2458803, 2491397, 2524957, 2559281, 2594069]
50628B594069L4649L3221K9551K3026J4009L660o790j6425k4573l0915l5729l9501
50616B578252m1947m1882l8558l2859k6662k1210j6573j2466q963o361m954n005
50604B320812o550r172j2432j6534k1955k8372l4603l9835m4328m8648n2730n6065
50592A949588n8279n9118n8368n6324n3901n1787m9720m7098m3830m0114l5799
50581A395250l0840k6079k2622k0364j7949j4506j0687p642n459l175p2L545O849
50568A246249R409J1493J3609J5928J8254K0480K2777K5335K8142L1199L4592
50557A477467L8168M1360M3721M5358M6521M7046M6655M5622M4521M3338M1391
50546A961168L8258L4390L0730K7976K6261K5198K4246K3378K3294K4657K7206
$$ y = [2594069, 2628718, 2661939, 2691490, 2714516, 2728525, 2732185, 2725395, 2708970, 2684397, 2653482, 2617753, 2578252, 2536305, 2494423, 2455865, 2423006, 2396344, 2375134, 2358561, 2346095, 2337132, 2330771, 2325817, 2320812, 2314262, 2305090, 2292658, 2276124, 2254169, 2225797, 2191194, 2151359, 2107031, 2058383, 2005653, 1949588, 1891309, 1832191, 1773823, 1717499, 1663598, 1611811, 1562091, 1514993, 1471163, 1431049, 1395250, 1364410, 1338331, 1315709, 1295345, 1277396, 1262890, 1252203, 1244561, 1239102, 1235927, 1235855, 1239400, 1246249, 1255658, 1267151, 1280760, 1296688, 1314942, 1335422, 1358199, 1383534, 1411676, 1442875, 1477467, 1515635, 1556995, 1600716, 1646074, 1692595, 1739641, 1786296, 1831918, 1876439, 1919777, 1961168, 1999426, 2033816, 2064546, 2092522, 2118783, 2143981, 2168227, 2191605, 2214899, 2239556, 2266762]
50535B266762L0107L3079L6524M0515M4442M7956N1624N6163O1425O6607P1155
50524B806359P5085P8598Q1723Q4247Q5754Q5869Q4508Q1664P6965O9890O0559
50513C671221M9750L7913K4710R930n597k0638l4662m7709n9484o9334p6929q2294
50501C396877q5109q4711q0952p4544o6351n6745m5816l3796k1089q293L576J3245
50489B856292J9955K3834K5186K3648J8385R107l411j7760l2595m6934o0125p1741
50477B743841q1492q9088r4247r6807r6835r4621r0603q5245p8922p1873o4372
50466A799736n6920n0196m4511l9459l4293k8801k3685j9910j7779j6785j6300
50455A451097j6099j6194j6437j6585j6727j7289j8429j9478j9350j7698j5428
$$ y = [2266762, 2296869, 2329948, 2366472, 2406987, 2451429, 2499385, 2551009, 2607172, 2668597, 2735204, 2806359, 2881444, 2960042, 3041765, 3126012, 3211766, 3297635, 3382143, 3463807, 3540772, 3610662, 3671221, 3720971, 3758884, 3783594, 3793524, 3787927, 3767289, 3732627, 3684918, 3625434, 3556100, 3479171, 3396877, 3311768, 3227057, 3146105, 3071561, 3005210, 2948465, 2902649, 2868853, 2847764, 2839471, 2843047, 2856292, 2876247, 2900081, 2925267, 2948915, 2967300, 2976407, 2972996, 2955236, 2922641, 2875707, 2815582, 2743841, 2662349, 2573261, 2479014, 2382207, 2285372, 2190751, 2100148, 2014903, 1935981, 1864108, 1799736, 1742816, 1692620, 1648109, 1608650, 1574357, 1545556, 1521871, 1501961, 1484182, 1467397, 1451097, 1434998, 1418804, 1402367, 1385782, 1369055, 1351766, 1333337, 1313859, 1294509, 1276811, 1261383]
50444A261383j3805j3042j2195j0444p994n464l021o40J202J937J944K369L696
50431A205926N212O209P072Q611J0775J2749J4191J5620J7534J9639K1337K2658
50419A367533K4244K6445K8824L0843L2850L5803L9934M4129M7164M9166N1301
50408A778236N4096N6779N8377N8739N8172N6665N4066N0585M6613M2171L6979
50397B351478L0950K4220J6762Q388q78j0515j9730k7839l4663m0505m5636m9739
50385B202293n2162n2663n1509m8762m4094l7567k9991k2110j3945n495K377Q526
50373A854898J2624J5041J5802J4446J0845N496j104q717j6991k5358l3436m1030
50361A802516m7642n2497n5276n6473n6807n6614n5897n4569n2435m9305m5372
$$ y = [1261383, 1247578, 1234536, 1222341, 1211897, 1203903, 1198439, 1195418, 1194778, 1195980, 1197917, 1199861, 1202230, 1205926, 1211138, 1217347, 1224419, 1233030, 1243805, 1256554, 1270745, 1286365, 1303899, 1323538, 1344875, 1367533, 1391777, 1418222, 1447046, 1477889, 1510739, 1546542, 1586476, 1630605, 1677769, 1726935, 1778236, 1832332, 1889111, 1947488, 2006227, 2064399, 2121064, 2175130, 2225715, 2272328, 2314499, 2351478, 2382428, 2406648, 2423410, 2431798, 2430920, 2420405, 2400675, 2372836, 2338173, 2297668, 2252032, 2202293, 2150131, 2097468, 2045959, 1997197, 1953103, 1915536, 1885545, 1863435, 1849490, 1843995, 1846372, 1854898, 1867522, 1882563, 1898365, 1912811, 1923656, 1929152, 1928048, 1919331, 1902340, 1876982, 1843546, 1802516, 1754874, 1702377, 1647101, 1590628, 1533821, 1477207, 1421310, 1366741, 1314306, 1265001, 1219629]
50350A219629m1295l7648l4481l1434k8232k4982k2028j9533j7263j4951j2842
50339I34940j1400j0350q694o081l552k262j907j352l04O20J248K086L147L791
50325H99930L958M424N458O278O347O224O411O402N655M676M242M195L958L641
50311I71799L663L782L500L106L237L701L790L586L804M390M459L758L138L175
50297A022888L350L088K680K634K754K607K252J893J263L0j533k947m271n766
50283A030922p092p588p294o910o688o136n049m119l929l901k980j134N19J169
50269I69790J268J790L022M524N844O797P107O500N251M165L694L454K848J877
50255A027931R63K50m19j015j309j426j863k778l663m061m294n058o416p583p779
$$ y = [1219629, 1178334, 1140686, 1106205, 1074771, 1046539, 1021557, 999529, 979996, 962733, 947782, 934940, 923540, 913190, 904496, 898415, 894863, 892601, 890694, 889342, 889038, 889658, 890906, 892992, 896139, 899930, 903888, 908312, 913770, 920048, 926395, 932619, 939030, 945432, 951087, 955763, 960005, 964200, 968158, 971799, 975462, 979244, 982744, 985850, 989087, 992788, 996578, 1000164, 1003968, 1008358, 1012817, 1016575, 1019713, 1022888, 1026238, 1029326, 1032006, 1034640, 1037394, 1040001, 1042253, 1044146, 1045409, 1045439, 1043906, 1040959, 1036688, 1030922, 1023830, 1016242, 1008948, 1002038, 995350, 989214, 984165, 980046, 976117, 972216, 969236, 968102, 968621, 969790, 971058, 972848, 975870, 980394, 986238, 993035, 1000142, 1006642, 1011893, 1016058, 1019752, 1023206, 1026054, 1027931, 1028894, 1029144, 1028725, 1027710, 1026401, 1024975, 1023112, 1020334, 1016671, 1012610, 1008316, 1003258, 996842, 989259, 981480]
50240I81480o969n683m387l280k460j960j567r38L4J094K019K885L855M888N886
50225I74897O881P817Q343Q190P653P253O952O195M761L100J575Qj840l747n470
50210A032568p249r314j1228j2340j2773j3296j4237j5038j5065j4361j3438j2641
50198H81588j1919j0998r700q211o992o199n327l868k135r33l75K66J367K252
50184H18816K197J544J274J824K915M232N596O499O356N401M771N260O471P455
50170H80611P851P877P623P004O391O515P462Q291Q074P085O455O814P712Q349
50156I84114Q412Q118P797P740Q114Q755R192R105Q654Q132P496O425M812K884
50142A089750Q90j167l387n706p759r018r190q635q200q440r082r451r322r086
$$ y = [981480, 974511, 968828, 964441, 961161, 958701, 956741, 955174, 954236, 954270, 955364, 957383, 960268, 964123, 969011, 974897, 981778, 989595, 997938, 1006128, 1013781, 1021034, 1027986, 1034181, 1038942, 1042042, 1043617, 1043625, 1041785, 1038038, 1032568, 1025319, 1016005, 1004777, 992437, 979664, 966368, 952131, 937093, 922028, 907667, 894229, 881588, 869669, 858671, 848971, 840760, 833768, 827569, 822242, 818374, 816239, 815306, 814931, 815197, 816564, 818816, 821013, 822557, 823831, 825655, 828570, 832802, 838398, 844897, 851253, 856654, 861425, 866685, 873156, 880611, 888462, 896339, 903962, 910966, 917357, 923872, 931334, 939625, 947699, 954784, 961239, 968053, 975765, 984114, 992526, 1000644, 1008441, 1016181, 1024295, 1033050, 1042242, 1051347, 1060001, 1068133, 1075629, 1082054, 1086866, 1089750, 1090640, 1089473, 1086086, 1080380, 1072621, 1063603, 1054413, 1045778, 1037578, 1029138, 1020056, 1010605, 1001283, 992197]
50128I92197r169r519r776r693r296q748q145p495o865o474o352n947m503k089
50114H88126J41J109J033R84J508K272K914L496L999M051L561L016K793K601K093
50099I23697J605J658J918J423l8j334j232J12J330J524J327K027L935O134P756
50084I51842Q899J0036J1131J1968J2901J4439J6242J7394J7816J8492J9994K1679
50072A132833K2866K4083K6334K9622L3087L6286L9392M2216M3974M4345M4062
50061A519100M4013M4199M3990M3135M2124M1587M1619M1749M1466M0680L9585
50050A983247L8094L5584L1360K5260J7649R045m6r012j7327k4892l1995l8818
50038B018149m4967m9494n1368n0202m6762m2541l8563l4681l0224k5137k0127
$$ y = [992197, 983028, 973509, 963733, 954040, 944744, 935996, 927851, 920356, 913491, 907017, 900665, 894718, 890215, 888126, 888267, 889376, 890409, 891393, 892901, 895173, 898087, 901583, 905582, 909633, 913194, 916210, 919003, 921604, 923697, 925302, 926960, 928878, 930301, 930263, 928929, 927697, 927809, 929139, 930663, 931990, 934017, 937952, 944086, 951842, 960741, 970777, 981908, 993876, 1006777, 1021216, 1037458, 1054852, 1072668, 1091160, 1111154, 1132833, 1155699, 1179782, 1206116, 1235738, 1268825, 1305111, 1344503, 1386719, 1430693, 1475038, 1519100, 1563113, 1607312, 1651302, 1694437, 1736561, 1778148, 1819767, 1861516, 1902982, 1943662, 1983247, 2021341, 2056925, 2088285, 2113545, 2131194, 2140239, 2140193, 2131181, 2113854, 2088962, 2056967, 2018149, 1973182, 1923688, 1872320, 1822118, 1775356, 1732815, 1694252, 1659571, 1629347, 1604210, 1584083]
50027A584083j5817j2241r174o605m722l667l360l483l648l771m123m882n972
50014A502618p558j0209j3971j7647j9829k0538k1024k1875k2342k1721k0422
50003A305482j9002j6998j3572q924m160N7M046Q305J2791J7016K0415K2559K3376
49990A351391K3242K2653K1742K0359J8453J6175J3586J0571P086L384N6k245
49978A506453l343l872m686n795o307n592m037k277k59K286M940P012Q685J0909
49964A504117J4140J7849K1386K4695K8046L1684L5841M0658M5887N1216N6935
49953A872454O3643P1158P8299Q4127Q8826R3004R6567R8754R8951R7146R3859
49942B836788Q9924Q6048Q2197P7690P2106O5822N9495N3282M6862L9728L1167
$$ y = [1584083, 1568266, 1556025, 1546851, 1540246, 1535524, 1531857, 1528497, 1525014, 1521366, 1517595, 1513472, 1508590, 1502618, 1495060, 1484851, 1470880, 1453233, 1433404, 1412866, 1391842, 1369967, 1347625, 1325904, 1305482, 1286480, 1269482, 1255910, 1246986, 1242826, 1242883, 1246929, 1255234, 1268025, 1285041, 1305456, 1328015, 1351391, 1374633, 1397286, 1419028, 1439387, 1457840, 1474015, 1487601, 1498172, 1505258, 1508642, 1508698, 1506453, 1503110, 1499238, 1494552, 1488757, 1482450, 1476858, 1472821, 1470544, 1470285, 1472571, 1477511, 1484523, 1493208, 1504117, 1518257, 1536106, 1557492, 1582187, 1610233, 1641917, 1677758, 1718416, 1764303, 1815519, 1872454, 1936097, 2007255, 2085554, 2169681, 2258507, 2351511, 2448078, 2546832, 2645783, 2742929, 2836788, 2926712, 3012760, 3094957, 3172647, 3244753, 3310575, 3370070, 3423352, 3470214, 3509942, 3541109]
49931C541109K0466P640o360k0581l4904m9467o3681p6517q7574r7156j05344
49920C027631j11578j15272j16343j15097j11955j07430j02015r6018q9631q3038
49910A979254p6157o8530n9939n1064m2926l5748k8839k1630j4292p291q66M821
$$ y = [3541109, 3561575, 3569215, 3562855, 3542274, 3507370, 3457903, 3394222, 3317705, 3230131, 3132975, 3027631, 2916053, 2800781, 2684438, 2569341, 2457386, 2349956, 2247941, 2151923, 2062292, 1979254, 1903097, 1834567, 1774628, 1723564, 1680638, 1644890, 1616051, 1594421, 1580129, 1572838, 1571972, 1576793]
$$ [...]
##END NTUPLES=NMR SPECTRUM
##END=
