##TITLE=AC1551_ROEFFECT0015_8269012_wAONcqBkeU
##JCAMPDX= 6.0         $$ Bruker NMR JCAMP-DX V2.0
##DATA TYPE= NMR SPECTRUM
##DATA CLASS= NTUPLES
##ORIGIN= BRUKER
##OWNER= Administrator
$$ 1.72 TOPSPIN		Version 2.1
$$ 2013-10-11 23:12:29.074 -0700  Administrator@X
$$ Compression mode = diff/dup
##.OBSERVE FREQUENCY= 400.02188249412
##.OBSERVE NUCLEUS= ^1H
##.ACQUISITION MODE= SIMULTANEOUS (DQD)
##.ACQUISITION SCHEME= undefined
##.AVERAGES= 8
##.DIGITISER RES= 22
##SPECTROMETER/DATA SYSTEM= spect
##.PULSE SEQUENCE= zg30
##.SOLVENT NAME= COFFEE_meoh
##.SHIFT REFERENCE= INTERNAL, COFFEE_meoh, 1, 14.98509
##AUDIT TRAIL= $$ (NUMBER, WHEN, WHO, WHERE, PROCESS, VERSION, WHAT)
$$ ##TITLE= Audit trail, TOPSPIN		Version 2.1
$$ ##JCAMPDX= 5.01
$$ ##ORIGIN= Bruker BioSpin GmbH
$$ ##OWNER= Administrator
$$ $$ E:\/data/COFFEE/nmr/AC1551_ROEFFECT0015_8269012_wAONcqBkeU/10/pdata/1/auditp.txt
$$ ##AUDIT TRAIL=  $$ (NUMBER, WHEN, WHO, WHERE, PROCESS, VERSION, WHAT)
(   1,<2013-10-11 23:12:22.371 -0700>,<Administrator>,<X>,<go>,<TOPSPIN 2.1>,
      <created by zg
	started at 2013-10-11 23:11:16.590 -0700,
	POWCHK enabled, PULCHK disabled,
       configuration hash MD5:
       C8 4E 4E 5D D3 5C D8 9E 9F 52 82 E0 59 8A DE 15
       data hash MD5: 64K
       6D C5 B6 16 5C A5 37 9B EC 89 3F 3E 92 85 90 F7>)
(   2,<2013-10-11 23:12:25.308 -0700>,<Administrator>,<X>,<proc1d>,<TOPSPIN 2.1>,
      <Start of raw data processing
       efp LB = 0 FT_mod = 6 PKNL = 1 PHC0 = 0 PHC1 = 0 SI = 32K 
       data hash MD5: 32K
       9F 6C 6D 7E 2E 0F 5A 66 59 E8 01 9D B7 28 B1 53>)
(   3,<2013-10-11 23:12:25.605 -0700>,<Administrator>,<X>,<proc1d>,<TOPSPIN 2.1>,
      <pk PHC0 = 94.91089 PHC1 = 0 
       data hash MD5: 32K
       08 FD 46 FA 65 EF 07 EC 59 32 E1 2B A1 A6 6C 20>)
(   4,<2013-10-11 23:12:25.715 -0700>,<Administrator>,<X>,<proc1d>,<TOPSPIN 2.1>,
      <abs ABSG = 1 
       data hash MD5: 32K
       BE D9 39 D4 8E 72 AA E5 6E FE 47 D9 06 34 FC 06>)
(   5,<2013-10-11 23:12:25.793 -0700>,<Administrator>,<X>,<proc1d>,<TOPSPIN 2.1>,
      <abs ABSG = 2 
       data hash MD5: 32K
       F6 C4 B1 91 CC 9F 85 3C 41 7A 46 BB EC 7E 65 A4>)
(   6,<2013-10-11 23:12:25.840 -0700>,<Administrator>,<X>,<proc1d>,<TOPSPIN 2.1>,
      <abs ABSG = 3 
       data hash MD5: 32K
       F3 B8 DE A9 1E B6 37 06 BB 03 0D D9 12 EC EB D6>)
(   7,<2013-10-11 23:12:25.887 -0700>,<Administrator>,<X>,<proc1d>,<TOPSPIN 2.1>,
      <abs ABSG = 4 
       data hash MD5: 32K
       91 B5 55 6E 94 3A BC 57 18 0A 47 BD D9 19 AE 70>)
(   8,<2013-10-11 23:12:25.933 -0700>,<Administrator>,<X>,<proc1d>,<TOPSPIN 2.1>,
      <abs ABSG = 5 
       data hash MD5: 32K
       10 3E 1F AD 91 E5 CB 11 10 FC C2 F5 C9 3D AD 36>)
$$ ##END=
$$ 
$$ $$ hash MD5
$$ $$ FD 5A 55 91 F8 A0 7A FC A7 D6 FA 51 EC 3E 8A 06
##$RELAX= 
##$RELAX= 
##$RELAX= 
##$RELAX= 
##$RELAX= 
##$RELAX= 
##$RELAX= 
$$ Bruker specific parameters
$$ --------------------------
##$DU= <E:\>
##$EXPNO= 10
$$ [...]
150 150 150 150 150 150 150 150
##$TP07= 0
##$TPNAME0= <>
##$TPNAME1= <>
##$TPNAME2= <>
##$TPNAME3= <>
##$TPNAME4= <>
##$TPNAME5= <>
##$TPNAME6= <>
##$TPNAME7= <>
##$TPOAL= (0..7)
0.5 0.5 0.5 0.5 0.5 0.5 0.5 0.5
##$TPOFFS= (0..7)
0 0 0 0 0 0 0 0
##$TUNHIN= 0
##$TUNHOUT= 0
##$TUNXOUT= 0
##$USERA1= <user>
##$USERA2= <user>
##$USERA3= <user>
##$USERA4= <user>
##$USERA5= <user>
##$V9= 5
##$VALIST= <valist>
##$VCLIST= <CCCCCCCCCCCCCCC>
##$VD= 0
##$VDLIST= <DDDDDDDDDDDDDDD>
##$VPLIST= <PPPPPPPPPPPPPPP>
##$VTLIST= <TTTTTTTTTTTTTTT>
##$WBST= 1024
##$WBSW= 4
##$XGAIN= (0..3)
0 0 0 0
##$XL= 0
##$YL= 0
##$YMAX_a= 647365
##$YMIN_a= -549299
##$ZGOPTNS= <>
##$ZL1= 120
##$ZL2= 120
##$ZL3= 120
##$ZL4= 120
##$ABSF1= 14.98509
##$ABSF2= -5.573092
##$ABSG= 5
##$ABSL= 3
##$ALPHA= 0
##$AQORDER= 0
##$ASSFAC= 0
##$ASSFACI= 0
##$ASSFACX= 0
##$ASSWID= 0
##$AUNMP= <proc_prof1d_extract_pilot.lims>
##$AXLEFT= 0
##$AXNAME= <>
##$AXNUC= <1H>
##$AXRIGHT= 0
##$AXTYPE= 0
##$AXUNIT= <>
##$AZFE= 0.1
##$AZFW= 0.1
##$BCFW= 0
##$BC_mod= 0
##$BYTORDP= 0
##$COROFFS= 0
##$CY= 15
##$DATMOD= 1
##$DC= 0
##$DFILT= <>
##$DTYPP= 0
##$F1P= 0
##$F2P= 0
##$FCOR= 0.5
##$FTSIZE= 32768
##$FT_mod= 6
##$GAMMA= 0
##$GB= 0
##$INTBC= 1
##$INTSCL= 1
##$ISEN= 128
##$LB= 0
##$LEV0= 0
##$LPBIN= 0
##$MAXI= 10000
##$MC2= 0
##$MEAN= 0
##$ME_mod= 0
##$MI= 0
##$NCOEF= 0
##$NC_proc= -8
##$NLEV= 6
##$NOISF1= 0
##$NOISF2= 0
##$NSP= 0
##$NTH_PI= 0
##$NZP= 0
##$OFFSET= 14.98509
##$PC= 1
##$PHC0= 94.91089
##$PHC1= 0
##$PH_mod= 1
##$PKNL= yes
##$PPARMOD= 0
##$PPDIAG= 0
##$PPIPTYP= 0
##$PPMPNUM= 2147483647
##$PPRESOL= 1
##$PSCAL= 4
##$PSIGN= 0
##$PYNMP= <proc.py>
##$REVERSE= no
##$SF= 400.02
##$SI= 32768
##$SIGF1= 0
##$SIGF2= 0
##$SINO= 400
##$SIOLD= 32768
##$SPECTYP= <>
##$SREGLST= <1H.CDCl3>
##$SSB= 0
##$STSI= 32768
##$STSR= 0
##$SW_p= 8223.68421052631
##$SYMM= 0
##$S_DEV= 0
##$TDeff= 65536
##$TDoff= 0
##$TI= <>
##$TILT= no
##$TM1= 0
##$TM2= 0
##$TOPLEV= 0
##$USERP1= <user>
##$USERP2= <user>
##$USERP3= <user>
##$USERP4= <user>
##$USERP5= <user>
##$WDW= 1
##$XDIM= 32768
##$YMAX_p= 444491589
##$YMIN_p= -727320
##$CURPLOT= <Network HP LaserJet P1505>
##$CURPRIN= <$Network HP LaserJet P1505>
##$DFORMAT= <normdp>
##$LAYOUT= <+/1D_H.xwp>
##$LFORMAT= <normlp>
##$PFORMAT= <normpl>
##$SURQMSG= 1
$$ End of Bruker specific parameters
$$ ---------------------------------
##NTUPLES= NMR SPECTRUM
##VAR_NAME=  FREQUENCY,     SPECTRUM/REAL,   SPECTRUM/IMAG
##SYMBOL=    X,             R,               I
##VAR_TYPE=  INDEPENDENT,   DEPENDENT,       DEPENDENT
##VAR_FORM=  AFFN,          ASDF,            ASDF
##VAR_DIM=   32768,         32768,           32768
##UNITS=     HZ,            ARBITRARY UNITS, ARBITRARY UNITS
##FACTOR=    0.250966925370066, 1,           1
##FIRST=     8223.43324360094, -269976,      -158803
##LAST=      0,             -106300,         -143823
##MIN=       0,             -727320,         0
##MAX=       8223.43324360094, 444491589,    0
$$ Real data points
##PAGE= N=1
##DATA TABLE= (X++(R..R)), XYDATA
$$ [...]
19536I7305a92672A8774h4443j77871a4421j91295A61489n758c48430a11905l1375
$$ 97305 -192672 18774 -84443 -262314 -14421 -205716 161489 155731 -348430 -111905 -143280
19525a43280M4205C14348a20593n1640G4422c11884e1839j07115f6691k63324
$$ -143280 -99075 314348 -120593 -172233 74422 -311884 -51839 -158954 -66691 -330015
19515c30015b8773k17824c6926l39973G7618b91736A08418a29871D53486g8903
$$ -330015 -28773 -246597 -36926 -376899 77618 -291736 108418 -129871 453486 -78903
19504C14J40137a20290H9628B6433a12942q834j11949a5149H1808K6497K4401
$$ 314 140451 -120290 89628 26433 -112942 -121776 -233725 -15149 81808 108305 132706
19493A32706a16836A26964n2605f8121k6422B75131c08197c7329j29150j04793
$$ 132706 -116836 126964 74359 -68121 -94543 275131 -308197 -37329 -166479 -271272
19483b71272A84534c7160E307K8429d4078A0141M7478e3112I9446g8792A89960
$$ -271272 184534 -37160 5307 33736 -44078 10141 57619 -53112 99446 -78792 189960
19471a19812l3353l9893d5604C0087c539j72103A21805g6627r5501N5383B73474
$$ -119812 -153165 -193058 -45604 30087 -3539 -175642 121805 -76627 -172128 -116745 273474
19459H1830J5882J50673k7267D3316f7728E6609e751G3919b02879c5050j55572
$$ 81830 97712 248385 221118 43316 -67728 56609 -5751 73919 -202879 -35050 -190622
19448a90622d4444j76027O7455Q630A49412a8256j6866j22813J9816C61309A2570
$$ -190622 -44444 -220471 -153016 -144386 149412 -18256 -35122 -157935 -138119 361309 12570
19436H0434b89776B90431c88112f0541B51178A5878a72185O1872N0435B9374b46384
$$ 80434 -289776 290431 -388112 -60541 251178 15878 -172185 -110313 -59878 29374 -246384
19424c7104J0625k16368n8649J27951C77922a08431r0361l4812n1909a7002C9821
$$ -37104 -26479 -242847 -301496 -173545 377922 -108431 -198792 -233604 -285513 -17002 39821
19412E4607a34644k66328A3271a36356B63543j11482a67051C3074a41165B68642
$$ 54607 -134644 -400972 13271 -136356 263543 152061 -167051 33074 -141165 268642
19401A11700h3883A58705C3826J8850J77031b66487h4034C1589K20025a19122
$$ 111700 -83883 158705 33826 52676 229707 -266487 -84034 31589 251614 -119122
19390A15208a66073e6886j60518M0175J7046c2589k9066j33343I9897J18905b37634
$$ 115208 -166073 -56886 -217404 -177229 -160183 -32589 -61655 -194998 99897 218802 -237634
19378b03600G04722G2861k3170a91443m38813A3526a14639B3513a03483b4822
$$ -203600 704722 72861 49691 -191443 -630256 13526 -114639 23513 -103483 -24822
19367a91436j52291J37911b9787C2517a14436e4944j5140b5316A16030J0659K56236
$$ -191436 -343727 -205816 -29787 32517 -114436 -54944 -70084 -25316 116030 126689 382925
19356C82925b04783A08196h8638C1825b85100A83369a73697l3347N3351A5443
$$ 382925 -204783 108196 -88638 31825 -285100 183369 -173697 -207044 -153693 15443
19345a80306o8902A71009D6100a75467o5778j06255a11835k73526J10285a24130
$$ -180306 -249208 171009 46100 -175467 -241245 -347500 -111835 -385361 -275076 -124130
19334A17377g6560j62947L6241b3446k75714a1989j63813n0845h2534l8236Q707
$$ 117377 -76560 -239507 -203266 -23446 -299160 -11989 -175802 -226647 -82534 -120770 -112063
19323a12063E6390a0408A23943a31865E0274O9084J83418j32145g769B54680h2935
$$ -112063 56390 -10408 123943 -131865 50274 119358 302776 170631 -7769 254680 -82935
19311c12074D2498J20085d57120B34341c72176Q3523c0643k22215L5380P3855
$$ -312074 42498 162583 -457120 234341 -372176 -288653 -30643 -252858 -217478 -143623
19301a43623E2719J03857b66192e6616k44413F8786c85455B65494F6612c9826
$$ -143623 52719 156576 -266192 -56616 -301029 68786 -385455 265494 66612 -39826
19290D0530h9527j38624q9771R480F4026h5341l76071J57639f2147o1540B20904
$$ 40530 -89527 -228151 -317922 -308442 64026 -85341 -461412 -303773 -62147 -123687 220904
19278h4677A45443e8924k1392A92214a85406Q7242K3590B82508a32203c6692C0984
$$ -84677 145443 -58924 -80316 192214 -185406 -98164 -74574 282508 -132203 -36692 30984
19266A49823A6650b5579A43722f5302l66922a43097A26347h63G574c37370b0788
$$ 149823 16650 -25579 143722 -65302 -432224 -143097 126347 -863 7574 -337370 -20788
19254E2039Q4297b46568n6354I1061H067b10211C59379c20266a52177j18815m9110
$$ 52039 136336 -246568 -302922 91061 8067 -210211 359379 -320266 -152177 -270992 -320102
19243c20102A23314b63467g9195n0779n9340L2265M1592C6898H739c1805j36067
$$ -320102 123314 -263467 -79195 -129974 -189314 -157049 -115457 36898 8739 -31805 -167872
19232a67872e9757j61675c3993B09207n3395a7301l48600h2763A30513l6132p685
$$ -167872 -59757 -221432 -33993 209207 155812 -17301 -365901 -82763 130513 94381 86696
19221H6696R449C6709K43797a96024G6326a86985l31597g403k14730L3212c8659
$$ 86696 96145 36709 280506 -196024 76326 -186985 -518582 -7403 -222133 -188921 -38659
19209B3166d0958l1951A06456b51818j49900H3353c74317A80550a00180F2359
$$ 23166 -40958 -72909 106456 -251818 -401718 83353 -374317 180550 -100180 62359
19198a72715j61401i3853K0829j88381a17118e0561j07258q8571O8857N3753j24463
$$ -172715 -334116 -93853 -73024 -261405 -117118 -50561 -157819 -246390 -177533 -123780 -248243
19187b48243B0774c39117b1188j32560a9657j38268A6628a45356O0644C34433
$$ -248243 20774 -339117 -21188 -153748 -19657 -157925 16628 -145356 -84712 334433
19176D5318Q9112d0367k68254R0435C24260a82854A19597K4723A0477j180b78904
$$ 45318 134430 -40367 -308621 -218186 324260 -182854 119597 144320 10477 9297 -278904
19164a15369J6443p3922B1515N2087J69777e66797A51883Q7540A17807m632r546
$$ -115369 -98926 -172848 21515 73602 243379 -566797 151883 239423 117807 113175 103629
19153A03629C1650P62b72525G8645a05664j22122J7586B62460a19166D285a32062
$$ 103629 31650 32412 -272525 78645 -105664 -227786 -210200 262460 -119166 4285 -132062
19141A58a38409M4201k57132f2269m7579e4391A03256a43858q5318a2216D1717
$$ 158 -138409 -94208 -351340 -62269 -109848 -54391 103256 -143858 -229176 -12216 41717
19129C6891c1282H1091e9681j9526m4958B60656a8327l42688J75400g6842H4689
$$ 36891 -31282 81091 -59681 -79207 -124165 260656 -18327 -361015 -185615 -76842 84689
19117a23232L3336J6090H8112g4590j33032C10867d9500o4878k29929J39216D5017
$$ -123232 -89896 -73806 88112 -74590 -207622 310867 -49500 -114378 -344307 -205091 45017
19105a19192A68281c91266P4147h8406E1310a57035B6427b68003A8258e660I452
$$ -119192 168281 -391266 -317119 -88406 51310 -157035 26427 -268003 18258 -5660 9452
19093A23745J45363b48717A6233b00026C5147d48055b14854A01146a2543k1036
$$ 123745 269108 -248717 16233 -200026 35147 -448055 -214854 101146 -12543 -33579
19083c3579r2232d440A27665a81888p470j83857B49284c39455J30G1861L7207
$$ -33579 -125811 -4440 127665 -181888 -189358 -373215 249284 -339455 -339325 71861 109068
19072A09068e42614A80711a84924M8967j1349j46036j2709A71375b37095C6959
$$ 109068 -542614 180711 -184924 -135957 -147306 -293342 -306051 171375 -237095 36959
19061A39447d6849n8914A25268c6224o0167A96215D7428i8201L4779l0204C73508
$$ 139447 -46849 -105763 125268 -36224 -96391 196215 47428 -98201 -63422 -93626 373508
19049c17864a22395B46069a32975D1571b74939c7780q4217E8341B8836N396J0821
$$ -317864 -122395 246069 -132975 41571 -274939 -37780 -121997 58341 28836 34232 45053
19038D5053a43273E485L675O7401c3322B42457E9521J27122C625J08347J83166
$$ 45053 -143273 5485 9160 76561 -33322 242457 59521 186643 3625 111972 295138
19027B95138J03629i9409A89609h7006C54266c33699O7377A77557i8621B04387
$$ 295138 398767 -99409 189609 -87006 354266 -333699 -266322 177557 -98621 204387
19016a97922C3145f0916q6634F3180a3557k02739d3883A76N5572b47010j3059
$$ -197922 33145 -60916 -147550 63180 -13557 -216296 -43883 176 55748 -247010 -260069
19005b60069h6852p0431A18523c24859g8864B2745c45362A43686e0985j18803
$$ -260069 -86852 -157283 118523 -324859 -78864 22745 -345362 143686 -50985 -169788
18995a69788C9290K3722i1231B1637a06680b1799k66130A89917b30486N8693Q3705
$$ -169788 39290 63012 -91231 21637 -106680 -21799 -287929 189917 -230486 -171793 -88088
18984h8088j56860d8752F74J50277a29624j02238b0782j82955j1812M6899m7771
$$ -88088 -244948 -48752 674 150951 -129624 -231862 -20782 -203737 -215549 -168650 -216421
18973b16421n7172M9678O1627r2035O4575G8690b8077N819C44560l6638a23013
$$ -216421 -273593 -223915 -162288 -254323 -189748 78690 -28077 -22258 344560 307922 -123013
18961d98499e1270j2895J0987D6885b9769F0166e5608k4383F7489e0319J6572
$$ -498499 -51270 -64165 -53178 46885 -29769 60166 -55608 -79991 67489 -50319 -33747
18950c3747F4217a9131l0621C6791b45467e3945B1431c13699A14474c98132J76555
$$ -33747 64217 -19131 -49752 36791 -245467 -53945 21431 -313699 114474 -398132 -221577
18939b21577Q0692b459D8831j125R8892K0817m8288a128I9966a12641B3022J1392
$$ -221577 -140885 -2459 48831 47706 146598 167415 119127 -1128 99966 -112641 23022 34414
18927C4414k244A4061N4734j3813J1976i3564M0706l04160D8195b54813R4955
$$ 34414 32170 14061 68795 54982 66958 -93564 -52858 -357018 48195 -254813 -159858
18916a59858k19076A9596J43775c2808A4919d2568I0494a88233D8129h4307C3416
$$ -159858 -378934 19596 163371 -32808 14919 -42568 90494 -188233 48129 -84307 33416
18904C2084J76908A6166d34104a01791E1564c3381m6614r6061P7805g232A10467
$$ 32084 208992 16166 -434104 -101791 51564 -33381 -79995 -176056 -98251 -7232 110467
18892F9750a52503N7595H6730a29449A06818a69142l21089f2649m2945c3467n7089
$$ 69750 -152503 -94908 86730 -129449 106818 -169142 -490231 -62649 -105594 -33467 -90556
18881i0556B38716c75795G6575a92180M5263B7559b04085d5299n1991r5014c5363
$$ -90556 238716 -375795 76575 -192180 -146917 27559 -204085 -45299 -97290 -192304 -35363
18869f6324G6122b11878G2572a26592B42110d4626l8775A70398m4460a53295C2988
$$ -66324 76122 -211878 72572 -126592 242110 -44626 -83401 170398 125938 -153295 32988
18857I5629N7458K46869e9695n3363F6405f6625B18657P1525A31372f2287C2676
$$ 95629 153087 399956 -59695 -113058 66405 -66625 218657 290182 131372 -62287 32676
18845c3105G0079a51069n0846E3682J21222b12537I734d4253j02097A6529a55298
$$ -33105 70079 -151069 -201915 53682 174904 -212537 9734 -44253 -146350 16529 -155298
18833B25164b59970I9970b43468a14559A5999J45736b81811R3137B73894b05931
$$ 225164 -259970 99970 -243468 -114559 15999 161735 -281811 -188674 273894 -205931
18822A29641b13258b91B47788c80863H503h1073K5984B75499j13046c5332A8860
$$ 129641 -213258 -291 247788 -380863 8503 -81073 -55089 275499 162453 -35332 18860
18810c71125D234J4450J12759b7679A5177b7950k12798g5924C1978A3114a7723
$$ -371125 4234 18684 131443 -27679 15177 -27950 -240748 -75924 31978 13114 -17723
18798E4761A931c5539A97799b27034A54186a9981p4745D3442K5046g6005F911
$$ 54761 1931 -35539 197799 -227034 154186 -19981 -94726 43442 68488 -76005 6911
18786a1069o9618j17628j52631D1071K53925b58825b4307l9813j41583P2937O1398
$$ -11069 -80687 -198315 -350946 41071 294996 -258825 -24307 -64120 -205703 -132766 -71368
18775g1368k4807L4938C95360j91513L7421h8339A51281g3598m5750a557j76736
$$ -71368 -96175 -61237 395360 203847 241268 -88339 151281 -73598 -119348 -1557 -178293
18764a78293e6692i827j23984k986e2141j45955A13879L01022a45036A05083J06374
$$ -178293 -56692 -9827 -133811 -136797 -52141 -198096 113879 414901 -145036 105083 211457
18753B11457C2396a20532q643A56364a11435J8241j62520A49924e1850n489G5928
$$ 211457 32396 -120532 -129175 156364 -111435 -93194 -255714 149924 -51850 -57339 75928
18741B49313a90354l626c0852p8810k24416A14730c64233F0016C241a46772f6480
$$ 249313 -190354 -193980 -30852 -109662 -334078 114730 -364233 60016 3241 -146772 -66480
18729A6573a23843l5630j7690O5470j89115a00746D1090d75761a05376M7463o0369
$$ 16573 -123843 -159473 -177163 -111693 -300808 -100746 41090 -475761 -105376 -57913 -118282
18718a18282j24621I1766P82b16151e0196B01973b39625L3808Q3830C9742b32600
$$ -118282 -242903 91766 92548 -216151 -50196 201973 -239625 -205817 -121987 39742 -232600
18706c37175a28211B36825e7255J9139L5n1853r7991d2132a1029j93041c8941
$$ -337175 -128211 236825 -57255 -38116 -38081 -89934 -187925 -42132 -11029 -204070 -38941
18694E2981M9535D7312e419k51823a15570M7235D949J4896h2649K1107n0691q448
$$ 52981 102516 47312 -5419 -257242 -115570 -68335 4949 19845 -82649 -61542 -112233 -120681
18682a20681A87944b86910E7888J07337E9058c5840o3632I685a68380P6137p012
$$ -120681 187944 -286910 57888 165225 59058 -35840 -99472 9685 -168380 -92243 -99255
18671i9255j81712J9022A42630A4283a94849B2242J54306a19756n1987m7128C6180
$$ -99255 -280967 -261945 142630 14283 -194849 22242 176548 -119756 -171743 -218871 36180
18659e7111M366B47779e9941k07668R6809l5355d574k45062A60751A1777c3948
$$ -57111 -52745 247779 -59941 -267609 -170800 -206155 -4574 -249636 160751 11777 -33948
18647b41174P6424l18429P6681g6772j16012A54814C3851a16451p3310e5576r9675
$$ -241174 -164750 -483179 -406498 -76772 -192784 154814 33851 -116451 -189761 -55576 -155251
18636a55251B80412a51908m14095b59071j3306J13817A18178m8166a10630E3106
$$ -155251 280412 -151908 -566003 -259071 -272377 -158560 118178 70012 -110630 53106
18625I5505i0957j04764A86246a08852M7802A06644a61240A01407c26564F6572
$$ 95505 -90957 -195721 186246 -108852 -61050 106644 -161240 101407 -326564 66572
18614A11400a14991K346m0120b0329o4626o6796C04003a10518E595K5259q593
$$ 111400 -114991 -112645 -152765 -20329 -84955 -151751 304003 -110518 5595 30854 22261
18603B2261M0804b6806j79027f9882j96899J28533k9658B60628a73332I5639e9253
$$ 22261 63065 -26806 -205833 -69882 -266781 -138248 -167906 260628 -173332 95639 -59253
18591a43418D4018J04578c4398G6246J3197l2102A2196b89426R216A80772b86502
$$ -143418 44018 148596 -34398 76246 89443 57341 12196 -289426 -280210 180772 -286502
18579g8580A08103n2876b0684A35620a03837K3766A60556a82880P0034d1593j45695
$$ -78580 108103 55227 -20684 135620 -103837 -80071 160556 -182880 -112846 -41593 -187288
18568a87288N8483k59452G1537a93216J0609l0046d5100j27467Q928A59224o6471
$$ -187288 -128805 -388257 71537 -193216 -182607 -212653 -45100 -172567 -163639 159224 92753
18557I2753i6897g366j28852A82754D8038b26439a08572H1783b18285b1839B87708
$$ 92753 -96897 -7366 -136218 182754 48038 -226439 -108572 81783 -218285 -21839 287708
18545a69381i715k72828H9426a28498j85400k6832g7427J1342F3666b16305B9620
$$ -169381 -9715 -282543 89426 -128498 -313898 -340730 -77427 -66085 63666 -216305 29620
18533a47539J7951j22853j13902i3005A9178a85967G6634a14867r230j92877B44470
$$ -147539 -129588 -252441 -366343 -93005 19178 -185967 76634 -114867 -124097 -316974 244470
18521a03266q3482M2288k22971J72373A8713a74469G5865P912f1567O83m5917
$$ -103266 -186748 -144460 -367431 -195058 18713 -174469 75865 83777 -61567 -60884 -106801
18510a06801k5106D05327g814E0575a68631E1497A8333g7290A61796h9045j01087
$$ -106801 -131907 405327 -7814 50575 -168631 51497 18333 -77290 161796 -89045 -190132
18499a90132a1197Q78j29535d5970N125q8058j8771C3251i2383a9333j17464N7988
$$ -190132 -11197 -10319 -139854 -45970 -40845 -128903 -147674 33251 -92383 -19333 -136797 -78809
18487g8809k11522A78530p1084e9906r1762d6552K487B91995f9437A68435b0018
$$ -78809 -290331 178530 107446 -59906 -151668 -46552 -44065 291995 -69437 168435 -20018
18475b39589c2837j93728q6267f8777m3204l00415a68084a991A38191a76958f0515
$$ -239589 -32837 -226565 -312832 -68777 -111981 -412396 -168084 -1991 138191 -176958 -60515
18463a55904A94864a56287M7766A90087F7034Q1861J04152H6450d59018b11200
$$ -155904 194864 -156287 -108521 190087 67034 148895 253047 86450 -459018 -211200
18452G908a40807N7532C9401a0833I6114b4684j29992B84097a33058j76420J15919
$$ 7908 -140807 -83275 39401 -10833 96114 -24684 -154676 284097 -133058 -309478 -193559
18441a93559K7551A64449a44539O9578K2636A00968m8371J88940b14844I1720
$$ -193559 -166008 164449 -144539 -74961 -52325 100968 52597 241537 -214844 91720
18430d5164j0560F2476b13527g893r1776b7224j00706I1346c13469F574g3351
$$ -45164 -55724 62476 -213527 -7893 -99669 -27224 -127930 91346 -313469 6574 -73351
18418C1245K24284b32492j59494A5078P7705a56209q3538d7444m8417M7203B32044
$$ 31245 255529 -232492 -391986 15078 92783 -156209 -239747 -47444 -95861 -48658 232044
18406I575L9748d5061A5139k299J46406o234a37367B54978B1676f5063l91355
$$ 9575 49323 -45061 15139 12840 159246 153012 -137367 254978 21676 -65063 -456418
18395d56418B25304h0552A74569f5057A82724a34638l49055b32377a05308B46755
$$ -456418 225304 -80552 174569 -65057 182724 -134638 -483693 -232377 -105308 246755
18384b6691m2355g023j44352C919R8514a53691f762B03423g971E4905Q0405b3608
$$ -26691 -69046 -7023 -151375 3919 102433 -153691 -6762 203423 -7971 54905 135310 -23608
18371C7237a0869j01872I3438e8887A17246h6646D0320J68937F7846b43152G2066
$$ 37237 -10869 -112741 93438 -58887 117246 -86646 40320 209257 67846 -243152 72066
18359b9215D9678J25759a26708G3336K44260c7696m9997j8637d6602j17939q053
$$ -29215 49678 175437 -126708 73336 317596 -37696 -87693 -106330 -46602 -164541 -172594
18348a72594A38184b84040B57704p4597a94831b3539j0615A59815a92307R4596
$$ -172594 138184 -284040 257704 183107 -194831 -23539 -34154 159815 -192307 -97711
18338i7711q3946G1936J2300B9973b3986G8007b27830A09513b15184f3190p7003
$$ -97711 -181657 71936 84236 29973 -23986 78007 -227830 109513 -215184 -63190 -140193
18327a40193I3995B84P6738f6489G9504a89622I0545K77488a55245r2800D6599
$$ -140193 93995 284 77022 -66489 79504 -189622 90545 368033 -155245 -248045 46599
18315c62917A8129J51578a79298c3432C33698D2785b20856A43984a03507c2147
$$ -362917 18129 169707 -179298 -33432 333698 42785 -220856 143984 -103507 -32147
18304b37618A27781k5187a32843M3298j14956B44421d4895F7858K33529d5409
$$ -237618 127781 102594 -132843 -89545 -204501 244421 -44895 67858 301387 -45409
18293a43689b9129j46744G6141b66767A21252B8070K7262h9916A75405c51353
$$ -143689 -29129 -175873 76141 -266767 121252 28070 55332 -89916 175405 -351353
18282F7866a5613m25870a47167A64656M433E7090a46035o9693h5285B6676J25807
$$ 67866 -15613 -441483 -147167 164656 169089 57090 -146035 -215728 -85285 26676 152483
18271A52483I273a16110N1695A46914a55528C14569b3998l7633m10800b18647
$$ 152483 9273 -116110 -64415 146914 -155528 314569 -23998 -61631 -472431 -218647
18260a88080e300A72186m4260C011a71063l0423G6264a63962A14120N1582a04229
$$ -188080 -5300 172186 127926 3011 -171063 -201486 76264 -163962 114120 165702 -104229
18248b62446a22845e3346B31449a34934l1112G058K23550b84072E0020b25099
$$ -262446 -122845 -53346 231449 -134934 -166046 7058 230608 -284072 50020 -225099
18237A51117c02623C7227j378a25857E7464b45443B14769A4260c098D9323a43522
$$ 151117 -302623 37227 35849 -125857 57464 -245443 214769 14260 -3098 49323 -143522
18225a30976M2779J7826A05980K8500a52718A84667f431G5984O7103J34268I8118
$$ -130976 -88197 -70371 105980 134480 -152718 184667 -6431 75984 143087 277355 98118
18213c35251g8081d201A64880a73286b7756A33525r725J331P5789D0631c013A46077
$$ -335251 -78081 -4201 164880 -173286 -27756 133525 123800 125131 200920 40631 -3013 146077
18200C4765b30347m4646h3422D9037d0117B89695c7540l01364J69271P0179m8670
$$ 34765 -230347 -274993 -83422 49037 -40117 289695 -37540 -338904 -169633 -99454 -148124
18189a48124O2344j7691G6610L00700h5185C52467b13204h1010k40939a34423
$$ -148124 -85780 -103471 76610 377310 -85185 352467 -213204 -81010 -321949 -134423
18178g4730B58874a0914j25284A44061J23897c08907C5731b32671I1021d33385
$$ -74730 258874 -10914 -136198 144061 267958 -308907 35731 -232671 91021 -433385
18167d0133M313D1482d05713A35458a68618j01033J32506j6092A02916a63759
$$ -40133 -35820 41482 -405713 135458 -168618 -269651 -137145 -153237 102916 -163759
18156D0619a55353b7015l5619p3879e063C8658M394b72476Q2969F1204a32177
$$ 40619 -155353 -27015 -62634 -136513 -5063 38658 43052 -272476 -189507 61204 -132177
18144A81050d2427r4519B57167i1231A3786J30816b51633Q2288A62104k6221c2490
$$ 181050 -42427 -136946 257167 -91231 13786 144602 -251633 -169345 162104 135883 -32490
18132a50879K0248j0295e4839k45093a37862H5148d76692a40674i554k73182B0353
$$ -150879 -130631 -140926 -54839 -299932 -137862 85148 -476692 -140674 -9554 -282736 20353
18120B07197C4111D630a8934A18884a24364f390A17536c08767J06380f9810G4667
$$ 207197 34111 4630 -18934 118884 -124364 -6390 117536 -308767 -202387 -69810 74667
18108a17565N6121j27982b068r246B35638J03473a61042M4752P277q767c427B419
$$ -117565 -61444 -189426 -2068 -11314 235638 339111 -161042 -116290 -109013 -117780 -3427 2419
18095A48481F2987a1709D3938P0401g2764l4881c6101m2421n5776d1284A64518
$$ 148481 62987 -11709 43938 114339 -72764 -107645 -36101 -78522 -134298 -41284 164518
18083i1944C99812I1399a17039C01835d5108G2780P2562h5698L7236A66888a3773
$$ -91944 399812 91399 -117039 301835 -45108 72780 145342 -85698 -48462 166888 -13773
18071a7333r2081b5165E7822a3789H3486K51999p1386o725d07948B8025K7513
$$ -17333 -109414 -25165 57822 -13789 83486 335485 264099 257374 -407948 28025 55538
18060E5538a517j4615k06325f5791j26161g6577B67338a40859O4549A1956J67766
$$ 55538 -1517 -16132 -222457 -65791 -191952 -76577 267338 -140859 -76310 11956 179722
18049A79722b49583L9466R3041j37882G3606J75192F7543Q9360a07019F3540L06848
$$ 179722 -249583 -210117 -117076 -254958 73606 248798 67543 156903 -107019 63540 370388
18038C70388f3861j12042C3162a28865A32894I456a08458A23986K71151b16007
$$ 370388 -63861 -175903 33162 -128865 132894 9456 -108458 123986 395137 -216007
18027g9572K4907F9414c50162d3577p2397B26041b00331b4134A91743e674B25074
$$ -79572 -54665 69414 -350162 -43577 -115974 226041 -200331 -24134 191743 -5674 225074
18015A93955k8120f0424j16474E4660J64493f3446C70325f4228k27346J41243
$$ 193955 165835 -60424 -176898 54660 219153 -63446 370325 -64228 -291574 -150331
18005a50331g0036m5486j9330B36542p6974M3117b45891Q5445e7533A15464c17720
$$ -150331 -70036 -115522 -134852 236542 159568 202685 -245891 -160446 -57533 115464 -317720
17993C7836N6339c1987E4795J46496g2917k53946B7666e22032a84276O0437B60128
$$ 37836 94175 -31987 54795 201291 -72917 -326863 27666 -522032 -184276 -123839 260128
17981A46321a77149A72550l3541d15904a28994B35690M6i9752Q686k70232B08864
$$ 146321 -177149 172550 139009 -415904 -128994 235690 235736 -99752 -91066 -361298 208864
17969C28930F0095P2441a36513k56449B1354M2992a81036P3801A24029a562C0020
$$ 328930 60095 132536 -136513 -392962 21354 64346 -181036 -107235 124029 -1562 30020
17957c71414e9669A42842i4833J4999D3501Q6581a40054A69742O1471n3085A4402
$$ -371414 -59669 142842 -94833 -79834 43501 130082 -140054 169742 231213 178128 14402
17945A47555h9685k88113B84890c7860B52086c70977J49789H1761c4254E5529
$$ 147555 -89685 -377798 284890 -37860 252086 -370977 -221188 81761 -34254 55529
17934F6883K46941a71776A00775c6420Q092m74008a84808O9140C03494A9214K21614
$$ 66883 313824 -171776 100775 -36420 -28328 -502336 -184808 -115668 303494 19214 240828
17923B40828c30749B98098l8623F4284J29111b98513a17501L8586b9523E6685
$$ 240828 -330749 298098 259475 64284 193395 -298513 -117501 -78915 -29523 56685
17912B4590a97263d3264a9236j25320L7840K3735D9176J21915q5064b29417C5189
$$ 24590 -197263 -43264 -19236 -144556 -106716 -82981 49176 171091 86027 -229417 35189
17900e06593h9814A10833b92875I4458g1577K1415A69051A324N2645L53271A11795
$$ -506593 -89814 110833 -292875 94458 -71577 -50162 169051 1324 53969 407240 111795
17888D8525Q154H337L18071f9782b432j83614l6223A64525b19230m0087A34709
$$ 48525 56679 8337 326408 -69782 -2432 -186046 -222269 164525 -219230 -259317 134709
17876A27418a52309A12780a45676A60461e244F0662D347J62724O738J34574A42631
$$ 127418 -152309 112780 -145676 160461 -5244 60662 4347 167071 173809 308383 142631
17864a02111k89581a52247A17038b53204O2471j11445h675H1159L4816J04076
$$ -102111 -391692 -152247 117038 -253204 -190733 -302178 -8675 81159 115975 220051
17854B20051A02711m5372a50495A26191J05371g8125j94489c175B0174b6608I1825
$$ 220051 102711 57339 -150495 126191 231562 -78125 -272614 -3175 20174 -26608 91825
17842a10085q9944h3660I8894a03090A76383i5713k13607F5734b01818C4124L8894
$$ -110085 -200029 -83660 98894 -103090 176383 -95713 -309320 65734 -201818 34124 73018
17831G3018a3004A14926K9176h5227J0069A55884P7996b3490k02497A90233D594
$$ 73018 -13004 114926 144102 -85227 -75158 155884 233880 -23490 -225987 190233 4594
17819A07766R3718a02894A51028p3028P3100O4584C3210K05492c07149C9175a2483
$$ 107766 201484 -102894 151028 78000 151100 215684 33210 238702 -307149 39175 -12483
17807H6788k3560N1771a32616B65782j25829b7549A89765B051b05714I6021O1411
$$ 86788 63228 114999 -132616 265782 139953 -27549 189765 2051 -205714 96021 157432
17796A57432a38048C8733e6233k9857j92818j73716a262j73029C23221G0745M1035
$$ 157432 -138048 38733 -56233 -86090 -278908 -452624 -1262 -174291 323221 70745 111780
17785A11780a72479C8341c1194l89A19609e8457j38307B9638c5959b731C5871
$$ 111780 -172479 38341 -31194 -31583 119609 -58457 -196764 29638 -35959 -2731 35871
17773a93282F7732k5274a84908O5336A03800P1240G4746K8905d02100J04561C7444
$$ -193282 67732 42458 -184908 -119572 103800 175040 74746 103651 -402100 -297539 37444
17761b07145A41407C6118L3960a34046A72642b7826q2402A47134c29862A95340
$$ -207145 141407 36118 70078 -134046 172642 -27826 -110228 147134 -329862 195340
17750A23129K2885b11306Q4256l06136G0113b2807A61699b43452D8523a6160b532
$$ 123129 146014 -211306 -127050 -433186 70113 -22807 161699 -243452 48523 -16160 -2532
17738A36554O4811m3617m1677b54921a00679M8084A95417R5941C6577b30300J07407
$$ 136554 201365 157748 116071 -254921 -100679 -52595 195417 291358 36577 -230300 -122893
17727a22893D4492Q7818i6445j3635I4708d19125D9492j2259a99936C65554A77060
$$ -122893 44492 132310 -96445 -110080 94708 -419125 49492 37233 -199936 365554 177060
17715a42220e3551B20065a18405e6694j40769c3715r7753A7883A091a76541h2647
$$ -142220 -53551 220065 -118405 -56694 -197463 -33715 -131468 17883 1091 -176541 -82647
17703a3348C3129Q7327b20960L535C6303b9537A3319J27736L713M6102k8972b63213
$$ -13348 33129 120456 -220960 -217425 36303 -29537 13319 141055 144768 190870 161898 -263213
17690A87636a13368m7677f3217A40662n9253a22532d570p6773A90536H5520G100
$$ 187636 -113368 -161045 -63217 140662 81409 -122532 -4570 -81343 190536 85520 7100
17678e9642a1728B34434d09768J45775J16888K1587G8050q443a24535B0430d0351
$$ -59642 -11728 234434 -409768 -263993 -147105 -125518 78050 69607 -124535 20430 -40351
17666a04800c5674E6330f0608B41943a35707A42260a79877K7471C9441g3612D66594
$$ -104800 -35674 56330 -60608 241943 -135707 142260 -179877 -152406 39441 -73612 466594
17654h4C5979J86291n4578M8693Q4279j23205l5125O7862e84453E1439a76922
$$ -84 35979 222270 167692 216385 300664 177459 142334 210196 -584453 51439 -176922
17642B6175b9263D1003g1350B35866i7972L1655q8969C60695c64908C86795A40682
$$ 26175 -29263 41003 -71350 235866 -97972 -66317 -155286 360695 -364908 386795 140682
17630B20252b4770F3287b2220B43413A11130b44633n954A25648J1034j0070J46954
$$ 220252 -24770 63287 -22220 243413 111130 -244633 -250587 125648 136682 126612 273566
17619B73566A9259h4014A03519k2049C4092K57152a78809B8825I573K39249j01630
$$ 273566 19259 -84014 103519 81470 34092 291244 -178809 28825 9573 248822 147192
17608A47192o9539i4171E7594c77263F2798B1787J47371f5931n860F0971h6361
$$ 147192 77653 -94171 57594 -377263 62798 21787 169158 -65931 -71791 60971 -86361
17596B21431a56989b2864G0929d8013k72476d3633q0209D2370j4463K1558L6073
$$ 221431 -156989 -22864 70929 -48013 -320489 -43633 -123842 42370 27907 49465 85538
17585H5538R23a39584A49643J51271a93732I9257B9384h1711o0344N9045K8578
$$ 85538 86461 -139584 149643 300914 -193732 99257 29384 -81711 -142055 -83010 -54432
17574e4432l4908A05698J17405J92711A29771c28548A8319b81894E2998b09662
$$ -54432 -89340 105698 223103 415814 129771 -328548 18319 -281894 52998 -209662
17563A6207f2392A65297o2026J64079j05356M4920e4239k73129D4883l665e358
$$ 16207 -62392 165297 103271 267350 161994 206914 -54239 -327368 44883 41218 -5358
17551i1846D2164L24677A55568b21569A48246K63659j31908a91630B95043g4910
$$ -91846 42164 366841 155568 -221569 148246 411905 279997 -191630 295043 -74910
17540B24228f7836B57889f4590C96173b89233G9537d2759B57510A21872d9466
$$ 224228 -67836 257889 -64590 396173 -289233 79537 -42759 257510 121872 -49466
17529C235a40872D98697A17795k3732i6011A57156a20250A57286A8025J50722
$$ 3235 -140872 498697 117795 94063 -96011 157156 -120250 157286 18025 168747
17519A68747m6011r571K08225E3193g472A910K98408B4698d43158h5573F9939
$$ 168747 122736 113165 321390 53193 -7472 1910 300318 24698 -443158 -85573 69939
17507i1009C59910E4287J39503H5587L1735Q8257k0850J84187A44673Q8215a3347
$$ -91009 359910 54287 193790 85587 117322 205579 184729 368916 144673 232888 -13347
17495B1750N1995g1624B48941M1629j31648K26593m8709A29986J6580l7384f029
$$ 21750 73745 -71624 248941 290570 158922 385515 336806 129986 146566 109182 -6029
17483I380Q5090J92460j4261B2593J92712L39922b64777A21968N2266q0003j5229
$$ 9380 94470 286930 272669 22593 215305 555227 -264777 121968 174234 94231 79002
17472G9002J65026p6386K17276A86232H4907a23997H8362a06914A66489n9128
$$ 79002 244028 167642 384918 186232 84907 -123997 88362 -106914 166489 107361
17462A07361J8752i18B20455g1631B1025J83218J76342j35340q045C1528O5440
$$ 107361 126113 -918 220455 -71631 21025 204243 380585 245245 237200 31528 96968
17451I6968J25250K83453j90095A20016J77717K2691J40478j38274A52865e621
$$ 96968 222218 505671 315576 120016 297733 320424 460902 322628 152865 -5621
17440B48563m8587J28955A08754K33758A68076K87953F0495j4187M3397K47753
$$ 248563 199976 328931 108754 342512 168076 456029 60495 46308 89705 337458
17430C37458o5629J6575L7905A18539M56568A14817K8377k4907K37017q1824A35102
$$ 337458 271829 288404 326309 118539 575107 114817 143194 118287 355304 273480 135102
17418D01975j28163r7068l2851K09167k9350F5906b52432F09820A73485a61179
$$ 401975 273812 176744 143893 353060 323710 65906 -252432 609820 173485 -161179
17407C44307D5659K63670i4897A69495R8892q1289k15Q6313a56989C9439b151
$$ 344307 45659 309329 -94897 169495 268387 187098 186883 273196 -156989 39439 -2151
17395h4552A36018o4168K71262k4479j56707f2472A62415a21698D33627j00401
$$ -84552 136018 71850 343112 318633 161926 -62472 162415 -121698 433627 333226
17385C33226a78851B97414e6542I928K19056r5601A7728J2504a56180B76517c17989
$$ 333226 -178851 297414 -56542 9928 228984 133383 17728 30232 -156180 276517 -317989
17373C71677j36847J2462m968L1964a8123m1936I4277k8670J14214h82G5569B19
$$ 371677 234830 247292 242324 274288 -18123 -60059 94277 65607 179821 -882 75569 219
17360C07902D7413L0485Q4014N9612E9691C853K45947b8642m1850A71899E1761
$$ 307902 47413 77898 161912 221524 59691 3853 249800 -28642 -70492 171899 51761
17348G0669J20177f9193D60111B10078J59788A13371O789K30857B7302a56765
$$ 70669 190846 -69193 460111 210078 369866 113371 120160 351017 27302 -156765
17337B37529F2910c7053D3725J06544b8645p859A03468N289a2493E5437J18273
$$ 237529 62910 -37053 43725 150269 -28645 -36504 103468 108757 -12493 55437 173710
17326A73710p5902B8395K4695E672J70287b01530h356r1360B27470a29180A30402
$$ 173710 97808 28395 53090 5672 175959 -201530 -8356 -99716 227470 -129180 130402
17314A33679O3400L17161g8970A63890m9618K25377j61761E9758e4614A03691
$$ 133679 197079 514240 -78970 163890 114272 339649 177888 59758 -54614 103691
17303B75346H6401J73652J59118j81744q5710b15859C54400F4370J85801n7824
$$ 275346 86401 260053 419171 237427 151717 -215859 354400 64370 250171 192347
17293A92347L65464f5609C36004A57632b42637D91045E4160J21289K33264p9951
$$ 192347 557811 -65609 336004 157632 -242637 491045 54160 175449 408713 328762
17283C28762f643A17275J28142o5816p2832O9690J58119o5118a59422A25716J18268
$$ 328762 -6643 117275 245417 179601 106769 176459 334578 269460 -159422 125716 243984
17272B43984C9791J05244m4403J55994c246E1467B5164J20765R9624n3903R8594
$$ 243984 39791 145035 100632 256626 -3246 51467 25164 145929 245553 191650 290244
17261B90244m969P9205a7310C25828J12421A42332J31195b93979j61288A6063
$$ 290244 285275 364480 -17310 325828 438249 142332 273527 -293979 -455267 16063
17250A82316G5033L26822A81313M4279q2318F4062J37885E8053J23583M02225
$$ 182316 75033 401855 181313 225592 143274 64062 201947 58053 181636 583861
17240E83861a12925B90448j12728J54216d5590I5632k5656b2988A24443L73488
$$ 583861 -112925 290448 177720 331936 -45590 95632 69976 -22988 124443 497931
17230D97931B11015d5550q672A78803K6935K8971l4963d6941D3420P2192J23805
$$ 497931 211015 -45550 -54222 178803 205738 234709 199746 -46941 43420 115612 239417
17219B39417D8825J4564e015H5637f0582A53370a33703D04379b57323A24861K31389
$$ 239417 48825 63389 -5015 85637 -60582 153370 -133703 404379 -257323 124861 356250
17208C56250L1968a63067A804J15868N3078K07414A53597J0112m8689m4480a5451
$$ 356250 388218 -163067 1804 117672 170750 378164 153597 163709 115020 70540 -15451
17196D43576j19979A29177d2826A57305P936k5037k245K54387K41575B49612Q6207
$$ 443576 323597 129177 -42826 157305 165241 140204 137959 392346 633921 249612 335819
17185C35819K32699j46175j37243A34908K32862p9414H7996K4384J94027F8429
$$ 335819 568518 422343 285100 134908 367770 288356 87996 112380 306407 68429
17174A07156J60846J01200q4171I7718N69571k14938A22418J18359F8519N25862
$$ 107156 268002 369202 285031 97718 667289 452351 122418 240777 68519 594381
17164E94381k73291O2458q3214C5014J03437J56562A04207R7724e6641a3037D76014
$$ 594381 321090 383548 300334 35014 138451 295013 104207 201931 -56641 -13037 476014
17152D20074j61598G7524K05776L41674k19782l2345h3989C30109A11847P4302
$$ 420074 258476 77524 283300 624974 405192 372847 -83989 330109 111847 186149
17142A86149K76988A53653N06157l28220j20171J13449n2255p9704L87184n1602
$$ 186149 463137 153653 659810 331590 211419 324868 272613 192909 580093 528491
17132E28491B26107N9805J74495k21026r5111J65594J71003A42143K48719j09871
$$ 528491 226107 285912 460407 239381 144270 309864 480867 142143 390862 280991
17122B80991n3876F2392L12763J61989L2712k80174J66536A49241O3557L4683
$$ 280991 227115 62392 375155 537144 569856 289682 456218 149241 212798 247481
17112B47481P6916j13368M7196P600K71888J05479j81824j97186J22250j84920
$$ 247481 324397 211029 258225 265825 537713 643192 461368 264182 386432 201512
17102B01512L22386J382B41357K78397k13240R2419j64729J58890O9778q5111
$$ 201512 523898 525280 241357 519754 306514 398933 234204 393094 462872 377761
17092C77761M17635B87125K16030I9951K39614J41345A67871J43226D4858K39817
$$ 377761 795396 287125 503155 99951 339565 480910 167871 311097 44858 284675
17082B84675K15734q8075j38885K92082B72481J47395J29104q7027B18648J91979
$$ 284675 500409 412334 273449 565531 272481 419876 548980 461953 218648 410627
17072D10627K0819p8476J92938o3178n1227o8369j33448L6218N40889A33739L37208
$$ 410627 431446 352970 545908 482730 431503 363134 229686 265904 806793 133739 470947
17061D70947j0495K35476l28261J80367J52706k88421H1678L34652n5843L18970
$$ 470947 460452 695928 367667 548034 700740 412319 81678 416330 360487 679457
17051F79457k48991m0557K2313m0598L45158C43388J77042j7041O9703n0185L0914
$$ 679457 430466 389909 412222 371624 716782 343388 520430 503389 573092 522907 553821
17040E53821j76996k7218J31928l5842j67261J59675K53511k73111J79363k84630
$$ 553821 376825 349607 481535 445693 278432 438107 691618 418507 597870 313240
17030C13240R5083k7294K00078o6545J11119p5512k6953l3605o0860p5234J96119
$$ 313240 408323 381029 581107 514562 625681 550169 523216 489611 428751 353517 549636
17019E49636k31906J23708J89584B01709M39669L11585j44648l45614J22072B91191
$$ 549636 317730 441438 631022 201709 641378 952963 808315 462701 584773 291191
17008G11619j54118J6990j22098K00814l13923K66282m1033K92957k28718L7827
$$ 711619 557501 574491 452393 653207 339284 605566 564533 857490 628772 666599
16998F66599k5129J46896K6113O7814j42698j70691L7883K35258C39641K65416
$$ 666599 641470 788366 814479 882293 739595 568904 606787 842045 339641 605057
16988F05057L265l6036J14793J34800J50423k75698k77888J13160J03643M13944
$$ 605057 608322 572286 687079 821879 972302 696604 418716 531876 635519 1049463
16978A049463m86122J41723P24J21179j17298K88992l00103r4406M20920O2284
$$ 1049463 563341 705064 705788 826967 709669 998661 698558 604152 1025072 1087356
16968A087356j78003J0713k22651J0569L00014J30524q2853k12362L03669j39979
$$ 1087356 909353 920066 697415 707984 1007998 1138522 1055669 843307 1146976 1006997
16958A006997o9442k64027J77960O9548j63521M7968J22298K20255k16657P0375
$$ 1006997 937555 673528 851488 921036 757515 805483 927781 1148036 931379 1001754
16948A001754n188J2446L96489m57509J84331q7995P0501K36840o04699L45259
$$ 1001754 996566 1009012 1405501 947992 1132323 1044328 1114829 1351669 746970 1092229
16938A092229K02235p3361M6036j32935K9345j69898O0946K65086N2695M1823
$$ 1092229 1294464 1221103 1267139 1134204 1163549 993651 1054597 1319683 1372378 1414201
16928A414201k68729L10466j6783l19225J6255n9045K41424l36111J6555R7878
$$ 1414201 1145472 1455938 1439155 1119930 1136185 1077140 1318564 982453 999008 1096886
16918A096886l6493M34992j42409j9283l185J62004M717j49987K17263J92931
$$ 1096886 1060393 1495385 1352976 1333693 1330508 1492512 1497229 1347242 1564505 1757436
16908A757436l30402L0332j69301L19787j60502Q4309k9946J35502j03714K66908
$$ 1757436 1427034 1457366 1288065 1607852 1447350 1531659 1501713 1637215 1533501 1800409
16898A800409k43286P2610m9482J83505K58071j79296O1446r8809k98631L10442
$$ 1800409 1557123 1629733 1580251 1763756 2021827 1842531 1903977 1805168 1506537 1816979
16888A816979p0501O0173J90311J71078l02801M6100J85717P4928K1280J47856
$$ 1816979 1746478 1806651 1996962 2168040 1865239 1911339 2097056 2171984 2193264 2341120
16878B341120m23765m5934L32846k57115j17829N19595J20354n22070N39074l9186
$$ 2341120 1917355 1871421 2204267 1947152 1829323 2348918 2469272 1947202 2486276 2447090
16868B447090j38334L48690j78846J48274k22615L1939J07185L7102J67514j51687
$$ 2447090 2308756 2657446 2478600 2626874 2404259 2436198 2543383 2580485 2747999 2596312
16858B596312l892K7839J22196J80223k27679P9182K80217r5155m5440L92857
$$ 2596312 2592420 2620259 2742455 2922678 2694999 2774181 3054398 2959243 2913803 3306660
16848C306660k20k80937J84493K89799l19972m8579K66961J42178l7600O192L21287
$$ 3306660 3306440 3025503 3209996 3499795 3179823 3131244 3398205 3540383 3502783 3508975 3830262
16837C830262o6992J41874J80022j50378K98574m50403M46327k13015L25178K12868
$$ 3830262 3763270 3905144 4085166 3934788 4233362 3782959 4229286 4016271 4341449 4554317
16827D554317M4497j55110J54825J91876k44501M03476k34281M07454J16194o3177
$$ 4554317 4598814 4443704 4598529 4790405 4545904 4949380 4715099 5122553 5238747 5175570
16817E175570L02785p5912K14271q8885j0621J91919O13979l36920K70053J04805
$$ 5175570 5478355 5402443 5616714 5527829 5517208 5709127 6323106 5986186 6256239 6361044
16807F361044J88088o341M97687K9335K20275l95526Q96229j03045K57210K31182
$$ 6361044 6549132 6542791 7040478 7069813 7290088 6894562 7790791 7687746 7944956 8176138
16797H176138J4776J73952N50504P2267P4169L30066J54481N28924M56368l52609
$$ 8176138 8190914 8364866 8915370 8987637 9061806 9391872 9546353 10075277 10531645 10179036
16787A0179036L58450N37669J79282P58175l69611O98702P26169j1231M71847
$$ 10179036 10537486 11075155 11254437 12012612 11643001 12341703 13067872 13056641 13528488
16778A3528488O45051L18155N18545J48768R14464L07138M25443N79760R35471
$$ 13528488 14173539 14491694 15010239 15159007 16073471 16380609 16806052 17385812 18321283
16769A8321283P59752O61174L71233J250455M38665J050112J113557O44726J063436
$$ 18321283 19081035 19742209 20113442 21363897 21802562 22852674 23966231 24610957 25674393
16760B5674393J120455J191790J283679J351448J345554J384847J879036J345426
$$ 25674393 26794848 27986638 29270317 30621765 31967319 33352166 35231202 36576628
16752C6576628J909033K148079J691821K481829K354479K441857K956243L249401
$$ 36576628 38485661 40633740 42325561 44807390 47161869 49603726 52559969 55809370
16744E5809370L172863L591530L722912M324550M268315M852936N065857N567032
$$ 55809370 58982233 62573763 66296675 70621225 74889540 79742476 84808333 90375365
16736I0375365N829268O656329O593345P366036P196706P729227Q641009P964927
$$ 90375365 96204633 102860962 109454307 116820343 124017049 131746276 140387285 148352212
16728A48352212Q171786Q259145P921781P341165O354764N474721M387828L453421
$$ 148352212 156523998 164783143 172704924 180046089 186400853 191875574 196263402 199716823
16720A99716823K275637R32305k05936j549634k933126l918505n084733o269567
$$ 199716823 201992460 202924765 202718829 201169195 198236069 194317564 189232831 182963264
16712A82963264p030872p117797q402412q162883q341566q216433p717353p848671
$$ 182963264 175932392 168814595 160412183 152249300 143907734 135691301 127973948 120125277
16704A20125277p748286p091135o893308n878194n846153n381975m878337n183462
$$ 120125277 112376991 105285856 98392548 92514354 86668201 81286226 76407889 71224427
16696G1224427m129239m087820l261952l827616l007370k697210k966511k731204
$$ 71224427 67095188 63007368 59745416 55917800 52910430 50213220 47246709 44515505
16688D4515505k196634k256033j840589k226108j955273j721702j233721j507604
$$ 44515505 42318871 40062838 38222249 35996141 34040868 32319166 31085445 29577841
16680B9577841j494786j009106j221279j087054j068738r67326q00548r79764
$$ 29577841 28083055 27073949 25852670 24765616 23696878 22729552 21929004 20949240
16672B0949240n33675j448162j76813j057405k57611p85670q25811n85589n01171
$$ 20949240 20415565 18967403 18790590 17733185 17475574 16689904 15864093 15278504 14777333
16663A4777333k80402p45066J65545p04666j096883j53448l55790k23005o65517
$$ 14777333 14496931 13751865 13917410 13212744 12115861 11962413 11606623 11383618 10718101
16654A0718101M1453k51267n00389r4875l62201k11653j81574k84099l12532k11743
$$ 10718101 10759554 10508287 10007898 9913023 9550822 9339169 9157595 8873496 8560964 8349221
16644H349221j84135l12491k68736K01892n53195l42246k6118j33642n8507n19863
$$ 8349221 8165086 7852595 7583859 7785751 7232556 6890310 6864192 6730550 6672043 6152180
16634F152180Q4227l81431k08707N34448m84276j60208j78627j78486L70068p22942
$$ 6152180 6236407 5854976 5646269 6180717 5696441 5536233 5357606 5179120 5549188 4826246
16624D826246O4422J02342j50481k68620n5185N2414l19473j79710K42094n15637
$$ 4826246 4890668 4993010 4842529 4573909 4518724 4571138 4251665 4071955 4314049 3798412
16614C798412K42786J27656l72097k79814J90048j08505j96151J31591J66058
$$ 3798412 4041198 4168854 3796757 3516943 3706991 3598486 3402335 3533926 3699984
16605C699984m26411J54858l18142O9316j15186P5105J7042o8661l38538R9903
$$ 3699984 3273573 3428431 3110289 3179605 3064419 3139524 3156566 3087905 2749367 2849270
16595B849270M6894J55652k64242k41796L87231m07122K88701k98440l03981K09804
$$ 2849270 2896164 3051816 2787574 2545778 2933009 2525887 2814588 2516148 2212167 2421971
16585B421971J07327j01830K04724j61664l3317l40129n4421L51526k38360o3110
$$ 2421971 2529298 2427468 2632192 2470528 2437211 2097082 2042661 2394187 2155827 2092717
16575B092717R0551j32186j311J22691p272k50294r1994J5365j03126P6002l75306
$$ 2092717 2183268 2051082 2049771 2172462 2165190 1914896 1822902 1838267 1735141 1811143 1435837
16564A435837M12119q9411q5803J35240J00867N3377k59100j88372j05477O15737
$$ 1435837 1847956 1758545 1672742 1807982 1908849 1962226 1703126 1514754 1409277 2025014
16554B025014n57229j30711l22702L91751M65158o10427K48407K0661m3160l51656
$$ 2025014 1467785 1337074 1014372 1406123 1871281 1260854 1509261 1529922 1486762 1135106
16544A135106K3486L7916O113J10661Q8101j33953m0443M32582l02506r1014k0718
$$ 1135106 1158592 1196508 1202621 1313282 1401383 1267430 1226987 1659569 1357063 1266049 1245331
16533A245331j48110L94884k00786M3373j62746K12581j55836q4846j75544J68214
$$ 1245331 1097221 1492105 1291319 1334692 1171946 1384527 1228691 1143845 968301 1136515
16523A136515l94369M73459l86049K81251j68569M79414k9481P665l08411r6675
$$ 1136515 742146 1215605 829556 1110807 942238 1421652 1392171 1399836 1091425 994750
16513I94750J63929l03470J95790p9934k31191J49139J30822k40557P1112p3456
$$ 994750 1158679 855209 1050999 971065 739874 889013 1019835 779278 850390 776934
16503G76934J1700K14573j0135j8731P8817m40689K15177j27660J68039l39628
$$ 776934 788634 1003207 993072 974341 1053158 612469 827646 699986 868025 528397
16493E28397M10924k44586J89941k78164J31645O498K2463j93444p6067m8573
$$ 528397 939321 694735 884676 606512 738157 744655 767118 573674 497607 449034
16483D49034K08779L24499k76603j74601L34886j11527j26831K4340L4746q6929
$$ 449034 657813 982312 705709 531108 865994 754467 627636 651976 686722 599793
16473E99793K89688j05628j12280j79398o1221L08172m9984L34698D88273K50737
$$ 599793 889481 783853 671573 492175 430954 739126 689142 1023840 488273 739010
16463G39010K21443D71788N2357j31133L79910l00660J1738K6509L52812N806
$$ 739010 960453 471788 524145 393012 772922 472262 484000 510509 863321 869127
16453H69127m01820J9928j83805K51081j44398J51785l149O0626j80112J54589
$$ 869127 467307 487235 303430 554511 410113 561898 558749 619375 439263 593852
16443E93852k7238M393j30933M1983j43255J08077K87638k11311j99087K87867
$$ 593852 566614 571007 440074 482057 338802 446879 734517 523206 324119 611986
16433F11986o8740J3967K13989C35933J47276l3383P3323m6733M1310N2485J39492
$$ 611986 543246 557213 771202 335933 483209 449826 523149 476416 517726 570211 709703
16422G09703j72311N2075k08995K50857C08468M51204l00213J45175r7862p0560
$$ 709703 537392 589467 380472 631329 308468 759672 459459 604634 506772 436212
16412D36212J88267l06651K81314k86766i5453C00645J56800j62485K64152j31766
$$ 436212 624479 317828 599142 312376 -95453 300645 457445 294960 559112 427346
16402D27346n8876j03428P4754J33494A63040L82673k33219N8406l1954L68808
$$ 427346 368470 265042 339796 473290 163040 545713 312494 370900 338946 707754
16392G07754l51704J45729M7920m0141N2762k13404r8252K82937A33125N52917
$$ 707754 356050 501779 549699 509558 562320 348916 250664 533601 133125 686042
16382F86042B54934L05014B69969K06910q5198A52753J86645L68623I8196R4546
$$ 686042 254934 559948 269969 476879 391681 152753 339398 708021 98196 192742
16372A92742K22035K8763j38460j46863K36777A08491J59448J21075H5496K61318
$$ 192742 414777 443540 305080 158217 394994 108491 267939 389014 85496 346814
16362C46814R0665j18644J56492j85727j07022a181D28173A69579J7183L61818
$$ 346814 437479 318835 475327 289600 182578 -1181 428173 169579 186762 548580
16352E48580A36770J73087j34706L09787k23454J90722A95986L38527B65246K1174
$$ 548580 136770 309857 175151 484938 261484 452206 195986 534513 265246 286420
16342B86420K18183A68395k0847J53946R2478q3803a05498F09285k97915J63499
$$ 286420 504603 168395 147548 301494 393972 310169 -105498 609285 311370 474869
16332D74869R3804k14430j37404L91721k24353Q9558o1022A52832O326N8767D9658
$$ 474869 568673 354243 216839 608560 384207 473765 412743 152832 159158 217925 49658
16320A5618N49667B5843M91775h6729C50523j61798J22943A08677M6494J78867
$$ 15618 565285 25843 517618 -86729 350523 188725 311668 108677 155171 334038
16310C34038Q4069H4949K03891d598C04331k6481o8305J6714L61511A17777L3126
$$ 334038 418107 84949 288840 -4598 304331 277850 209545 226259 587770 117777 150903
16299A50903a0763H1175J55717J93708J3769j58328e1580C53176A06344K66782
$$ 150903 -10763 81175 236892 430600 444369 286041 -51580 353176 106344 373126
16289C73126A16721N3780P3931A03091d2426A93609p17K65627j81799r3753j0543
$$ 373126 116721 170501 244432 103091 -42426 193609 192892 458519 276720 182967 172424
16278A72424F4027K17779J05222M9731B11791J33472A53971J6829o4976K7295
$$ 172424 64027 281806 387028 436759 211791 345263 153971 170800 105824 133119
16268A33119K7218a46043B39818b37503D6201M94394B55914K42404j64388A63177
$$ 133119 160337 -146043 239818 -237503 46201 540595 255914 498318 333930 163177
16257F47931k90408H3390A3527L62292D0005j8701J77314f9928F6162J66835a4053
$$ 647931 357523 83390 13527 375819 40005 21304 198618 -69928 66162 232997 -14053
16245B5698K36830j4226L9436A43369A5564J53521K6464b2069B04276n5113J0616
$$ 25698 262528 248302 287738 143369 15564 169085 195549 -22069 204276 149163 159779
16234A59779f0096I0117C4688J78871p9774d832A70320J69269p7958b00147C1101
$$ 159779 -60096 90117 34688 213559 133785 -4832 170320 339589 261631 -200147 31101
16222A26854K25276A06860l3791J03820a9831A41303K27711I0172C6654i9774
$$ 126854 352130 106860 73069 176889 -19831 141303 369014 90172 36654 -99774
16211B90337A23774K57910A34771J12864l1365M85630h1762E1103K179c5298A45868
$$ 290337 123774 381684 134771 247635 216270 701900 -81762 51103 53282 -35298 145868
16199A68963a58851C85876j36916a94391O9262E25767i5179A25047k3729J17445
$$ 168963 -158851 385876 248960 -194391 -125129 525767 -95179 125047 101318 218763
16189B18763b1902D48395B17841a01570B94752a401I4357e6888B37448J56547
$$ 218763 -21902 448395 217841 -101570 294752 -1401 94357 -56888 237448 393995
16179C93995A07980m6659J92746J0989j27628N160J20639j13144g1311a6533B45723
$$ 393995 107980 61321 254067 265056 137428 142588 263227 150083 -71311 -16533 245723
16167A33771J9258a73A83577a54564o0603A02402C7181K18493a1214l45357G2328
$$ 133771 153029 -173 183577 -154564 -215167 102402 37181 255674 -11214 -356571 72328
16155b79452a16302A70052a44578I7577J20078P8708c21098a6568E0527L5877
$$ -279452 -116302 170052 -144578 97577 217655 296363 -321098 -16568 50527 86404
16145H6404i9065L6392B40688Q0470D0632a31709N7753A72287K25613E8529L9581
$$ 86404 -99065 -62673 240688 321158 40632 -131709 -73956 172287 397900 58529 98110
16134I8110b81102G3844e3012F4105K25804b1089m688B3692K30449E9614O0772
$$ 98110 -281102 73844 -53012 64105 289909 -21089 -25777 23692 254141 59614 120386
16123A20386Q1552d94102J38100B0050J64732a54568A50206E250J63066e2305
$$ 120386 201938 -494102 -356002 20050 184782 -154568 150206 5250 168316 -52305
16112b7800F6735k5545K16512D2818K72376j49127P8359L64792k26239j54319
$$ -27800 66735 41190 257702 42818 315194 166067 244426 609218 382979 228660
16102B28660J95508h9563B34273j06933L61844A39432l3591l4374J29920E4401
$$ 228660 424168 -89563 234273 127340 489184 139432 105841 71467 201387 54401
16091d0697l8556H6257L0131L9897b599B86012f343A22143f7880l40089A2423
$$ -40697 -79253 86257 116388 156285 -2599 286012 -6343 122143 -67880 -407969 12423
16079b16627c3615k11085B8616J15854Q2568b68934C56899b95004a04669K7032
$$ -216627 -33615 -244700 28616 144470 227038 -268934 356899 -295004 -104669 -77637
16069g7637F2277h7627l11119B57341F7135e1315q1666e7834l77864A37636f5061
$$ -77637 62277 -87627 -398746 257341 67135 -51315 -132981 -57834 -435698 137636 -65061
16057a91958A44921J08718m9379I3738a73904E3359a18104A42004b07251O3748
$$ -191958 144921 253639 204260 93738 -173904 53359 -118104 142004 -207251 -143503
16047a43503E897J11298c3238r7517B17084M1943a06771B7463c90765I5998a63689
$$ -143503 5897 117195 -33238 -130755 217084 259027 -106771 27463 -390765 95998 -163689
16035A9426a26531r3037A05849m0414a25528D93264d21164a14027A16950m2435
$$ 19426 -126531 -219568 105849 65435 -125528 493264 -421164 -114027 116950 74515
16025G4515N3819b01950P9416G4820J78025o3142J2271n2368P7307a12009i931
$$ 74515 128334 -201950 -122534 74820 252845 189703 201974 149606 226913 -112009 -9931
16013a82401I5358H136c85473A7388c10350a36837A95081r1109J76609g8387j34054
$$ -182401 95358 8136 -385473 17388 -310350 -136837 195081 103972 280581 -78387 -212441
16002b12441H56c16807G3120e5418A6829a79240F4370d4129m8596H4674m0260
$$ -212441 856 -316807 73120 -55418 16829 -179240 64370 -44129 -92725 84674 44414
15991D4414r295N4271J32728q7399a36593B5891b6599l26319a49979A75464H2161
$$ 44414 35119 89390 222118 134719 -136593 25891 -26599 -352918 -149979 175464 82161
15979c81412R2320A76305b00308B3743a72696l3844h5110A14715g6495k2866Q282
$$ -381412 -289092 176305 -200308 23743 -172696 -206540 -85110 114715 -76495 -99361 -91079
15968i1079L9644k88551a23480B12611E9637O0402K03772F1358c00175H0056b42833
$$ -91079 -51435 -339986 -123480 212611 59637 120039 323811 61358 -300175 80056 -242833
15956a77286p0952b5840F8969e694j1539m21690g9125m1810j44300I4685k6317
$$ -177286 -248238 -25840 68969 -5694 -17233 -438923 -79125 -120935 -265235 94685 68368
15945F8368Q4141a93045c1878j23314d4989k09415B04259c90222a76472p2247
$$ 68368 152509 -193045 -31878 -155192 -44989 -254404 204259 -390222 -176472 -248719
15935b48719A40381k4397M7351b29122j32388d4338r3454A10130m8906H507a67507
$$ -248719 140381 115984 163335 -229122 -361510 -44338 -137792 110130 61224 8507 -167507
15923C2822J19395b49699A6663Q4663c24765O5128J14731B4745L1832M1624j1972
$$ 32822 152217 -249699 16663 101326 -324765 -259637 -144906 24745 56577 98201 86229
15912H6229c0827A0987b56792l1983N3065c1418r4385r1903k2474e5176I4049
$$ 86229 -30827 10987 -256792 -288775 -235710 -31418 -125803 -217706 -240180 -55176 94049
15900B34362a01745G1234b71346G7658A4805J37387a31953A6171O3426j0466f3246
$$ 234362 -101745 71234 -271346 77658 14805 152192 -131953 16171 79597 69131 -63246
15888a07276B56748a01713A2982M9968d6166a5828k76198J43645h536j02504M4365
$$ -107276 256748 -101713 12982 62950 -46166 -15828 -292026 -148381 -8536 -111040 -66675
15877f6675k90466B983a2539k1980p7546E245P2742C8843b33526A58758m9387
$$ -66675 -357141 2983 -12539 -34519 -112065 5245 77987 38843 -233526 158758 109371
15866A09371a42550C5493M7609d4832I3662a84475D9432a92984n2241B5990a94715
$$ 109371 -142550 35493 83102 -44832 93662 -184475 49432 -192984 -245225 25990 -194715
15854B8340a12774j2638D7811L6591P9681g3620C18046c3740k44172J28960e0574
$$ 28340 -112774 -125412 47811 84402 164083 -73620 318046 -33740 -277912 -148952 -50574
15842c2873j17938N3419A46343f568k75695l6974h3881A43373a24993j69091d490
$$ -32873 -150811 -97392 146343 -6568 -282263 -319237 -83881 143373 -124993 -294084 -4490
15830F3482b24826L3579h0488A65889a73693A95091F3261K0968b80592J35740
$$ 63482 -224826 -191247 -80488 165889 -173693 195091 63261 84229 -280592 -144852
15820a44852F2064a78891g0239j06218H6521J7231h6587R468m8184G4165R4027
$$ -144852 62064 -178891 -70239 -176457 86521 103752 -86587 -77119 -125303 74165 168192
15809A68192h8209P167j82828e5648A16383i6673F9110h1422j77184i8193E3629
$$ 168192 -88209 -81042 -263870 -55648 116383 -96673 69110 -81422 -258606 -98193 53629
15797a71126l8525H6564J1112L3574M2a52928B19407I6907b71709A4940J29899
$$ -171126 -209651 86564 97676 131250 131292 -152928 219407 96907 -271709 14940 144839
15786A44839i9329K8718j59481N6994R737A08919C7015c1717m6597j04836i0247
$$ 144839 -99329 -70611 -230092 -173098 -163361 108919 37015 -31717 -78314 -183150 -90247
15774a38032M5351G6820b21011I3876K2603n2482J02513a0201j63739c3684r3402
$$ -138032 -92681 76820 -221011 93876 116479 63997 166510 -10201 -173940 -33684 -127086
15763a27086a8605j61547A43695c23574O0120A3624o293L4468K04582E4930c8595
$$ -127086 -18605 -180152 143695 -323574 -263454 13624 7331 41799 246381 54930 -38595
15751g2797a1516H4590b99232D0986k735K27822i0140q1380G8084a37673k11115
$$ -72797 -11516 84590 -299232 40986 38251 266073 -90140 -171520 78084 -137673 -348788
15740c48788h1741c2063a3477A91211b03867B9602b37722g7164A02321k0091L9655
$$ -348788 -81741 -32063 -13477 191211 -203867 29602 -237722 -77164 102321 82230 121885
15729A21885p219e0334A1630d2511H6442d70097a2779m77706F7007Q2816J38229
$$ 121885 114666 -50334 11630 -42511 86442 -470097 -12779 -490485 67007 149823 288052
15718B88052j41402p0987e5142j63713D9560d3820a9709A53675c06137Q5717C2576
$$ 288052 146650 75663 -55142 -218855 49560 -43820 -19709 153675 -306137 -220420 32576
15706h9123a4733A4235K04400f8387q6397A55701c5181j00262A60189j4908O5416
$$ -89123 -14733 14235 218635 -68387 -154784 155701 -35181 -135443 160189 145281 210697
15695B10697D5641i724A32231f2771m322C3858e4502B02379d3964C170a45371
$$ 210697 45641 -9724 132231 -62771 -67093 33858 -54502 202379 -43964 3170 -145371
15683c7684j41050Q0610B39331b43707B20865c99764c9642p7439j65644D0094
$$ -37684 -178734 -98124 239331 -243707 220865 -399764 -39642 -117081 -282725 40094
15672c684A84630G6442e0490J1433a8440A52505a47883B3566a5792I6284h945
$$ -3684 184630 76442 -50490 -39057 -18440 152505 -147883 23566 -15792 96284 -8945
15660a95026E5154A000J91779h6084j21677A33176b68265r7803a80903B95143
$$ -195026 55154 1000 192779 -86084 -207761 133176 -268265 -366068 -180903 295143
15649d18908a5399q8205c8044I338b0977p3841I7736Q1439b17255B73548c65003
$$ -418908 -15399 -103604 -38044 9338 -20977 -94818 97736 179175 -217255 273548 -365003
15637b09298B10112e065m5778A43904B5206b75615a00659B16285B4585f9564C5067
$$ -209298 210112 -5065 -50843 143904 25206 -275615 -100659 216285 24585 -69564 35067
15625A0796a45526n0253H0670k2078F449b10994C4901J05816N0914a27013A12287
$$ 10796 -145526 -195779 80670 58592 6449 -210994 34901 140717 191631 -127013 112287
15613C8827a33594A33001a42378p2278n5223c0167j90827n3281a0748j54786A11709
$$ 38827 -133594 133001 -142378 -214656 -269879 -30167 -220994 -274275 -10748 -165534 111709
15601F6420j9807j3938a67252g5379K5555k54785e8257k52491i6660k52534A09542
$$ 66420 46613 32675 -167252 -75379 -49824 -304609 -58257 -310748 -96660 -349194 109542
15589i8916B46346C5416d1216j67143a02846a1418n5878l01346A06860f5718j77044
$$ -98916 246346 35416 -41216 -208359 -102846 -11418 -67296 -368642 106860 -65718 -242762
15578b42762O5507A09643k5281a99244a5511j36901G8690e2618n2326j2542c1365
$$ -242762 -177255 109643 84362 -199244 -15511 -152412 78690 -52618 -104944 -117486 -31365
15566a54597p8936B30665f8791j48642A7380a03397A83857a89429D6440c56259
$$ -154597 -233533 230665 -68791 -217433 17380 -103397 183857 -189429 46440 -356259
15555F6958M04612B17396b38955m7254B6569a97602R1310M9225A6209b0846F0797
$$ 66958 471570 217396 -238955 -286209 26569 -197602 -106292 -57067 16209 -20846 60797
15543C11697j27202j8906K4772F2337N6877I098e593A85407m5716A4521b15579
$$ 311697 184495 165589 190361 62337 119214 9098 -5593 185407 139691 14521 -215579
15531b8767j08579c3373j44535e6558j11296A77122o2729D3963L25934q7261j5898
$$ -28767 -137346 -33373 -177908 -56558 -167854 177122 114393 43963 369897 282636 266738
15520B66738F3539R5300g9367c4569A23654R7782a52562A95926a76005d6664B15935
$$ 266738 63539 158839 -79367 -34569 123654 221436 -152562 195926 -176005 -46664 215935
15508A03045O2687i501j03985l2003K3446p2655B21159J70978E8612k5044a55510
$$ 103045 165732 -9501 -113486 -145489 -122043 -194698 221159 392137 58612 33568 -155510
15496e2595k7863a0393I6618b9074A45792g9199A13430b76139M8377k8237E0548
$$ -52595 -80458 -10393 96618 -29074 145792 -79199 113430 -276139 -227762 -255999 50548
15484a8049k82460M3304L9876O5843A00338a1036r4954A05104C2823N7578k3616
$$ -18049 -300509 -257205 -217329 -151486 100338 -11036 -105990 105104 32823 90401 66785
15473F6785K5346J60916J07876b66004H3684l4382i3567p5190C7732c5231E9199
$$ 66785 92131 253047 360923 -266004 83684 49302 -93567 -168757 37732 -35231 59199
15461c28724Q7081a14167A90323Q5314C3217b8761A50563P9981H8647J48358d5561
$$ -328724 -241643 -114167 190323 275637 33217 -28761 150563 230544 88647 237005 -45561
15449a06319p7420C5306f0118q1059M5358A28692f4125C62959j41568G8264K0208
$$ -106319 -183739 35306 -60118 -141177 -95819 128692 -64125 362959 221391 78264 98472
15438I8472m104D1876R8659J6030a95385G082a10844B3778a14948J0405A00375
$$ 98472 94368 41876 140535 156565 -195385 7082 -110844 23778 -114948 -104543 100375
15426b2722j48318n0162d4429A78586b51771J14935M7091C7796G796N9447j5548
$$ -22722 -171040 -221202 -44429 178586 -251771 -136836 -89745 37796 7796 67243 51695
15415E1695N6080a60807I9228J59580d78396b29644e8458l4945E8479J4610f5771
$$ 51695 107775 -160807 99228 258808 -478396 -229644 -58458 -93403 58479 73089 -65771
15403C01858b66416F8061a74767N2510D8278J65270r6958b33381A25660a86705
$$ 301858 -266416 68061 -174767 -122257 48278 213548 116590 -233381 125660 -186705
15392D485c3285j07121C87246e8151E2694J66945r7439b0792C06410o2289A20844
$$ 4485 -33285 -140406 387246 -58151 52694 219639 122200 -20792 306410 244121 120844
15380d3226A05370g2933A07527B0152K5972J54024A0452c30194H3446K35053b76544
$$ -43226 105370 -72933 107527 20152 46124 200148 10452 -330194 83446 318499 -276544
15368i045B09369L4731b27028B00727H4723a01243D6956B0691a21088C5491a12866
$$ -9045 209369 244100 -227028 200727 84723 -101243 46956 20691 -121088 35491 -112866
15356A3155b34119c3281k59851J46033N7613F9411f4589A23928h0030J2471N746
$$ 13155 -234119 -33281 -293132 -147099 -89486 69411 -64589 123928 -80030 -67559 -61813
15345f1813A06885J6453b8626k66456K3640D38026A49258j4268n8526l0024J23538
$$ -61813 106885 123338 -28626 -295082 -271442 438026 149258 134990 76464 46440 169978
15334A69978j9703R8297b15645e1611R324j44016F41g4457h645A38449f1638A33224
$$ 169978 150275 248572 -215645 -51611 -42287 -186303 641 -74457 -8645 138449 -61638 133224
15321A04857b86921J03263A5810K54359j09509j3586E1222f007m7571m9651k7016
$$ 104857 -286921 -183658 15810 270169 160660 147074 51222 -6007 -53578 -103229 -130245
15310a30245A79815a9431A89793F7781c10033J28311A6852L460K55408i8718B46449
$$ -130245 179815 -19431 189793 67781 -310033 -181722 16852 20312 275720 -98718 246449
15298A19894b45523A38086J36451j05554q2576b41183F8815A9530L47785j75152
$$ 119894 -245523 138086 274537 168983 86407 -241183 68815 19530 367315 192163
15288A92163E3702b17791b613B39372j18389c3865A04048L6286b23169I3322Q5019
$$ 192163 53702 -217791 -2613 239372 120983 -33865 104048 140334 -223169 93322 178341
15277A78341m0824h4329B321K67154A13774N544a35225F5130a17330G791a82616
$$ 178341 137517 -84329 2321 269475 113774 119318 -135225 65130 -117330 7791 -182616
15265D19257j09771b58017E6364J19461a13389d6062F7419a2048A23612l5930
$$ 419257 309486 -258017 56364 175825 -113389 -46062 67419 -12048 123612 87682
15255H7682A4817J96632G4005K87214j59973M32892j02505K90280j85945O03402
$$ 87682 14817 211449 74005 361219 201246 634138 531633 821913 635968 1239370
15245A239370L59507n33631k48565C16653O3206k2647A24966D7525a14369A36637
$$ 1239370 1598877 1065246 816681 316653 379859 357212 124966 47525 -114369 136637
15234b73779g3522A34746a9059E8847N673A5913J21240F4604L12198A2898N3276
$$ -273779 -73522 134746 -19059 58847 64520 15913 137153 64604 376802 12898 66174
15223F6174K70972j30980Q0848a36167B7971O7193K68811A22310m5475a47505
$$ 66174 337146 206166 287014 -136167 27971 95164 363975 122310 76835 -147505
15212B06179h7970A32631b65410f2502F2936J62832H3176N1858b13482C39445
$$ 206179 -87970 132631 -265410 -62502 62936 225768 83176 135034 -213482 339445
15201B73562D0108A203J3363J04871a87321k7359B5261b6130A04499h6344j35234
$$ 273562 40108 1203 14566 119437 -187321 -214680 25261 -26130 104499 -86344 -221578
15190b21578B9141J074J75707o6548C3060c23187a09843D8084J68999l2476J3698
$$ -221578 29141 30215 205922 139374 33060 -323187 -109843 48084 217083 184607 198305
15179A98305i8042D9975f6227A35448b24334e3372C07934d6679B71393D4333K05475
$$ 198305 -98042 49975 -66227 135448 -224334 -53372 307934 -46679 271393 44333 249808
15168B49808b24564A6067P5193N11697b00830F9721a6076B31468d8070q9956D0610
$$ 249808 -224564 16067 91260 602957 -200830 69721 -16076 231468 -48070 -138026 40610
15156B05481i4797a3134n6376o7235C20902C8036Q5533r013J2311a10576h996
$$ 205481 -94797 -13134 -69510 -136745 320902 38036 123569 114556 126867 -110576 -8996
15144B10270b03354A61951R8309I0204m318n771c3428E9252J13191G1721a19459
$$ 210270 -203354 161951 260260 90204 85886 80115 -33428 59252 172443 71721 -119459
15132C50583A00724K67772a73889A54464K3358J96409j64265o9362A3805O0088
$$ 350583 100724 368496 -173889 154464 177822 374231 209966 140604 13805 73893
15122G3893a20359D1761j3760L17225A39006d5042A28046M708a89140A1289J14643
$$ 73893 -120359 41761 28001 345226 139006 -45042 128046 132754 -189140 11289 125932
15111A25932O0346H7415a20541A65532F1637J01124e6441m9667D70958A45027
$$ 125932 186278 87415 -120541 165532 61637 162761 -56441 -106108 470958 145027
15100C1486h8394B80476A0464L76891c6941A99093a25142J5102Q376C2844J9429
$$ 31486 -88394 280476 10464 387355 -36941 199093 -125142 -110040 -101664 32844 52273
15089E2273a30762B95299I0724K54863j68084d927A05872J15156a77664B64693
$$ 52273 -130762 295299 90724 345587 177503 -4927 105872 221028 -177664 264693
15078B98806m4348r6915h6558J5846D08004a59216e4700A52723O9948a06248A67880
$$ 298806 254458 157543 -86558 -70712 408004 -159216 -54700 152723 222671 -106248 167880
15066e6289B87098e0625k7058j231h360o4661C18548l4487A35866m0992R5862
$$ -56289 287098 -50625 -77683 -78914 -8360 -73021 318548 284061 135866 94874 190736
15055A90736r3249e9904A95401P6187L3234J22124A81954a11431C7425N33668
$$ 190736 97487 -59904 195401 271588 304822 426946 181954 -111431 37425 571093
15045E71093h9404C05991a18798j06446B02385J27294P7632I8108L8343c2613
$$ 571093 -89404 305991 -118798 -225244 202385 329679 407311 98108 136451 -32613
15034D37349A39618K27667o7628A34843J16238q2164O5498j1692L9649c5391B17715
$$ 437349 139618 367285 299657 134843 251081 168917 234415 222723 262372 -35391 217715
15022A65400R3791L13340a77834C69902A57311J29797H4709J74737H6060O01266
$$ 165400 259191 572531 -177834 369902 157311 287108 84709 259446 86060 687326
15012F87326A58091L1737P7638K17581D6516e8928E64986k65998J48347D4076
$$ 687326 158091 189828 267466 485047 46516 -58928 564986 298988 447335 44076
15001C58466m0253j25851L39184e953I9077J22245k1162b47696B25898N15813
$$ 358466 318213 192362 531546 -5953 99077 221322 200160 -247696 225898 741711
14991G41711B39073b13223A98952Q9221l389L1662E7253M76408j52492I8123L58114
$$ 741711 239073 -213223 198952 288173 284784 316446 57253 533661 381169 98123 456237
14980D56237A20518D7008K64831j27481Q4463D6015J82120j3308D1659N0951J58697
$$ 456237 120518 47008 311839 184358 268821 46015 228135 214827 41659 92610 251307
14969B51307A16735h2782k7859C30017k7175I1296e2476E49841k39952P1801j05901
$$ 251307 116735 -82782 -110641 330017 302842 91296 -52476 549841 309889 381690 275789
14958B75789I0301L29890a30247A95976a80364C0741c0754B66285J66937c3696
$$ 275789 90301 420191 -130247 195976 -180364 30741 -30754 266285 433222 -33696
14947C16254p1039l9900M0233A5028M10776b2281I7496J35930c6770C81340j19217
$$ 316254 245215 205315 245548 15028 425804 -22281 97496 233426 -36770 381340 262123
14936B62123O1907K47760k03503j18334K09244A60359m392J06739a71726C62027
$$ 262123 324030 571790 368287 249953 459197 160359 155967 262706 -171726 362027
14925D320M05132r7080o8175P1029j47163N18054k17890A2996K22602G7450J80995
$$ 4320 409452 312372 244197 315226 168063 686117 468227 12996 235598 77450 258445
14914B58445K70421N8628q1452J57943E8776J02893R2730A02641J84712L20508
$$ 258445 528866 587494 506042 663985 58776 161669 254399 102641 287353 607861
14904F07861k74969b8925B32496l5175P5181m5786L27157k52662K24951F8028
$$ 607861 332892 -28925 232496 197321 272502 226716 553873 301211 526162 68028
14893E65314B39785L80842k92781N3484H3092L75967j81874J58390k1906P5231
$$ 565314 239785 620627 327846 381330 83092 459059 277185 435575 413669 488900
14883D88900M4335A25513C709Q0752L03661A88846L31699k03146j3369q0415L71848
$$ 488900 533235 125513 3709 84461 388122 188846 520545 317399 304030 223615 595463
14872E95463j42480B01523C0723L60948m6145K01436j9689k25426l6576M20881
$$ 595463 452983 201523 30723 391671 345526 546962 527273 301847 265271 686152
14862F86152A94826O95827j13684l57966j38371j3700K76755j68374L05105l9219
$$ 686152 194826 890653 776969 419003 280632 266932 543687 375313 680418 641199
14852F41199j56257p2055A63533K91264j02740j17814J87820K06386j82855A93148
$$ 641199 484942 412887 163533 454797 352057 234243 422063 628449 445594 193148
14841E36284A91277k8806K29171J72287A19652J42443J20486p4018L23551e095
$$ 536284 191277 162471 391642 563929 119652 262095 382581 308563 632114 -5095
14830C02794L84640k44134j49586L82341A73882K00222r9352J69094A83041L73466
$$ 302794 687434 443300 293714 676055 173882 374104 274752 443846 183041 556507
14820E56507q4703O7316k9832N5383j73628L8515j73871J54504J30975j39095
$$ 556507 471804 539120 509288 564671 391043 429558 255687 410191 541166 402071
14810D02071L39418k25250K55756l46413j68329K83289k8457j49822L48063A17452
$$ 402071 741489 516239 771995 425582 257253 540542 512085 362263 710326 117452
14799C99613J17380K55008k06966k24897K23472k58715J11606N33481j37752J35301
$$ 399613 516993 772001 565035 340138 563610 304895 416501 949982 812230 947531
14789I47531l34018m2948Q6942l02910M64040k73033j77972L99524o3894k03466
$$ 947531 613513 570565 657507 354597 818637 545604 367632 767156 703262 499796
14779D99796L92838D02359f873E65694N6690K9738J57605B03115K90024K36148
$$ 499796 892634 402359 -6873 565694 622384 652122 809727 203115 493139 729287
14769G29287o966j22393B42065N24034m7896q4938r3542L16006j0705P5086m54096
$$ 729287 722321 599928 242065 766099 718203 633265 539723 855729 845024 920110 466014
14758D66014L29068k52206n3063L26184n3645r1309K7108j07849j39360K43109
$$ 466014 795082 542876 489813 815997 762352 671043 698151 590302 450942 694051
14748F94051l4653K2816J7400J17296j84373R460k00516R7433K07131J02051j00101
$$ 694051 659398 682214 699614 816910 632537 641997 441481 538914 746045 848096 747995
14737G47995q2187l18531K45266K90475M8693q3285K36024m41055j4778Q5586
$$ 747995 665808 347277 592543 883018 931711 848426 1084450 643395 628617 714203
14727G14203L5824k46087K24927N7906J989m5506L33395k97541J95101K56217
$$ 714203 750027 503940 728867 786773 788762 743256 1076651 779110 974211 1230428
14717A230428m02943l14757K44924K28585k41469M17620m40727k85069M12472
$$ 1230428 827485 512728 757652 986237 744768 1162388 721661 436592 849064
14708H49064K52548m47434J3747M11127q4308q8055m07426N01989j92137J43031
$$ 849064 1101612 654178 667925 1079052 994744 906689 499263 1001252 809115 952146
14698I52146p6045m3033k49693J61688L00694j99385K0776k0953J23724J47610
$$ 952146 876101 833068 583375 745063 1045757 846372 867148 846195 969919 1117529
14688A117529k81765K5196k01265K93339k64281L38519l4314m43260M4209N68544
$$ 1117529 835764 860960 659695 953034 688753 1027272 992958 549698 593907 1162451
14678A162451K8858k30671K82162l04017J11773J41453m55593L14047l31701J59166
$$ 1162451 1191309 960638 1242800 938783 1050556 1192009 736416 1050463 718762 877928
14668H77928K89749O0190M270Q0557n8217j55558j87588l2929L62929M2220k77625
$$ 877928 1167677 1227867 1232137 1312694 1254477 1098919 911331 878402 1241331 1283551 1005926
14657A005926P6121K33113n63118K60376l7103p5481N40120k64561J02193o110
$$ 1005926 1082047 1315160 752042 1012418 975315 899834 1439954 1175393 1277586 1271476
14647A271476k94342K33372P3133k74050p6153M20051k56283P984J70440j88452
$$ 1271476 977134 1210506 1283639 1009589 933436 1353487 1097204 1105188 1275628 1087176
14637A087176L82952k10984P2889m44154N76860l48165K54984p6038J69344l66507
$$ 1087176 1470128 1259144 1332033 887879 1464739 1116574 1371558 1295520 1464864 1098357
14627A098357K55037P5167Q1529k23732L42964j74870L2919j27120L03988j80520
$$ 1098357 1353394 1428561 1510090 1286358 1629322 1454452 1487371 1360251 1664239 1483719
14617A483719N1774k5023L20464l94859Q1275J64359k1510j40273j98040J90997
$$ 1483719 1535493 1510470 1830934 1436075 1517350 1681709 1660199 1519926 1321886 1512883
14607A512883J63332r738l30919L65944P1690j99156L6001m6413k69342O49058
$$ 1512883 1676215 1666477 1335558 1701502 1773192 1574036 1610037 1563624 1294282 1943340
14597A943340j36229j74666J17526K73711j23324j83766K47384j96747J2786q3096
$$ 1943340 1807111 1632445 1749971 2023682 1900358 1716592 1963976 1767229 1780015 1696919
14587A696919L74755k31792J69531j47347p7515K43902l58416J00233K41365N7077
$$ 1696919 2071674 1839882 2009413 1862066 1784551 2028453 1670037 1770270 2011635 2068712
14577B068712M7717m0568K609K4815J23603k11408M33255q4459j10382J81030
$$ 2068712 2116429 2075861 2078470 2103285 2226888 2015480 2448735 2364276 2253894 2434924
14567B434924R6410K588q5505m2703K1379j98528L35640M71117j24169J55943
$$ 2434924 2531334 2533922 2448417 2405714 2427093 2228565 2564205 3035322 2911153 3067096
14557C067096l18910O92002l2473L48005L48299P28004J535224M126017M029841
$$ 3067096 2748186 3440188 3407715 3755720 4104019 4832023 6367247 10493264 14523105
14548A4523105J912195L191162K602178L937373j887014p793802o938907l623397
$$ 14523105 16435300 19626462 22228640 26166013 24278999 16485197 9546290 5922893
14540E922893k054546r65115l34163k03792K7945J1108n70270K43835p0747L96469
$$ 5922893 3868347 2903232 2569069 2365277 2393222 2404330 1834060 2077895 2007148 2403617
14530B403617j04812k07969P3316L39867j33608J07368J59032j34141J9105J25188
$$ 2403617 2298805 2090836 2164152 2504019 2370411 2477779 2636811 2502670 2521775 2646963
14520B646963l27625m11K16601R9403p0198K60606j08856J41104Q2571j50688
$$ 2646963 2319338 2318927 2535528 2634931 2564733 2825339 2716483 2857587 2940158 2789470
14510B789470j35817J61869Q3306K10198q9802M1878r7671j64203N98710k27457
$$ 2789470 2653653 2815522 2898828 3109026 3019224 3061102 2963431 2799228 3397938 3170481
14500C170481j15090J14334r3583J75547L8823N491J2028P5823j4959J50580L24635
$$ 3170481 3055391 3169725 3076142 3251689 3290512 3296003 3308031 3383854 3368895 3519475 3844110
14489C844110k28684j53406K06733k92503J64401j06437L65572J8514n2876J32890
$$ 3844110 3615426 3462020 3668753 3376250 3540651 3434214 3799786 3818300 3765424 3898314
14479C898314J835P0344O4782J94952J60647m4563m06807M14301l20828N07825
$$ 3898314 3900149 3970493 4035275 4230227 4390874 4346311 3939504 4353805 4032977 4540802
14469D540802J24534j22400L03012k99268j34679J23210L01626j02843J01918
$$ 4540802 4665336 4542936 4845948 4546680 4412001 4535211 4836837 4733994 4835912
14460D835912J77296p3920K89155l96065L06415j42238K98979L11558L4631J52693
$$ 4835912 5013208 4939288 5228443 4832378 5138793 4996555 5295534 5607092 5641723 5794416
14450E794416r8749J10221k4349j10471L35623j57010J73428M3248p8147L16434
$$ 5794416 5695667 5805888 5781539 5671068 6006691 5849681 6023109 6066357 5988210 6304644
14440F304644J87205l23236Q0052O12172m03036J63809K98875o6015L8189J37296
$$ 6304644 6491849 6168613 6248665 6860837 6457801 6621610 6920485 6854470 6892659 7029955
14430G029955K45609M8561M2802Q0225K73282l8280O9457J76568k780Q7520J56504
$$ 7029955 7275564 7324125 7366927 7447152 7720434 7682154 7751611 7928179 7925399 8012919 8169423
14419H169423m1651L21113L0986K16691n0353M44946M8660j60964K46110K16066
$$ 8169423 8127772 8448885 8479871 8696562 8646209 9091155 9139815 8978851 9224961 9441027
14409I441027J20612R9965K66707r1151K20597N3678J27308L28717L53642J0856
$$ 9441027 9561639 9661604 9928311 9837160 10057757 10111435 10238743 10567460 10921102 10931958
14399A0931958k21653N28106J16540K07313K27324m7152L68898q5444M30729J31584
$$ 10931958 10710305 11238411 11354951 11562264 11789588 11742436 12111334 12025890 12456619 12588203
14389A2588203K35276O67432J43163n6904Q12966q8988M86869J1558M68502R5203
$$ 12588203 12823479 13490911 13634074 13577170 14390136 14301148 14788017 14799575 15268077 15363280
14379A5363280R2044M00203K73151L64747L21687M84863m2824O32564K41554M13931
$$ 15363280 15455324 15855527 16128678 16493425 16815112 17299975 17257151 17889715 18131269 18545200
14369A8545200M6017O05947L52820L86478O05012K6018P22418N24540K36170Q20292
$$ 18545200 18591217 19197164 19549984 19936462 20541474 20567492 21289910 21814450 22050620 22870912
14359B2870912J33843J079891K07886N17317N80758L22831J149409L08398N02412
$$ 22870912 23004755 24084646 24292532 24809849 25390607 25713438 26862847 27171245 27673657
14350B7673657P32417Q16210L81109R52932P95802P09482Q46988P34078J030002
$$ 27673657 28406074 29222284 29603393 30556325 31352127 32061609 32908597 33642675 34672677
14341C4672677R81374Q49056R35825J382902R07827J265681J276502J119862J322583
$$ 34672677 35654051 36503107 37438932 38821834 39729661 40995342 42271844 43391706 44714289
14332D4714289J092337J742739J163768J782979J374308J617881J645571J876904
$$ 44714289 45806626 47549365 48713133 50496112 51870420 53488301 55133872 57010776
14324E7010776K043964K203962J985004J937076K020627K828604K393953K871416
$$ 57010776 59054740 61258702 63243706 65180782 67201409 70030013 72423966 75295382
14316G5295382K492080L338776K673781L386677L532735L519492M091693L859824
$$ 75295382 77787462 81126238 83800019 87186696 90719431 94238923 98330616 102190440
14308A02190440M651282M383968M714689N221607N580272N663920N888796O543967
$$ 102190440 106841722 111225690 115940379 121161986 126742258 132406178 138294974 144838941
14300A44838941O824451P267434P961653Q119145Q584013R039350J0173148J0215624
$$ 144838941 151663392 158930826 166892479 175011624 183595637 192634987 202808135 213023759
14292B13023759J0544720J1731186J2035607J2657963J3367156J3725974J4175147
$$ 213023759 223568479 235299665 247335272 259993235 273360391 287086365 301261512
14285C01261512J4292919J5170400J4948750J5340005J4878509J4653391J4358310
$$ 301261512 315554431 330724831 345673581 361013586 375892095 390545486 404903796
14278D04903796J3272150J2077376R693264M545003l759830j1168076l966429
$$ 404903796 418175946 430253322 439946586 444491589 440731759 429563683 425597254
14271D25597254R88029J661528N430334N331971j110590m040256p218810q514824
$$ 425597254 426585283 428246811 433677145 439009116 437898526 433858270 426639460 418124636
14263D18124636r133091j0425801j1956993j3413068j4497793j5502578j5209305
$$ 418124636 408991545 398565744 386608751 373195683 358697890 343195312 327986007
14256C27986007j5370307j4932448j4359558j3527648j2996130j2421592j2588152
$$ 327986007 312615700 297683252 283323694 269796046 256799916 244378324 231790172
14249B31790172j1245235j0835628j0190625r683915r445132q168604q223641
$$ 231790172 220544937 209709309 199518684 189834769 180389637 172221033 163997392
14242A63997392p619488o963029o865788o351163o423819n193700n254174n163162
$$ 163997392 156377904 149414875 142549087 136197924 129774105 124580405 119326231 114163069
14234A14163069m933715m727568m127953m013936l526903l704664l593059l403104
$$ 114163069 109229354 104501786 100373833 96359897 92832994 89128330 85535271 82132167
14226H2132167k956803l091656k719611k357519k766169k347422j952721k227201
$$ 82132167 79175364 76083708 73364097 71006578 68240409 65892987 63940266 61713065
14218F1713065k176267j911188j955607j567593j538066j918060j480324j700188
$$ 61713065 59536798 57625610 55670003 54102410 52564344 50646284 49165960 47465772
14210D7465772j016555j501468j294080r84957j112497r92931j430252j097187
$$ 47465772 46449217 44947749 43653669 42668712 41556215 40563284 39133032 38035845
14202C8035845n15346j433353j036936l76160j298893r43993q16372o24383p07090
$$ 38035845 37520499 36087146 35050210 34674050 33375157 32431164 31614792 30990409 30283319
14193C0283319p68246j012878q04099l15917p40872o18401n82060o51094m39785
$$ 30283319 29515073 28502195 27698096 27382179 26641307 26022906 25440846 24789752 24349967
14184B4349967r84252j75700o32366m41175m01063m53268q87461k58679k60555
$$ 24349967 23365715 23190015 22557649 22116474 21715411 21262143 20374682 20116003 19855448
14175A9855448k84560p82086j49969j91767l30352n85980l96232M6122n41474
$$ 19855448 19570888 18788802 18638833 18447066 18116714 17530734 17134502 17180624 16639150
14166A6639150k44819l07016m88688n6117j99067o80928k63871R29q0104k73599
$$ 16639150 16394331 16087315 15598627 15542510 15343443 14662515 14398644 14399573 14319469 14045870
14156A4045870o26173o891j3080m83210J50276n70519K4437m7626l80136k60695
$$ 14045870 13419697 13412806 13399726 12916516 13066792 12496273 12520710 12473084 12092948 11832253
14146A1832253l56508K2829m09759P3476k70535J3629l50317j92379M3176l55522
$$ 11832253 11475745 11498574 11088815 11162291 10891756 10905385 10555068 10362689 10405865 10050343
14136A0050343Q9553l72067J55383l12319k1973J5774k91930j98394j65563l74298
$$ 10050343 10139896 9767829 9923212 9610893 9588920 9604694 9312764 9114370 8948807 8574509
14126H574509R7732l18587K6444j12649j81611m4045o5425o3553k58882r8430
$$ 8574509 8672241 8353654 8380098 8267449 8085838 8041793 7976368 7912815 7653933 7555503
14116G555503j19519k6502j19278R7860l70123k3769k66841K13197k52814K82279
$$ 7555503 7435984 7409482 7290204 7388064 7017941 6994172 6727331 6940528 6687714 6969993
14106F969993r9436m60348o8634o0222J40100j24670M0105o07002M21548o9492
$$ 6969993 6870557 6410209 6341575 6281353 6421453 6296783 6336888 5729886 6151434 6081942
14096F081942k61037K70825l032j75088k71532j99030j26989R3787K41010l34226
$$ 6081942 5820905 6091730 6088698 5913610 5642078 5443048 5316059 5409846 5650856 5316630
14086E316630L3376m06154J80449J63838k06531P9659l41104L03939k0024j61802
$$ 5316630 5350006 4943852 5124301 5288139 5081608 5161267 4820163 5124102 5104078 4942276
14076D942276k07460q4972J11938m1158l68562L37033m5367k51219k3754L21344
$$ 4942276 4734816 4649844 4761782 4720624 4352062 4689095 4643728 4392509 4368755 4690099
14066D690099l15893k75964j11419L18815l88188L88904r4837m8083o2035N6879
$$ 4690099 4374206 4098242 3986823 4305638 3917450 4306354 4211517 4163434 4101399 4158278
14056D158278l0870m01159L8433J06892j6684j95444m05050L91387N6028p1462
$$ 4158278 4127408 3726249 3764682 3871574 3854890 3659446 3254396 3645783 3701811 3630349
14046C630349J2129p5764j00121k72164K64156L1059l46883P8467K78630k01593
$$ 3630349 3642478 3566714 3466593 3194429 3458585 3489644 3142761 3221228 3499858 3298265
14036C298265m0243k33434K28436j72548R8582P2927j50751j73634m0076N34496
$$ 3298265 3258022 3024588 3253024 3080476 3179058 3251985 3101234 2927600 2887524 3422020
14026C422020j36284k82224K25378j28776k62379L03342m5517n25466J64827J81490
$$ 3422020 3285736 3003512 3228890 3100114 2837735 3141077 3095560 2570094 2734921 2916411
14016B916411j79005j66648L4315k66083K93667j95212J66639j56938j27638J15547
$$ 2916411 2737406 2570758 2605073 2338990 2632657 2437445 2604084 2447146 2319508 2435055
14006B435055j73252K70113m5439J46239l63204j10541J11443j34774J373O7746
$$ 2435055 2261803 2531916 2486477 2632716 2269512 2158971 2270414 2135640 2137013 2204759
13996B204759o3942j84075J081J2929N58385J140894L143337M506080J982698
$$ 2204759 2140817 1956742 1957823 1970752 2529137 3670031 6813368 11319448 13302146
13987A3302146K910215L604972M792978N36423o315187o995471l966471j865593
$$ 13302146 16212361 19817333 24610311 25146734 18831547 11836076 7869605 6004012
13979F004012r85413q60857m25544q4276k30063n34175o1428J18316j19677n5093
$$ 6004012 5018599 4157742 3732198 3647922 3417859 2883684 2822256 2940572 2820895 2765802
13969B765802j38738l03083J86322k42498o0187j10262N15590j49899l21735q7220
$$ 2765802 2627064 2323981 2510303 2267805 2207618 2097356 2612946 2463047 2141312 2054092
13959B054092J96633o7807J2394k62327K86572J72106m90195J85474J6274m85684
$$ 2054092 2250725 2182918 2195312 1932985 2219557 2391663 1901468 2086942 2103216 1617532
13949A617532M91198k07444L25425j29370k02765N6209j90367j06766N28985l72343
$$ 1617532 2108730 1901286 2226711 2097341 1894576 1950785 1760418 1653652 2182637 1810294
13939A810294L904m2206r8132J43555k77944J78219j51950N3714R3242k19472
$$ 1810294 1814198 1771992 1673860 1817415 1539471 1717690 1565740 1619454 1712696 1493224
13929A493224K77501R4400m30998k097J98642k39456P8575j607J89753r2214q3509
$$ 1493224 1770725 1865125 1434127 1432030 1630672 1391216 1469791 1468184 1657937 1565723 1482214
13918A482214K04900j35211j01769j59960L09774q9020j4444k34505J17002J29030
$$ 1482214 1687114 1551903 1450134 1290174 1599948 1510928 1496484 1261979 1378981 1508011
13908A508011M6677p2746K30961l03745K17419l9162J89504l57553P2661k28971
$$ 1508011 1554688 1481942 1712903 1409158 1626577 1587415 1776919 1419366 1492027 1263056
13898A263056J87620j45609K54908j07028q9950p9782j2603R9796M4527j37629
$$ 1263056 1450676 1305067 1559975 1452947 1362997 1283215 1270612 1370408 1414935 1277306
13888A277306j19727J68517j53541K25679L9333n61125P44417k95233J06052j83295
$$ 1277306 1157579 1326096 1172555 1398234 1437567 876442 1620859 1325626 1431678 1248383
13878A248383L40483o85648M00968P7723k21224L21220l02262r7498j84417O79498
$$ 1248383 1588866 903218 1304186 1381909 1160685 1481905 1179643 1082145 897728 1577226
13868A577226l97928J28633l09298j2703r0466L93895m14495N979N3163M45020
$$ 1577226 1179298 1307931 998633 985930 895464 1289359 874864 880843 934006 1379026
13858A379026l16166J36972j41285l5117m6248j22498L96872j79044j02367p1341
$$ 1379026 1062860 1199832 1058547 1023430 977182 854684 1251556 1072512 970145 898804
13848H98804L37710l28472R207M7873J09255j40932K03044l0726K2584o587O3296
$$ 898804 1236514 908042 917249 965122 1074377 933445 1136489 1105763 1128347 1121760 1185056
13837A185056q3593k84865L27239N9161k38257j71998L04080M9584l27978j80935
$$ 1185056 1101463 816598 1143837 1202998 964741 792743 1096823 1146407 818429 637494
13827F37494K63847q1414K28829l457J24370q6751K7918j23931N2843k01171M21633
$$ 637494 901341 819927 1048756 1045299 1169669 1082918 1110836 986905 1039748 838577 1260210
13816A260210l29281N7920p519j27323k95042L24295j50459J08724K49602k38382
$$ 1260210 930929 988849 981330 854007 558965 883260 732801 841525 1091127 852745
13806H52745j23012K45721k93478J52618n9405o4758L02301l7540j06079Q6481
$$ 852745 729733 975454 681976 834594 775189 710431 1012732 975192 869113 955594
13796I55594j65346K83894o9834j32410J49330D25398M94647j91146K0046N3431
$$ 955594 790248 1074142 1004308 871898 1021228 425398 920045 728899 748945 802376
13786H02376j25416m8501o8627K44766J96792l13898K90127l36896O7958M1200
$$ 802376 676960 628459 559832 804598 1001390 687492 977619 640723 708681 749881
13776G49881j57882K87956l27478J40031L23544D62183K60740M2694j48038L73046
$$ 749881 591999 879955 552477 692508 1016052 462183 722923 765617 617579 990625
13766I90625C32599O02730l45039J0620j17946M21080l36891J01940q2240K38748
$$ 990625 332599 935329 590290 600910 482964 904044 567153 669093 586853 825601
13756H25601k00908j77580M38140D29375J90407k05009j13575K67017J47290m3951
$$ 825601 624693 447113 885253 429375 619782 414773 301198 568215 715505 671554
13746F71554J0607j60508L9968l6996Q8854J60449B87392N36882l36993r6289
$$ 671554 682161 521653 561621 524625 613479 773928 287392 824274 487281 390992
13736C90992K73555Q7000k76988j09098K28312L95519l83581M8654j54656K16058
$$ 390992 664547 751547 474559 365461 593773 989292 605711 654365 499709 715767
13726G15767B51982N6792L98404k52725J59869K97215l02302j87510K4733K83106
$$ 715767 251982 308774 707178 454453 614322 911537 609235 421725 446458 729564
13716G29564k8122k29707q80K93646k88371K6735J33796j04647l2470M13K6917
$$ 729564 701442 471735 470855 764501 476130 502865 636661 532014 499544 499957 526874
13705E26874m6935n3979K41948j81854o2690K71103k14902J93977j78778M1805
$$ 526874 479939 425960 667908 486054 423364 694467 479565 673542 494764 536569
13695E36569j32156R4267N01353j4240l13908k87385M0156o293l1306L22729R4400
$$ 536569 404413 498680 1000033 985793 671885 384500 424656 418363 387057 709786 804186
13684H04186j86706k2593k5847J6849j81175M8553P0067J91671k96327n6674L35459
$$ 804186 617480 594887 569040 585889 404714 453267 523334 715005 418678 362004 697463
13673F97463k78053j00612J62903o3778J11137J57617C26117J08036K05133l06424
$$ 697463 419410 318798 481701 417923 529060 686677 326117 434153 639286 332862
13663C32862J90455L9958p3675J06005B22734N8198L4832K08750J8427c3526E35003
$$ 332862 523317 563275 489600 595605 222734 280932 315764 524514 542941 -33526 535003
13651H07253A79569O3163K33581j19441L65260C19355J71277j94190N1513O7038
$$ 807253 179569 242732 476313 356872 722132 319355 490632 296442 347955 414993
13641D14993j07338L30049A99362J36288l4939e417D15331L8452Q8555p6650J29602
$$ 414993 307655 637704 199362 335650 300711 -5417 415331 453783 542338 465688 595290
13630E95290B06253O43299k42124Q438q9890j63212j23172J42812J40387R4687
$$ 595290 206253 849552 607428 615866 525976 362764 239592 382404 522791 617478
13620F17478j29803j06207o2824J36151j2041j84784J10110N5563A36308J6882
$$ 617478 487675 381468 318644 454795 442754 257970 368080 423643 136308 153190
13610A53190L48728K51408B10763J86358O9682j90575L27790N1341j20030j66956
$$ 153190 501918 753326 210763 397121 466803 276228 604018 655359 535329 368373
13600C68373K57570j56319j81440N1412A09656K5991J51001J03921r0795K40294
$$ 368373 625943 469624 288184 339596 109656 135647 286648 390569 299774 540068
13590E40068q4734m8227L3215n7611R6609j68144J04114F7570K8875C5966R3017
$$ 540068 455334 407107 440322 382711 479320 311176 415290 67570 96445 35966 128983
13579A28983J39283K1833N4928L59680p6733B63392a55108C56052q4077K63490
$$ 128983 268266 290099 345027 704707 627974 263392 -155108 356052 271975 535465
13569E35465A43160L78996k55091r0569M23230k51429l4652K68396d1148A77169
$$ 535465 143160 522156 267065 176496 599726 348297 313645 582041 -41148 177169
13558A13035M00091r5489B1694K11208p7297N37566A51093K25539i1136D28960
$$ 113035 513126 417637 21694 232902 155605 693171 151093 376632 -91136 428960
13547F14503B84224K9391J4496K21386A96660J22775Q944j00246r9639B2166a45592
$$ 614503 284224 313615 328111 549497 196660 319435 328379 228133 128494 22166 -145592
13535A35418J61186j40963J45142K15586p7698j49393j27751L11695n9777K46999
$$ 135418 296604 155641 300783 516369 438671 289278 161527 473222 413445 660444
13525F60444k33981A64971J41278J4881M55623E3456K88706G4336K68768j19980
$$ 660444 426463 164971 306249 321130 776753 53456 342162 74336 343104 223124
13515B23124R9651N5012H2811Q7400J21134C6390N69603d8464D8563L29887j39468
$$ 223124 322775 377787 82811 170211 291345 36390 605993 -48464 48563 378450 238982
13504B38982L66198B45970A14011K69028j65979F4423B8961K61205j13415J35676
$$ 238982 605180 245970 114011 383039 217060 64423 28961 290166 176751 312427
13494C12427i3707B40316J47320B9582L45334M12059C27116j03684J00688N43423
$$ 312427 -93707 240316 387636 29582 374916 786975 327116 223432 324120 867543
13484H67543l01814B65465j26445m9212K54572A26792k2324L15200L58168G7572
$$ 867543 565729 265465 139020 89808 344380 126792 104468 419668 777836 77572
13473C20210G053K27094L84920A22978D8786J10464L1558q0908O0531J38641j47778
$$ 320210 7053 234147 619067 122978 48786 159250 190808 109900 170431 309072 161294
13462A61294J73564q783j23691L3652F2627J38942o653K29521I2188J10333k6925
$$ 161294 334858 326075 202384 236036 62627 201569 194916 424437 92188 202521 175596
13451A75596M6920j896n4275J35664l8206j8995L1687B7904L64801D4734J04232
$$ 175596 222516 220620 166345 302009 263803 244808 276495 27904 392705 44734 148966
13440A48966J92975I8010K13876A42390a7588D56171A79472K46817A47400J60519
$$ 148966 341941 98010 311886 142390 -17588 456171 179472 426289 147400 307919
13430C07919A41224J71765J7995h6338A33943B7120K32516i0284A85291b37964
$$ 307919 141224 312989 330984 -86338 133943 27120 259636 -90284 185291 -237964
13419B98396A02247O0074P8168j12897o710Q9280l5587j0624O3925I4071j9083
$$ 298396 102247 162321 240489 127592 120882 210162 174575 163951 227876 94071 74988
13408G4988C6700L83048A46098k9265g5941i884B15639J54308J02261i7995C79169
$$ 74988 36700 419748 146098 116833 -75941 -9884 215639 369947 472208 -97995 379169
13396B8280K13909r1380K18719A79266K20517J84469H2294k3345J21400a53756
$$ 28280 242189 150809 369528 179266 399783 584252 82294 58949 180349 -153756
13385B16039n609I2551L07803A94197a49847B2502J68152P3104l3952K49434m9921
$$ 216039 210430 92551 400354 194197 -149847 22502 190654 263758 229806 479240 429319
13374D29319b8998A97085H7006L6151N5656L11530q0158o5957m9385r2351r5345
$$ 429319 -28998 197085 87006 123157 178813 490343 410185 344228 294843 202492 107147
13363A07147R5669K200J56060j43621n2198d6087A39060C8709K26340J00054N5159
$$ 107147 202816 205016 361076 217455 165257 -46087 139060 38709 265049 365103 420262
13352D20262d719C18122I9321J8786b18085E08514m1523J21596q1876k04145J863
$$ 420262 -4719 318122 99321 118107 -218085 508514 466991 588587 506711 302566 304429
13341C04429p4651A289J27704L21271K2402B32057j7866O3955J65577J47957A5855
$$ 304429 229778 1289 128993 450264 472666 232057 214191 278146 443723 591680 15855
13329B64197A23969Q3957D6550K66676K8503F6052g053A69881L1973J0264g8673
$$ 264197 123969 207926 46550 313226 341729 66052 -7053 169881 201854 212118 -78673
13317B39330K36893A23970L85206I2517J70973J61542n9634n8498D987J39619
$$ 239330 476223 123970 509176 92517 263490 425032 365398 306900 4987 144606
13307A44606n5231b2132D65976j99498j07209L30830B32898n409H3410K11717
$$ 144606 89375 -22132 465976 266478 159269 490099 232898 227489 83410 295127
13297B95127l2627b8496n5278D2187N82356F8147k0909J28701J11413J03872A24111
$$ 295127 262500 -28496 -83774 42187 624543 68147 47238 175939 287352 391224 124111
13285D5013K99045C6498K48051c2057I4367J21676N7033E6591a35762D04830E7060
$$ 45013 344058 36498 284549 -32057 94367 216043 273076 56591 -135762 404830 57060
13273A30757K12174j21444G292J24616K15219G6447j641J95639E0880K53277A18022
$$ 130757 342931 221487 7292 131908 347127 76447 74806 270445 50880 304157 118022
13261I5565J21284c4360A29240i7602j06418G6916j1843d1366A94940a72741B14248
$$ 95565 216849 -34360 129240 -97602 -204020 76916 65073 -41366 194940 -172741 214248
13249C54461A01018L02488j91186r9708A2046a97377C83362H2848J48314Q5526
$$ 354461 101018 403506 212320 112612 12046 -197377 383362 82848 231162 316688
13239C16688I475L69609C7129a62560C50741n9496p6144b48065A13829f7306B86644
$$ 316688 9475 379084 37129 -162560 350741 291245 215101 -248065 113829 -67306 286644
13227A93013N5488D7923g3382K6467M227B67636I713K9181J48279m1885a97718
$$ 193013 248501 47923 -73382 -46915 -42688 267636 9713 38894 187173 145288 -197718
13215A27605O2311L108J62103C6411L46664j82316g6575B90233a26402B6620K57422
$$ 127605 189916 193024 355127 36411 383075 200759 -76575 290233 -126402 26620 284042
13204B84042A03230a811B80857H7066b15915d9547j5641C9764g3396o1537k3177
$$ 284042 103230 -1811 280857 87066 -215915 -49547 -65188 39764 -73396 -134933 -158110
13193a58110P2080I0560K88250k9035L7990A66304i7014A96110f8143A67262C1036
$$ -158110 -86030 90560 378810 349775 387765 166304 -97014 196110 -68143 167262 31036
13181B9801L5986a22875A75817D0411J27846J04238L6610d8792a0822k08708A19093
$$ 29801 65787 -122875 175817 40411 168257 272495 309105 -48792 -10822 -219530 119093
13169I2585a85955C30606D3253K2793L6287I98i4210A44052R14K9155M07385c6005
$$ 92585 -185955 330606 43253 66046 102333 998 -94210 144052 144966 174121 581506 -36005
13156D9409J89010L0572a38207B40109b12172c2846p6744J4618E7457K07768b06762
$$ 49409 238419 268991 -138207 240109 -212172 -32846 -109590 -94972 57457 265225 -206762
13144F1651R5820o522N1356G9820N1563b40870B00176H649K65874b52282E0733
$$ 61651 157471 150949 202305 79820 131383 -240870 200176 8649 274523 -252282 50733
13132B36553b14276a9812p0640E8831J66463J9523q6745m8059O8938M7154H8805
$$ 236553 -214276 -19812 -90452 58831 225294 244817 158072 110013 178951 226105 88805
13120A44766C6256P200h8813a2523E98241A70510j8368J24875n1053p5712K56220
$$ 144766 36256 43456 -88813 -12523 598241 170510 152142 277017 225964 150252 406472
13109D06472H6273N5886a66502C5633a38957L0181A32204k7269b10146Q3693M1588
$$ 406472 86273 142159 -166502 35633 -138957 -108776 132204 104935 -210146 -126453 -84865
13098h4865H1520k3546J97402c18886A09960J70005J08864f1816A67808h2046
$$ -84865 81520 57974 255376 -318886 109960 279965 388829 -61816 167808 -82046
13087F5776M3452J10754e3985A13957g9626D4837a9750A66881b2201j53322f5303
$$ 65776 109228 219982 -53985 113957 -79626 44837 -19750 166881 -22201 -175523 -65303
13075B16656j4419F8802a2149A75226J16715b35531j5667D72872j66317a26937
$$ 216656 202237 68802 -12149 175226 291941 -235531 -251198 472872 306555 -126937
13064B63200A00281L10564A88257J62023a47159G0412K55215F8985b21065E07672
$$ 263200 100281 410845 188257 350280 -147159 70412 325627 68985 -221065 507672
13053D28277n9779H4681K3892d698C62209j56993J76807p610a88704B45989J01972
$$ 428277 368498 84681 108573 -4698 362209 205216 382023 374413 -188704 245989 347961
13042C47961A65996b21980C16348a33118G7920J02479D1669b0159k05164I9843
$$ 347961 165996 -221980 316348 -133118 77920 180399 41669 -20159 -225323 99843
13031G7129C5679K15615K2222b93887D25012F1455R053A8723M0954J34702H2414
$$ 77129 35679 251294 273516 -293887 425012 61455 70508 18723 59677 194379 82414
13019B97249b70158D0412K34085j11297a16331k9292B31281K49891a15024B7415
$$ 297249 -270158 40412 274497 163200 -116331 -145623 231281 481172 -115024 27415
13008B1935J11442a75821a7943A47382Q4150a17651C5854M33348b0654A03867
$$ 21935 133377 -175821 -17943 147382 231532 -117651 35854 469202 -20654 103867
12997B58463F0271m762c0073q7137e7203C69601j16469h1063D5207L8812F255
$$ 258463 60271 55509 -30073 -117210 -57203 369601 253132 -81063 45207 84019 6255
12985A49022F8037j9345J13065K41336A09094L03980A87556M1565a58616B69952
$$ 149022 68037 48692 161757 403093 109094 413074 187556 229121 -158616 269952
12974B836L05186h5371L894A75448b75904A51780P7358q2085c09767C9734K11765
$$ 2836 308022 -85371 -81477 175448 -275904 151780 229138 147053 -309767 39734 251499
12963B51499a1661C13305H0695N4763b16081g4950B28041J81939a02609A73868
$$ 251499 -11661 313305 80695 135458 -216081 -74950 228041 409980 -102609 173868
12952B0180a67300C19267F1272G295h4741j30744L4497G551L07652r577A7412
$$ 20180 -167300 319267 61272 7295 -84741 -215485 -180988 7551 315203 305626 17412
12940C43890I3682O8056c67323B55029d8192A57000d6865B90312e395j6749D4568
$$ 343890 93682 161738 -367323 255029 -48192 157000 -46865 290312 -5395 -22144 44568
12928a70028g211a060j4243q8246C26926f3870A55529E2963c8246D4918J39329
$$ -170028 -7211 -1060 -15303 -103549 326926 -63870 155529 52963 -38246 44918 184247
12917A84247K05071F4326J14754A4467L20986c57616h9351E7689M3831C4710b49132
$$ 184247 389318 64326 179080 14467 335453 -357616 -89351 57689 101520 34710 -249132
12905c41211K3305R2848j07896D9008R0032o998R0728J06010P4931h8662c199
$$ -341211 -317906 -225058 -332954 49008 139040 132042 222770 328780 403711 -88662 -3199
12893b12195B1751L7173b7886N262B07870k9948A829g056A97505f3853C8878c08649
$$ -212195 21751 58924 -27886 -22624 207870 177922 1829 -7056 197505 -63853 38878 -308649
12880I4532a82485N1044p9233E3426J35851F7725K82744b14935l9971d5462J152
$$ 94532 -182485 -131441 -210674 53426 189277 67725 350469 -214935 -254906 -45462 -44310
12869d4310j17344A56981a29323f2317H9619a7098k59134c6741A02271L8972o4939
$$ -44310 -161654 156981 -129323 -62317 89619 -17098 -276232 -36741 102271 141243 76304
12858G6304J78486h9632C5151K7251a01794A26898a18429A79375c52589a73823
$$ 76304 254790 -89632 35151 62402 -101794 126898 -118429 179375 -352589 -173823
12847E19209A34445K1825J23903A35270R589l82c1061o3541A82393a35629A05878
$$ 519209 134445 156270 280173 135270 144859 144477 -31061 -94602 182393 -135629 105878
12835B46233F5781b06879A96440F9121b0132P671A22567a32005G8674R4438A5686
$$ 246233 65781 -206879 196440 69121 -20132 -12461 122567 -132005 78674 173112 15686
12823A59534g0569a1261F2059N3870e0214B14415a47232F012A635J4008K3729
$$ 159534 -70569 -11261 62059 115929 -50214 214415 -147232 6012 1635 15643 39372
12812C9372K14644q5717J60723r8420g8418k5260j72176b3717B03291J13332j26195
$$ 39372 254016 168299 329022 230602 -78418 -103678 -275854 -23717 203291 316623 190428
12801A90428N3898a06886A90086N6984C6608h8775B30497o9146C3736q763a26485
$$ 190428 244326 -106886 190086 247070 36608 -88775 230497 161351 33736 24973 -126485
12789C6715a11830B00558H80J9073f8745C84457C4342K06537F3852H491K4967
$$ 36715 -111830 200558 880 19953 -68745 384457 34342 240879 63852 8491 33458
12778C3458q51b38633B28354m5707b53932h0025j642b145j08090J429H6663b87023
$$ 33458 32607 -238633 228354 182647 -253932 -80025 -81667 -2145 -110235 -108806 86663 -287023
12765c1003A86649b56090O2439O2869A05099R2765C0582e0038b0419j10564C41672
$$ -31003 186649 -256090 -193651 -130782 105099 197864 30582 -50038 -20419 -130983 341672
12753C19771c21745A49776J7708q3184c4132A76097a0938B5242c60026C2522p610
$$ 319771 -321745 149776 167484 84300 -34132 176097 -10938 25242 -360026 32522 24912
12742B4912h6959A4188P0862B0198d7150B12728c4786A06279k3177g6537F63089
$$ 24912 -86959 14188 85050 20198 -47150 212728 -34786 106279 83102 -76537 663089
12730b5574j09492H5495L93739c4660D2701L0877a97083A10279b34903L4345P3610
$$ -25574 -135066 85495 479234 -34660 42701 73578 -197083 110279 -234903 -200558 -126948
12719a26948l52219F001L13153b1865B35518p0262l8448J0981n9053J1140K06724
$$ -126948 -479167 6001 319154 -21865 235518 165256 126808 137789 78736 89876 296600
12708B96600A45686M0565A5671K66106A10787D7605A2144b03891B59712J66079
$$ 296600 145686 186251 15671 281777 110787 47605 12144 -203891 259712 425791
12698D25791E0458N6688D4967h1030B62345j09319J11191i8200K2742n7058C6561
$$ 425791 50458 107146 44967 -81030 262345 153026 264217 -98200 -75458 -132516 36561
12686a43470D9113e9418b2907H128i7845L892A40721K22999A3890J81447r6787
$$ -143470 49113 -59418 -22907 8128 -97845 -93953 140721 363720 13890 195337 98550
12675I8550K64086e6859A55740M9921L7506a09690A3683K96348j07453A1236K36277
$$ 98550 362636 -56859 155740 205661 243167 -109690 13683 310031 202578 11236 247513
12664B47513G7151J67780p5989J25369A39993e5754G4642j7986i4882G6241J61545
$$ 247513 77151 244931 168942 294311 139993 -55754 74642 56656 -94882 76241 237786
12653B37786A11848K26984j9175a21104A74196q1761N5650b36725K1218I0658
$$ 237786 111848 338832 319657 -121104 174196 92435 148085 -236725 -215507 90658
12642c43458B1569L3611K92531A19434C4534c02303B8126f0670A07168J73737
$$ -343458 21569 55180 347711 119434 34534 -302303 28126 -60670 107168 280905
12632B80905m2351b2795B35410A11819B0648J48538b39327B75902g3094B53914
$$ 280905 238554 -22795 235410 111819 20648 169186 -239327 275902 -73094 253914
12621A55639k611c8989B43763b50747Q5011B17690p394n3336c20126A80372o4997
$$ 155639 153028 -38989 243763 -250747 -165736 217690 210296 156960 -320126 180372 115375
12610A15375e7946A48955b22147H1026l2936N9249J36941i4403E4428J86280j4792
$$ 115375 -57946 148955 -222147 81026 48090 107339 244280 -94403 54428 240708 225916
12599B25916I5257A4392b39432C94439A31061i6885A78192A5110L29062d8038
$$ 225916 95257 14392 -239432 394439 131061 -96885 178192 15110 344172 -48038
12588c0728A07047D888a21221A19380m6274a06854j98358J25466B96155a83752
$$ -30728 107047 4888 -121221 119380 73106 -106854 -305212 -179746 296155 -183752
12577B3085c7869B67635A880e6740J585J8483D4414L03156A41270l77O2335a72194
$$ 23085 -37869 267635 1880 -56740 -55155 -36672 44414 347570 141270 140893 203228 -172194
12564B27030e9194r8082a2396j07562j56573a13160i347B48659a02546j11935
$$ 227030 -59194 -157276 -12396 -119958 -276531 -113160 -9347 248659 -102546 -214481
12554b14481A41263o5133R8009E4268L5626a31944F1907c42980D8642J33901A8395
$$ -214481 141263 76130 174139 54268 89894 -131944 61907 -342980 48642 182543 18395
12542a43382A0098d22157J19730a21041A94474h8259D09768D5700n523J13995
$$ -143382 10098 -422157 -302427 -121041 194474 -88259 409768 45700 40177 154172
12532A54172i5457c3027A45269h3723B9787J1349K43735a21689c2738j49337H4974
$$ 154172 -95457 -33027 145269 -83723 29787 41136 284871 -121689 -32738 -182075 84974
12520a277A89127o4803a93364A22680K0546F3161Q3943a18200A10525c0580A01092
$$ -1277 189127 124324 -193364 122680 143226 63161 147104 -118200 110525 -30580 101092
12508b72309h4902B35601a09248C0775R5792f1386H2334J48823q3341b50185A42002
$$ -272309 -84902 235601 -109248 30775 126567 -61386 82334 231157 147816 -250185 142002
12496a36233B09669b28190B38049f5915A60829F3152K23495j40940L27293A02048
$$ -136233 209669 -228190 238049 -65915 160829 63152 286647 145707 473000 102048
12485D98923A39287a15305C54040N4976j00867k0778a74825C83307F0753i2080
$$ 498923 139287 -115305 354040 409016 308149 287371 -174825 383307 60753 -92080
12474B16848q3419c9794A1631i7869c7604n7229M316j5689B05657a09335A57205
$$ 216848 133429 -39794 11631 -97869 -37604 -94833 -90517 -106206 205657 -109335 157205
12462B65843H0558N3900E9703K27345j9780m0084o971a23988d8766A94527r1515
$$ 265843 80558 134458 59703 287048 267268 227184 220213 -123988 -48766 194527 103012
12451A03012a90336B82410p9122E0640P11559B90576j18057a09213B616K3385
$$ 103012 -190336 282410 203288 50640 762199 290576 172519 -109213 2616 26001
12441B6001b54808G9222l3811c14595A19235K3227n7091k4056e60594D755a16192
$$ 26001 -254808 79222 45411 -314595 119235 142462 85371 61315 -560594 4755 -116192
12429c42909A07872J11973a37277A02414a87270A1458J41773b7807q5314I7607
$$ -342909 107872 219845 -137277 102414 -187270 11458 153231 -27807 -113121 97607
12418B80655q1839p4506c00508a08916A43507l650b46168Q6587a4339A76236o8775
$$ 280655 198816 124310 -300508 -108916 143507 139857 -246168 -159581 -14339 176236 107461
12407A07461m9770f0029r127A18772b57785J27105H7688a02822c2633A50391B5220
$$ 107461 57691 -60029 -69156 118772 -257785 -130680 87688 -102822 -32633 150391 25220
12395C0763q011h4573k0088j2048R624p2838A20948g9837A56245N058P4560b7407
$$ 30763 22752 -84573 -104661 -116709 -107085 -179923 120948 -79837 156245 161303 235863 -27407
12382a12418M9065j51265L4379n4084C6714J63090f1268l2551M634B5222a39318
$$ -112418 -63353 -214618 -180239 -234323 36714 199804 -61268 -93819 -89185 25222 -139318
12370H3270i8011c8704C1344J05978f788A21502e6683B52695L9499A07919m2230
$$ 83270 -98011 -38704 31344 137322 -6788 121502 -56683 252695 292194 107919 65689
12359F5689J49825a21453k74968B48025r400j09261N7035c0912J747a4582j46925
$$ 65689 215514 -121453 -396421 248025 238625 129364 186399 -30912 -29165 -14582 -161507
12348a61507j23556C58470c4997A54636K8344a4429A92927a8393k25518D3152
$$ -161507 -285063 358470 -34997 154636 182980 -14429 192927 -18393 -243911 43152
12337B02506b38224c7801D0667a23040o8663I0306J18241M2609J96384h4337A84302
$$ 202506 -238224 -37801 40667 -123040 -191703 90306 208547 251156 447540 -84337 184302
12325f0788C0048b02981A17383C847a08748C7104b5149B84634a52275A06921L2190
$$ -60788 30048 -202981 117383 3847 -108748 37104 -25149 284634 -152275 106921 139111
12314A39111L1770q0494a29260M2701a3534B0063J71874J9914K94418h0094q1807
$$ 139111 170881 90387 -129260 -86559 -13534 20063 191937 211851 506269 -80094 -161901
12303a61901A65535c19871c7220A70911E004h9972h491o5968a9333j01987C93410
$$ -161901 165535 -319871 -37220 170911 5004 -89972 -8491 -74459 -19333 -121320 393410
12291a22634I4153O1623B37d8227n9960A77533E159a65344c2028a1175B44467
$$ -122634 94153 155776 237 -48227 -108187 177533 5159 -165344 -32028 -11175 244467
12279C33071l5583A01905J55190K03209D6347d5030j1991C4050o203J07722a01137
$$ 333071 297488 101905 257095 460304 46347 -45030 -57021 34050 27847 135569 -101137
12267B47174c1461N528B46922j09011J53996q5809c1823B5449a45040m5139G3261
$$ 247174 -31461 -25933 246922 137911 291907 206098 -31823 25449 -145040 -190179 73261
12255B84802D6792a27649I5708D5957b3882B25186G3446g7655B87029A7747m115
$$ 284802 46792 -127649 95708 45957 -23882 225186 73446 -77655 287029 17747 13632
12244A3632J24822M984A7991K74146q0126a47699o1886A96600D5027J4981K12967
$$ 13632 138454 143438 17991 292137 212011 -147699 -209585 196600 45027 60008 272975
12233B72975n1839L23367b9040F0676a04173G6782n430J35743h281A6667K77322
$$ 272975 221136 544503 -29040 60676 -104173 76782 71352 207095 -8281 16667 293989
12222B93989A17044K34036p26c2615k6129C17731f3452C09344A11449M42547B1300
$$ 293989 117044 351080 350354 -32615 -58744 317731 -63452 309344 111449 553996 21300
12210A86748E8003M363c7718j4967B56208A16182E4771k279q93N9279O5304b33704
$$ 186748 58003 62366 -37718 -52685 256208 116182 54771 52492 51599 110878 176182 -233704
12197B02716J96441A60376K26214j84013Q0910J47072D2446J5567L4637b23112
$$ 202716 399157 160376 386590 202577 283487 430559 42446 58013 92650 -223112
12186B56607B1455L04625l0727B5040K82625b4604k7809C59150N9476A28914L0066
$$ 256607 21455 326080 295353 25040 307665 -24604 -52413 359150 418626 128914 158980
12175A58980m7512b7890G1117J00424C8254a68515a2768A96820J39582a5357k46933
$$ 158980 111468 -27890 71117 171541 38254 -168515 -12768 196820 336402 -15357 -262290
12164b62290c8685D14060A43219B3915J3779j7307J59104e1735k4798j12686F4244
$$ -262290 -38685 414060 143219 23915 37694 20387 179491 -51735 -76533 -189219 64244
12152C36871H6132K4557c0275l17501A77294K1122I3018L42900b88587c9169l2358
$$ 336871 86132 110689 -30275 -347776 177294 198416 93018 435918 -288587 -39169 -71527
12141g1527A04996D8335J55207j2825a38951A0218b6008j28619B28586o1675b22859
$$ -71527 104996 48335 203542 190717 -138951 10218 -26008 -154627 228586 166911 -222859
12129F5712J62395b0715A86320o5018C2472K8662g2410j67788L5700n7115i1970
$$ 65712 228107 -20715 186320 121302 32472 61134 -72410 -240198 -204498 -261613 -91970
12117I0594K64900a03684D0725J66141D5717K98750c6763D4686j9801L07886c46240
$$ 90594 355494 -103684 40725 206866 45717 344467 -36763 44686 24885 332771 -346240
12105B68607h1274C72853b51377A89342b88706C26754I1643O9604f5859A00805
$$ 268607 -81274 372853 -251377 189342 -288706 326754 91643 161247 -65859 100805
12094a3127B52224n7209f5001l13521g1723A2836L32096A53941b22636N890J07407
$$ -13127 252224 195015 -65001 -378522 -71723 12836 344932 153941 -222636 -216746 -109339
12083a09339L41J2404B05246a0268q724A02220q934O4017n8742M4914K3875a77609
$$ -109339 -108998 -96594 205246 -10268 -18992 102220 93286 157303 98561 143475 167350 -177609
12070b05471j76598a8061m1395a2963p2725j02584D48641a41066g155B055J70765
$$ -205471 -382069 -18061 -59456 -12963 -85688 -188272 448641 -141066 -7155 2055 172820
12059A72820c20326A68282b5922A41178L7006f8816m0325j36570A0051P9983J14688
$$ 172820 -320326 168282 -25922 141178 178184 -68816 -109141 -245711 10051 90034 204722
12048B04722K3636D2837b2231C54174H6243l485c20689f5254k4194r2220F213
$$ 204722 228358 42837 -22231 354174 86243 82758 -320689 -65254 -89448 -181668 6213
12036e3532A4844J6850M5306a12603B88783A35658o6736J29696K04475L12584
$$ -53532 14844 31694 77000 -112603 288783 135658 68922 198618 403093 715677
12026G15677l06496p2067M6828A0232b81A85036E8215J20824D6927b44537p6228
$$ 715677 409181 337114 383942 10232 -281 185036 58215 179039 46927 -244537 -320765
12015c20765c7625B69497D0415b5110B73770a83595B071J5055e8108b5773j07861
$$ -320765 -37625 269497 40415 -25110 273770 -183595 2071 17126 -58108 -25773 -133634
12004a33634A10832a17248j6163j77439a4387A93743o2658C1055L0452a30691
$$ -133634 110832 -117248 -133411 -310850 -14387 193743 131085 31055 61507 -130691
11993a8586B7795a06364f821A15639d24746a51129D2539K2569d7479j22508A72996
$$ -18586 27795 -106364 -6821 115639 -424746 -151129 42539 65108 -47479 -169987 172996
11981A85592b84342J16941B29022j04107c73330C9428a92358P7583L9028A02091
$$ 185592 -284342 -167401 229022 124915 -373330 39428 -192358 -114775 -75747 102091
11970a27112A33694c40690A27734a46675o1136i3894q2781I6153c39491J55310
$$ -127112 133694 -340690 127734 -146675 -207811 -93894 -176675 96153 -339491 -184181
11960a84181A62995a94168A39171b34265b3028j10670A39761m2610f5258a9869
$$ -184181 162995 -194168 139171 -234265 -23028 -133698 139761 97151 -65258 -19869
11949D7488J98900a03579B23137a46192E4869K23729j19264D3464h3991k4231
$$ 47488 246388 -103579 223137 -146192 54869 278598 159334 43464 -83991 -108222
11939a08222q4546C7215L661K70163a04918K0474q2981O920q2540B00671m2297
$$ -108222 -192768 37215 40876 311039 -104918 -84444 -167425 -160505 -243045 200671 158374
11928A58374J67901a03647A92223k5574a18185a3113r5795I8122M7756a59734
$$ 158374 326275 -103647 192223 166649 -118185 -13113 -108908 98122 145878 -159734
11917e2119A53183f0445B18889J6556r2162b0063j09497A73353a92427d8350A34490
$$ -52119 153183 -60445 218889 235445 143283 -20063 -129560 173353 -192427 -48350 134490
11905a99273A73596b33841B86071b09745c0898A61703g3353J6326j67549l1225
$$ -199273 173596 -233841 286071 -209745 -30898 161703 -73353 -57027 -224576 -255801
11895b55801K3827i1733j11560B8045e8604B15410c38987a5843D3440b38352D2470
$$ -255801 -231974 -91733 -203293 28045 -58604 215410 -338987 -15843 43440 -238352 42470
11883f115A66578B5227L2785b0767B03048b24543e810A77131b19306A63201f3936
$$ -6115 166578 25227 58012 -20767 203048 -224543 -5810 177131 -219306 163201 -63936
11871F1032b77507J07372g3049j7634r4569A45979K47313a44845k99963N87a42883
$$ 61032 -277507 -170135 -73049 -90683 -185252 145979 393292 -144845 -444808 -444221 -142883
11859a33893j75744A66750a0431B99670a68330C97762c86677f3164j2977B11875
$$ -133893 -309637 166750 -10431 299670 -168330 397762 -386677 -63164 -76141 211875
11848a83010A14254c63353A15485b66272A78803e8566j63282F4542K5250A145
$$ -183010 114254 -363353 115485 -266272 178803 -58566 -221848 64542 89792 1145
11837b19896A86176a42967o7412A55068a61489B54567a36067C45497b02448k0643
$$ -219896 186176 -142967 -210379 155068 -161489 254567 -136067 345497 -202448 -223091
11827b23091A50869C0423d4233A18219m8480a31475f0304j38095h3305D1002J79765
$$ -223091 150869 30423 -44233 118219 69739 -131475 -60304 -198399 -83305 41002 220767
11816B20767a78341H9232a8362A27196m1532J13372b76964a5032D5092f1861k8182
$$ 220767 -178341 89232 -18362 127196 85664 199036 -276964 -15032 45092 -61861 -90043
11805i0043k99257a0922B53624P8779b94502Q5439j44065A8602J32162a07812
$$ -90043 -389300 -10922 253624 332403 -294502 -209063 -353128 18602 150764 -107812
11794b4096A617J52753b14015A10754K87085A80280j5668m4422n5908M7475E1204
$$ -24096 1617 154370 -214015 110754 397839 180280 164612 120190 64282 111757 51204
11782c51728B22349r3952a5703A01442N7826a78753O1786A08586J34370b31467
$$ -351728 222349 128397 -15703 101442 159268 -178753 -116967 108586 242956 -231467
11771E7291K16432O0570H9149L4272L9750i7522A06980e2653A56439b30143J9675
$$ 57291 273723 334293 89149 123421 163171 -97522 106980 -52653 156439 -230143 -210468
11760b10468G1468Q7706a60788F8383h6377H4469p363C6714b800F7483J9258A4484
$$ -210468 71468 159174 -160788 68383 -86377 84469 77106 36714 -2800 67483 86741 14484
11747A11208J54403b67399C0542G473b91945f3631k03717C19303e11003A43934
$$ 111208 265611 -267399 30542 7473 -291945 -63631 -267348 319303 -511003 143934
11736a99918C1151A2305j169a26160A08207M485i8959B55418j23780a09380A46910
$$ -199918 31151 12305 11136 -126160 108207 112692 -98959 255418 131638 -109380 146910
11724a62014A58750M6553E1900J41916q3380i4806a3433l51206b1734A38850c33119
$$ -162014 158750 205303 51900 193816 110436 -94806 -13433 -364639 -21734 138850 -333119
11712E772L22317b1133l6101H3986J39807J4759H369J98118b3707j80272B51363
$$ 5772 328089 -21133 -57234 83986 223793 238552 8369 206487 -23707 -203979 251363
11700g3683m0589A4110c6818A18030K049K8276b87152d6766o2632J1651A42369
$$ -73683 -114272 14110 -36818 118030 120079 148355 -287152 -46766 -109398 -97747 142369
11688A13817L7938l7321D2888K70455G8324R3714F5041J34193b3703B01132c538
$$ 113817 151755 114434 42888 313343 78324 172038 65041 199234 -23703 201132 -3538
11676a63104B8754K8649K39305M2741a20729A47527a22944e0328j50066A85069
$$ -163104 28754 57403 296708 339449 -120729 147527 -122944 -50328 -200394 185069
11665b34629J02082A2918M6808a34351L9936p6150B2395a39451j8498a3218A23514
$$ -234629 -132547 12918 59726 -134351 -94415 -170565 22395 -139451 -157949 -13218 123514
11653c22308e6273A82262A7974b53232B65334f123m3125C35635a20327C7683d7720
$$ -322308 -56273 182262 17974 -253232 265334 -6123 -49248 335635 -120327 37683 -47720
11641A77973d5153A4345Q5485N8632a32689C35738j07759a61629C6226c70007
$$ 177973 -45153 14345 99830 158462 -132689 335738 227979 -161629 36226 -370007
11630E1152a18103H0225j08f2602A1725L635f0228A127g4286c2447j04253A1912
$$ 51152 -118103 80225 80117 -62602 11725 15360 -60228 1127 -74286 -32447 -136700 11912
11617B96125a35206b2332o3727C1490a65864K6507c6508B28844I6380N7828p1400
$$ 296125 -135206 -22332 -86059 31490 -165864 -139357 -36508 228844 96380 154208 82808
11606H2808b04203A17884J85304A35913i7048E0745J22262k7329k2926P7005i2240
$$ 82808 -204203 117884 303188 135913 -97048 50745 173007 145678 122752 199757 -92240
11594a97123F7827a46893A92378K9519E3734K31677h7502K7245A87588n1991h4333
$$ -197123 67827 -146893 192378 221897 53734 285411 -87502 -60257 187588 135597 -84333
11582H4156d197j6664B08111A00631J28612j2384n078J63610A08878d1596A06491
$$ 84156 -4197 -20861 208111 100631 229243 216859 211781 375391 108878 -41596 106491
11570B02746J83023A45049i5630F5789h7750A41466c9214A24346J95966m9554
$$ 202746 385769 145049 -95630 65789 -87750 141466 -39214 124346 320312 270758
11560B70758h0262b5050D17082m8642b1389F8722g6782A42240c16109a46876G3485
$$ 270758 -80262 -25050 417082 368440 -21389 68722 -76782 142240 -316109 -146876 73485
11548D3035b9717D4965K47691j44441K2582a92123B27493f5139B04336q8509c7093
$$ 43035 -29717 44965 292656 148215 170797 -192123 227493 -65139 204336 115827 -37093
11536A06683M38319a39102H7415J38029H3347a27880H982K86151b79456B23785
$$ 106683 545002 -139102 87415 225444 83347 -127880 8982 295133 -279456 223785
11525A35051Q3277a11363o3997A4196a14126N7023C08713j19115A0944J04588
$$ 135051 218328 -111363 -175360 14196 -114126 -57103 308713 189598 10944 115532
11515A15532A7631J24497o7040h1705A47544M2651B3387R0644R7949C7675K32373
$$ 115532 17631 142128 75088 -81705 147544 190195 23387 114031 211980 37675 270048
11504B70048h5172B63738F5327K37788Q359I4484O2933F7691d7894C75937m6488
$$ 270048 -85172 263738 65327 303115 311474 94484 157417 67691 -47894 375937 329449
11493C29449j30516b127B93020M8321f959A32233J49608B1913K18540a10145A65544
$$ 329449 198933 -2127 293020 341341 -6959 132233 281841 21913 240453 -110145 165544
11481B14241P6341m9593E6581a2904C08648r4L3022B503K11312J92184A30225
$$ 214241 290582 240989 56581 -12904 308648 308554 341576 2503 213815 405999 130225
11469I9674K06584r7213l4700J0670Q6031m3819L5909a7491q4638D2881J54659
$$ 99674 306258 209045 174345 185015 271046 227227 263136 -17491 -102129 42881 197540
11458A97540q7920J23386k4159J04819N2302G6684a580C47674m5507h0939A01546
$$ 197540 109620 233006 208847 313666 365968 76684 -1580 347674 302167 -80939 101546
11446B60108J25385b8617A75000q2440M8953K84615A34810a23533B150K1101a8063
$$ 260108 385493 -28617 175000 92560 141513 426128 134810 -123533 2150 23251 -18063
11434d1174k0430b721q1106E01297k30026A7082K57519a5850A85051K7107c2323
$$ -41174 -61604 -2721 -83827 501297 271271 17082 274601 -15850 185051 212158 -32323
11422B3673L2826L0964a15616j09025B33007j06514h8519A71969o7323J7948L23238
$$ 23673 56499 87463 -115616 -224641 233007 126493 -88519 171969 104646 122594 445832
11411D45832H5958a8040C025a20247M8068j96985A46890J03169H5307d1649q0423
$$ 445832 85958 -18040 3025 -120247 -72179 -269164 146890 250059 85307 -41649 -122072
11400a22072C920Q1010b9771C20997b32293I9968m0959g3393c3624A6796J74829
$$ -122072 3920 84930 -29771 320997 -232293 99968 59009 -73393 -33624 16796 191625
11389A91625a76585O6600A24788f5240p9309j07867M0081O368c8297j48465B36315
$$ 191625 -176585 -109985 124788 -65240 -144549 -252416 -212335 -205967 -38297 -186762 236315
11377F2467a11740B0039d54403K16635b6897q7614C0719b3384B39735D2706a76313
$$ 62467 -111740 20039 -454403 -237768 -26897 -114511 30719 -23384 239735 42706 -176313
11365B2447c18845F2670L74512A40225J40742c3806B15500P145h5063j739I646
$$ 22447 -318845 62670 437182 140225 280967 -33806 215500 222645 -85063 -86802 9646
11353G2542A5727a6095k16986j56563G3756g6663r3287k8532A59045a56608F7650
$$ 72542 15727 -16095 -233081 -389644 73756 -76663 -169950 -198482 159045 -156608 67650
11341D55862j12106a11788d5519j56440B4646a92312E3219R5875a31487I855i7739
$$ 455862 343756 -111788 -45519 -201959 24646 -192312 53219 149094 -131487 9855 -97739
11329A20107e4316j02330B9134Q8178a40010p2117B32621k0498a55541F071a63028
$$ 120107 -54316 -156646 29134 117312 -140010 -212127 232621 212123 -155541 6071 -163028
11317a67466L958B11513F907K08079N2082j08001D0477J07964e8637k58833M5175
$$ -167466 -163508 211513 6907 214986 267068 159067 40477 148441 -58637 -317470 -272295
11306b72295q4855E7320d41822J66672I5071b34834c9451E2000P8837b5716k33000
$$ -272295 -357150 57320 -441822 -275150 95071 -234834 -39451 52000 130837 -25716 -258716
11295b58716k10299M5454g5360j60905a08119A88805A4012M60670a69058A52153
$$ -258716 -469015 -423561 -75360 -236265 -108119 188805 14012 474682 -169058 152153
11284b09071H2348a58042k972P8044k0095A42448b41264a07638C21084e8663j44939
$$ -209071 82348 -158042 -161014 -82970 -103065 142448 -241264 -107638 321084 -58663 -203602
11273b03602N4555k1443N9233k02830o5569B97258b39680b6103C79043f317A45976
$$ -203602 -149047 -170490 -111257 -314087 -379656 297258 -239680 -26103 379043 -6317 145976
11261F5399b11799A53181a7919j81621N5466A54595a19490j38080I8746f6222
$$ 65399 -211799 153181 -17919 -199540 -144074 154595 -119490 -257570 98746 -66222
11250e6579A43775l2143a41770j1022e0985C50258a63501m5280L9880B01958p1160
$$ -56579 143775 111632 -141770 -152792 -50985 350258 -163501 -208781 -168901 201958 130798
11239A30798B7647M7791c96237C50189j13695G6109c89186a67371H4023i6288
$$ 130798 27647 75438 -396237 350189 236494 76109 -389186 -167371 84023 -96288
11228A83522k1541E5382i4861B92121b0101j23243J4373K3206G5484J53011f0331
$$ 183522 161981 55382 -94861 292121 -20101 -143344 -128971 -105765 75484 228495 -60331
11216a6983j42578L4554C2260J87369l5066b66696E847N6797b15867D66752A0301
$$ -16983 -159561 -125007 32260 219629 184563 -266696 5847 62644 -215867 466752 10301
11204a21849O313G0764i338B1155c40198J11132N5202N1494o3655C4538J3289
$$ -121849 -115536 70764 -9338 21155 -340198 -229066 -173864 -122370 -186025 34538 47827
11193D7827a9138A25128d4893j09671A2044K72185a22603A22729a81055K0351
$$ 47827 -19138 125128 -44893 -154564 12044 284229 -122603 122729 -181055 -160704
11183a60704A47964g1802L0337j53818P7649K4291E2679a6883A0679a36788d4144
$$ -160704 147964 -71802 -41465 -195283 -117634 -93343 52679 -16883 10679 -136788 -44144
11171G208a33367e29k83447J26270A21477d23861b3700m1231F1567B5251b36597
$$ 7208 -133367 -529 -283976 -157706 121477 -423861 -23700 -64931 61567 25251 -236597
11159c7202I168J73980B5937K66670F0290h4092r0869p40D1362M1824a21623m9978
$$ -37202 9168 183148 25937 292607 60290 -84092 -174961 -175701 41362 83186 -121623 -171601
11147a71601P8052G9408a61449h195r0948D8297O277b18973J0686P4228C12235
$$ -171601 -93549 79408 -161449 -8195 -99143 48297 54574 -218973 -208287 -134059 312235
11135e4566J8548B05213b46113B60367A7577J71831k734F2826b78909J34696F3484
$$ -54566 -36018 205213 -246113 260367 17577 189408 186674 62826 -278909 -144213 63484
11123C0953J65297a01452D9302g0230j80552A09055O3467j6870d7911B6450Q8867
$$ 30953 196250 -101452 49302 -70230 -250782 109055 172522 155652 -47911 26450 115317
11112A15317J22591j07584K14733b26880A82643K55960A39924M98638h7395D6351
$$ 115317 237908 130324 345057 -226880 182643 438603 139924 638562 -87395 46351
11101f8353B57628j00666i57j27035B79385A29621J75636k6879d4321a1803B67013
$$ -68353 257628 156962 -957 -127992 279385 129621 305257 278378 -44321 -11803 267013
11089C20759L0165j07989L32944k10275M7168j21954O3080p1698A20726J9001
$$ 320759 350924 242935 575879 365604 412772 290818 353898 282200 120726 139727
11079A39727J04100j20218L64207m5654j61901L7825J51421p2491A96901B0973
$$ 139727 243827 123609 487816 442162 280261 318086 469507 397016 196901 20973
11068C36634J82272J3774K92J3901A92544Q03300D83648K0692k26200N24373B12606
$$ 336634 518906 532680 532972 546873 192544 995844 483648 504340 278140 802513 212606
11056D79864J66541j31586R266J91839P072j67730j26504N37106O4584n6209k18152
$$ 479864 646405 514819 524085 715924 722996 555266 428762 965868 1030452 974243 756091
11045G56091j75831R0819q2295J64808P9772K88944j80897R0970k7168k61033
$$ 756091 580260 671079 588784 753592 833364 1122308 941411 1032381 1005213 744180
11035G44180j07187K24741l54219M73784j71906L46833k05104k21475L0244K05341
$$ 744180 636993 861734 507515 981299 809393 1156226 951122 729647 759891 965232
11025I65232j78732L3770j2553l39904N32677j21994j65754L27261m60368J62283
$$ 965232 786500 820270 807717 467813 1000490 878496 712742 1040003 579635 741918
11015G41918j46653K78371k9016L30870j83608k70667j36046k689L6042K0027
$$ 741918 595265 873636 844620 1175490 991882 721215 585169 582480 618522 638549
11005F38549O27o3469L6701K87880l755j95250J90521j02369N3622J13769k03363
$$ 638549 639176 575707 612408 900288 896533 701283 891804 789435 843057 956826 753463
10994G53463j71717K80562J0600n9465j0933k22252O2725K45842J75321J35613
$$ 753463 581746 862308 872908 813443 802510 580258 642983 888825 1064146 1199759
10984A199759k68591J13710O9554J65469K27765k29027K64853O31104L0564J47596
$$ 1199759 931168 1044878 1114432 1279901 1507666 1278639 1543492 2174596 2205160 2352756
10974B352756J11022Q21833K10845n14038N19022J7343K90563k19012o77774j19658
$$ 2352756 2463778 3285611 3496456 2982418 3501440 3518783 3809346 3590334 2912560 2792902
10964B792902o9055j30200n52187l98586O6524J18722l21146l69269M91494p9607
$$ 2792902 2723847 2593647 2041460 1642874 1709398 1828120 1506974 1137705 1629199 1549592
10954A549592L1274j84251o50058O101J72354l25764k64634A02637K68574J52735
$$ 1549592 1580866 1396615 746557 752658 925012 599248 334614 102637 371211 523946
10944E23946O2074L4386j71942A34062J28530A01827a0492B74348C4719K34979
$$ 523946 586020 620406 448464 134062 262592 101827 -10492 274348 34719 269698
10934B69698j1187m9059N66a855j4323r5890o0821D01117f8447O035j09714A16367
$$ 269698 258511 209452 210018 -1855 -16178 -112068 -172889 401117 -68447 -62412 -172126 116367
10921B80011o7675o6657a31644B51253H570J12973m0538J58634h6672j6145j05087
$$ 280011 212336 145679 -131644 251253 8570 121543 81005 239639 -86672 -102817 -207904
10910b07904H5958a03654E22821b1733k5211A23106J24057d3038D9485J57523
$$ -207904 85958 -103654 522821 -21733 -46944 123106 247163 -43038 49485 207008
10900B07008L796E567P4069K44925I0958d4800K205j91550C8667J26156a78944
$$ 207008 210804 5567 79636 324561 90958 -44800 -42595 -234145 38667 164823 -178944
10888A28284K08326A58160R6819q8901a94576h602k90300E6070m983a53004c2404
$$ 128284 336610 158160 254979 166078 -194576 -8602 -298902 56070 51087 -153004 -32404
10876f9488A92099R518C7655J34000E317a23257b6806j99724M3702o940k4420
$$ -69488 192099 201617 37655 171655 5317 -123257 -26806 -226530 -182828 -189768 -214188
10865b14188R4989A92940a23869j76619a29777A0628b89693e0800q086p7350B04330
$$ -214188 -119199 192940 -123869 -300488 -129777 10628 -289693 -50800 -58886 -136236 204330
10853c31489B9222K11882p1963a36950F78e9579j39938e6559J977j87194A34032
$$ -331489 29222 241104 169141 -136950 678 -59579 -199517 -56559 -54582 -241776 134032
10841b2092F8089J34001c3299j36320Q942C22312A41772M9518h5593m01114b09999
$$ -22092 68089 202090 -33299 -169619 -160677 322312 141772 191290 -85593 -486707 -209999
10829A70512b10870f1103j50118K4408k5922P2646n5732B15809a78449h6285A21913
$$ 170512 -210870 -61103 -211221 -186813 -212735 -140089 -195821 215809 -178449 -86285 121913
10817b082q1195A92006g8321b7877k32317c6632m3807C63636H1327b84494B4176
$$ -2082 -83277 192006 -78321 -27877 -260194 -36632 -80439 363636 81327 -284494 24176
10805D0655a08547F5223J30844E7350a2958l2169B52401A9107N9775c48426C43067
$$ 40655 -108547 65223 196067 57350 -12958 -45127 252401 19107 78882 -348426 343067
10793b04514C6872P1925A4169J14077m7104b95871H5944a51923a0499j19483B30183
$$ -204514 36872 108797 14169 128246 81142 -295871 85944 -151923 -10499 -129982 230183
10781b84263J33331A27118a09509D0007a137A16024L8896j2087C2298e1253A66149
$$ -284263 -150932 127118 -109509 40007 -1137 116024 154920 142833 32298 -51253 166149
10769a07052l1966k34931d4932n6177D8455i5988j32505l052P5014q1419B94376
$$ -107052 -139018 -373949 -44932 -101109 48455 -95988 -228493 -231545 -156531 -237950 294376
10757b86315A44165e5105j51670f137D6473K52036f4323j55788A54799a82211
$$ -286315 144165 -55105 -206775 -6137 46473 298509 -64323 -220111 154799 -182211
10746B7905J64140J7622b12435I6701C2713a33485c916G0060c41164N6848Q0437
$$ 27905 192045 209667 -212435 96701 32713 -133485 -3916 70060 -341164 -284316 -203879
10735b03879P5735A33970b72729a11986K0249A71455a91810B2362a23208C8149
$$ -203879 -128144 133970 -272729 -111986 -91737 171455 -191810 22362 -123208 38149
10724A19794i1348j28888f3335k84139A48734a34453l7361n7789A69567N0850
$$ 119794 -91348 -220236 -63335 -347474 148734 -134453 -171814 -229603 169567 220417
10714B20417a30577G4685A2121J15046O6229b85741P6845i523m1359J9727q7476
$$ 220417 -130577 74685 12121 127167 193396 -285741 -208896 -9523 -50882 -31155 -118631
10703a18631k8532J7907b8824A49787b75101B48269q6292b4564j16711H5337a60780
$$ -118631 -147163 -129256 -28824 149787 -275101 248269 161977 -24564 -141275 85337 -160780
10691F3779a75556f3368F1799a52992J4889j36699A2151Q4973a37087O325D9564
$$ 63779 -175556 -63368 61799 -152992 -138103 -274802 12151 97124 -137087 -130762 49564
10679b68554f7713k6720k84058J21924a19696n134l0311k16612J62280P7533J9370
$$ -268554 -67713 -94433 -378491 -256567 -119696 -124830 -155141 -371753 -209473 -131940 -112570
10668a12570d3700k96371A4780J1121h1757C16417A10291b00535C1070a63596
$$ -112570 -43700 -340071 14780 25901 -81757 316417 110291 -200535 31070 -163596
10657a54320A58064h148B34891j13518b75667f4430A65654d03075J21525h362
$$ -154320 158064 -8148 234891 121373 -275667 -64430 165654 -403075 -281550 -8362
10646D0235a9838H6259b07151C65981g2404a5307I1034e9887k76837D22222G7612
$$ 40235 -19838 86259 -207151 365981 -72404 -15307 91034 -59887 -336724 422222 77612
10634a95052g6027P307A15191a33843j12942g831k56195e0086j36643E9252a33188
$$ -195052 -76027 -68720 115191 -133843 -246785 -7831 -264026 -50086 -186729 59252 -133188
10622c2547A0291c94503B21486B5469J07125a84595A11526d2001A53529c75678
$$ -32547 10291 -394503 221486 25469 132594 -184595 111526 -42001 153529 -375678
10611A07895J34526J96458c97701h447p007A37829a31701k31245F6250K24444
$$ 107895 242421 438879 -397701 -8447 -15454 137829 -131701 -362946 66250 290694
10601B90694c55195B56131a83986i415A29911b32903J08217q3127h5892E8116
$$ 290694 -355195 256131 -183986 -9415 129911 -232903 -124686 -207813 -85892 58116
10590b055m22826B08123c55901j6351D40673a351H1646A721J03434i8950M8487
$$ -2055 -424881 208123 -355901 -372252 440673 -1351 81646 1721 105155 -98950 -50463
10579e0463D09972a30550j43403a2736C22942G392Q4310a7658A97314g3231A70377
$$ -50463 409972 -130550 -273953 -12736 322942 7392 91702 -17658 197314 -73231 170377
10567b60621R0699C2089g2408J3712j33957g6953l2917g367B69909f8791b4302
$$ -260621 -169922 32089 -72408 -58696 -192653 -76953 -109870 -7367 269909 -68791 -24302
10555b7831k70322A2816f3495k0923A24551c37315O7339D7815d1440j31122B46990
$$ -27831 -298153 12816 -63495 -84418 124551 -337315 -269976 47815 -41440 -172562 246990
10543A2126a10818A16479a46829b3839B53110b84208B87360p6680f2091A65129
$$ 12126 -110818 116479 -146829 -23839 253110 -284208 287360 210680 -62091 165129
10532c16391J55349A8993N4156b59078k6939A4496b36852a7317n5335A64125b1585
$$ -316391 -161042 18993 73149 -259078 -286017 14496 -236852 -17317 -72652 164125 -21585
10520d2329k82539A58838D9340R6246k4884J34929b16322B72732r6792b17324
$$ -42329 -324868 158838 49340 145586 120702 255631 -216322 272732 175940 -217324
10509a95790A56261e1730j25304o1600B15638A9617a78189B09529K120a2989j39271
$$ -195790 156261 -51730 -177034 -238634 215638 19617 -178189 209529 211649 -12989 -152260
10498a52260N8758C70090c05132J8076a24914n4701G9274K91512j16100n5098
$$ -152260 -93502 370090 -305132 -287056 -124914 -179615 79274 370786 254686 199588
10488A99588e2225A75185a18158A61457I258K46788G6703J68955a67104C64471
$$ 199588 -52225 175185 -118158 161457 9258 256046 76703 245658 -167104 364471
10477B55045K03086c5129j1622B88800A04428a45576m8534B01669b9153E1900
$$ 255045 458131 -35129 -46751 288800 104428 -145576 -194110 201669 -29153 51900
10466i5389C1687J97729d419m2702k26747H6650M7318H889M631b16932N4262A22837
$$ -95389 31687 229416 -4419 -47121 -273868 86650 133968 8889 13520 -216932 -162670 122837
10453A94409G1155B6411J42544a24010k82j62035a6751j98892H692a7629C1206
$$ 194409 71155 26411 168955 -124010 -124292 -286327 -16751 -215643 8692 -17629 31206
10441B49477f1012J5763j02318B8907b17568L8749k48813d8833A6996b43973E1534
$$ 249477 -61012 -45249 -147567 28907 -217568 -178819 -427632 -48833 16996 -243973 51534
10429F6111k2341c07659f8184A42154b24201j52976a44844b8667j92829A25546
$$ 66111 43770 -307659 -68184 142154 -224201 -377177 -144844 -28667 -221496 125546
10418D732a10456A09090a58413j44649a45994I8339d1641j07901i129j58978O2304
$$ 4732 -110456 109090 -158413 -303062 -145994 98339 -41641 -149542 -9129 -168107 -105803
10407a05803l6478I0703J47664a52250A19967J29921A5358c81614B89272F1279
$$ -105803 -142281 90703 238367 -152250 119967 249888 15358 -381614 289272 61279
10396C8748j4658a7500m1016B21077J02612l3364A26608L23065d2367I4965O8932
$$ 38748 24090 -17500 -58516 221077 323689 290325 126608 449673 -42367 94965 163897
10385A63897B9414M03885c703j02205A91630N3527B2638L86299D8807L2535D124
$$ 163897 29414 433299 -3703 -105908 191630 245157 22638 408937 48807 81342 4124
10373A54937K52711J30128B4551Q2168K57218E4279K26981r1737n498L12661J69400
$$ 154937 407648 537776 24551 106719 363937 54279 281260 189523 184025 496686 666086
10362F66086C31004m6475q128g0046B46314F0240P6063Q5936L51032j38162K89235
$$ 666086 331004 284529 276401 -70046 246314 60240 136303 222239 573271 435109 724344
10351G24344k50259k3343J42999l0694J600k7497j10005p1179O7663A53488J92732
$$ 724344 474085 450742 593741 563047 564647 537150 427145 355966 423629 153488 346220
10340C46220L1187A67691J70314j10089a05079a6455I6872K67688H4116J7088
$$ 346220 377407 167691 338005 227916 -105079 -16455 96872 364560 84116 101204
10330A01204J6111D7470J26124E7401L4197N1055A7918J66989p1399J03473e515
$$ 101204 117315 47470 173594 57401 91598 142653 17918 184907 113508 216981 -5515
10318E9967K23682L4528a54401A16529k3219K72448A24949M2341a58106C13848
$$ 59967 283649 318177 -154401 116529 93310 365758 124949 167290 -158106 313848
10307a3282A57645Q7645a44831P271f4135I1353J07874J23811g1216B73877B614
$$ -13282 157645 245290 -144831 -137560 -64135 91353 199227 323038 -71216 273877 2614
10295A91076J4088D5348R138c1310o2827B92788F024a62882C0048J05038h4826
$$ 191076 205164 45348 54486 -31310 -94137 292788 6024 -162882 30048 135086 -84826
10283a82475A42671i2280l05272K8212F7740a75318L3498j23209A4413N2171K3094
$$ -182475 142671 -92280 -397552 -369340 67740 -175318 -141820 -265029 14413 66584 89678
10272H9678i7090r2772j326H3475M64746A40412A5480M34978d1019J3367E8196
$$ 89678 -97090 -189862 -191188 83475 548221 140412 15480 450458 -41019 -27652 58196
10260I1974K39378M5796Q8179E7285h4722A73818J1228d50445A3869f5917A55207
$$ 91974 331352 377148 465327 57285 -84722 173818 185046 -450445 13869 -65917 155207
10248b54265l8432A07906a61760A19592H018e4477j24131b9040A10056f6732A75636
$$ -254265 -292697 107906 -161760 119592 8018 -54477 -178608 -29040 110056 -66732 175636
10236e5361B7289a47942P0780j40711A06791J19383e7083j11746g8415b2855A64231
$$ -55361 27289 -147942 -77162 -217873 106791 226174 -57083 -168829 -78415 -22855 164231
10224f8744H4395R0167e7561k59254A31011b05381f6603a4843k07411A72628a26921
$$ -68744 84395 174562 -57561 -316815 131011 -205381 -66603 -14843 -222254 172628 -126921
10212A77163f8701B07171d9776l18887A13766a32540D21666c63228B49217a30671
$$ 177163 -68701 207171 -49776 -368663 113766 -132540 421666 -363228 249217 -130671
10201e00698B02726a92023c6303K422j43188f5240B73468j17615B2043c97711
$$ -500698 202726 -192023 -36303 -33881 -177069 -65240 273468 155853 22043 -397711
10190a59439b0674D8044a25615J3373C38866j30428b02034K3344C7036K2637Q2243
$$ -159439 -20674 48044 -125615 -112242 338866 208438 -202034 -178690 37036 59673 141916
10179A41916a43027c192A6910c43986a66754O1409E1827L20810A22530c80752
$$ 141916 -143027 -3192 16910 -343986 -166754 -105345 51827 372637 122530 -380752
10168a72553B27420B1776c3764j81497A28148b23765A83332d7772M332a1089j14977
$$ -172553 227420 21776 -33764 -215261 128148 -223765 183332 -47772 -43440 -11089 -126066
10157a26066D8731d2498j7120p5688d182G7063P835h9652F5689h6492j7818l48837
$$ -126066 48731 -42498 -59618 -135306 -4182 77063 84898 -89652 65689 -86492 -104310 -453147
10145d53147a33419H989a80674D7568C93a6746n9753r7665a3810m18898J69526
$$ -453147 -133419 8989 -180674 47568 393 -16746 -76499 -174164 -13810 -432708 -263182
10134b63182G6783d2113k1259j21981Q2549A90989a74209h0159D0468J03101a01226
$$ -263182 76783 -42113 -63372 -185353 -102804 190989 -174209 -80159 40468 143569 -101226
10122d2091B39748E3771e3634k0469K4953l49324D5328a90811d2158J4554k08019
$$ -42091 239748 53771 -53634 -74103 -49150 -398474 45328 -190811 -42158 -27604 -235623
10111b35623F4669c4451n2369B1647c47374i7634B13h2078I290c23110K4283i034
$$ -235623 64669 -34451 -86820 21647 -347374 -97634 213 -82078 9290 -323110 -298827 -9034
10098e0193B0430a44542L7082A35548c41202M2769i949j41507L8514I4258l6a9193
$$ -50193 20430 -144542 -107460 135548 -341202 -298433 -9949 -151456 -112942 94258 94222 -19193
10085c56607G946a41158p9027R3294l8892g6706k35923h1710j70076c9811B12789
$$ -356607 7946 -141158 -220185 -126891 -165783 -76706 -312629 -81710 -251786 -39811 212789
10073a6587n414k14030B6792d22089E3784d52081a08740j01000a8106j71882d7269
$$ -16587 -22001 -236031 26792 -422089 53784 -452081 -108740 -209740 -18106 -189988 -47269
10061c01644b0994n1612K7688l37440G1774J69483d7006C6906p427b60230B57424
$$ -301644 -20994 -72606 -44918 -382358 71774 241257 -47006 36906 29479 -260230 257424
10049A02061j5406G136a14452c9825B25879g966B2678i5759J5405A4882K5307
$$ 102061 86655 7136 -114452 -39825 225879 -7966 22678 -95759 -80354 14882 40189
10038D0189a74530I2104a61454M5735a3473A7724a40087f3420A06199m7814a06234
$$ 40189 -174530 92104 -161454 -115719 -13473 17724 -140087 -63420 106199 58385 -106234
10026a34099j8509d8584I0855g1800A26422J5764b02004g8756p8636N3734M0720
$$ -134099 -152608 -48584 90855 -71800 126422 142186 -202004 -78756 -157392 -103658 -62938
10015f2938A09461Q5584e9018j03319E0970h3160L5642k73969A2562f21A7845
$$ -62938 109461 195045 -59018 -162337 50970 -83160 -47518 -321487 12562 -621 17845
10003A01620c9099l28925a37014j66683p7403C8670r804b110k36425g9992C1504
$$ 101620 -39099 -368024 -137014 -303697 -381100 38670 28866 -2110 -238535 -79992 31504
9991a20747H4441J26862i9615F0561b22938A07073M355b40146M7580c6312l10716
$$ -120747 84441 211303 -99615 60561 -222938 107073 111428 -240146 -192566 -36312 -347028
9980c47028A0463d7115D269J80991B3157N8487e4262k15097B48190a07778A46949
$$ -347028 10463 -47115 4269 185260 23157 81644 -54262 -269359 248190 -107778 146949
9968I5920A4482P3507a18445B0990P2227b95420O1567J02478N8276p3064A13254
$$ 95920 14482 87989 -118445 20990 93217 -295420 -233853 -131375 -73099 -146163 113254
9956A39649m13a98138b2447B34505I1914A1113P0964J22122g4834k2205B03819
$$ 139649 139236 -198138 -22447 234505 91914 11113 82077 204199 -74834 -97039 203819
9944C4828J42391a17401a8842k32991R6377A49384k9784D1334a88594A62459c15470
$$ 34828 177219 -117401 -18842 -251833 -155456 149384 119600 41334 -188594 162459 -315470
9932E6887b62126A24307b36244e2010k3039B34772F4503a45754f4906b2393j9704
$$ 56887 -262126 124307 -236244 -52010 -75049 234772 64503 -145754 -64906 -22393 -42097
9921d2097l36388n1147a71986A87181c8509k66458R2680n5613C5991J11712a43874
$$ -42097 -378485 -429632 -171986 187181 -38509 -304967 -212287 -267900 35991 147703 -143874
9909b59073J771A2217b95272R0515B3993b36725P0624p577L6636q6589A00703
$$ -259073 -257302 12217 -295272 -204757 23993 -236725 -166101 -173678 -137042 -223631 100703
9897A92100a50289j01714g4775j42855C59327A24158k9659K1286d47918a56776
$$ 192100 -150289 -252003 -74775 -217630 359327 124158 94499 115785 -447918 -156776
9886b42620J18018b7290l4700a2516j34094a3685k40846A06496C1987g8779j29215
$$ -242620 -124602 -27290 -61990 -12516 -146610 -13685 -254531 106496 31987 -78779 -207994
9875b07994P7780b3079j82572a1716j57655C5134b85327O8172J05419n6458C29726
$$ -207994 -130214 -23079 -205651 -11716 -169371 35134 -285327 -217155 -111736 -168194 329726
9863b54340A2480e4793A44051E6319A866a32176m3081C22915b62110A0484J16740
$$ -254340 12480 -54793 144051 56319 1866 -132176 -175257 322915 -262110 10484 127224
9852A27224c81883A46493J68590c56505b1444l42671f6940k0619B36205i5856
$$ 127224 -381883 146493 315083 -356505 -21444 -364115 -66940 -87559 236205 -95856
9841g8371E0782p597h2014h232k6949B63847f1877A30322E9886k2509a35792r6340
$$ -78371 50782 43185 -82014 -8232 -35181 263847 -61877 130322 59886 37377 -135792 -232132
9829b32132R9249k7713m8586A33497d40995a65195B932d36020E3825J97314a52262
$$ -232132 -132883 -160596 -209182 133497 -440995 -165195 2932 -436020 53825 251139 -152262
9817E3887e2781k59157H648b77411J24281k11253D3533P8669a09036l5421j4087
$$ 53887 -52781 -311938 8648 -277411 -153130 -364383 43533 122202 -109036 -144457 -158544
9806a58544j967a5053j09498A29349b17744b7227j78081d7486L613k47485a05322
$$ -158544 -160511 -15053 -124551 129349 -217744 -27227 -205308 -47486 -43873 -291358 -105322
9794C4617b0722j25114E5475l09f3605B0641f510k48816o5167b5401J431A74574
$$ 34617 -20722 -145836 55475 55166 -63605 20641 -6510 -255326 -320493 -25401 -23970 174574
9781c8239m0821I068J5387m158a0997I7222b88684P0359I4258b3990A54018o0020
$$ -38239 -79060 9068 24455 20297 -10997 97222 -288684 -218325 94258 -23990 154018 93998
9769I3998B0609b99433h1323G039c37931o271g7184B75716c10566M0370C17237
$$ 93998 20609 -299433 -81323 7039 -337931 -344202 -77184 275716 -310566 -270196 317237
9757e3473P352j0085n8121H1024g2951a5198k81360B53231c49422a54872j16277
$$ -53473 -46121 -56206 -114327 81024 -72951 -15198 -296558 253231 -349422 -154872 -271149
9746b71149I389a79024k3788J699B59070a05637c4726B61947a43738j79130e782
$$ -271149 9389 -179024 -202812 -201113 259070 -105637 -34726 261947 -143738 -322868 -5782
9734c2782o8020A218b80102A71310d7451j0631A6104b74549E2743a52941q4022
$$ -32782 -100802 1218 -280102 171310 -47451 -58082 16104 -274549 52743 -152941 -236963
9723b36963E5027K0450a16158o6961H7773a57139g4917k36220A7286a51829k6091
$$ -236963 55027 75477 -116158 -183119 87773 -157139 -74917 -311137 17286 -151829 -177920
9712a77920L0814F981K52499a0893j12750B97485A17623O8022q9268c40018A74815
$$ -177920 -147106 6981 259480 -10893 -123643 297485 117623 185645 96377 -340018 174815
9700A1199J79912c25972g9132C31000b6637M18n7364A56619j1404d8011o0423
$$ 11199 191111 -325972 -79132 331000 -26637 -26219 -83583 156619 145215 -48011 -108434
9689a08434I158i0308k17332O9839F1092f808q4296p0510a5587k6056C8150a97917
$$ -108434 9158 -90308 -307640 -237801 61092 -6808 -91104 -161614 -15587 -41643 38150 -197917
9676a7289j23363K8042k9746A92664a83888m2060c9824E2428a95491J3046a797
$$ -17289 -140652 -112610 -142356 192664 -183888 -225948 -39824 52428 -195491 -182445 -1797
9664c11516A7943c4369k34665n6787a55743m4143A1211b49102A34910Q5276B8570
$$ -311516 17943 -34369 -269034 -325821 -155743 -199886 11211 -249102 134910 220186 28570
9652a59408N6900H8733a12400l8340P4374C6152f2519n1976k03668Q4693N4632
$$ -159408 -102508 88733 -112400 -150740 -76366 36152 -62519 -114495 -318163 -233470 -178838
9641a78838l7832l12360b01063f9898L0254k45191A73668a52257c2198j2321B05666
$$ -178838 -216670 -529030 -201063 -69898 -39644 -284835 173668 -152257 -32198 -44519 205666
9629d61925a09430n8901e1141k38246B8067d01348f3060q9955k09862a02713j33261
$$ -461925 -109430 -168331 -51141 -289387 28067 -401348 -63060 -153015 -362877 -102713 -235974
9618b35974b4574A61975b6407n8693j90848M2442b0868p0311m8992d5805j0925
$$ -235974 -24574 161975 -26407 -85100 -275948 -233506 -20868 -91179 -140171 -45805 -56730
9607e6730e047l43820a0838M56A6709O8125B1457b1008j83732j3625A33049b7927
$$ -56730 -5047 -348867 -10838 -10382 16709 84834 21457 -21008 -204740 -218365 133049 -27927
9594I1615a41552q7564a05057F7974e9204K7222B07690B5160b30059j89107C41150
$$ 91615 -141552 -229116 -105057 67974 -59204 -31982 207690 25160 -230059 -419166 341150
9582f3429r9021J2733j28151a33641d30B23812i5199I6419c78430f4337j83306
$$ -63429 -162450 -149717 -277868 -133641 -430 223812 -95199 96419 -378430 -64337 -247643
9571b47643J05695j26547A04406J02916a04723A19297c079B78931b68062O8258
$$ -247643 -141948 -268495 104406 207322 -104723 119297 -3079 278931 -268062 -199804
9561a99804k2648i974k02590n3136G17f3952a8115k14049k78536g6799A20355
$$ -199804 -222452 -9974 -212564 -265700 717 -63952 -18115 -232164 -510700 -76799 120355
9549a45889I5695b27548R0174G7433M897b31670g229p6411m8459A46556b15315
$$ -145889 95695 -227548 -137374 77433 82330 -231670 -7229 -83640 -132099 146556 -215315
9537b05000o5150A53955a72806k57821h0939a0164B24737a32898G7586a44442
$$ -205000 -270150 153955 -172806 -430627 -80939 -10164 224737 -132898 77586 -144442
9526D20903E4965a62614G2973a95674P7960p6243M3685j7049g5086k16365a5632
$$ 420903 54965 -162614 72973 -195674 -117714 -193957 -150272 -167321 -75086 -291451 -15632
9514A44793b2808j08009o3929R3600j31008J04887a6173k3657d188k37079f7051
$$ 144793 -22808 -130817 -194746 -101146 -232154 -127267 -16173 -39830 -4188 -241267 -67051
9502c04032A2786a60805A80799b01349q6188A3586e8032j55680l7507P3094A5616
$$ -304032 12786 -160805 180799 -201349 -287537 13586 -58032 -213712 -251219 -178125 15616
9490b38811o671C20583A52223b75123e6102j11727b1664j33637e538k97185g5947
$$ -238811 -245482 320583 152223 -275123 -56102 -167829 -21664 -155301 -5538 -302723 -75947
9478a85475g1251b2799i347k18934g903A14733e2992n09068K64615f9148j59979
$$ -185475 -71251 -22799 -9347 -228281 -7903 114733 -52992 -562060 -297445 -69148 -229127
9467b29127j32738e0654o991j89665c0024R352B52781a67604e3161k62504G2763
$$ -229127 -361865 -50654 -57645 -247310 -30024 -20672 252781 -167604 -53161 -315665 72763
9455a98154B9846h8488n6139n7584A79985P686I0519a85161I6067a79926I4461
$$ -198154 29846 -88488 -144627 -202211 179985 187671 90519 -185161 96067 -179926 94461
9443b36337H5951e4212j46286j38169g8600C23682i4550P148k74760A40481a59999
$$ -236337 85951 -54212 -200498 -338667 -78600 323682 -94550 -87402 -362162 140481 -159999
9431B42388a79855F4331O9695E624J07388b49470Q2939P5424m3970J902j87766
$$ 242388 -179855 64331 134026 5624 113012 -249470 -166531 -91107 -135077 -133175 -320941
9420c20941A16454a17145N4097j6798b7113k10888c4474k82392A47798g8304K6230
$$ -320941 116454 -117145 -63048 -79846 -27113 -238001 -34474 -316866 147798 -78304 -52074
9409e2074m5751L7031n148C51101c6959B41058d92444B3647K39608c5375H6927
$$ -52074 -97825 -60794 -65942 351101 -36959 241058 -492444 23647 263255 -35375 86927
9397D0352K32255a77786A79461b50917f5441b7091C55172A67804a32494A67153
$$ 40352 272607 -177786 179461 -250917 -65441 -27091 355172 167804 -132494 167153
9386A85465q425M1971g3040N908B5859b76635c0676o331J0642A57225K1895f3160
$$ 185465 177040 219011 -73040 -67132 25859 -276635 -30676 -37007 -26365 157225 179120 -63160
9373H9468a08563j04491A71674a49842a0490q9236A5147J16161a33092A99883
$$ 89468 -108563 -213054 171674 -149842 -10490 -99726 15147 131308 -133092 199883
9362a23145c3162m6018A45740a07968M7073r6693O4286m3572F6754b51315a08969
$$ -123145 -33162 -79180 145740 -107968 -60895 -157588 -93302 -136874 66754 -251315 -108969
9350A61891b40272b1678j08280C676f9761l40958a32630b5878A07513a24808j58348
$$ 161891 -240272 -21678 -129958 3676 -69761 -410719 -132630 -25878 107513 -124808 -283156
9339b83156b1757r5556N549d5379E8394P3273i457j69328j20993e650q5089D6420
$$ -283156 -21757 -117313 -111764 -45379 58394 131667 -9457 -178785 -299778 -5650 -90739 46420
9326a17434j81531e0839A58324b15331G0128a34665I4432f4377A16493b4140j90634
$$ -117434 -298965 -50839 158324 -215331 70128 -134665 94432 -64377 116493 -24140 -214774
9315b14774A03422h3388J7115r8608o6688b5693l4810p6231K4540H4156f7249
$$ -214774 103422 -83388 -66273 -164881 -231569 -25693 -60503 -136734 -112194 84156 -67249
9303e78500K58336i0500A50383a31610b9130q3273k05981G4111B2858L46691q4397
$$ -578500 -320164 -90500 150383 -131610 -29130 -112403 -318384 74111 22858 369549 285152
9292B85152j40584c1403j32862p7913f6310j30630J804E6635a00685d2620r8418
$$ 285152 144568 -31403 -164265 -242178 -66310 -196940 -195136 56635 -100685 -42620 -141038
9281a41038O6774A57120A5850c20156B7722N0030c45048A85104e3j38145e665
$$ -141038 -74264 157120 15850 -320156 27722 77752 -345048 185104 -53 -138198 -5665
9269c24365a51961G0893N8752a49803p8849E0084i386k06310j48167I4483P8800
$$ -324365 -151961 70893 129645 -149803 -228652 50084 -9386 -215696 -363863 94483 173283
9258A73283j5741a9544j06185C16799b23718H3352j5046a71528l9628m9234O0665
$$ 173283 157542 -19544 -125729 316799 -223718 83352 68306 -171528 -211156 -260390 -199725
9247a99725A99677H9467n528B9216L33771c81933H0917l4162e6418k57360M5177
$$ -199725 199677 89467 83939 29216 362987 -381933 80917 46755 -56418 -313778 -268601
9236b68601G300K09881D3526C453J53594d03728a4873m9099j99067J7459a12687
$$ -268601 7300 217181 43526 3453 157047 -403728 -14873 -63972 -263039 -245580 -112687
9224H3349b72031a06836E4945a72501A60597a92990O2880B01982k7267c50263
$$ 83349 -272031 -106836 54945 -172501 160597 -192990 -130110 201982 174715 -350263
9213b55561j55592a80256L2168j53507a9065A58933c93530c5363A20448A2422
$$ -255561 -411153 -180256 -148088 -301595 -19065 158933 -393530 -35363 120448 12422
9202a46324d7261J5749r9185c0050C5032h9188A8312g9175E8959g4448A51549
$$ -146324 -47261 -31512 -130697 -30050 35032 -89188 18312 -79175 58959 -74448 151549
9190b7930q3919B09166c31156a52903B31898C1349a07343L6891A92485N2982e3129
$$ -27930 -111849 209166 -331156 -152903 231898 31349 -107343 -70452 192485 245467 -53129
9178B1371a76011G8413O905a24558E2188a62353r6917B21413b05655B96230H8190
$$ 21371 -176011 78413 85318 -124558 52188 -162353 -259270 221413 -205655 296230 88190
9166a47233D7890a54471m3236N8084Q694G333c17601B57941F2569P1716b70690
$$ -147233 47890 -154471 -197707 -139623 -130929 7333 -317601 257941 62569 134285 -270690
9154c95524A25437a08825l7812a1355k81043o8647A04775c47622i0424j34742
$$ -395524 125437 -108825 -146637 -11355 -292398 -361045 104775 -347622 -90424 -225166
9144b25166F9428i9174n029D2611d35951A92361b35958a11891p6434A56253c47663
$$ -225166 69428 -99174 -104203 42611 -435951 192361 -235958 -111891 -188325 156253 -347663
9132D5357g1910k53744C8636q151a68407A9062i7953k3972L4279n1671b318l1219
$$ 45357 -71910 -325654 38636 30485 -168407 19062 -97953 -121925 -87646 -139317 -2318 -33537
9120c3537n3216k27376j7031c7231k21928G1122e8825o5214j73177B36945r980
$$ -33537 -86753 -314129 -331160 -37231 -259159 71122 -58825 -124039 -297216 236945 226965
9109B26965f3628p6657A49909c56321B0482a11088d0942j88274O5326M9284A04896
$$ 226965 -63628 -140285 149909 -356321 20482 -111088 -40942 -229216 -163890 -114606 104896
9097E9267b84302A87911a04597A22238e3699j66228A97498A3011b16286r7928
$$ 59267 -284302 187911 -104597 122238 -53699 -219927 197498 13011 -216286 -314214
9087c14214C11425a33675L8615A36566o3103L7746a69567A18711E9348a11831
$$ -314214 311425 -133675 -95060 136566 73463 111209 -169567 118711 59348 -111831
9076b67739I889a78425g9611l2463K579N1901A07522h2587A50356b20422K2066
$$ -267739 9889 -178425 -79611 -112074 -109495 -57594 107522 -82587 150356 -220422 -198356
9065a98356c9885G3609a33811D36906b13961A81067b29839E285K07151g1118k57309
$$ -198356 -39885 73609 -133811 436906 -213961 181067 -229839 5285 212436 -71118 -328427
9054c28427J51997A07297J69161F9129a80272O9650m8935o1113k25852J53021
$$ -328427 -176430 107297 276458 69129 -180272 -110622 -159557 -220670 -446522 -293501
9044b93501a18887k5863j36038f5002K0925I4421R2414a92282C41608b2032l9071
$$ -293501 -118887 -144750 -280788 -65002 -44077 94421 186835 -192282 341608 -22032 -61103
9033f1103p2892F2808P2126g4159j11848A27265g6677I8463a06392j1006K9760
$$ -61103 -133995 62808 134934 -74159 -186007 127265 -76677 98463 -106392 -117398 -87638
9022h7638A05428a95495d2446i260q9600H4403d1116F5261h3961p5781A65662
$$ -87638 105428 -195495 -42446 -9260 -98860 84403 -41116 65261 -83961 -159742 165662
9010H0762a12688o7677f9900j10229b9067A9683J00803a06620A19292f5793k6377
$$ 80762 -112688 -180365 -69900 -180129 -29067 19683 120486 -106620 119292 -65793 -92170
8999i2170J7492A59009l6342d08A15033d4710K0788l6392g907B6736e2904C3591
$$ -92170 -74678 159009 122667 -408 115033 -44710 -23922 -60314 -7907 26736 -52904 33591
8986A09965P6854a05009I5454b75796r758g9987B67381c44371c8045g771C02b03263
$$ 109965 186819 -105009 95454 -275796 -285554 -79987 267381 -344371 -38045 -7771 302 -203263
8973A37992E328b79643A15490a06350G5615b13662a0175m39955a05254B5372J81152
$$ 137992 5328 -279643 115490 -106350 75615 -213662 -10175 -450130 -105254 25372 206524
8962B06524g7342B01973b0257j11077j71050J34690L0739G7561A2415M2309a26928
$$ 206524 -77342 201973 -20257 -131334 -302384 -167694 -136955 77561 12415 54724 -126928
8950g6609p9107C7516A5707b62761O5790R3834D6543r744a21595j4761b6682B35351
$$ -76609 -155716 37516 15707 -262761 -196971 -103137 46543 36799 -121595 -136356 -26682 235351
8937B93713c49147A92427B1803J74486f4745I4960J13160a03280B04680B2697
$$ 293713 -349147 192427 21803 196289 -64745 94960 208120 -103280 204680 22697
8926I94182J064695J119729o9688J712323N53597K740409k699309B283165j028031
$$ 994182 2058877 3178606 3108918 4821241 5374838 8115247 5415938 2283165 1255134
8917A255134m17188D17489L1036j84619j26708J35839b54460G783J82831r2726
$$ 1255134 837946 417489 448525 263906 137198 273037 -254460 7783 190614 97888
8907I7888p439b8292A35445a13355j03684Q0235r6718B86308a94399B02524G1196
$$ 97888 90449 -28292 135445 -113355 -217039 -136804 -233522 286308 -194399 202524 71196
8895b09785A55486o2311e3643j85720n4700g2600Q894j27900m2958k21447a04371
$$ -209785 155486 93175 -53643 -239363 -294063 -72600 -63706 -191606 -234564 -456011 -104371
8883A864c24125h3138L4117A31728a67774C7731b08712q053A24431b55182J13678
$$ 1864 -324125 -83138 -49021 131728 -167774 37731 -208712 -216765 124431 -255182 -141504
8872a41504D2907J33311J24384a90173k47996G3117c73213a71018e1285D7182
$$ -141504 42907 176218 300602 -190173 -438169 73117 -373213 -171018 -51285 47182
8861b66518K2513E9655a85378a1271k22006c6524j88850b1033k03557g9815I7695
$$ -266518 -244005 59655 -185378 -11271 -233277 -36524 -225374 -21033 -224590 -79815 97695
8849A58355b70990J31265K5586C05731a68238f4666K5762J6328j91741N5489d2988
$$ 158355 -270990 -139725 -114139 305731 -168238 -64666 -38904 -22576 -214317 -158828 -42988
$$ [...]
##END NTUPLES=NMR SPECTRUM
##END=
