##TITLE=AC1551_ROEFFECT0015_8269012_wAONcqBkeU
##JCAMPDX= 6.0         $$ Bruker NMR JCAMP-DX V2.0
##DATA TYPE= NMR SPECTRUM
##DATA CLASS= NTUPLES
##ORIGIN= BRUKER
##OWNER= Administrator
$$ 1.72 TOPSPIN		Version 2.1
$$ 2013-10-11 23:25:27.451 -0700  Administrator@X
$$ Compression mode = diff/dup
##.OBSERVE FREQUENCY= 400.02188249412
##.OBSERVE NUCLEUS= ^1H
##.ACQUISITION MODE= SIMULTANEOUS (DQD)
##.ACQUISITION SCHEME= undefined
##.AVERAGES= 64
##.DIGITISER RES= 22
##SPECTROMETER/DATA SYSTEM= spect
##.PULSE SEQUENCE= noesygpps1d.comp
##.SOLVENT NAME= COFFEE_meoh
##.SHIFT REFERENCE= INTERNAL, COFFEE_meoh, 1, 14.96097
##AUDIT TRAIL= $$ (NUMBER, WHEN, WHO, WHERE, PROCESS, VERSION, WHAT)
$$ ##TITLE= Audit trail, TOPSPIN		Version 2.1
$$ ##JCAMPDX= 5.01
$$ ##ORIGIN= Bruker BioSpin GmbH
$$ ##OWNER= Administrator
$$ $$ E:\/data/COFFEE/nmr/AC1551_ROEFFECT0015_8269012_wAONcqBkeU/12/pdata/1/auditp.txt
$$ ##AUDIT TRAIL=  $$ (NUMBER, WHEN, WHO, WHERE, PROCESS, VERSION, WHAT)
(   1,<2013-10-11 23:25:22.482 -0700>,<Administrator>,<X>,<go>,<TOPSPIN 2.1>,
      <created by zg
	started at 2013-10-11 23:13:52.808 -0700,
	POWCHK enabled, PULCHK disabled,
       configuration hash MD5:
       C8 4E 4E 5D D3 5C D8 9E 9F 52 82 E0 59 8A DE 15
       data hash MD5: 64K
       3A 67 02 A7 6F 71 89 79 E7 8E 1F F8 8F CD 9B 2B>)
(   2,<2013-10-11 23:25:25.529 -0700>,<Administrator>,<X>,<proc1d>,<TOPSPIN 2.1>,
      <Start of raw data processing
       efp LB = 0.3 FT_mod = 6 PKNL = 1 PHC0 = 0 PHC1 = 0 SI = 128K 
       data hash MD5: 128K
       BD 43 6E 69 3C BD 45 43 40 8B 80 BE D5 46 85 44>)
(   3,<2013-10-11 23:25:26.451 -0700>,<Administrator>,<X>,<proc1d>,<TOPSPIN 2.1>,
      <pk PHC0 = -82.6062 PHC1 = 0 
       data hash MD5: 128K
       46 59 36 E0 2B 1E 02 0B 95 BA B4 E3 6C 6F 45 AE>)
(   4,<2013-10-11 23:25:26.873 -0700>,<Administrator>,<X>,<proc1d>,<TOPSPIN 2.1>,
      <abs ABSG = 1 
       data hash MD5: 128K
       08 02 49 88 0C 84 1E CD 6A 9C D4 DE F6 70 AE 45>)
(   5,<2013-10-11 23:25:26.966 -0700>,<Administrator>,<X>,<proc1d>,<TOPSPIN 2.1>,
      <abs ABSG = 2 
       data hash MD5: 128K
       85 80 7E 46 25 85 42 48 BC A7 6C 64 DE 3A 07 CF>)
(   6,<2013-10-11 23:25:27.091 -0700>,<Administrator>,<X>,<proc1d>,<TOPSPIN 2.1>,
      <abs ABSG = 3 
       data hash MD5: 128K
       9F D2 D7 A8 FF 67 F9 6E B9 69 80 F0 D0 CD E7 3E>)
(   7,<2013-10-11 23:25:27.185 -0700>,<Administrator>,<X>,<proc1d>,<TOPSPIN 2.1>,
      <abs ABSG = 4 
       data hash MD5: 128K
       FC D2 FA 52 F4 7C A1 01 5B 8A AB 8F 19 8D E8 3B>)
(   8,<2013-10-11 23:25:27.295 -0700>,<Administrator>,<X>,<proc1d>,<TOPSPIN 2.1>,
      <abs ABSG = 5 
       data hash MD5: 128K
       77 B5 BD 3F 4D 09 C8 20 47 85 6C FC CD 97 96 97>)
$$ ##END=
$$ 
$$ $$ hash MD5
$$ $$ 17 E0 42 FC 02 31 81 C8 13 B1 5A 96 7F 21 FC 88
##$RELAX= 
##$RELAX= 
##$RELAX= 
##$RELAX= 
##$RELAX= 
##$RELAX= 
##$RELAX= 
##$RELAX= 
$$ Bruker specific parameters
$$ --------------------------
##$DU= <E:\>
##$EXPNO= 12
$$ [...]
##$TP07= 0
##$TPNAME0= <>
##$TPNAME1= <>
##$TPNAME2= <>
##$TPNAME3= <>
##$TPNAME4= <>
##$TPNAME5= <>
##$TPNAME6= <>
##$TPNAME7= <>
##$TPOAL= (0..7)
0.5 0.5 0.5 0.5 0.5 0.5 0.5 0.5
##$TPOFFS= (0..7)
0 0 0 0 0 0 0 0
##$TUNHIN= 0
##$TUNHOUT= 0
##$TUNXOUT= 0
##$USERA1= <user>
##$USERA2= <user>
##$USERA3= <user>
##$USERA4= <user>
##$USERA5= <user>
##$V9= 5
##$VALIST= <valist>
##$VCLIST= <CCCCCCCCCCCCCCC>
##$VD= 0
##$VDLIST= <DDDDDDDDDDDDDDD>
##$VPLIST= <PPPPPPPPPPPPPPP>
##$VTLIST= <TTTTTTTTTTTTTTT>
##$WBST= 1024
##$WBSW= 4
##$XGAIN= (0..3)
0 0 0 0
##$XL= 0
##$YL= 0
##$YMAX_a= 7038603
##$YMIN_a= -13042210
##$ZGOPTNS= <>
##$ZL1= 120
##$ZL2= 120
##$ZL3= 120
##$ZL4= 120
##$ABSF1= 14.96097
##$ABSF2= -5.597212
##$ABSG= 5
##$ABSL= 3
##$ALPHA= 0
##$AQORDER= 0
##$ASSFAC= 0
##$ASSFACI= 0
##$ASSFACX= 0
##$ASSWID= 0
##$AUNMP= <proc_prof1d_extract.lims>
##$AXLEFT= 0
##$AXNAME= <>
##$AXNUC= <1H>
##$AXRIGHT= 0
##$AXTYPE= 0
##$AXUNIT= <>
##$AZFE= 0.1
##$AZFW= 0.1
##$BCFW= 0
##$BC_mod= 0
##$BYTORDP= 0
##$COROFFS= 0
##$CY= 15
##$DATMOD= 1
##$DC= 0
##$DFILT= <>
##$DTYPP= 0
##$F1P= 0
##$F2P= 0
##$FCOR= 0.5
##$FTSIZE= 131072
##$FT_mod= 6
##$GAMMA= 0
##$GB= 0
##$INTBC= 1
##$INTSCL= 1
##$ISEN= 128
##$LB= 0.3
##$LEV0= 0
##$LPBIN= 0
##$MAXI= 10000
##$MC2= 0
##$MEAN= 0
##$ME_mod= 0
##$MI= 0
##$NCOEF= 0
##$NC_proc= -3
##$NLEV= 6
##$NOISF1= 0
##$NOISF2= 0
##$NSP= 0
##$NTH_PI= 0
##$NZP= 0
##$OFFSET= 14.96097
##$PC= 1
##$PHC0= -82.6062
##$PHC1= 0
##$PH_mod= 1
##$PKNL= yes
##$PPARMOD= 0
##$PPDIAG= 0
##$PPIPTYP= 0
##$PPMPNUM= 2147483647
##$PPRESOL= 1
##$PSCAL= 4
##$PSIGN= 0
##$PYNMP= <proc.py>
##$REVERSE= no
##$SF= 400.020009647028
##$SI= 131072
##$SIGF1= 0
##$SIGF2= 0
##$SINO= 400
##$SIOLD= 131072
##$SPECTYP= <>
##$SREGLST= <1H.CDCl3>
##$SSB= 0
##$STSI= 131072
##$STSR= 0
##$SW_p= 8223.68421052631
##$SYMM= 0
##$S_DEV= 0
##$TDeff= 65536
##$TDoff= 0
##$TI= <>
##$TILT= no
##$TM1= 0
##$TM2= 0
##$TOPLEV= 0
##$USERP1= <user>
##$USERP2= <user>
##$USERP3= <user>
##$USERP4= <user>
##$USERP5= <user>
##$WDW= 1
##$XDIM= 131072
##$YMAX_p= 533786532
##$YMIN_p= -19900991
##$CURPLOT= <Network HP LaserJet P1505>
##$CURPRIN= <$Network HP LaserJet P1505>
##$DFORMAT= <normdp>
##$LAYOUT= <+/1D_H.xwp>
##$LFORMAT= <normlp>
##$PFORMAT= <normpl>
##$SURQMSG= 1
$$ End of Bruker specific parameters
$$ ---------------------------------
##NTUPLES= NMR SPECTRUM
##VAR_NAME=  FREQUENCY,     SPECTRUM/REAL,   SPECTRUM/IMAG
##SYMBOL=    X,             R,               I
##VAR_TYPE=  INDEPENDENT,   DEPENDENT,       DEPENDENT
##VAR_FORM=  AFFN,          ASDF,            ASDF
##VAR_DIM=   131072,        131072,          131072
##UNITS=     HZ,            ARBITRARY UNITS, ARBITRARY UNITS
##FACTOR=    0.0627417313425164, 1,          1
##FIRST=     8223.62146879497, 1757,         -137076
##LAST=      0,             5825,            -137472
##MIN=       0,             -19900991,       0
##MAX=       8223.62146879497, 533786532,    0
$$ Real data points
##PAGE= N=1
##DATA TABLE= (X++(R..R)), XYDATA
$$ [...]
63467A081156J1871J1822J1639J2487J4181J4918J3949J2537J1622J0473Q546
63456A215201O881O399O370N889N426N554N456M411L556M286N871O608O870Q796
63442A297574J3075J8038K2131K5504K8810L2224L6129M1135M6722N1296N4385
63431A667023N7412O1396O5267O7514O8184O7724O4885N7745M6553L3940K2233
63420B279876J1979L227l299p097q896r774r794q228m817j29N058J0068J4152
63407B272326J6666J7520J7030J5272J2007P348K034l226q387j3736j9192k4213
63395B291449k8360l1710l4815l8303m2366m6436m9684n2020n4181n6423n7721
63384A799430n7010n4889n3015n1814m9987m6614m2521l8781l4933k9887k3978
$$ plain form
63467 1081156 1093027 1104849 1116488 1128975 1143156 1158074 1172023 1184560 1196182 1206655 1215201
63456 1215201 1222082 1228481 1234851 1240740 1246166 1251720 1257176 1261587 1265143 1269429 1275300 1281908 1288778 1297574
63442 1297574 1310649 1328687 1350818 1376322 1405132 1437356 1473485 1514620 1561342 1612638 1667023
63431 1667023 1724435 1785831 1851098 1918612 1986796 2054520 2119405 2177150 2223703 2257643 2279876
63420 2279876 2291855 2295082 2291783 2284686 2275790 2266016 2256222 2247994 2243177 2243048 2248106 2258174 2272326
63407 2272326 2288992 2306512 2323542 2338814 2350821 2358169 2360203 2356977 2348590 2334854 2315662 2291449
63395 2291449 2263089 2231379 2196564 2158261 2115895 2069459 2019775 1967755 1913574 1857151 1799430
63384 1799430 1742420 1687531 1634516 1582702 1532715 1486101 1443580 1404799 1369866 1339979 1316001
63373A316001j8744j4808j1188o841j871L136Q080J3191J8562K4278L0434L6629
63361A396859M1919M5813M8969N2488N6722O1098O4908O7896P0282P2547P4919
63350B054420P6646P6052P1929O5086N7986N2567M8531M3880L7023K8164J8868
63339B631152J0567L609k598q782j5069k0855k5343k8413l0933l3974l7639m0958
63327B400764m3033m4014m4745m5695m6579m6832m6222m5119m4292m4119m3768
63316A906346m1577l6819l0880k6212k4402k5719l0059l7075m5213n1877n5433
63305A501080n6503n6726n6713n5966n4269n2051m9325m5362m0028l4749l1136
63294I68252k8908k6095k1593j6756j3807j3248j3592j3319j2072r978p122m287
$$ plain form
63373 1316001 1297257 1282449 1271261 1264420 1262549 1265685 1273765 1286956 1305518 1329796 1360230 1396859
63361 1396859 1438778 1484591 1533560 1586048 1642770 1703868 1768776 1836672 1906954 1979501 2054420
63350 2054420 2131066 2207118 2279047 2344133 2402119 2454686 2503217 2547097 2584120 2612284 2631152
63339 2631152 2641719 2645328 2642730 2633948 2618879 2598024 2572681 2544268 2513335 2479361 2441722 2400764
63327 2400764 2357731 2313717 2268972 2223277 2176698 2129866 2083644 2038525 1994233 1950114 1906346
63316 1906346 1864769 1827950 1797070 1770858 1746456 1720737 1690678 1653603 1608390 1556513 1501080
63305 1501080 1444577 1387851 1331138 1275172 1220903 1168852 1119527 1074165 1034137 999388 968252
63294 968252 939344 913249 891656 874900 861093 847845 834253 820934 808862 798884 791762 787475
63282G87475l068m224o417p552p005n736m581l528k390j188K15J904L283L633
63268G50821L291L322L946M376M321M403M677M142K496J201J791L965O327Q179
63254H07258R512J0083R854R849J1117J2920J3332J1837J0169J0190J1939J4156
63242I42216J5920J7116J7816J7911J7423J6836J6984J8372K0513K2173K2683
63231A145963K2686K3228K4349K5240K5618K6185K7652K9849L2090L3893L5171
63220A451924L5988L6312L5851L4276L1848K9584K8316K7672K6452K3950K0465
63209A782638J6682J3077R731O176J649l817q950j2791j6368k1416k7494l1994
63197A707123l3577l3988l5325l6858l6051l2000k6251k0589j5496j0778o203
$$ plain form
63282 787475 784407 780183 773766 766214 759209 753473 748892 745364 742974 741786 742001 743905 747188 750821
63268 750821 754112 757434 761380 765756 770077 774480 779157 783299 785795 786996 788787 792752 799079 807258
63254 807258 816770 826853 836707 846556 857673 870593 883925 895762 905931 916121 928060 942216
63242 942216 958136 975252 993068 1010979 1028402 1045238 1062222 1080594 1101107 1123280 1145963
63231 1145963 1168649 1191877 1216226 1241466 1267084 1293269 1320921 1350770 1382860 1416753 1451924
63220 1451924 1487912 1524224 1560075 1594351 1626199 1655783 1684099 1711771 1738223 1762173 1782638
63209 1782638 1799320 1812397 1822128 1828304 1829953 1826136 1817186 1804395 1788027 1766611 1739117 1707123
63197 1707123 1673546 1639558 1604233 1567375 1531324 1499324 1473073 1452484 1436988 1426210 1420007
63186A420007j305M304R979J4390J7239J9717K2799K5990K8372L0046L1599L2782
63174A655919L2706L1167K8884K6468K3936K1234J8495J5637J2393Q923N684K445
63162A883891j845p578j3506j7952k0823k3612k7559l2483l7516m2126m6020m8687
63150A564184m9736m9530m9006m8731m8391m7166m4481m0530l6267l2784l0394
63139A087168k8349k5688k2341j9154j6860j5332j3986j2543j1129r794q355o858
63127H96779n822n666o014o029n490n119n522o208o105m864l107j497k37M97M52
63112H36048l9M1J274L041M372N154N879O645P201P764Q877J0436J1713J2579
63098I20985J4022J6868K0469K3104K3601K2392K1081K1033K2174K3071K2406
$$ plain form
63186 1420007 1418702 1423006 1432985 1447375 1464614 1484331 1507130 1533120 1561492 1591538 1623137 1655919
63174 1655919 1688625 1719792 1748676 1775144 1799080 1820314 1838809 1854446 1866839 1875762 1881446 1883891
63162 1883891 1882046 1874468 1860962 1843010 1822187 1798575 1771016 1738533 1701017 1658891 1612871 1564184
63150 1564184 1514448 1464918 1415912 1367181 1318790 1271624 1227143 1186613 1150346 1117562 1087168
63139 1087168 1058819 1033131 1010790 991636 974776 959444 945458 932915 921786 911992 903637 896779
63127 896779 890957 885291 879277 873248 867758 862639 857117 850909 844804 839940 836833 835336 835099 835596 836048
63112 836048 836009 836050 837324 840365 844737 849891 855770 862415 869616 877380 886257 896693 908406 920985
63098 920985 935007 951875 972344 995448 1019049 1041441 1062522 1083555 1105729 1128800 1151206
63087A151206K0256J7674J5127J2075Q086L680m25m305q379j2301j5074j6273
63075A171347j6598j6942j7256j6591j4168j0230n872k148P19L293O271R923J4033
63062A105781J8166K1996K5540K9124L2989L6894M0298M2980M5361M8142N1799
63051A499070N6386O1531O6492P0485P3272P5422P7817Q0768Q3717Q5764Q6635
63040B317359Q7029Q7841Q9006Q9547Q8911Q7689Q6465Q4488Q0515P4835O9262
63029C242947O4771O0212N3963M5828L6443K5705J3199k78j2994k4269l4972m5707
63017C424848n5557o3260o8802p3091p6533p8588p8466p5757p0631o3909n6590
63006B663664m8930m0269l0327k0187j1250l385M852J4034K2756K9167L2882L4933
$$ plain form
63087 1151206 1171462 1189136 1204263 1216338 1224424 1228104 1227679 1223374 1214995 1202694 1187620 1171347
63075 1171347 1154749 1137807 1120551 1103960 1089792 1079562 1073690 1071542 1072261 1075554 1081825 1091748 1105781
63062 1105781 1123947 1145943 1171483 1200607 1233596 1270490 1310788 1353768 1399129 1447271 1499070
63051 1499070 1555456 1616987 1683479 1753964 1827236 1902658 1980475 2061243 2144960 2230724 2317359
63040 2317359 2404388 2492229 2581235 2670782 2759693 2847382 2933847 3018335 3098850 3173685 3242947
63029 3242947 3307718 3367930 3421893 3467721 3504164 3529869 3543068 3542790 3529796 3505527 3470555 3424848
63017 3424848 3369291 3306031 3237229 3164138 3087605 3009017 2930551 2854794 2784163 2720254 2663664
63006 2663664 2614734 2574465 2544138 2523951 2512701 2509316 2514168 2528202 2550958 2580125 2613007 2647940
62994B647940L6372L7561L8433L8742L8108L6304L3520L0068K6113K1918J8000
62983C003079J4482J0673N908N30m819j0621j8070k7122l6077m3606n0260n7271
62971B786826o4648p1293p6385p9836q1772q2497q2698q2876q2648q1249p8561
62960A922363p5005p0787o6086o1739n8596n6094n2463m6831m0393l5183l2212
62949A326974l1048l0582k9818k8368k6533k4666k2494j9605j6533j4627j4524
62938A068176j5397j5923j5461j4095j2283j0733r861q997o855l350j93R31K60
62925I56219n76m71L35R55P22k57r71l26J497L066L488L505M216N434O127N873
62909I88836M984L829K908K934L744L803K169K84Q0O86q31n068q825r096o786
$$ plain form
62994 2647940 2684312 2721873 2760306 2799048 2837156 2873460 2906980 2937048 2963161 2985079 3003079
62983 3003079 3017561 3028234 3034142 3034672 3029853 3019232 3001162 2974040 2937963 2894357 2844097 2786826
62971 2786826 2722178 2650885 2574500 2494664 2412892 2330395 2247697 2164821 2082173 2000924 1922363
62960 1922363 1847358 1776571 1710485 1648746 1590150 1534056 1481593 1434762 1394369 1359186 1326974
62949 1326974 1295926 1265344 1235526 1207158 1180625 1155959 1133465 1113860 1097327 1082700 1068176
62938 1068176 1052779 1036856 1021395 1007300 995017 984284 974423 965426 958571 955221 955028 955959 956219
62925 956219 955643 955172 955507 956462 957184 956927 955956 955630 957127 960193 963681 967186 971402 976836 982963 988836
62909 988836 993820 997649 1000557 1003491 1007235 1011038 1013207 1013491 1013571 1014257 1013426 1008358 999533 990437 983651
62894I83651n023m982n202m442l278k579j941m83J433K248J086r55j835q34P07
62879I57571J199P63P71J747K814L194L173L134K614J085j008k733l776m402m661
62864I61485m392l861l686m058m441m147k999j506n03m39r87j536j939k247j904
62849I22840l04J666J951Q4j595p63J717L017K239J171J151J253L72n99k7J975
62833I36148L752M305M164M268M970O153P510Q524Q774Q337P629O929O419O392
62819A024274O855P093O311M709L235K302J495O72L91Q82J432J498J718K921M605
62804A070393N478N252M855M798M699M729O265J0105J4901J8608K0976K3407K6580
62791A221046K9609L1781L3788L6631M0332M4569M9721N6179O3211O9596P5172
$$ plain form
62894 983651 978628 973646 968444 964002 960724 958145 956204 955721 957154 959402 960488 959533 957698 956864 957571
62879 957571 958770 959533 960304 962051 964865 968059 971232 974366 976980 978065 977057 974324 970548 966146 961485
62864 961485 957093 953232 949546 945488 941047 936900 933901 932395 931892 931453 930466 928930 926991 924744 922840
62849 922840 922536 924202 926153 926237 924642 923879 925596 928613 930852 932023 933174 934427 934799 934200 934173 936148
62833 936148 939900 944205 948369 952637 957607 963760 971270 979794 988568 996905 1004534 1011463 1017882 1024274
62819 1024274 1031129 1038222 1044533 1049242 1052477 1054779 1056274 1056946 1057337 1058219 1059651 1061149 1062867 1065788 1070393
62804 1070393 1075871 1081123 1085978 1090776 1095475 1100204 1106469 1116574 1131475 1150083 1171059 1194466 1221046
62791 1221046 1250655 1282436 1316224 1352855 1393187 1437756 1487477 1543656 1606867 1676463 1751635
62780A751635Q0688Q6270R1271R5764J00936J07308J13583J17992J20128J20610
62770B786185J19605J16796J12447J07260J01045R2614Q1412O8419N4882M0755
62760C681420K5088P591j0800k8716m5164n9726p2588q4403r5596j05586j13114
62749C098406j17579j19728j20774j21016j19754j16470j11641j06215j00525
62740B064704r4185q6971p9419p2239o5492n8857n2545m7315m3416m0127l6730
62729A387408l3405l0538k7561k3303j7605j1931q050o370n710m514k237K30J585
62716A217999J708J963L599O340R184J2194J6334K1596K6614L0499L3863L7448
62704A419341M0928M4002M7643N2967N9553O6063P2026P7658Q2440Q5487Q7250
$$ plain form
62780 1751635 1832323 1918593 2009864 2105628 2206564 2313872 2427455 2545447 2665575 2786185
62770 2786185 2905790 3022586 3135033 3242293 3343338 3435952 3517364 3585783 3640665 3681420
62760 3681420 3706508 3714099 3703299 3674583 3629419 3569693 3497105 3412702 3317106 3211520 3098406
62749 3098406 2980827 2861099 2740325 2619309 2499555 2383085 2271444 2165229 2064704
62740 2064704 1970519 1883548 1804129 1731890 1666398 1607541 1554996 1507681 1464265 1424138 1387408
62729 1387408 1354003 1323465 1295904 1272601 1254996 1243065 1235015 1228645 1222935 1218421 1216184 1216414 1217999
62716 1217999 1219707 1221670 1225269 1231609 1240793 1252987 1269321 1290917 1317531 1348030 1381893 1419341
62704 1419341 1460269 1504271 1551914 1604881 1664434 1730497 1802523 1880181 1962621 2048108 2135358
62693B135358Q9163R1349R2287R1249Q9478Q8019Q5725Q0782P3239O4629N5662
62682C036940M5735L4498K2437R796l811j8179l1957m4141n5403o7012p8543q7660
62670B762700r2602r4353r5592r7499r8448r6383r1838q7448q4555q1683p6921
62659A765378p0693o4923o0170n5082m8847m2719l8438l5932l3476k9915k5852
62648A259331k2610k0559j8900j6887j4831j3609j3462j3595j3093j1834j0340
62637A089611r045q046p332o861o377n521m216k796j697j062p08n00p76k100m304
62622A028270o000n730l590j067Q06K146K959K479P13n50K93K384L694M129N508
62607A036444Q481J1425J2962J3782J5046J6580J7889J9620K2463K5507K7341
$$ plain form
62693 2135358 2224521 2315870 2408157 2499406 2588884 2676903 2762628 2843410 2916649 2981278 3036940
62682 3036940 3082675 3117173 3139610 3149406 3145595 3127416 3095459 3051318 2995915 2928903 2850360 2762700
62670 2762700 2670098 2575745 2480153 2382654 2284206 2187823 2095985 2008537 1923982 1842299 1765378
62659 1765378 1694685 1629762 1569592 1514510 1465663 1422944 1384506 1348574 1315098 1285183 1259331
62648 1259331 1236721 1216162 1197262 1180375 1165544 1151935 1138473 1124878 1111785 1099951 1089611
62637 1089611 1080566 1072520 1065188 1058327 1051950 1046429 1042213 1039417 1037720 1036658 1035950 1035450 1034674 1032574 1028270
62622 1028270 1022270 1016540 1012950 1011883 1012689 1014835 1017794 1020273 1020986 1020436 1020729 1023113 1026807 1030936 1036444
62607 1036444 1044925 1056350 1069312 1083094 1098140 1114720 1132609 1152229 1174692 1200199 1227540
62596A227540K8312L0182L3780L8366M2983M7006M9531M9961M9467N0153N2161
62585A699442N3057N0931M6811M2866L9341L4734K8346K1068J3812O453j382r560
62573B025919j7781k5836l3217l9187m3613m7174n0336n2716n3856n4073n3928
62562A554202n3269n1521m8790m5882m3100l9781l5405l0707k7032k4812k3276
62551A130627k1699k0266j9356j8488j6763j4199j1882j0487r289p205m442k324
62539I74227j553j333n48P74J712J819J622J829K557L576M843O450Q151R424J0052
62524A023602J0527J1674J3870J6718J9481K1852K4224K7123L0442L3395L5432
62513A268340L7017L9203M2359M5734M8374N0190N1706N3024N3559N2755N0577
$$ plain form
62596 1227540 1255852 1286034 1319814 1358180 1401163 1448169 1497700 1547661 1597128 1647281 1699442
62585 1699442 1752499 1803430 1850241 1893107 1932448 1967182 1995528 2016596 2030408 2036861 2035479 2025919
62573 2025919 2008138 1982302 1949085 1909898 1866285 1819111 1768775 1716059 1662203 1608130 1554202
62562 1554202 1500933 1449412 1400622 1354740 1311640 1271859 1236454 1205747 1178715 1153903 1130627
62551 1130627 1108928 1088662 1069306 1050818 1034055 1019856 1007974 997487 988198 980993 976551 974227
62539 974227 972674 971341 970793 971567 973279 975098 976720 978549 981106 984682 989525 995975 1004126 1013550 1023602
62524 1023602 1034129 1045803 1059673 1076391 1095872 1117724 1141948 1169071 1199513 1232908 1268340
62513 1268340 1305357 1344560 1386919 1432653 1481027 1531217 1582923 1635947 1689506 1742261 1792838
62502A792838M7231M2948L8161L3312K8144K1838J4371P101J219l880r590j5628
62490A998065j9946k1407k1391k1871k2882k2866k1089j8503j6328j4721j3103
62479A783958j0957p992m219m46J738J298r18k717k829k412l800p764j2605j6290
62465A714045j9027k2730k8144l3565l6951l8315l9175m0280m1015m0858m0267
62454A333718l9895l9732l9366l8467l6703l3669k9306k4213j9341j5503j3051
62443A004472j1649j0458q987p644o950o445n132l026j320p96r13q95q80j422
62429I37955k433l268l443k786j310N48J894K074J153l60j831k399j582k94k86
62414I23632j844l051k326o60J2k01M04K038K833J707P2j35J179K838M217N314
$$ plain form
62502 1792838 1840069 1883017 1921178 1954490 1982634 2004472 2018843 2025944 2027163 2023283 2013693 1998065
62490 1998065 1978119 1956712 1935321 1913450 1890568 1867702 1846613 1828110 1811782 1797061 1783958
62479 1783958 1773001 1765009 1760790 1760344 1762082 1763380 1762462 1759745 1756916 1754504 1750704 1742940 1730335 1714045
62465 1714045 1695018 1672288 1644144 1610579 1573628 1535313 1496138 1455858 1414843 1373985 1333718
62454 1333718 1293823 1254091 1214725 1176258 1139555 1105886 1076580 1052367 1033026 1017523 1004472
62443 1004472 992823 982365 973378 965734 958784 952339 947207 944181 942861 942065 941152 940257 939377 937955
62429 937955 935522 932254 928811 926025 924715 925263 927157 929231 930384 930024 928193 925794 924212 923918 923632
62414 923632 921788 918737 916411 915751 915763 915562 915966 918004 920837 922544 922616 922481 923660 926498 930715 936029
62398I36029N698M749K929J810K514M513O226O583N835M950M464M289M483N500
62384A000572P180Q245P755O665O785Q231R215Q637P631P887R527J1516J3362
62371A113208J5346J7609J9887K1904K3398K4213K5069K7643L2817L9085M3852
62360A404031M6390M8620N2737N8842O5248P0427P4203P7265Q0052Q2216Q3163
62349B143194Q2899Q1964Q0399P7355P2223O5663N8763N1374M2170L0475J7425
62338B803904M998n669j4947k4057l3865m3959n2893n9607o4467o8507p1968p4230
62326B294733p4993p4635p3377p1058o8051o5376o3363o1011n7410n3162m9598
62315A582699m6954m4306m1030l7467l4152l1240k8840k7142k5790k3768k0457
$$ plain form
62398 936029 941727 946476 949405 951215 953729 958242 964468 971051 976886 981836 986300 990589 995072 1000572
62384 1000572 1007752 1015997 1023752 1030417 1037202 1045433 1054648 1063285 1070916 1078803 1088330 1099846 1113208
62371 1113208 1128554 1146163 1166050 1187954 1211352 1235565 1260634 1288277 1321094 1360179 1404031
62360 1404031 1450421 1499041 1551778 1610620 1675868 1746295 1820498 1897763 1977815 2060031 2143194
62349 2143194 2226093 2308057 2388456 2465811 2538034 2603697 2662460 2713834 2756004 2786479 2803904
62338 2803904 2808902 2803233 2788286 2764229 2730364 2686405 2633512 2573905 2509438 2440931 2368963 2294733
62326 2294733 2219740 2145105 2071728 2000670 1932619 1867243 1803880 1742869 1685459 1632297 1582699
62315 1582699 1535745 1491439 1450409 1412942 1378790 1347550 1318710 1291568 1265778 1242010 1221553
62304A221553j6565j3464j1731j0693r426p791o336n474n052m686m192l599k870
62291A119674j946r33j9Q65K002L386M567N234N722O556P604Q169P879P014N850
62276A181624M336K762K091K897M346N196N628O985R485J1584J2426J3696J7639
62263A280695K3856K9737L3909L7614M2359M7907N3358N8735O4281O9303P3128
62252A814882P6454Q0346Q4313Q6803Q7252Q6123Q3112P7100O8200N8263M8631
62241B651479L8692K7373J4948K398j0010k2395l4240m4761n3840o1580o7478
62230B440586p1094p3336p5743p8366p9371p7182p2375o6964o2293n8072n3335
62219A672455m7918m2776l8830l5771l2519k8832k5808k4398k3991k3160k1376
$$ plain form
62304 1221553 1204988 1191524 1179793 1169100 1159674 1151883 1145547 1140073 1135021 1130335 1126143 1122544 1119674
62291 1119674 1117728 1116795 1116776 1117641 1119643 1123029 1127596 1132830 1138552 1145108 1152712 1160881 1168760 1175774 1181624
62276 1181624 1185960 1188722 1190813 1193710 1198056 1203252 1208880 1215865 1225350 1236934 1249360 1263056 1280695
62263 1280695 1304551 1334288 1368197 1405811 1448170 1496077 1549435 1608170 1672451 1741754 1814882
62252 1814882 1891336 1971682 2055995 2142798 2230050 2316173 2399285 2476385 2544585 2602848 2651479
62241 2651479 2690171 2717544 2732492 2734890 2724880 2702485 2668245 2623484 2569644 2508064 2440586
62230 2440586 2369492 2296156 2220413 2142047 2062676 1985494 1913119 1846155 1783862 1725790 1672455
62219 1672455 1624537 1581761 1542931 1507160 1474641 1445809 1420001 1395603 1371612 1348452 1327076
62208A327076j9290j7469j5722j3719j1659j0045r147q757q232o892m793k889
62196A198462j911j257K35K431L738L257K341L235O409J0022J2138J2847J3731
62183A265678J5484J6865J6421J4681J3745J4706J6291J6557J5230J3826J3842
62172A433326J5415J7618J9463K0810K2528K5576K9734L3810L7272M0832M4853
62161A741237M8295N0224N1405N3013N4535N4619N3445N2197N0350M5757L7958
62150B293035K9265K1604J4107N264m130j1879j7341k1844k6658l1837l6771m0637
62138B172178m2446m1653l8777l4862l0546k5935k0763j4261n694M247J3422K0614
62126A955524K7082L4696M3204N0680N6079N9960O3043O5467O7420O9102O9878
$$ plain form
62208 1327076 1307786 1290317 1274595 1260876 1249217 1239172 1230025 1221268 1213036 1206144 1201351 1198462
62196 1198462 1196551 1195294 1195529 1197960 1201698 1204955 1207296 1210531 1216940 1226962 1239100 1251947 1265678
62183 1265678 1281162 1298027 1314448 1329129 1342874 1357580 1373871 1390428 1405658 1419484 1433326
62172 1433326 1448741 1466359 1485822 1506632 1529160 1554736 1584470 1618280 1655552 1696384 1741237
62161 1741237 1789532 1839756 1891161 1944174 1998709 2053328 2106773 2158970 2209320 2255077 2293035
62150 2293035 2322300 2343904 2358011 2363275 2359145 2347266 2329925 2308081 2281423 2249586 2212815 2172178
62138 2172178 2129732 2088079 2049302 2014440 1983894 1957959 1937196 1922935 1917241 1921488 1934910 1955524
62126 1955524 1982606 2017302 2060506 2111186 2167265 2227225 2290268 2355735 2423155 2492257 2562135
62115B562135O8687O5435O1047N6058N0162M3264L5987K8914K2155J5784R951
62104C019579M610j15l382m408l694k528j219J098M914R640J4551J9540K4732
62091C083318L0182L5838M0932M3796M3605M2104M2091M4112M6225M7059M7260
62080C546522M7545M7363M6420M5711M5821M5696M4401M2865M2529M3292M4067
62069D042232M4410M4270M3091M0542L7518L5172L3492L1955L0844L0696L1065
62058D445287L1128L0974L1106L1231L0874L0661L1369L2064L0710K6766K1721
62047D773891J6796J1222L206q157k2082l6790n0888o4442p8415r2913j06783
62036D344645j19313j31109j42270j50964j55375j56208j55643j54474j51938
$$ plain form
62115 2562135 2630822 2696257 2757304 2813362 2863524 2906788 2942775 2971689 2993844 3009628 3019579
62104 3019579 3024189 3024074 3020692 3016284 3012590 3010062 3008843 3009941 3014855 3024495 3039046 3058586 3083318
62091 3083318 3113500 3149338 3190270 3234066 3277671 3319775 3361866 3405978 3452203 3499262 3546522
62080 3546522 3594067 3641430 3687850 3733561 3779382 3825078 3869479 3912344 3954873 3998165 4042232
62069 4042232 4086642 4130912 4174003 4214545 4252063 4287235 4320727 4352682 4383526 4414222 4445287
62058 4445287 4476415 4507389 4538495 4569726 4600600 4631261 4662630 4694694 4725404 4752170 4773891
62047 4773891 4790687 4801909 4805115 4796958 4774876 4738086 4687198 4622756 4544341 4451428 4344645
62036 4344645 4225332 4094223 3951953 3800989 3645614 3489406 3333763 3179289 3027351
62027C027351j47790j42594j36312j28544j20070j12136j04324r5148q4961p6071
62017A879401o9530o3928n8049n2617m8404m4561m0098l5491l1529k7903k4106
62006A383185k0489j7282j3753r577n829l407j602M94K254K713K477K746L142
61993A325072K347M31j233k316m066p272j1059j4208j6566j8581k0221k0969k0665
61980A190694j9942j9702k0144k0496k0097j9459j9342j8946j6462j1931q056
61969I96117o960p503p185n621m319l781l012j788j218j601j427N58L499N519
61955I61278N893N449N392O382Q442J1232J4393J7538J9966K1016K1242K2547
61943A120770K6059L0431L3476L5200L7581M1319M4691M6219M6769M7811M8985
$$ plain form
62027 3027351 2879561 2736967 2600655 2472111 2352041 2239905 2135581 2040433 1955472 1879401
62017 1879401 1809871 1745943 1687894 1635277 1586873 1542312 1502214 1466723 1435194 1407291 1383185
62006 1383185 1362696 1345414 1331661 1322084 1316255 1312848 1311246 1311740 1313994 1316707 1319184 1321930 1325072
61993 1325072 1327419 1327850 1326617 1324301 1320235 1312963 1301904 1287696 1271130 1252549 1232328 1211359 1190694
61980 1190694 1170752 1151050 1130906 1110410 1090313 1070854 1051512 1032566 1016104 1004173 996117
61969 996117 989157 981654 974469 968848 964529 960748 957736 955948 954730 953129 951702 952260 955759 961278
61955 961278 967171 972620 978012 984394 992836 1004068 1018461 1035999 1055965 1076981 1098223 1120770
61943 1120770 1146829 1177260 1210736 1245936 1283517 1324836 1369527 1415746 1462515 1510326 1559311
61932A559311M8932M7693M6613M6078M4848M1922L7886L3961L0441K6712K2385
61921A986782J7905J4014J0911P984M444L28l115m397l370j607q92j286j095J097
61907B027703M871Q754J2050J5156J8207K0416K1058K0301J8632J6090J2591Q401
61895B204230L683j860q229j4591k0322k5972l2234l8266m2368m4178m5116m6442
61883A888335m8032m9289n0100n0278m8938m5392m0282l5178l1273k8815k7484
61872A433274k6679k5633k3715k0904j7726j4645j1485p640k899J997O079R349
61860A299373J2757J6826K1016K4869K8996L4142L9892M5221M9926N4515N9069
61849A686602O3324O7569P2164P6238P8248P7960P6639P5113P2949O9901O6597
$$ plain form
61932 1559311 1608243 1655936 1702549 1748627 1793475 1835397 1873283 1907244 1937685 1964397 1986782
61921 1986782 2004687 2018701 2029612 2037596 2042040 2042368 2039253 2034856 2031486 2029879 2028987 2027701 2026606 2027703
61907 2027703 2032574 2041328 2053378 2068534 2086741 2107157 2128215 2148516 2167148 2183238 2195829 2204230
61895 2204230 2207913 2206053 2197824 2183233 2162911 2136939 2104705 2066439 2024071 1979893 1934777 1888335
61883 1888335 1840303 1791014 1740914 1690636 1641698 1596306 1556024 1520846 1489573 1460758 1433274
61872 1433274 1406595 1380962 1357247 1336343 1318617 1303972 1292487 1284847 1281948 1283945 1290024 1299373
61860 1299373 1312130 1328956 1349972 1374841 1403837 1437979 1477871 1523092 1573018 1627533 1686602
61849 1686602 1749926 1817495 1889659 1965897 2044145 2122105 2198744 2273857 2346806 2416707 2483304
61838B483304O3049N7931N0473M2028L4607K8636K3188J7762J2664Q209M627K502
61826B828980K163K779L041K754K900M019N330N578M291J901j003m406q928j5177
61812B834222k3048l1872m1162n0671n9711o7192p2693p6903q0427q2888q3725
61801B163930q3173q1674p8952p4642o9403o4486o0332n6540n2947m9703m6358
61790A445720m2043l6826l1933k8168k4994k1813j9416j9063k0271k0522j7787
61779A162884j2903q767p242p537p903p940q367r148r276q491p861q098q419p834
61765A043098o559n306m011k323p06k3l85j311k385k866j447K137N745O740N263
61750A035661M056M831O438P138P156P860R478J0967J1704J2153J2904J3796J4353
$$ plain form
61838 2483304 2546353 2604284 2654757 2696785 2731392 2760028 2783216 2800978 2813642 2821851 2826478 2828980
61826 2828980 2831143 2833922 2836963 2839717 2842617 2846636 2851966 2857544 2861835 2863736 2862733 2858327 2849399 2834222
61812 2834222 2811174 2779302 2738140 2687469 2627758 2560566 2487873 2410970 2330543 2247655 2163930
61801 2163930 2080757 1999083 1920131 1845489 1776086 1711600 1651268 1594728 1541781 1492078 1445720
61790 1445720 1403677 1366851 1334918 1306750 1281756 1259943 1240527 1221464 1201193 1180671 1162884
61779 1162884 1149981 1141214 1133972 1126435 1118532 1110592 1102225 1093077 1083801 1075310 1067449 1059351 1050932 1043098
61765 1043098 1036539 1031233 1027222 1024899 1024193 1024170 1023785 1022474 1020089 1017223 1015776 1017913 1023658 1030398 1035661
61750 1035661 1039717 1044548 1050986 1058124 1065280 1073140 1082618 1093585 1105289 1117442 1130346 1144142 1158495
61737A158495J4630J5229J6367J7200J6622J4814J3275J2844J2516J1121R348
61726A312461Q746R164Q980P891P520Q670R806R430Q341Q055Q216P414N816M955
61712A425465N045M448K290n6j015j090j976m066o021o692o454o359o741p205
61698A389573p601q275r321j0186j0337r837q957p654n985m621m087l705k353
61685A296654l21O38m67k642m465n812p143q066p876p137p316q854j0646j1561
61671A214986j1551j1093j0489r924r486q872p806o810o652o888o072l938k208
61658A113197k293l207k944j351j47k64o73j72Q82J357J124J269K773N383P527
61643A122461P413M858K197K375N546Q433Q022N153L112L246L704K660Q01l84
$$ plain form
61737 1158495 1173125 1188354 1204721 1221921 1238543 1253357 1266632 1279476 1291992 1303113 1312461
61726 1312461 1321207 1330371 1339351 1347242 1354762 1363432 1373238 1382668 1391009 1399064 1407280 1414694 1420510 1425465
61712 1425465 1430510 1434958 1437248 1437192 1436177 1435087 1433111 1429045 1423024 1416332 1409878 1403519 1396778 1389573
61698 1389573 1381972 1373697 1364376 1354190 1343853 1334016 1325059 1317405 1311420 1306799 1302712 1299007 1296654
61685 1296654 1296333 1296971 1296504 1293862 1289397 1283585 1276442 1268376 1260500 1253363 1246047 1237193 1226547 1214986
61671 1214986 1203435 1192342 1181853 1171929 1162443 1153571 1145765 1138955 1132303 1125415 1119343 1115405 1113197
61658 1113197 1110904 1107697 1104753 1103402 1103255 1102991 1102318 1102146 1103028 1104385 1105509 1106778 1109551 1114934 1122461
61643 1122461 1129874 1134732 1136929 1139304 1144850 1153283 1161305 1166458 1169570 1172816 1176520 1179180 1179981 1179597
61629A179597j174k762m700n147l645j948j504j554o48R54J686R95K9L8J029K251
61613A163497L195L730L832L712L821M205M156K995J085m87j210j523j868k059
61599A187081j996k344l707n407n963m950l674l611m750n921o373o395o601p272
61585A118117q479j0244j2320j4097j5031j4956j3972j2443j1267j1516j3230
61574I80562j4945j5125j3997j3094j2949j2321j0255p956p496r097j0899j1310
61562H41118j0448r157p861o891o725p100o813n409m252m788o366o997n899l952
61548G48460k033l79M94pj106r62J006L279M342M244L450J733o14j803m07K614
61532G62311N157O589P593Q055O903M133J274n20j637k861m116m882n089n037
$$ plain form
61629 1179597 1178423 1175661 1170961 1165814 1162169 1160221 1158717 1157163 1156515 1157469 1159155 1160150 1160179 1160217 1161246 1163497
61613 1163497 1166692 1170422 1174254 1177966 1181787 1185992 1190148 1193143 1194228 1193741 1192531 1191008 1189140 1187081
61599 1187081 1185085 1182741 1179034 1173627 1167664 1162714 1159040 1155429 1150679 1144758 1138385 1131990 1125389 1118117
61585 1118117 1109638 1099394 1087074 1072977 1057946 1042990 1029018 1016575 1005308 993792 980562
61574 980562 965617 950492 936495 923401 910452 898131 887876 879920 872424 863327 852428 841118
61562 841118 830670 821513 813652 806761 800036 792936 786123 780714 776462 771674 765308 758311 752412 748460
61548 748460 746427 746048 746542 746535 745429 744467 745473 748752 753094 757338 760788 762521 761907 760104 759697 762311
61532 762311 767468 774057 781650 789705 796608 800741 802015 801495 799858 796997 792881 787999 782910 777873
61518G77873m950m909m931m939m917n007n139m851m033l435l772m593m845m280
61504G13272l404k433j376r25j897l654m385l359j810j169j528k185k709k826
61490F79612k168r14N0J90m1k0J70J61j48q16j949l086l280k277r48p4M70R33
61472F65865R41L18j84J43Q66J019L59o45j483j684q55O09J465J085M21O48J473
61455F70361J736J179O05N48Q08J146J555J990K576L745N401O384N777M441M068
61440G12320M911N679N626N462N929O776P628Q719R997J0483R426P650O720P001
61426H14327P286O373M402K505J598J836K859M069M672M072K586J421J415K011
61412H61432K059J413R28J001J150J160J441J759Q87j641m469o203p190q388r377
$$ plain form
61518 777873 772923 768014 763083 758144 753227 748220 743081 738230 734197 730762 726990 722397 717552 713272
61504 713272 709868 707435 706059 705134 703237 699583 695198 691839 690029 688860 687332 685147 682438 679612
61490 679612 677444 676530 676580 676770 676729 676709 676879 677040 676892 676076 674127 671041 667761 665484 664536 664462 664932 665865
61472 665865 666806 667124 666940 667083 667949 668968 669327 668682 667199 665515 664660 665269 666734 667819 668240 668888 670361
61455 670361 672097 673276 673881 674429 675237 676383 677938 679928 682504 686249 691650 698034 703811 708252 712320
61440 712320 717231 722910 728536 733998 739927 746703 754331 763050 773047 783530 792956 800606 807326 814327
61426 814327 821613 827986 832388 834893 836491 838327 841186 845255 849927 853999 856585 858006 859421 861432
61412 861432 863491 864904 865832 866833 867983 869143 870584 872343 873230 871589 867120 860917 853727 845339 835962
61397H35962r177q454q927j0642j1533j0216p680n675m672m095l585l153k749
61384G45404k379k250k364k304j789j105p80j100j938k681k492j202K07O90N31
61369G24448Q61J899K684K527J719P54JK78K429N774Q164Q323P283O798P318Q182
61353G89442Q991R828J0684J1498J2377J3230J3717J4031J5056J7122J9288K0636
61341I55900K1411K2135K2268K1013J8958J7640J7474J7209J5593J2753R681P105
61329A159140N107L402J608n12k873n127o819p551p329o812o768p132p177o785
61315A104372o769p490p921o977n115l712l130k477j129M06J345J604J729K244
61301A066980L237M406N443O370P184P321O206M509L790M335M407K607k5j585
$$ plain form
61397 835962 826785 818331 809404 798762 787229 777013 769333 763658 758986 754891 751306 748153 745404
61384 745404 743025 740775 738411 736107 734318 733213 732433 731333 729395 726714 724222 723020 723227 723917 724448
61369 724448 725309 727208 729892 732419 734138 734892 734893 735171 737600 743374 751538 759861 767144 773942 781260 789442
61353 789442 798433 808261 818945 830443 842820 856050 869767 883798 898854 915976 935264 955900
61341 955900 977311 999446 1021714 1042727 1061685 1079325 1096799 1114008 1129601 1142354 1152035 1159140
61329 1159140 1164247 1167649 1169257 1168745 1165872 1160745 1153926 1146375 1139046 1132234 1125466 1118334 1111157 1104372
61315 1104372 1097603 1090113 1082192 1075215 1070100 1066388 1063258 1060781 1059652 1060058 1061403 1063007 1064736 1066980
61301 1066980 1070217 1074623 1080066 1086436 1093620 1100941 1107147 1111656 1115446 1119781 1124188 1126795 1126770 1125185
61287A125185k041k745l944m697n062o179p861q278o843n448n554n769l938m84
61273A056342K219L146L528M635O310P854R046R892J0328J0615J1305J2517J3787
61260A161524J4786J5655J6528J7320J8131J9188K0215K0550K0165J9877K0161
61249A364100K0371J9651J8058J6074J3542R987N817K268p3j974m450p464j0133
61236A445774j1931j3293j5004j7228j9117j9489j8035j5757j3912j2618j1103
61225A278287r178p608o715n573l408j035K47Q11K352N264P742Q125P080O556
61211A282947P222Q023Q015P562P541Q059Q451Q262P876Q140R498J1679J4179
61198A397454J6765J9288K1444K3266K5622K9344L3943L8081M1479M5165M9395
$$ plain form
61287 1125185 1123144 1120399 1116455 1111758 1106696 1100517 1092656 1084378 1077535 1072087 1066533 1060764 1056826 1056342
61273 1056342 1058561 1061707 1065235 1069870 1076180 1084034 1093080 1102972 1113300 1123915 1135220 1147737 1161524
61260 1161524 1176310 1191965 1208493 1225813 1243944 1263132 1283347 1303897 1324062 1343939 1364100
61249 1364100 1384471 1404122 1422180 1438254 1451796 1461783 1467600 1469868 1469795 1467821 1463371 1455907 1445774
61236 1445774 1433843 1420550 1405546 1388318 1369201 1349712 1331677 1315920 1302008 1289390 1278287
61225 1278287 1269109 1261501 1254786 1249213 1245805 1244770 1245017 1245828 1248180 1253444 1261186 1269311 1276391 1282947
61211 1282947 1290169 1298192 1306207 1313769 1321310 1329369 1337820 1346082 1353958 1362098 1371596 1383275 1397454
61198 1397454 1414219 1433507 1454951 1478217 1503839 1533183 1567126 1605207 1646686 1691851 1741246
61187A741246N2619N3578N3428N4392N6779N8795N9028N7697N5432N2271M8219
61176B343484M3620L8544L2769K6736K1415J6857J1983O394J091l377q188j4386
61164B516942k0810k5613k9297l4277m1309m8086n2084n3452n4139n5135n5805
61153B046935n5474n4467n3351n1942m9529m5875m1735l8324l6078l3930l0179
61142A556051k4396j8323j4348j3057j2635j0849p369l860j966j513q43J254M258
61129A452404O817Q712J1378J6064K1923K6816L0110L3789M0097M8597N6560O2050
61117A815317O5735O9382P3648P7999Q2010Q5773Q9188R1827R3508R4391R4320
61106B733098R2829R0050Q6894Q3824P9807P3203O3731N3155M3871L6826L0783
$$ plain form
61187 1741246 1793865 1847443 1900871 1955263 2012042 2070837 2129865 2187562 2242994 2295265 2343484
61176 2343484 2387104 2425648 2458417 2485153 2506568 2523425 2535408 2541802 2542893 2539516 2531328 2516942
61164 2516942 2496132 2470519 2441222 2406945 2365636 2317550 2265466 2212014 2157875 2102740 2046935
61153 2046935 1991461 1936994 1883643 1831701 1782172 1736297 1694562 1656238 1620160 1586230 1556051
61142 1556051 1531655 1513332 1498984 1485927 1473292 1462443 1455074 1451214 1449248 1447735 1446892 1448146 1452404
61129 1452404 1459221 1467933 1479311 1495375 1517298 1544114 1574224 1608013 1648110 1696707 1753267 1815317
61117 1815317 1881052 1950434 2024082 2102081 2184091 2269864 2359052 2450879 2544387 2638778 2733098
61106 2733098 2825927 2915977 3002871 3086695 3166502 3239705 3303436 3356591 3400462 3437288 3468071
61095C468071K3582J4194L492p076j7268k7845l8809m8895n7310o4889p2523p9128
61083C095596q2705q3263q3146q4124q5594q6298q6219q5641q3592p9111p3377
61072B182526o8626o5075o0783n4864m8846m4058l9546l3946k7998k3422k0281
61061A695081j7249j3960j1163q715n296n11M397Q403J1865J5249J8136K0420
61049A716657K3146K7010L0946L3550L5241L7821M2136M7365N2386N6802O0714
61038B163774O4488O8884P4449Q0478Q5263Q7736Q8457Q8796Q9560R0646R1723
61027C074254R2921R4797R7683J01135J04284J06736J08825J11071J14027J18760
61017D124493J26763J38863J54869J74757J99482K30090K67010L11244L65378
$$ plain form
61095 3468071 3491653 3505847 3509339 3502263 3484995 3457150 3418341 3369446 3312136 3247247 3174724 3095596
61083 3095596 3012891 2929628 2846482 2762358 2676764 2590466 2504247 2418606 2335014 2255903 2182526
61072 2182526 2113900 2048825 1988042 1933178 1884332 1840274 1800728 1766782 1738784 1715362 1695081
61061 1695081 1677832 1663872 1652709 1643994 1638698 1638187 1642584 1650987 1662852 1678101 1696237 1716657
61049 1716657 1739803 1766813 1797759 1831309 1866550 1904371 1946507 1993872 2046258 2103060 2163774
61038 2163774 2228262 2297146 2371595 2452073 2537336 2625072 2713529 2802325 2891885 2982531 3074254
61027 3074254 3167175 3261972 3359655 3460790 3565074 3671810 3780635 3891706 4005733 4124493
61017 4124493 4251256 4390119 4544988 4719745 4919227 5149317 5416327 5727571 6092949
61008F092949M32011N11607O03133P06306Q21632R48526J085183J230230J382624
60999A3814201J539699J697220J851110J995825K120085K209323K257879K277175
60991B9762517K284651K280287K236271K113818J891969J582055J219451Q45536
60983D4216555M93976J83292q7035l34885n85873q60516j165628j490797j807342
60974C8561747k073588k252660k335511k348032k331141k310455k283318k231039
60966B0396003k138781k004371j835092j642472j440079j242032j060306r02041
60958H130829p68650o57189n63409m84476m18959l64919l19376k80154k46986
60949D026711k19947j97764j78612j61677j46860j33650j21488j10693j01860
$$ plain form
61008 6092949 6524960 7036567 7639700 8346006 9167638 10116164 11201347 12431577 13814201
60999 13814201 15353900 17051120 18902230 20898055 23018140 25227463 27485342 29762517
60991 29762517 32047168 34327455 36563726 38677544 40569513 42151568 43371019 44216555
60983 44216555 44710531 44893823 44806788 44471903 43886030 43025514 41859886 40369089 38561747
60974 38561747 36488159 34235499 31899988 29551956 27220815 24910360 22627042 20396003
60966 20396003 18257222 16252851 14417759 12775287 11335208 10093176 9032870 8130829
60958 8130829 7362179 6704990 6141581 5657105 5238146 4873227 4553851 4273697 4026711
60949 4026711 3806764 3609000 3430388 3268711 3121851 2988201 2866713 2756020 2654160
60940B654160r4513q7554q0833p5243p1129o7589o3619n9368n5949n4284n4098
60929A889981n3788n1538m6931m1314l6364l2677k9973k7979k6556k5508k4836
60918A492517k4664k4418k2955k0274j8232j8334j9465j9177j6874j4234j2653
60907A281237j1831j1076j0540j0447j0255r393q221p557p596p743p362o521o086
60894A166609o953q957j0963j2241j3106j3707j3201j1301r603r697j0573j0010
60882A036297q326q199j0343j1952j0686p995o638o687o244m904l976l812l368
60869I43167k553k653l842m234k524k1J283J555K419M094N049M669M594O414R210
60854I66627J0665J0188R416R560R728Q644O790N551M991M065K718K120K426J855
$$ plain form
60940 2654160 2559647 2472093 2391260 2316017 2244888 2177299 2113680 2054312 1998363 1944079 1889981
60929 1889981 1836193 1784655 1737724 1696410 1660046 1627369 1597396 1569417 1542861 1517353 1492517
60918 1492517 1467853 1443435 1420480 1400206 1381974 1363640 1344175 1324998 1308124 1293890 1281237
60907 1281237 1269406 1258330 1247790 1237343 1227088 1217695 1209474 1201917 1194321 1186578 1179216 1172695 1166609
60894 1166609 1159656 1150699 1139736 1127495 1114389 1100682 1087481 1076180 1066577 1056880 1046307 1036297
60882 1036297 1027971 1019772 1009429 997477 986791 978796 972158 965471 959227 954323 950347 946535 943167
60869 943167 940614 937961 934119 929885 927361 927340 928623 930178 932597 936691 941740 946409 951003 957417 966627
60854 966627 977292 987480 996896 1006456 1016184 1024828 1031618 1037169 1042160 1046225 1048943 1051063 1053489 1055344
60840A055344j101n476q829r885r444r000r258r910j0390j0749j1603j2929j3289
60827I33481j1241p590n048n154o659p573p578p416p032n829m169l081k644j836
60813H50631n1K259M331N618N764N033M546N156O281O859P079P773Q400P414M953
60798I32046L374M268O449P895Q383Q864R255Q465O307L902K170R19l94j881l335
60783I96687m409m540l407j758j218k785n650p822p887o189m414m171n793q322
60769I28322j0420j1193j0404q408o123m631m318m615m803m880n115n093l915
60756H44404j699r7o28k656l779k480J65J845J691Q97Q25J450K023K600L962O293
60740H54816Q609R695R074P095M662K988K987M465O112O656N925M687L712L217
$$ plain form
60840 1055344 1054243 1048767 1039938 1030053 1020609 1011609 1002351 992441 982051 971302 959699 946770 933481
60827 933481 922240 914650 909602 904448 897789 890216 882638 875222 868190 862361 858192 855111 852467 850631
60813 850631 850580 852839 857170 862788 868552 873585 878131 883287 889568 896427 903506 911279 919679 927093 932046
60798 932046 935420 939688 946137 954032 962415 971279 980534 988999 995306 999208 1001378 1002297 1001903 1000022 996687
60783 996687 992278 987738 984331 982573 981355 978570 972920 965098 957211 951022 946608 942437 936644 928322
60769 928322 917902 906709 896305 887897 881774 877143 872825 868210 863407 858527 853412 848319 844404
60756 844404 842705 842608 841980 839324 835545 833065 833230 835075 836766 837663 838488 839938 841961 844561 848523 854816
60740 854816 863425 873120 882194 889289 893951 896939 899926 904391 910503 917159 923084 927771 931483 934700
60726I34700L120L505M573N966O421M799J848J40J366M111N361M052J920Q08N50
60711I83240J01o71j321j975l012m153m902n431o052o364n937n352n392n667n316
60696I21796m749n151o379o972o446n926o038n933n177m908n806o393n003k390
60682H44525n76R6Q60J920K268K083L025N356O870O092M832N710Q200R259P566
60667I08086N115M278N044N867N952N525M735L548K447K200K804L332K917J450
60653I63300o31k673l902l809k711j590j141j277j562j716j538r76m37n32j172
60638I37633j551j460j792k971l622k209M72J967J532J135K443M386M963M205
60624I45131L743M122M368L977L542L254K595J989L017N884Q190P698N344L975
$$ plain form
60726 934700 937820 941325 945898 951864 958285 963084 964932 965072 966438 970549 975910 979962 981882 982690 983240
60711 983240 983341 982670 981349 979374 976362 972209 967307 961876 955824 949460 943523 938171 932779 927112 921796
60696 921796 917047 911896 905517 898545 892099 886173 880135 874202 869025 864117 858311 851918 846915 844525
60682 844525 843949 844045 844905 846825 849093 851176 854201 859557 866427 872519 877351 883061 891261 900520 908086
60667 908086 913201 917479 922523 928390 934342 939867 944602 948150 950597 952797 955601 958933 961850 963300
60653 963300 962669 959996 956094 952285 949574 947984 946843 945566 944004 942288 940750 939774 939337 938805 937633
60638 937633 936082 934622 932830 929859 926237 924028 924500 926467 927999 929134 931577 935963 940926 945131
60624 945131 948874 952996 957364 961341 964883 968137 970732 972721 975738 981622 989812 997510 1002854 1006829
60610A006829M761O349P137O727N245L075J537K120M238N262L784J574J158K531
60596A062327L734L928M077M849N566N571N176M769M147L352L081L498L553K437
60582A120065R83N13P75K00j741l552l461j526L30J56k226m958n693l803j005
60567A095057N98Q63J389L021M637M796L784L106L460M096M230M183M788O170
60553A144178P592Q319Q247P587O379M669L116K933M682P309Q954Q885Q126P925
60539A238901Q232Q226P764P468P599P829Q198R274J1007J2351J2661J2755J3686
60526A365951J5076J5645J5238J5118J6166J7841J9308K0661K2393K4397K6285
60515A574079K8110K9932L1042L0639K9225K8388K9110L1010L3325L5658L7432
$$ plain form
60610 1006829 1011590 1017939 1025076 1031803 1037048 1040123 1041660 1043780 1048018 1053280 1057064 1058638 1059796 1062327
60596 1062327 1066061 1069989 1074066 1078915 1084481 1090052 1095228 1099997 1104144 1107496 1110577 1114075 1117628 1120065
60582 1120065 1121048 1121561 1122336 1122536 1120795 1117243 1113782 1112256 1112586 1112742 1110516 1105558 1099865 1096062 1095057
60567 1095057 1095655 1096518 1097907 1100928 1105565 1110361 1114145 1117251 1120711 1124807 1129037 1133220 1138008 1144178
60553 1144178 1151770 1160089 1168336 1175923 1182302 1186971 1190087 1193020 1197702 1205011 1213965 1222850 1230976 1238901
60539 1238901 1247133 1255359 1263123 1270591 1278190 1286019 1294217 1303491 1314498 1326849 1339510 1352265 1365951
60526 1365951 1381027 1396672 1411910 1427028 1443194 1461035 1480343 1501004 1523397 1547794 1574079
60515 1574079 1602189 1632121 1663163 1693802 1723027 1751415 1780525 1811535 1844860 1880518 1917950
60504A917950L7647L6083L4113L3343L3697L3710L2526L0598K8427K5716K2274
60493B266084J8841J6149J3674J0186N407L12m218q309j2501j6947k1644k6824
60481B240210l2519l7995m2415m5929m9361n2712n4775n4744n3446n2281n1426
60470A712607m9984m7648m5135m2878m0391l7413l4719l3023l1769k9979k7719
60459A291949k5744k4064k2058j9902j8536j8063j7367j5913j4719j4788j5500
60448A085295j5547j4719j3656j2462j0860r382r095j0045j1142j1720j2011j1827
60436I42829j0156o908l883l005m201n940p177p680p102n206k946j948k575l557
60422H70545l857l800l937l938l436k964k949k574r38J051J493K08q25k32Q70
$$ plain form
60504 1917950 1955597 1991680 2025793 2059136 2092833 2126543 2159069 2189667 2218094 2243810 2266084
60493 2266084 2284925 2301074 2314748 2324934 2330341 2330653 2326435 2318126 2305625 2288678 2267034 2240210
60481 2240210 2207691 2169696 2127281 2081352 2031991 1979279 1924504 1869760 1816314 1764033 1712607
60470 1712607 1662623 1614975 1569840 1526962 1486571 1449158 1414439 1381416 1349647 1319668 1291949
60459 1291949 1266205 1242141 1220083 1200181 1181645 1163582 1146215 1130302 1115583 1100795 1085295
60448 1085295 1069748 1055029 1041373 1028911 1018051 1008669 999574 989529 978387 966667 954656 942829
60436 942829 932673 925765 921882 918877 914676 908736 901559 893879 886777 881571 878625 876677 874102 870545
60422 870545 866688 862888 858951 855013 851577 848613 845664 843090 842152 843203 844696 844904 844079 843847 844717
60407H44717O33q02j621q30O89J635J836K028K766L898M840N135M881M626M627
60392H79058M437L602K559K237K684K787J666j08j034k14J857L675L879K338L21
60377I09744p52p72p06r27o68M81J532J379M46p2j27o92j834k358j705r70j246
60360I00753j930j665l40R06J454J872K744L735M235M248M071L557K399J030N35
60345I27604J418K978M325N517P107Q735R200Q150O859O655P209P156O153N307
60331A014373N657P048Q613R664R860R194Q098P009N604L137j80k921m089m325
60317A076742m751n288n035m033l489m101n008m754k868j54K305M253O402R455
60303A059676J2950J5397J5877J5112J4374J3766J2487J0631R471R440Q875N847
$$ plain form
60407 844717 845350 844548 842927 842097 842786 844421 846257 848285 851051 854949 859789 864924 869805 874431 879058
60392 879058 883495 887097 889656 891893 894577 897364 899030 898922 897888 897674 899531 903206 907085 909423 909744
60377 909744 908992 908220 907514 906587 905919 906400 907932 909311 909757 909685 909558 908866 907032 904674 902969 901999 900753
60360 900753 898823 897158 896818 897724 899178 901050 903794 907529 911764 916012 920083 923640 926039 927069 927604
60345 927604 929022 932000 936325 941842 948949 957684 966884 975034 981893 988548 995757 1002913 1009066 1014373
60331 1014373 1020030 1027078 1035691 1045355 1055215 1064409 1072507 1079516 1085120 1088257 1088077 1085156 1081067 1076742
60317 1076742 1071991 1066703 1061668 1057635 1054146 1050045 1045037 1040283 1037415 1037261 1039566 1043819 1050221 1059676
60303 1059676 1072626 1088023 1103900 1119012 1133386 1147152 1159639 1170270 1179741 1189181 1198056 1203903
60291A203903P73l910o630q253j0368j2983j4746j4934j4272j3770j3737j4038
60279A077035j4465j4301j2586r637p523p687q667p744m778k539k706l556k752
60266I78094q03J67k4M85K455M415N034M846M868M958M421L382K611K561L160
60251A020630M096M863M980M452L508J859r09m059n961o190o183p104q128p922
60237I97932o789n869n058l458j621j339k855m000k961n71J247K268L755O032
60223I76713P848Q391Q583R579J0809J0576Q386N707M241M260N058O239P731Q957
60209A083078Q979P707O213N686O434P891R131R384Q699Q146Q621R471R181P506
60195A196127N797M953M337L344K650K807K898J916N80J50L21Q5l4J188K861K463
$$ plain form
60291 1203903 1204676 1200766 1194136 1185883 1175515 1162532 1147786 1132852 1118580 1104810 1091073 1077035
60279 1077035 1062570 1048269 1035683 1026046 1018523 1010836 1002169 994425 989647 987108 984402 980846 978094
60266 978094 977291 977458 977434 977919 980374 984789 989823 994669 999537 1004495 1008916 1012298 1014909 1017470 1020630
60251 1020630 1024726 1029589 1034569 1039021 1042529 1044388 1043479 1039420 1033459 1027269 1021086 1013982 1005854 997932
60237 997932 991143 985274 980216 976758 975137 973798 970943 966943 963982 963411 964658 966926 970681 976713
60223 976713 984561 992952 1001535 1011114 1021923 1032499 1040885 1046592 1050833 1055093 1060151 1066390 1074121 1083078
60209 1083078 1092057 1099764 1105977 1111663 1118097 1125988 1135119 1144503 1153202 1161348 1169969 1179440 1188621 1196127
60195 1196127 1201924 1206877 1211214 1214558 1217208 1220015 1222913 1224829 1225409 1225559 1225880 1225965 1225931 1227119 1229980 1232443
60179A232443m21l130l604k985l297m361m679l961k977j912o94k50j440l049k740
60164A192943j78K535L740L956M268M591M474M379M982N785N634M316K844K174
60150A246443K212K289K186K544M132O684Q719R031Q219Q102R428J1008J1519
60137A332516J1370J2052J3962J5779J6001J4544J2693J1743J1744J1519R928
60126A473851P087M052J359j345m053n775o018o065p487r731j0597r133o707m863
60112A414575l550k228j412j841k905l299k873k493k262j215R14K818L063J702
60098A398994l2r62o76L43R35L55l82Q34M403P822Q427O798N942P277R086R472
60082A458636R109R872J1737J2752J1814R931Q336O693L981L21l071n425p034
$$ plain form
60179 1232443 1232022 1228892 1225288 1222303 1219006 1214645 1209966 1206005 1203028 1201116 1200422 1200172 1198732 1195683 1192943
60164 1192943 1192765 1195300 1199040 1202996 1207264 1211855 1216329 1220708 1225690 1231475 1237109 1241425 1244269 1246443
60150 1246443 1248655 1250944 1253130 1255674 1259806 1266490 1275209 1284240 1292459 1300561 1309989 1320997 1332516
60137 1332516 1343886 1355938 1369900 1385679 1401680 1416224 1428917 1440660 1452404 1463923 1473851
60126 1473851 1480938 1484990 1486349 1485004 1480951 1475176 1469158 1463093 1455606 1445875 1435278 1426145 1419438 1414575
60112 1414575 1411025 1408797 1407385 1405544 1402639 1399340 1396467 1393974 1391712 1390497 1391411 1394229 1397292 1398994
60098 1398994 1398962 1398000 1397324 1397667 1398602 1398957 1398575 1399409 1403812 1411634 1420061 1426859 1432801 1440078 1449164 1458636
60082 1458636 1467745 1477617 1489354 1502106 1513920 1523851 1532187 1538880 1542861 1543182 1540111 1534686 1527652
60069A527652q414r734j1181j3087j5358j7264j8213j8336j8049j7528j6977j6753
60057A346758j6624j5440j2544r197p581q303r801j0369r805q684p172n261l419
60044A222558k007o21J104K463K517J813K015L657N291N403M403L940M638N273
60030A262447M219J240k321m859n789n659n394n707p035r388j2087j4169j5442
60017A180056j6599j7903j8442j7545j6263j6124j6658j5748j2841j0120r508
60006A012305r812q457n255k609j969j931n47J900L630M015M055M432M591M162
59992A008510M161N722Q172R573R118Q025P661P763P179N717M197L013J659n6
59978A090414j391j708j455j545k138k680k915l283m260n618o516o323n388m844
$$ plain form
60069 1527652 1519238 1509504 1498323 1485236 1469878 1452614 1434401 1416065 1398016 1380488 1363511 1346758
60057 1346758 1330134 1314694 1302150 1292953 1285372 1277069 1267268 1256899 1247094 1238410 1231238 1225977 1222558
60044 1222558 1220551 1219930 1221034 1223497 1226014 1227827 1229842 1233499 1238790 1244193 1248596 1252536 1257174 1262447
60030 1262447 1266666 1267906 1265585 1260726 1254937 1249278 1243884 1238177 1231142 1221754 1209667 1195498 1180056
60017 1180056 1163457 1145554 1127112 1109567 1093304 1077180 1060522 1044774 1031933 1021813 1012305
60006 1012305 1002493 994036 988781 986172 984203 982272 981725 983625 987255 991270 995325 999757 1004348 1008510
59992 1008510 1012671 1018393 1026565 1036138 1045256 1053281 1060942 1068705 1075884 1081601 1085798 1088811 1090470 1090414
59978 1090414 1089023 1087315 1085860 1084315 1082177 1079497 1076582 1073299 1069039 1063421 1056905 1050582 1045194 1040350
59964A040350n349o145n893m420k945k389k254j710r91q96j394j731j609j302
59950A001322p55K89J165N23j728l720l650j896l51q4o76j583k951m752o004n632
59934I69517l861k194k013l465n582p122p312o213m691l790l754l690k490j63
59920I13177K107L276L517L633L695K900R55r53j080J027L943N760N863N292N444
59905I58556O720Q365R377R313Q282O574M572K979K642L837N815P373P922P894
59891A050221Q026Q528R141R784J0647J1652J2272J2105J1378J0553R845R465
59879A173617R937J1425J2836J2579J0581Q671Q281Q355O580K501j756m103m753
59866A254751n252o228p235q231r729j1349j1733j0589r621j0290j1489j0924
$$ plain form
59964 1040350 1035001 1028856 1022963 1018543 1015598 1013209 1010955 1009245 1008254 1007358 1005964 1004233 1002624 1001322
59950 1001322 1000567 1000856 1002021 1002544 1000816 997096 993446 991550 991199 991115 990439 988856 985905 981153 975149 969517
59934 969517 965656 963462 961449 957984 952402 945280 937968 931755 927064 923274 919520 915830 913340 913177
59920 913177 915284 918560 922077 925710 929405 932305 933260 932307 931227 932254 936197 941957 947820 953112 958556
59905 958556 965276 973641 983018 992331 1000613 1007187 1011759 1014738 1017380 1021217 1027032 1034405 1042327 1050221
59891 1050221 1058247 1066775 1075916 1085700 1096347 1107999 1120271 1132376 1143754 1154307 1164152 1173617
59879 1173617 1183554 1194979 1207815 1220394 1230975 1239646 1247927 1256282 1262862 1265363 1263607 1259504 1254751
59866 1254751 1249499 1243271 1236036 1227805 1218076 1206727 1194994 1184405 1174784 1164494 1153005 1142081
59854A142081q255n253k928m55K538M586M639M194N487Q387J0984J2697J4704
59841A193406J7212J8401J6952J3955J1318R453P705O173N666O132O206M605J542
59828A318726j347k513k139k080l676n998p295p804r412j2399j4611j4745j4343
59815A220364j5008j5588j4398j2676j2947j4696j4803j2387j0117r952j0312
59804A077480r023o726n405n072m201k602j827k777m448n262m756l774l509m233
59790A013865m843m129k679k483m080n380m410k041n58l91j31O62P46m93j803
59775I81852j828p07O59J825K547K370J329L67K95Q85J595K459L631M636M894
59760A006809M577M180L687K952K506L074M364N288N350N078M928M652M007L378
$$ plain form
59854 1142081 1133826 1128573 1125645 1125190 1127728 1132314 1136953 1141147 1146634 1155021 1166005 1178702 1193406
59841 1193406 1210618 1229019 1245971 1259926 1271244 1280697 1288402 1294575 1300241 1306373 1312579 1317184 1318726
59828 1318726 1317379 1314866 1312727 1310647 1306971 1300973 1293678 1285874 1276462 1264063 1249452 1234707 1220364
59815 1220364 1205356 1189768 1175370 1162694 1149747 1135051 1120248 1107861 1097744 1087792 1077480
59804 1077480 1068457 1061731 1056326 1051254 1047053 1044451 1042624 1039847 1035399 1030137 1025381 1021607 1018098 1013865
59790 1013865 1009022 1004893 1002214 999731 995651 990271 985861 983820 983262 982871 982740 983402 984148 983655 981852
59775 981852 980024 979317 979976 981801 984348 986718 988047 988414 988709 989594 991189 993648 997279 1001915 1006809
59760 1006809 1011386 1015566 1019253 1022205 1024711 1027785 1032149 1037437 1042787 1047865 1052793 1057445 1061452 1064830
59746A064830L262L594L969M129L884L088K156K067L206M439M259K747J583J865
59732A109078K700K524J144k40p29n52k08L80J436K583L043K482J313K42k81k52
59716A124663K8K75M94Q89J522K218K816L208L071J999K25j150j163j00Q43R20
59700A140758L91j98o71j027j223j459k152l168l545k536p21N57Q22Q29J229J569
59684A129455J113J85l1R57K157K177Q40n58p11K28Q51R5j611l044l760m401n429
59667A118513o210n821m376k812j609m10R85K030K210J873J758K029K285K273
59653A112718K079J823J663K035L228M640N019L785J809N66O37J286J344K48j653
59638A141227l513m542m368l142j474q3Q13J720L167M713N141L958K307J877L082
$$ plain form
59746 1064830 1068092 1071686 1075655 1079784 1083668 1086756 1088912 1090979 1094185 1098624 1102883 1105630 1107213 1109078
59732 1109078 1111778 1114302 1115446 1115206 1114477 1113925 1113717 1114097 1115533 1118116 1121159 1123641 1124954 1125196 1124915 1124663
59716 1124663 1124691 1124966 1125460 1126349 1127871 1130089 1132905 1136113 1139184 1141183 1141408 1140258 1139095 1138995 1139838 1140758
59700 1140758 1141149 1140951 1140280 1139253 1138030 1136571 1134419 1131251 1127706 1125170 1124449 1125006 1125828 1126657 1127886 1129455
59684 1129455 1130568 1130753 1130722 1131679 1133836 1136013 1136853 1136295 1135584 1135812 1136663 1136758 1135147 1132103 1128343 1123942 1118513
59667 1118513 1112303 1106482 1102106 1099294 1097685 1097275 1098260 1100290 1102500 1104373 1106131 1108160 1110445 1112718
59653 1112718 1114797 1116620 1118283 1120318 1123546 1128186 1133205 1136990 1138799 1139365 1140002 1141288 1142632 1142880 1141227
59638 1141227 1137714 1133172 1128804 1125662 1124188 1124105 1124918 1126638 1129805 1134518 1139659 1143617 1145924 1147801 1150883
59623A150883M809N768N611M891M434M729N420N439M179K436J530J629J796J619
59609A205173J687K095J796K27j389j460j16J243K003K639L144K627Q52j008j793
59594A217720j838k377l957o058p895r028r407r289r080q956q714q275q048q351
59580A116447q595p649n268k733j736k732m639o045o306n557m184k588j238m72
59566A056705j81M4N15J331K480L722M538M653M580N084O023O343N487M216L676
59551A109216M131N100O247P547Q788R564R695R366R101R828J2326J6041J9021
59538A235971J9969J9936K0907K3034K4595K4752K4731K5631K6533K5928K4131
59527A496118K2810K2510K2144K1025K0017K0086K0585J9985J7808J5030J2573
$$ plain form
59623 1150883 1155692 1161460 1167071 1171962 1176396 1181125 1186545 1191984 1196163 1198599 1200129 1201758 1203554 1205173
59609 1205173 1206860 1208955 1210751 1210978 1209589 1208129 1208013 1209256 1211259 1213898 1217042 1219669 1220521 1219513 1217720
59594 1217720 1215882 1213505 1209548 1203490 1195595 1186567 1177160 1167871 1158791 1149835 1141121 1132846 1124798 1116447
59580 1116447 1107852 1100203 1094935 1092202 1090466 1087734 1083095 1077050 1070744 1065187 1061003 1058415 1057177 1056705
59566 1056705 1056524 1056568 1057083 1058414 1060894 1064616 1069154 1073807 1078387 1083471 1089494 1095837 1101324 1105540 1109216
59551 1109216 1113347 1118447 1124694 1132241 1141029 1150593 1160288 1169654 1178755 1188583 1200909 1216950 1235971
59538 1235971 1255940 1275876 1296783 1319817 1344412 1369164 1393895 1419526 1446059 1471987 1496118
59527 1496118 1518928 1541438 1563582 1584607 1604624 1624710 1645295 1665280 1683088 1698118 1710691
59516A710691J0293P685M924K486P4l206p436j1413j4038j5591j7004j8340j8917
59503A630208j8703j8520j8709j8627j7834j6820j5910j4353j1404p728m540j781
59491A465279J583N524Q560R923J0933J3366J7288K1408K5023K8336L1139L2542
59479A670904L2393L2056L3034L5404L8132M0355M1773M2291M2088M1768M1606
59468B091804M0869L8733L5720L3312L2168L1861L2496L5130L9982M5630N1043
59457B508748N7367O6272P7317Q8449R8691J08595J18195J26195J31495J34000
59447C515324J33393J28617J19454J07441R4194P9468O1587L9193J2129j8323
59437D272477m9197p6895r9598j18144j33751j45867j53472j57365j59162j58379
$$ plain form
59516 1710691 1720984 1728669 1733593 1736079 1736153 1732947 1725511 1714098 1700060 1684469 1667465 1649125 1630208
59503 1630208 1611505 1592985 1574276 1555649 1537815 1520995 1505085 1490732 1479328 1471600 1467060 1465279
59491 1465279 1466862 1472386 1480946 1490869 1501802 1515168 1532456 1553864 1578887 1607223 1638362 1670904
59479 1670904 1703297 1735353 1768387 1803791 1841923 1882278 1924051 1966342 2008430 2050198 2091804
59468 2091804 2132673 2171406 2207126 2240438 2272606 2304467 2336963 2372093 2412075 2457705 2508748
59457 2508748 2566115 2632387 2709704 2798153 2896844 3005439 3123634 3249829 3381324 3515324
59447 3515324 3648717 3777334 3896788 4004229 4098423 4177891 4239478 4278671 4290800 4272477
59437 4272477 4223280 4146385 4046787 3928643 3794892 3649025 3495553 3338188 3179026 3020647
59427C020647j52678j41390j27011j12337r7638q1779o5023m9235l5723k4175
59417B133658j3826m705K712Q464J3054J6461J7712J6055J2470R319P934O939
59405B226247L744k525j0332j7695k3702k8076l0643l2053l3865l6675l8869l8488
59393A937068l6051l4186l4466l5903l6975l7691l8720l9437l8396l5631l3126
59382A536486l2413l2626l1756k9329k6773k5162k3641k0711j6404j2317r654
59371A275700q121o807n421m171k957j343P92L038M913O286P342Q416R871J1922
59357A299460J4550J7672K1353K5685L0446L5073L9009M1916M3692M4544M5123
59346A658523M6322M8580N1391N3649N4479N3666N1370M7681M2652L6562K9890
$$ plain form
59427 3020647 2867969 2726579 2599568 2487231 2389593 2307814 2242791 2193556 2157833 2133658
59417 2133658 2119832 2115127 2117839 2126303 2139357 2155818 2173530 2189585 2202055 2211374 2219308 2226247
59405 2226247 2229991 2227466 2217134 2199439 2175737 2147661 2117018 2084965 2051100 2014425 1975556 1937068
59393 1937068 1901017 1866831 1832365 1796462 1759487 1721796 1683076 1643639 1605243 1569612 1536486
59382 1536486 1504073 1471447 1439691 1410362 1383589 1358427 1334786 1314075 1297671 1285354 1275700
59371 1275700 1267579 1260772 1255351 1251180 1248223 1246880 1247672 1250710 1255623 1261909 1269251 1277667 1287538 1299460
59357 1299460 1314010 1331682 1353035 1378720 1409166 1444239 1483248 1525164 1568856 1613400 1658523
59346 1658523 1704845 1753425 1804816 1858465 1912944 1966610 2017980 2065661 2108313 2144875 2174765
59335B174765K2900J5443P243j715j1040k0018k7753l3626l7934m1920m6686n2021
59323A947638n6563n9150n9664n8585n6305n3216m9993m7082m3957l9507l3437
59312A390179k6985k1849j8521j5979j3025r581o430l913j538J074L494N316P154
59299A289396R864J2854J4287J3408J1672J0822J0651R844Q449P973Q824R076
59287A417120O713K246j827l741l761k974j877m30J211K676M060O170R812J4812
59273A450210J9912K3846K6493K8720L1161L3485L4879L4824L3221L0268K6472
59262A773491K2459J8365J3838Q870M036n54n815j2255j8560k2781k4687k5706
59250A730701k6620k6696k5493k3912k2680k1009j7928j3981j0275o571j703M280
$$ plain form
59335 2174765 2197665 2213108 2220351 2218636 2207596 2187578 2159825 2126199 2088265 2046345 1999659 1947638
59323 1947638 1891075 1831925 1772261 1713676 1657371 1604155 1554162 1507080 1463123 1423616 1390179
59312 1390179 1363194 1341345 1322824 1306845 1293820 1284239 1277809 1273896 1272358 1273432 1276926 1282242 1289396
59299 1289396 1299260 1312114 1326401 1339809 1351481 1362303 1372954 1382798 1391247 1399220 1408044 1417120
59287 1417120 1423833 1426079 1424252 1420511 1416750 1413776 1411899 1411469 1412680 1415356 1419416 1425586 1435398 1450210
59273 1450210 1470122 1493968 1520461 1549181 1580342 1613827 1648706 1683530 1716751 1747019 1773491
59262 1773491 1795950 1814315 1828153 1837023 1841059 1840505 1834690 1822435 1803875 1781094 1756407 1730701
59250 1730701 1704081 1677385 1651892 1627980 1605300 1584291 1566363 1552382 1542107 1535536 1533833 1538113
59238A538113R744J3341J5212J6277J7173J8025J8503J7944J6126J3845J1956
59227A706259R978O681J988k889p373j2157j7510k2290k5555k7920l0231l1881
59215A547100l1884l0875l0544l1205l1431l0146k7930k5842k4078k2258k0142
59204A240765j7510j4067j0191p350o918q613j0552j0992r751p921o455n375m222
59191A120848k913j821j128n51L05J559L127M747N870O039N581N430O115P394
59177A160602R101J1514J4435J6813J8100J9329K1793K5104K7579K8296K7733
59166A380399K6709K5854K5854K6988K8330K8609K7891K7168K6308K3960J9812
59155A667882J5324J1414P010J020n546j0832j4669j8441k2816k6957k9712l0592
$$ plain form
59238 1538113 1547857 1561198 1576410 1592687 1609860 1627885 1646388 1664332 1680458 1694303 1706259
59227 1706259 1716237 1722918 1724906 1722017 1714644 1702487 1684977 1662687 1637132 1609212 1578981 1547100
59215 1547100 1515216 1484341 1453797 1422592 1391161 1361015 1333085 1307243 1283165 1260907 1240765
59204 1240765 1223255 1209188 1198997 1191647 1184729 1176116 1165564 1154572 1144821 1136900 1130445 1125070 1120848
59191 1120848 1117935 1116114 1114986 1114435 1114740 1116299 1119426 1124173 1130043 1136082 1141663 1147093 1153208 1160602
59177 1160602 1169703 1181217 1195652 1212465 1230565 1249894 1271687 1296791 1324370 1352666 1380399
59166 1380399 1407108 1432962 1458816 1485804 1514134 1542743 1570634 1597802 1624110 1648070 1667882
59155 1667882 1683206 1694620 1701630 1702650 1697104 1686272 1671603 1653162 1630346 1603389 1573677 1543085
59143A543085k9781k8139k6953k6701k6324k4583k1906j9909j9290j9226j8766
59132A281507j7690j5906j3139r707o688m765l479k040m03R28J840K954N105Q553
59118A227070J2536J5617J6713J5971J4651J4251J5628J8399K0945K1585K0270
59107A413636J8710J8334J8780J8900J8477J7991J7372J6214J4839J3926J3304
59096A600483J2426J1667J1708J1758J0143O852L827K241J163m64k218l439m435
59083A661712n404n686n457o624j0314j4648j6989j7593j8941k1860k4484k5186
59071A488526k4535k3746k2882k1534k0115j9392j9221j8564j6656j3833j1329
59060A276719j0272j0634j1305j1375j1069j0958j0763r727p925o352n710n784
$$ plain form
59143 1543085 1513304 1485165 1458212 1431511 1405187 1380604 1358698 1338789 1319499 1300273 1281507
59132 1281507 1263817 1247911 1234772 1225065 1218377 1213612 1210133 1208093 1207690 1208618 1210458 1213412 1218517 1227070
59118 1227070 1239606 1255223 1271936 1287907 1302558 1316809 1332437 1350836 1371781 1393366 1413636
59107 1413636 1432346 1450680 1469460 1488360 1506837 1524828 1542200 1558414 1573253 1587179 1600483
59096 1600483 1612909 1624576 1636284 1648042 1658185 1665037 1668864 1671105 1672268 1671804 1669586 1666147 1661712
59083 1661712 1656308 1650622 1645165 1638541 1628227 1613579 1596590 1578997 1560056 1538196 1513712 1488526
59071 1488526 1463991 1440245 1417363 1395829 1375714 1356322 1337101 1318537 1301881 1288048 1276719
59060 1276719 1266447 1255813 1244508 1233133 1222064 1211106 1200343 1190616 1182691 1176339 1170629 1164845
59048A164845n978n990n956o274o995p196n756l224j849k753m130l685j809m43
59034A102807L72K397N855Q770J0091J0963J2268J3216J3482J4430J6827J9239
59022A230717K0389K1230K2912K4317K3827K2253K1658K2095K1835K0327J8709
59011A470269J7626J6629J5671J5135J4344J2120R205Q192J0273J3607J5581J5468
58999A634120J4328J3592J4380J7021K0429K2835K3555K3199K1946J8923J3971
58988A838299Q781N383M186M067L519J220l363r084j3510j5076j4404j3158j2383
58975A784477j2337j2845j3068j1900r354o790m889k473J612O399R855J1454J2371
58962A752512J3460J4350J4411J3477J1539Q735N706L257J609M35o74k367n578
$$ plain form
59048 1164845 1158867 1152877 1146921 1140647 1133652 1126456 1120700 1117476 1115627 1112874 1108744 1105059 1103250 1102807
59034 1102807 1103179 1105576 1111431 1120201 1130292 1141255 1153523 1166739 1180221 1194651 1211478 1230717
59022 1230717 1251106 1272336 1295248 1319565 1343392 1365645 1387303 1409398 1431233 1451560 1470269
59011 1470269 1487895 1504524 1520195 1535330 1549674 1561794 1570999 1579191 1589464 1603071 1618652 1634120
58999 1634120 1648448 1662040 1676420 1693441 1713870 1736705 1760260 1783459 1805405 1824328 1838299
58988 1838299 1847080 1852463 1856649 1860716 1864235 1865455 1862092 1853008 1839498 1824422 1810018 1796860 1784477
58975 1784477 1772140 1759295 1746227 1734327 1724973 1718183 1713294 1710821 1712433 1718832 1728687 1740141 1752512
58962 1752512 1765972 1780322 1794733 1808210 1819749 1828484 1834190 1837447 1839056 1839491 1838817 1836450 1830872
58949A830872j0409j5333j8458j9441j9277j8677j7775j7083j7146j7165j5497
58938A644611j2040q806p474p417o955n684m662m855o308q595j1374j4480j7777
58925A528184k0952k3422k4749k5142k5057k4371k2514j9535j6189j2917r509
58914A303827o111l435j435J199N232R330J1541J1913J2338J4126J6965K0369
58902A395859K4553K9290L3140L5003L5838L7645M0945M4187M5852M6247M6837
58891A815396M8388N0303N1445N1133M9523M7532M6286M6154M6285M5555M3902
58880B341902M2077L9917L5694K7962J7636P489m41o479j2450j9792k8548l7653
58868B407314m5846n2325n6760n9000n9257n8550n8083n7677n5636n1198m6429
$$ plain form
58949 1830872 1820463 1805130 1786672 1767231 1747954 1729277 1711502 1694419 1677273 1660108 1644611
58938 1644611 1632571 1623765 1616291 1608874 1601919 1596235 1591573 1586718 1580410 1571815 1560441 1545961 1528184
58925 1528184 1507232 1483810 1459061 1433919 1408862 1384491 1361977 1342442 1326253 1313336 1303827
58914 1303827 1297716 1294281 1292846 1294045 1299277 1308607 1320148 1332061 1344399 1358525 1375490 1395859
58902 1395859 1420412 1449702 1482842 1517845 1553683 1591328 1632273 1676460 1722312 1768559 1815396
58891 1815396 1863784 1914087 1965532 2016665 2066188 2113720 2160006 2206160 2252445 2298000 2341902
58880 2341902 2383979 2423896 2459590 2487552 2505188 2512677 2512236 2505757 2493307 2473515 2444967 2407314
58868 2407314 2361468 2309143 2252383 2193383 2134126 2075576 2017493 1959816 1904180 1852982 1806553
58857A806553m4082m3759m1988l6842l0831k7868k8328k8841k6726k3008k0522
58846A453758k0243k0508j9412j7004j4739j3483j2678j1527j0252r697j0011
58835A294204j0545j0903j1359j1958j1998j0932r359q450q493q456p147m641
58823A179963k429j916k707k786q22K143M112M684N072N761N867N125M713N190
58809A211970N277M065K958L590M953M782L062J797J502M78j927l772l334j522
58795A233879k16K27L93K18m08n32O78K371L267L819N296P263P981P441P695R584
58779A288956J1037R894P044N291N837P300P850P008N347L631K681L086M425N124
58765A374511L861J080j288j816r99m95j187k383k809j886J42K774N326O865O850
$$ plain form
58857 1806553 1762471 1718712 1676724 1639882 1609051 1581183 1552855 1524014 1497288 1474280 1453758
58846 1453758 1433515 1413007 1393595 1376591 1361852 1348369 1335691 1324164 1313912 1304215 1294204
58835 1294204 1283659 1272756 1261397 1249439 1237441 1226509 1217150 1208700 1200207 1191751 1184604 1179963
58823 1179963 1177534 1175618 1172911 1170125 1169303 1171446 1175558 1180242 1185314 1191075 1196942 1202067 1206780 1211970
58809 1211970 1217247 1221312 1224270 1227860 1232813 1237595 1240657 1242454 1243956 1244434 1242507 1238735 1235401 1233879
58795 1233879 1233663 1233890 1234283 1234501 1234093 1233561 1234239 1236610 1239877 1243696 1248992 1256255 1264236 1271677 1279372 1288956
58779 1288956 1299993 1309887 1316931 1322222 1328059 1335359 1343209 1350217 1355564 1359195 1361876 1364962 1369387 1374511
58765 1374511 1378372 1379452 1378164 1376348 1375349 1374854 1373667 1371284 1368475 1366589 1366731 1369505 1374831 1381696 1388546
58750A388546N922N459O174P628R119J0487J1834J3029J3750J3643J2393J0240
58738A508224Q558Q968J1335J3448J3465J2016J1068J1402J2277J3056J3741J4036
58726A651594J3425J2445J2536J4014J5389J5384J4642J4491J4911J4904J4314
58715A808049J3991J4267J4427J3853J2857J2097J1714J1263J0058P494L523j010
58703A932583m935p829j0205j2645j5147j7457j9580k1744k4090k6611k9173l1463
58691A711704l3011l3471l2882l1711l0550k9560k8170k5711k2529j9884j8469
58680A405756j7575j6346j5171j4803j4639j3134r988o541l771j261J253K753
58668A296533K606K297L984P597J0931J2577J3371J4605J6110J6978J7172J7084
$$ plain form
58750 1388546 1394468 1399927 1406101 1413729 1422848 1433335 1445169 1458198 1471948 1485591 1497984 1508224
58738 1508224 1516782 1525750 1537085 1550533 1563998 1576014 1587082 1598484 1610761 1623817 1637558 1651594
58726 1651594 1665019 1677464 1690000 1704014 1719403 1734787 1749429 1763920 1778831 1793735 1808049
58715 1808049 1822040 1836307 1850734 1864587 1877444 1889541 1901255 1912518 1922576 1930070 1933593 1932583
58703 1932583 1927648 1919819 1909614 1896969 1881822 1864365 1844785 1823041 1798951 1772340 1743167 1711704
58691 1711704 1678693 1645222 1612340 1580629 1550079 1520519 1492349 1466638 1444109 1424225 1405756
58680 1405756 1388181 1371835 1356664 1341861 1327222 1314088 1304100 1297559 1293788 1292527 1293780 1296533
58668 1296533 1299139 1301436 1305420 1313017 1323948 1336525 1349896 1364501 1380611 1397589 1414761 1431845
58656A431845J6051J2873Q142M585M003M774L840P81j846k380k277l411m942m901
58642A467137l736l841n747p204o493m473k500m20K105M075M678M943O112P468
58628A462104P604O963O969P252O108L696K438L760O386Q533J0084J1703J3379
58615A556979J4928J6720J8825K0416K0989K1306K2122K2851K2533K1322J9878
58604A778869J8001J5127J1664Q548N769K603p53l079l784l570l211k661j654
58591A821869k50J643M427P821J0550J1726J2130J3243J5298J7168J8180J9127
58579A952932K0907K2857K3332K2007K0716K1431K3790K5358K4272K0982J7323
58568B195907J4645J3246J2836J2882J2799J2583J3015J4622J6582J7387J6530
$$ plain form
58656 1431845 1447896 1460769 1468911 1473496 1477499 1482273 1486113 1486894 1485048 1482668 1480391 1476980 1472038 1467137
58642 1467137 1463401 1459560 1453813 1446609 1440116 1435643 1433143 1432723 1434828 1438903 1443581 1448524 1454636 1462104
58628 1462104 1469708 1476671 1483640 1490892 1497000 1500696 1503134 1506894 1513280 1521813 1531897 1543600 1556979
58615 1556979 1571907 1588627 1607452 1627868 1648857 1670163 1692285 1715136 1737669 1758991 1778869
58604 1778869 1796870 1811997 1823661 1832209 1837978 1840581 1839828 1836749 1832965 1829395 1826184 1823523 1821869
58591 1821869 1821619 1823262 1827689 1835510 1846060 1857786 1869916 1883159 1898457 1915625 1933805 1952932
58579 1952932 1973839 1996696 2020028 2042035 2062751 2084182 2107972 2133330 2157602 2178584 2195907
58568 2195907 2210552 2223798 2236634 2249516 2262315 2274898 2287913 2302535 2319117 2336504 2353034
58557B353034J4892J3410J2141J0701Q830O230K676j277m427o419q461j1792j5867
58544B373671j9010k0603k1550k2633k3569k4087k4810k6228k7470k7191k5527
58533B110993k4095k3914k4057k2812j9635j5554j1989r603q119o694m513j426
58521A938582J828M261N533O127O648P227P678P944Q262Q909R861J0578J0257
58508B033695Q574O239M552M204M787N609O593Q061R908J1557J2756J3854J5076
58495B145465J5894J5588J4281J3045J2806J3359J3615J2799J1202R638Q321O656
58483B292669M324K168J529K669M369N253N137M650L904K286l26k791l814l564
58469B318463l686n540q909j2630j5971j8792k0697k1057k0172j9509j9989k0685
$$ plain form
58557 2353034 2367926 2381336 2393477 2404178 2413008 2419238 2421914 2420637 2416210 2409791 2401330 2389538 2373671
58544 2373671 2354661 2334058 2312508 2289875 2266306 2242219 2217409 2191181 2163711 2136520 2110993
58533 2110993 2086898 2062984 2038927 2016115 1996480 1980926 1968937 1959334 1951215 1944521 1940008 1938582
58521 1938582 1940410 1944671 1950204 1956331 1962979 1970206 1977884 1985828 1994090 2002999 2012860 2023438 2033695
58508 2033695 2042269 2048508 2053060 2057264 2062051 2067660 2074253 2082314 2092222 2103779 2116535 2130389 2145465
58495 2145465 2161359 2176947 2191228 2204273 2217079 2230438 2244053 2256852 2268054 2277692 2286013 2292669
58483 2292669 2296993 2299161 2300690 2303359 2307728 2312981 2318118 2322768 2326672 2328958 2328632 2325841 2322027 2318463
58469 2318463 2314777 2309237 2300328 2287698 2271727 2252935 2232238 2211181 2191009 2171500 2151511 2130826
58457B130826k0138j8612j7752j7968j7678j5755j3233j1407r443n795j476K96
58445A981865j837n438p220o526m900l487k345j419p44M2J173K035K164K579M671
58430A960613P978J0606J2074J3970J7140J9854K0092J8519J7746J9028K1099
58419B138719K2140K1681K0325J8498J6074J2862R023N079J564j308l597n336
58407B255724o486p211p837q435q828r110r723j0722j1412j0980r107n794j327
58394B148752L136N756N758M643M625O033P181O907O071O011O363N508K928J74
58380B219846j057j208k309n142p876q295o638n025m395l615j996r41j787l179
58366B166383k468P08L946N257N204N434O449P655Q676R583J0343J0855J1433
$$ plain form
58457 2130826 2110688 2092076 2074324 2056356 2038678 2022923 2009690 1998283 1988840 1983045 1981569 1981865
58445 1981865 1980028 1974590 1967370 1960844 1955944 1952457 1950112 1948693 1947949 1947991 1949164 1951199 1953363 1955942 1960613
58430 1960613 1968591 1979197 1991271 2005241 2022381 2042235 2062327 2080846 2098592 2117620 2138719
58419 2138719 2160859 2182540 2202865 2221363 2237437 2250299 2259322 2264401 2265965 2264657 2261060 2255724
58407 2255724 2249238 2242027 2234190 2225755 2216927 2207817 2198094 2187372 2175960 2164980 2155873 2150079 2148752
58394 2148752 2151888 2157644 2163402 2168045 2172670 2178703 2185884 2192791 2198862 2204873 2211236 2216744 2219672 2219846
58380 2219846 2218789 2217581 2215272 2210130 2202254 2193959 2187321 2182296 2177901 2174286 2172290 2171349 2169562 2166383
58366 2166383 2163915 2164623 2168569 2173826 2179030 2184464 2190913 2198568 2207244 2216827 2227170 2238025 2249458
58353B249458J2499J3774J4273J3262J1023Q594O858N947N447N111N260O384Q481
58340B366371J0953J3142J4859J6419J8192K0114K1690K2570K2993K3382K3692
58329B574377K3651K3539K3978K4757K4660K2986K0616J9005J8585J8716J8744
58318B813614J8442J7850J7308J7347J7978J8515J8730J9509K1609K4252K6054
58307C031208K6989K8314L0642L3267L5377L6879L7766L7728L6887L6149L6302
58296C407508L7160L7896L7961L7480L7018L7042L7422L7559L7187L6810L7044
58285C818087L7852L8828L9883M1262M3167M5722M8769N1451N2812N3382N5160
58274D326375N9135O3776O7002O8808P0675P3222P5946P8788Q2266Q6236R0012
$$ plain form
58353 2249458 2261957 2275731 2290004 2303266 2314289 2322883 2329741 2335688 2341135 2346246 2351506 2357890 2366371
58340 2366371 2377324 2390466 2405325 2421744 2439936 2460050 2481740 2504310 2527303 2550685 2574377
58329 2574377 2598028 2621567 2645545 2670302 2694962 2717948 2738564 2757569 2776154 2794870 2813614
58318 2813614 2832056 2849906 2867214 2884561 2902539 2921054 2939784 2959293 2980902 3005154 3031208
58307 3031208 3058197 3086511 3117153 3150420 3185797 3222676 3260442 3298170 3335057 3371206 3407508
58296 3407508 3444668 3482564 3520525 3558005 3595023 3632065 3669487 3707046 3744233 3781043 3818087
58285 3818087 3855939 3894767 3934650 3975912 4019079 4064801 4113570 4165021 4217833 4271215 4326375
58274 4326375 4385510 4449286 4516288 4585096 4655771 4728993 4804939 4883727 4965993 5052229 5142241
58263E142241R3627R7803J02769J08174J13832J19381J23796J26458J28320J30685
58253F287086J33578J36608J40496J45983J52095J57553J63166J70584J79375
58244G666524J87826J96158K06286K18600K31703K45196K59974K75935K92420
58235I780622L10830L33520L59715L85917M11034M37875M68856N03587N41663
58226A3533619N84305O31835O82777P37094P97383Q65617R41853J027425J126067
58217B0927975J240349J370447J518247J689555J890731K126904K405503K738377
58209C5908088L138859L620179M197923M889362N708065O663126P765164R027397
58201H0918163J0456861J2047220J3781425J5638302J7597797J9644864K1762258
$$ plain form
58263 5142241 5235868 5333671 5436440 5544614 5658446 5777827 5901623 6028081 6156401 6287086
58253 6287086 6420664 6557272 6697768 6843751 6995846 7153399 7316565 7487149 7666524
58244 7666524 7854350 8050508 8256794 8475394 8707097 8952293 9212267 9488202 9780622
58235 9780622 10091452 10424972 10784687 11170604 11581638 12019513 12488369 12991956 13533619
58226 13533619 14117924 14749759 15432536 16169630 16967013 17832630 18774483 19801908 20927975
58217 20927975 22168324 23538771 25057018 26746573 28637304 30764208 33169711 35908088
58209 35908088 39046947 42667126 46865049 51754411 57462476 64125602 71890766 80918163
58201 80918163 91375024 103422244 117203669 132841971 150439768 170084632 191846890
58194A91846890K3902474K5959865K7777610K9181372K9999127L0076092K9341832
58187C88085262K7907532K6050419K4003451K1704424J8766270J4734648R427056
58180E30679062L107470l582022r870180j5175731j9340164k2609673k5358503
58173D37850259k7776181k9768202l1090256l1533875l1023237k9634159k7581912
58166B29442437k5166138k2668173k0265514j8026556j5963327j4075036j2358821
58159A00918872j0810733r429753q215999p163173o257273n482061m821298m257325
58151D4481257l773107l356061k996877k686027k414707k177615j970977j788986
58143B3316900j625486j477900j346113j228371j121388j023727r35820q56892
$$ plain form
58194 191846890 215749364 241709229 269486839 298668211 328667338 358743430 388085262
58187 388085262 415992794 442043213 466046664 487751088 506517358 521252006 530679062
58180 530679062 533786532 530204510 520334330 505158599 485818435 463208762 437850259
58173 437850259 410074078 380305876 349215620 317681745 286658508 257024349 229442437
58166 229442437 204276299 181608126 161342612 143316056 127352729 113277693 100918872
58159 100918872 90108139 80678386 72462387 65299214 59041941 53559880 48738582 44481257
58151 44481257 40708150 37352089 34355212 31669185 29254478 27076863 25105886 23316900
58143 23316900 21691414 20213514 18867401 17639030 16517642 15493915 14558095 13701203
58135A3701203p84613p17782o57069o03045n55206n12891m75584m42398m12393
58126H540222l85167l60277l36788l14328k93727k75645k59384k43999k29538
58117E841369k16213k03553j91503j81179j73093j65653j56918j47145j38237
58108D267875j31238j25576j20274j14807j09075j03461r8565r4378r0269q6058
58098C194174q2225p8787p5174p1629o9225o7844o5846o2606n9693n8255n6906
58087B445984n3918n0050m7280m5800m4148m1728l9294l7371l5831l4791l4562
58076A981211l4901l5348l5832l5968l4655l1766k9343k9311l0531l0036k7072
58065A626448k4012k3024k3488k3278k1376j8605j6540j6147j7012j7705j7305
$$ plain form
58135 13701203 12916590 12198808 11541739 10938694 10383488 9870597 9395013 8952615 8540222
58126 8540222 8155055 7794778 7457990 7143662 6849935 6574290 6314906 6070907 5841369
58117 5841369 5625156 5421603 5230100 5048921 4875828 4710175 4553257 4406112 4267875
58108 4267875 4136637 4011061 3890787 3775980 3666905 3563444 3464879 3370501 3280232 3194174
58098 3194174 3111949 3033162 2957988 2886359 2817134 2749290 2683444 2620838 2561145 2502890 2445984
58087 2445984 2392066 2342016 2294736 2248936 2204788 2163060 2123766 2086395 2050564 2015773 1981211
58076 1981211 1946310 1910962 1875130 1839162 1804507 1772741 1743398 1714087 1683556 1653520 1626448
58065 1626448 1602436 1579412 1555924 1532646 1511270 1492665 1476125 1459978 1442966 1425261 1407956
58054A407956j6288j5525j5014j4438j4313j5264j6436j6002j3493j0574r293
58043A251316j0180j2086j3131j2083r646q184r150j1132j1575j0200r178r802
58031A124969j0683r990q142p124p927r716j1094j1309j0407r016p980p735p912
58018A005934p811p229o651o653p304q079q326p758o599n330m430m245m769n351
58004I15399n024l425j358j03k42j209j820j200L65J357L67k090l637k544K33
57989H95069K128J787J25j169j330p23k07n34j755k943l030k104j448j956l007
57974H78903l325k575j662j480j984k578k883k753j934m18R22Q72n49j790j587
57959H55179n51j74p56j405j730k197k789k780k290k630m312n861n731m456l735
$$ plain form
58054 1407956 1391668 1376143 1361129 1346691 1332378 1317114 1300678 1284676 1271183 1260609 1251316
58043 1251316 1241136 1229050 1215919 1203836 1194190 1186006 1176856 1165724 1154149 1143949 1134771 1124969
58031 1124969 1114286 1104296 1096154 1089030 1081103 1071387 1060293 1048984 1038577 1029561 1021581 1013846 1005934
58018 1005934 998123 990894 984243 977590 970286 962207 953881 946123 939524 934194 929764 925519 920750 915399
58004 915399 910375 906950 905592 905489 905247 904038 902218 901018 901383 902740 903107 901017 897380 894836 895069
57989 895069 897197 898984 899109 897940 896610 895887 895680 895146 893391 890448 887418 885314 883866 881910 878903
57974 878903 875578 873003 871341 869861 867877 865299 862416 859663 857729 857311 858233 859105 858556 856766 855179
57959 855179 854628 854454 853698 852293 850563 848366 845577 842797 840507 837877 833565 827704 821973 817517 813782
57944H13782l977m095l471k868l197m148m450l203q83Q75R06o1j92J119K615L264
57928G92016L719M804N726N154L355J769Q89K2j149k216l188m566o139p005o905
57913G86286o429n850m986m328m898o646q235q822q829q511p211m822k650j907
57899G02162k264k797l449m480n426n660n392n045m245k570p68L3m0L0L98L21
57883F60808j84j23O91J031P3j257j676j346j363k039k796l454m475n861o794
57868F31235o787o419o466o789o652n845m857m118l559k959k281j505m56R00K074
57853E75516K350J629R65J835M446O954P121M978L118L836O574Q926R476Q603
57839F46327O929M480J595p27k033k967m042m772m663m161l861l587l050k673
$$ plain form
57944 813782 809805 805710 802239 799371 796174 792026 787576 784373 783490 784365 785271 785210 785018 786137 788752 792016
57928 792016 795735 800539 806265 811419 814774 816543 817432 817454 816305 814089 810901 806335 800196 793191 786286
57913 786286 779857 774007 769021 764693 759795 753149 744914 736092 727263 718752 711541 706719 704069 702162
57899 702162 699898 697101 693652 689172 683746 678086 672694 667649 663404 660834 660066 660099 660059 660089 660487 660808
57883 660808 660624 660501 661192 662223 662296 661039 659363 658017 656654 654615 651819 648365 643890 638029 631235
57868 631235 624448 618029 611563 604774 598122 592277 587420 583302 579743 576784 574503 572998 572542 573442 575516
57853 575516 577866 579495 580460 582295 586741 593695 600816 605794 608912 612748 619322 628248 637724 646327
57839 646327 653256 657736 659331 658604 656571 653604 649562 644790 640127 635966 632105 628518 625468 622795
57825F22795k903l376l703m320n474o065m985l139k532l346l619k162k67L02k90
57810E76916o00l00o72k816o059q562r109q198p304p269p793q447r345j0328j0303
57795D79811q588o519o339q338j0322j0251q302n961m108k833k228k285k314j433
57781C99990L08J790J970R61o1L9J240K479K967L135L742M513M521L867L815M951
57765D40227O122N908M317K380O69q90k155k636k251j494r21q42j472k838m474
57750D39650n691o254o563o965p160o483m798k858j619j126m35J062K455K069
57736C95284n49l868n768n409l568j583k75L02M51L06k52j166j994k347k317k113
57720C65134j551m93M76N46j03l62L21J125P56j227m143o680p516o083l156m01
$$ plain form
57825 622795 619892 616516 612813 608493 603019 596954 591969 588830 586298 582952 579333 577171 576904 577206 576916
57810 576916 576316 576016 575344 572528 566469 557907 548798 540600 533296 526027 518234 509787 500442 490114 479811
57795 479811 471223 464704 458365 450027 439705 429454 421152 415191 411083 408250 406022 403737 401423 399990
57781 399990 400298 402088 404058 405019 404958 404997 406237 408716 411683 414818 418560 423073 427594 431461 435276 440227
57765 440227 446349 452257 456574 458954 459623 458733 456578 453942 451691 450197 449276 448434 446962 444124 439650
57750 439650 433959 427705 421142 414177 407017 400534 395736 392878 391259 390133 389698 390760 393215 395284
57736 395284 394735 390867 385099 379690 376122 374539 374264 374566 375017 375323 375071 373905 371911 369564 367247 365134
57720 365134 363583 363090 363566 364112 364009 363647 363968 365093 365849 364622 360479 353799 346283 340200 337044 336643
57704C36643Q58K91j630l779m589l251r08K88l61j486j701j105k59R42K438L184
57688C25575K577J920K975N498P657Q682R613J1264J3012J4210J5529J8003K1486
57675D58001K5014K8289L1846L5896L9760M2744M4940M6678M7486M6303M2789
57664H89746L7843L2362K5916J7363O587n065j6096k5834l3943l9903m3625m5955
57652G99396m7895m9576n0401m9745m7106m2216l5742k9572k5381k2941k0455
57641C78366j6704j2288q658o514n312m067k412r56o67j775l413m366m086k930
57627C04218j700j073j093j160p59k45l57q97p83J90N69q75l195m250l331j717
57611B83542p69o07q69j679l096m236l879j976kN68o4l68L77R49j48k342l489
$$ plain form
57704 336643 337501 337792 336162 332383 327794 324543 323635 323923 323562 322076 320375 319270 319011 319953 322391 325575
57688 325575 328152 330072 333047 338545 346202 354884 364497 375761 388773 402983 418512 436515 458001
57675 458001 483015 511304 543150 579046 618806 661550 706490 753168 800654 846957 889746
57664 889746 927589 959951 985867 1003230 1009817 1004752 988656 962822 928879 888976 845351 799396
57652 799396 751501 701925 651524 601779 554673 512457 476715 447143 421762 398821 378366
57641 378366 361662 349374 340716 334202 328890 324823 322411 321455 320788 319013 315600 311234 307148 304218
57627 304218 302518 301445 300352 299192 298433 298188 297831 296934 296151 296341 296910 296035 292840 288590 285259 283542
57611 283542 282773 282166 281297 279618 276522 272286 268407 266431 266429 266997 266933 266565 266942 267891 267743 265401 261912
57594B61912k767j730j986l138l943m375n161n984n746m393l176k973l437l788
57580B09315l625k905j947j412j595j947k086k655m107n244m541k601j475j645
57566A71530j587o90l83j476k353j291Q65J923J308K03m46o68o31m00k82l56n4
57549A65212R21J700J334K68l13k67l51p12p43k48M94J521K773L145J597p39j326
57532A74266M34K221J972M51m04l89q41k275l743m176l279j279J149K825K876
57517A69808J650K19q48j549j609o94O29J158N72j93k91J71Q43J709K508K452
57501A76535J264j62r11j258j910k616k456j393m67m29j044j854k787l713m094
57486A52705l590k601j876j897k776m239n449n391l907j936l97P49J789K179J109
$$ plain form
57594 261912 259145 257415 255429 252291 248348 243973 238812 232828 227082 222689 219513 216540 213103 209315
57580 209315 205690 202785 200838 199426 197831 195884 193798 191143 187036 181792 177251 174650 173175 171530
57566 171530 169943 169253 168870 167394 165041 163750 164615 166538 167846 168049 167603 166935 166304 165904 165622 165266 165212
57549 165212 166133 167833 169167 169435 169122 168855 168504 167792 167049 166801 167295 168816 171589 174734 176331 175592 174266
57532 174266 174700 176921 178893 179344 178940 178551 177710 175435 171692 167516 164237 162958 164107 166932 169808
57517 169808 171458 171677 170829 169280 167671 166977 167606 168764 169336 169143 168852 169023 169866 171575 174083 176535
57501 176535 177799 177637 176726 175468 173558 170942 168486 167093 166626 166197 165153 163299 160512 156799 152705
57486 152705 149115 146514 144638 142741 139965 135726 130277 124886 120979 119043 118646 119395 121184 123363 124472
57471A24472j063k774k930j944q64r8N55J077J149P51K56k16r68j986k475j640
57455A11302J73J589J588M23r20j785k183k431k796l177k904j179J778M355M964
57440A08797L729K177J307P01l53j634k328j992q85L16P83K4j452k351j852m65
57424A04522O36Q46M42M4J49Q59J703J845Q87p66k374l440l808l628l350l193
57408I1374k539p03J466J953J84j782j769k91N57K48J35P87J028J25p80m62M68
57391H9999O25M1p0N34O18n71j902j733j63R67M32q64j289p85p58j715k310j379
57373G9677J09J96j416k993k960j505M5P60P75R53J877K894K566N95j228r56J050
57356H0439K635K628J744Q58j21j252j870j570q83l50J15M43J20n65k48J496K903
$$ plain form
57471 124472 123409 120635 117705 115761 114897 114799 115354 116431 117580 118331 118587 118371 117403 115417 112942 111302
57455 111302 111475 113064 114652 115075 114155 112370 110187 107756 104960 101783 98879 97700 99478 103833 108797
57440 108797 112526 114703 116010 116711 116358 114724 112396 110404 109519 109835 110618 110642 109190 106839 104987 104522
57424 104522 105158 106004 106446 106490 106639 107498 109201 111046 111933 111167 108793 105353 101545 97917 94567 91374
57408 91374 88835 88132 89598 91551 91735 89953 88184 87893 88450 88698 88833 89620 90648 90773 89993 89531 89999
57391 89999 90624 90665 90595 91129 91747 91176 89274 87541 87378 88345 88777 87913 86624 85839 85081 83366 81056 79677
57373 79677 79786 79982 78566 75573 72613 71108 71153 71913 72688 73641 75518 78412 80978 81573 80345 79389 80439
57356 80439 83074 85702 87446 88304 88183 86931 85061 83491 82608 82258 82373 82816 82936 82371 82123 83619 86522
57339H6522K089m49k675l730m284m576l867k091n48k92q19r44k72O95J293J079
57323F7131O5r87j024J2Q55M11q23j481j171p22p87j133j492k150l091l310k083
57306D8220m62k91j677k582j526L72R46j48j244j044QP64Q60P23Q65J460K170
57289D7414K105O03j730l283l168k227j881k405k759j915J15K452M043M242L096
57274D4702J361J95M36J841L054K761J107l71m45O17J821K687L066K546J069k46
57258F6201j80P49P77p01k418l136l039k835k681k513k428k147j020P12J707J226
57242D8274K33L4O40J252J478J297N57n42j158r02n06n71m48N43J588J393K58
57225E3420k94K91J094J359J366J501J526J114L37n38j218j354q58q4O88J574
$$ plain form
57339 86522 88611 88162 85487 81757 77473 72897 69030 66939 66391 66099 65280 64336 64064 64759 66052 67131
57323 67131 67196 66209 65185 65197 66052 66463 65640 64159 62988 62266 61479 60346 58854 56704 53613 50303 48220
57306 48220 47758 47467 45790 43208 41682 42054 43000 42852 41608 40564 40572 41336 42196 42919 43784 45244 47414
57289 47414 49519 50122 48392 45109 41941 39714 37833 35428 32669 30754 30869 33321 37364 41606 44702
57274 44702 46063 46258 46694 48535 51589 54350 55457 55086 54641 55258 57079 59766 62832 65378 66447 66201
57258 66201 66021 66770 67547 66846 64428 61292 58253 55418 52737 50224 47796 45649 44629 45341 47048 48274
57242 48274 48507 48541 49181 50433 51911 53208 53765 53223 52065 51163 50657 50086 49638 50181 51769 53162 53420
57225 53420 53126 53417 54511 55870 57236 58737 60263 61377 61714 61176 59958 58604 57746 57662 58350 59924
57209E9924K302J873O7j341m07K148L451K047n43k118k231j618n93P76J733J447
57193F6917L93J00J277K946L727L648M103N959Q269R388R079Q639Q849Q890P862
57178A50046O353N568N712O322P521R514J1409J2129J2391J4180J8054K2476K6051
57165C07726K8833L0890L1166K8854K4869K0945J7955J5969J5152J5635J7057
57154E55051J9143K2300K6863L2104L6885M1070M5471N0438N5199N8750O0812
57143A004086O1667O1238N8586N2452M2412K9554J6088M442l460o956p483q093
57131A304533j0910j4777j6121j2156k806R873K2691L1766L4075K9805K2357J4919
57119A413249P668r21j0726j9324k4604k6946k8433l0443l2560l3883l4844l7002
$$ plain form
57209 59924 62226 64099 64166 62825 62418 64566 68017 70064 69521 67403 65172 63554 62961 63737 65470 66917
57193 66917 67310 67410 68687 71633 75360 79008 83111 89070 97339 106727 115806 124445 133294 142184 150046
57178 150046 156399 161967 167679 174001 181522 191036 202445 214574 226965 241145 259199 281675 307726
57165 307726 336559 367449 398615 427469 452338 473283 491238 507207 522359 537994 555051
57154 555051 574194 596494 623357 655461 692346 733416 778887 829325 884524 943274 1004086
57143 1004086 1065753 1126991 1185577 1238029 1280441 1309995 1326083 1330525 1327065 1320109 1312626 1304533
57131 1304533 1293623 1278846 1262725 1250569 1247763 1257636 1280327 1312093 1346168 1375973 1398330 1413249
57119 1413249 1420917 1419996 1409270 1389946 1365342 1338396 1309963 1279520 1246960 1213077 1178233 1141231
57107A141231m1001m5705m9980n4574o1541p3432r5234j36479k09557D7045d53241
57095a195395j051120j393766j699126j880450j870170j644849j234302p22531
57087a2691709k38041P9015J29173j02854n40058j040213j438952j593332j418523
57078a8855494r09163j36334P79123J703975K525214L168114L596992L803783
57070d323790e27039C071789L251664K812027K336255J864103J415788J001190
57062A5752816O28730L06527L9593j71187l28500m38821n11873n57340n81453
57053A4138492n87729n80683n67094n53190n41991n34005n29099n26623n24715
57044I193363n21130n14713n05399m93210m78171m60892m42218m22270m00508
$$ plain form
57107 1141231 1100230 1054525 1004545 949971 888430 814998 719764 583285 373728 47045 -453241
57095 -1195395 -2246515 -3640281 -5339407 -7219857 -9090027 -10734876 -11969178 -12691709
57087 -12691709 -12929750 -12850735 -12721562 -12824416 -13364474 -14404687 -15843639 -17436971 -18855494
57078 -18855494 -19764657 -19900991 -19121868 -17417893 -14892679 -11724565 -8127573 -4323790
57070 -4323790 -527039 3071789 6323453 9135480 11471735 13335838 14751626 15752816
57062 15752816 16381546 16688073 16727666 16556479 16227979 15789158 15277285 14719945 14138492
57053 14138492 13550763 12970080 12402986 11849796 11307805 10773800 10244701 9718078 9193363
57044 9193363 8672233 8157520 7652121 7158911 6680740 6219848 5777630 5355360 4954852
57035D954852l76767l51630l25823k99849k74109k48770k23679j99121j76541
57026B478563j57655j42581j29432j15950j01205q5855p1389n9148m9430m1443
57016A524475l4459k8799k5121k3189k2394k3300k7293l4321m2129m8285n1965
57005A163220n3299n2309m9422m6060m3295m0433l6212l1032k6737k4173k2199
56994G38049j9395j5746j2215r469p632o718o608o817o692n894m478k774j364
56981F32247r25j680l024l965l990l474l254l883n209o531p175o886n849m365
56967E72037k605o33J411L159M112M091L606L590M486N765O530O529O189N761
56953F24028M887L192R14j379l432n266o729p608q210r173j0443j0930r697p208
$$ plain form
57035 4954852 4578085 4226455 3900632 3600783 3326674 3077904 2854225 2655104 2478563
57026 2478563 2320908 2178327 2048895 1932945 1831740 1745885 1674496 1615348 1565918 1524475
57016 1524475 1490016 1461217 1436096 1412907 1390513 1367213 1339920 1305599 1263470 1215185 1163220
57005 1163220 1109921 1057612 1008190 962130 918835 878402 842190 811158 784421 760248 738049
56994 738049 718654 702908 690693 681224 673592 666874 660266 653449 646757 640863 636385 633611 632247
56981 632247 631322 629642 626618 622653 618663 615189 611935 608052 602843 596312 589137 582251 576402 572037
56967 572037 569432 568799 570210 573369 577481 581572 585178 588768 593254 599019 605549 612078 618267 624028
56953 624028 628915 632107 633021 631642 628210 622944 616215 608607 600397 591224 580781 569851 560154 552946
56939E52946m822l165j611O44L684P153J0531J2716J2325R432O377N545O448O304
56925F24507L558n55m306p718j1420j4653j6148j6329j6901j8322j9340j9133
56913D83240j8406j7921j7366j6294j4889j3095j0270o732m332m173m781l989
56901C50992j836J17J541L367N402O265O007O515Q478J0020R675Q952J0204J3131
56887D38830J5335J5629J5000J4546J4268J3819J3040J1417Q339M380J402Q86
56875E66891K559M885O448O893P057Q153J0469J3086J5247J7373K0024K2593K4250
56862G25928K5501K7294K8948K8844K7148K5848K5581K4389K0577J5077R830N263
56850I90228R02k739m558m574l770k592p73J751M889Q921J3861J8719K2592K6191
$$ plain form
56939 552946 548124 544959 543348 543992 547676 554829 565360 578076 590401 599833 606210 611755 618203 624507
56925 624507 628065 627510 623204 615486 604066 589413 573265 556936 540035 521713 502373 483240
56913 483240 464834 446913 429547 413253 398364 385269 374999 368267 363935 359762 354981 350992
56901 350992 349156 349273 350814 354181 359583 365848 371855 378370 386848 396868 406543 415495 425699 438830
56887 438830 454165 469794 484794 499340 513608 527427 540467 551884 560223 564603 566005 566891
56875 566891 569450 574335 580783 587676 594733 602886 613355 626441 641688 659061 679085 701678 725928
56862 725928 751429 778723 807671 836515 863663 889511 915092 939481 960058 975135 984965 990228
56850 990228 991130 988391 983833 979259 975489 972897 972124 973875 978764 987685 1001546 1020265 1042857 1069048
56836A069048L0935L6587M1150M3224M3271M2242M0052L5886K9194J9956Q754
56825A440299l019j3510k1564k7268l1311l4160l5955l6639l5954l3607k9602
56814A137710k4197j7563r899j950N074J0321J4002J7125K0448K3350K3807K0161
56802A218389J3146N466j075p170j4114k1337k7123l1019l3989l6361l7243l6231
56790I91339l4190l1854k8783k4318j8689j2679p017k468L58J798K926M110M557
56777H45090L613J649q42m147q614j3781j8830k3289k6821k9072l0358l1636l3118
56764F29844l3718l2640l0636k8677k6324k2722j8527j5327j3402j1620r605q455
56752C78191q845r646r208p321n283m413m906n804n899m884l638l027k749k049
$$ plain form
56836 1069048 1099983 1136570 1177720 1220944 1264215 1306457 1346509 1382395 1411589 1431545 1440299
56825 1440299 1437280 1423770 1402206 1374938 1343627 1309467 1273512 1236873 1200919 1167312 1137710
56814 1137710 1113513 1095950 1086051 1084101 1089175 1099496 1113498 1130623 1151071 1174421 1198228 1218389
56802 1218389 1231535 1237001 1235926 1228756 1214642 1193305 1166182 1135163 1101174 1064813 1027570 991339
56790 991339 957149 925295 896512 872194 853505 840826 833809 831341 831699 833497 836423 840533 845090
56777 845090 848703 850352 849510 845363 836749 822968 804138 780849 754028 724956 694598 662962 629844
56764 629844 596126 563486 532850 504173 477849 455127 436600 421273 407871 396251 386646 378191
56752 378191 369346 359700 350492 343171 337888 333475 328569 322765 316866 311982 308344 305317 302568 300519
56738C00519j267j512k626k862j298N66P04p02j707j398p84q38j068o45O9J09
56722B85260m80o43K00J437K121J916J058ko98n66J70O26L11k02r7M94P60M97
56704B92162L84Q36J361J300O82Nl69k60M05J239J431P85L06J064K620L330K330
56687C09611M76q46j151q19k60K91N90N95O35Q30O67j92q47Q1K483M399M218K406
56669C23167M70j039k409l285k756j043K97L81P0M06R82Q38K08J41Q63J655K109
56652C21055K477K799K763K448K311K320J986J313R08R67J098J210J633K134J906
56637C49328R21K44M85R92J124J219J528J353K51q41r05m09k29J35J603L326L448
56620C63573J959P93P82M88j094k580k286r04l99j142j856j878j728j474m46J112
$$ plain form
56738 300519 299252 297740 295114 292252 290954 291520 292224 291522 289815 288417 287633 286795 285727 285082 285151 285260
56722 285260 284780 284137 284337 285774 287895 289811 290869 290867 290169 289603 289773 290399 290710 290508 290411 290905 291665 292162
56704 292162 292546 293382 294743 296043 296725 296730 296361 296101 296506 297745 299176 299961 300267 301331 303951 307281 309611
56687 309611 310087 309241 308090 307271 307011 307302 307892 308487 309122 309952 310619 310427 309580 309661 312144 316543 320761 323167
56669 323167 323637 322598 320189 316904 314148 313105 313402 313783 313853 314259 315241 316079 316287 316428 317291 318946 321055
56652 321055 323532 326331 329094 331542 333853 336173 338159 339472 340380 341347 342445 343655 345288 347422 349328
56637 349328 350249 350493 350978 351970 353094 354313 355841 357194 357445 356604 355699 355290 355061 355196 356799 360125 363573
56620 363573 365532 366325 367107 367595 366501 363921 361635 360731 360332 359190 357334 355456 353728 352254 351808 352920
56604C52920J642M72r22r55k27m52j632j957n18J350K039J759J741K214K294J604
56588C61372Q44N63L35m27j369j468l27J238K005J669J125J332K070K266J550
56573C72778Q72J208K318L327L951M370M377L758L233L814N131N718N165M839
56559D24859N898P698Q864Q948Q301P152N763M701M098L293K123J798L265N263
56545E02024N456L353P59o63j044j300j750k186k453k385j862j259j293k121l137
56530D90139l863m383m737m639m096l622l446l155k563k167k300k501k363k340
56516D43964k885l309k513o96O77O88j42r13j494k076k316j719o90m00j401k856
56500D21919l495l004k011j015K9R42J034J21q03o78J15L03l82q35k97O32J158
$$ plain form
56604 352920 354562 355034 354112 353157 352930 352478 350846 348889 348371 349721 351760 353519 355260 357474 359768 361372
56588 361372 362216 362779 363114 362687 361318 359850 359523 360761 362766 364435 365560 366892 368962 371228 372778
56573 372778 373650 374858 377176 380503 384454 388824 393201 396959 400192 404006 409137 414855 420020 424859
56559 424859 430757 438455 447319 456267 464568 471720 477483 482184 486282 489575 491698 493496 496761 502024
56545 502024 507480 510833 511592 510929 509885 508585 506835 504649 502196 499811 497949 496690 495397 493276 490139
56530 490139 486276 481893 477156 472517 468421 464799 461353 458198 455635 453468 451168 448667 446304 443964
56516 443964 441079 437770 435257 434561 435238 435926 435784 434871 433377 431301 428985 427266 426576 426176 424775 421919
56500 421919 418424 415420 413409 412394 412423 413365 414399 414520 413717 413039 413154 413457 413075 412240 411943 412575 413733
56483D13733J499K158K765K696K227J992J682N63q73j203k51M29n8n71O9R34L26
56466D28117j417k265j399m3P26J348K319K997K783K301K232J996Q55m78p74k85
56450D39013k20n62j09J275K178J826J122Q56L53j014k205j727J89J878K387K179
56434D47419J886J402M30p60j401q93O35K245K985K918L007L796M679M790L993
56419D77131K648J103j26l49L49Q23L01m27j66Q02J138L91m64n27m2J17n33j698
56401D80471k409j724J76J818J920P28n64j294j464j121n54n74j495k162j289
56386D70463N85J749J712J491J653J688J427J491J956K032J547J263J357J135
56372D91549P62J562L668N131M511K901J977J596Q42K55J014K679L622L260K243
$$ plain form
56483 413733 415232 417390 420155 422851 425078 427070 428752 429315 428442 427239 426988 427417 427359 426788 426857 427791 428117
56466 428117 426700 424435 423036 422993 423719 425067 427386 430383 433166 435467 437699 439695 440550 440072 439298 439013
56450 439013 438793 438231 438122 439397 441575 443401 444523 445379 445732 444718 442513 440786 440975 442853 445240 447419
56434 447419 449305 450707 451137 450377 448976 448083 448718 450963 453948 456866 459873 463669 468348 473138 477131
56419 477131 479779 480882 480756 480407 480756 481579 481880 481453 481287 482089 483227 483618 483154 482627 482585 482702 482169 480471
56401 480471 478062 476338 476514 478332 480252 480980 480416 479122 477658 476537 475983 475409 473914 471752 470463
56386 470463 471048 472797 474509 476000 477653 479341 480768 482259 484215 486247 487794 489057 490414 491549
56372 491549 492311 493873 497541 502672 507183 510084 512061 513657 514499 514754 515768 518447 522069 525329 527572
56357E27572R60l72o28J056L158K919J32k259j984j17J078J204J237J345R76N40
56341E36817J226L078M601M567L322K057J526J823K776M045N015N111M181K523
56327E82668N94j156k250k217r13J049K381K167J036Q03K451M776N693M748L545
56312F05375L550M415M898M573L802K769J625J203K162L529L500K027J210K505
56298F47143M857O427O920P032O720N571M154L442L301L151L653N744Q157Q112
56284G24384N087J928J282K596L809M385N127O188P053P927R478J1370J2438J2269
56270H15321J1564J0968J0563J0496J1223J2796J4622J6013J6638J6656J6790
56259I63650J8007K0497K3312K5578K7657L0309L3196L5295L6552L8027M0341
$$ plain form
56357 527572 528532 528160 527532 528588 531746 534665 534797 532538 530554 530437 531515 532719 533956 535301 536277 536817
56341 536817 538043 541121 545722 550289 553611 555668 557194 559017 561793 565838 570853 575964 580145 582668
56327 582668 583262 582106 579856 577639 576726 577775 580156 582323 583359 584162 586613 591389 597082 601830 605375
56312 605375 608925 613340 618238 622811 626613 629382 631007 632210 634372 637901 641401 643428 644638 647143
56298 647143 652000 658427 665347 672379 679099 684670 688824 692266 695567 698718 702371 708115 716272 724384
56284 724384 729471 731399 732681 735277 739086 743471 748598 754786 761839 769766 779244 790614 803052 815321
56270 815321 826885 837853 848416 858912 870135 882931 897553 913566 930204 946860 963650
56259 963650 981657 1002154 1025466 1051044 1078701 1109010 1142206 1177501 1214053 1252080 1292421
56248A292421M3139M6208M9884N4010N7502N9640O0980O2294O3281O3059O1460
56237A913878N9073N6253N2763M8236M2502L5511K7441J8798J0053J237p763j6603
56225B241379k4678l1824l8290m3986m8430n1645n4443n7250n9274n9555n8492
56214A713512n7314n6200n4079n0510m6582m3344m0453l7209l4013l1570k9372
56203A232866k6407k2985k0364j8745j7105j5110j3604j2802j1571r196o568m796
56191A053613l771k975k553k613k385j239K62J291J991K837L561L826M120M710
56177A060675M440K183q94k251j140O76J627K231L708N839P206P072O255O192
56163A103819P438R221J0434J0941J1499J2525J3618J4523J5634J7123J8521J9817
$$ plain form
56248 1292421 1335560 1381768 1431652 1485662 1543164 1602804 1663784 1726078 1789359 1852418 1913878
56237 1913878 1972951 2029204 2081967 2130203 2172705 2208216 2235657 2254455 2264508 2265745 2257982 2241379
56225 2241379 2216701 2184877 2146587 2102601 2054171 2002526 1948083 1890833 1831559 1772004 1713512
56214 1713512 1656198 1599998 1545919 1495409 1448827 1405483 1365030 1327821 1293808 1262238 1232866
56203 1232866 1206459 1183474 1163110 1144365 1127260 1112150 1098546 1085744 1074173 1064977 1058409 1053613
56191 1053613 1049842 1046867 1044314 1041701 1039316 1038077 1038339 1039630 1041621 1044458 1048019 1051845 1055965 1060675
56177 1060675 1065115 1067298 1066404 1064153 1063013 1063689 1065316 1067547 1071255 1077094 1084300 1091372 1097627 1103819
56163 1103819 1111257 1120478 1130912 1141853 1153352 1165877 1179495 1194018 1209652 1226775 1245296 1265113
56151A265113K1859K4726K6920K7456K7722K9647L2923L6053L9404M4803N2141
56140A628767N8857O3374O6942P1232P6125Q0992Q6461R3369J01066J08074J13630
56129B548889J17485J19025J17896J14880J11039J06324J00042R2238Q3660P4552
56119C586030O4471N3229M1277K9239J7503O189n073j6951k9414m1020n0025n6377
56107C599078o2140o9594p8989q8283r5016r8340r9265r9035r7786r4932r0445
56096B625253q5024p9160p2679o5292n7060m8359l9860l2447k6448k1031j5123
56085B082770r059m428k010o63J275M162P114R272J0417J0717J0589J0854J2464
56072B143474J5693J9623K2638K3835K3913K4301K5458K6742K7932K9684L1879
$$ plain form
56151 1265113 1286972 1311698 1338618 1366074 1393796 1423443 1456366 1492419 1531823 1576626 1628767
56140 1628767 1687624 1750998 1817940 1889172 1965297 2046289 2132750 2226119 2327185 2435259 2548889
56129 2548889 2666374 2785399 2903295 3018175 3129214 3235538 3335580 3427818 3511478 3586030
56119 3586030 3650501 3703730 3745007 3774246 3791749 3797938 3792865 3775914 3746500 3705480 3655455 3599078
56107 3599078 3536938 3467344 3388355 3300072 3205056 3106716 3007451 2908416 2810630 2715698 2625253
56096 2625253 2540229 2461069 2388390 2323098 2266038 2217679 2177819 2145372 2118924 2097893 2082770
56085 2082770 2073711 2069283 2067273 2066610 2067885 2072047 2079161 2088433 2098850 2109567 2120156 2131010 2143474
56072 2143474 2159167 2178790 2201428 2225263 2249176 2273477 2298935 2325677 2353609 2383293 2415172
56061B415172L2900L1856L0354L0536L2109L3241L3671L4677L6205L6543L5350
56050B782614L4557L5471L7029L8025L9052M0830M2403M2595M2037M2192M3441
56039C220246M5458M8381N2010N4994N6514N7988O1284O5798O9120P0415P1363
56028C873571P3621P6931Q0207Q3190Q6427R0239R4330R8138J01463J04814J08901
56017D871832J13647J18251J22463J27023J32258J37191J41064J45001J50877
56008F059607J58819J67086J74470J81696J90202K00423K11778K23735K36331
55999G804147K49794K64145K79312K95469L13016L32126L52626L74567L98539
55990A0663741M25077M54144M85698N20377N59002O01787O48790P00717P58628
$$ plain form
56061 2415172 2448072 2479928 2510282 2540818 2572927 2606168 2639839 2674516 2710721 2747264 2782614
56050 2782614 2817171 2852642 2889671 2927696 2966748 3007578 3049981 3092576 3134613 3176805 3220246
56039 3220246 3265704 3314085 3366095 3421089 3477603 3535591 3596875 3662673 3731793 3802208 3873571
56028 3873571 3947192 4024123 4104330 4187520 4273947 4364186 4458516 4556654 4658117 4762931 4871832
56017 4871832 4985479 5103730 5226193 5353216 5485474 5622665 5763729 5908730 6059607
56008 6059607 6218426 6385512 6559982 6741678 6931880 7132303 7344081 7567816 7804147
55999 7804147 8053941 8318086 8597398 8892867 9205883 9538009 9890635 10265202 10663741
55990 10663741 11088818 11542962 12028660 12549037 13108039 13709826 14358616 15059333 15817961
55981A5817961Q23455Q96499R79667J074336J181128J302101J441875J605199
55973B5122221J795159K016178K277300K589947K964556L412972L952363M601826
55965D8732522N375883O286229P349084Q584184J0004109J1606979J3376488J5280758
55957A26596236J7270886J9289263K1281763K3194872K4961148K6496428K7706724
55950B86797320K8479123K8671931K8163653K6956234K5209915K3108003K0640871
55943D68027050J7530261J3401280Q076160J769529m935465j1306078j6759312
55936D75803425k1080010k4416129k7052337k9145815l0633134l1339954l1147062
55929B80988984l0071712k8252566k5900802k3254011k0533777j7912828j5504169
$$ plain form
55981 15817961 16641416 17537915 18517582 19591918 20773046 22075147 23517022 25122221
55973 25122221 26917380 28933558 31210858 33800805 36765361 40178333 44130696 48732522
55965 48732522 54108405 60394634 67743718 76327902 86332011 97938990 111315478 126596236
55957 126596236 143867122 163156385 184438148 207633020 232594168 259090596 286797320
55950 286797320 315276443 343948374 372112027 399068261 424278176 447386179 468027050
55943 468027050 485557311 498958591 507034751 508804280 503868815 492562737 475803425
55936 475803425 454723415 430307286 403254949 374109134 343476000 312136046 280988984
55929 280988984 250917272 222664706 196763904 173509893 152976116 135063288 119559119
55922A19559119j3367998j1521949r951475q624517p506046o564101n769205n094494
55914E1159334m517443m019765l586533l206930k874250k583063k326998k100178
55906B5944174j898814j719770j559087j413808j283691j169179j068587r78803
55898A4852435q97638q23879p56117o93345o36009n84806n38865m96433m56994
55889H968349m21328l89745l61326l34990l10471k88284k69071k52676k37726
55880F102732k22726k07780j94429j83489j74075j65200j57250j51032j46311
55871D500440j42153j38096j34061j29756j24998j20201j15817j11632j07202
55862C376524j02469r7502r2288q7340q3771q1883q0217p6934p1833o6330o1764
$$ plain form
55922 119559119 106191121 94669172 84717697 76093180 68587134 62023033 56253828 51159334
55914 51159334 46641891 42622126 39035593 35828663 32954413 30371350 28044352 25944174
55906 25944174 24045360 22325590 20766503 19352695 18069004 16899825 15831238 14852435
55898 14852435 13954797 13130918 12374801 11681456 11045447 10460641 9921776 9425343 8968349
55889 8968349 8547021 8157276 7795950 7460960 7150489 6862205 6593134 6340458 6102732
55880 6102732 5880006 5672226 5477797 5294308 5120233 4955033 4797783 4646751 4500440
55871 4500440 4358287 4220191 4086130 3956374 3831376 3711175 3595358 3483726 3376524
55862 3376524 3274055 3176553 3084265 2996925 2913154 2831271 2751054 2674120 2602287 2535957 2474193
55851B474193n8485n6257n4627n2957n0942m9122m8208m7824m6621m3939m0732
55840A924479l8396l7096l5846l4071l2280l0969k9738k8139k6777k6423k6287
55829A578457k4664k1554j9190j9142k0190k0277j9379j8920j9105j8704j7251
55818A360081j5737j4972j4766j4972j5967j7639j8963j9100j8060j6165j3757
55807A179983j1471r849q523o731m686l354k874k384j430l36Q46K267L121K194
55793A136773j1j439j328j262k591m460n446n722o309p406q599r855j1169j2120
55779A059056j2692j3651j5222j6422j6608j6514j6828j6931j6197j5276j4767
55768H87948j3847j1753r506q494q210p317o116n948o662o726n782n092n392o063
$$ plain form
55851 2474193 2415708 2359451 2304824 2251867 2200925 2151803 2103595 2055771 2009150 1965211 1924479
55840 1924479 1886083 1848987 1813141 1779070 1746790 1715821 1686083 1657944 1631167 1604744 1578457
55829 1578457 1553793 1532239 1513049 1493907 1473717 1453440 1434061 1415141 1396036 1377332 1360081
55818 1360081 1344344 1329372 1314606 1299634 1283667 1266028 1247065 1227965 1209905 1193740 1179983
55807 1179983 1168512 1158663 1150140 1143409 1138723 1135369 1132495 1130111 1128681 1128345 1129191 1131458 1134579 1136773
55793 1136773 1136762 1135323 1133995 1132733 1130142 1125682 1120236 1114514 1108205 1100799 1092200 1082345 1071176 1059056
55779 1059056 1046364 1032713 1017491 1001069 984461 967947 951119 934188 917991 902715 887948
55768 887948 874101 862348 852842 844348 836138 828821 822705 816757 810095 803369 797587 792495 787103 781040
55754G81040o612p350q251q616q295q013q131q278q304q429q254o997n064l975
55740F76471m318m991n054m960n235n163l913k146j424k339m064n453n974n819
55726F15618n648o096p158q136q328p613o328m989m098l790l575k865j858j381
55712E43755j728k218k149j756j893k984m453n098m126k089n40m40j224j874k467
55697E08716l808n687o613n558l367j983k594m569o074n780m189k930k591k065
55683D50908m98J229K077K748M324N665M474R72j727j575O5R79J119J709K814
55668D75283L490L464L121K354R39k43K90K694N261O067M710K497J225J652K879
55653E15683L466L207L146L711L791K299q6j590j383k31N05O4j260k433k799l074
$$ plain form
55754 781040 774428 767078 758827 750211 741916 733903 725772 717494 709190 700761 692507 685510 680446 676471
55740 676471 672153 667162 662108 657148 651913 646750 642837 640691 639267 636928 632864 627411 621437 615618
55726 615618 609970 603874 596716 588580 580252 572639 566311 561322 557224 553434 549859 546994 545136 543755
55712 543755 542027 539809 537660 535904 534011 531027 526574 521476 517350 515261 514721 514281 513057 511183 508716
55697 508716 504908 499221 492608 487050 483683 481700 479106 474537 468463 462683 458494 455564 452973 450908
55683 450908 450410 451639 453716 456464 460788 466453 470927 471899 470172 468597 468662 469641 470760 472469 475283
55668 475283 478773 482237 485358 487712 488651 488408 488698 491392 496653 502720 507430 509927 511152 512804 515683
55653 515683 519149 522356 525502 529213 533004 535303 535217 533627 532244 532013 532518 532582 531322 528889 526090 523016
55637E23016m582p344r808j0831j0823j0424r356p583o292o437p163p115o471
55624D18787o188o056n260m369m685n736n446l178p44K46M12R91J554O42j974
55609C78996m740n837m753k528p52j38j22j06n96k255m184m510k913j215r85j658
55593C41704j768j018k97l27j135k337l240l120k012q90n40o87p04n87o65q19
55577C21558o81l05JK16M92P82J041J414J862J936J373N84R3r4j45N1N53J060
55559C31791J485K197L096L160J765k01j513k298l331m141l460j516k62q31k106
55544C23835k514k073j782j897j888j584j389j478j621j664j656j625j660j972
55530B99032k351j865J28K747M131L462J843Q50P22M73n17j661j995j401o70n14
$$ plain form
55637 523016 518434 511090 501282 490451 479628 469204 459848 452265 445973 439536 432373 425258 418787
55624 418787 412599 406543 401283 396914 392229 386493 381047 377869 377125 377371 377783 378774 380328 380970 378996
55609 378996 374256 368419 363666 361138 360386 360248 360126 360020 359424 357169 352985 348475 345562 344347 343362 341704
55593 341704 339936 338918 338621 338294 337159 334822 331582 328462 326450 325560 325020 324333 323629 323042 322377 321558
55577 321558 320877 320572 320573 320789 321281 322063 323104 324518 326380 328316 329689 330273 330366 330272 330127 330178 330731 331791
55559 331791 333276 335473 338569 341729 343494 343293 341780 339482 336151 332010 328550 327034 326772 325941 323835
55544 323835 321321 319248 317466 315569 313681 312097 310708 309230 307609 305945 304289 302664 301004 299032
55530 299032 296681 294816 294944 297691 301822 305284 307127 307977 308699 309172 308655 306994 304999 303598 302928 302414
55514C02414q20j018q62o39o61q59r33p02j80M35P15J89j090k262k378j387j59
55497B89803N46Q08J055J298J253J079J320K019K286J210j007l106l946l377k049
55482B89192o97K47N63K9j397l141l968l048j208m86j819l691l888k354j096j227
55466B62011j479l23J682K811K601K027J602Q51k25n88L87J889K671K417J588
55451B79922N96l38j063j660k263k411j379L57J012j88j481p15J509K462J007
55436B75367r75j254O5J349J669J225M98N2N06J532J519m50k759k911q93P62N81
55419B75883m7M77J234M03j501k063m63J475K108K159L037M292M217K421L91n65
55403B93458p52j162j977k622k780k715k705k764k907l187l342k802j432rM92
$$ plain form
55514 302414 301594 300576 299714 299075 298414 297555 296622 295920 295740 296175 296890 297079 295989 293727 291349 289962 289803
55497 289803 290349 291157 292212 293510 294763 295842 297162 299181 301467 302677 301670 298564 294618 291241 289192
55482 289192 288495 288742 289305 289334 287937 284796 280828 277780 276572 276086 274267 270576 266688 264334 263238 262011
55466 262011 260532 260209 261891 264702 267303 269330 270932 271783 271558 270970 271357 273246 275917 278334 279922
55451 279922 280518 280180 279117 277457 275194 272783 271404 271761 272773 272585 271104 270389 271898 274360 275367
55436 275367 274392 273138 273203 274552 276221 277446 277944 277996 278502 280034 281553 281103 278344 275433 274540 275302 275883
55419 275883 275836 276313 277547 277950 276449 274386 273923 275398 277506 279665 282702 286994 291211 293632 294023 293458
55403 293458 292706 291544 289567 286945 284165 281450 278745 275981 273074 269887 266545 263743 262311 262302 262794
55388B62794R8j99J59N15J60k74N51K588L971L260J406O30J685L164L528K870
55372B86906K201J814J232M09k3O6k46j678l366l614k004q2M29n25j642j897j250
55355B76730j42Q76J124K46j108j734j203k04N47R26P39m97k453l557k630m98
55339B67162J004J168P00K49j65m14j72L38M76L01N43J233J363K74j468k977l886
55322B65729l867k361L94K874L762L307K494J537K38q66j005o01q16j647j732
55307B67440l92J289K022J977K045K156J439j34j290r25N78J892K112J210m88
55292B80931k447l627k960o80J426J909J365J393K121K084P07n25k52O61M33r22
55276B81617j621o91Q26J436Q94lm50j34O58J024J11j865l599m030l248j972o54
$$ plain form
55388 262794 262892 262693 262852 263367 263527 263253 263804 266392 270363 273623 275029 275659 277344 280508 284036 286906
55372 286906 289107 290921 292153 292562 292539 292605 292359 290681 287315 283701 281697 281615 282044 281519 279877 277980 276730
55355 276730 276588 277464 278588 278834 277726 275992 274789 274585 275132 276058 276797 276300 273847 270290 267660 267162
55339 267162 268166 269334 270034 270283 270118 269704 269532 269870 270346 270647 271190 272423 273786 274060 272592 269615 265729
55322 265729 261862 259501 259895 262769 266531 269838 272332 273869 274107 273241 272236 271635 270819 269172 267440
55307 267440 267048 268337 270359 272336 274381 276537 277976 277842 276552 275627 276205 278097 280209 281419 280931
55292 280931 278484 274857 271897 271217 272643 274552 275917 277310 279431 281515 282222 281697 281445 282106 282539 281617
55276 281617 279996 279305 280131 281567 282461 282458 282008 281874 282532 283556 283667 281802 278203 274173 270925 268953 268299
55259B68299N17J249J373J244J513K409L475L933L279J640l08j770k276j790o61
55244B82126M16P00K5r40j343r40j63L34l1j428l146l901l086j378L18J877L244
55227B72684L592K352N66k98m90j348k655k514k78K208L121K790K337J698L31
55212B84096j124j465n66O39J342J146M8r72l32K044L903L295J106m59r12j163
55196B90626j077K22J815J400j244l397k943r46L23L02j80p39j429j726r66M43
55180B80484J368J265M37o51j584j816j046L44J584K081J535K8j562j942p30R78
55164B80773J918K101K440L356M268M217K639m2k302k593r69R12J786K038K467
55149C03009K750K114P53n16j536k605l311k856j513n67o00p45j8J343K171J551
$$ plain form
55259 268299 268816 270065 271438 272682 274195 276604 280079 284012 287291 288931 288623 286853 284577 282787 282126
55244 282126 282542 283242 283267 282327 280984 280044 279881 280215 280184 278756 275610 271709 268623 267245 267563 269440 272684
55227 272684 276276 278628 279194 278896 278406 277058 274403 271889 271611 273819 276940 279730 282067 283765 284096
55212 284096 282972 281507 280941 281580 282922 284068 284116 283144 282812 284856 288759 292054 293160 292701 291789 290626
55196 290626 289549 289771 291586 292986 291742 288345 285402 284456 284779 285081 284901 284162 282733 281007 280041 280484
55180 280484 281852 283117 283554 282903 281319 279503 278457 278801 280385 282466 284001 284029 282467 280525 279795 280773
55164 280773 282691 284792 287232 290588 294856 299073 301712 301670 299368 296775 295806 296718 298504 300542 303009
55149 303009 305759 307873 308626 308110 306574 303969 300658 297802 296289 295722 295122 294377 294359 295702 297873 299424
55133B99424l66k321k772j310P88J875J519K94j417l356m478l641j334M97Q00
55118B84202M74O62J194J402J453J813K145J720N87n21j060r02p7R85J475J132
55102B96684P97J163J588J021k29q94p00n95j004j209q56n85n15N02K832M488
55086C02488L391O57m11J246K988K271J49n95L87Q62k98j432p19J192K331K023
55070C16530J078O1j097k127k456k284k418k808k501j417r36j851k771j708J244
55055B94539L855M245K460k17k516l527k849r93P76J507J340J004Q55P01L97J64
55039C01741K47M71L29m40j430j842j282j85N85N13j90q08p11J31J041J310R89
55022C00469P49Q13N88l35j305j342m45M70Q13O90K41n43j168p74O85K104K498
$$ plain form
55133 299424 299058 296737 293965 292655 293443 295318 296837 297131 295714 292358 287880 284239 282905 283402 284202
55118 284202 284676 285338 286532 287934 289387 291200 293345 295065 295652 295131 294071 293169 293092 294077 295552 296684
55102 296684 297481 298644 300232 301253 301024 300130 299430 298835 297831 296622 295766 295181 294666 295168 298000 302488
55086 302488 305879 306536 306125 307371 310359 312630 312779 312184 312571 313433 313135 311703 310984 312176 314507 316530
55070 316530 317608 317669 316572 314445 311989 309705 307287 304479 301978 300561 299625 297774 295003 293295 294539
55055 294539 298394 302639 305099 304882 302366 298839 295990 294997 295773 297280 298620 299624 300479 301180 301577 301741
55039 301741 301988 302459 302788 302348 300918 299076 297794 297609 298194 298707 298517 297709 296998 297129 298170 299480 300469
55022 300469 301218 302031 302619 302284 300979 299637 299192 299662 300475 301165 301406 300863 299695 298921 299606 301710 304208
55005C04208J997J225M73O4P00K416L798L419J779O85Q96J558J944K298K612K064
54989C32136M77q39q09j39n0l27q4K60l69j333n97K179M665M824L268J659K92
54972C45213j201j918n38K238L998L543J948O01l90j296j802j690j402j176n71
54957C45557L78O29k19p52M15K344K864J601K81N4J58k65o76l81qn86j814k461
54939C47119k072j262m70M32J314J560J031N68J038K328L590M205M224M153M533
54924C72291N356N796M875K800J200J504L422N527O961P748P738O515M597L487
54910D39817L672L627J925m08j147j39L68j077l313m647n265o291p508p680o679
54895D05255n797n825o132n803m723l237j700o18l93n20J50J909L655M339M307
$$ plain form
55005 304208 306205 307430 307903 307967 308667 311083 314881 318300 320079 320764 321660 323218 325162 327460 330072 332136
54989 332136 332613 331774 330965 330826 330776 330449 330365 330625 330256 328923 328326 330505 335170 339994 343262 344921 345213
54972 345213 344012 342094 341556 343794 347792 351335 353283 353884 353494 352198 350396 348706 347304 346128 345557
54957 345557 345935 346564 346345 345593 346008 348352 351216 352817 353098 353152 353310 353045 352369 351988 351980 351394 349580 347119
54939 347119 345047 343785 343315 343747 345061 346621 347652 348220 349258 351586 355176 359381 363605 367758 372291
54924 372291 377647 383443 388318 391118 392318 393822 397244 402771 409732 417480 425218 431733 436330 439817
54910 439817 443489 447116 449041 448633 447486 447347 447715 446638 443325 438678 433413 427122 419614 411934 405255
54895 405255 399458 393633 387501 381698 376975 373738 372038 371420 371027 370507 370657 372566 376221 380560 384867
54880C84867M645N609O355N933M252K345J775L174N190N602L905J944J502K226
54866D39324K724K673K484J677n67l300m190k718j481l223p389j0768j1058q835
54852C95353o226m729m527n030n484n224l912j773L77J475R27q40k520k845j523
54837C53499N40J961J913P59l28m38K80Q97O43m06j529k053j886j395q73k14P50
54820C52120J807K548K862K820K180O72j125k017j621q84o84o90l25M8j91o63
54804C56857o53m90r24j417o18J305K424J559l05j714k492k987k797j436M27J530
54788C48269J440P06K8p1O31J632J949J519J663L288N278N749M505L139K947L781
54772C86453M887N822O536P263Q329R519R887Q932P578P038P086O538N226M159
$$ plain form
54880 384867 389512 395121 401476 407409 411661 414006 415781 418955 424145 429747 433652 435596 437098 439324
54866 439324 442048 444721 447205 448882 448315 445015 440825 438107 436626 433403 426014 415246 404188 395353
54852 395353 389127 384398 379871 374841 369357 364133 360221 358448 358825 360300 361227 360387 357867 355022 353499
54837 353499 354039 356000 357913 358672 358344 357906 358186 359083 359726 359320 357791 355738 353852 352457 351584 351370 352120
54820 352120 353927 356475 359337 362157 364337 365009 363884 361867 360246 359362 358678 357988 357663 357711 357520 356857
54804 356857 356204 355714 354790 353373 352755 354060 356484 358043 357738 356024 353532 350545 347748 346312 346739 348269
54788 348269 349709 350415 350443 350372 351003 352635 354584 356103 357766 361054 366332 372081 376586 379725 382672 386453
54772 386453 391340 397162 403698 410961 419290 428809 438696 447628 455206 462244 469330 475868 481094 485253
54758D85253L725L075J727N06L03P11O39l20j621k436k450k374l643o789j0192
54743D66114j1449j0128q065o763n786m355l088l024l753l821k498k86J934L384
54729D08416L575K849K396K834L221K464J218J169K610M001M149L576L363L530
54715D49371L339K611K047K336L220L465J943j013l570m319l965m402o133p736
54701D37194q035p616p462p143n687l683k981m147n505n286l717k266j547j083
54687C71036o83p29j143j155n60j84n67r93n85K86O09K57l3J30N37J108J868K380
54669C71579K154J587J304Q03q91l021l266q18K113K895J359p65k193k561j706
54654C68573j23O05m74j866j259J092K331P40j991k987j553N29J365P90J10N29
$$ plain form
54758 485253 488978 492053 493780 494286 494589 495300 495939 495619 493998 491562 489112 486738 483095 476306 466114
54743 466114 454665 444537 436472 429709 423923 419568 416480 413456 409703 405882 403384 403098 405032 408416
54729 408416 411991 414840 417236 420070 423291 425755 426973 428142 430752 434753 438902 442478 445841 449371
54715 449371 452710 455321 457368 459704 462924 466389 468332 467319 463749 459430 455465 451063 444930 437194
54701 437194 429159 421543 414081 406938 401251 397568 394587 390440 384935 379649 375932 373666 372119 371036
54687 371036 370353 369624 368481 367326 366766 366582 366015 365022 364437 364723 365332 365589 365556 365686 366223 367331 369199 371579
54669 371579 373733 375320 376624 377427 376536 373515 370249 369431 371544 374439 375798 375033 372840 370279 368573
54654 368573 368450 369055 368581 366715 365456 366548 368879 369619 367628 364641 363088 363617 364982 365772 365882 366411
54638C66411J817K486J522k55j008L9J818K720K133P24k92k28L48J53j120k068
54622C75200j393J25N76l62j129p49j36l71r93r44j88N37R39J126R33J52p52j050
54604C71521p51n43p45p79R2J732K965K574O18j396k025j400p17m83j11P25J325
54587C72602R30k34j282j495p10M60P01p81k850l299j526O49J373Q76M58M68L90
54570C66730R6k11o81j381j642q54M04J033P70Oj120k345k651j415K36P10L30
54553C58015P06J838J860K07r04N21L222M245K729O01l08k99o88j782k671k546
54537C64746j511j31J182K180K589K406K239K692L333K956J206o75j231l82R59
54522C82558K215L194L283J892k61j561j421r60j267j950j968j223n12l06k93
$$ plain form
54638 366411 368228 370714 372236 371981 370973 371012 372830 375550 377683 378407 378115 377887 378235 378388 377268 375200
54622 375200 373807 373932 374508 374146 373017 372268 372132 371761 370768 369824 369636 370173 371112 372238 373171 373323 372571 371521
54604 371521 370770 370227 369482 368703 368795 370527 373492 376066 376684 375288 373263 371863 371146 370663 370552 371277 372602
54587 372602 373532 373298 372016 370521 369811 370271 370972 370191 367341 364042 362516 363165 364538 365414 365872 366340 366730
54570 366730 366826 366615 365934 364553 362911 362057 362461 363494 364264 364270 363150 360805 358154 356739 356975 357685 358015
54553 358015 358721 360559 362419 362626 361722 362243 365465 369710 372439 373040 372732 372433 371745 369963 367292 364746
54537 364746 363235 363104 364286 366466 369055 371461 373700 376392 379725 382681 383887 383212 381981 381599 382558
54522 382558 384773 387967 391250 393142 392881 391320 389899 388939 387672 385722 383754 382531 382019 381713 381420
54507C81420j18M2j61o12p41k47M21O25N58J124K457L200J994n74k397k149m50
54490C84392J239K101K109J571R20N62M87K99k29q60j212j171r79j116j821k427
54474C83865j679O63L064L940L638L424K976O84l270o047n385k333M11J775K559
54459C88285L198L034J683j42j441j756j099J04R07M87p78j508r51j5j97j647
54443C88164k847k326m22J134J271O24L39N01M22Oj57J15L98N92J023J496J282
54426C91615M01j30K66R27J121J116J436J923K150K004J320q1j436j282M17J604
54410D03371Q57l70J43J908K381P54j067j412q90p29q40n98l67r71k123k546j612
54393C95889p7Q72R04P15J051J837K404K450K354K384K200J495O63L05M80R80
$$ plain form
54507 381420 381302 381344 381183 380571 379830 379583 380004 380629 381187 382311 384768 387968 389962 389388 386991 384842 384392
54490 384392 385631 387732 389841 391412 392332 392894 393381 393680 393451 392591 391379 390208 389229 388113 386292 383865
54474 383865 382186 382849 385913 389853 393491 396915 399891 400575 397305 391258 385873 383540 383951 385726 388285
54459 388285 391483 394517 396200 396058 394617 392861 391762 391866 392773 393260 392482 390974 390023 390008 389811 388164
54443 388164 385317 382991 382569 383703 384974 385598 385937 386438 386860 386866 386709 386824 387222 387814 388837 390333 391615
54426 391615 392016 391886 392152 393079 394200 395316 396752 398675 400825 402829 404149 404068 402632 401350 401767 403371
54410 403371 404228 403858 404001 405909 408290 409044 407977 406565 405675 404946 404106 403508 403141 402170 400047 397501 395889
54393 395889 395812 396684 397588 398303 399354 401191 403595 406045 408399 410783 412983 414478 415141 415446 415926 416906
54377D16906J745K466K341J127j42m34k00m56r06m18Q44J366N72l76m85k45l93
54360D23312m93K86J784K972L036J938M63j37P59K103K042J86j803k212r94P78
54344D34020K126K301Q60j524l142l020k037j617k064k829l528l708k511K18K934
54329D16479L658K132j66j777k233j721q20l67o40q61l60K47L2n02n6J279K041
54312D16365J800J859K873L304J651q21j221J250M141M665K693K53j109j515j624
54297D34564j466q07N5O13R19J359J804J715R95Oj200k736l879l349j092J262
54281D28763K462L070L851L847J682j713l543k525l47P33M35p9k20m53j166k004
54265D32793k366k129j730j615j620j084K31J620K267K192J807R75n27j819j544
$$ plain form
54377 416906 418651 421117 423458 424585 424443 424009 423809 423353 422447 422029 422873 424239 424811 424435 423950 423705 423312
54360 423312 422819 423105 424889 427861 430897 432835 433298 433161 433920 436023 438065 438251 436448 434236 433242 434020
54344 434020 436146 438447 439307 437783 434641 431621 429584 427967 425903 423074 419546 415838 413327 413545 416479
54329 416479 420137 422269 422103 420326 418093 416372 415552 415185 414545 413684 413324 413571 413603 413101 413045 414324 416365
54312 416365 418165 420024 422897 426201 427852 427031 425810 427060 431201 435866 438559 438812 437703 436188 434564
54297 434564 433098 432291 432346 432959 433878 435237 437041 438756 439751 439757 438557 435821 431942 428593 427501 428763
54281 428763 431225 434295 438146 441993 443675 441962 438419 435894 435547 436280 436715 436636 436416 435963 434797 432793
54265 432793 430427 428298 426568 424953 423333 422249 422480 424100 426367 428559 430366 431341 430814 428995 427451
54250D27451J74J580J525N98l12j229j939j140J648M354M456K436J120J501J389
54235D43612r49l718l839j188J293J530O06O89K029K966K183R6j840k518j875
54220D39077p79k87p49j502j610q78N2N27N03L18K11J96J48p5n02r09j002p84
54202D31955n56m26j35M99J168J363J061Q16J066J503J369M42m63l07Q94K086
54186D42335K559K720L106L337K855K188K332L119L377K758K138J975J656Q98
54172D77353M15N19M15o4L78K251L473J852j427l010j826k36m86k023l004k781
54156D71799j921j046o73j347k949m382m592l491j734j65L58m13j424j256r8L86
54140D47052m53j207o15M92O45j1k67J11L10L2k58l86n88o41P5J539K956L707
$$ plain form
54250 427451 427625 429205 430730 431328 431016 429787 427848 426708 428356 432710 437166 439602 440722 442223 443612
54235 443612 442663 438945 435106 433918 435211 436741 437347 438036 440065 443031 445214 445310 443470 440952 439077
54220 439077 438298 438011 437262 435760 434150 433272 433324 433851 434354 434672 434883 435079 435227 435152 434650 433741 432739 431955
54202 431955 431399 430973 430838 431337 432505 433868 434929 435745 436811 438314 439683 440125 439662 439355 440249 442335
54186 442335 444894 447614 450720 454057 456912 459100 461432 464551 467928 470686 472824 474799 476455 477353
54172 477353 477768 478287 478702 478638 479016 481267 484740 486592 485165 482155 480329 480093 479607 477584 474580 471799
54156 471799 469878 468832 468159 466812 463863 459481 454889 451398 449664 449499 449857 449444 448020 446764 446666 447052
54140 447052 446599 445392 444777 445269 445914 445903 445636 445747 446057 446089 445831 445445 444857 444216 444291 445830 448786 452493
54122D52493L700K926J430k92j595k364k746k426r66J125K513K370J075l86j163
54107D55694p55P39K437L325L233K803K547K427K265K009J575R23L03%q1k08n01
54090D78735j113k323l828m536l847k665k096j684k22K011L361L184K552K272
54076D69801J775O36k99k74P6j73p86j073j251j863k455k047n62J185K643L662
54060D68995L804K703J040J08J49Q4q73k003k002n55J388K720L230L558M255N028
54044D91629N147M549M017M000L891L055K150K547M531O793P889P687P083O767
54030E61735O642O364O103O480P545Q264P585O000N136N488N506L713Q07j275
54016F36093j857j757j485p62j3p62l724p374r263q299n344k250q04j883m752
$$ plain form
54122 452493 456193 459119 460549 460257 458662 456298 453552 451126 450160 451285 453798 456168 457243 456857 455694
54107 455694 454939 455678 458115 461440 464673 467476 470023 472450 474715 476724 478299 479222 479525 479525 479444 479236 478735
54090 478735 477622 475299 471471 466935 463088 460423 458327 456643 456421 458432 461793 464977 467529 469801
54076 469801 471576 472212 471913 471639 471715 471542 470756 469683 468432 466569 464114 462067 461505 462690 465333 468995
54060 468995 472799 475502 476542 476650 476799 476883 476010 474007 472005 471450 472838 475558 478788 482346 486601 491629
54044 491629 496776 501325 505342 509342 513233 516288 518438 520985 525516 532309 540198 547885 554968 561735
54030 561735 568377 574741 580844 587324 594869 603133 610718 616718 621854 627342 632848 636561 637368 636093
54016 636093 634236 632479 630994 630232 630219 629457 625733 618359 609096 600797 595453 593203 592399 590516 585764
54001E85764p447q518q234p733p352o553n121l711l040l096l303l119k398j471
53987E14668r50j096j302o16R58J987R58j867m325m484k631q08n02j341k078k198
53971D94373k030j841j568j273j206j393j629j735j487n32R70J894J301q4m95
53956D83265O25K052K606K513K493K553K427K292K376K566K966M011N373N828
53942E23946N099M671N587O470N374K767Q79O07J030J752L508O125P966Q157P657
53927E91595P440P310P253Q109R663R912P829N509N560P441Q336P032M939L622
53913F91550L326L877N073N848M886K702J549K518M017M004K546J190P01O22N58
53898G34967O85R86P65q07l808p184r388r771r276r172r312q469o417m499l794
$$ plain form
54001 585764 578317 569799 561565 553832 546480 539927 534806 531095 528055 524959 521656 518537 516139 514668
53987 514668 513718 512622 511320 510704 511662 513649 514607 512740 508415 503931 501300 500492 499990 498649 496571 494373
53971 494373 492343 490502 488934 487661 486455 485062 483433 481698 480211 479679 480649 482543 483844 483760 483265
53956 483265 483890 485942 488548 491061 493554 496107 498534 500826 503202 505768 508734 512745 518118 523946
53942 523946 529045 533716 539303 545773 551147 553914 554793 555400 556430 558182 561690 567815 575781 583938 591595
53927 591595 599035 606345 613598 621707 631370 641282 649111 654620 660180 667621 675957 682989 687928 691550
53913 691550 694876 698753 703826 709674 714560 717262 718811 721329 725346 729350 731896 733086 733787 734409 734967
53898 734967 735652 736638 737403 736596 732788 725604 716216 706445 697169 687997 678685 670216 663799 659300 655506
53883F55506l958m518n943q370j0333j0292q818p723p318o152l597j174o90k144
53869E74476m106n351n506m749l621k805k570k523k198j596r18k59J04m08k003
53854E35967l871m824m463l389k318j416o38k88p79j872k537j868q1J737K846
53839E12206L382L685L634L115K534K217J680L09j483k640k941l114l393l041
53825E16150j722l11L57O87J450K399K659K073J267P15N62J096K451L887M249
53810E37969L231J657N71O28K008M083N380M914L604L283M283N141M900M359M491
53795E90502M975N165N370O033O552O174N389N100M986M072K536J443P92m78k357
53780F46254l263k265m73N41M85k26j636l624n078n050m222m051m747n178m668
$$ plain form
53883 655506 651548 647030 641087 632717 622384 612092 603274 595551 588233 582081 578484 577310 576620 574476
53869 574476 570370 565019 559513 554764 551143 548338 545768 543245 541047 539451 538533 538274 538378 537970 535967
53854 535967 532096 527272 522809 519420 517102 515686 515048 514760 513981 512109 509572 507704 507623 509360 512206
53839 512206 515588 519273 522907 526022 528556 530773 532453 532762 531279 528639 525698 522584 519191 516150
53825 516150 514428 514117 514474 515161 516611 519010 521669 523742 525009 525724 526286 527382 529833 533720 537969
53810 537969 541200 542857 543428 544056 546064 550147 555527 560441 564045 567328 571611 576752 581652 586011 590502
53795 590502 595477 600642 606012 612045 618597 624771 630160 635260 640246 644318 646854 648297 649089 648611 646254
53780 646254 642991 640726 640253 640794 641279 641053 639417 635793 630715 625665 621443 617392 612645 607467 602799
53765F02799l691k814j987j125n44m49o18q51j197j495j265l14Q58J533J356M77
53749E90673n77j145r17k48L48P51R91P75Q2j04J323L945O056O755O707O615O208
53732F28238N382N129O300Q324J0227J2183J4827J7555J9000J9109J9564K1915
53720G87753K6169L1301L6275M0410M3627M6541M9579N1931N2130M9882M6511
53709A262109M3421M0855L8226L4692K9059K0327R209j709j0336j7052k3423k9547
53697A395831l3982l6172l7566l9716m2208m3255m1921l8926l5394l1584k7240
53686I87867k2597j8473j5464j3531j2454j2106j2079j1531r967p901o232n209
53674H40323m564m387n025o096o509n862n080n151n809o030n374m219k937j556
$$ plain form
53765 602799 599108 596294 594307 593182 592638 592189 591571 590720 589523 588028 586763 586449 587307 588840 590196 590673
53749 590673 590096 588951 588034 587786 588134 588885 589876 590651 590733 590629 591952 595897 601953 608708 615415 622030 628238
53732 628238 633620 638749 645049 653373 663600 675783 690610 708165 727165 746274 765838 787753
53720 787753 813922 845223 881498 921908 965535 1012076 1061655 1113586 1165716 1215598 1262109
53709 1262109 1305530 1346385 1384611 1419303 1448362 1468689 1477898 1476189 1465853 1448801 1425378 1395831
53697 1395831 1361849 1325677 1288111 1248395 1206187 1162932 1121011 1082085 1046691 1015107 987867
53686 987867 965270 946797 931333 917802 905348 893242 881163 869632 859665 851764 845532 840323
53674 840323 835759 831372 826347 820251 813742 807880 802800 797649 791840 785810 780436 776217 773280 771724
53660G71724l25J01o89k136k996k502j203l71n24q52n39j56q68k428l100j938
53644G51198j37N86J64j03N58J675K392K229J209o5n90J85J703K966L620L939
53628G71529M172M556N506O931P761P164N993N907P106Q089P783O695N743N094
53614H60029M732N064O217P576Q641R624J0580J0823R999Q946Q537Q332P445O191
53600I72736N685N994N970N017L914L545L635L271K166J005P38J709L214L943
53586A022542L202J595K04p34j791l191m417n035n189n139m948m780m900n141
53572I82278m957m279l735l733l960m019l990l976l808l565l658l937l605k666
53558I28390k415l366l762j772J398K598R69q98n95J116K002J516Q68R25J585
$$ plain form
53660 771724 771399 771500 770811 768675 765679 763177 761974 761603 761079 760227 759688 759532 758664 756236 753136 751198
53644 751198 751061 751647 751811 751708 752266 753941 756333 758562 759771 759706 759116 759301 761004 763970 767590 771529
53628 771529 775701 780257 785763 792694 800455 807619 813612 819519 826625 834714 842497 849192 854935 860029
53614 860029 864761 869825 876042 883618 892259 901883 912463 923286 933285 942231 950768 959100 966545 972736
53600 972736 978421 984415 990385 995402 999316 1002861 1006496 1009767 1011933 1012938 1013676 1015385 1018599 1022542
53586 1022542 1025744 1027339 1027543 1026809 1025018 1021827 1017410 1012375 1007186 1002047 997099 992319 987419 982278
53572 982278 977321 973042 969307 965574 961614 957595 953605 949629 945821 942256 938598 934661 931056 928390
53558 928390 925975 922609 918847 917075 918473 921071 922040 921142 920547 921663 923665 925181 926049 926974 928559
53543I28559K684M138N415O136O990Q866J1126J2032J1036R606R464J0947J3384
53530A040383J6072J8427J9987K0900K1853K3202K4673K6093K7729K9611L1391
53519A300321L3222L5792L8889M0993M1254M1068M2495M5614M8614N0216N0759
53508A769237N1094N1630N2551N3916N5289N6173N7012N8772O1270O2998O3081
53497B393023O2604O3291O5538O8389P0828P2389P3059P3470P4778P7421Q0023
53486C174813Q0490P8282P4832P1498O7964O3239N7437N1416M4825L5890K3923
53475C824609J1258J424m393q138j2059j6480k0849k5484l0798l5570l7829l7503
53463C608188l6792l7551l9566m1674m3247m3914m3242m1845m1729m4143m7603
$$ plain form
53543 928559 931243 935381 940796 946932 953922 962788 973914 985946 996982 1006588 1016052 1026999 1040383
53530 1040383 1056455 1074882 1094869 1115769 1137622 1160824 1185497 1211590 1239319 1268930 1300321
53519 1300321 1333543 1369335 1408224 1449217 1490471 1531539 1574034 1619648 1668262 1718478 1769237
53508 1769237 1820331 1871961 1924512 1978428 2033717 2089890 2146902 2205674 2266944 2329942 2393023
53497 2393023 2455627 2518918 2584456 2652845 2723673 2796062 2869121 2942591 3017369 3094790 3174813
53486 3174813 3255303 3333585 3408417 3479915 3547879 3611118 3668555 3719971 3764796 3800686 3824609
53475 3824609 3835867 3837291 3832898 3824760 3812701 3796221 3775372 3749888 3719090 3683520 3645691 3608188
53463 3608188 3571396 3533845 3494279 3452605 3409358 3365444 3322202 3280357 3238628 3194485 3146882
53452C146882m9320m8377m6366m5148m5142m5804m6489m6526m5432m3560m1925
53441B642793m0908l9744l7608l4621l1496k8683k6275k4234k2184j9405j5564
53430B322071j1349p838n280k822N44M946R565J3527J6818K0223K4222K8231L1335
53417B444193L3632L6208L9666M3337M6343M8873N1800N5445N9267O2679O5613
53406B987056O8415P1576P5506Q0101Q4626Q8402R1570R4787R8373J02227J06365
53395C949004J10776J14731J17148J17957J18405J19572J21197J22549J23631
53386E014970J24558J24256J21170J15486J09489J05094J01736R7362R0952Q3187
53376F088260P4971O6398N7470M8956M1649L4939K6970J6619M920n970j5136k3681
$$ plain form
53452 3146882 3097562 3049185 3002819 2957671 2912529 2866725 2820236 2773710 2728278 2684718 2642793
53441 2642793 2601885 2562141 2524533 2489912 2458416 2429733 2403458 2379224 2357040 2337635 2322071
53430 2322071 2310722 2302884 2297604 2294782 2295326 2300272 2309837 2323364 2340182 2360405 2384627 2412858 2444193
53417 2444193 2477825 2514033 2553699 2597036 2643379 2692252 2744052 2799497 2858764 2921443 2987056
53406 2987056 3055471 3127047 3202553 3282654 3367280 3455682 3547252 3642039 3740412 3842639 3949004
53395 3949004 4059780 4174511 4291659 4409616 4528021 4647593 4768790 4891339 5014970
53386 5014970 5139528 5263784 5384954 5500440 5609929 5715023 5816759 5914121 6005073 6088260
53376 6088260 6163231 6229629 6287099 6336055 6377704 6412643 6439613 6456232 6461152 6455182 6440046 6416365
53364F416365l3068m3290n3068o1485o8733p5493q2194q8921r5444j01247j06005
53353E607417j10044j13772j16730j18054j18007j17919j18178j17379j14420
53344D562914j10505j07765j06378j04539j01149r7132r3834r1297q8617q5106
53334C576592q0611p5339o9918o5066o0876n6831n2693m8741m4944m0659l5597
53323B945317l0428k6037k2698k0284j8580j7015j4874j2302j0303r220q131o470
53311B748975n264n547o330n625l185p11O56J676L470N897Q126J0072J2511J6141
53297B780862K1037K6724L2459L7550M1693M4992M7762N0365N2953N4906N5006
53286C246309N2743M9296M6449M4741M3287M1275L8636L5288L0970K6135K2015
$$ plain form
53364 6416365 6383297 6340007 6286939 6225454 6156721 6081228 5999034 5910113 5814669 5713422 5607417
53353 5607417 5497373 5383601 5266871 5148817 5030810 4912891 4794713 4677334 4562914
53344 4562914 4452409 4344644 4238266 4133727 4032578 3935446 3841612 3750315 3661698 3576592
53334 3576592 3495981 3420642 3350724 3285658 3224782 3167951 3115258 3066517 3021573 2980914 2945317
53323 2945317 2914889 2888852 2866154 2845870 2827290 2810275 2795401 2783099 2772796 2763576 2755445 2748975
53311 2748975 2743711 2738164 2731834 2726209 2723024 2722313 2722969 2724645 2728115 2734012 2742138 2752210 2764721 2780862
53297 2780862 2801899 2828623 2861082 2898632 2940325 2985317 3033079 3083444 3136397 3191303 3246309
53286 3246309 3299052 3348348 3394797 3439538 3482825 3524100 3562736 3598024 3628994 3655129 3677144
53275C677144J9029J5953J1337N312p07n670r665j3444j7706k2643k7674l1949
53263C599317l5447l9192m3921m8942n2963n5678n7845o0062o2244o4241o6086
53252C012696o7480o7885o7464o7215o7743o8390o8116o6838o5232o3588o1642
53241B281103n9491n7800n6813n5934n4700n3433n2219n0084m6347m2321m0206
53230A711755m0169m0099l8648l6902l6078l5230l2955l0140k8839k8847k7853
53219A335995k5100k2641k2145k2502k1981k1027k1152k2048k1825j9823j7508
53208A098243j6387j6353j6408j6064j5506j4975j4464j3786j2782j1650j0889
53197I38979j0755j0919j0940j0779j0486r780q514p255o718o796o734o143n212
$$ plain form
53275 3677144 3696173 3712126 3723463 3728775 3728068 3722398 3712733 3699289 3681583 3658940 3631266 3599317
53263 3599317 3563870 3524678 3480757 3431815 3378852 3323174 3265329 3205267 3143023 3078782 3012696
53252 3012696 2945216 2877331 2809867 2742652 2674909 2606519 2538403 2471565 2406333 2342745 2281103
53241 2281103 2221612 2163812 2106999 2051065 1996365 1942932 1890713 1840629 1794282 1751961 1711755
53230 1711755 1671586 1631487 1592839 1555937 1519859 1484629 1451674 1421534 1392695 1363848 1335995
53219 1335995 1310895 1288254 1266109 1243607 1221626 1200599 1179447 1157399 1135574 1115751 1098243
53208 1098243 1081856 1065503 1049095 1033031 1017525 1002550 988086 974300 961518 949868 938979
53197 938979 928224 917305 906365 895586 885100 875320 866806 859551 852833 846037 839303 833160 827948
53184H27948m068k644j207l82m10q00p95J24J966M046N145M633L341K736L179
53169H42812L674L318K279J145R8q36j520k118l294n275p169p886p619p699q842
53154H01068j0127j0101q591o929o329o524o386n626n120n489o076n955n268m829
53140G07718m696m198l268k665k620k262j011K92M26n31j422j592j368j035l18
53125F81450P68J282L62j429k464j924p94n12j009p43J250L976N559N219L699
53110F94690K088R54N46R63J781K078J363L04Q9J062K304K692K183J788K124K451
53094G19460J675J64l25J113L311M713N378O135O507N114K055p68j985k034j695
53079G48818r65j52m78k277l801l371j881j559k801l902l730k969k629k768l055
$$ plain form
53184 827948 823880 821236 820029 819647 819237 818437 817642 817766 819732 823778 828923 833556 836897 839633 842812
53169 842812 846486 849804 852083 853228 853326 852490 850970 848852 845558 840283 833114 825228 817609 809910 801068
53154 801068 790941 780840 772249 765320 758991 752467 746081 740455 735335 729846 723770 717815 712547 707718
53140 707718 703022 698824 695556 692891 690271 688009 686998 687290 687716 687185 685763 684171 682803 681768 681450
53125 681450 682218 683500 683862 682433 679969 678045 677251 676739 675730 674987 676237 680213 685772 690991 694690
53110 694690 696778 697732 698278 699241 701022 703100 704463 704767 704856 705918 708222 710914 713097 714885 717009 719460
53094 719460 721135 721299 720974 722087 725398 730111 735489 741624 748131 753245 755300 754532 752547 750513 748818
53079 748818 747853 747701 747223 744946 741145 737774 735893 734334 731533 727631 723901 720932 718303 715535 712480
53064G12480l362l405k853k105j926k091j637o83o57k023l237k943j984j937k692
53049F78945k943k432j985j714q92K38K06j627l895m859m224k802j225L05J612
53034F52708K602L337L545K731J217M60J394K938L042J055j780l938m850m446
53020F60015k646J53K638L373K096L9j052l14J563L037L179K377J567J165J041
53005F78231J102J229J030M27K06J136K522K823J787R61J606L087L910L452K033
52990G05542K08j220j220M11K448L506L403K663J410j86j099m51J066K003K110
52975G20594K183K287J680M97j35J24L60J50J91O66N63n75j675j920k062k718
52959G20210k711q17J699K201M0k836m482m695m038k686q62O62J180P23k48j345
$$ plain form
53064 712480 709118 705713 702860 700755 698829 696738 695101 694418 693761 691738 688501 685558 683574 681637 678945
53049 678945 676002 673570 671585 669871 668979 669217 669423 667796 663901 659042 654818 652016 650791 651096 652708
53034 652708 655310 658647 662192 664923 666140 666600 667994 670932 673974 675029 673249 669311 664461 660015
53020 660015 657369 657522 660160 663533 665629 665668 664616 664302 665865 668902 672081 674458 676025 677190 678231
53005 678231 679333 680562 681592 682019 682225 683361 685883 688706 690493 691454 693060 696147 700057 703509 705542
52990 705542 705750 704530 703310 703721 706169 709675 713078 715741 717151 716965 715866 715415 716481 718484 720594
52975 720594 722777 725064 726744 727241 727106 727230 727590 727740 727931 728597 729160 728585 726910 724990 722928 720210
52959 720210 717499 716682 718381 720582 720622 717786 713304 708609 704571 701885 701023 701685 702865 703588 703340 701995
52943G01995k352l156l743l997l709l071k732k755k155l62J392J424n1j244j464
52928F74020j809k853l349k145j29R36N77n00j823l113l432j848R64L052L319
52913F61867K396J336N01L2L17J230J698Q82n56j137l87P83J353J168N93p4m86
52896F71516k21P29J805K588L174L422K553L44j827k295j333p84j409k002j619
52881F74641j121j548k255k151j746k294l435l547k343j393j815k970l841m153
52867F40029l726k132K23J986K639L091L684L116Q21j069j65K491L469J561p79
52852F55239j072J51R58R77J085J239M30j296k471k203j316r19q20k41O74J187
52836F51602J388J993K731K321N39j091j422j308j950k707k211q88l84p84m77
$$ plain form
52943 701995 699643 696487 692744 688747 685038 681967 679235 676480 674325 673963 675355 676779 676728 675484 674020
52928 674020 672211 669358 666009 663864 663735 664671 665248 664748 662925 659812 656380 654532 655496 658548 661867
52913 661867 664263 665599 666100 666132 666449 667679 669377 670259 669703 668566 668179 668962 670315 671483 672076 672002 671516
52896 671516 671295 672024 673829 676417 679591 683013 685566 685910 684083 681788 680455 679671 678262 676260 674641
52881 674641 673520 671972 669717 667566 665820 663526 660091 656544 654201 652808 650993 648023 644182 640029
52867 640029 636303 634171 634394 636380 639019 642110 645794 648910 649731 648662 648497 650988 654457 656018 655239
52852 655239 654167 654318 655276 656253 657338 658577 659007 657711 655240 653037 651721 650802 649982 649741 650415 651602
52836 651602 652990 654983 657714 660035 660574 659483 658061 656753 654803 652096 649885 648997 648613 647829 647352
52821F47352R83J950J266j32r94j335j244j6K183L584L431L608N631P601O664
52806F80532L365Q07K33M23R53K712M848M735K050j87k19l69l110o758p801n944
52790F76270m055m000n072o109o804o919o270n571n714o058n168l262k191k657
52776F06420l107k060p6J409J962K036J853J414J006Q44O16N1m16j85M81O58m3
52759F12863q59o40Q44K460K786J652M14M11J502K522K835K786K714K391J547
52744F36228L74o96j413j783k026k377k622k094n65J177K152K264J875R21n74
52729F30841j506o77J271K279J441j52j251j684j350K51K601L693K272m86k550
52714F34993l242k923j697J32J283Q52j97l30L59O99M97L31o0j216k140j269P43
$$ plain form
52821 647352 648335 650285 651551 651419 650425 649090 647846 647830 650013 653597 657028 660636 666267 673868 680532
52806 680532 683897 684704 684937 685360 686313 689025 693873 698608 700658 700471 700252 699883 696773 690015 682214 676270
52790 676270 672215 668215 663143 657034 650230 643311 637041 631470 625756 619698 614530 611268 609077 606420
52776 606420 603313 601253 601177 602586 604548 606584 608437 609851 610857 611701 612317 612368 611952 611767 612248 612906 612863
52759 612863 612004 611364 612208 614668 617454 619106 619520 619931 621433 623955 626790 629576 632290 634681 636228
52744 636228 636602 635906 634493 632710 630684 628307 625685 623591 623026 624203 626355 628619 630494 631415 630841
52729 630841 629335 628658 629929 632208 633649 633497 632246 630562 629212 629463 632064 635757 638029 637543 634993
52714 634993 631751 628828 627131 627263 628546 629398 629201 628871 629230 629929 630426 630757 630697 629481 627341 626072 626815
52697F26815J501M91j62P31J494N96p03n40M44M21m28m29M97P44n1k41J194L007
52679F35381L512K660J562R74R90J431J857J746J219R66J186J253Q68P26J458
52664F57789K646L572M301N186N802N372L990K610J895J853K417L455M190L568
52650G08646J655m3p6J607L968N840O180M331R63j690j733K24J733J467N20M27
52634G34019R44Q60K76O57K427L918L475J735P77J317K039J844J493K208L424
52619G61413L267J185j145j999j787k172l616m911n121m866n252o132o225m667
52605G17972j953O16K032K113J358M50k11o09q47r28q04m26M00J830L471M364
52589G28828L921K733J942J939K170K217K347K739K814J980O59j24j42k00p95
$$ plain form
52697 626815 628316 628807 628645 629376 630870 631466 630763 630223 630667 631088 630660 630231 630728 631472 631421 631180 632374 635381
52679 635381 638893 641553 643115 644089 645079 646510 648367 650113 651332 652298 653484 654737 655605 656331 657789
52664 657789 660435 664007 668308 673494 679296 684668 688658 691268 693163 695016 697433 700888 705078 708646
52650 708646 710301 710258 710182 711789 715757 721597 727777 732108 733071 731381 729648 729872 731605 733072 733592 734019
52634 734019 734963 735823 736099 736756 739183 743101 746576 748311 749088 750405 752444 754288 755781 757989 761413
52619 761413 764680 765865 764720 762721 760934 758762 755146 750235 745114 740248 734996 728864 722639 717972
52605 717972 716019 716635 718667 720780 722138 722588 722377 721768 720921 719993 719189 718763 719163 720993 724464 728828
52589 728828 732749 735482 737424 739363 741533 743750 746097 748836 751650 753630 754289 754165 754023 753823 753028
52574G53028j137j61J843L292L114J814N21m38j403k253k326j452k11R94K314
52559G57539L537L745K609J247Q70J127Q32j29r32j508k500l355k296R04L745
52544G65435L898K250J414K050K464J681R27J445K453K310Q13p21j189o03M04
52529G85031J316J936K336K598K360J080r18k094j169J125K602K003K54q45n53
52514G97062N43J681K640L469M082M342M314M269M375M370L711K308J095J262
52500H39523K561L017J050k373m653m644l856m212n570o280n520m117l182k909
52486G98835k754k140q91N44J290R56K88K78P81Q34L61M79J767L192L484K764
52470H10068K017J543R41K13r7K18Q45J632K677L697M159M129M188M267L372J038
$$ plain form
52574 753028 751891 751730 753573 756865 759979 761793 762314 761876 760473 758220 755894 754442 754231 755225 757539
52559 757539 761076 764821 767430 768677 769547 770674 771506 771377 770445 768937 766437 763082 760786 761690 765435
52544 765435 769333 771583 772997 775047 777511 779192 780119 781564 784017 786327 787140 786419 785230 784627 785031
52529 785031 786347 788283 790619 793217 795577 796657 795739 793645 792476 793601 796203 798206 798460 797615 797062
52514 797062 797605 799286 801926 805395 809477 813819 818133 822402 826777 831147 834858 837166 838261 839523
52500 839523 842084 845101 846151 843778 839125 834481 830625 826413 820843 814563 809043 804926 801744 798835
52486 798835 796081 793941 793050 793594 794884 795840 796128 796406 797187 798021 798382 798861 800628 803820 807304 810068
52470 810068 812085 813628 814569 814782 814685 814903 815748 817380 820057 823754 827913 832042 836230 840497 843869 844907
52454H44907j613k993k931k687l205l991l874k460n70M79r9j982l934m731m070
52439H06246k658j389o39m42q72j780k365j865p62n56j793l013k418k40J500J399
52423G88353M4j144j390p30M75J597J955J548J194J614K675L852M924N922O830
52408H17719P722Q750R717J0120R871R351Q644P543O604P030Q764R765Q275N021
52394I34896K076K35j192k628l863n050o527p671p394n958m931n125n693n577
52380H75598m610l001q48J361K840L453L637L361K319J337J991M236N973N766
52366I03413M697M427M675L961J965j46j239r98K09J318J106l11j199m44P53P21
52350I22908O3Q41L316N339N262L901L119L635M835N858O214O004N991P034R114
$$ plain form
52454 844907 843294 840301 837370 834683 831478 827487 823613 821153 820583 821062 820963 818981 815047 810316 806246
52439 806246 803588 802199 801560 801118 800246 798466 796101 794236 793474 792918 791125 788112 785694 785454 786954 788353
52423 788353 788397 787253 785863 785133 785608 787205 789160 790708 791902 793516 796191 800043 804967 810889 817719
52408 817719 825441 834191 843908 854028 863899 873250 881894 889437 896041 903071 911835 921600 929875 934896
52394 934896 936972 937207 936015 933387 929524 924474 917947 910276 902882 896924 891993 886868 881175 875598
52380 875598 870988 867987 867139 868500 871340 874793 878430 881791 884110 885447 887438 891674 897647 903413
52366 903413 908110 912537 917212 921173 923138 922992 921753 920755 920964 922282 923388 923077 921878 921434 922187 922908
52350 922908 922971 923812 927128 932467 937729 941630 944749 948384 953219 959077 965291 971295 977286 984320 993434
52335I93434J1349J3191J5026J7226J9231K0128J9912J9679K0501K2321K4033
52324A196031K4683K4501K4553K5398K6508K7211K7733K8767L0282L1407L1507
52313A498581L0968L0782L1534L2810L3520L2985L1661L0550L0005K9693K9583
52302A842672K9982L0382K9436K6950K4713K4210K4313K2686J8937J4934J2122
52291B101337J0116Q121O312N198M503L414J466j045l197m085l964m428o600r222
$$ plain form
52335 993434 1004783 1017974 1033000 1050226 1069457 1089585 1109497 1129176 1149677 1171998 1196031
52324 1196031 1220714 1245215 1269768 1295166 1321674 1348885 1376618 1405385 1435667 1467074 1498581
52313 1498581 1529549 1560331 1591865 1624675 1658195 1691180 1722841 1753391 1783396 1813089 1842672
52302 1842672 1872654 1903036 1932472 1959422 1984135 2008345 2032658 2055344 2074281 2089215 2101337
52291 2101337 2111453 2119574 2125886 2131084 2135587 2139001 2140467 2139422 2136225 2132140 2128176 2123748 2117148 2107926
$$ [...]
##END NTUPLES=NMR SPECTRUM
##END=
