##TITLE=AC1552_ROEFFECT0015_8269144_1tQLPa4ePq
##JCAMPDX= 6.0         $$ Bruker NMR JCAMP-DX V2.0
##DATA TYPE= NMR SPECTRUM
##DATA CLASS= NTUPLES
##ORIGIN= BRUKER
##OWNER= Administrator
$$ 1.72 TOPSPIN		Version 2.1
$$ 2013-10-11 23:52:26.486 -0700  Administrator@X
$$ Compression mode = diff/dup
##.OBSERVE FREQUENCY= 400.02188249412
##.OBSERVE NUCLEUS= ^1H
##.ACQUISITION MODE= SIMULTANEOUS (DQD)
##.ACQUISITION SCHEME= undefined
##.AVERAGES= 8
##.DIGITISER RES= 22
##SPECTROMETER/DATA SYSTEM= spect
##.PULSE SEQUENCE= zg30
##.SOLVENT NAME= COFFEE_meoh
##.SHIFT REFERENCE= INTERNAL, COFFEE_meoh, 1, 14.98509
##AUDIT TRAIL= $$ (NUMBER, WHEN, WHO, WHERE, PROCESS, VERSION, WHAT)
$$ ##TITLE= Audit trail, TOPSPIN		Version 2.1
$$ ##JCAMPDX= 5.01
$$ ##ORIGIN= Bruker BioSpin GmbH
$$ ##OWNER= Administrator
$$ $$ E:\/data/COFFEE/nmr/AC1552_ROEFFECT0015_8269144_1tQLPa4ePq/10/pdata/1/auditp.txt
$$ ##AUDIT TRAIL=  $$ (NUMBER, WHEN, WHO, WHERE, PROCESS, VERSION, WHAT)
(   1,<2013-10-11 23:52:19.892 -0700>,<Administrator>,<X>,<go>,<TOPSPIN 2.1>,
      <created by zg
	started at 2013-10-11 23:51:13.611 -0700,
	POWCHK enabled, PULCHK disabled,
       configuration hash MD5:
       C8 4E 4E 5D D3 5C D8 9E 9F 52 82 E0 59 8A DE 15
       data hash MD5: 64K
       C6 FE 3E 90 ED 47 92 AC BF 95 CE 23 EB 45 B8 46>)
(   2,<2013-10-11 23:52:22.845 -0700>,<Administrator>,<X>,<proc1d>,<TOPSPIN 2.1>,
      <Start of raw data processing
       efp LB = 0 FT_mod = 6 PKNL = 1 PHC0 = 0 PHC1 = 0 SI = 32K 
       data hash MD5: 32K
       35 04 E0 01 9D 22 02 97 DF 28 28 50 24 DB E0 0B>)
(   3,<2013-10-11 23:52:23.189 -0700>,<Administrator>,<X>,<proc1d>,<TOPSPIN 2.1>,
      <pk PHC0 = 96.36108 PHC1 = 0 
       data hash MD5: 32K
       A3 DD 89 3F 05 4A 5E 7C 0C D3 7A 04 38 FB F9 C1>)
(   4,<2013-10-11 23:52:23.267 -0700>,<Administrator>,<X>,<proc1d>,<TOPSPIN 2.1>,
      <abs ABSG = 1 
       data hash MD5: 32K
       38 3E 64 31 E5 F9 28 90 31 A9 69 E4 BF 4E B4 20>)
(   5,<2013-10-11 23:52:23.329 -0700>,<Administrator>,<X>,<proc1d>,<TOPSPIN 2.1>,
      <abs ABSG = 2 
       data hash MD5: 32K
       A3 E3 E5 2C 73 69 C5 C1 DF 97 A0 9F FC 04 D5 F0>)
(   6,<2013-10-11 23:52:23.376 -0700>,<Administrator>,<X>,<proc1d>,<TOPSPIN 2.1>,
      <abs ABSG = 3 
       data hash MD5: 32K
       7C 86 A2 8A 3F A0 39 7B 21 68 59 24 B9 A3 73 43>)
(   7,<2013-10-11 23:52:23.454 -0700>,<Administrator>,<X>,<proc1d>,<TOPSPIN 2.1>,
      <abs ABSG = 4 
       data hash MD5: 32K
       ED 7F 1D E8 06 04 5A 60 78 F0 87 4F A7 86 C9 05>)
(   8,<2013-10-11 23:52:23.532 -0700>,<Administrator>,<X>,<proc1d>,<TOPSPIN 2.1>,
      <abs ABSG = 5 
       data hash MD5: 32K
       8F B5 B6 39 46 0E 2D BE E4 9E 90 D6 C5 9A 25 EE>)
$$ ##END=
$$ 
$$ $$ hash MD5
$$ $$ 04 AA A5 6E C6 B9 39 EE 09 D7 A2 CB 82 4C DF D9
##$RELAX= 
##$RELAX= 
##$RELAX= 
##$RELAX= 
##$RELAX= 
##$RELAX= 
##$RELAX= 
$$ Bruker specific parameters
$$ --------------------------
##$DU= <E:\>
##$EXPNO= 10
$$ [...]
150 150 150 150 150 150 150 150
##$TP07= 0
##$TPNAME0= <>
##$TPNAME1= <>
##$TPNAME2= <>
##$TPNAME3= <>
##$TPNAME4= <>
##$TPNAME5= <>
##$TPNAME6= <>
##$TPNAME7= <>
##$TPOAL= (0..7)
0.5 0.5 0.5 0.5 0.5 0.5 0.5 0.5
##$TPOFFS= (0..7)
0 0 0 0 0 0 0 0
##$TUNHIN= 0
##$TUNHOUT= 0
##$TUNXOUT= 0
##$USERA1= <user>
##$USERA2= <user>
##$USERA3= <user>
##$USERA4= <user>
##$USERA5= <user>
##$V9= 5
##$VALIST= <valist>
##$VCLIST= <CCCCCCCCCCCCCCC>
##$VD= 0
##$VDLIST= <DDDDDDDDDDDDDDD>
##$VPLIST= <PPPPPPPPPPPPPPP>
##$VTLIST= <TTTTTTTTTTTTTTT>
##$WBST= 1024
##$WBSW= 4
##$XGAIN= (0..3)
0 0 0 0
##$XL= 0
##$YL= 0
##$YMAX_a= 649168
##$YMIN_a= -552792
##$ZGOPTNS= <>
##$ZL1= 120
##$ZL2= 120
##$ZL3= 120
##$ZL4= 120
##$ABSF1= 14.98509
##$ABSF2= -5.573092
##$ABSG= 5
##$ABSL= 3
##$ALPHA= 0
##$AQORDER= 0
##$ASSFAC= 0
##$ASSFACI= 0
##$ASSFACX= 0
##$ASSWID= 0
##$AUNMP= <proc_prof1d_extract_pilot.lims>
##$AXLEFT= 0
##$AXNAME= <>
##$AXNUC= <1H>
##$AXRIGHT= 0
##$AXTYPE= 0
##$AXUNIT= <>
##$AZFE= 0.1
##$AZFW= 0.1
##$BCFW= 0
##$BC_mod= 0
##$BYTORDP= 0
##$COROFFS= 0
##$CY= 15
##$DATMOD= 1
##$DC= 0
##$DFILT= <>
##$DTYPP= 0
##$F1P= 0
##$F2P= 0
##$FCOR= 0.5
##$FTSIZE= 32768
##$FT_mod= 6
##$GAMMA= 0
##$GB= 0
##$INTBC= 1
##$INTSCL= 1
##$ISEN= 128
##$LB= 0
##$LEV0= 0
##$LPBIN= 0
##$MAXI= 10000
##$MC2= 0
##$MEAN= 0
##$ME_mod= 0
##$MI= 0
##$NCOEF= 0
##$NC_proc= -9
##$NLEV= 6
##$NOISF1= 0
##$NOISF2= 0
##$NSP= 0
##$NTH_PI= 0
##$NZP= 0
##$OFFSET= 14.98509
##$PC= 1
##$PHC0= 96.36108
##$PHC1= 0
##$PH_mod= 1
##$PKNL= yes
##$PPARMOD= 0
##$PPDIAG= 0
##$PPIPTYP= 0
##$PPMPNUM= 2147483647
##$PPRESOL= 1
##$PSCAL= 4
##$PSIGN= 0
##$PYNMP= <proc.py>
##$REVERSE= no
##$SF= 400.02
##$SI= 32768
##$SIGF1= 0
##$SIGF2= 0
##$SINO= 400
##$SIOLD= 32768
##$SPECTYP= <>
##$SREGLST= <1H.CDCl3>
##$SSB= 0
##$STSI= 32768
##$STSR= 0
##$SW_p= 8223.68421052631
##$SYMM= 0
##$S_DEV= 0
##$TDeff= 65536
##$TDoff= 0
##$TI= <>
##$TILT= no
##$TM1= 0
##$TM2= 0
##$TOPLEV= 0
##$USERP1= <user>
##$USERP2= <user>
##$USERP3= <user>
##$USERP4= <user>
##$USERP5= <user>
##$WDW= 1
##$XDIM= 32768
##$YMAX_p= 499185230
##$YMIN_p= -1391005
##$CURPLOT= <Network HP LaserJet P1505>
##$CURPRIN= <$Network HP LaserJet P1505>
##$DFORMAT= <normdp>
##$LAYOUT= <+/1D_H.xwp>
##$LFORMAT= <normlp>
##$PFORMAT= <normpl>
##$SURQMSG= 1
$$ End of Bruker specific parameters
$$ ---------------------------------
##NTUPLES= NMR SPECTRUM
##VAR_NAME=  FREQUENCY,     SPECTRUM/REAL,   SPECTRUM/IMAG
##SYMBOL=    X,             R,               I
##VAR_TYPE=  INDEPENDENT,   DEPENDENT,       DEPENDENT
##VAR_FORM=  AFFN,          ASDF,            ASDF
##VAR_DIM=   32768,         32768,           32768
##UNITS=     HZ,            ARBITRARY UNITS, ARBITRARY UNITS
##FACTOR=    0.250966925370066, 1,           1
##FIRST=     8223.43324360094, -118967,      -516915
##LAST=      0,             -271454,         -126768
##MIN=       0,             -1391005,        0
##MAX=       8223.43324360094, 499185230,    0
$$ Real data points
##PAGE= N=1
##DATA TABLE= (X++(R..R)), XYDATA
$$ [...]
19319a53061j22443C75743A44752D2267d64524A97534J54286A10823Q9447c92445
$$ -153061 -275504 375743 144752 42267 -464524 197534 351820 110823 200270 -392445
19308c75625d5677q60049c68313B44293F3794g34148B22215O3359G7391b3397
$$ -375625 -45677 -905726 -368313 244293 63794 -734148 222215 285574 77391 -23397
19297a004111a98724D9024d7304n62450J56455P7813a32487r7171B59573e89878
$$ -1004111 -198724 49024 -47304 -609754 -453299 -375486 -132487 -229658 259573 -589878
19286c21594k22139A25288b89931A8664b07506r3346a1267k07653F60181b98247
$$ -321594 -543733 125288 -289931 18664 -207506 -300852 -11267 -218920 660181 -298247
19275h00774a57977j0161M5634k6013r0393k13330D17013c55429B96936f41140
$$ -800774 -157977 -168138 -122504 -148517 -238910 -452240 417013 -355429 296936 -641140
19264a49460j50835B91995g894B07496a01505o5759n14775H15199A41380J6827
$$ -149460 -300295 291995 -7894 207496 -101505 -167264 -682039 815199 141380 158207
19254A58207a84711k98940j66858a60882a6383F7264e04766b4067A31104P4364
$$ 158207 -184711 -483651 -650509 -160882 -16383 67264 -504766 -24067 131104 205468
19244B05468g9515j89696A47444D0315M0704b43197J09015j01112I3605g210n3704
$$ 205468 -79515 -269211 147444 40315 81019 -243197 -134182 -235294 93605 -7210 -60914
19233f0914G08367a03431j98041k47327A17844c2789j49980A57366a43660A25489
$$ -60914 708367 -103431 -301472 -548799 117844 -32789 -182769 157366 -143660 125489
19222c24438A28579h004m14250R4771F63154c62016D45615b10200K5473B54126
$$ -324438 128579 -8004 -422254 -327483 663154 -362016 445615 -210200 -184727 254126
19211c42117A9009P4020a49066k10530A24537b81217j93145f994l09308A4398
$$ -342117 19009 93029 -149066 -359596 124537 -281217 -474362 -6994 -316302 14398
19200E37447e88819o141j74731K33791G08862f21105j14533h8906K2151k18003
$$ 537447 -588819 -594960 -769691 -535900 708862 -621105 -735638 -88906 -66755 -284758
19190b84758g8866j36276l04478D20201k7313A53792c20833D21173b4107E63743
$$ -284758 -78866 -215142 -519620 420201 392888 153792 -320833 421173 -24107 563743
19179i2890n24233B98815c54820D04179B4381a19706l71446H681c58346I35514
$$ -92890 -617123 298815 -354820 404179 24381 -119706 -491152 8681 -358346 935514
19168A80251e7294l7393k45647j12898J00155q0505a70399A50729a11643F97620
$$ 180251 -57294 -94687 -340334 -453232 -353077 -433582 -170399 150729 -111643 697620
19157c93808J88349j11154a51372j8231l66425o51193a91226C85479f22498a69820
$$ -393808 -205459 -316613 -151372 -169603 -536028 -1187221 -191226 385479 -622498 -169820
19146g819C3536g1931b6390A14120M4229a9760j67539j55811C64184a54738o36509
$$ -7819 33536 -71931 -26390 114120 158349 -19760 -187299 -343110 364184 -154738 -791247
19135g91247L70733k23661b53784C05656d42272H4312b80112a14047l10366J19459
$$ -791247 -420514 -644175 -253784 305656 -442272 84312 -280112 -114047 -424413 -304954
19125c04954n43896F3234g8464D16848A29426o2115d91088A66036a04118E24427
$$ -304954 -848850 63234 -78464 416848 129426 67311 -491088 166036 -104118 524427
19114A9522b21737j26544R3847c4930F5534c45640B07720g45932F56292e7782
$$ 19522 -221737 -348281 -254434 -34930 65534 -345640 207720 -745932 656292 -57782
19103a59451D5526f13647o3877a4082A14288e19358j51672D22502I9240g1601
$$ -159451 45526 -613647 -677524 -14082 114288 -519358 -671030 422502 99240 -71601
19092e12845b07079P8449F59579h1968B42674g50407G6013D523K74414i55818
$$ -512845 -207079 -128630 659579 -81968 242674 -750407 76013 4523 278937 -955818
19081a03170m46700B0965c06516a48598b3222m38869a98309D65193c50172i3744
$$ -103170 -549870 20965 -306516 -148598 -23222 -462091 -198309 465193 -350172 -93744
19070a04324F12506c38741B03257c56130A461d56033B98282a32858q9353o4237
$$ -104324 612506 -338741 203257 -356130 1461 -456033 298282 -132858 -222211 -286448
19060b86448a17625E7317a54543A86835G6240i8499a3679G3844a39626A95715
$$ -286448 -117625 57317 -154543 186835 76240 -98499 -13679 73844 -139626 195715
19049a48371j27119C36913C1310K76718b26243m89354C49519c57807J42940N1966
$$ -148371 -275490 336913 31310 308028 -226243 -715597 349519 -357807 -214867 -162901
19039a62901k7770A57386M18191j38962a49287D45177b9374A02602Q5146a080787
$$ -162901 -190671 157386 575577 436615 -149287 445177 -29374 102602 187748 -1080787
19028G75834A37001Q758j0921N8140I489R8774a50129A20697e74352E23825N9047
$$ 775834 137001 145759 134838 192978 9489 108263 -150129 120697 -574352 523825 582872
19017E82872d66476D77403k01173a36185l2006c2950m53356B33615J21446a052977
$$ 582872 -466476 477403 276230 -136185 -168191 -32950 -486306 233615 355061 -1052977
19006c45093L4426J25060j15491J21588l61794a53048j56714F8720M30389g43777
$$ -345093 -310667 -185607 -301098 -179510 -541304 -153048 -309762 68720 499109 -743777
18995F7674d3139I19662c19213J36762C69292A48337K22369j08157C9896K12325
$$ 67674 -43139 919662 -319213 -182451 369292 148337 370706 262549 39896 252221
18985B52221c07137l25584A78203a92219B86121A6835Q3824d65062A57555p0649
$$ 252221 -307137 -632721 178203 -192219 286121 16835 100659 -465062 157555 86906
18975H6906c61501a21473A05996a02569B16538p1667F1785b55113i8240k4635
$$ 86906 -361501 -121473 105996 -102569 216538 144871 61785 -255113 -98240 -122875
18965a22875n15953c7192B48335A12654c17023N8398M4772D9392c06452a3743
$$ -122875 -638828 -37192 248335 112654 -317023 -258625 -213853 49392 -306452 -13743
18954d39888C34753g310m79065A45859f49400f5454j86301A41484d8213D47189
$$ -439888 334753 -7310 -486375 145859 -649400 -65454 -251755 141484 -48213 447189
18943c49664n9789J95065j0233A75841a88861B59217b16189l01448k64729K69225
$$ -349664 -409453 -214388 -224621 175841 -188861 259217 -216189 -517637 -782366 -513141
18933e13141O6817E29821a029711H9696O05464a92446F5660c31244d7634k15054
$$ -513141 -446324 529821 -1029711 89696 695160 -192446 65660 -331244 -47634 -262688
18923b62688K392C32636a84931k29330i1180k54112i8160j55563b59A73484C1284
$$ -262688 -260296 332636 -184931 -414261 -91180 -345292 -98160 -253723 -259 173484 31284
18911C02897b96382A13423c46351d9200A4425a28401O855F12569c73586B91258
$$ 302897 -296382 113423 -346351 -49200 14425 -128401 -121546 612569 -373586 291258
18900d25857B7821b54897l75555A33080B6982b29690o6528C2770e28546J87212
$$ -425857 27821 -254897 -630452 133080 26982 -229690 -296218 32770 -528546 -341334
18890c41334A4831i70567c44688J30963r7594B48872e15238b4844l41886k00175
$$ -341334 14831 -970567 -344688 -213725 -311319 248872 -515238 -24844 -366730 -566905
18880e66905C53983P843A39310f00692b97373a32684q0285I3949a3611m21303
$$ -566905 353983 361826 139310 -600692 -297373 -132684 -212969 93949 -13611 -434914
18870d34914e4569o59567B92927j30259K11933H9905K33576A39327b09040a01889
$$ -434914 -54569 -714136 292927 162668 374601 89905 323481 139327 -209040 -101889
18859B49816c39648J09250l11899g6439m97124C01269b96740A01218a51122j068937
$$ 249816 -339648 -230398 -542297 -76439 -573563 301269 -296740 101218 -151122 -1220059
18849a220059a24309N1366J1262C46106c24353J20079B90786a34738B82421K36577
$$ -1220059 -124309 -72943 -61681 346106 -324353 -204274 290786 -134738 282421 518998
18839E18998a67674D92189a00727j40205J18121m90591d1391E2131Q2177P2945
$$ 518998 -167674 492189 -100727 -240932 -122811 -613402 -41391 52131 134308 207253
18829B07253K7039c75009A08046A6289M01268b1941k10532K0953l49967D01475
$$ 207253 234292 -375009 108046 16289 417557 -21941 -232473 -211520 -561487 401475
18818g97668C25525d74018B73094c60717a44210A89860D0237a91587l10913E11892
$$ -797668 325525 -474018 273094 -360717 -144210 189860 40237 -191587 -502500 511892
18807a83424n79561B51047e40759D96657b99547Q6726Q7468o3295E4330f78110
$$ -183424 -762985 251047 -540759 496657 -299547 -212821 -125353 -188648 54330 -678110
18796f8010j07073j59788j06766D68782h70839L88446B41955c8834p47420D68369
$$ -68010 -175083 -334871 -441637 468782 -870839 -482393 241955 -38834 -786254 468369
18785C46498e62502A73244N375J54256c61584C89151c9666j7223l35355k80240
$$ 346498 -562502 173244 178619 332875 -361584 389151 -39666 -56889 -392244 -672484
18775f72484I2002f52196A38899K56858j49846e80877A45087K16151a1443q00957
$$ -672484 92002 -652196 138899 395757 245911 -580877 145087 361238 -11443 -812400
18765h12400A75353f85493i9594l03583a39580b9175j310a0796m72414B98634
$$ -812400 175353 -685493 -99594 -403177 -139580 -29175 -30485 -10796 -483210 298634
18754c56615C28733a05713b8055l14274M589G3302h99452b8286m61163F2158J93783
$$ -356615 328733 -105713 -28055 -342329 -337740 73302 -899452 -28286 -489449 62158 255941
18743B55941b92153A02185g98996a98470E8083b8173j61570D6705K67266b72483
$$ 255941 -292153 102185 -798996 -198470 58083 -28173 -189743 46705 313971 -272483
18732c04532m85438C53805h0776H906a1346E6341a43880k03455a1648D09702b7460
$$ -304532 -789970 353805 -80776 8906 -11346 56341 -143880 -347335 -11648 409702 -27460
18720E81717B14051H3833e38289B57681d5070B18018g13437D63590i2634D8927
$$ 581717 214051 83833 -538289 257681 -45070 218018 -713437 463590 -92634 48927
18709d82397f5799j50229m67825a85105o30126a50268B66505j31719a71135d5527
$$ -482397 -65799 -216028 -683853 -185105 -815231 -150268 266505 134786 -171135 -45527
18698A94937c88649j45405d9254G43137f96192b63633c4450A06643L82604b71799
$$ 194937 -388649 -534054 -49254 743137 -696192 -263633 -34450 106643 489247 -271799
18687F41361b84295P6904o12388C06807a39874m5889n72289C97271A06740F608
$$ 641361 -284295 -207391 -819779 306807 -139874 -185763 -758052 397271 106740 6608
18676G8654g38969A0798b27507A82079J28125h2637B41588d93705a68581l97421
$$ 78654 -738969 10798 -227507 182079 310204 -82637 241588 -493705 -168581 -566002
18666e66002B27138K4425a53445a8402k89961I1167i8457A39087e13470a32244
$$ -566002 227138 251563 -153445 -18402 -308363 91167 -98457 139087 -513470 -132244
18655g5836C39146O59116f2997l94932d5522b2061k8316g128r83181d59843D46434
$$ -75836 339146 998262 -62997 -457929 -45522 -22061 -50377 -7128 -990309 -459843 446434
18643d10196C6737A8294M99931f50533e914m19999n79408E01414b28719f6315
$$ -410196 36737 18294 518225 -650533 -5914 -425913 -1005321 501414 -228719 -66315
18632C00032b40615E8375c31088B70957f370C90176c83344a68360j49257B09498
$$ 300032 -240615 58375 -331088 270957 -6370 390176 -383344 -168360 -317617 209498
18621c59807a37169k82247J89713A0642c66009k21443J52962B17640R9653a22097
$$ -359807 -137169 -419416 -229703 10642 -366009 -587452 -434490 217640 317293 -122097
18610h05578K95035a99429C9175d63331k34360B24596d09191j27069A9880a21555
$$ -805578 -510543 -199429 39175 -463331 -697691 224596 -409191 -536260 19880 -121555
18599h711r2762L2351F46a55040I6449K9743c64699n5585E35152d10875A70315
$$ -8711 -101473 -69122 646 -155040 96449 126192 -364699 -420284 535152 -410875 170315
18587a114179e34064a29383l7786D14699E1591M1725a52415O9714B40240e25967
$$ -1114179 -534064 -129383 -167169 414699 51591 93316 -152415 -82701 240240 -525967
18576b32255R1234C41324g52179c16030b4076l42877H896a54654L8298I939a98705
$$ -232255 -141021 341324 -752179 -316030 -24076 -366953 8896 -154654 -116356 9939 -198705
18564f95879E01633a006626A02424K05606c9133A35925b14709A41088b04006n6272
$$ -695879 501633 -1006626 102424 308030 -39133 135925 -214709 141088 -204006 -260278
18554b60278E42276b77140j597k1649E7197O7585a14473a327n34082A54525g73783
$$ -260278 542276 -277140 -278737 -300386 57197 124782 -114473 -1327 -535409 154525 -773783
18542b58310D6918Q8639J39307d87202e6103o18767D81697c74154A45444f25500
$$ -258310 46918 135557 274864 -487202 -56103 -674870 481697 -374154 145444 -625500
18531C08929e27495j48180B99335e11794E28021b92298B84605c89139N5477A56265
$$ 308929 -527495 -675675 299335 -511794 528021 -292298 284605 -389139 -333662 156265
18520d88730K27530A24445J33411F8555b25324B48559d01902a32496j66851B94728
$$ -488730 -261200 124445 257856 68555 -225324 248559 -401902 -132496 -299347 294728
18509h02957G56237g6046l49558D99890b97412A2644M02693a05089C30458r4298
$$ -802957 756237 -76046 -425604 499890 -297412 12644 415337 -105089 330458 236160
18499B36160J15555p3989E4557K31309d83502C40841K36861G9360f74966b18589
$$ 236160 351715 277726 54557 285866 -483502 340841 577702 79360 -674966 -218589
18488A72861g32863a71075G90796B06903L6661b00818P1109F16496j79732a11430
$$ 172861 -732863 -171075 790796 206903 243564 -200818 -129709 616496 436764 -111430
18477b7217l91133C33547a72268F13953c65904A81299P12705B07743i9697j40382
$$ -27217 -418350 333547 -172268 613953 -365904 181299 894004 207743 -99697 -240079
18467b40079C95505e96245A2457K4057g08050P9092E0058a36063j26616f5252
$$ -240079 395505 -596245 12457 36514 -708050 -628958 50058 -136063 -262679 -65252
18456c39818J64101E2587K66839b77446A64891B8667d65273J89243e207m91630
$$ -339818 -175717 52587 319426 -277446 164891 28667 -465273 -276030 -5207 -496837
18446d96837b00773i7613c8779j04454k65448D88279k17961d83637I1892J72941
$$ -496837 -200773 -97613 -38779 -143233 -408681 488279 270318 -483637 91892 264833
18436B64833b05776A25797g9630A0186e41276c8888k74014R9397B11648p6602
$$ 264833 -205776 125797 -79630 10186 -541276 -38888 -312902 -213505 211648 135046
18426A35046Q0725k3532K89757A72272R7877n1049d53747C57240D914K74561c3854
$$ 135046 215771 192239 481996 172272 270149 219100 -453747 357240 4914 279475 -33854
18414A90238J15296b3388j06211B58604b62200C75495b20788i9244j30045E4073
$$ 190238 305534 -23388 -129599 258604 -262200 375495 -220788 -99244 -229289 54073
18403h2065l1586J7877M4018j97434C86095o0275d23715E816b33937e3368F60622
$$ -82065 -113651 -95774 -51756 -249190 386095 325820 -423715 5816 -233937 -53368 660622
18391a93871k02581a4715m05250j35504a11891E35053a8219a995m88787b22893
$$ -193871 -396452 -14715 -419965 -555469 -111891 535053 -18219 -1995 -490782 -222893
18380A29562J22866b13885M8944A43475l6695K53401a69398A64565L05090a56908
$$ 129562 252428 -213885 -164941 143475 106780 360181 -169398 164565 469655 -156908
18369B10289J16500d06480k83206L25008a68975k5297C27257c61721D18130g0225
$$ 210289 326789 -406480 -689686 -364678 -168975 -194272 327257 -361721 418130 -70225
18358c45557Q9668l31081b73450j35266J40237d2597j8539b2500A02219d88087
$$ -345557 -255889 -586970 -273450 -408716 -268479 -42597 -61136 -22500 102219 -488087
18347b9028j88788j94392C33238d01254c9080C17907b24975j86422A5042a87107
$$ -29028 -217816 -412208 333238 -401254 -39080 317907 -224975 -411397 15042 -187107
18336e7034k29363A17052B2170K20010E140h52609M20733J60871i0808o52821
$$ -57034 -286397 117052 22170 242180 5140 -852609 -431876 -271005 -90808 -743629
18326g43629K71780j26443f8980n921k09259l13270a78993n44267K57334c6149
$$ -743629 -471849 -598292 -68980 -74901 -284160 -597430 -178993 -723260 -465926 -36149
18315c10803M3221m63541B87687a80379n2625l5385C54278c6424B24193a8059
$$ -310803 -267582 -731123 287687 -180379 -233004 -268389 354278 -36424 224193 -18059
18304f50637F63279B30990b81748D45352A54947g7825l26831C12911j51037a75988
$$ -650637 663279 230990 -281748 445352 154947 -77825 -404656 312911 161874 -175988
18293f50934A11156K5549R04e47464J71914B20878K77317k37330c19670J21607
$$ -650934 111156 136705 137609 -547464 -375550 220878 498195 260865 -319670 -198063
18283a98063o22375A92074c84796B05856e3098F6137J63848G9058a0103C58446
$$ -198063 -820438 192074 -384796 205856 -53098 66137 229985 79058 -10103 358446
18272b09327r833c7588j14526A96277g44394A19305c62269C61193i94106f7868
$$ -209327 -219160 -37588 -152114 196277 -744394 119305 -362269 361193 -994106 -67868
18261I7036c09325A74719g4393B1067c10907h0649m85532A67473K75642p1148
$$ 97036 -309325 174719 -74393 21067 -310907 -80649 -566181 167473 443115 371967
18251C71967g38820C42823J03579k19082g35333B04288f22543a71594A33499c29257
$$ 371967 -738820 342823 446402 227320 -735333 204288 -622543 -171594 133499 -329257
18240A49295E3915c59154a75234l60566c7653A5543h35603C86158a71673D4319
$$ 149295 53915 -359154 -175234 -535800 -37653 15543 -835603 386158 -171673 44319
18229i24095h0687o08299a6545D24880A69867K22139e94754C8294N3999i41536
$$ -924095 -80687 -688986 -16545 424880 169867 392006 -594754 38294 92293 -941536
18218B13935K67091a86494F13342c80771N609B23672J07431d04826g9927G6771
$$ 213935 481026 -186494 613342 -380771 -375162 223672 331103 -404826 -79927 76771
18207B15856e95626G38866C18129f13560A70799a80388j55029J49428B90082a32028
$$ 215856 -595626 738866 318129 -613560 170799 -180388 -335417 -185989 290082 -132028
18196A73455c48571J10469F35509A54084a0903E9274M4662J99873d3942H07989
$$ 173455 -348571 -238102 635509 154084 -10903 59274 103936 303809 -43942 807989
18185D62626a50899p3241O2883H04282C07019a50775k23083k55883b25482q794
$$ 462626 -150899 -224140 -161257 804282 307019 -150775 -373858 -629741 -225482 -234276
18175b34276k47131B7044N03837d19248a13111C09661j40951d34931J14697k58196
$$ -234276 -481407 27044 530881 -419248 -113111 309661 168710 -434931 -320234 -578430
18165e78430d3780m02144B52117b18372f8272k44896j16844m00964F5669B3121
$$ -578430 -43780 -445924 252117 -218372 -68272 -313168 -430012 -830976 65669 23121
18154D99189k02486i02625B19273b75024A71670l1755L8183K20084a118082C56275
$$ 499189 296703 -902625 219273 -275024 171670 139915 178098 398182 -1118082 356275
18143g7340j9894k0544j23080C56084c78983B7989h35828J47006B24768c63487
$$ -77340 -97234 -117778 -240858 356084 -378983 27989 -835828 -688822 224768 -363487
18132f42702D05331d4509E48012F4216D704N8520c03446b3104B02884e59762c5426
$$ -642702 405331 -44509 548012 64216 4704 63224 -303446 -23104 202884 -559762 -35426
18120f72998c2913B89512q7902a17556A35322e18406a08257k69214H1318b12257
$$ -672998 -32913 289512 201610 -117556 135322 -518406 -108257 -377471 81318 -212257
18109b30935C478d34955M3687b9514D32503a30729A14611J60720j13973b46514
$$ -230935 3478 -434955 -391268 -29514 432503 -130729 114611 275331 161358 -246514
18098d63846D7086M40267B34308E4563a38318A74511L168a14729A2126M8635a61811
$$ -463846 47086 487353 234308 54563 -138318 174511 177679 -114729 12126 60761 -161811
18086i51585D02231j77557J3201E2387a38930k10201i9294k3189n09545D6845
$$ -951585 402231 224674 237875 52387 -138930 -349131 -99294 -122483 -632028 46845
18075A2657b02242A67240N55085B30718N1004H4982b6945A39462b66423G4123
$$ 12657 -202242 167240 722325 230718 281722 84982 -26945 139462 -266423 74123
18064i1016C40373j60129c63536B12696g1912C41200g28946A82026A4017h24080
$$ -91016 340373 180244 -363536 212696 -71912 341200 -728946 182026 14017 -824080
18053A54505L40264b52307k226E47072c67677p4810l04346h8016D79670I1636
$$ 154505 494769 -252307 -254533 547072 -367677 -442487 -746833 -88016 479670 91636
18042A69826l1434a95385B71284c97097D27223A64858g28058b74240k43400D25348
$$ 169826 138392 -195385 271284 -397097 427223 164858 -728058 -274240 -517640 425348
18031D68188g3935q2075k70530e9272r77898C43827b0419G828b51634B14027K5973
$$ 468188 -73935 -156010 -426540 -59272 -1037170 343827 -20419 7828 -251634 214027 240000
18020B40000M8462j5811J9224g5592o7670k91566A07281J46743c12746A62987
$$ 240000 288462 272651 291875 -75592 -143262 -434828 107281 254024 -312746 162987
18009i31158i9498j06233D22782c07257J49330j53509l29732a39988o08702J77888
$$ -931158 -99498 -205731 422782 -307257 -157927 -311436 -641168 -139988 -748690 -570802
17999e70802A80047a56262P745A65838C6618e80867g1990k73462C05646e42574
$$ -570802 180047 -156262 -148517 165838 36618 -580867 -71990 -345452 305646 -542574
17988a57531A42723J13203L04129A95995a90504A96871a18516A61881N26858c47064
$$ -157531 142723 255926 560055 195995 -190504 196871 -118516 161881 688739 -347064
17977A13379b57371E87998a81735k08480l9051B92093b98347J0585D44769a9789
$$ 113379 -257371 587998 -181735 -390215 -429266 292093 -298347 -287762 444769 -19789
17966e31964D00720g93751G8007L82390a29491B52484a43140B33003a37424F05810
$$ -531964 400720 -793751 78007 460397 -129491 252484 -143140 233003 -137424 605810
17955h9811j61805j08576P4131E37576j41424a68755A24267b17269A15656d22432
$$ -89811 -251616 -360192 -286061 537576 396152 -168755 124267 -217269 115656 -422432
17944a27147I3380e67582D46790c6998m61943k95501F8796c22880A99727J66084
$$ -127147 93380 -567582 446790 -36998 -498941 -794442 68796 -322880 199727 365811
17934C65811g41436C10137j38044I688b8B9763i7546B9637h7910G65557D9174
$$ 365811 -741436 310137 172093 9688 -28 29763 -97546 29637 -87910 765557 49174
17922A01105K03472E5960J22654a61600A83931h52768c29256i9809k55867J330
$$ 101105 304577 55960 178614 -161600 183931 -852768 -329256 -99809 -355676 -354346
17912c54346a61661n91047E5912c74934l17139A28398F1204K29431E4355N19071
$$ -354346 -161661 -752708 55912 -374934 -692073 128398 61204 290635 54355 573426
17902E73426a29710d8144B67206Q9019o2853H2713n567g8009D36229f81700Q6725
$$ 573426 -129710 -48144 267206 356225 293372 82713 77146 -78009 436229 -681700 -594975
17891e94975D76189H0627b60975g4767B60539m9085e8429k19678B89091c38719
$$ -594975 476189 80627 -260975 -74767 260539 211454 -58429 -278107 289091 -338719
17880a87601r7041D54246A70125L41712p8921a59680F49380k41513d48629a44834
$$ -187601 -284642 454246 170125 511837 432916 -159680 649380 407867 -448629 -144834
17869b84968B43482k6891K91750A67119F1856A2660h44779a19571r7293q9436
$$ -284968 243482 216591 508341 167119 61856 12660 -844779 -119571 -216864 -306300
17859c06300L8375A11470d98327d3486I2573e9912j98393C43746k3318d00012
$$ -306300 -267925 111470 -498327 -43486 92573 -59912 -258305 343746 320428 -400012
17848a46207A91532c91667j96464i0615I2584e14056A33831J85875F7255a19144
$$ -146207 191532 -391667 -588131 -90615 92584 -514056 133831 319706 67255 -119144
17837F54109f4630K0937A50326b28530e7710b4401A83195J52814c19548B02235
$$ 654109 -64630 -43693 150326 -228530 -57710 -24401 183195 336009 -319548 202235
17826E640b31010k06005E9127R1395b55190A69672Q31h1672a2653j66908G2252
$$ 5640 -231010 -437015 59127 150522 -255190 169672 170503 -81672 -12653 -179561 72252
17814A30364c51546q3643C68427e61065J97201m19480b72491B52073e94097a56657
$$ 130364 -351546 -435189 368427 -561065 -363864 -783344 -272491 252073 -594097 -156657
17803c52849j29559b16573L582j4217q0625C0252e62015J24563a62531B11428
$$ -352849 -482408 -216573 -212991 -227208 -307833 30252 -562015 -437452 -162531 211428
17792A76268d13504j39252I75890d8587G0390e38715J024b00078C90791a91936
$$ 176268 -413504 -552756 975890 -48587 70390 -538715 -537691 -200078 390791 -191936
17781c02768A81026a20679C5251K26887g59668c78454b5757o57754C00294C7798
$$ -302768 181026 -120679 35251 262138 -759668 -378454 -25757 -683511 300294 37798
17770C40563L9695O2167j29241c1265B56731f17498b30168j88671b01374C04669
$$ 340563 380258 442425 313184 -31265 256731 -617498 -230168 -418839 -201374 304669
17759A73212p2451J98205c82086f8763A70286f2168r0141G9027J41426a0737j01165
$$ 173212 100761 298966 -382086 -68763 170286 -62168 -152309 79027 220453 -10737 -111902
17748a11902r2914B15063J20316d58517B36370d2891o59809g1489n41277B5325
$$ -111902 -204816 215063 335379 -458517 236370 -42891 -702700 -71489 -612766 25325
17737d61646B85609f0231B35285K13504B23787f1233C39026c92397A36667J92696
$$ -461646 285609 -60231 235285 448789 223787 -61233 339026 -392397 136667 329363
17727C29363K80655j41217b62609j58303A03580c6399k31702M3347j21687A79167
$$ 329363 610018 468801 -262609 -420912 103580 -36399 -268101 -224754 -346441 179167
17716a24603k07834B95287d46083B6779J74544d85777J17318e7539m66358a7006
$$ -124603 -332437 295287 -446083 26779 201323 -485777 -368459 -57539 -523897 -17006
17705D18696F6740M80830f68178C64943i9605B55698b3664j97533j16355d0216
$$ 418696 66740 547570 -668178 364943 -99605 255698 -23664 -221197 -337552 -40216
17694c83380I5517b81734A44814K76780A57680a90492B71082c154j35986j85825
$$ -383380 95517 -281734 144814 421594 157680 -190492 271082 -3154 -139140 -324965
17684c24965B21969d1185k4080E6314J73113b76670M6225k98577b00187F3739
$$ -324965 221969 -41185 -65265 56314 229427 -276670 -230445 -529022 -200187 63739
17673a82114d1398j7332B10925N2224J66110d81381I2306a47759l75948B61450
$$ -182114 -41398 -58730 210925 263149 429259 -481381 92306 -147759 -523707 261450
17662b09677A75589d31351J00266D49947g2858l43424E32545c26233B42532e40105
$$ -209677 175589 -431351 -331085 449947 -72858 -416282 532545 -326233 242532 -540105
17651d73879a71352q5579m07054A75735i4731l2444l06941A86850M77230g0845
$$ -473879 -171352 -256931 -663985 175735 -94731 -127175 -434116 186850 664080 -70845
17640c87485I6308j1100Q4341G6481Q8200f9167A57498N24299d9429n62885R8803
$$ -387485 96308 85208 169549 76481 164681 -69167 157498 681797 -49429 -612314 -513511
17629e13511J21497G8632M9605c46956F1069K19463L69342A5390d3386C6664N46080
$$ -513511 -392014 78632 128237 -346956 61069 280532 649874 15390 -43386 36664 582744
17618E82744E7785M3440K45482d68395N9348a67209j86835j79388e4471C40127
$$ 582744 57785 101225 346707 -468395 -409047 -167209 -354044 -533432 -54471 340127
17607e54874b05905B8877J28244J68856e84163E53401d45349A258R9464M1494
$$ -554874 -205905 28877 157121 325977 -584163 553401 -445349 1258 100722 142216
17597A42216d25362D3473J002319B23618K32454b50641A59918O22876c66534J02162
$$ 142216 -425362 43473 1045792 223618 456072 -250641 159918 782794 -366534 -264372
17587b64372O1369B16111F9188M07111g0435H566a84336e4250m10263J75941J18207
$$ -264372 -203003 216111 69188 476299 -70435 8566 -184336 -54250 -464513 -288572 -170365
17576a70365A14858a17575B96481b44557C85595J63298b40353B56639b67324j80243
$$ -170365 114858 -117575 296481 -244557 385595 548893 -240353 256639 -267324 -447567
17566d47567B77047J57521d78566a7501B41254F0586N07426A03628M42362K65064
$$ -447567 277047 434568 -478566 -17501 241254 60586 568012 103628 545990 811054
17556H11054B90614b56576B49058a00242B1654J6312M26061B03655I9903e3632
$$ 811054 290614 -256576 249058 -100242 21654 37966 464027 203655 99903 -53632
17545f34191D80236i4978C18548j40259H6980b49033B34370b22413G25671j84457
$$ -634191 480236 -94978 318548 178289 86980 -249033 234370 -222413 725671 541214
17535E41214B60457d1087l50219E1664O08838i5641F3193a02510A67756G5760
$$ 541214 260457 -41087 -391306 51664 660502 -95641 63193 -102510 167756 75760
17524F5946b9695D66798a94118A46903d19983A22054M24033A14165L33574A2257
$$ 65946 -29695 466798 -194118 146903 -419983 122054 546087 114165 447739 12257
17513D98879n0172a4128C61270M2917A84716a10602E55739N21218C82945e30276
$$ 498879 448707 -14128 361270 404187 184716 -110602 555739 1076957 382945 -530276
17502G73421b3466I4631b0389j54798k61248G50370J09081e05908a59287B36879
$$ 773421 -23466 94631 -20389 -175187 -436435 750370 859451 -505908 -159287 236879
17491b21445E83430B18114G9455a01974B05407J02825h2110E46225j62018j11518
$$ -221445 583430 218114 79455 -101974 205407 308232 -82110 546225 384207 272689
17481B72689A00643L6467a85704D25881K61611k39992A01135A3172O36504i2755
$$ 272689 100643 137110 -185704 425881 687492 447500 101135 13172 649676 -92755
17470b12266D31473L7091k30598c85456B38025a32481F43191G7143N15515E0729
$$ -212266 431473 468564 237966 -385456 238025 -132481 643191 77143 592658 50729
17459G7014a36864D6267N3082e7305E15241j50688R7159k28621Q0340e1406E61618
$$ 77014 -136864 46267 99349 -57305 515241 364553 461712 233091 313431 -51406 561618
17447C87690O37800l71088k73699J54312k56470a7278D72996o7231j47214J94140
$$ 387690 1025490 654402 380703 535015 278545 -17278 472996 405765 258551 452691
17437D52691J27083k43529M10809C52069h8106k1415C7666K66962q4257a67695
$$ 452691 579774 336245 747054 352069 -88106 -109521 37666 304628 220371 -167695
17426A64099M68302q3648A65171L72224m0140a04591d5148B04364c09195i2295
$$ 164099 632401 548753 165171 537395 497255 -104591 -45148 204364 -309195 -92295
17415c86635D24565c09728D32380g04665C64470n9289J13757p0083o0683P0504
$$ -386635 424565 -309728 432380 -704665 364470 305181 418938 348855 288172 358676
17405C58676J30110R1671j85712C9553K78265c28493B45081M27353f6167j90290
$$ 358676 488786 580457 394745 39553 317818 -328493 245081 672434 -66167 -256457
17395b56457F20570k52690K00463B64890j25787O00422a73213D35633F6498K13851
$$ -256457 620570 367880 568343 264890 139103 739525 -173213 435633 66498 280349
17385B80349a64076A61812A2769b32335B50379B6607J03884b56527C22898J2115
$$ 280349 -164076 161812 12769 -232335 250379 26607 130491 -256527 322898 335013
17375C35013I7562M92440M13815c91724R6959F10006b09438a03134A2179c92979
$$ 335013 97562 590002 1003817 -391724 -294765 610006 -209438 -103134 12179 -392979
17364A6814N24393B33890J80136b40736G7999R45914n4486l23980A87597a68370
$$ 16814 541207 233890 414026 -240736 77999 1023913 969427 645447 187597 -168370
17353C09547M6237M03741c24009D23235L49225d34343A75125e34395R4259I00125
$$ 309547 355784 759525 -324009 423235 772460 -434343 175125 -534395 -440136 900125
17342B97432K17014A75658b7404A27770j139d80138A95189r3078L00373a1101
$$ 297432 514446 175658 -27404 127770 126631 -480138 195189 102111 402484 -11101
17331i1390B14998N10997l17188L72369c04289C47080L7957I1935J67963P5816
$$ -91390 214998 725995 408807 781176 -304289 347080 385037 91935 259898 335714
17321C35714A44322N56235b65531Q8612D6503J238589B23749J54168n0026m1338
$$ 335714 144322 700557 -265531 -176919 46503 1285092 223749 377917 327891 286553
17311B86553L48248K43309H887M08564A03992a36901n2941H98867b12643B94109
$$ 286553 634801 878110 8887 417451 103992 -136901 -189842 898867 -212643 294109
17300a07817j47169B27641J57097N19882a89770C37260E7166a46263C06119J21909
$$ -107817 -254986 227641 384738 904620 -189770 337260 57166 -146263 306119 428028
17290D28028p1114L16302B75140L29263A1674N80056k69700a80034D55052K831
$$ 428028 356914 673216 275140 604403 11674 591730 322030 -180034 455052 457883
17280D57883N5034A58433L41413c18903F36457A86193K80968c79825A30497b31887
$$ 457883 512917 158433 499846 -318903 636457 186193 467161 -379825 130497 -231887
17269I77007l54162j06893k28569A14133N2670L18962A03994j5001J07685O16782
$$ 977007 622845 515952 287383 114133 166803 485765 103994 88993 196678 813460
17259H13460l62320A2587K88435L11396r2966l1319A3822c10478F07696K56180
$$ 813460 451140 12587 301022 612418 519452 488133 13822 -310478 607696 863876
17249H63876B70932J19805J52831J49612B27822o487F2944j769N9364a3374E42290
$$ 863876 270932 390737 543568 693180 227822 221335 62944 61175 120539 -13374 542290
17237C14454K50754J68972j31135D1988D866J55963K62350o6889p9640n8663K10848
$$ 314454 565208 734180 603045 41988 4866 160829 423179 356290 276650 217987 428835
17226D28835B10915j2258l7017L55407F1574O4198J2414N6019h3935C57536K35642
$$ 428835 210915 198657 161640 517047 61574 125772 138186 194205 -83935 357536 593178
17215E93178B93440L03724k22828B4247Q62136D12413c11334H99719j54256A46723
$$ 593178 293440 597164 374336 24247 886383 412413 -311334 899719 745463 146723
17204C97343a4932G49048a63952I80078l40464C05712o5800K72915J75317k68178
$$ 397343 -14932 749048 -163952 980078 639614 305712 239912 512827 688144 419966
17194D19966R4440p8064a99725m5758C03277N78165C20421L46185c21895B35728
$$ 419966 514406 436342 -199725 -245483 303277 881442 320421 666606 -321895 235728
17183a62940B86294L39663I2420b1350I3046c2058C80683K45660B27799a62336
$$ -162940 286294 625957 92420 -21350 93046 -32058 380683 626343 227799 -162336
17172F72532k4290O28876C07379P0639A01980Q34245k68208k56780a53151C07624
$$ 672532 648242 1277118 307379 378018 101980 936225 668017 411237 -153151 307624
17161c6420C40119j19378m466L49460k01442G2199N68075j92485M05145O306k65789
$$ -36420 340119 220741 216275 565735 364293 72199 640274 447789 852934 859240 593451
17150E93451K4588J26648C36900N11350J15960m06776k7325p1470j58542j3958
$$ 593451 618039 744687 336900 848250 964210 557434 530109 458639 300097 286139
17140B86139J06458o7799K8117G8305J72494b146G99382L70062j58653a835A87034
$$ 286139 392597 324798 352915 78305 250799 -2146 799382 1169444 1010791 -1835 187034
17128G87898l89133j63351L55220P3315j23098m6573J80981l28M88226E15632
$$ 787898 398765 235414 590634 663949 540851 494278 675259 674931 1163157 515632
17117F29818j44046A34478L07948L002K15281j45606c6223F72914b18870F78549
$$ 629818 485772 134478 442426 445428 660709 515103 -36223 672914 -218870 678549
17106H35174N6291n6715k71211K96441k80857D5067Q0022R83011J86279k96116
$$ 835174 891465 834750 563539 859980 579123 45067 125089 1108100 1294379 998263
17096I98263j13267O31536C86237R25396D59020L87200K11520k77077k94794R81326
$$ 998263 884996 1516532 386237 1311633 459020 846220 1057740 780663 485869 1467195
17086A467195n44382O0672q8915K35883l76907K61263p8063m18941O23572l91393
$$ 1467195 922813 983485 894570 1130453 753546 1014809 936746 517805 1141377 749984
17076G49984P073r3397j93947P1384P24277m99039L89099L23722n49770j6822
$$ 749984 757057 663660 469713 541097 1265374 766335 1155434 1479156 929386 912564
17066I12564J70239l86250P72047l61684j36735M07050o20307M28760m48701N40413
$$ 912564 1082803 696553 1468600 1106916 970181 1377231 756924 1185684 736983 1277396
17056A277396N8025j80356l21372Q57157o24219k50698N8010O79855j23802E06404
$$ 1277396 1335421 1155065 833693 1690850 1066631 815933 873943 1553798 1429996 506404
17045A068935P54043p18759m81391Q76144l34635j77346L97376K8966J20746J55981
$$ 1068935 1822978 1104219 622828 1498972 1164337 986991 1384367 1413333 1534079 1690060
17035A690060G82834N97176j70099p6451K80440l97156J55934L23486m3232n56846
$$ 1690060 782834 1380010 1209911 1133460 1413900 1016744 1172678 1496164 1452932 896086
17025H96086Q45248k08590M28452o63588k24901k30827P43192K98771l51677l08718
$$ 896086 1741334 1532744 1961196 1297608 1072707 841880 1585072 1883843 1532166 1223448
17015A223448j26489P38513o52599Q65053p07138P49804k93367k78998m82899
$$ 1223448 1096959 1835472 1182873 2047926 1340788 2090592 1797225 1518227 1035328
17006A035328K70528M23477K13609o26815M57253L98204m53700j19216n7515J39688
$$ 1035328 1305856 1729333 1942942 1316127 1773380 2171584 1717884 1598668 1541153 1680841
16996A680841l1407J13603J34045o98616J051278q14911J70703K36885k09652
$$ 1680841 1649434 1763037 1897082 1198466 2249744 1434833 1605536 1842421 1632769
16987A632769N48158M38025A304416N66302m46523O18628n2068J84897L76007
$$ 1632769 2180927 2618952 1304416 1870718 1424195 2042823 1990755 2175652 2551659
16978B551659o42630P7688M42193m16555k0673n9596Q82924r02327L40374P8650
$$ 2551659 1909029 1986717 2428910 2012355 1991682 1932086 2815010 1912683 2253057 2331707
16968B331707l88743K42531O61195o31434P89019j60754j78337j61212N5144K5582
$$ 2331707 1942964 2185495 2846690 2215256 3004275 2843521 2665184 2503972 2559116 2584698
16958B584698k22742O3262J012241q98798J00488J043220j206669K673N41038
$$ 2584698 2361956 2425218 3437459 2538661 2639149 3682369 2475700 2478373 3019411
16949C019411o23118P74881k73891M07220p30627J29113O41493J0083l40568P2906
$$ 3019411 2396293 3171174 2897283 3304503 2573876 2702989 3344482 3354565 3013997 3086903
16939C086903K12264m07383J32771M14248j40704N66521m11047K2113j67752K34726
$$ 3086903 3299167 2891784 3024555 3438803 3298099 3864620 3453573 3475686 3307934 3542660
16929C542660O6543K17705l25591K71852Q40288n29260L54147q51332J172219
$$ 3542660 3609203 3826908 3501317 3773169 4613457 4084197 4438344 3587012 4759231
16920D759231n18912j14554M75544l7527m28108M61723k15599L26002L00139L78342
$$ 4759231 4240319 4125765 4601309 4563782 4135674 4597397 4381798 4707800 5007939 5386281
16910E386281l25999k85450L38099j26996Q2075J93948N81061j78644j84134j96049
$$ 5386281 5060282 4774832 5112931 4985935 5068010 5261958 5843019 5664375 5480241 5284192
16900E284192M67154k19710M3223N27395M19595J96630j260073J063231k56067
$$ 5284192 5751346 5531636 5574859 6102254 6521849 6718479 5458406 6521637 6265570
16891F265570n78466Q88659L05879j09112n8670Q65445o16317K65933K5741L87609
$$ 6265570 5687104 6575763 6881642 6772530 6713860 7579305 6962988 7228921 7254662 7642271
16881G642271n83326M93781M62252M96371l67670O77117o44730N05008m40693
$$ 7642271 7058945 7552726 8014978 8511349 8143679 8820796 8176066 8681074 8240381
16872H240381J110382J09356k63619r2405J18708O5699O26363M6454N21036m85660
$$ 8240381 9350763 9460119 9196500 9104095 9222803 9288502 9914865 9961319 10482355 9996695
16862I996695O07036J85024l82246J226718j43864J58980P3610k57708Q97081
$$ 9996695 10603731 10788755 10406509 11633227 11489363 11648343 11721953 11464245 12361326
16853A2361326J71390N24732M4150m32299O39147N23822K32816P91955j42921
$$ 12361326 12532716 13057448 13101598 12669299 13308446 13832268 14065084 14857039 14714118
16844A4714118K44865L85629J35742L83001n50790J334642m55656J026331k32068
$$ 14714118 14958983 15344612 15480354 15863355 15312565 16647207 16191551 17217882 16985814
16835A6985814P20620Q70491j32203Q10374L92682Q91260O51104q14739Q39936
$$ 16985814 17706434 18576925 18444722 19255096 19647778 20539038 21190142 20375403 21215339
16826B1215339R57215J67178L94560P13018j17111J896646J72480j6215N83526
$$ 21215339 22172554 22339732 22734292 23447310 23330199 25226845 25399325 25383110 25966636
16817B5966636L58255P81537J98212J593082M20091O48503J104946Q58659J086390
$$ 25966636 26324891 27106428 27304640 28897722 29317813 29966316 31071262 31929921 33016311
16808C3016311m197J158589L42398J289163M01442J065091J361262J074900J198862
$$ 33016311 33012114 34170703 34513101 35802264 36203706 37268797 38630059 39704959 40903821
16799D0903821k3914K065880Q12072J167649J043399Q53095J070533J503848J374307
$$ 40903821 40879907 42945787 43757859 44925508 45968907 46822002 47892535 49396383 50770690
16790E0770690O31621K081032Q91336J635487J293726J991277J272283N47343
$$ 50770690 51402311 53483343 54374679 56010166 57303892 59295169 60567452 61114795
16782F1114795K759923J261870R39432K194973K011990J801437K203770K126624
$$ 61114795 63874718 65136588 66076020 68270993 70282983 72084420 74288190 76414814
16774G6414814J209644J682014K138336K375193J295559J913676K827088J170897
$$ 76414814 77624458 79306472 81444808 83820001 85115560 87029236 89856324 91027221
16766I1027221K291998L230220J752845K296673J617480L261181J921840K781328
$$ 91027221 93319219 96549439 98302284 100598957 102216437 105477618 107399458 110180786
16758A10180786L281800J899180K987377K824185K154198L285086K757429K938678
$$ 110180786 113462586 115361766 118349143 121173328 123327526 126612612 129370041 132308719
16750A32308719L263364L028349K820587K490365L317043K877189K455131M452650
$$ 132308719 135572083 138600432 141421019 143911384 147228427 150105616 152560747 157013397
16742A57013397K830730L197973K404262L467557L616068L323079K644511L226157
$$ 157013397 159844127 163042100 165446362 168913919 172529987 175853066 178497577 181723734
16734A81723734K968025K914315K555959L475821J471058K502613L014856N28301
$$ 181723734 184691759 187606074 190162033 193637854 195108912 197611525 200626381 201154682
16726B01154682K477288J272638J092879J074597J647254N84119N8030L24431
$$ 201154682 203631970 204904608 205997487 207072084 208719338 209303457 209361487 209685918
16718B09685918l54986k45454m96557q15151j551102j325769j432745k223442
$$ 209685918 209330932 209085478 208588921 207773770 206222668 204896899 203464154 201240712
16710B01240712j981799j952355k609241l551928k931978m027660m156853l461514
$$ 201240712 199258913 197306558 194697317 191145389 188213411 184185751 180028898 176567384
16702A76567384l908399m364262m843352m059199n113466m613160n350701m556069
$$ 176567384 172658985 168294723 163451371 159392172 154278706 149665546 144314845 139758776
16694A39758776n175568m800342m762687m872579m850061m625363m360369m499425
$$ 139758776 134583208 129782866 125020179 120147600 115297539 110672176 106311807 101812382
16686A01812382m960189l770214m104907m301005l954766k129254l458275m007492
$$ 101812382 96852193 93081979 88977072 84676067 80721301 78592047 75133772 71126280
16678G1126280l160426l649445k407790k958768l505730j755288l580814j433819
$$ 71126280 67965854 64316409 61908619 58949851 55444121 53688833 50108019 48674200
16670D8674200j981453k488443k553771j560319k343103j596350j879820j793704
$$ 48674200 46692747 44204304 41650533 40090214 37747111 36150761 34270941 32477237
16662C2477237j853677j454652n48726j588341j075788j196290j169172j212049
$$ 32477237 30623560 29168908 28620182 27031841 25956053 24759763 23590591 22378542
16654B2378542l35640j60406j625318n96664n08412n09494m91376n23005n97850
$$ 22378542 22042902 21882496 20257178 19660514 19152102 18642608 18151232 17628227 17030377
16645A7030377p53049k02039m81580n06666q20388o1992l4853o55448K75044j198801
$$ 17030377 16277328 16075289 15593709 15087043 14266655 14204663 14169810 13514362 13789406 12590605
16635A2590605J1469o69222L54743q66665l22173j27971r9601q90242J45433q6017
$$ 12590605 12602074 11932852 12287595 11420930 11098757 10970786 10871185 9980943 10126376 10040359
16625A0040359p50415k95269K70585J30664Q808r22903P29070m86303p80430L85024
$$ 10040359 9289944 8994675 9265260 9395924 9404732 8481829 9210899 8724596 7944166 8329190
16615H329190n11135K8581J52648p23723l2289k76879q934j26210J97489l00591
$$ 8329190 7818055 7846636 7999284 7275561 7243272 6966393 6957459 6831249 7028738 6728147
16605F728147L6043p14102L36139M19462o82277j48843j67365j70761O59115O0147
$$ 6728147 6764190 6050088 6386227 6805689 6123412 5974569 5807204 5636443 6295558 6355705
16595F355705m28898o38356n83988P88571l57883q2767k05228P72652j116942
$$ 6355705 5926807 5288451 4704463 5493034 5135151 5052384 4847156 5619808 4502866
16586D502866N13559j78446K6253K23258n74297m37505J11569j69856L10635O08341
$$ 4502866 5016425 4837979 4864232 5087490 4513193 4075688 4187257 4017401 4328036 4936377
16576D936377j053461J21484K29198k23014k31760N93196q63179L39206p50441
$$ 4936377 3882916 4004400 4233598 4010584 3778824 4372020 3508841 3848047 3097606
16567C097606L49224n79361R45945R0048o79483K32142L69739k16907n36231P49281
$$ 3097606 3446830 2867469 3813414 3903462 3223979 3456121 3825860 3608953 3072722 3822003
16557C822003q63339J07363J68323K68997n10427J46726o84000N10590J87628
$$ 3822003 2958664 3066027 3234350 3503347 2992920 3139646 2455646 2966236 3153864
16548C153864k18402p26971K42197J75575m41951P04434k70652K04090j46672
$$ 3153864 2935462 2208491 2450688 2626263 2184312 2888746 2618094 2822184 2675512
16539B675512j99175M8968k92180L55777L39342m22225n00504N17792M6120q40827
$$ 2675512 2476337 2525305 2233125 2588902 2928244 2506019 2005515 2523307 2569427 1728600
16529A728600O00080l9288L72531n49830K10961J88110m4190l34327J00013k2300
$$ 1728600 2328680 2289392 2661923 2112093 2323054 2511164 2466974 2132647 2232660 2210360
16519B210360K46172k0200k53448o25059K19421K97462j64456k93703K58523k93407
$$ 2210360 2456532 2436332 2182884 1557825 1777246 2074708 1910252 1616549 1875072 1581665
16509A581665L24699o73978L38575q4355J26155K18150j82979l6733Q6137l15906
$$ 1581665 1906364 1232386 1570961 1486606 1612761 1830911 1647932 1611199 1697336 1381430
16499A381430n7458k8071L04495L68665j64166j54903O3794j54711P0029L83898
$$ 1381430 1323972 1295901 1600396 1969061 1804895 1649992 1713786 1559075 1629104 2013002
16489B013002j66746p82198K04563M64227K1829l83182K19025M21466o14127n4892
$$ 2013002 1846256 1064058 1268621 1732848 1754677 1371495 1590520 2011986 1397859 1342967
16479A342967K51211M9598p00787M20792J61622k01532l65164K25924m62515O81106
$$ 1342967 1594178 1643776 942989 1363781 1525403 1323871 958707 1184631 722116 1403222
16469A403222j16098N84122F87750N45448N7424l95791Q52235n18575m56419P4131
$$ 1403222 1287124 1871246 687750 1233198 1290622 894831 1747066 1228491 772072 846203
16459H46203l03655K68796O41836l17252k7338L82978j11395o01588P03205E96595
$$ 846203 542548 811344 1453180 1135928 1108590 1491568 1380173 778585 1481790 596595
16448A165347n39631K72805l7712K40363J11801m1706k26866M67874L75535F89208
$$ 1165347 625716 898521 860809 1101172 1212973 1171267 944401 1412275 1787810 689208
16437I05211k69640N19531d7050A060445l28367M31434m28666J21144M36799E70809
$$ 905211 635571 1155102 -47050 1060445 732078 1163512 734846 855990 1292789 570809
16426I75216D48561L47830L98132n09668O65406l98981M92945K95228H15047k3752
$$ 975216 448561 796391 1194523 684855 1350261 951280 1444225 1739453 815047 791295
16416G91295l52684M36046K30321k09584J68947j99173M89497E38058R92158j07326
$$ 791295 438611 874657 1104978 895394 1064341 865168 1354665 538058 1530216 1422890
16406A422890D56906L70055A92374O70989K43940j17089J8383l69679Q74490o34460
$$ 1422890 456906 826961 192374 863363 1107303 990214 1008597 638918 1513408 878948
16396H78948l73970I319Q68950M21025E31430J59092K37366C76334L05407K96603
$$ 878948 504978 9319 878269 1299294 531430 690522 927888 376334 681741 978344
16386I78344j87014l85102A99882Q64605l07298k00951l6632K22891k01142J20
$$ 978344 791330 406228 199882 1064487 757189 556238 519606 742497 541355 541475
16376E41475O26815J2238E1343M51853P18806N3292o00791Q50029D29995M11481
$$ 541475 1168290 1180528 51343 503196 1222002 1275294 674503 1524532 429995 841476
16366H41476p1936A96385K37497P28289l82340R1701L97697l46928l37232a55217
$$ 841476 769540 196385 433882 1162171 779831 871532 1269229 922301 585069 -155217
16355D94231j28676J71144K82382D04838O13669k78619L55397k21337m6937M3929
$$ 494231 365555 536699 819081 404838 1018507 739888 1095285 873948 827011 870940
16345H70940B17582q8260P62033j16821K18475K10333k71316j71402M2126o9117
$$ 870940 217582 129322 891355 774534 993009 1203342 932026 760624 802750 733633
16335G33633a73872C95959Q45005D10356p603K67284J13671L96990l04947A64297
$$ 733633 -173872 395959 1240964 410356 402753 670037 783708 1180698 875751 164297
16324G59835o294d4764D61655L64840C87697A50188O85017J6098M85123E17693
$$ 759835 753541 -44764 461655 826495 387697 150188 835205 851303 1336426 517693
16313E12805b3105C14980o5993J047173F14705L4830K81488C85011A47841K72746
$$ 512805 -23105 314980 248987 1296160 614705 649535 931023 385011 147841 420587
16303D20587Q4266L73322B80435L59209K37361l74802J11111j70986L06210Q1089
$$ 420587 504853 878175 280435 639644 877005 502203 613314 442328 748538 829627
16293H29627k94728K65220B94589Q89163C27084g7838D22906j70858K00835J37131
$$ 829627 534899 800119 294589 1183752 327084 -77838 422906 252048 452883 590014
16283E90014M966k84302N71717B30082K9313a46929g163G84019B20611H6790N33244
$$ 590014 594980 310678 882395 230082 259395 -146929 -7163 784019 220611 86790 620034
16272F20034M48147C44993M89607H6253M01483K13727l12626b7335F35021F5351
$$ 620034 1068181 344993 834600 86253 487736 701463 388837 -27335 635021 65351
16261E90277c73987D00362O1720C9227a5150j18353B87392K15341L0268M79576
$$ 590277 -373987 400362 462082 39227 -15150 -133503 287392 502733 533001 1012577
16251A012577A16705L47263k04983p3586J95193c4369E26172j73640J03948h0580
$$ 1012577 116705 463968 258985 185399 380592 -34369 526172 352532 456480 -80580
16240E36581A61732B6424l160M13680C8970L24715j78378M20224K74994A99293
$$ 536581 161732 26424 23264 436944 38970 363685 185307 605531 880525 199293
16229I4137K56988A37824P0456a67659a7909F29386k78207L78179K45560A74423
$$ 94137 351125 137824 208280 -167659 -17909 629386 351179 729358 974918 174423
16218F6867O27905C03043o0576K43601a7219C46425a06744B80531K80520b03845
$$ 66867 694772 303043 242467 486068 -17219 346425 -106744 280531 561051 -203845
16207E48087a19830A278804e9669l01568D40706F6232J88547J18654d15913E92265
$$ 548087 -119830 1278804 -59669 -361237 440706 66232 254779 373433 -415913 592265
16196A92190M21525c1373A23138L01263n4910j14613J40991g4198A19081O60759
$$ 192190 613715 -31373 123138 424401 369491 254878 395869 -74198 119081 779840
16186G79840k40542a13240B18999K11838j5347k05556J49468L66204b81604H1222
$$ 779840 539298 -113240 218999 430837 415490 209934 359402 725606 -281604 81222
16175G7434c37714A28902K85931d16507C44367J44201j958j12292b09333A83302
$$ 77434 -337714 128902 414833 -416507 344367 488568 486610 374318 -209333 183302
16164E33361j48478P4316A29673O20939a03300o548l6971B91418J64044c98385
$$ 533361 384883 459199 129673 750612 -103300 -109848 -146819 291418 455462 -398385
16153g5779j27759B31422I232N9594f65238D12432e68740A92450Q8354L21422
$$ -75779 -203538 231422 9232 68826 -665238 412432 -568740 192450 280804 602226
16143F02226a0576C14118J82088h0091D22647b33428j34164J3112B07658F0600
$$ 602226 -10576 314118 496206 -80091 422647 -233428 -367592 -354480 207658 60600
16132C10056f244m50878C22397B2892b75834A34631d06061C39277d10237C50720
$$ 310056 -6244 -457122 322397 22892 -275834 134631 -406061 339277 -410237 350720
16121E41035m3307b47790r098A41948B0318K56970r9309a00194A96733M34815
$$ 541035 497728 -247790 -256888 141948 20318 277288 177979 -100194 196733 631548
16111F31548l02562c25607A02150N84035A62819c0891A018654g25115G7198N49950
$$ 631548 328986 -325607 102150 686185 162819 -30891 1018654 -725115 77198 627148
16101F27148D1583e81047B55864C1016N8224M28100K32462l07940K3204A92579
$$ 627148 41583 -581047 255864 31016 89240 517340 749802 441862 465066 192579
16090I9229K48543A73473m7161O40628A37372J59476H0816P036e37222h7431r8508
$$ 99229 347772 173473 126312 766940 137372 296848 80816 87852 -537222 -87431 -185939
16079a85939A9249e57083b46124j86222C24624b95902B28838b50019B5059N25892
$$ -185939 19249 -557083 -246124 -432346 324624 -295902 228838 -250019 25059 550951
16069E50951a96919J4787F31121a18864H4685d74807B23011a13688A06008K63927
$$ 550951 -196919 -182132 631121 -118864 84685 -474807 223011 -113688 106008 369935
16059C69935b96936E6425L33419K22052g7322A76179c47556B78100b33468R4825
$$ 369935 -296936 56425 389844 611896 -77322 176179 -347556 278100 -233468 -138643
16049a38643j17465H104b78268B10884q3266m5513d9116k55097C0983J57901J93841
$$ -138643 -256108 8104 -278268 210884 127618 82105 -49116 -304213 30983 188884 382725
16038C82725d1588C57481h4014j36634P8504k68997G1903b2028n96935C70596
$$ 382725 -41588 357481 -84014 -220648 -142144 -411141 71903 -22028 -618963 370596
16027G8575J69891a22149k2144m2215B56701b09374k78077m6913g0811D58627
$$ 78575 248466 -122149 -144293 -186508 256701 -209374 -487451 -534364 -70811 458627
16016b37899H1744b27644l6416n5362l14505K45248J76586C19123J13696p5845
$$ -237899 81744 -227644 -264060 -319422 -633927 -388679 -212093 319123 432819 356974
16006C56974f9233B72674A33703a56408l92041H28831a4210j57466c7832C06017
$$ 356974 -69233 272674 133703 -156408 -548449 828831 -14210 -171676 -37832 306017
15995A21407a06216l67373K30270o5678P3744q5006f1931o84l62866l71464L74987
$$ 121407 -106216 -473589 -243319 -308997 -235253 -320259 -61931 -62615 -425481 -796945 -421958
15984d21958n4562D22215A17857Q36031C70008c18041i333l1144a3236k65643
$$ -421958 -476520 422215 117857 953888 370008 -318041 -9333 -40477 -13236 -278879
15974b78879O5046B44045a50681k24657k59316B67344Q2494A27957g5898l41615
$$ -278879 -213833 244045 -150681 -375338 -634654 267344 349838 127957 -75898 -417513
15964d17513J73395a13274n89239n9453L79345F3349g87274a75424p72829B98280
$$ -417513 -244118 -113274 -702513 -761966 -382621 63349 -787274 -175424 -948253 298280
15953b14989G2738a96507a0506m8310J5017j87092B36551c8720Q736j6670B26306
$$ -214989 72738 -196507 -10506 -58816 -43799 -230891 236551 -38720 -29984 -46654 226306
15941C10247b46122R4272j20916J17066q9613H2846a62284g3742r2252j93500
$$ 310247 -246122 -151850 -272766 -155700 -245313 82846 -162284 -73742 -165994 -359494
15931c59494j1769n8338B29426d0006o8261k4182n13823B3268h7598o89442a32967
$$ -359494 -371263 -429601 229426 -40006 -108267 -132449 -646272 23268 -87598 -777040 -132967
15919a51830J4648o37803c53098h8624f618k9045F12395b09341e8188B48580a16377
$$ -151830 -137182 -774985 -353098 -88624 -6618 -35663 612395 -209341 -58188 248580 -116377
15907d58834B60750b24557K4134f0104D00258O2224d2107j81593j04508k30327
$$ -458834 260750 -224557 -200423 -60104 400258 462482 -42107 -223700 -328208 -558535
15897e58535J37993a57788o3458J05955l6699C23999C0995K64278j1245a53806
$$ -558535 -420542 -157788 -221246 -115291 -151990 323999 30995 295273 284028 -153806
15886A66477e83111a7879o35424E9097b9141o40006A69217e65032A69474e6559
$$ 166477 -583111 -17879 -653303 59097 -29141 -669147 169217 -565032 169474 -56559
15875d0106k98879F36521d85282m15039c93083E17519B33105b61577l03845f6960
$$ -40106 -338985 636521 -485282 -900321 -393083 517519 233105 -261577 -565422 -66960
15864B8098b98255J05989p4413O6395i2787L9195l58912j98019H2946B0472M07332
$$ 28098 -298255 -192266 -266679 -200284 -92787 -53592 -412504 -610523 82946 20472 427804
15853D27804M1183d03373E06382p4447g3357k08751C46170D1187K01943B6982
$$ 427804 468987 -403373 506382 431935 -73357 -282108 346170 41187 243130 26982
15842c48478N4921D35172a9503B10930K462h2882p08961L22668a21121B38402
$$ -348478 -293557 435172 -19503 210930 213392 -82882 -791843 -469175 -121121 238402
15831B40819d49432A16683e15833C66631d72273C2091P71523E8436c80253A53433
$$ 240819 -449432 116683 -515833 366631 -472273 32091 803614 58436 -380253 153433
15820B12331c72085C53833D0971h22802c81781G6888e26020B13512a3041l02071
$$ 212331 -372085 353833 40971 -822802 -381781 76888 -526020 213512 -13041 -315112
15810c15112A73907B6678e20145K03311a41711C0959d34040C67276M949d47204
$$ -315112 173907 26678 -520145 -316834 -141711 30959 -434040 367276 372225 -447204
15799A13642g92627b92499a03704F8027c2204A01650g06741a90284B66814a18085
$$ 113642 -792627 -292499 -103704 68027 -32204 101650 -706741 -190284 266814 -118085
15788A49696d38131A57871e05295c3947k04639a03132B9499b68813A14055e3033
$$ 149696 -438131 157871 -505295 -33947 -238586 -103132 29499 -268813 114055 -53033
15777e56742a94347j06800H1786e80971D27019j07703a50156K9724J7987A20755
$$ -556742 -194347 -301147 81786 -580971 427019 319316 -150156 -120432 -102445 120755
15766E38930d20972J46234m4044b7499r22222M51048o3552b47666Q3031m29559
$$ 538930 -420972 -274738 -318782 -27499 -949721 -498673 -562225 -247666 -164635 -594194
15756e94194B32048a46095A55988Q01749D26668a05012E18532f67455G441d994
$$ -594194 232048 -146095 155988 957737 426668 -105012 518532 -667455 7441 -4994
15745a33217D59558A9772Q7589e71938A65342h3968A44507a65016A20402a52517
$$ -133217 459558 19772 107361 -571938 165342 -83968 144507 -165016 120402 -152517
15734d6759G7564N40453j29717c45864a38150A31226b90106g7180p8442l78587
$$ -46759 77564 618017 488300 -345864 -138150 131226 -290106 -77180 -155622 -534209
15724e34209J04974A49961c24879j12878b09769C69994a75336k79588A73791J03632
$$ -534209 -429235 149961 -324879 -437757 -209769 369994 -175336 -454924 173791 277423
15714B77423b62992B665O1294e69400J44901J29013m7528i9378k7031o4950m6129
$$ 277423 -262992 2665 63959 -569400 -424499 -295486 -343014 -99378 -126409 -191359 -237488
15703b37488q4883k0259j80690D2015b93325n83122b84903J14755j82127C3168
$$ -237488 -322371 -342630 -523320 42015 -293325 -876447 -284903 -170148 -352275 33168
15692A24091a63535A21965K29157P5872c35919B04167b16640K6104F6046M73722
$$ 124091 -163535 121965 351122 426994 -335919 204167 -216640 -190536 66046 539768
15682E39768e8094j25970c4344k71260C55054g15146A44907f35591H1686B718
$$ 539768 -58094 -184064 -34344 -305604 355054 -715146 144907 -635591 81686 2718
15671D140J58556b33950G4468a1282D10504a68174D54986b84986A27746b8453
$$ 4140 162696 -233950 74468 -11282 410504 -168174 454986 -284986 127746 -28453
15660C06060b25122l84245F2707d90229p1634H9918f4004j1810j76404j53273
$$ 306060 -225122 -609367 62707 -490229 -561863 89918 -64004 -75814 -252218 -405491
15650d05491e2184l70332j8965I5002a72075k89037Q4897a15320p5641A85256
$$ -405491 -52184 -422516 -441481 95002 -172075 -461112 -376215 -115320 -190961 185256
15639B91238a2746l02690j78399E9386K9389c06057C7905f60988I1674a54339
$$ 291238 -12746 -315436 -493835 59386 88775 -306057 37905 -660988 91674 -154339
15628i65878a32826q1527J03146j7301b7339A28013K5372E7804r808i8069l25143
$$ -965878 -132826 -214353 -111207 -128508 -27339 128013 153385 57804 47996 -98069 -423212
15617d23212J82016j74457B8077K21391c06786D07087a100659L65348G9015P0199
$$ -423212 -241196 -415653 28077 249468 -306786 407087 -1100659 -735311 79015 149214
15607A49214g2250F36229l2187b22484m29036i2324E5533e51422H9741d83780
$$ 149214 -72250 636229 604042 -222484 -651520 -92324 55533 -551422 89741 -483780
15596A53006e8548E1813J66277H9280K73709a87829I3495e45962b25381A75578
$$ 153006 -58548 51813 218090 89280 362989 -187829 93495 -545962 -225381 175578
15585C73639i7009l46736a04941A87561G9487K57724b20077A90483L62807h2141
$$ 373639 -97009 -443745 -104941 187561 79487 337211 -220077 190483 553290 -82141
15574F67973b07028k1725b2799B30306J91009A72162D6444c54656C70595i6236
$$ 667973 -207028 -228753 -22799 230306 421315 172162 46444 -354656 370595 -96236
15563g18975K83955F31317g73027g4297B62814A7964a78712B85182e3158k39326
$$ -718975 -435020 631317 -773027 -74297 262814 17964 -178712 285182 -53158 -292484
15553b92484k51301K16081j68717J1509B03513F3859b2603E8572J0370K79848
$$ -292484 -543785 -327704 -496421 -484912 203513 63859 -22603 58572 68942 348790
15543C48790d87806N2303D95782b22185G07077A74620N612f119G1892R594d49218
$$ 348790 -487806 -435503 495782 -222185 707077 174620 180232 -6119 71892 81486 -449218
15531b54059i2483A03739a41321A00434b14092B31408b27084E13970a82780g9406
$$ -254059 -92483 103739 -141321 100434 -214092 231408 -227084 513970 -182780 -79406
15520a75838M5432B1192a53040A61117a33377l68710C64608N47267i201k50800
$$ -175838 -130406 21192 -153040 161117 -133377 -502087 364608 911875 -9201 -260001
15510b60001D37612b31465A70803M37937a3692C3174d97458b16663A15657a06410
$$ -260001 437612 -231465 170803 608740 -13692 33174 -497458 -216663 115657 -106410
15499c60566j31952K42338g4029b6341m9798E7246N72454B13208b03681A025119
$$ -360566 -492518 -250180 -74029 -26341 -76139 57246 629700 213208 -203681 1025119
15488i64731i3274B95198a18311k97612o8491a58379o390j39914G368d95631A69350
$$ -964731 -93274 295198 -118311 -415923 -484414 -158379 -164769 -304683 7368 -495631 169350
15476f7370A97903b67703F76562a44730B17642e48334F10672c52720P0178B70132
$$ -67370 197903 -267703 676562 -144730 217642 -548334 610672 -352720 -282542 270132
15465A39764d09818h6160L3412p2261A65009c79358l4263B58061e86286c2206
$$ 139764 -409818 -86160 -52748 -125009 165009 -379358 -413621 258061 -586286 -32206
15454C54229A48816J43466b19530B3462b11694B58686d92715F54443b23479R2942
$$ 354229 148816 292282 -219530 23462 -211694 258686 -492715 654443 -223479 -130537
15444a30537N9786d437B90985K0882c49444o07056D04584j94972a53153j22192
$$ -130537 -70751 -4437 290985 311867 -349444 -956500 404584 209612 -153153 -275345
15434b75345l7849r6055C48330j32233b83556I1596b52187G47883k74841j83877
$$ -275345 -313194 -409249 348330 216097 -283556 91596 -252187 747883 473042 289165
15424B89165e22421D56005j52862c60971C8673J10251C3849J88681c40248K387
$$ 289165 -522421 456005 303143 -360971 38673 148924 33849 222530 -340248 -337861
15414c37861C43093a78619q7794c7727l7591m928D90040g8530q57963c4276G7061
$$ -337861 343093 -178619 -266413 -37727 -75318 -80246 490040 -78530 -936493 -34276 77061
15402a33623C57188c35722J02801A72520g2750c4610E78265a13720l03268G0667
$$ -133623 357188 -335722 -232921 172520 -72750 -34610 578265 -113720 -416988 70667
15391b93677B08325K01895n5749e62888K01893a10666j07465m30688a93042k16625
$$ -293677 208325 410220 354471 -562888 -360995 -110666 -218131 -648819 -193042 -409667
15381d09667a437k84535m37491K03807J47504J23918j28205b3819I9925J97766
$$ -409667 -1437 -285972 -723463 -519656 -372152 -248234 -376439 -23819 99925 297691
15371B97691a1336l26013R9800C42382b88571C24346e09530K46734o3994B52136
$$ 297691 -11336 -337349 -237549 342382 -288571 324346 -509530 -262796 -326790 252136
15360H00164A31412J68964o1711a87464C07584i5073B67431b24684H794c81142
$$ 800164 131412 300376 238665 -187464 307584 -95073 267431 -224684 8794 -381142
15349E85583k60665D6221c59336B50770J43893j24247i4969D9294R4278J20213
$$ 585583 324918 46221 -359336 250770 394663 270416 -94969 49294 143572 263785
15339B63785b16913F94389B45939H2506f06992a18744C93880f9853o05468b08505
$$ 263785 -216913 694389 245939 82506 -606992 -118744 393880 -69853 -675321 -208505
15328c62127F98439m4954F3356Q2307J98171e7994g080I3386J49915G335P5044
$$ -362127 698439 653485 63356 145663 343834 -57994 -7080 93386 243301 7335 82379
15317H2379L77504i717A77070M12969G2562b12349A65258k2628o7520i75732b24048
$$ 82379 459883 -9717 177070 590039 72562 -212349 165258 142630 75110 -975732 -224048
15305a00294A30945l9196L82322A23939L41017P6783d77066B53066J03859d00877
$$ -100294 130945 91749 474071 123939 464956 541739 -477066 253066 356925 -400877
15294D58105J39328A11235c6342A8919Q922K41542M6104m5776K0718J61867J49645
$$ 458105 597433 111235 -36342 18919 27841 269383 315487 269711 290429 452296 601941
15283F01941k13169a02100B34271d8235B57984j21409C3321P6872a51575M2734
$$ 601941 388772 -102100 234271 -48235 257984 136575 33321 110193 -151575 -108841
15273a08841B44291a30387A062708m98350A95685M0375d86372F01840B71072G6845
$$ -108841 244291 -130387 1062708 564358 195685 236060 -486372 601840 271072 76845
15262B87166O82340C89067a59952R918E05049j29280j54709K51206N65840C32383
$$ 287166 969506 389067 -159952 -150034 505049 375769 221060 472266 1038106 332383
15251F25506l01860J14842L91468D09524r5367L05086j71450k1874b21997A5881
$$ 625506 323646 438488 829956 409524 314157 619243 447793 425919 -221997 15881
15240c6162G68K55406R9523K12428B28316J3634c2153B05469h4800B44600g5850
$$ -36162 768 256174 355697 568125 228316 241950 -32153 205469 -84800 244600 -75850
15228A37111K27193k2675b69653C05587I0918e19039K35305k17581a20920H05426
$$ 137111 364304 341629 -269653 305587 90918 -519039 -283734 -501315 -120920 805426
15217A92772b51042O1708B51945J13802B5919K5048c8741C88300L24464B33274
$$ 192772 -251042 -189334 251945 365747 25919 50967 -38741 388300 712764 233274
15206F0830g15379K75560a28928C9517J93009L17877A56322O5269r3198J19871
$$ 60830 -715379 -439819 -128928 39517 232526 550403 156322 221591 128393 248264
15196B48264m0686c65204A27507l8940k5946C0301M90088b40039h7061A29191
$$ 248264 207578 -365204 127507 88567 62621 30301 520389 -240039 -87061 129191
15185h34544C87523j45423M72102b37779g9411p1419k0283I15918k31967e40642
$$ -834544 387523 242100 714202 -237779 -79411 -150830 -171113 915918 683951 -540642
15174B22055j08851K77932Q8422K4661A08081J02193b78206J28645k0243C76055
$$ 222055 113204 391136 479558 504219 108081 210274 -278206 -149561 -169804 376055
15163C52856B964a96692k40700G41194E9600f19788H33894d05773H06067A4992
$$ 352856 2964 -196692 -437392 741194 59600 -619788 833894 -405773 806067 14992
15152H68150k90846B86363c06494B27045b25185I2684Q5089K64368c39300A44321
$$ 868150 577304 286363 -306494 227045 -225185 92684 177773 442141 -339300 144321
15141C67031b95796C15217c73598B61562E0057M42445L0733C924M2770J25337
$$ 367031 -295796 315217 -373598 261562 50057 492502 523235 3924 46694 172031
15131A72031m3523d32734C59320p1048J23374f81602J22105H72516k47221I2278
$$ 172031 128508 -432734 359320 288272 411646 -681602 -559497 872516 625295 92278
15120c8324B79476A0596b73171D9217N64345L42729I7215J43737A03309Q1457
$$ -38324 279476 10596 -273171 49217 613562 956291 97215 240952 103309 184766
15110A84766a97569A12255O2943J13947K12597J75234A83035d57766F82856C40276
$$ 184766 -197569 112255 175198 289145 501742 676976 183035 -457766 682856 340276
15099b00047G0109J45678e04126A94424I1505b2871A140324f5589B7273R2797
$$ -200047 70109 215787 -504126 194424 91505 -22871 1140324 -65589 27273 120070
15089A20070i0400G16290l54307E4710N65409A34761b94500d8851A181880l42270
$$ 120070 -90400 716290 361983 54710 620119 134761 -294500 -48851 1181880 839610
15079H39610D01784J85596k33443f9569H34146l71686b59312E83660l7358B18675
$$ 839610 401784 587380 353937 -69569 834146 462460 -259312 583660 546302 218675
15068D6285K93450j48438L69970k15098m2245J88591J00868j27883A59452J12059
$$ 46285 339735 191297 561267 346169 303924 492515 593383 465500 159452 271511
15058B71511J16524F6222O75088K09138l77367b39326G9449H545R1792K135b40750
$$ 271511 388035 66222 741310 950448 573081 -239326 79449 8545 100337 102472 -240750
15046A664530a72373D50062j58279B0162K20097b30921D98177A95280b03946A52089
$$ 1664530 -172373 450062 291783 20162 240259 -230921 498177 195280 -203946 152089
15035A90658M9181h12228A05304M87902A0573b75076m8609B74716K36471B5608
$$ 190658 239839 -812228 105304 593206 10573 -275076 -323685 274716 511187 25608
15024B06910H5702m2362O48313A73060L65928j37457A95326E9148P67843j92789
$$ 206910 85702 43340 691653 173060 538988 401531 195326 59148 826991 634202
15014F34202r5403m5184A04888M03948K52528k48353P3397A56764J87997j12356
$$ 634202 538799 493615 104888 508836 761364 513011 586408 156764 344761 232405
15004B32405N92377d7126D42657P5871p8749A31042L50308B05413d0140I25640
$$ 232405 824782 -47126 442657 518528 439779 131042 481350 205413 -40140 925640
14993B74147K9842D9316J37617a30891C35666K25159B9231P07739I6596J74688
$$ 274147 303989 49316 186933 -130891 335666 560825 29231 736970 96596 271284
14983B71284J25666c01453E52625L20698C44454J36997J39982J50291j25859j8866
$$ 271284 396950 -301453 552625 873323 344454 481451 621433 771724 645865 626999
14973F26999b7192A247056n31946j91568C0991L85396M24559B98859N63901C55044
$$ 626999 -27192 1247056 715110 523542 30991 416387 840946 298859 862760 355044
14962C3347R10336D20382A32933J77716J54916A04187D4319K30421L26115j38843
$$ 33347 943683 420382 132933 310649 465565 104187 44319 274740 600855 462012
14952D62012A33778N17Q12850a08593D45143N74887F638J13310B1419L12337O95760
$$ 462012 133778 134295 947145 -108593 445143 1020030 6638 119948 21419 333756 1029516
14941A029516l02167M0750f4569A37867K30029J26595B41686L43725k00368M09366
$$ 1029516 727349 768099 -64569 137867 367896 494491 241686 585411 385043 794409
14931G94409A52337K90689J33923J27485k70555A92638L04167l6229e2072l7902
$$ 794409 152337 443026 576949 704434 433879 192638 496805 460576 -52072 -89974
14921h9974H1985M53242J79054C5336K54571M18856l20291K18714I5796Q54402
$$ -89974 81985 535227 714281 35336 289907 708763 388472 607186 95796 950198
14911I50198C07818J30555K52106k71718N52407D41328O37959J78426l5291E09767
$$ 950198 307818 438373 690479 418761 971168 441328 1079287 1257713 1222422 509767
14900G07963B80352N27172C86920M52706J20071m74445L34894k66015C4216L17944
$$ 707963 280352 807524 386920 839626 959697 485252 820146 554131 34216 352160
14890C52160L11357J3404M34313l14019M46441l31927k19797p9890P35623j06520
$$ 352160 663517 676921 1111234 797215 1243656 911729 691932 612042 1347665 1241145
14880A241145j20480l27114C27066j05138R97940k04823C32738J35257a39856
$$ 1241145 1120665 793551 327066 221928 1219868 1015045 332738 467995 -139856
14870F62435N4176I5616L83580G3069R19906m94005J20187l1345J66721J80214
$$ 662435 716611 95616 479196 73069 992975 498970 619157 587812 754533 934747
14860I34747l62532R3622J74142j16253k07481j56323O61556A19748O52883k76967
$$ 934747 572215 665837 839979 723726 516245 359922 1021478 119748 772631 495664
14850D95664J60239L29914K63842m12516k25207M84007k5856J93210n64302p7141
$$ 495664 655903 985817 1249659 837143 611936 1095943 1070087 1263297 698995 621854
14840F21854M8506J36177J02968A76542N24314l28020P18462M62946l81478L4291
$$ 621854 670360 806537 909505 176542 700856 372836 1091298 1554244 1172766 1207057
14830A207057K25525F56812N44279l61886J81188l33154O18769j84979k81562
$$ 1207057 1432582 656812 1201091 839205 1020393 687239 1306008 1121029 839467
14821H39467B75635N26130k64057L26575K37062J43807J72156o19131J82981M8299
$$ 839467 275635 801765 537708 864283 1101345 1245152 1417308 798177 981158 1029457
14811A029457k33196C03406O15549M39719J46316D58666L08553J08049N20670
$$ 1029457 796261 303406 918955 1358674 1504990 458666 767219 875268 1395938
14802A395938E63420J010343n36553j34405l33943L25241O88119k56758n22438
$$ 1395938 563420 1573763 1037210 902805 568862 894103 1582222 1325464 803026
14793H03026o1425k36087P1851P45678L73931n11786l51051L4437L39253Q8728
$$ 803026 741601 505514 577365 1323043 1696974 1185188 834137 868574 1207827 1296555
14783A296555E97093O58197L33178n29255m3051L19943C17063P67052o1451j70371
$$ 1296555 597093 1255290 1588468 1059213 1016162 1336105 317063 1084115 1022664 852293
14773H52293l61269P21369l7878L60944m19535L9836Q0836k60928j92511J39125
$$ 852293 491024 1212393 1174515 1535459 1115924 1155760 1236596 975668 783157 922282
14763I22282K0776K45392j66842J70986l40544N56748l93229L55298n30601J21452
$$ 922282 943058 1188450 1021608 1192594 852050 1408798 1015569 1370867 840266 961718
14753I61718O31715m11866j6265K64333n80206J21283M50196J37773k70925j73083
$$ 961718 1593433 1181567 1165302 1429635 849429 970712 1420908 1558681 1287756 1114673
14743A114673M13965l36784M22845k16793O00436I30007M22811j37192o2645O2273
$$ 1114673 1528638 1191854 1614699 1397906 1998342 930007 1352818 1215626 1152981 1215254
14733A215254k04547Q91444K82496l90409n78404j74376J22391j103N71799n97031
$$ 1215254 1010707 1902151 2184647 1794238 1215834 1041458 1163849 1162746 1734545 1137514
14723A137514P46083n16495j41418L96080m09776N39814j57905M44790p5664j75440
$$ 1137514 1883597 1367102 1225684 1621764 1211988 1751802 1593897 2038687 1963023 1787583
14713A787583o0598J7470n60997m894M96572k12554L71167n37742Q02414M4875
$$ 1787583 1726985 1744455 1183458 1178564 1675136 1462582 1833749 1296007 2098421 2143296
14703B143296l94378J08086j25416J02480J11201k63194K74030k32505k82787
$$ 2143296 1748918 1857004 1731588 1834068 1945269 1682075 1956105 1723600 1440813
14694A440813J81041K69566K70048L5610p67019P75786M12470p53304J6824j50274
$$ 1440813 1621854 1891420 2161468 2197078 1430059 2205845 2618315 1865011 1881835 1731561
14684A731561l94181M61429N2454M46933j49765n36560Q75399J21516q04226k78605
$$ 1731561 1337380 1798809 1851263 2298196 2148431 1611871 2487270 2608786 1804560 1525955
14674A525955J120453L83418o71412J82633J98010m84242n2775J30346N59378
$$ 1525955 2646408 3029826 2358414 2541047 2739057 2254815 2202040 2332386 2891764
14665B891764m98747M14809m17900k78247R3454N62419m00852j31003J244881
$$ 2891764 2393017 2807826 2389926 2111679 2205133 2767552 2366700 2235697 3480578
14656C480578p71077l85787L13357m0747K47675O48908n51632o00874O85888l7171
$$ 3480578 2709501 2323714 2637071 2596324 2843999 3492907 2941275 2340401 3026289 2989118
14646B989118p55747P03208n32862O7015J072150k14819K5540J0942j54991J00634
$$ 2989118 2233371 2936579 2403717 2470732 3542882 3328063 3353603 3364545 3209554 3310188
14636C310188n44972N34442n1968n82278Q42412k69610P83089n51956K60985R9260
$$ 3310188 2765216 3299658 3247690 2665412 3507824 3238214 4021303 3469347 3730332 3829592
14626C829592k03734Q1359J13330p88917Q60626j10602Q9626q16853O73104O70142
$$ 3829592 3625858 3707217 3820547 3031630 3892256 3781654 3871280 3054427 3727531 4397673
14616D397673l82514J38428p51575N17851K69747K96190L4622m25993j94024l061
$$ 4397673 4015159 4153587 3402012 3919863 4189610 4485800 4520422 4094429 3900405 3897344
14606C897344K75551O60952J66963J79943l60946o1036N77326l31440J0493L09714
$$ 3897344 4172895 4833847 5000810 5180753 4819807 4758771 5336097 5004657 5015150 5324864
14596E324864J02N92552m11520n78742Q92868m62304O93300Q0146N52565l01883
$$ 5324864 5324966 5917518 5505998 4927256 5820124 5357820 6051120 6131266 6683831 6381948
14586F381948L56103J9320q55083Q87559J73747j70138r4324J41630R58455p46306
$$ 6381948 6738051 6757371 5902288 6789847 6963594 6793456 6699132 6840762 7799217 7052911
14576G052911K81023L42990l28511P38605j86309L29792k66546K71869n9022Q56856
$$ 7052911 7333934 7676924 7348413 8087018 7900709 8230501 7963955 8235824 8176802 9033658
14566I033658r0592r491R87722m25531N67466n03552J008726l96689K23287R85388
$$ 9033658 8943066 8933575 9921297 9495766 10063232 9559680 10568406 10171717 10395004 11380392
14556A1380392j559327J359738n95938N48079m39656m4834Q76305K57700K38019
$$ 11380392 9821065 11180803 10584865 11132944 10693288 10648454 11524759 11782459 12020478
14547A2020478l72617m06834O89755J60701m72532r54674N58566J63332l45356
$$ 12020478 11647861 11241027 11930782 12091483 11618951 10664277 11222843 11386175 11040819
14538A1040819N04348p90038M52595m71214M22472l95539l37366N5126o84355
$$ 11040819 11545167 10755129 11207724 10736510 11158982 10763443 10426077 10481203 9796848
14529I796848k22272O53711o08777n24024O83517j352126Q53668l95567j97880
$$ 9796848 9574576 10228287 9619510 9095486 9779003 8426877 9280545 8884978 8687098
14520H687098N26948m66018L32893o73595M46972L35301o71480Q46511q01245
$$ 8687098 9214046 8748028 9080921 8407326 8854298 9189599 8518119 9364630 8563385
14511H563385P0633N15785r49767J363327K32505P1726j125759J394775o27793
$$ 8563385 8634018 9149803 8200036 9563363 9795868 9867594 8741835 10136610 9508817
14502I508817m54336K70581P17825q04017R71545q16968J010078q23896M5362
$$ 9508817 9054481 9325062 10042887 9238870 10210415 9393447 10403525 9579629 9624991
14493I624991R84180O2536J57799j10858O40870k35612j15361O69565K38492j68261
$$ 9624991 10609171 10671707 10829506 10718648 11359518 11123906 11008545 11678110 11916602 11748341
14483A1748341j0261N01336M7948l65341k4319Q31122N2011J67731L06227L77252
$$ 11748341 11738080 12239416 12287364 11922023 11897704 12728826 12780837 12948568 13254795 13632047
14473A3632047j36386O82959m90025R97072L1377N74312l75446P7730L89936K07631
$$ 13632047 13495661 14178620 13688595 14685667 14717044 15291356 14915910 14993640 15383576 15591207
14463A5591207M72024K01917K15781n42333J761100k2696N83355p5438R99431
$$ 15591207 16063231 16265148 16480929 15938596 17699696 17677000 18260355 18184917 19184348
14454A9184348m30466j52249M34477J4195Q34115N40153j04744O1052P37313j52233
$$ 19184348 18753882 18601633 19036110 19050305 19884420 20424573 20319829 20380881 21118194 20965961
14444B0965961M29057J87700P63911M00780p3880N98743J018858J0441J00443
$$ 20965961 21395018 21582718 22346629 22747409 22673529 23272272 24291130 24301571 24402014
14435B4402014R58523K61551R2398Q37354L65759O46525j55144J016147O6534
$$ 24402014 25360537 25622088 25714486 26551840 26917599 27564124 27408980 28425127 28491661
14426B8491661Q70264N58792M96246l1400R70286P42403N59986K70019L47044
$$ 28491661 29361925 29920717 30416963 30385563 31355849 32098252 32658238 32928257 33275301
14417C3275301Q48261Q08609N19058L74177N89011P18640Q88286Q11334P08448
$$ 33275301 34123562 34932171 35451229 35825406 36414417 37133057 38021343 38832677 39541125
14408C9541125R13748O58346R28413R78103p0598J433033L20680J238503O00195
$$ 39541125 40454873 41113219 42041632 43019735 42949137 44382170 44702850 45941353 46541548
14399D6541548J352385O24064P01963J524928P37753P30389J504301L32168K157290
$$ 46541548 47893933 48517997 49219960 50744888 51482641 52213030 53717331 54049499 56206789
14390E6206789R80059P15215N98911J593830J259349J181836J234728K107427
$$ 56206789 57186848 57902063 58500974 60094804 61354153 62535989 63770717 65878144
14382F5878144J559363J542182J030267J703261J630747J226871J263544K036806
$$ 65878144 67437507 68979689 70009956 71713217 73343964 74570835 75834379 77871185
14374G7871185J756236J963538K357396J717197K743186K332769J366404L262547
$$ 77871185 79627421 81590959 83948355 85665552 88408738 90741507 92107911 95370458
14366I5370458J886097K201626K931747L019551K156846L066060K556353K959536
$$ 95370458 97256555 99458181 102389928 105409479 107566325 110632385 113188738 116148274
14358A16148274K428503K235633K751448K345425K925988L571601K997078L617866
$$ 116148274 118576777 120812410 123563858 125909283 128835271 132406872 135403950 139021816
14350A39021816K678278J616567L484916L377890M061697M653256L843144L377016
$$ 139021816 141700094 143316661 146801577 150179467 154241164 158894420 162737564 166114580
14342A66114580L528781K906031L600572M246237M459214L990839N151104M793975
$$ 166114580 169643361 172549392 176149964 180396201 184855415 188846254 193997358 198791333
14334A98791333M871438M165013N290493M936301M938091N344890L468698L255151
$$ 198791333 203662771 207827784 213118277 218054578 222992669 228337559 231806257 235061408
14326B35061408N041072N162261N533905N071597L471137K812681K512524L597212
$$ 235061408 240102480 245264741 250798646 255870243 259341380 262154061 264666585 268263797
14318B68263797O251708N730287O236074N358050N938600O233786N751394P817033
$$ 268263797 274515505 280245792 286481866 291839916 297778516 304012302 309763696 317580729
14310C17580729O428772L142067L735393M613665N702539O265116N619693N597114
$$ 317580729 324009501 327151568 330886961 335500626 341203165 347468281 353087974 358685088
14302C58685088P304325N767771O369945O307277M608169M734330M843248O352845
$$ 358685088 365989413 371757184 378127129 384434406 389042575 393776905 398620153 404972998
14294D04972998N595212N779993P336607P577199N232552M474034N869129O705543
$$ 404972998 410568210 416348203 423684810 431262009 436494561 440968595 446837724 453543267
14286D53543267N311657N973340O588735K312501l59064N749224N600678M551929
$$ 453543267 458854924 464828264 471416999 473729500 473370436 479119660 484720338 489272267
14278D89272267K388360n3380J449524K437157n11024k7874M152431P7769j230638
$$ 489272267 491660627 491607247 493056771 495493928 494982904 494955030 499107461 499185230 497954592
14269D97954592r39802J724462K12254j83950l586465k745942j765074l275689
$$ 497954592 497014790 498739252 498951506 498767556 495181091 492435149 490670075 487394386
14261D87394386j200707l040037r74389j886178l442879l902260o540025p352425
$$ 487394386 486193679 483153642 482179253 480293075 476850196 472947936 466407911 459055486
14253D59055486n882748n816951m660061r896072r729468r528078r881789r544012
$$ 459055486 453172738 447355787 442695726 432799654 423070186 413542108 403660319 394116307
14245C94116307j0418597q272511j4059821j3109633j3673855j2580491j0165060
$$ 394116307 383697710 375425199 361365378 348255745 334581890 322001399 311836339
14238C11836339r824438r852690j0988622j0482665q209326r996538r824754r623220
$$ 311836339 302011901 292159211 281170589 270687924 262478598 252482060 242657306 233034086
14230B33034086r264805q984216o879200p565886p820187n027755p033596o215421
$$ 233034086 223769281 214785065 207905865 200339979 192519792 187492037 180458441 174243020
14222A74243020o279585p031096p928041r564520r770594r781233q560277n963775
$$ 174243020 167963435 160932339 153004298 143439778 133669184 123887951 115327674 109363899
14214A09363899n007695m293366m613744l711743l953400l467510l076957k575696
$$ 109363899 104356204 100062838 95449094 91737351 87783951 84316441 81239484 78663788
14206G8663788l310141j487308k204433k491889k618088k131721j343503k511590
$$ 78663788 75353647 73866339 71661906 69170017 66551929 64420208 63076705 60565115
14198F0565115q41159k173372j642549r56009j735393j214461p94105j398445
$$ 60565115 59723956 57550584 55908035 54952026 53216633 52002172 51208067 49809622
14190D9809622j741532j166567j044981n38326j295576j860332m57991l10746
$$ 49809622 48068090 46901523 45856542 45318216 44022640 42162308 41704317 41393571
14182D1393571j184052j37361j278648n39816j658219k66932N7658j811394j24534
$$ 41393571 40209519 40072158 38793510 38253694 36595475 36328543 36386201 34574807 34450273
14173C4450273p52007j229173K37155l97622q73056q71739n80379k35096n6980
$$ 34450273 33698266 32469093 32706248 32308626 31435570 30563831 29983452 29748356 29691376
14164B9691376j430362j376794M68842o59311n5722k92481j118808p5779p85703
$$ 29691376 28261014 26884220 27353062 26693751 26638029 26345548 25226740 25150961 24365258
14155B4365258r1751j26489q41988J97300o39549p33685k78755j95470K35381
$$ 24365258 24273507 24147018 23305030 23502330 22862781 22129096 21850341 21654871 21890252
14146B1890252r49714N833m38622l08789K6939o42506O0401o17064l1587o90492
$$ 21890252 20940538 20946371 20507749 20198960 20225899 19583393 19643794 19026730 18995143 18304651
14136A8304651k58570m45944J80995o40205K65722J965m97331o47360J15823n40959
$$ 18304651 18046081 17600137 17781132 17140927 17406649 17408614 16911283 16263923 16379746 15838787
14126A5838787P3276q43637O26717r03224J53082K00872l8629l57024k62013k73160
$$ 15838787 15912063 15068426 15695143 14791919 14945001 15145873 15107244 14750220 14488207 14215047
14116A4215047J66010q31169j45297j13204L52378j03388n13766j54495P68156
$$ 14215047 14381057 13549888 13404591 13291387 13643765 13540377 13026611 12872116 13640272
14107A3640272j094562N57054m87183p53809N534j16121K02101j45881j81273
$$ 13640272 12545710 13102764 12615581 11861772 11867306 11751185 11953286 11807405 11626132
14098A1626132M04620n94051L69705j100928J10568K66237j73497k39473Q4830
$$ 11626132 12030752 11436701 11806406 10705478 10816046 11082283 10908786 10669313 10754143
14089A0754143R2931M15574j564380M48786n08239k17284K55409L01695q59746
$$ 10754143 10847074 11262648 9698268 10147054 9638815 9421531 9676940 9978635 9118889
14080I118889O04237q54092L95428l05604o54387M1713J182415n42925l13013
$$ 9118889 9723126 8869034 9264462 8958858 8304471 8346184 9528599 8985674 8672661
14071H672661Q5688O27047j029733l36476M29732K24722m29415K26912l61646
$$ 8672661 8758349 9385396 8355663 8019187 8448919 8673641 8244226 8471138 8109492
14062H109492J04785m353n58487P03912q63602P37282o90789J82995k201l56774
$$ 8109492 8214277 8209924 7651437 8355349 7491747 8229029 7538240 7721235 7719034 7362260
14052G362260K01203J34116k26333N2742L41147l19213N4759l38992M68518J76003
$$ 7362260 7563463 7697579 7471246 7523988 7865135 7545922 7600681 7261689 7730207 7906210
14042G906210m82718m98435k59278O81621N8477N18587q70065o4923N24722p88514
$$ 7906210 7423492 6925057 6665779 7347400 7405877 7924464 7054399 6989476 7514198 6725684
14032F725684P82666k93263J83334l94149K84435L06736j6383k65313k7931m41234
$$ 6725684 7508350 7215087 7398421 7004272 7288707 7595443 7579060 7313747 7285816 6844582
14022F844582r2599L78054k40667J090838j111265N35576O23890q40845O41596
$$ 6844582 6751983 7130037 6889370 7980208 6868943 7404519 8028409 7187564 7829160
14013G829160r77301J51522N99492p0607O91525q23815Q30380k09783L50082j94176
$$ 7829160 6851859 7003381 7602873 7532266 8223791 7399976 8230356 8020573 8370655 8176479
14003H176479K80019l61273P78145m36204N24892O61730p92543M56197K06694
$$ 8176479 8456498 8095225 8873370 8437166 8962058 9623788 8831245 9287442 9494136
13994I494136M5901K18788l33004j5885J84736M66515j76474o5717J32692l92269
$$ 9494136 9540037 9758825 9425821 9409936 9594672 10061187 9884713 9818996 9951688 9559419
13984I559419K50644K54098o02996k41453N25131n21267n43267K33141j46459
$$ 9559419 9810063 10064161 9461165 9219712 9744843 9223576 8680309 8913450 8766991
13975H766991l5869n82728J11037k01834j73109q10366O77057l06947o88347k67567
$$ 8766991 8731122 8148394 8259431 8057597 7884488 7074122 7751179 7444232 6755885 6488318
13965F488318L18075N05648o77398p76575j23553k47541j22614m77627J68109
$$ 6488318 6806393 7312041 6634643 5858068 5734515 5486974 5364360 4886733 5054842
13956E054842k43487L40598j03500n43561J15420l41578P4199L4801l21009K93625
$$ 5054842 4811355 5151953 5048453 4504892 4620312 4278734 4352933 4387734 4066725 4360350
13946D360350n88167R18167k93382n01637J60924m65355Q11470Q236n0000q69760
$$ 4360350 3772183 4690350 4396968 3895331 4056255 3590900 4402370 4410606 4360606 3490846
13936C490846J27407N3677m15331k9949p17289O57463k277k73206l27608K46115
$$ 3490846 3618253 3671930 3256599 3226650 2509361 3166824 3164547 2891341 2563733 2809848
13926B809848N6331J56844N20498l59558k69396K04067n1856k15305O2421J84063
$$ 2809848 2866179 3023023 3543521 3183963 2914567 3118634 3066778 2851473 2913894 3097957
13916C097957o76412P72913o0274J40419n06661K51304r4157L08034k76586p63162
$$ 3097957 2421545 3194458 3134184 3274603 2767942 3019246 2925089 3233123 2956537 2193375
13906B193375N74449M65322l18433m0527l30050j73294N10886m01571P64804p31203
$$ 2193375 2767824 3233146 2914713 2874186 2544136 2370842 2881728 2480157 3244961 2513758
13896B513758j70679O78463n87048L53759O5818k34759P83280j181492R41536
$$ 2513758 2343079 3021542 2434494 2788253 2854071 2619312 3402592 2221100 3162636
13887C162636o15911K3194m2360J82848K18795O0534n08281j34940n6415N46972
$$ 3162636 2546725 2569919 2527559 2710407 2929202 2989736 2481455 2346515 2290100 2837072
13877B837072n60593Q70797p79231L80583k54429k76188M58464n318n36068L42037
$$ 2837072 2276479 3147276 2368045 2748628 2494199 2218011 2676475 2671157 2135089 2477126
13867B477126k19928K37196K67486j11683J37377n73683J33582l97046p7590O62572
$$ 2477126 2257198 2494394 2761880 2650197 2787574 2213891 2347473 1950427 1872837 2535409
13857B535409m09641J93083O37149q76105Q95507k6792n46036p60855M75403K46024
$$ 2535409 2125768 2318851 2956000 2079895 2975402 2948610 2402574 1641719 2117122 2363146
13847B363146k89257L59849O95739j008003K49741K90093A248588K05987P64860
$$ 2363146 2073889 2433738 3129477 2121474 2371215 2661308 1248588 1454575 2219435
13838B219435q820n61476M47040k71917o1623M36829j2692m25244M50152o23460
$$ 2219435 2210615 1649139 2096179 1824262 1762639 2199468 2186776 1761532 2211684 1588224
13828A588224L07488O57840K36551A246200K36130j50558R23312m12421L75117
$$ 1588224 1895712 2553552 2790103 1246200 1482330 1331772 2255084 1842663 2217780
13819B217780j037944N57547l06718L5952K20570L74869l21702M33269m04893
$$ 2217780 1179836 1737383 1430665 1466617 1687187 2062056 1740354 2173623 1768730
13810A768730N15217l63854J25014j55342l55545J61134n69790N91178n53293
$$ 1768730 2283947 1920093 2045107 1889765 1534220 1695354 1125564 1716742 1163449
13801A163449K66791L88945o25958K80271Q13318j60710l82065K76577q97741
$$ 1163449 1430240 1819185 1193227 1473498 2286816 2126106 1744041 2020618 1122877
13792A122877Q97657l90562J91797p29063M64796n52796R86772k98428j04471
$$ 1122877 2020534 1629972 1821769 1092706 1557502 1004706 1991478 1693050 1588579
13783A588579K31416J66175j62407L50642k92337n02613M23599l03271L33940
$$ 1588579 1819995 1986170 1823763 2174405 1882068 1379455 1803054 1499783 1833723
13774A833723n82964k78456N78406L65862k37672L08951l98847j25924j73293
$$ 1833723 1250759 972303 1550709 1916571 1678899 1987850 1589003 1463079 1289786
13765A289786k00404N09635j24939p9984m2238L3524P3402r9982j42556k60882
$$ 1289786 1089382 1599017 1474078 1394094 1351856 1385380 1458782 1358800 1216244 955362
13755I55362R2032J30341L21299n75139R51627n06972P1768K90120o10673K68459
$$ 955362 1047394 1177735 1499034 923895 1875522 1368550 1440318 1730438 1119765 1388224
13745A388224j44382j38728l2411Q48841q60237P0621L33381q1350K08758K90103
$$ 1388224 1243842 1105114 1072703 1921544 1061307 1131928 1465309 1383959 1592717 1882820
13735A882820m87838J70349m37428D96010P80515M50588O9194l36193P47421n45091
$$ 1882820 1394982 1565331 1127903 496010 1276525 1727113 1796307 1460114 2207535 1662444
13725A662444m16153m96036O07426R6329k69286m8983K47576J36088p3078k30733
$$ 1662444 1246291 750255 1357681 1454010 1184724 1135741 1383317 1519405 1446327 1215594
13715A215594E97755P17681m20095m5982J00969j08991L98184m037k27014L13955
$$ 1215594 597755 1315436 895341 849359 950328 841337 1239521 1235484 1008470 1322425
13705A322425n35662k26635P07284f7381H86433L25853n34317O46929k08637m12680
$$ 1322425 786763 560128 1267412 -67381 886433 1212286 677969 1324898 1116261 703581
13695G03581q63J05436J66656r5907j292J40565O42853n61724k98494K32885j82423
$$ 703581 702718 808154 974810 878903 877611 1018176 1661029 1099305 800811 1033696 851273
13684H51273J91289Q6889P6664k37433O8528j49866k84751L79139J60236J79776
$$ 851273 1042562 1129451 1206115 968682 1037210 887344 602593 981732 1141968 1321744
13674A321744o28005N84115p511n13618P01328j56654l02344J24133k77830P52671
$$ 1321744 693739 1277854 1270343 756725 1458053 1301399 999055 1123188 845358 1598029
13664A598029G68116M7150P2837j96471P51996l42202k56199J37357l88194O27133
$$ 1598029 768116 815266 888103 691632 1443628 1101426 845227 982584 594390 1221523
13654A221523j05916j22494j4476l98135N56921J69942m72571N79586E35077P18700
$$ 1221523 1115607 993113 978637 580502 1137423 1307365 834794 1414380 535077 1253777
13644A253777j58451L80757l74736D12899A71832L09538O19834O3191j48879l4325
$$ 1253777 1095326 1476083 1101347 412899 171832 481370 1101204 1164395 1015516 981191
13634I81191J57362l08702r1846N78694k94345Q0796E00950K42512K38944K43630
$$ 981191 1138553 829851 738005 1316699 1022354 1103150 500950 743462 982406 1226036
13624A226036C14831L18816L26624j49540B63244R50272C48918L49709N35700
$$ 1226036 314831 633647 960271 810731 263244 1213516 348918 698627 1234327
13615A234327m40226K11355j94460M24069j94721J27113J27210j19053r3961l6019
$$ 1234327 794101 1005456 810996 1235065 1040344 1167457 1294667 1175614 1081653 1045634
13605A045634J06803l604m03840J3985l2797K33087m52611J72269M72834l82568
$$ 1045634 1152437 1148833 744993 758978 726181 959268 506657 678926 1151760 769192
13595G69192Q3453C86313Q86888D15589L49139C09348J56234r3816M39073K97017
$$ 769192 852645 386313 1273201 415589 764728 309348 465582 371766 810839 1107856
13585A107856j29035K474C10603K98839j11317N59419j72014l40579j85576O23686
$$ 1107856 978821 981295 310603 609442 498125 1057544 885530 544951 359375 983061
13575I83061b01112H29550L7761l97216L07885q77l38581M36477J04210j74748
$$ 983061 -201112 829550 867311 470095 777980 777103 438522 874999 979209 804461
13565H04461O2440l04177O7391M42162l42009j13343L4571j01907K57151p8327
$$ 804461 866901 562724 630115 1072277 730268 616925 651496 549589 806740 728413
13555G28413M23291F9240K78970O73342D95197J070745D89173k35390L76145M55273
$$ 728413 1151704 69240 348210 1021552 495197 1565942 489173 253783 629928 1085201
13545A085201k78097R2071O7860A06585N72444n2907J25480k0324j26625A94611
$$ 1085201 807104 899175 967035 106585 679029 626122 751602 731278 604653 194611
13534A163877K65508I1835N78234k99311o328E0402K52401Q64076A12005N07755
$$ 1163877 1429385 91835 670069 370758 364430 50402 302803 1166879 112005 619760
13524F19760B89116m9367K96242J49880Q5157A55065N20852p0432k31497N09769
$$ 619760 289116 239749 535991 685871 771028 155065 675917 605485 373988 883757
13514H83757a85480D76547M1956j74522O60752m47625K35880b31708F19289j66299
$$ 883757 -185480 476547 518503 343981 1004733 557108 792988 -231708 619289 452990
13504D52990j77929N73008l77772M29909B76876K27223K02601j26071P93806l90114
$$ 452990 275061 848069 470297 900206 276876 504099 706700 580629 1374435 984321
13494I84321D29516p3570L30233p5900J57974I2635N50163B98939o2102L78860
$$ 984321 429516 355946 686179 610279 768253 92635 642798 298939 236837 615697
13484F15697k57850K39930E2993i2786F46675k54618L88837j11476b82535C53816
$$ 615697 357847 597777 52993 -92786 646675 392057 780894 669418 -282535 353816
13473C9631R35424B61416N99490M70728E36554k28338L4398e00060F03295k42068
$$ 39631 975055 261416 860906 1331634 536554 308216 342614 -500060 603295 361227
13463C61227M18943j52379K04270m15920J87380A52372J04371c41446A81924N90386
$$ 361227 780170 627791 832061 416141 603521 152372 256743 -341446 181924 772310
13453G72310q6521B55425Q4757N96167l05859j19861j12625J11951J36256b3432
$$ 772310 685789 255425 340182 936349 630490 510629 398004 509955 646211 -23432
13442F08627G7197P08070B43682a15686C24905k1264Q9086K30361F5807N09522
$$ 608627 77197 785267 243682 -115686 324905 303641 392727 623088 65807 575329
13432E75329K81310l3594J69571J12354j80409B15511K50787L04478K14328F7251
$$ 575329 856639 823045 992616 1104970 924561 215511 466298 770776 985104 67251
13421C91228M19524k32687P2990d8519C23861J16463B07009J99798K13871J2822
$$ 391228 810752 578065 651055 -48519 323861 440324 207009 406807 620678 633500
13411F33500k98363J67472A33641M17507j71393L79859J98858D05599K12642J73824
$$ 633500 335137 502609 133641 551148 379755 759614 958472 405599 618241 792065
13401G92065k49998B38484K35528O104q3709j72656J69744A48693N79863l30084
$$ 792065 542067 238484 474012 480116 396407 223751 393495 148693 728556 398472
13391C98472P0958d43589A118118l21123j31844a46861E08717k50890c0510D8185
$$ 398472 469430 -443589 1118118 796995 665151 -146861 508717 257827 -30510 48185
13380E26113j08141G5176J56620K39K64305j84269Q5334N5477O9154H3066N6325
$$ 526113 417972 75176 231796 232035 496340 312071 397405 452882 522036 83066 139391
13369A39391K87663R8985A88454M14963J66468k40145M79538d8830B92079J24071
$$ 139391 427054 526039 188454 603417 769885 529740 1009278 -48830 292079 416150
13359D16150L16644c14977C42021C4675K06976P42929C18733N73733P9711g7379
$$ 416150 732794 -314977 342021 34675 241651 984580 318733 892466 972177 -77379
13348d2211D70429B18950i5994A172452A85632O72717B53479P03276l02336k40603
$$ -42211 470429 218950 -95994 1172452 185632 858349 253479 956755 654419 413816
13338D13816P28841m34287B30981L20608k29488G959K72835Q1638j53394K64580
$$ 413816 1142657 708370 230981 551589 322101 7959 280794 362432 209038 473618
13328D73618K84740j09221k84357K98672G3613R0614M48926k50769J35538Q8143
$$ 473618 758358 649137 364780 663452 73613 164227 613153 362384 497922 586065
13318E86065A41594j3457K59368j05879M0168A12747j2438J89562K25236B22898
$$ 586065 141594 128137 387505 281626 321794 112747 100309 289871 515107 222898
13307D75862a15253D98047B8262O03822A68391N46290m9211k14952j91858J00534
$$ 475862 -115253 498047 28262 632084 168391 714681 665470 450518 258660 359194
13297C59194K72288h2691E80958b93279D12860j26358L13521B77407L43567k13589
$$ 359194 631482 -82691 580958 -293279 412860 286502 600023 277407 620974 407385
13287D07385j99139O8057K94905k01730a2829C14676M4887m1938A03920K90555
$$ 407385 208246 276303 571208 369478 -12829 314676 359563 317625 103920 394475
13277C94475h0925j09125C53199K11388L25499f4245B81851M65474k85773p8683
$$ 394475 -80925 -190050 353199 564587 890086 -64245 281851 747325 461552 382869
13267C82869P98310E23151J91058c3323k54803K8856E27895I8156k8877a21205
$$ 382869 1181179 523151 714209 -33323 -288126 -259270 527895 98156 69279 -121205
13256C8014M19059H5968a21087H4643b8189B82120P34778B91076c24328a37059
$$ 38014 457073 85968 -121087 84643 -28189 282120 1016898 291076 -324328 -137059
13245b03848E52380b56231F63123b06054F57467E536L05862J81876h7838L551
$$ -203848 552380 -256231 663123 -206054 657467 5536 311398 493274 -87838 -84287
13235h4287C09512R83136A54933A5341M53409A16354M52498b74222D46986q8631
$$ -84287 309512 1292648 154933 15341 468750 116354 568852 -274222 446986 358355
13225C58355g0642A39748B3132P8668L62079g3569A94305c02904F70186k52479
$$ 358355 -70642 139748 23132 101800 463879 -73569 194305 -302904 670186 417707
13215D17707d69728C21698A17929a10622C37585e8719A63458c8214r38081C36606
$$ 417707 -469728 321698 117929 -110622 337585 -58719 163458 -38214 -976295 336606
13204G0811M0805e5164B73673j03321d80717D73055b0078I97742A79795J0514
$$ 70811 111616 -55164 273673 170352 -480717 473055 -20078 997742 179795 190309
13194A90309J66520f63348A482L97531J76563B66491J03433N39540B07305h6386
$$ 190309 356829 -663348 1482 399013 575576 266491 369924 909464 207305 -86386
13183A41480N3791O0005j12973l7151K69359C9298A4325P42585H1366c54334C09853
$$ 141480 195271 255276 142303 105152 374511 39298 14325 756910 81366 -354334 309853
13171C22090H7078d40623F72455h90E39895j21359j13267b59403E87809p8447
$$ 322090 87078 -440623 672455 -890 539895 418536 305269 -259403 587809 509362
13161E09362M2781B21775R2631G8671g2449A43150B3580J9411b111D6807B3358
$$ 509362 552143 221775 314406 78671 -72449 143150 23580 42991 -2111 46807 23358
13149H75939C92580j2506j26001M30268A0919R02607k79086b19042L8880m1058
$$ 875939 392580 380074 254073 684341 10919 913526 634440 -219042 -180162 -221220
13139b21220B42384j18829E4373c6095g007p4535j93706A16323d7637H7380M0667
$$ -221220 242384 123555 54373 -36095 -7007 -81542 -275248 116323 -47637 87380 128047
13128A28047J82819A17316a39730B32920L84641b23341C58017j4208b32844A28250
$$ 128047 310866 117316 -139730 232920 617561 -223341 358017 343809 -232844 128250
13117C6435M62012B11791f7814C70621G1148L95456A29203J62897b56015D01731
$$ 36435 498447 211791 -67814 370621 71148 466604 129203 292100 -256015 401731
13106B36050d2892j08464E76155f3915B01429I4043M07470j02888J15966f49347
$$ 236050 -42892 -151356 576155 -63915 201429 94043 501513 398625 514591 -649347
13095H8192K56018j17160L88365e16340E24913B59914b92714G26665C38315n5440
$$ 88192 344210 227050 615415 -516340 524913 259914 -292714 726665 338315 282875
13085B82875k3373K43215j18055b99540a9783B27752R3556K71423A46263K75190
$$ 282875 259502 502717 384662 -299540 -19783 227752 321308 592731 146263 421453
13075D21453M5700L59134d8714C73990o892L79448b48642G89922h97205A96904
$$ 421453 467153 826287 -48714 373990 367098 746546 -248642 789922 -897205 196904
13064C98716e3692D23982a59650D928N61339k47761e77628C41225a95182F97512
$$ 398716 -53692 423982 -159650 4928 566267 318506 -577628 341225 -195182 697512
13053e12986C67935m7039p6022G5959f10732a09551k72311C32308c2086o8908
$$ -512986 367935 320896 244874 75959 -610732 -109551 -381862 332308 -32086 -100994
13043a00994H37628A85127l2831E9861K16024d53968C99454A8828a85781A98294
$$ -100994 837628 185127 152296 59861 275885 -453968 399454 18828 -185781 198294
13032A06120K68671h13A92350N02789C3807M53928M61590C6627N89884O7589B37
$$ 106120 374791 -813 192350 695139 33807 487735 949325 36627 626511 694100 237
13020a96882I56864F7154M44557d66434B22885K16932d69507H6816k7925K1872
$$ -196882 956864 67154 511711 -466434 222885 439817 -469507 86816 58891 80763
13010H0763a88960A81884J56940A32641l2826O0850K557L03303M26892b79107
$$ 80763 -188960 181884 338824 132641 99815 160665 163222 466525 893417 -279107
12999g09938A01948J98409F5653d41698J81758C61257K26007l1503A91464C7791
$$ -709938 101948 300357 65653 -441698 -259940 361257 587264 555761 191464 37791
12988b37429p1120E83090f3977k07725C6189K05113o1631b70124F6118d37929
$$ -237429 -308549 583090 -63977 -271702 36189 241302 179671 -270124 66118 -437929
12977c2271l2517n30493C82877c51340E35949c42082E4875M80498c66342Q7993
$$ -32271 -64788 -595281 382877 -351340 535949 -342082 54875 535373 -366342 -278349
12967b78349a7094j19437A86466K38069j93570G7716K35540k0108l8178g2337
$$ -278349 -17094 -136531 186466 424535 230965 77716 313256 293148 254970 -72337
12956D70107B06284O13906E9258O92404k47554B16334L9724j24159b89354H3266
$$ 470107 206284 820190 59258 751662 504108 216334 256058 131899 -289354 83266
12945I56342g5431l80815C61576b90340a5468E45038J68533B25017d18607F5081
$$ 956342 -75431 -456246 361576 -290340 -15468 545038 713571 225017 -418607 65081
12934c11759a0780C63225A04162K76942g178H0791b35514G5054M29219n1967f65069
$$ -311759 -10780 363225 104162 381104 -7178 80791 -235514 75054 504273 452306 -665069
12922B47267N51718l38245k15113M4864c03615A78682j4452a79361l14465B45054
$$ 247267 798985 460740 245627 290491 -303615 178682 164230 -179361 -493826 245054
12911e0049m52489B22787a96663A69926q1127L0890K99089f2051j8698E0937g8877
$$ -50049 -502538 222787 -196663 169926 88799 119689 418778 -62051 -80749 50937 -78877
12899E70441b80913A28922a92193f6133J9283C10631A16725a50633j45730M6889
$$ 570441 -280913 128922 -192193 -66133 -46850 310631 116725 -150633 -296363 -249474
12889b49474B93147Q3730b0495C62984A09253J22548R7784q2544b48031D00706
$$ -249474 293147 376877 -20495 362984 109253 231801 329585 247041 -248031 400706
12878A53703e60776C05247a68132E24519A71893L30402j48229c63014F0386M45358
$$ 153703 -560776 305247 -168132 524519 171893 502295 354066 -363014 60386 505744
12868E05744B28302Q0483f46592J26170a76344E3657Q0903d58603B2946M81258
$$ 505744 228302 308785 -646592 -520422 -176344 53657 134560 -458603 22946 504204
12858E04204h2937B79322P3639r6496k6667B2374c7417n831B24540a22177C57160
$$ 504204 -82937 279322 352961 256465 229798 22374 -37417 -43248 224540 -122177 357160
12846b10465A99719b80772J02302L9590k35815B01056L0562B565L0632L11032
$$ -210465 199719 -280772 -178470 -138880 -374695 201056 231618 2565 33197 344229
12836C44229J8239a06506D80266f11950E0687N18308F5528M60885d04297a08018
$$ 344229 362468 -106506 480266 -611950 50687 568995 65528 526413 -404297 -108018
12825B38817r9730R1104b33190G242a94929E1151J66658G6313b04706B04307K14496
$$ 238817 139087 230191 -233190 7242 -194929 51151 217809 76313 -204706 204307 418803
12814D18803h7328k67293D62622k10326i562D22165b10411B11541A01462i6401
$$ 418803 -87328 -354621 462622 252296 -9562 422165 -210411 211541 101462 -96401
12803c9680D57416f47030F65000j2615C23255M3425b2692A47686M95076A3315
$$ -39680 457416 -647030 665000 652385 323255 366680 -22692 147686 642762 13315
12792A21422a27656A02046b3217A88659E6493J07023d49519B42358r2709j7599
$$ 121422 -127656 102046 -23217 188659 56493 163516 -449519 242358 149649 132050
12782A32050L03558c25490n58107C08919e10828A47088b45343Q8277N9086G77165
$$ 132050 435608 -325490 -883597 308919 -510828 147088 -245343 -157066 -97980 777165
12771b16678D6743f3405I33371b28805C37623J39179e58602a96778E03969A20896
$$ -216678 46743 -63405 933371 -228805 337623 476802 -558602 -196778 503969 120896
12760A60365I528c04494c9307k8952D5520P90764j3154C99318f69214b46685C83548
$$ 160365 9528 -304494 -39307 -68259 45520 836284 823130 399318 -669214 -246685 383548
12748A6221O9117J56224P06508m35065j63089f23896K67757p4030k12090G7426
$$ 16221 85338 241562 948070 513005 349916 -623896 -356139 -430169 -642259 77426
12737E84496G3565J71175A14402M98375a38183D30413r0597K79149B80417a04978
$$ 584496 73565 244740 114402 612777 -138183 430413 339816 618965 280417 -104978
12726A07124K33867b21422A47835M30976A55387a33481j45223E86244K21799a60815
$$ 107124 340991 -221422 147835 578811 155387 -133481 -278704 586244 808043 -160815
12715C1259c36155D60013a17052C06403h05592C83802b86287O9532E12524f0743
$$ 31259 -336155 460013 -117052 306403 -805592 383802 -286287 -216755 512524 -60743
12704i092E58462j31680b5944B20523K25801B21614r9643M43424k17035J78194
$$ -9092 558462 426782 -25944 220523 446324 221614 121971 565395 348360 526554
12694E26554k00119M33348L9988A89593b57307B75452F4914R9018G6021K14874
$$ 526554 326435 759783 799771 189593 -257307 275452 64914 163932 76021 290895
12684B90895e3564I27352g7115G21841b89628A555K02164J81581N03712A73703
$$ 290895 -53564 927352 -77115 721841 -289628 1555 203719 385300 889012 173703
12673g9394A3356b64241G41033k76772a06538G73120R32h8136C14699A05083f12352
$$ -79394 13356 -264241 741033 464261 -106538 773120 774052 -88136 314699 105083 -612352
12661B44698L9140K1310O13202D30119h911C05018N28763f2186B25217O30481
$$ 244698 283838 305148 918350 430119 -8911 305018 833781 -62186 225217 855698
12651H55698G4664c8212A19094a47455O9354C61505p6059I4071j0011Q13693m09351
$$ 855698 74664 -38212 119094 -147455 -78101 361505 285446 94071 84060 897753 488402
12640D88402a24531e6856C65570e0798B96718A23711I433J9443M7900b89060B30176
$$ 488402 -124531 -56856 365570 -50798 296718 123711 9433 28876 76776 -289060 230176
12628F05563d69669A82889b87191B73410J02807M5885O0041A04792K50374P7647
$$ 605563 -469669 182889 -287191 273410 376217 422102 482143 104792 355166 432813
12618D32813A85500g0658A84948a76065D4674O8366E6187K60079K85874o2832
$$ 432813 185500 -70658 184948 -176065 44674 113040 56187 316266 602140 539308
12608E39308c2290D05691I137b05388d8098C85054b02568B78006j25445P01123
$$ 539308 -32290 405691 9137 -205388 -48098 385054 -202568 278006 152561 853684
12598H53684B48978M5508J12510m0513B7555b49935A77644a0394F81743g9740
$$ 853684 248978 294486 406996 366483 27555 -249935 177644 -10394 681743 -79740
12587B04945a53580k56030A60239b44537E19058a63390H5556M25040b00149A13285
$$ 204945 -153580 -409610 160239 -244537 519058 -163390 85556 510596 -200149 113285
12576a05330M8618C83006b8269C96299A53016c53912C38866j31675J56030f3522
$$ -105330 -56712 383006 -28269 396299 153016 -353912 338866 207191 363221 -63522
12565A33467K45152d0066C7161K07165n8463k9298a55636l15467J61393G9442
$$ 133467 378619 -40066 37161 244326 185863 156565 -155636 -471103 -309710 79442
12554H4451J94069B2712K74033C3483N86062m1735A10614b84921k47351A16814
$$ 84451 278520 22712 296745 33483 619545 577810 110614 -284921 -532272 116814
12543C9510a38333B30959n0147J5256L86767j73733d97854a53861H7801c08886
$$ 39510 -138333 230959 180812 196068 582835 409102 -497854 -153861 87801 -308886
12532b81440C54332J99355A68469M48479A56558d777l5826G0331P4476c48881
$$ -281440 354332 553687 168469 616948 156558 -4777 -40603 70331 144807 -348881
12521F32984I2121a6669o54053C6637H843a80049I1352O16879i3171A47897a72712
$$ 632984 92121 -16669 -670722 36637 8843 -180049 91352 708231 -93171 147897 -172712
12509E19792B9270a06579k84484a9310j01306F0409J65126q6756a64684G59079
$$ 519792 29270 -106579 -391063 -19310 -120616 60409 225535 138779 -164684 759079
12498a77795D79074A08407B3567M42804A88459C1265b660l34820D81677c75558
$$ -177795 479074 108407 23567 466371 188459 31265 -2660 -337480 481677 -375558
12487c63011E84452L0127k86609e16698E96732r8013h5178c5830m17804A62355
$$ -363011 584452 614579 327970 -516698 596732 498719 -85178 -35830 -453634 162355
12476I8663P65742B05264L47202L12369l02964B7788L30874L15374B96753n803
$$ 98663 864405 205264 552466 864835 561871 27788 358662 674036 296753 290950
12466B90950j20747c04066j76827A75142j4609a86874C34278M0441A67688L1748
$$ 290950 170203 -304066 -480893 175142 160533 -186874 334278 374719 167688 199436
12456A99436d25697C67282f9108k74402A65331d65918A085300c32504A39475a41712
$$ 199436 -425697 367282 -69108 -343510 165331 -465918 1085300 -332504 139475 -141712
12445f5964j19636G19789l40545f9539l1950m08794A06047O34368a96596D96082
$$ -65964 -185600 719789 379244 -69539 -101489 -510283 106047 740415 -196596 496082
12434F070a74970E0285b57379g7B20492d50160A84365a5064D86368a30070A09458
$$ 6070 -174970 50285 -257379 -77 220492 -450160 184365 -15064 486368 -130070 109458
12422e30954D56313F3881L01792a08240E05689a9791j08491B03469c34853m91097
$$ -530954 456313 63881 365673 -108240 505689 -19791 -128282 203469 -334853 -825950
12412h25950A81836o6597i1171G91815A34474a94545A20640Q9432M757J5569f0176
$$ -825950 181836 115239 -91171 791815 134474 -194545 120640 210072 214829 230398 -60176
12400a65608I5205b46511l7915q8801R429K8665Q364N8224C7843N54749E7385
$$ -165608 95205 -246511 -284426 -373227 -363798 -335133 -326769 -268545 37843 592592 57385
12388D02771J92048B36437a89180E85975f1835A50273J4589N9788o2422a48172
$$ 402771 594819 236437 -189180 585975 -61835 150273 164862 224650 162228 -148172
12377h6211n59364j5724L22417j06296a58886j64941J47323D64326A32350b14766
$$ -86211 -645575 -661299 -338882 -445178 -158886 -323827 -176504 464326 132350 -214766
12366E2123K49686a89546C93683p7808I2102J72042l1368a17458k0658n0188G3153
$$ 52123 301809 -189546 393683 315875 92102 264144 232776 -117458 -138116 -188304 73153
12354e7177B14496L0044M88736A45079g82754a5685n29171b34017D6955O92796
$$ -57177 214496 244540 733276 145079 -782754 -15685 -544856 -234017 46955 739751
12344G39751j23855j09005g81978b29457K5593E91471b62961B37083I1152a77619
$$ 739751 615896 506891 -781978 -229457 -203864 591471 -262961 237083 91152 -177619
12333b31772E6457c94524J55320B47659a89915A20709a1429A098436C09262L0531
$$ -231772 56457 -394524 -239204 247659 -189915 120709 -11429 1098436 309262 339793
12323C39793M30767A71340K40505r193K0003b54825B12015c63865a18091C08618
$$ 339793 770560 171340 411845 402652 422655 -254825 212015 -363865 -118091 308618
12312a43757D11185A7822J51130g03096E51085r6228A23533K0428c32236A54538
$$ -143757 411185 17822 168952 -703096 551085 454857 123533 143961 -332236 154538
12301E55812a98339E81268j49425b49223r6786H7493K6648J50332L8229b37980
$$ 555812 -198339 581268 431843 -249223 -346009 87493 114141 264473 302702 -237980
12290b20444c8728A10694b21123d5584a4243D42290D3333b18641k81929B02235
$$ -220444 -38728 110694 -221123 -45584 -14243 442290 43333 -218641 -500570 202235
12279G17277a23064a9767G52531B20546b53961E11826k25041j22215c13199C71567
$$ 717277 -123064 -19767 752531 220546 -253961 511826 286785 164570 -313199 371567
12268D8319O71361k78752k02429l4247M49345A01592m7884J6794A4046O49936
$$ 48319 719680 440928 238499 204252 653597 101592 53708 70502 14046 663982
12258F63982a518A82717Q7538Q34290j89097l49496J20476C3610J046703C73482
$$ 663982 -1518 182717 270255 1104545 915448 565952 686428 33610 1080313 373482
12247B77920m0359N98368C78647O1120j30897K24163F8402a60224j29736D95593
$$ 277920 237561 835929 378647 439767 308870 533033 68402 -160224 -289960 495593
12236F55836j02747B35014A02133O40314j01196d93929F484K82279q8154J49265
$$ 655836 553089 235014 102133 742447 641251 -493929 6484 288763 200609 349874
12226C49874M7058D400K90468J32608n1299p0806L13538k41464j47429q7325P30021
$$ 349874 396932 4400 294868 427476 376177 305371 618909 377445 230016 142691 872712
12215H72712B74797O1425a01257G77038A56762O62730d62747J00660K3211I51409
$$ 872712 274797 336222 -101257 777038 156762 819492 -462747 -362087 -338876 951409
12204C84659j915B8406a8310B70925L31495k42506f2667I64125c62763B44430
$$ 384659 382744 28406 -18310 270925 602420 359914 -62667 964125 -362763 244430
12193A26676m0905J56899M1096A14197J38146L43660J2871L74532B57431M44612
$$ 126676 85771 242670 283766 114197 252343 596003 608874 983406 257431 702043
12183G02043N6581b0702A40285K34500d95344d2633B53784f6238q6407E40451
$$ 702043 758624 -20702 140285 374785 -495344 -42633 253784 -66238 -152645 540451
12172E26815g2601D18866J3285q7151J2456d31527A83806M04688n9943B02767
$$ 526815 -72601 418866 432151 345000 357456 -431527 183806 588494 528551 202767
12161A2827h50947f3341A68556O1702N82073k82554b2203C27018a67482j70821
$$ 12827 -850947 -63341 168556 230258 812331 529777 -22203 327018 -167482 -338303
12151c38303A2515J37170e1402C44830N21957a49460C45956K46708D7210b59275
$$ -338303 12515 149685 -51402 344830 866787 -149460 345956 592664 47210 -259275
12140b18764D88612A27256M04042K0244j62233p2979r7991d22347C3808a22217
$$ -218764 488612 127256 531298 551542 389309 316330 218339 -422347 33808 -122217
12129D72148a91345q7816J5306a6570C33540K90467E6909K07733g4804E39348
$$ 472148 -191345 -279161 -263855 -16570 333540 624007 56909 264642 -74804 539348
12118b02397B52905g3085m78111b39836B5597J75750i4624C74139j67933J85581
$$ -202397 252905 -73085 -551196 -239836 25597 201347 -94624 374139 206206 391787
12108C91787F4985d3657j13296m57678C1491f86375C23601m4914p7309n568M31639
$$ 391787 64985 -43657 -156953 -614631 31491 -686375 323601 278687 201378 195810 627449
12097F27449D7050Q9492h49560E07869h3571C12332E6588L31401c01572a09307
$$ 627449 47050 136542 -849560 507869 -83571 312332 56588 387989 -301572 -109307
12086b25469C81442q1394a76240M4941E8034b40644l02385J09751B36602e19478
$$ -225469 381442 300048 -176240 -131299 58034 -240644 -543029 -433278 236602 -519478
12075a93913C19347e08346B42951J74529E1440M59656b14306r2430F6410b15803
$$ -193913 319347 -508346 242951 417480 51440 511096 -214306 -306736 66410 -215803
12064A65949b83309p4500B59621R2499A46081J52324c72298l39000A85328a63300
$$ 165949 -283309 -357809 259621 352120 146081 298405 -372298 -711298 185328 -163300
12053B73238P33559D27424A05092c99353E05330k13017A16456O42472f1244A51739
$$ 273238 1006797 427424 105092 -399353 505330 292313 116456 758928 -61244 151739
12042c31585G55574c62594d1861B70806O67249m11931F5380c28045C16085M89281
$$ -331585 755574 -362594 -41861 270806 938055 526124 65380 -328045 316085 805366
12032H05366B56803b25888B0380N6664g08408A56911b38623d3884C93441a36095
$$ 805366 256803 -225888 20380 77044 -708408 156911 -238623 -43884 393441 -136095
12021B1050A090N40739i3711B24106d94996k0149A54969b72108D97766o2652A62255
$$ 21050 1090 541829 -93711 224106 -494996 -515145 154969 -272108 497766 435114 162255
12009C13349e24206D34656b90758C80737j25680b21050B05944j9750h1755l11052
$$ 313349 -524206 434656 -290758 380737 255057 -221050 205944 186194 -81755 -392807
11999c92807a95650A40007d72548A1232L70109Q71675a8283E243b47316A0462
$$ -392807 -195650 140007 -472548 11232 381341 1253016 -18283 5243 -247316 10462
11988A4254a95570C53718A07657K18745d67930A20313J55224j26010c42361K1279
$$ 14254 -195570 353718 107657 326402 -467930 120313 275537 149527 -342361 -321082
11978c21082D24336j35995O9226c77899J04921E80766f30711A65509a40900C50281
$$ -321082 424336 288341 357567 -377899 -272978 580766 -630711 165509 -140900 350281
11967b11231B35879c83612a49942A90875I064c52553B55938c17019b2293D4696
$$ -211231 235879 -383612 -149942 190875 9064 -352553 255938 -317019 -22293 44696
11956C4980J36811d42050N2109D3085a94337C32393A03539C8384f4128E72468
$$ 34980 171791 -442050 -389941 43085 -194337 332393 103539 38384 -64128 572468
11945A95935b8877j62809j45818G93351h3900H1280K53157A3229J49943b7762
$$ 195935 -28877 -191686 -337504 793351 -83900 81280 334437 13229 163172 -27762
11934I3139C211M01293J81700B73326j06345c40263D8297b71998o23681c03020
$$ 93139 3211 404504 586204 273326 166981 -340263 48297 -271998 -895679 -303020
11923f7838C61049A09350a65845B40683a14234m25226H6066e67191C8333P5806
$$ -67838 361049 109350 -165845 240683 -114234 -539460 86066 -567191 38333 114139
11913A14139b5391E12829J13246e47173D45572C7717J38255L07220A26018a92878
$$ 114139 -25391 512829 626075 -547173 445572 37717 175972 483192 126018 -192878
11902A82130I0495J52672A07154a34086k8089M9792j703a0147D84202p2200A68671
$$ 182130 90495 243167 107154 -134086 -162175 -112383 -114086 -10147 484202 412002 168671
11890b58859r3103I76372C53919d90870A32543d30491C50574o0803a42139c6760
$$ -258859 -351962 976372 353919 -490870 132543 -430491 350574 289771 -142139 -36760
11879e79003M5104B58054e69838d7188A63544d08713B64147p9079L3882F0460
$$ -579003 -533899 258054 -569838 -47188 163544 -408713 264147 185068 218950 60460
11868c80947a76368f4521A57431A7404a35940C17620g4738n00401A37525i0302
$$ -380947 -176368 -64521 157431 17404 -135940 317620 -74738 -575139 137525 -90302
11857b58573n32026c91849J50509l34276b12414r9918j20030N3448a64956B95972
$$ -258573 -790599 -391849 -241340 -575616 -212414 -312332 -432362 -378914 -164956 295972
11846g6683B76592b572m2121F48494h5887q4816C64185b64851B25399d787r4120
$$ -76683 276592 -2572 -44693 648494 -85887 -170703 364185 -264851 225399 -4787 -98907
11835i8907E990Q3048j5868f48359B75604J50388K7554J45864d0431D72778C6658
$$ -98907 5990 89038 73170 -648359 275604 425992 453546 599410 -40431 472778 36658
11823c20568j47988E53788j50469e3160D71390E7667a02948A64839b12892N3440
$$ -320568 -468556 553788 403319 -53160 471390 57667 -102948 164839 -212892 -159452
11813a59452p0832D48188b07632j18249D33286h6223O085l44470P6699P1567D0268
$$ -159452 -230284 448188 -207632 -325881 433286 -86223 -80138 -424608 -347909 -276342 40268
11801C63863a31775l0581E9894e3822A06382n2979L02252c4916j03690c9450C46533
$$ 363863 -131775 -162356 59894 -53822 106382 53403 355655 -34916 -138606 -39450 346533
11789C77594c83960E83a65699B34431d34299a12572A19005a66919B47928K29158
$$ 377594 -383960 583 -165699 234431 -434299 -112572 119005 -166919 247928 477086
11779D77086J06156k14687f7627k28725A86004a8403A75753O00677F8609A0487
$$ 477086 583242 368555 -67627 -296352 186004 -18403 175753 776430 68609 10487
11768C04595j19398K6520o2767c79709a55952m13874i0770C02074C7188i5246
$$ 304595 185197 211717 148950 -379709 -155952 -569826 -90770 302074 37188 -95246
11757b91815a37809B19217a59831C43663a97790A03438A6523h1562E48418F2691
$$ -291815 -137809 219217 -159831 343663 -197790 103438 16523 -81562 548418 62691
11746e9357J5647B73646K7914a54804A54846n831b40535A08479K6863D1468d17231
$$ -59357 -43710 273646 301560 -154804 154846 149015 -240535 108479 135342 41468 -417231
11734E74039D9680e67604a80648m35040A41057N1673b36917Q3398B49445q9594
$$ 574039 49680 -567604 -180648 -615688 141057 192730 -236917 -153519 249445 159851
11724A59851b47402O9619B82714d41718h9307o4790b5414F08579j75342c45364
$$ 159851 -247402 -177783 282714 -441718 -89307 -154097 -25414 608579 433237 -345364
11713A54713a88071j55535D43123A67005L84643B26637b22297J05556A44428K97520
$$ 154713 -188071 -343606 443123 167005 551648 226637 -222297 -116741 144428 441948
11703D41948d16931B37637f52254H3538g17073B42589a23543E43628c41602D6036
$$ 441948 -416931 237637 -652254 83538 -717073 242589 -123543 543628 -341602 46036
11692D42434e2929m24505A85793F3655a67654j48191C71228c64271C17224L32076
$$ 442434 -52929 -477434 185793 63655 -167654 -315845 371228 -364271 317224 649300
11682F49300d2397B63456L0501b46322m7685K7867M2906j00725C88504j18824
$$ 649300 -42397 263456 293957 -246322 -294007 -266140 -223234 -323959 388504 269680
11672B69680K10303b20327h1490C65850c75933g8537D87606j91815D1816j2794
$$ 269680 479983 -220327 -81490 365850 -375933 -78537 487606 295791 41816 29022
11662B9022R552K11767e3414H7926b20775B03702L69507j88952g38871D72643
$$ 29022 38574 250341 -53414 87926 -220775 203702 573209 384257 -738871 472643
11651b00596G07617k10104A40620g766C66538P3384A10761J19719q2610b31645
$$ -200596 707617 497513 140620 -7766 366538 439922 110761 230480 147870 -231645
11640a19262j90412E75084A09700a61315D15366g048l51255D49754b18140J2425
$$ -119262 -309674 575084 109700 -161315 415366 -7048 -358303 449754 -218140 -205715
11630b05715k22141J29453D66274a43804k71055B44688K66914E2084J10157N33070
$$ -205715 -427856 -298403 466274 -143804 -414859 244688 511602 52084 162241 695311
11620F95311c97159C56443e56374L333A81924i23798J81657B81987b35580A24570
$$ 695311 -397159 356443 -556374 -553041 181924 -923798 -742141 281987 -235580 124570
11609a89126f2309G59186d78415G97679L5586B58448L00835A38117P24537A12437
$$ -189126 -62309 759186 -478415 797679 833265 258448 559283 138117 862654 112437
11598B28889i2555G68934a20634F339e5838H4883g9707A85210E2082K65449j55106
$$ 228889 -92555 768934 -120634 6339 -55838 84883 -79707 185210 52082 317531 162425
11587A62425a69417j35426C96109A04032L56125A96536f56176B41747K31791m6588
$$ 162425 -169417 -304843 396109 104032 460157 196536 -656176 241747 473538 426950
11577D26950L1062j38411A4890L67099n5868D4288e762A36097a75808G37303j158
$$ 426950 458012 319601 14890 381989 326121 44288 -5762 136097 -175808 737303 736145
11566G36145a13268E03389Q4884f112F59898j54722A86588K6883D7064b11574
$$ 736145 -113268 503389 588273 -6112 659898 505176 186588 213471 47064 -211574
11555B91538A39549L66570K6976g335F43051e50140A48344e19797E33371E4875
$$ 291538 139549 506119 533095 -7335 643051 -550140 148344 -519797 533371 54875
11544a29065M1673F528M82571c00257h2933A29290e4344D78553q4996c4441E90484
$$ -129065 -87392 6528 489099 -300257 -82933 129290 -54344 478553 393557 -34441 590484
11532B80774l3830J52038A15702j8228L40179b25395N1294g2900k62152E81172
$$ 280774 246944 398982 115702 97474 437653 -225395 -174101 -72900 -335052 581172
11521i9669C62067j31264O4506A34114D8711L49816L88461k84870d22869A57860
$$ -99669 362067 230803 295309 134114 48711 398527 786988 502118 -422869 157860
11510D19989a80505O3105G3126K18812p9136L26334b37217B1459P27459k20958
$$ 419989 -180505 -117400 73126 291938 212802 539136 -237217 21459 748918 527960
11500E27960A59036M25151k91375d9319A04346b23091D29662A78385a11274E13765
$$ 527960 159036 584187 292812 -49319 104346 -223091 429662 178385 -111274 513765
11489G75552B38876K78633J32764B69603a60580g5073C87497r7847L30578a10236
$$ 775552 238876 517509 650273 269603 -160580 -75073 387497 289650 620228 -110236
11478E07144c78562f576E91072i354E21327A12956M57774C4903M84764b76606
$$ 507144 -378562 -6576 591072 -9354 521327 112956 570730 34903 519667 -276606
11467E33743B43842K54022b37925C74158A29537J75555K56297J66542a69408A70564
$$ 533743 243842 497864 -237925 374158 129537 305092 561389 727931 -169408 170564
11456D65141A30960Q8542b40382C31294B3665L6549N09461a21756J4351G39847
$$ 465141 130960 219502 -240382 331294 23665 60214 569675 -121756 -107405 739847
11445b64964F94587a76115B0462a98382A10292L4123J130101A3906a19743a811
$$ -264964 694587 -176115 20462 -198382 110292 144415 1274516 13906 -119743 -1811
11434D12471A41903f7048C2294N43694A86084F8964J4122a9157m58281d2436D738
$$ 412471 141903 -67048 32294 575988 186084 68964 83086 -19157 -477438 -42436 4738
11422D98501b37748o2410f2150D11549A37701J66890P25878B74826J9215K20499
$$ 498501 -237748 -300158 -62150 411549 137701 304591 1030469 274826 294041 514540
11412E14540a81589J0130o5243B95293f35463F79686k10065A71743J6247P5228
$$ 514540 -181589 -171459 -236702 295293 -635463 679686 469621 171743 187990 263218
11402B63218h3872l7275B79560j28617e63835f5126H57813C56507h8386K4535
$$ 263218 -83872 -121147 279560 150943 -563835 -65126 857813 356507 -88386 -63851
11392f3851B8933N94806k20755q1895k8094l5956N1302r9446H1382L2236a0837
$$ -63851 28933 623739 402984 321089 292995 257039 308341 208895 81382 113618 -10837
11380B71884j0346b38898l57975a09478A67167g473E1924f77477B62559c87133
$$ 271884 261538 -238898 -596873 -109478 167167 -7473 51924 -677477 262559 -387133
11369A22840c73149H4402O52600a72473Q4180H0674f83460E08727B4139d14099
$$ 122840 -373149 84402 737002 -172473 -88293 80674 -683460 508727 24139 -414099
11358a3765k38926B45182a80116k83106b26735P9643L8705j14319j1013B59622
$$ -13765 -252691 245182 -180116 -463222 -226735 -147092 -108387 -222706 -233719 259622
11347c41108c7724q21445M7573A156141D4894b34697A05526A6214L27621a8411
$$ -341108 -37724 -859169 -811596 1156141 44894 -234697 105526 16214 343835 -18411
11336C32697a31958A85527e40697a8815E4089J7640a44360k75409J38316k19789
$$ 332697 -131958 185527 -540697 -18815 54089 71729 -144360 -419769 -281453 -501242
11326e01242j90528B86227a54025n76071a50085m7693l1072Q4344E64715a33629
$$ -501242 -691770 286227 -154025 -730096 -150085 -197778 -228850 -144506 564715 -133629
11315A72425k7418b01368k72106C50872M7215A36401a17519D67412a93380j56259
$$ 172425 145007 -201368 -473474 350872 398087 136401 -117519 467412 -193380 -349639
11305c49639D62966b18177C6327d3298C5799M3104f58196a82760D44763i12790
$$ -349639 462966 -218177 36327 -43298 35799 78903 -658196 -182760 444763 -912790
11294E61072q5487j73617e66019A08662b34893k69247i8435B34109M98065c37726
$$ 561072 475585 301968 -566019 108662 -234893 -504140 -98435 234109 732174 -337726
11283E4677d65843B37323b55641e62l11536g6013o3036D27998K8741h32259a87789
$$ 54677 -465843 237323 -255641 -562 -312098 -76013 -139049 427998 456739 -832259 -187789
11271G51204C9104b15282j2074k46532B12204K45775h67111K86504C29137A64416
$$ 751204 39104 -215282 -227356 -473888 212204 457979 -867111 -580607 329137 164416
11260a19307m5218F4967M1890J91851e3687m51630A70929J94890b1524D07030
$$ -119307 -164525 64967 106857 298708 -53687 -505317 170929 365819 -21524 407030
11249f48750b11270E51187j17723K65387A39431J08458C1848J24961j7871h12955
$$ -648750 -211270 551187 433464 698851 139431 247889 31848 156809 138938 -812955
11238b3294o0595I5813e925m72845K38886E63981a71003A94460r238c26090F12154
$$ -23294 -83889 95813 -5925 -478770 -239884 563981 -171003 194460 185222 -326090 612154
11226B04671a40722k11504f1393I7636J91342P3519a78762l78613A84013h2064
$$ 204671 -140722 -352226 -61393 97636 288978 362497 -178762 -557375 184013 -82064
11215c06340a05689a2682n05k75972e8558B6509d78214b25813l4326k92218J27365
$$ -306340 -105689 -12682 -13187 -289159 -58558 26509 -478214 -225813 -260139 -552357 -424992
11204d24992b01999f0229A322K59838g3560B35102e7746E69281A32902e40869
$$ -424992 -201999 -60229 1322 261160 -73560 235102 -57746 569281 132902 -540869
11193B00543J62150j47188N36782c12194a42243m37390a92107k97794o0604J72390
$$ 200543 362693 215505 752287 -312194 -142243 -579633 -192107 -489901 -550505 -378115
11183c78115C48480B9826J31750f24975C65824A9113a86271F54294a27753l96342
$$ -378115 348480 29826 161576 -624975 365824 19113 -186271 654294 -127753 -524095
11173e24095d6632k96852N7226D70247d18470A48736C7942M36000K75564l30509
$$ -524095 -46632 -343484 -286258 470247 -418470 148736 37942 473942 749506 418997
11163D18997r2165b38005B18592b89684a4126j60232D04266b91686L3875H18628
$$ 418997 326832 -238005 218592 -289684 -14126 -174358 404266 -291686 -257811 818628
11152D72607j91525a62071C42090f466H87244b60706Q1749I5703N54244b45394
$$ 472607 281082 -162071 342090 -6466 887244 -260706 -178957 95703 649947 -245394
11141C96697a00441k11905B24602a63464E40424A47055K7993L2723D1890K57722
$$ 396697 -100441 -312346 224602 -163464 540424 147055 175048 207771 41890 299612
11131B99612j21002Q0615b4013p5804A52455K2072c73669F82321a06504F08716
$$ 299612 178610 259225 -24013 -99817 152455 174527 -373669 682321 -106504 608716
11120h7301H11345a33830C89917A02830M24175Q1965E9404N95682A60513K65395
$$ -87301 811345 -133830 389917 102830 527005 608970 59404 655086 160513 425908
11110D25908N24084j09562k63702J03624m1273A65957K10593M4993A39603K86103
$$ 425908 949992 840430 576728 680352 639079 165957 376550 421543 139603 425706
11100D25706j51598R47109A43412N19880N22137f9008A023728l26008j915C39996
$$ 425706 274108 1221217 143412 663292 1185429 -69008 1023728 697720 695805 339996
11089A080441Q0554N26371p60399D36041K53683Q1524J4757J28017M8323N46335
$$ 1080441 1160995 1687366 926967 436041 689724 771248 786005 914022 962345 1508680
11079A508680m44115l53751J4563R4316k74537J41063J01903J67947K34974K6817
$$ 1508680 1064565 710814 725377 819693 545156 686219 788122 956069 1191043 1217860
11069A217860j12764l01141M25263j88676Q89086n8536q96201M56123J64587n87594
$$ 1217860 1105096 803955 1229218 1040542 1929628 1871092 974891 1431014 1595601 1008007
11059A008007M56410j82214N8439m6750L65926o37592L16325L37047m84201J099729
$$ 1008007 1464417 1282203 1340642 1293892 1659818 1022226 1338551 1675598 1191397 2291126
11049B291126p3540q4352A007736L78819l1349L47693l47577J35804J26273N3037
$$ 2291126 2217586 2133234 1007736 1386555 1355206 1702899 1355322 1491126 1617399 1670436
11039A670436K52007j33140k25152K15500k12876R70944k58206q50996L03765
$$ 1670436 1922443 1789303 1564151 1779651 1566775 2537719 2279513 1428517 1732282
11030A732282n88530J001662k78764L31386j81417o81832N38462J45502q423K41027
$$ 1732282 1143752 2145414 1866650 2198036 2016619 1334787 1873249 2018751 2010328 2251355
11020B251355l81350k72883K71778j22157k6746l0872j7558k47700N66561j67
$$ 2251355 1870005 1597122 1868900 1746743 1719997 1689125 1671567 1423867 1990428 1990261
11010A990261J94153r53032Q40264j006633J410045l27537K77738r56055N34705
$$ 1990261 2184414 1231382 2071646 1065013 2475058 2147521 2425259 1469204 2003909
11001B003909J05333L66035K49266l35m84956P0376j35429n79250R47974l76801
$$ 2003909 2109242 2475277 2724543 2724208 2239252 2309628 2174199 1594949 2542923 2166122
10991B166122j66062O00071O4177j86838O18389r08923N62872J45368J15068k72192
$$ 2166122 2000060 2600131 2664308 2477470 3095859 2186936 2749808 2895176 3010244 2738052
10981B738052J41724j000387L27720k01319J244442r75028O14369n17692N80675
$$ 2738052 2879776 1879389 2207109 2005790 3250232 2275204 2889573 2371881 2952556
10972B952556L20574j35898n40934O47993l35066l16846L6279j50846l4204M33053
$$ 2952556 3273130 3137232 2596298 3244291 2909225 2592379 2628658 2477812 2443608 2876661
10962B876661o49738K06110J86250j7221q25249M42074R2414p65595N73581q06639
$$ 2876661 2226923 2433033 2619283 2602062 1776813 2218887 2311301 1545706 2119287 1312648
10952A312648P01389p73745k0082L22779L8038J65253L8603n20831K01961N3643
$$ 1312648 2014037 1240292 1220210 1542989 1581027 1746280 1784883 1264052 1466013 1519656
10942A519656l50037K12181k61934E10219K25292p3251O19578j74813i4645G45481
$$ 1519656 1169619 1381800 1119866 510219 735511 662260 1281838 1107025 -94645 745481
10931c01620A99262R1042L80136C12755K67788B54712A21680K74837a63471A91578
$$ -301620 199262 290304 670440 312755 580543 254712 121680 396517 -163471 191578
10920A44550J34209N72908e6319C38267e87553A34375i4234g781C47486N4754
$$ 144550 278759 851667 -56319 338267 -587553 134375 -94234 -7781 347486 402240
10910D02240m6856a89830B99454a55691m79968J53082b7746G83397a62667g145
$$ 402240 355384 -189830 299454 -155691 -635659 -482577 -27746 783397 -162667 -7145
10899F5223b46738m2708B48038e9182o09857d9288p9586D9249M75385K82477k48870
$$ 65223 -246738 -289446 248038 -59182 -669039 -49288 -128874 49249 524634 807111 558241
10888E58241k13532N1594A95128c67812l63283m53203C53187j05635L18344d82539
$$ 558241 344709 396303 195128 -367812 -731095 -1184298 353187 247552 565896 -482539
10877c44360c6381G7139b63812D84635a69262a4240A76252J76583C0741h2775
$$ -344360 -36381 77139 -263812 484635 -169262 -14240 176252 352835 30741 -82775
10866d01250a5313n35560D13511b91768P2598r3329I5883d97009a14949b5443
$$ -401250 -15313 -550873 413511 -291768 -219170 -312499 95883 -497009 -114949 -25443
10855G6255g4280C17320i8397G8546N5398a2314B11192q6074l1218g06703g3791
$$ 76255 -74280 317320 -98397 78546 133944 -12314 211192 125118 93900 -706703 -73791
10843g34029K52974a4850n00788K47564c2010F48242k33003B2921M29589o0974
$$ -734029 -481055 -14850 -515638 -268074 -32010 648242 415239 22921 452510 391536
10833C91536A69006E0145d52726J02645B78289r9133a07332M66c0337C28459d10669
$$ 391536 169006 50145 -452726 -350081 278289 179156 -107332 -106866 -30337 328459 -410669
10821f45803H3354a25786G9098M35817e13406A3069f74597B49469k8927d5941
$$ -645803 83354 -125786 79098 514915 -513406 13069 -674597 249469 220542 -45941
10810d4439j88135g7765D90856a76013j71953j79442r3538D14524A96021a50806
$$ -44439 -232574 -77765 490856 -176013 -347966 -527408 -620946 414524 196021 -150806
10799b42033j33915A24188a27399E02088d60704a26971k17486p5410a27217o25163
$$ -242033 -375948 124188 -127399 502088 -460704 -126971 -344457 -419867 -127217 -752380
10789g52380c47591A41820l251K17294a081507B15655b81059C53059j52069c00175
$$ -752380 -347591 141820 138569 355863 -1081507 215655 -281059 353059 200990 -300175
10778c71644a77201C19267g2486k58452B55076R3270a22213B17024b88448j51523
$$ -371644 -177201 319267 -72486 -330938 255076 348346 -122213 217024 -288448 -439971
10768d39971k5754K11045B40854b53423j14748a22474H012c1851A9668J01903
$$ -439971 -465725 -254680 240854 -253423 -368171 -122474 8012 -31851 19668 121571
10758A21571b00610K9967C71946b143E6505L9030G03d88162p7042g4592D38323
$$ 121571 -200610 -170643 371946 -2143 56505 95535 703 -488162 -565204 -74592 438323
10746a97875G6004R24492A31523A7562M7621e13311K05823j94064F84274J78814
$$ -197875 76004 1000496 131523 17562 65183 -513311 -307488 -501552 684274 863088
10736H63088C06689e66745J23631p1386l3830F81359F5035M54983e179C42520
$$ 863088 306689 -566745 -443114 -514500 -548330 681359 65035 520018 -5179 342520
10725b1110D76679g40149l0644a98280k68331N231C00684c23079a8059q6358l929
$$ -21110 476679 -740149 -770793 -198280 -466611 -461380 300684 -323079 -18059 -104417 -108346
10714a08346r3837j25789M0568J18117l37871L0554J84582J15666f1018j05954
$$ -108346 -202183 -327972 -287404 -169287 -507158 -476604 -292022 -176356 -61018 -166972
10704a66972j12294C07418c95679J54419k0751E0932b32950j51730m32153A29334
$$ -166972 -279266 307418 -395679 -241260 -262011 50932 -232950 -384680 -816833 129334
10693H6450K93518F9189a84649m74493c03022j13961A8333d47257J24995a24914
$$ 86450 379968 69189 -184649 -659142 -303022 -416983 18333 -447257 -322262 -124914
10682e67244A45204e39225P4629K2248a67297F12390A98592b02319C37537k7482
$$ -567244 145204 -539225 -464596 -442348 -167297 612390 198592 -202319 337537 310055
10672C10055c04638o2990J70577o7837j72988I1980b36510j06180K215A6317a15664
$$ 310055 -304638 -367628 -197051 -264888 -437876 91980 -236510 -342690 -340475 16317 -115664
10660b15488i0456o14171D04884c73076j89492b62624E84518c04393C44709F4623
$$ -215488 -90456 -704627 404884 -373076 -562568 -262624 584518 -304393 344709 64623
10649A85967D3643J94157h60449A41924h46307C8650a53914A77692f9573E78231
$$ 185967 43643 237800 -860449 141924 -846307 38650 -153914 177692 -69573 578231
10638h24180A33781J04431b79141D00456c09110k93621B09558b48739N8908B2591
$$ -824180 133781 238212 -279141 400456 -309110 -602731 209558 -248739 -189831 22591
10627B92510Q0667a68541A12171a73006C20127d63777B44678L66480a111802L68312
$$ 292510 373177 -168541 112171 -173006 320127 -463777 244678 611158 -1111802 -743490
10617g43490D66727a17311o1101f9960p8848j71882a02599l53370j80248B25042
$$ -743490 466727 -117311 -178412 -69960 -148808 -320690 -102599 -455969 -636217 225042
10606a58378F6344J80021a18702A53844a50800m02626B24875q1133c75269l68621
$$ -158378 66344 246365 -118702 153844 -150800 -553426 224875 143742 -375269 -743890
10596g43890B21767J34095a39495o84337B27398K38769O0274a1829F719K65680
$$ -743890 221767 355862 -139495 -823832 227398 466167 526441 -11829 6719 272399
10586B72399a92240k01289F1151g82832A40109a84542k87530K30601k87129F19719
$$ 272399 -192240 -393529 61151 -782832 140109 -184542 -472072 -241471 -528600 619719
10575B56804Q9641e86842J38437a84002B1577e46964c2673C11316c4184n82959
$$ 256804 346445 -586842 -448405 -184002 21577 -546964 -32673 311316 -34184 -617143
10565f17143A6332J27685b39082d5131j52315c6908C30566f5231D7936L1108e98199
$$ -617143 16332 144017 -239082 -45131 -197446 -36908 330566 -65231 47936 79044 -598199
10553d14503j90411J33541J91719a02049h297o22821L00388j4772g8688l12987
$$ -414503 -604914 -471373 -279654 -102049 -8297 -631118 -330730 -345502 -78688 -391675
10543c91675A38708a27106j12821D71606A51064c40404i6610j05821P7736K9164
$$ -391675 138708 -127106 -239927 471606 151064 -340404 -96610 -202431 -124695 -95531
10533i5531B05660a4476m66404J47136J47316C7272Q0001a70781m62929r2903
$$ -95531 205660 -14476 -480880 -333744 -186428 37272 117273 -170781 -633710 -726613
10523g26613a98557E7350g4215b4195E16900B41401e14562E29456d09122C0893
$$ -726613 -198557 57350 -74215 -24195 516900 241401 -514562 529456 -409122 30893
10512e5232B17391m9594G4233b30835o8277d584E64847b77649G602K67746f7118
$$ -55232 217391 167797 74233 -230835 -299112 -4584 564847 -277649 7602 275348 -67118
10500F17717d96776R4671a40270k31551C22564h4650C15170I0173R004m7410L06159
$$ 617717 -496776 -402105 -140270 -371821 322564 -84650 315170 90173 99177 51767 357926
10489C57926A07495e29864a66933D82131A98913o7046c83215J17306I5903L04103
$$ 357926 107495 -529864 -166933 482131 198913 131867 -383215 -265909 95903 400006
10479D00006F9936P61868b18894l148j7610f9921m29449B20051d7040p99880B28395
$$ 400006 69936 831804 -218894 -222042 -239652 -69921 -499370 220051 -47040 -846920 228395
10467e9666A56751K00634j3609A27314a84544c2024m29324G61182B20559G2709
$$ -59666 156751 357385 343776 127314 -184544 -32024 -461348 761182 220559 72709
10456F9830c06745H79088C49896I9316A450a82194B06659a59338l38964a81039
$$ 69830 -306745 879088 349896 99316 1450 -182194 206659 -159338 -498302 -181039
10445c15001i5873B60304F4543J41344L34689j47152q8771J15588b78718M9516
$$ -315001 -95873 260304 64543 205887 540576 393424 304653 420241 -278718 -229202
10435b29202I9817A9583L79074e66551E48644b17285E51058A56141P9374O15714
$$ -229202 99817 19583 398657 -566551 548644 -217285 551058 156141 235515 851229
10425H51229j70647j86608a27125C81030e56170B40859M03574F4653j6594L27690
$$ 851229 680582 493974 -127125 381030 -556170 240859 644433 64653 48059 375749
10415C75749L51851A58360J01060Q8987J00334g0348D25030j86231K46522b65597
$$ 375749 727600 158360 259420 348407 448741 -70348 425030 238799 485321 -265597
10404B48594Q19022C89450j16355a21596k36639e6514F68923A06767N62110l12534
$$ 248594 1067616 389450 273095 -121596 -358235 -56514 668923 106767 668877 356343
10394C56343J28371B12236H9204J14731L33723a08336C92149A3136c2381D96148
$$ 356343 484714 212236 89204 203935 537658 -108336 392149 13136 -32381 496148
10383E73686A80696E0358L41253l0931M13490A09970N96308k10003J93662k30266
$$ 573686 180696 50358 391611 360680 774170 109970 706278 496275 689937 459671
10373D59671B16181N26552M9822A75561J45129O3778A7693Q428J96636R65525
$$ 459671 216181 742733 792555 175561 320690 384468 17693 26121 222757 1188282
10363A188282B6635O64784K16352A94455K03052K13736f66572F82284M96120k76719
$$ 1188282 26635 691419 907771 194455 397507 611243 -666572 682284 1178404 901685
10353I01685l96477l3897J43208A14400Q2790N40767C24108L26238K84770D49339
$$ 901685 505208 471311 614519 114400 197190 737957 324108 650346 935116 449339
10342D21142J9743M44735B28415P24925m37238d64036G17449A62463L47889A56075
$$ 421142 440885 885620 228415 953340 516102 -464036 717449 162463 510352 156075
10331C9932g7359A68464n256N82174B02950E6447M77932j28923J8917A04407c03699
$$ 39932 -77359 168464 163208 745382 202950 56447 534379 405456 424373 104407 -303699
10319A52526a73493G63973d10974a98289G9537M57726b26377C62074a52775j9044
$$ 152526 -173493 763973 -410974 -198289 79537 537263 -226377 362074 -152775 -171819
10309a71819A78385e41106d4439D47954k07060k3720J86270A62683R5290e11371
$$ -171819 178385 -541106 -44439 447954 240894 217174 403444 162683 257973 -511371
10298b53486B46874c69340C33642d83449B72870F4036A3959e12942K17799E2106
$$ -253486 246874 -369340 333642 -483449 272870 64036 13959 -512942 -295143 52106
10287d52568J32614E34531M1803b0983n59681b81979E73445J20635I3478d89979
$$ -452568 -319954 534531 576334 -20983 -580664 -281979 573445 694080 93478 -489979
10276b80450A12059c66289a8192k23082C3213m167L51912j73663L67122c32174
$$ -280450 112059 -366289 -18192 -241274 33213 29046 380958 207295 574417 -332174
10265f832D58824b58630A91523q4481c7507C20156r9328q8323b43601j17076k99734
$$ -6832 458824 -258630 191523 107042 -37507 320156 220828 132505 -243601 -360677 -660411
10254f60411D81193g0163C80715b31391m73736g2258m935A98198C9569K80875
$$ -660411 481193 -70163 380715 -231391 -705127 -72258 -77193 198198 39569 320444
10244C20444b99961H24816A27424b96753N9313A96173e44656A64981d63817B56778
$$ 320444 -299961 824816 127424 -296753 -237440 196173 -544656 164981 -463817 256778
10233A57182J34952b57599J07598B73341a95A08150N31838c27417D75877A20861
$$ 157182 292134 -257599 -150001 273341 -195 108150 639988 -327417 475877 120861
10222f9756j76690i1115k07145d3327j76298f367I470K15539g08104C50756r4437
$$ -69756 -246446 -91115 -298260 -43327 -219625 -6367 9470 225009 -708104 350756 256319
10211B56319P9641b49340n3984m27462a46153l05326D32841G9005c62123J69954
$$ 256319 335960 -249340 -303324 -730786 -146153 -451479 432841 79005 -362123 -192169
10201a92169A46860d9664n55734A54070c54580J44414B70841K50285a06691o6000
$$ -192169 146860 -49664 -605398 154070 -354580 -210166 270841 521126 -106691 -172691
10191a72691P0965k99297H6441J68921a63012A45911d45262A96101J48016R7556
$$ -172691 -101726 -401023 86441 255362 -163012 145911 -445262 196101 344117 441673
10181D41673e36003k33351I5104L44766c40825C04298f44902K2022J42238h5381
$$ 441673 -536003 -769354 95104 439870 -340825 304298 -644902 -622880 -480642 -85381
10170C60967a35178k67193a77250A37430b60709A75688a19548e0531o20969b60565
$$ 360967 -135178 -402371 -177250 137430 -260709 175688 -119548 -50531 -671500 -260565
10159E7883j3575L4016B3598a87410h4948j53304D2794b15373j175632c46901
$$ 57883 44308 78324 23598 -187410 -84948 -238252 42794 -215373 -1391005 -346901
10148C70827f6084K3191B04136K16505c28956A82448d50902N8148A0430a29851
$$ 370827 -66084 -42893 204136 420641 -328956 182448 -450902 -392754 10430 -129851
10137B72541I9684a93665D8755L78520o8763f80704b7512E2540c61252B360b44777
$$ 272541 99684 -193665 48755 427275 358512 -680704 -27512 52540 -361252 2360 -244777
10125b82966l42283l4723a02750j37004o0425j36455d6950k90322D55962g46476
$$ -282966 -625249 -659972 -102750 -239754 -300179 -436634 -46950 -337272 455962 -746476
10114d03558B24697A00864J30599b34930G6658B5026M96118k6526e01416B07139
$$ -403558 224697 100864 231463 -234930 76658 25026 521144 494618 -501416 207139
10103b17341B94592l8571l5939h66659B34691f55478B26263e90397b24700m778
$$ -217341 294592 256021 220082 -866659 234691 -655478 226263 -590397 -224700 -229478
10093b29478m685m5490j48017J76716F72511e80521B46141d58867l95841B87321
$$ -229478 -234163 -279653 -427670 -250954 672511 -580521 246141 -458867 -854708 287321
10082g697k52284a4997l29170A42475J53343c2279K497A82777e57250c8631G18385
$$ -7697 -259981 -14997 -344167 142475 295818 -32279 -29782 182777 -557250 -38631 718385
10070e76913a5744B09241d07527A12662d31699O4468a75992k20493a30495j09048
$$ -576913 -15744 209241 -407527 112662 -431699 -367231 -175992 -396485 -130495 -239543
10060b39543A21631E3262J63727a36657E2805K07353a33000k45016A93362E908
$$ -239543 121631 53262 216989 -136657 52805 260158 -133000 -378016 193362 5908
10049G8312d21756Q2386k5628a114k03788n53898a65631A94009e2134A99521h15408
$$ 78312 -421756 -339370 -364998 -1114 -204902 -758800 -165631 194009 -52134 199521 -815408
10037e76194K00363B4368O02284d33912i0453a0596m75663m035c8240A94254d73060
$$ -576194 -375831 24368 626652 -433912 -90453 -10596 -486259 -490294 -38240 194254 -473060
10025A98038h1785j97883O6810B136c98146J03686Q5930L9707j59084m37409F36113
$$ 198038 -81785 -279668 -212858 2136 -398146 -294460 -208530 -168823 -327907 -765316 636113
10013C03396c28516k32836J65680f6849J1783j38803l00501p7583P0467C1365
$$ 303396 -328516 -561352 -395672 -66849 -55066 -193869 -494370 -571953 -501486 31365
10002d94526A95995d10401a97355o1723O4800D93198k21751g44288c37810E8972
$$ -494526 195995 -410401 -197355 -259078 -194278 493198 271447 -744288 -337810 58972
9991F0430F035a30876k56154C7278b75903J05466k7602j44209A28083E4516I322
$$ 60430 6035 -130876 -387030 37278 -275903 -170437 -198039 -342248 128083 54516 9322
9979a15256h614l72800B79821i3829A51729b34472M3469A78155n1722b77193j95633
$$ -115256 -8614 -381414 279821 -93829 151729 -234472 -191003 178155 126433 -277193 -472826
9968d72826b28892A42170a183147c65955H05069G3207a62237j08165j02746D84163
$$ -472826 -228892 142170 -1183147 -365955 805069 73207 -162237 -270402 -373148 484163
9957F4596f26603i7594A95462e53736k8012b11246l31992o9991L1292l42460A35068
$$ 64596 -626603 -97594 195462 -553736 -581748 -211246 -543238 -613229 -581937 -924397 135068
9945d45225C82571A89129b41931b8532G2959f75879E1586M7407b86358A42410
$$ -445225 382571 189129 -241931 -28532 72959 -675879 51586 98993 -286358 142410
9934B97056a68660B43931J52029b74899h9305o53592a81440C33248f02496A87023
$$ 297056 -168660 243931 395960 -274899 -89305 -742897 -181440 333248 -602496 187023
9923c10921j30417H35340D9905M5524e10194A28319c90706J44441n21944C43586
$$ -310921 -441338 835340 49905 95429 -510194 128319 -390706 -246265 -768209 343586
9912e13828K05649k10681C7435a01074k72465M2613E9578M8981K8630b31010k12919
$$ -513828 -308179 -518860 37435 -101074 -373539 -330926 59578 108559 137189 -231010 -443929
9901d43929B08648b49046A09395b43924l58112l99955D52005a64501r52385h8452
$$ -443929 208648 -249046 109395 -243924 -602036 -1001991 452005 -164501 -1116886 -88452
9890c84833m0920B6544b0197k29077j03654E79882i69270e3634A1253f2535C2481
$$ -384833 -425753 26544 -20197 -249274 -352928 579882 -969270 -53634 11253 -62535 32481
9878b77422B68307D1228a089578d44767R8838I3100e16177K04123A65267L4526
$$ -277422 268307 41228 -1089578 -444767 -345929 93100 -516177 -312054 165267 199793
9868A99793J04439H6106e10986J27323J49787C91551j42449c37036a36074o23003
$$ 199793 304232 86106 -510986 -383663 -233876 391551 249102 -337036 -136074 -759077
9858g59077c8793C17797e05039J28074c5635m08678C22589c21206A54864P41517
$$ -759077 -38793 317797 -505039 -376965 -35635 -444313 322589 -321206 154864 896381
9848H96381e19738Q6678C74174b99787j73431b06535j02681l01363B1087e34831
$$ 896381 -519738 -433060 374174 -299787 -473218 -206535 -309216 -610579 21087 -534831
9837e12831A96394O6876g64819B61255b04318k05723a8231j51569b9534m14293
$$ -512831 196394 263270 -764819 261255 -204318 -410041 -18231 -169800 -29534 -443827
9827d43827p2475B61504c69497J37033j071E6748L0734d09821P1947E1500g0772
$$ -443827 -516302 261504 -369497 -232464 -233535 56748 87482 -409821 -337874 51500 -70772
9815c25584o8192a75580l20506J62554A46814g8674C05735b11853C0418e58558
$$ -325584 -393776 -175580 -496086 -333532 146814 -78674 305735 -211853 30418 -558558
9804a66695D27465j54928A23385M8149i75326b95124B8693b49974A09320e65660
$$ -166695 427465 272537 123385 171534 -975326 -295124 28693 -249974 109320 -565660
9793A40798L02236d73428a77919f6507C30709A44408A6007e9546m86616e5016
$$ 140798 443034 -473428 -177919 -66507 330709 144408 16007 -59546 -546162 -55016
9782C36926H1830J37012b19069J338l39268J83184i3007F99459a80942H7411b99753
$$ 336926 81830 218842 -219069 -217731 -556999 -373815 -93007 699459 -180942 87411 -299753
9770b91074E4515e64647j38747a11022B81667c43286D81009A55834c59783B90672
$$ -291074 54515 -564647 -703394 -111022 281667 -343286 481009 155834 -359783 290672
9759A32538A2107J79804e57432C0818K73399b53219B08745e42268K64368l40905
$$ 132538 12107 191911 -557432 30818 304217 -253219 208745 -542268 -277900 -618805
9749f18805A47206l8105O4269a80209m44318A43407M94598B13309f39070k28446
$$ -618805 147206 109101 173370 -180209 -624527 143407 638005 213309 -639070 -867516
9739h67516b71335k96441A20998g1111J1732F6533h4725C90219e23957J81567
$$ -867516 -271335 -567776 120998 -71111 -59379 66533 -84725 390219 -523957 -342390
9729c42390b6358n81423J95152A24834f42930i4822k7318d6721n95931A2545a40089
$$ -342390 -26358 -607781 -412629 124834 -642930 -94822 -122140 -46721 -642652 12545 -140089
9717H9691g08347E74225A54983g39108a34232n22383d509C17680e91439a50003
$$ 89691 -708347 574225 154983 -739108 -134232 -656615 -4509 317680 -591439 -150003
9706A10612b51628d6746H7300A5164m921K47226F4634K42270a02118k08254n7590
$$ 110612 -251628 -46746 87300 15164 10243 257469 64634 306904 -102118 -310372 -367962
9695c67962j87521B03648A6551L34381D2131b93973o461A00437f26817B93891
$$ -367962 -555483 203648 16551 350932 42131 -293973 -300434 100437 -626817 293891
9684f22460A71595d7991B92183g0601m31277A02502g30478c08400A64924c39847
$$ -622460 171595 -47991 292183 -70601 -501878 102502 -730478 -308400 164924 -339847
9673g2632a3473l48729n978b0185E79257i67878M56487M4893E06163O6773A20285
$$ -72632 -13473 -362202 -368180 -20185 579257 -967878 -511391 -466498 506163 572936 120285
9661C72805a44789p03566K68985A21681e3636L701B32834f22940A54281g47880
$$ 372805 -144789 -848355 -579370 121681 -53636 -49935 232834 -622940 154281 -747880
9650f28558a03047k86905e680B8698J39368c9773i630A8229d50840K10250C5020
$$ -628558 -103047 -389952 -5680 28698 168066 -39773 -9630 18229 -450840 -240590 35020
9638b00352l75918K81547e90A54840b51367B45669e35089b16435n4807J4458j75674
$$ -200352 -576270 -294723 -590 154840 -251367 245669 -535089 -216435 -271242 -256784 -432458
9627d32458G5846g39383C07463J72582b55480A40330c33949e6706m35291K33690
$$ -432458 75846 -739383 307463 480045 -255480 140330 -333949 -56706 -491997 -258307
9617b58307a17299J8626C28108J72628a36826H0093f3847q8203F63830A38433
$$ -258307 -117299 -98673 328108 500736 -136826 80093 -63847 -152050 663830 138433
9606B40704j18752E507L17743G1541b36975H692c63819m4596D91766a86370m34028
$$ 240704 121952 5507 323250 71541 -236975 8692 -363819 -408415 491766 -186370 -620398
9595f20398d9666m01132C7223k307a3592L063l16235B06735d2891j65989C81763
$$ -620398 -49666 -450798 37223 34916 -13592 -10529 -326764 206735 -42891 -208880 381763
9583B0135h5781p29323A80047l864J27363e97181b84992R9780k97269b29115j13788
$$ 20135 -85781 -815104 180047 176183 303546 -597181 -284992 -185212 -482481 -229115 -342903
9572c42903k1945P7396Q2306g5405B2373O2620k5682e50988b26929F6495L27480
$$ -342903 -364848 -287452 -205146 -75405 22373 84993 59311 -550988 -226929 66495 393975
9561C93975a86454j4301E7376L44100p9642a093014D34656e7205a0326A04418
$$ 393975 -186454 -200755 57376 401476 321834 -1093014 434656 -57205 -10326 104418
9550D0154K13315a39844m06252c0626l71842j27995k01539E71956j69882b16066
$$ 40154 253469 -139844 -546096 -30626 -402468 -530463 -732002 571956 402074 -216066
9539A02019d23534b05683C84555c41411D25493d3706j80776l10648a74101o8166
$$ 102019 -423534 -205683 384555 -341411 425493 -43706 -224482 -535130 -174101 -242267
9529b42267c7442l85564P988J07239G2697K09029a26119k58383J26805J00532
$$ -242267 -37442 -423006 -415018 -307779 72697 281726 -126119 -384502 -257697 -157165
9519a57165I9896a27664d1544B58697L58221d6832H3621i4438M1575l83586e6937
$$ -157165 99896 -127664 -41544 258697 616918 -46832 83621 -94438 -52863 -436449 -56937
9507f59871B50459b78038H1280M1886d46858l78088a73626l40802B39307q2182
$$ -659871 250459 -278038 81280 123166 -446858 -824946 -173626 -514428 239307 157125
9497A57125e14869B33229B3574K7983d22782J40331B4409N68921e67174j59664
$$ 157125 -514869 233229 23574 51557 -422782 -282451 24409 593330 -567174 -726838
9487g26838a82020o5585j57914E4840b175j94451D60800b13051k56889a1692C00206
$$ -726838 -182020 -247605 -405519 54840 -2175 -196626 460800 -213051 -469940 -11692 300206
9475C16770c09361B1732c57310A4282J6783G173c8032m25043G0405M5624f33847
$$ 316770 -309361 21732 -357310 14282 31065 7173 -38032 -463075 70405 116029 -633847
9463A93470h88640Q0309A67547a29891m65226K25673l3471k4043a36944j60232
$$ 193470 -888640 -808331 167547 -129891 -595117 -369444 -402915 -426958 -136944 -297176
9453b97176e3935k47944h2211m28881E51498b64872m20475h891l27407k72137
$$ -297176 -53935 -301879 -82211 -511092 551498 -264872 -685347 -8891 -336298 -608435
9443f08435C27286B2702g007B96887g074m45322C42094a108485E2439e72743F20804
$$ -608435 327286 22702 -7007 296887 -7074 -452396 342094 -1108485 52439 -572743 620804
9431A137d48958B51102A16997h8894n73036E25913A06272a12936o44160B16951
$$ 1137 -448958 251102 116997 -88894 -661930 525913 106272 -112936 -757096 216951
9420a59961j36507J06818l15554Q5234a53213k19484B33480e508m64515Q3315
$$ -159961 -296468 -189650 -505204 -419970 -153213 -372697 233480 -5508 -470023 -386708
9410c86708f8402D24649E2218R8181d52996K05655k52361a09243l07122C92332
$$ -386708 -68402 424649 52218 150399 -452996 -247341 -499702 -109243 -416365 392332
9399e72679E51727f4753E6681M6527k6499f6622j11322j54077c3769r6665k55111
$$ -572679 551727 -64753 56681 103208 76709 -66622 -177944 -332021 -33769 -130434 -385545
9388c85545p19222I0219J34531b73686e1499A58949a10617l3523A35328b08591
$$ -385545 -1104767 90219 224750 -273686 -51499 158949 -110617 -144140 135328 -208591
9377b32552j34372B60543b22150L1292B38921i65263e1762B4200a70651g2317
$$ -232552 -366924 260543 -222150 -190858 238921 -965263 -51762 24200 -170651 -72317
9366a49322D71083a62106n89700J27325F7781a22311A45527J88956c46524A82751
$$ -149322 471083 -162106 -751806 -624481 67781 -122311 145527 334483 -346524 182751
9355D67941a06435A04748g80934B0111d9170B22354f03A61270d9226j63857Q8252
$$ 467941 -106435 104748 -780934 20111 -49170 222354 -603 161270 -49226 -213083 -124831
9344a24831A92519a06445F26789F6875J10581N4791K74014b53281k80728C51758
$$ -124831 192519 -106445 626789 66875 177456 232247 506261 -253281 -534009 351758
9333d68971j68852c12450N6961j05028A7079d53635J02664j37609k23531B31816
$$ -468971 -637823 -312450 -255489 -360517 17079 -453635 -350971 -488580 -712111 231816
9322h07464j9028a11253p296c8767k27136a15425j73370B1791c64143J05685k3889
$$ -807464 -826492 -111253 -118549 -38767 -265903 -115425 -288795 21791 -364143 -258458 -282347
9311b82347m40695B75607c648E17585j75346d44305C02976a91590Q7937B27431
$$ -282347 -723042 275607 -3648 517585 342239 -444305 302976 -191590 -103653 227431
9300b42139h931C19365A46279e36362o676K58824B40795d82260G15440c84305
$$ -242139 -8931 319365 146279 -536362 -543038 -284214 240795 -482260 715440 -384305
9289c22842D53642a122380G35668B04799e21470a22005B52490b77307F27801I2466
$$ -322842 453642 -1122380 735668 204799 -521470 -122005 252490 -277307 627801 92466
9278h8772A45843g24123R8041K61676A52430J50810a14315j41687B05413c86732
$$ -88772 145843 -724123 -626082 -364406 152430 303240 -114315 -256002 205413 -386732
9267b13697E65299d64125c4424A31695L83622f46977K77259j15763C637R1728
$$ -213697 565299 -464125 -34424 131695 515317 -646977 -369718 -485481 3637 95365
9257I5365a18574j56956D823c70799j27762a52372k08301k88246D48321f72648
$$ 95365 -118574 -275530 4823 -370799 -498561 -152372 -360673 -648919 448321 -672648
9246E07942d08365M1539M4031j47344n8025F0571R1105c3482A39746a94860Q5062
$$ 507942 -408365 -366826 -322795 -470139 -528164 60571 151676 -33482 139746 -194860 -109798
9235a09798F1999c40821g3387E55835c39628C9692J71173e9998l27747k85840
$$ -109798 61999 -340821 -73387 555835 -339628 39692 210865 -59998 -387745 -673585
9225f73585a27230C77188C4826b76016A95588a80558L9606l5503M2585p8615h4302
$$ -673585 -127230 377188 34826 -276016 195588 -180558 -140952 -176455 -133870 -212485 -84302
9213A86211d6677E20833b99267j43355H8327b57820A49850i116k41505E4062b68918
$$ 186211 -46677 520833 -299267 -442622 88327 -257820 149850 -9116 -250621 54062 -268918
9201b88711c8917k60821m051k76848l29878J70167b32452J05851m90252n6626
$$ -288711 -38917 -299738 -303789 -580637 -910515 -740348 -232452 -126601 -616853 -673479
9191f73479a40540A02548e6265a3091q34600H3354J77077a99595k8235m54442
$$ -673479 -140540 102548 -56265 -13091 -847691 83354 260431 -199595 -227830 -682272
9181f82272A02M97162j97297e02767a65612k31832e3371B63779J11770a32958
$$ -682272 102 497264 299967 -502767 -165612 -397444 -53371 263779 375549 -132958
9170d74519C88330a38289B91717N34060d79179B21788f83790L15228M2803a61013
$$ -474519 388330 -138289 291717 825777 -479179 221788 -683790 -368562 -325759 -161013
9159b49798j58749j15489D05700I3546e03563D05121J69129F1952i20753c61131
$$ -249798 -408547 -524036 405700 93546 -503563 405121 574250 61952 -920753 -361131
9148f25158K17956G55337C34117C6517M41100j64345a38240C0434a86296B46368
$$ -625158 -407202 755337 334117 36517 477617 313272 -138240 30434 -186296 246368
9137d86593b22892A75234a33081k96491E50540k17344d20596J88408H3627h6641
$$ -486593 -222892 175234 -133081 -429572 550540 333196 -420596 -232188 83627 -86641
9126a63102m98027c04272C92610i3410B67090e37225a91871m8049k18443J45154
$$ -163102 -661129 -304272 392610 -93410 267090 -537225 -191871 -239920 -458363 -313209
9116c13209J56535o43052c16058k34331B19729a74970H5256a10796q2390l88100
$$ -313209 -156674 -799726 -316058 -550389 219729 -174970 85256 -110796 -193186 -581286
9106e81286a39286m21697B1190K42185a36033I1788e59349K72235c1922k43613
$$ -581286 -139286 -560983 21190 263375 -136033 91788 -559349 -287114 -31922 -275535
9096b75535p5485a51716j75992D60400j06910a115801D82234B13443a06006j43230
$$ -275535 -351020 -151716 -327708 460400 353490 -1115801 482234 213443 -106006 -249236
$$ [...]
##END NTUPLES=NMR SPECTRUM
##END=
