##TITLE=AC1552_ROEFFECT0015_8269144_1tQLPa4ePq
##JCAMPDX= 6.0         $$ Bruker NMR JCAMP-DX V2.0
##DATA TYPE= NMR SPECTRUM
##DATA CLASS= NTUPLES
##ORIGIN= BRUKER
##OWNER= Administrator
$$ 1.72 TOPSPIN		Version 2.1
$$ 2013-10-12 00:05:25.564 -0700  Administrator@X
$$ Compression mode = diff/dup
##.OBSERVE FREQUENCY= 400.02188249412
##.OBSERVE NUCLEUS= ^1H
##.ACQUISITION MODE= SIMULTANEOUS (DQD)
##.ACQUISITION SCHEME= undefined
##.AVERAGES= 64
##.DIGITISER RES= 22
##SPECTROMETER/DATA SYSTEM= spect
##.PULSE SEQUENCE= noesygpps1d.comp
##.SOLVENT NAME= COFFEE_meoh
##.SHIFT REFERENCE= INTERNAL, COFFEE_meoh, 1, 14.95963
##AUDIT TRAIL= $$ (NUMBER, WHEN, WHO, WHERE, PROCESS, VERSION, WHAT)
$$ ##TITLE= Audit trail, TOPSPIN		Version 2.1
$$ ##JCAMPDX= 5.01
$$ ##ORIGIN= Bruker BioSpin GmbH
$$ ##OWNER= Administrator
$$ $$ E:\/data/COFFEE/nmr/AC1552_ROEFFECT0015_8269144_1tQLPa4ePq/12/pdata/1/auditp.txt
$$ ##AUDIT TRAIL=  $$ (NUMBER, WHEN, WHO, WHERE, PROCESS, VERSION, WHAT)
(   1,<2013-10-12 00:05:20.611 -0700>,<Administrator>,<X>,<go>,<TOPSPIN 2.1>,
      <created by zg
	started at 2013-10-11 23:53:50.611 -0700,
	POWCHK enabled, PULCHK disabled,
       configuration hash MD5:
       C8 4E 4E 5D D3 5C D8 9E 9F 52 82 E0 59 8A DE 15
       data hash MD5: 64K
       2D DB 95 15 C4 07 41 FB CB CA BD FF 77 CB 97 65>)
(   2,<2013-10-12 00:05:23.642 -0700>,<Administrator>,<X>,<proc1d>,<TOPSPIN 2.1>,
      <Start of raw data processing
       efp LB = 0.3 FT_mod = 6 PKNL = 1 PHC0 = 0 PHC1 = 0 SI = 128K 
       data hash MD5: 128K
       3A 80 72 34 F5 DE 79 8C 55 77 14 42 EB 5A F0 20>)
(   3,<2013-10-12 00:05:24.611 -0700>,<Administrator>,<X>,<proc1d>,<TOPSPIN 2.1>,
      <pk PHC0 = -81.81519 PHC1 = 0 
       data hash MD5: 128K
       DE 03 B1 79 E1 F6 EE 30 70 5E 66 03 31 0B E1 FA>)
(   4,<2013-10-12 00:05:25.017 -0700>,<Administrator>,<X>,<proc1d>,<TOPSPIN 2.1>,
      <abs ABSG = 1 
       data hash MD5: 128K
       2B EF 29 FB 85 AE 5A 17 48 57 BD D4 D2 4D 2C 5A>)
(   5,<2013-10-12 00:05:25.111 -0700>,<Administrator>,<X>,<proc1d>,<TOPSPIN 2.1>,
      <abs ABSG = 2 
       data hash MD5: 128K
       0B EB 69 58 8A 25 C3 E0 5F B6 07 DE DF 42 24 01>)
(   6,<2013-10-12 00:05:25.173 -0700>,<Administrator>,<X>,<proc1d>,<TOPSPIN 2.1>,
      <abs ABSG = 3 
       data hash MD5: 128K
       32 B1 84 65 53 50 01 B3 57 4C 63 62 FB 9C EE 94>)
(   7,<2013-10-12 00:05:25.267 -0700>,<Administrator>,<X>,<proc1d>,<TOPSPIN 2.1>,
      <abs ABSG = 4 
       data hash MD5: 128K
       62 EE 7C 88 EB 86 EF 2D 01 BE 65 47 32 92 74 A4>)
(   8,<2013-10-12 00:05:25.376 -0700>,<Administrator>,<X>,<proc1d>,<TOPSPIN 2.1>,
      <abs ABSG = 5 
       data hash MD5: 128K
       75 29 1B CC 7F 1D 64 F4 4F 6A 38 EE EA E4 90 05>)
$$ ##END=
$$ 
$$ $$ hash MD5
$$ $$ EC B9 DA B3 B1 37 23 E9 78 B5 5F 08 51 1E 32 43
##$RELAX= 
##$RELAX= 
##$RELAX= 
##$RELAX= 
##$RELAX= 
##$RELAX= 
##$RELAX= 
##$RELAX= 
$$ Bruker specific parameters
$$ --------------------------
##$DU= <E:\>
##$EXPNO= 12
$$ [...]
##$TP07= 0
##$TPNAME0= <>
##$TPNAME1= <>
##$TPNAME2= <>
##$TPNAME3= <>
##$TPNAME4= <>
##$TPNAME5= <>
##$TPNAME6= <>
##$TPNAME7= <>
##$TPOAL= (0..7)
0.5 0.5 0.5 0.5 0.5 0.5 0.5 0.5
##$TPOFFS= (0..7)
0 0 0 0 0 0 0 0
##$TUNHIN= 0
##$TUNHOUT= 0
##$TUNXOUT= 0
##$USERA1= <user>
##$USERA2= <user>
##$USERA3= <user>
##$USERA4= <user>
##$USERA5= <user>
##$V9= 5
##$VALIST= <valist>
##$VCLIST= <CCCCCCCCCCCCCCC>
##$VD= 0
##$VDLIST= <DDDDDDDDDDDDDDD>
##$VPLIST= <PPPPPPPPPPPPPPP>
##$VTLIST= <TTTTTTTTTTTTTTT>
##$WBST= 1024
##$WBSW= 4
##$XGAIN= (0..3)
0 0 0 0
##$XL= 0
##$YL= 0
##$YMAX_a= 20451767
##$YMIN_a= -31239516
##$ZGOPTNS= <>
##$ZL1= 120
##$ZL2= 120
##$ZL3= 120
##$ZL4= 120
##$ABSF1= 14.95963
##$ABSF2= -5.598552
##$ABSG= 5
##$ABSL= 3
##$ALPHA= 0
##$AQORDER= 0
##$ASSFAC= 0
##$ASSFACI= 0
##$ASSFACX= 0
##$ASSWID= 0
##$AUNMP= <proc_prof1d_extract.lims>
##$AXLEFT= 0
##$AXNAME= <>
##$AXNUC= <1H>
##$AXRIGHT= 0
##$AXTYPE= 0
##$AXUNIT= <>
##$AZFE= 0.1
##$AZFW= 0.1
##$BCFW= 0
##$BC_mod= 0
##$BYTORDP= 0
##$COROFFS= 0
##$CY= 15
##$DATMOD= 1
##$DC= 0
##$DFILT= <>
##$DTYPP= 0
##$F1P= 0
##$F2P= 0
##$FCOR= 0.5
##$FTSIZE= 131072
##$FT_mod= 6
##$GAMMA= 0
##$GB= 0
##$INTBC= 1
##$INTSCL= 1
##$ISEN= 128
##$LB= 0.3
##$LEV0= 0
##$LPBIN= 0
##$MAXI= 10000
##$MC2= 0
##$MEAN= 0
##$ME_mod= 0
##$MI= 0
##$NCOEF= 0
##$NC_proc= -3
##$NLEV= 6
##$NOISF1= 0
##$NOISF2= 0
##$NSP= 0
##$NTH_PI= 0
##$NZP= 0
##$OFFSET= 14.95963
##$PC= 1
##$PHC0= -81.81519
##$PHC1= 0
##$PH_mod= 1
##$PKNL= yes
##$PPARMOD= 0
##$PPDIAG= 0
##$PPIPTYP= 0
##$PPMPNUM= 2147483647
##$PPRESOL= 1
##$PSCAL= 4
##$PSIGN= 0
##$PYNMP= <proc.py>
##$REVERSE= no
##$SF= 400.020010184744
##$SI= 131072
##$SIGF1= 0
##$SIGF2= 0
##$SINO= 400
##$SIOLD= 131072
##$SPECTYP= <>
##$SREGLST= <1H.CDCl3>
##$SSB= 0
##$STSI= 131072
##$STSR= 0
##$SW_p= 8223.68421052631
##$SYMM= 0
##$S_DEV= 0
##$TDeff= 65536
##$TDoff= 0
##$TI= <>
##$TILT= no
##$TM1= 0
##$TM2= 0
##$TOPLEV= 0
##$USERP1= <user>
##$USERP2= <user>
##$USERP3= <user>
##$USERP4= <user>
##$USERP5= <user>
##$WDW= 1
##$XDIM= 131072
##$YMAX_p= 286060824
##$YMIN_p= -104428
##$CURPLOT= <Network HP LaserJet P1505>
##$CURPRIN= <$Network HP LaserJet P1505>
##$DFORMAT= <normdp>
##$LAYOUT= <+/1D_H.xwp>
##$LFORMAT= <normlp>
##$PFORMAT= <normpl>
##$SURQMSG= 1
$$ End of Bruker specific parameters
$$ ---------------------------------
##NTUPLES= NMR SPECTRUM
##VAR_NAME=  FREQUENCY,     SPECTRUM/REAL,   SPECTRUM/IMAG
##SYMBOL=    X,             R,               I
##VAR_TYPE=  INDEPENDENT,   DEPENDENT,       DEPENDENT
##VAR_FORM=  AFFN,          ASDF,            ASDF
##VAR_DIM=   131072,        131072,          131072
##UNITS=     HZ,            ARBITRARY UNITS, ARBITRARY UNITS
##FACTOR=    0.0627417313425164, 1,          1
##FIRST=     8223.62146879497, 382,          -217911
##LAST=      0,             6951,            -219726
##MIN=       0,             -104428,         0
##MAX=       8223.62146879497, 286060824,    0
$$ Real data points
##PAGE= N=1
##DATA TABLE= (X++(R..R)), XYDATA
$$ [...]
66046 439632 440031 439148 437999 437687 438225 438517 437492 435160 432656 431395 432054 434130 436447 438292 440103 442885
66030 442885 446792 450556 452633 452867 452584 453036 454267 455695 457069 458188 458318 457092 455884 457021 461059
66015 461059 465745 468370 468408 467137 465570 463974 462983 463543 465489 467365 468201 468508 468984 469171 468336 467025
65999 467025 466677 467879 469950 472145 474306 476118 476692 475555 473558 472246 472490 474199 477022 480669 484521
65984 484521 487533 488910 488684 487482 485980 484693 483917 483551 483171 482670 482654 483767 485741 487675 489326 491469
65968 491469 494699 498431 501652 504271 507103 510618 514299 517270 519039 519614 519380 519100 519644 521435 524241
65953 524241 527531 530784 533420 534701 533950 530995 526658 522934 522108 524956 529880 534399 537365 539090 539715
65938 539715 538762 536606 535043 535537 537727 540443 543338 546480 549142 550441 550925 552175 554779 557904 560946
65923 560946 564311 568039 570836 571256 569231 565783 561852 558004 554851 552979 552638 553893 556763 560810 564965
65908 564965 568312 570817 572974 575090 577365 580139 583328 585972 587242 587721 588783 590668 592167 592443 592172
65893 592172 592289 592493 592029 591474 592509 595686 599313 601163 600803 599734 599541 600516 602000 603365 604354 604885
65877 604885 605055 605258 605895 606849 607547 607775 608211 609940 613351 617719 621908 625332 628093 630288 631616 631935
65861 631935 632002 633126 635874 639366 642099 643354 643578 643606 643841 644210 644525 644703 644806 645029 645658 646949 649048
65844 649048 651914 655210 658272 660373 661169 660983 660708 661288 663031 665410 667788 670325 673741 677971 681607
65829 681607 683210 682934 682300 682640 684257 686841 689851 692506 694211 695226 696370 697926 699522 701147 703353
65814 703353 706055 708141 709078 710164 713051 717295 720529 721135 719901 718832 719145 720894 723813 727664 731819
65799 731819 735235 737213 738033 738582 739490 740860 742699 745148 748074 750906 753318 755745 758669 761559 763259
65784 763259 763521 763519 764654 767404 771430 776075 780426 783580 785397 786568 787656 788670 789764 791473 793621
65769 793621 794976 794927 794722 795859 797795 798690 798234 798262 800272 803636 806866 809658 812864 816899 820919 823532
65753 823532 824194 823967 824803 827732 831833 835370 837613 839002 839890 840136 839927 840058 841111 843023 845555 848478
65737 848478 851265 853454 855362 857538 859477 860009 859224 858700 859439 860880 862621 865584 870317 875331 878688
65722 878688 880417 881929 883626 884784 885538 887240 890582 894643 898170 900729 902265 902541 901507 899535 896991
65707 896991 894213 892146 892144 894653 898588 902359 905141 906949 908061 908706 908936 908625 907995 908053 909783 912810
65691 912810 915699 917926 920637 924914 930012 934121 936369 937246 937414 937025 936170 935216 934488 934048 933887 934013
65675 934013 934376 935128 936923 940436 945249 949566 951433 950387 947836 945799 945270 945727 946099 945948 945503 944807
65659 944807 943367 940821 937576 934580 932644 932057 932443 932744 931891 929972 928399 928344 929306 929919 929945 930519 932251
65642 932251 934117 934811 934435 933939 933408 931985 929426 926609 924191 921806 919271 917701 918266 920169 921111 919986
65626 919986 918059 917083 917241 917653 918023 918601 918994 918365 917009 916553 917953 919969 920314 917984 914022 910260
65610 910260 907766 906334 904978 902911 900275 897945 896588 896084 895897 895626 894918 893249 890319 886536 882688
65595 882688 879148 875727 872319 869324 867355 866708 867151 868009 868413 867679 865660 862802 859903 857684 856387
65580 856387 855737 855402 855339 855256 853854 849531 842411 835053 830209 828097 826676 824415 821706 819337 816822 813259
65564 813259 809233 806669 806619 807925 808464 807341 805403 803760 802346 800194 796860 793023 789611 786755 783941
65549 783941 780779 777194 773152 768833 764993 762406 760852 759204 756700 753516 749985 746124 742424 740266
65535 740266 740565 742355 743621 743374 742176 740841 739602 738610 738132 737733 736133 732661 728398 725127 723314
65520 723314 721848 719678 716942 714341 712045 709743 707334 704967 702502 699573 696378 693796 692278 690990
65506 690990 688806 685999 684087 683703 683448 681505 677863 674135 671500 669729 668138 666443 664410 661652 658379
65491 658379 655687 654369 653839 652919 651440 650384 650537 651544 652259 651603 649195 645649 642299 640234 639528 639642
65475 639642 640267 641243 641877 641172 638965 636212 633842 631759 629293 626219 623040 620504 619067 618521 617946 616385
65459 616385 613801 611025 608649 606429 604100 602153 601237 601179 601314 601485 602041 602886 603316 602951 602284 602089 602710
65442 602710 604023 605627 606872 607150 606444 605293 603995 602229 599738 597026 594916 593621 592677 591746 591059
65427 591059 591012 591539 592082 592062 591403 590642 590498 591210 592270 592895 592866 592911 594131 596753 599343 599692 597032 593234
65409 593234 591140 591646 593113 593824 594041 594962 596574 597765 598057 597815 596718 593707 589106 585451 585032 587317
65393 587317 589876 591199 591428 590886 589538 588042 587802 589344 591696 593986 596543 599621 602030 602288 600653
65378 600653 598765 597487 596289 594760 593580 593629 594926 596794 598374 598715 597195 594368 591781 590467 590136
65363 590136 590214 590795 591817 592070 590380 587573 585997 586764 588542 589631 590305 592099 595159 597494 597224 594847
65347 594847 592669 592270 593212 594180 594549 594433 593845 592823 592223 593320 596144 598918 599807 598868 597780 597921 599228
65330 599228 600760 601774 602181 602281 602144 601268 599155 596262 593930 593018 593145 593599 594259 594999 594976 593676 592244
65313 592244 592457 594406 596345 596977 596737 596589 596722 596893 597064 597051 596433 595366 594719 594867 595167 595209 595688 597207
65295 597207 599032 600003 600065 599864 599336 597893 595833 594480 594751 596153 597222 596600 594056 590946 589197 589214
65279 589214 589355 588195 586569 586387 588068 590401 592349 593494 593188 591182 589144 589607 592845 596363 598043
65264 598043 598288 598437 598725 598822 598831 598524 596978 594377 592898 594069 596209 596454 594682 593394 593957 595087 595296
65247 595296 594830 594462 593969 592821 591271 589915 589003 588829 589799 591330 591645 589796 587248 586300 587251 588264
65231 588264 587937 586909 586635 587445 588384 588649 588569 588989 589914 590218 589067 587354 586921 588172 589371 588962 587834
65214 587834 588281 591061 594636 597254 598565 598887 598166 596576 595318 595625 597140 598167 597550 595557 592898
65199 592898 589813 586580 584203 583777 585223 587216 588481 588867 589036 589399 589638 589219 588122 586944 586320 586429
65183 586429 587047 587869 588651 589198 589438 589420 589086 588170 586637 585099 584383 584683 585576 586918 589026 591658 593443
65166 593443 593085 590919 588693 587833 588374 589482 590515 591546 593252 596191 599780 602192 601984 599833 597979
65151 597979 597832 598802 599613 599894 600022 600200 600449 601139 602786 605502 609005 612946 616858 620149 622560 624250
65135 624250 625059 624296 621906 619278 617956 617798 617373 616072 614922 615328 617839 622072 626744 629713 629298 626318
65119 626318 623880 624283 626698 628661 629227 629649 631224 633647 635744 636887 637078 636128 633691 630309 627835
65104 627835 628020 630486 632699 632468 630252 628446 628632 630307 632198 633771 635032 635852 636353 637330 639337 641590
65088 641590 642644 642139 641169 640864 641272 641711 641592 640675 639088 637488 636854 637663 639314 640628 640987 640911 641524
65071 641524 643356 645671 647096 647027 646239 645918 646362 646910 646949 646436 645545 644382 643267 642805 643252 643995 644054 643083
65053 643083 641760 641193 642018 643985 646250 647998 648858 648832 648044 646681 645081 643665 642711 642192 641850 641401 640758
65036 640758 640076 639567 639372 639693 640859 642873 644951 646003 645726 644812 643915 643036 642232 642256 643724 645937 647292
65019 647292 646852 645070 643175 642410 643558 646385 649532 651710 653122 655081 658193 661541 663785 664402 663738
65004 663738 662573 661800 661733 661488 659836 657051 655099 655438 657383 659243 660306 660944 661451 661783 662030 662104 661255
64987 661255 659022 656581 655975 657735 660169 661491 661860 662694 664577 666608 667774 668269 669149 670904 672792
64972 672792 673743 673662 673367 673217 672520 670717 668596 667569 667992 668961 669755 670670 672191 674009 675298 675608 675104
64955 675104 674205 673391 673287 674544 677345 681028 684437 686986 689345 692609 696613 699633 700085 698025 694595
64940 694595 690811 687706 686821 689020 692868 695611 696170 696011 696823 698582 700529 702686 705238 707237 707259 705181
64924 705181 702441 700679 700745 702643 705596 708250 709551 709507 708776 707768 706657 705893 706007 707038 708672 710668
64908 710668 712625 713773 713822 713741 714834 717179 719824 722270 724670 726622 727122 726152 725183 725434 726464 727235
64892 727235 727835 729199 731505 733791 735143 735573 735547 735179 734282 733128 732827 734535 738165 742182 745030 746431
64876 746431 746843 746136 743788 740303 737363 736234 736877 738805 741730 744875 746824 747026 746652 747030 747966 748585
64860 748585 749085 750238 751696 752308 752054 752170 753140 753973 753950 753859 754847 757047 759981 763302 766299 767590 766510
64843 766510 764292 762717 761884 760516 758414 757330 758900 762609 766481 769237 771080 772773 774749 777125
64829 777125 779753 781869 782270 780489 777666 775669 775298 775922 776948 778935 782579 787083 790438 791391 790549
64814 790549 789404 788827 788729 788680 788519 788610 789708 792224 795475 797997 798801 797957 795893 792798 789153 786153 784838
64797 784838 785092 786213 788168 791377 795191 797642 797299 794985 793154 793739 796854 801343 806069 810595 814859
64782 814859 818468 820524 820336 818326 816042 815045 815714 817130 818135 818474 818896 820159 822055 823585 824071 823903
64766 823903 824105 825399 827758 830685 833659 836414 838873 840833 841867 841817 841338 841403 842152 842825 843050 843499 844676
64749 844676 845786 845759 845015 845083 846499 848166 849003 849248 849674 850314 850620 850389 849985 849952 850750 852535 854879 857061
64731 857061 858848 860644 862749 865069 867694 870944 874378 876623 876969 876588 877276 879444 882037 883946 884531
64716 884531 883241 879998 875939 872694 870757 869494 868689 868894 870039 871014 871311 872001 874230 877570 880759
64701 880759 883283 885178 885834 884499 882026 880816 882418 885872 888882 890135 890006 889444 888912 888471 888365 889080
64685 889080 890769 892836 894264 894439 893679 892978 893268 894689 896322 896796 895686 894353 894820 897434 900074 900200
64669 900200 897489 894011 892031 892240 893931 896070 897812 898650 898752 899111 900920 904567 909263 913523 916036
64654 916036 916378 915314 914389 914859 916688 918604 919227 918146 915909 913249 910663 908690 908006 908799 910322 911574
64638 911574 912384 913312 914459 915014 914310 912889 911988 912155 912805 913116 913026 913232 914353 916158 917688 918249 918137
64621 918137 918085 918127 917598 916345 915229 915047 915626 916500 917785 919598 921185 921713 921659 922293 923811 925023 925101 924585
64603 924585 924266 923971 923004 921186 919022 917433 917617 920332 924666 928116 928674 926612 923909 922419 922948 925348
64587 925348 928719 931965 934846 938084 941776 944303 943834 940632 936933 934674 934217 935102 936922 939222 941435
64572 941435 943300 944895 946214 947276 948528 950325 952005 952347 951224 949894 949465 949825 950394 950998 951629 952137
64556 952137 952692 953727 954917 955036 953503 951304 949676 948730 948251 948989 951794 955873 959217 960745 961047 961204
64540 961204 961956 963846 966816 969474 970034 968483 966810 966646 967710 969078 970746 972989 975174 976512 977548
64525 977548 979682 983367 987830 992417 997026 1001061 1003216 1003056 1002002 1001866 1002719 1003042 1001907 1000289 1000015
64510 1000015 1001862 1005036 1008145 1010278 1011274 1011455 1011377 1011582 1012383 1013972 1016785 1021358 1027473 1033651 1038056
64495 1038056 1040034 1040460 1040612 1041049 1041644 1042193 1042762 1043673 1045305 1047587 1049710 1050887 1051628 1053579 1057604 1062509
64479 1062509 1066282 1068260 1069405 1070728 1072198 1073192 1073322 1072752 1072263 1073105 1076251 1081560 1088001 1094549 1100437
64464 1100437 1104787 1107021 1107885 1109209 1112147 1116168 1120140 1123714 1127032 1129731 1131099 1131063 1130408 1130080 1130649
64449 1130649 1132153 1134034 1135564 1136903 1139334 1143640 1148530 1151751 1152869 1153973 1157134 1161952 1166228 1168499
64435 1168499 1169119 1169159 1169152 1169164 1169503 1170825 1173576 1177538 1181899 1185626 1187889 1188485 1188031 1187524 1187337 1186776 1184987
64418 1184987 1182326 1180314 1180161 1181709 1183967 1186075 1187509 1188056 1188188 1188877 1190349 1191513 1191330 1190196 1189006
64403 1189006 1187393 1184296 1180111 1176765 1175289 1174651 1173553 1172146 1171262 1171047 1171327 1172418 1174430 1176271 1176433
64388 1176433 1174500 1171162 1167120 1162814 1158911 1156119 1154526 1153594 1152572 1150559 1146851 1142076 1138425 1137656
64374 1137656 1139082 1140380 1140053 1138106 1134780 1130077 1124642 1119773 1116134 1113356 1111087 1109464 1108260 1106628
64360 1106628 1104189 1101581 1099496 1097837 1096027 1093406 1089162 1082931 1075882 1070209 1066918 1064871 1062451 1059197
64346 1059197 1055359 1050860 1045644 1040159 1034578 1028227 1020682 1012792 1005715 999536 993705 988183 983142 978119
64332 978119 972614 967129 962462 958372 954154 950187 947485 945691 942992 938327 932541 926925 921687 916425
64318 916425 911175 906279 901793 897646 894044 891168 888729 886093 882777 878798 874758 871483 869182 867034
64304 867034 863986 859803 854927 849705 844481 840158 837610 836525 835725 834599 833225 831104 827251 822031
64290 822031 817635 815780 815783 815709 814631 812849 810630 807926 805068 802675 800827 799046 797090 795196 793577
64275 793577 792153 790671 788748 786054 783013 781072 781564 784160 786892 787863 786742 784643 782806 781449 779827
64260 779827 777394 774669 772479 770436 767045 761760 756149 752347 750945 751208 752686 755338 758187 759345
64246 759345 758010 755691 754761 756080 758387 759711 759040 756912 754812 753915 754104 754200 753345 752051 751648 752575
64230 752575 753613 753293 751969 751754 753967 757330 759544 760163 760669 761821 762619 762488 762888 765300 768628 770280
64214 770280 769544 768219 767903 768160 767873 767153 767065 768169 770081 772058 773428 773679 772631 770538 767971 765792
64198 765792 765080 766427 769022 770876 770368 767540 763921 761399 761215 763419 766930 770307 772671 773874 774013
64183 774013 773377 772818 773470 775647 778343 780161 780575 780189 780010 780677 782162 784049 786090 788418 791055 793525
64167 793525 795361 796730 798029 799019 799076 798211 797081 795993 794789 793862 794261 796281 798807 800756 802471 804890
64151 804890 807852 810146 811107 811433 812350 814463 817483 820777 824065 827579 831412 834889 837197 838693 840751
64136 840751 843879 846719 847643 846738 845432 844623 844114 843612 843251 843146 843333 844342 847021 851472 856666 861332
64120 861332 864822 867082 868368 869254 870412 872077 873988 875925 877939 880057 882257 884772 887834 890957
64106 890957 893173 894283 895194 896582 897987 898909 900104 902680 906218 909017 910355 911403 913442 916231 918877
64091 918877 921528 925078 929535 933710 936599 938286 939501 941094 944001 948690 954150 958283 959924 959942 959805
64076 959805 959826 959517 959008 959001 959635 960430 961311 962766 965017 967890 971485 975992 980711 984247 986058 987019 988107
64059 988107 989281 989988 990151 990268 991135 993613 997826 1002333 1005101 1005854 1006648 1009424 1013727 1017531 1019685 1020833
64043 1020833 1022472 1025730 1030569 1035615 1039288 1041557 1043923 1047328 1051117 1054662 1058584 1063170 1066870 1068204
64029 1068204 1068390 1070099 1073823 1077398 1079180 1079911 1081014 1082742 1084701 1086925 1089629 1092836 1096865 1102318
64015 1102318 1108884 1114913 1118852 1120708 1121827 1123721 1127234 1132078 1136924 1140619 1143441 1146502 1149961 1152883
64001 1152883 1155015 1157409 1160873 1164946 1168983 1173133 1177540 1181619 1184963 1188043 1191185 1193808 1195635 1197763
63987 1197763 1201316 1205753 1209788 1213521 1218332 1224830 1232168 1239366 1246237 1252835 1258940 1264416 1269534 1274646
63973 1274646 1279829 1284789 1288864 1291477 1293040 1295035 1298549 1303046 1307250 1310816 1314273 1317686 1320559 1323130
63959 1323130 1326603 1331697 1337754 1343631 1348766 1353061 1356537 1359714 1363698 1369086 1375088 1380460 1385156 1390338
63945 1390338 1396587 1402808 1407459 1410584 1413884 1418654 1424260 1429125 1432791 1436312 1440733 1445984 1451435 1456785
63931 1456785 1462064 1467331 1472848 1479029 1485772 1492319 1498216 1503954 1510165 1516666 1522891 1528827 1534764 1540492
63917 1540492 1545558 1550243 1555481 1561681 1568100 1573584 1577663 1580959 1584600 1589008 1593246 1596092 1597978 1601011
63903 1601011 1606562 1613475 1619368 1623077 1625132 1626582 1628392 1631414 1635804 1640772 1645763 1651206 1657036 1661449
63889 1661449 1662894 1662776 1664077 1667402 1670579 1672492 1675005 1680131 1687266 1694437 1700555 1705001 1706576 1704867
63875 1704867 1701856 1700305 1700857 1702043 1702768 1703351 1704326 1705595 1706934 1708335 1709731 1711135 1712952 1715401 1717802
63860 1717802 1719241 1719785 1720277 1721134 1722242 1723753 1725930 1728229 1729718 1730524 1731797 1733820 1735228 1734690 1732571
63845 1732571 1730249 1728336 1726341 1723736 1720703 1717891 1715875 1714719 1713672 1711510 1707743 1703542 1700921 1700720
63831 1700720 1701611 1701399 1699092 1695370 1691308 1687364 1683716 1680681 1678008 1674407 1668877 1662353 1656874 1652997
63817 1652997 1649157 1643984 1637997 1632331 1626979 1621459 1616367 1612906 1611163 1609977 1608187 1605024 1599697 1592053
63803 1592053 1583697 1577080 1573098 1570479 1567663 1564226 1560276 1555766 1551031 1546912 1543555 1539831 1534724 1528660
63789 1528660 1522727 1517185 1511636 1506174 1501364 1497085 1492179 1485484 1477002 1468105 1460705 1455830 1452589 1448769
63775 1448769 1442887 1435514 1428279 1421932 1415896 1409456 1402661 1395929 1389377 1382950 1377026 1372454 1369683 1367847
63761 1367847 1365052 1359968 1353070 1346000 1339860 1334702 1330554 1327872 1326388 1324382 1320141 1313952 1307772 1302856
63747 1302856 1298403 1292819 1285828 1278936 1273913 1271089 1269286 1267362 1265528 1264763 1265059 1264913 1262848 1258917 1254346
63732 1254346 1250127 1246458 1243115 1239846 1236586 1233743 1232008 1231444 1231152 1230362 1229376 1228732 1227971 1226353 1224576
63717 1224576 1224410 1226289 1228371 1228705 1227565 1226913 1227988 1230057 1231300 1230443 1227699 1224560 1222554 1222048 1222346
63702 1222346 1222909 1224035 1226113 1228715 1230851 1231875 1231973 1231996 1232940 1235105 1237528 1238729 1238283 1237159 1236274 1235540
63686 1235540 1234913 1235509 1238507 1243273 1247777 1250903 1253340 1256060 1258985 1261650 1264358 1267896 1272489 1277578
63672 1277578 1282431 1286633 1290237 1293763 1297765 1302070 1305728 1308077 1309589 1311234 1313297 1315395 1317534 1320464
63658 1320464 1324758 1330002 1335218 1339884 1344246 1348780 1353613 1358456 1362905 1366657 1369498 1371310 1372366 1373633
63644 1373633 1376387 1381137 1387045 1392802 1398089 1403681 1409938 1415777 1419713 1421650 1422907 1424478 1426017 1426917
63630 1426917 1427729 1429847 1433978 1439567 1445585 1451236 1455911 1459257 1461757 1464695 1469021 1474554 1480636 1487098
63616 1487098 1493945 1500479 1505730 1509776 1513787 1518414 1522949 1526573 1529744 1533539 1537989 1541996 1544918 1547410
63602 1547410 1550434 1554138 1558251 1563042 1569087 1576158 1583056 1588847 1593764 1598468 1602782 1605830 1607460 1608836
63588 1608836 1611236 1614645 1618094 1621155 1624396 1628306 1632488 1636408 1640376 1645026 1649925 1653590 1655259 1656092
63574 1656092 1657947 1661184 1664310 1665912 1666371 1667291 1669685 1673252 1677239 1681255 1685102 1688501 1691503 1694916
63560 1694916 1699702 1705862 1712193 1717168 1720061 1721387 1722477 1724342 1726672 1728191 1728335 1728217 1729308 1731483
63546 1731483 1733281 1734074 1734876 1736600 1738553 1739536 1739738 1740488 1742373 1744616 1746355 1747659 1748971 1750211 1750912
63531 1750912 1751001 1751135 1752292 1754945 1758449 1761369 1762829 1763510 1764813 1766973 1768557 1768167 1766219 1764616 1764862
63516 1764862 1766879 1769553 1771919 1773599 1774406 1774041 1772427 1770118 1767980 1766389 1765134 1764250 1764467 1766405 1769659
63501 1769659 1773175 1776226 1778390 1778941 1777451 1775156 1774546 1776743 1779984 1781533 1780711 1779150 1778390 1778317 1778168 1778081
63485 1778081 1778965 1781200 1784014 1786073 1786376 1784752 1781934 1779287 1778132 1778920 1780834 1782325 1782276 1780849 1779196
63470 1779196 1778351 1778469 1779112 1780005 1781333 1783370 1786014 1788687 1790715 1791941 1792955 1794401 1795962 1796417 1795090
63455 1795090 1792918 1791560 1791597 1792177 1792395 1792224 1791893 1791203 1790158 1789722 1791004 1793779 1796574 1798247 1798727 1798125
63439 1798125 1796154 1793050 1790381 1789973 1792188 1795855 1799705 1803112 1805673 1806980 1807095 1806568 1805743 1804636 1803711
63424 1803711 1803996 1805968 1808819 1811304 1812826 1813272 1812528 1810904 1809562 1809580 1810771 1812145 1813294 1814542 1815937
63409 1815937 1817073 1817932 1819033 1820586 1822237 1823773 1825336 1826838 1828009 1829139 1830860 1832849 1833678 1832505
63395 1832505 1830197 1828242 1827276 1827264 1828308 1830438 1833038 1835310 1837080 1838573 1839722 1840191 1839768 1838287 1835705
63380 1835705 1832882 1831650 1833170 1836506 1839609 1841396 1842019 1841549 1839666 1836723 1833944 1832028 1830363 1828099
63366 1828099 1825477 1823563 1822947 1823036 1822626 1821162 1819548 1819501 1821684 1824645 1826023 1824702 1821355 1817148 1812644
63351 1812644 1807971 1803408 1799535 1797086 1796515 1797271 1797720 1796463 1793642 1790394 1787357 1784589 1782575 1781891 1781674
63336 1781674 1779933 1776071 1771879 1769093 1767027 1763836 1759381 1755334 1752660 1750453 1747606 1744438 1741996 1740348
63322 1740348 1738396 1735201 1730981 1726649 1722766 1719232 1715915 1713148 1711324 1710157 1708718 1706215 1702471 1697751
63308 1697751 1692570 1687723 1684031 1681732 1680353 1679298 1678277 1677091 1675389 1672895 1669613 1665665 1661207 1656607
63294 1656607 1652400 1648927 1646209 1644174 1642620 1641053 1639048 1636756 1634503 1631982 1628668 1625127 1622871 1622531
63280 1622531 1622972 1622704 1621351 1619226 1616490 1613583 1611583 1611044 1611001 1610147 1608448 1606580 1604405 1601444 1598474
63265 1598474 1597136 1597741 1598837 1599220 1599189 1599418 1599701 1599378 1598128 1595793 1592274 1588204 1585070 1583976 1584676 1586086
63249 1586086 1587129 1586898 1584944 1582115 1580326 1580658 1582152 1583085 1582885 1582068 1580973 1579560 1578038 1576693 1575317
63234 1575317 1573799 1572962 1573655 1575106 1575456 1574170 1572622 1571920 1571535 1570927 1571208 1573651 1577236 1579389 1579214 1578565
63218 1578565 1579503 1581923 1584348 1586008 1587005 1587047 1585472 1582764 1580973 1581812 1584703 1587366 1588382 1588595 1589690
63203 1589690 1591825 1593445 1593526 1593188 1594311 1597058 1599947 1602382 1605688 1610818 1616175 1619180 1619490 1619140 1619554
63188 1619554 1620069 1619828 1619590 1620557 1622600 1624882 1627571 1631394 1635736 1638622 1638962 1637842 1637166 1637745 1639064 1640317
63172 1640317 1641239 1642322 1644469 1648047 1652119 1655178 1656903 1658586 1661372 1664615 1666612 1666605 1665397 1664225 1663728
63157 1663728 1663981 1664730 1665383 1665328 1664644 1664076 1664034 1664041 1663618 1663333 1664328 1666847 1669801 1671815 1672294 1671532 1670444 1670394 1672430
63138 1672430 1676009 1678932 1679370 1677826 1676519 1677066 1679520 1683363 1688119 1692640 1695061 1694570 1692649 1691645 1692400
63123 1692400 1694078 1695923 1698069 1700584 1702846 1704333 1705302 1706101 1706389 1705682 1704325 1703176 1702480 1701900 1701845 1703929
63107 1703929 1709346 1717033 1724228 1728928 1731289 1732648 1734054 1736118 1739267 1743121 1746228 1747634 1748473 1750735
63093 1750735 1754475 1757692 1759213 1760145 1761803 1763799 1765341 1766968 1769351 1771435 1771830 1771501 1772947 1776694 1780711
63078 1780711 1783727 1787088 1792274 1798315 1803118 1806267 1809012 1812204 1815758 1819828 1824969 1830866 1836077 1839583
63064 1839583 1842005 1844872 1849100 1854550 1860737 1867399 1874290 1880791 1886247 1890828 1895642 1901551 1908043 1913800
63050 1913800 1918292 1922134 1925836 1929023 1931355 1933457 1936209 1939460 1942209 1943896 1944898 1945754 1946685 1948190
63036 1948190 1951497 1957660 1965998 1973887 1978692 1980096 1980238 1981364 1983689 1985957 1987566 1989239 1991629 1994299
63022 1994299 1996577 1998668 2001218 2004182 2006851 2008887 2010760 2013067 2015729 2017918 2018708 2017957 2016628 2015985 2016316
63007 2016316 2016759 2016554 2016056 2016126 2016861 2017495 2017454 2016979 2016549 2016104 2015216 2013918 2012921 2012688 2012519 2011132 2008302 2005330
62989 2005330 2003468 2002399 2000861 1998241 1994711 1990303 1985049 1979889 1976162 1974012 1972539 1971630 1972156 1973766
62975 1973766 1974137 1971563 1967196 1963433 1960884 1958156 1953880 1947716 1939963 1931551 1924044 1918303 1913268 1907238
62961 1907238 1900167 1893586 1888514 1884631 1881328 1878254 1874870 1870807 1866679 1863221 1859605 1854139 1846946 1840208
62947 1840208 1835095 1830078 1823441 1816088 1810403 1807110 1804754 1801855 1798217 1794183 1789838 1785250 1780694 1776273
62933 1776273 1771719 1766754 1761332 1755435 1748922 1741711 1734121 1727103 1721942 1719184 1717673 1715102 1709953 1702735
62919 1702735 1695210 1688755 1683659 1679435 1675283 1670561 1665218 1659720 1654451 1649611 1645790 1643826 1643539 1643248
62905 1643248 1641361 1638102 1634924 1632527 1630381 1628013 1625678 1623526 1620990 1617457 1613011 1608137 1603196 1598538
62891 1598538 1594705 1592001 1590099 1588397 1586536 1584294 1581342 1577644 1573986 1571608 1571144 1572103 1573311 1573557 1572013
62876 1572013 1568624 1564401 1560945 1559303 1559308 1560095 1560917 1561276 1560695 1559042 1557029 1555830 1556052 1557368 1559196 1561304
62860 1561304 1563684 1566286 1569114 1572179 1575192 1577818 1580487 1584241 1589143 1593402 1595011 1594073 1592704 1592685 1594037
62845 1594037 1595922 1597935 1599996 1601801 1603170 1604634 1606970 1610162 1613355 1615909 1618131 1620774 1623974 1627027
62831 1627027 1629299 1631156 1633710 1637640 1642607 1647923 1653243 1658197 1661886 1663573 1663801 1664025 1665067 1666620
62817 1666620 1668487 1671446 1676338 1682714 1689020 1694051 1697934 1701818 1706736 1712599 1718170 1722232 1724876 1727363
62803 1727363 1730649 1734449 1737914 1740803 1743713 1747533 1752923 1759974 1767880 1775071 1780099 1782651 1783821 1785562
62789 1785562 1789494 1795573 1801700 1805273 1805598 1804568 1804795 1807451 1812077 1817749 1823748 1829435 1834261 1838071
62775 1838071 1841094 1843716 1846495 1850077 1854583 1859154 1862595 1864520 1865609 1866752 1868331 1870448 1873418 1877651
62761 1877651 1882957 1888300 1892611 1895877 1899058 1902620 1905652 1907065 1907356 1908227 1910334 1912409 1913148 1913198 1914445
62746 1914445 1917730 1921965 1925366 1926968 1927059 1926677 1926773 1927607 1928815 1929948 1930607 1930208 1928425 1926194 1925526 1927588
62730 1927588 1931358 1934780 1936879 1938149 1939329 1940701 1942401 1944458 1946306 1946940 1945918 1943895 1941991 1940734
62716 1940734 1939649 1937802 1934906 1931984 1930567 1931036 1932190 1932757 1932804 1933146 1933904 1934367 1933834 1931890 1928179 1922820
62700 1922820 1916973 1912168 1908987 1906920 1905338 1903950 1902447 1900554 1898518 1896888 1895766 1894783 1893708 1892444
62686 1892444 1890496 1887136 1882113 1875685 1868250 1860738 1855060 1852945 1854082 1856290 1857706 1857969 1857254 1855359
62672 1855359 1852272 1848740 1845595 1842990 1840611 1838023 1834676 1830369 1825919 1822440 1819702 1816216 1811345 1806163
62658 1806163 1801535 1796643 1790520 1784185 1779863 1778493 1779040 1779936 1780179 1779283 1777223 1774475 1771452 1768035 1764222
62643 1764222 1760803 1758490 1756750 1754417 1751227 1747742 1743983 1739447 1734561 1730796 1728816 1727589 1725930 1723964
62629 1723964 1722242 1720278 1717137 1713212 1710267 1709440 1709858 1709622 1707796 1705151 1703091 1702138 1701463 1699771 1696511
62614 1696511 1692244 1687907 1683993 1680575 1677944 1676764 1677260 1678380 1678217 1675604 1671177 1666613 1662914 1659699
62600 1659699 1656104 1651931 1647801 1644527 1642596 1641943 1641889 1641376 1639628 1636720 1633496 1630891 1629246 1628126 1626868
62585 1626868 1625437 1624618 1625033 1626113 1626547 1625710 1624105 1622358 1620493 1618453 1616524 1614761 1612699 1610366 1609016
62570 1609016 1609874 1612366 1614496 1614990 1614377 1613915 1614166 1614756 1614892 1613809 1611234 1607829 1604951 1603750 1604490 1606580
62554 1606580 1608951 1610539 1610948 1610735 1610753 1611268 1612162 1613871 1617306 1622458 1627662 1630716 1630577 1627793 1623730 1619773
62538 1619773 1616971 1615783 1616016 1617141 1618681 1620235 1621426 1622170 1622928 1624288 1626166 1627612 1627666 1626369 1624706
62523 1624706 1623513 1622675 1621763 1621205 1622117 1624667 1627316 1628473 1628513 1629201 1631116 1632767 1632745 1631784 1631767 1633232 1634904
62506 1634904 1635536 1635163 1634347 1633173 1631622 1630280 1629827 1629985 1629710 1628513 1627163 1626963 1628652 1631969 1635755 1638389
62490 1638389 1638785 1637487 1636405 1636983 1638810 1640418 1641057 1641050 1640726 1640025 1639250 1639259 1640454 1642173 1643603 1644708 1645762
62473 1645762 1646518 1646541 1645989 1645343 1644623 1643624 1642739 1642625 1642996 1642617 1640914 1638901 1637985 1638296 1638796 1638787 1638663 1639156 1640393
62454 1640393 1642007 1643772 1645616 1647088 1647435 1646587 1645646 1645874 1647399 1649478 1651837 1654870 1658387 1661195 1662544
62439 1662544 1663157 1664030 1664851 1664627 1663545 1663087 1664275 1666640 1668969 1670314 1670297 1669344 1668784 1669871 1672360 1674752
62423 1674752 1676147 1677054 1678131 1679134 1679771 1680792 1683293 1687297 1691719 1695406 1697628 1697978 1696717 1695219 1695291
62408 1695291 1697700 1701616 1705465 1708134 1709533 1710424 1711674 1713344 1714553 1714441 1713131 1711503 1710376 1710315 1711818
62393 1711818 1714836 1718222 1720581 1721860 1723354 1725730 1727963 1728995 1729769 1732407 1737371 1742584 1745888 1747591
62379 1747591 1749916 1754373 1760439 1766568 1771669 1775481 1778219 1780245 1781884 1783394 1785277 1788351 1792918 1798003
62365 1798003 1802244 1805625 1809332 1813624 1817014 1818328 1818456 1818965 1819912 1820578 1821703 1825056 1830670 1836200 1839592
62350 1839592 1841121 1842285 1843914 1846011 1848422 1850838 1852950 1855171 1858443 1862816 1867262 1871395 1876127 1881633
62336 1881633 1885975 1887234 1886271 1885904 1887866 1891897 1897222 1903218 1908811 1912970 1916139 1919822 1924496 1929193
62322 1929193 1933359 1937663 1942414 1946615 1949566 1952232 1955831 1959780 1962316 1962982 1963460 1965833 1970530 1976090
62308 1976090 1980627 1983550 1985956 1989158 1992913 1995716 1996941 1997806 1999646 2002002 2003481 2004130 2005758 2009652
62294 2009652 2014771 2018702 2020068 2019642 2019329 2020347 2022421 2024563 2026436 2028687 2032027 2036361 2041102 2045869
62280 2045869 2050354 2053902 2056046 2057573 2060187 2064587 2069416 2072766 2074400 2075684 2077356 2078375 2077553 2075620
62266 2075620 2074763 2076234 2079239 2082276 2084759 2086937 2088973 2090788 2092388 2093618 2093875 2092839 2091429 2091189 2092604
62251 2092604 2094660 2096265 2097455 2098830 2100421 2101706 2102553 2103692 2106231 2110672 2116111 2120499 2122390 2122616
62237 2122616 2123546 2126289 2129381 2130941 2131331 2132526 2135284 2138401 2140926 2143631 2147461 2151610 2154398 2155639
62223 2155639 2156954 2159698 2163540 2167420 2170986 2174517 2177984 2181066 2184039 2187847 2192888 2198079 2201643 2202929
62209 2202929 2203210 2204413 2207193 2210583 2213674 2217050 2221906 2227974 2233442 2237392 2241336 2247233 2254498 2260383
62195 2260383 2263421 2265206 2268158 2272595 2276912 2279895 2281782 2283461 2285762 2289401 2294538 2300134 2304582 2307387
62181 2307387 2309696 2312898 2317247 2322075 2326799 2331242 2335361 2339229 2343177 2347527 2352131 2356397 2359959 2363328
62167 2363328 2367660 2373576 2380111 2385280 2388029 2389429 2391596 2395654 2401136 2406969 2412424 2417258 2421662 2426133
62153 2426133 2430854 2435310 2439051 2442591 2446801 2451621 2456397 2461367 2467549 2474874 2481722 2486896 2490912 2494630
62139 2494630 2497845 2500399 2503627 2509120 2516365 2523006 2527628 2531255 2535893 2542300 2549409 2555460 2559659 2563048
62125 2563048 2567678 2574591 2582810 2590482 2596486 2600596 2602965 2604353 2606233 2609494 2613285 2616093 2617747 2619364
62111 2619364 2621651 2624506 2628136 2633160 2639374 2645668 2651497 2657286 2663008 2667647 2670729 2673253 2676266 2679400
62097 2679400 2681779 2683720 2686444 2690443 2694954 2698928 2701928 2704236 2706488 2709018 2711290 2712357 2712127 2711722
62083 2711722 2712245 2713680 2715249 2716225 2716051 2714502 2712383 2711336 2712083 2713363 2713299 2711387 2708577 2706103 2705039
62068 2705039 2706128 2708819 2710951 2710697 2708519 2706047 2703531 2700074 2696098 2693483 2692657 2691425 2687736 2682260
62054 2682260 2676988 2672378 2667313 2661241 2654967 2649521 2645310 2642170 2639254 2635007 2628332 2620044 2612428 2607152
62040 2607152 2604005 2601532 2598190 2593012 2586058 2578539 2571823 2565995 2559937 2553025 2546021 2539837 2534096 2527644
62026 2527644 2520098 2512073 2504049 2495917 2487819 2480582 2474723 2469434 2463205 2455393 2446593 2437488 2427995 2417927
62012 2417927 2407845 2398520 2389733 2380425 2370217 2360040 2350925 2342816 2335139 2327926 2321476 2315170 2307668
61999 2307668 2298520 2288729 2279340 2270158 2260443 2250329 2240821 2232526 2225040 2217644 2210091 2202538 2195039 2187333
61985 2187333 2179085 2170276 2161418 2153359 2146725 2141435 2136652 2131082 2123539 2113749 2102828 2092604 2084052
61972 2084052 2076638 2069413 2062290 2055616 2048889 2040959 2031800 2023213 2017198 2013963 2011978 2009598 2006075 2001303
61958 2001303 1995442 1989096 1983354 1979063 1975974 1972894 1968860 1964093 1959537 1955509 1951184 1945708 1939447 1933550
61944 1933550 1928414 1923413 1918337 1914221 1911975 1910621 1907965 1903161 1897826 1894140 1892342 1890787 1888285 1885523
61930 1885523 1883843 1883294 1882741 1881670 1880841 1880789 1880640 1879183 1876445 1873179 1869354 1864586 1859921 1857536 1858059 1859551
61914 1859551 1859953 1859354 1858816 1858130 1856342 1853856 1852381 1852796 1854369 1856013 1857038 1856727 1854627 1851692 1849861
61899 1849861 1849920 1850781 1851330 1851938 1853511 1856014 1858712 1861124 1863006 1864113 1864793 1866149 1868715 1871475 1873065
61884 1873065 1873504 1873752 1874032 1873681 1872569 1871538 1871241 1871379 1871295 1870633 1869252 1867212 1865137 1864040 1864450 1866021
61868 1866021 1868049 1869872 1870683 1869725 1867208 1864625 1863524 1864041 1865012 1865440 1865475 1865845 1866682 1867204 1866552 1864668 1862170
61851 1862170 1859572 1856945 1854358 1852233 1851023 1850820 1851377 1852204 1852469 1851330 1848830 1846143 1844379 1843310 1841802
61836 1841802 1839308 1836348 1833624 1831360 1829642 1828679 1828337 1827849 1826450 1824179 1821795 1819932 1818490 1816772 1814131
61821 1814131 1810480 1806166 1801484 1796680 1792459 1789875 1789109 1788723 1786901 1783444 1779855 1777339 1775449 1772954
61807 1772954 1769346 1765061 1760770 1757107 1754685 1753535 1752528 1750102 1745928 1741372 1737867 1735147 1731719 1727012
61793 1727012 1722213 1718563 1715611 1712136 1708388 1706000 1705392 1704631 1701774 1697324 1693136 1689567 1685219 1679355
61779 1679355 1673081 1667741 1663324 1658961 1654122 1648808 1643213 1637744 1632825 1628328 1623716 1619038 1615127 1612385
61765 1612385 1609995 1606760 1602249 1596769 1590798 1584854 1579341 1574106 1568782 1563900 1560770 1559600 1558587 1555781
61751 1555781 1551184 1546041 1540796 1535049 1529072 1523867 1519618 1515414 1510799 1506480 1503126 1500462 1498006 1495828
61737 1495828 1494028 1492201 1489945 1487330 1484390 1480829 1476785 1473144 1470316 1467281 1462745 1457025 1451839 1448324
61723 1448324 1446017 1443798 1441031 1437620 1433783 1430129 1427311 1425096 1422295 1418230 1413839 1410597 1408555 1406266
61709 1406266 1402765 1398733 1395369 1392820 1390425 1388000 1385925 1384037 1381433 1377746 1373938 1371172 1369265 1366912
61695 1366912 1363414 1359609 1356888 1355693 1355288 1354711 1353435 1351125 1347483 1342993 1339473 1338910 1341305 1344285 1345385
61680 1345385 1344317 1342458 1340655 1338449 1335271 1331297 1326973 1322663 1319087 1317210 1317055 1317304 1316718 1315460 1314428
61665 1314428 1313791 1312879 1311240 1309156 1307198 1305636 1304130 1301819 1298189 1294138 1291522 1291106 1291605 1291368 1290295
61650 1290295 1289229 1288149 1286178 1283060 1279419 1275728 1272289 1270099 1270254 1272148 1273562 1273107 1271549 1270194
61636 1270194 1269078 1267544 1265671 1264078 1262797 1261209 1258820 1255525 1251476 1247304 1244116 1242584 1242233 1242091
61622 1242091 1241787 1241531 1241399 1241222 1240918 1240327 1238971 1236593 1233735 1231204 1229169 1227437 1226408 1226834 1228461 1229653
61606 1229653 1228759 1225500 1220886 1216226 1212440 1209786 1207780 1205594 1202878 1200115 1197941 1196304 1194612 1192623
61592 1192623 1190812 1189683 1189045 1188249 1187036 1185731 1184537 1183150 1181398 1179798 1178851 1178107 1176856 1175712 1176359
61577 1176359 1179109 1181661 1181304 1177999 1174300 1172365 1171935 1171257 1169155 1165915 1162776 1160905 1160437 1160275 1159165
61562 1159165 1157072 1155046 1153725 1152612 1151125 1149678 1149151 1149729 1150785 1151559 1151430 1149900 1147058 1143999 1142102
61547 1142102 1141755 1142272 1143008 1143916 1144895 1145297 1144461 1142333 1139246 1135581 1132025 1129653 1129079 1129759 1130691 1131577 1132574
61530 1132574 1133158 1132221 1129601 1126726 1125171 1125067 1125454 1125818 1126600 1128384 1131079 1133908 1135821 1135978 1134276 1131511
61514 1131511 1128820 1126980 1126319 1126900 1128403 1130104 1131571 1133283 1135965 1139336 1142127 1143423 1143332 1142229 1140182
61499 1140182 1137618 1135797 1135731 1136874 1137698 1137483 1136961 1137150 1138267 1139941 1141885 1143937 1145858 1147579 1149429
61484 1149429 1151667 1153909 1155455 1156208 1156804 1157772 1158969 1160079 1161222 1162718 1164564 1166592 1168999 1172165 1175995
61469 1175995 1179977 1183979 1188458 1193612 1198706 1202471 1204002 1203261 1201215 1199615 1200034 1202629 1206098 1209041
61455 1209041 1210966 1211908 1211903 1211383 1211330 1212199 1213213 1213649 1214386 1217069 1221868 1227139 1231414 1234805 1238252 1242322
61439 1242322 1247061 1252292 1257545 1262207 1266094 1269554 1272813 1275560 1277309 1277966 1278120 1279067 1282140 1287376 1293051
61424 1293051 1297259 1299742 1301534 1303266 1304837 1306410 1308360 1310394 1312094 1314376 1318756 1324946 1330885 1335715
61410 1335715 1340953 1347804 1354979 1360524 1364443 1368063 1371875 1375422 1378461 1380902 1382394 1383379 1385691 1390587
61396 1390587 1396893 1402646 1407847 1413783 1420190 1425277 1428631 1432071 1437126 1443295 1449393 1455199 1460947 1466313
61382 1466313 1470796 1474572 1478458 1483370 1489826 1497366 1504493 1509959 1514153 1518574 1524142 1530775 1538211 1545993
61368 1545993 1552822 1557376 1560054 1562734 1566660 1571655 1577499 1584606 1592857 1601052 1608113 1613873 1618396 1621815
61354 1621815 1625318 1630817 1638714 1647044 1653811 1659244 1664989 1671961 1679909 1688191 1695936 1702158 1706725 1710866
61340 1710866 1715955 1722296 1729627 1737988 1747223 1756347 1764415 1771597 1778528 1785167 1791256 1797416 1804640 1812850
61326 1812850 1820932 1828182 1835004 1842191 1850047 1858136 1865460 1871197 1875731 1880682 1887476 1896174 1905954 1916057
61312 1916057 1925730 1934062 1940789 1946844 1953300 1960251 1967452 1975376 1984440 1993599 2001033 2006278 2010705 2015879
61298 2015879 2022333 2029980 2038795 2048736 2059553 2070816 2081803 2091650 2100219 2108593 2117995 2128438 2139191
61285 2139191 2150183 2161833 2173614 2184015 2192328 2199575 2207346 2216384 2226514 2237091 2247166 2255951
61273 2255951 2263677 2271527 2280395 2290106 2299981 2309634 2319022 2328360 2338338 2349773 2362538 2375264 2386567
61260 2386567 2396343 2405509 2414793 2424270 2433890 2443932 2454689 2465931 2476984 2487574 2498444 2510652
61248 2510652 2524153 2537636 2550202 2562622 2576196 2590758 2604775 2617324 2628950 2640419 2651683
61237 2651683 2662635 2674059 2687001 2701533 2716713 2731548 2745530 2758484 2770640 2783019 2797094
61226 2797094 2813418 2830509 2845630 2857168 2866155 2875108 2885525 2897133 2909441 2922840 2937566 2952633
61214 2952633 2966826 2980196 2993493 3006629 3019021 3031291 3045153 3061253 3078229 3094367 3109227
61203 3109227 3123255 3136757 3149842 3162708 3175475 3188187 3201303 3215397 3230035 3243723 3255563
61192 3255563 3266284 3277082 3288128 3298876 3309180 3319360 3329699 3340702 3353330 3367870 3382726
61181 3382726 3395356 3404788 3412696 3421908 3434302 3450138 3468688 3488860 3509330 3528599 3545496 3559943
61169 3559943 3573109 3586519 3600985 3616541 3633048 3650147 3666824 3682048 3696297 3711660 3729827
61158 3729827 3750526 3772424 3794772 3817318 3839219 3859335 3877680 3895672 3914630 3934506 3954220
61147 3954220 3972807 3990189 4007207 4024946 4043729 4062825 4081419 4099568 4117706 4135570 4152498
61136 4152498 4168809 4185930 4204794 4224821 4244788 4264016 4282218 4298972 4314314 4329506 4346275
61125 4346275 4365123 4385054 4404927 4424345 4443109 4460822 4477772 4495552 4515816 4538484 4561923
61114 4561923 4584860 4607349 4629820 4652200 4674490 4697421 4721671 4746756 4771399 4794887 4817594
61103 4817594 4840406 4864133 4889126 4914761 4939499 4962296 4983943 5006235 5029815 5053620 5076570
61092 5076570 5098860 5121202 5143682 5166045 5188555 5211860 5236260 5261672 5288053 5315376 5343247
61081 5343247 5370956 5397982 5424436 5451238 5479827 5511117 5544360 5577457 5608906 5639321 5670674
61070 5670674 5704149 5739015 5773550 5806828 5839586 5873392 5908895 5944966 5979728 6012319 6043482
61059 6043482 6074733 6107401 6142231 6179080 6216875 6254472 6291659 6328819 6365726 6401493 6435773
61048 6435773 6469106 6501899 6534084 6566067 6598850 6632572 6665949 6697984 6729409 6761704 6795583
61037 6795583 6831280 6869224 6908926 6947855 6983094 7014358 7044351 7076132 7110871 7147950 7186091
61026 7186091 7224134 7261449 7297901 7333226 7366833 7398704 7429813 7460751 7490419 7517331 7541978
61015 7541978 7566690 7593081 7620624 7647574 7672057 7692311 7707471 7718805 7729138 7740436 7752685
61004 7752685 7765362 7778772 7793243 7807976 7821693 7833922 7844961 7855035 7864138 7872348 7879776 7886495
60992 7886495 7892889 7899610 7906786 7913634 7919166 7922818 7924160 7922675 7918440 7912460 7905640 7897742 7887935 7876119
60978 7876119 7863126 7849823 7836459 7822663 7807604 7790443 7771183 7750859 7730267 7708569 7683920
60967 7683920 7655645 7625204 7594607 7564266 7532951 7499748 7465378 7431156 7397076 7361723 7324170
60956 7324170 7285208 7246259 7207769 7169431 7131396 7094141 7057232 7019363 6979867 6939309 6898250
60945 6898250 6856327 6813008 6768469 6723066 6676533 6628397 6578828 6528599 6478371 6428270 6377801
60934 6377801 6326032 6272400 6217536 6162629 6107637 6050968 5991472 5930025 5868434 5807316 5745931
60923 5745931 5683604 5620440 5556821 5492953 5428808 5363996 5297901 5230408 5162172 5093768 5025094
60912 5025094 4956180 4887860 4820705 4753869 4686149 4617833 4550230 4483514 4416370 4348032 4279555
60901 4279555 4212680 4148328 4086437 4026354 3967019 3907636 3848498 3790400 3733060 3675239 3616787
60890 3616787 3559246 3503624 3448695 3392763 3336311 3281505 3229361 3178657 3127623 3075678 3023490
60879 3023490 2972288 2923324 2877108 2832750 2788601 2743813 2698862 2654506 2610982 2568497 2527795
60868 2527795 2489598 2453649 2418714 2383592 2348205 2313903 2282466 2254214 2227266 2199423 2170696
60857 2170696 2142881 2116488 2089682 2061292 2033360 2008871 1987643 1966568 1943936 1921308 1900453
60846 1900453 1880487 1859605 1838329 1819031 1802681 1787691 1772037 1755170 1737665 1720217 1703522
60835 1703522 1688287 1674674 1662017 1649381 1636116 1621890 1606707 1591111 1575975 1561968 1549426
60824 1549426 1538517 1529028 1520128 1511057 1501973 1493368 1484764 1475125 1464764 1455712 1449460 1445156 1440667
60811 1440667 1434751 1427529 1419584 1411481 1403722 1396307 1388647 1380575 1373050 1367127 1362582 1358281 1353543 1348357
60797 1348357 1342717 1336815 1331646 1328131 1325512 1321669 1315489 1308152 1301671 1296840 1292972 1289016 1284410 1279236
60783 1279236 1274002 1269201 1264945 1261159 1257935 1255246 1252505 1249152 1245689 1243352 1242487 1242046 1240999 1239518
60769 1239518 1238242 1237116 1235734 1234343 1233587 1233343 1232616 1230847 1228871 1228203 1229502 1231883 1233806 1234555 1234669
60754 1234669 1234872 1234942 1234158 1232646 1231516 1231538 1232304 1233005 1233425 1233793 1234209 1234747 1235690 1237060 1238159 1238123 1236805 1234715
60736 1234715 1232391 1230300 1229129 1229582 1231819 1235358 1239358 1242777 1244718 1245247 1245586 1246847 1248703 1249964 1250299
60721 1250299 1250641 1251878 1253873 1255930 1257466 1258020 1257335 1255885 1254802 1254774 1255349 1255614 1255198 1254347 1253508 1253230 1254062
60704 1254062 1256027 1258489 1260914 1263464 1266408 1269303 1271320 1272201 1272383 1272352 1272386 1272788 1273687 1274591 1274680 1273706 1272212
60687 1272212 1270916 1270336 1270961 1273107 1276333 1279547 1282027 1284020 1286128 1288551 1291190 1293952 1296488 1298008
60673 1298008 1298008 1297107 1296709 1297829 1300494 1304126 1308077 1311674 1314079 1314453 1312505 1309129 1306280 1305609 1306844 1307993
60657 1307993 1307640 1306697 1307308 1310198 1313877 1316484 1317695 1318475 1319515 1320545 1321076 1321319 1322151 1324319 1327855 1332232
60641 1332232 1336780 1340748 1343327 1344296 1344723 1346268 1349381 1352770 1355122 1356615 1357987 1358843 1358176 1356359 1355205
60626 1355205 1355823 1357528 1359256 1360960 1363013 1365203 1367113 1368886 1370897 1373155 1375638 1378634 1382109 1385190
60612 1385190 1386987 1387524 1387279 1386385 1385040 1384249 1385155 1387796 1391202 1394411 1396717 1397500 1397061 1397340 1400439 1406165
60596 1406165 1412213 1417042 1421371 1426310 1431237 1434637 1436323 1437617 1439530 1441760 1443599 1445054 1446574 1448066
60582 1448066 1448726 1448069 1446882 1446746 1448421 1450960 1452791 1453489 1454036 1455471 1457858 1460633 1463368 1466001 1468875
60567 1468875 1472767 1478307 1484962 1490980 1494824 1496413 1496700 1496518 1496344 1496766 1498319 1500675 1502588 1503017 1502190
60552 1502190 1501424 1501959 1503920 1506298 1507912 1508558 1509228 1511151 1514662 1519058 1523400 1527195 1530251 1532312 1533234
60537 1533234 1533470 1533878 1534776 1535530 1535636 1535942 1538007 1542071 1546449 1549481 1551370 1553401 1555914 1558056 1559334
60522 1559334 1560190 1560882 1560755 1559164 1556343 1552914 1549150 1545387 1542587 1541612 1542007 1542226 1541328 1540090 1540166 1542247
60506 1542247 1545264 1547525 1548460 1548874 1549397 1549273 1547289 1543632 1540045 1538101 1537909 1538581 1539281 1539525 1538990 1537458
60490 1537458 1534842 1531296 1527615 1525206 1524930 1525992 1526695 1526282 1525307 1524354 1523587 1523602 1525178 1527526 1528201 1525792
60474 1525792 1521689 1518145 1515675 1513587 1512021 1511684 1511994 1511198 1508349 1503926 1498584 1492684 1487097 1483040 1480712
60459 1480712 1479036 1477097 1474954 1472956 1471203 1469779 1468535 1466621 1463414 1459984 1458178 1457920 1456903 1453607
60445 1453607 1449018 1444430 1439172 1432182 1424766 1419747 1418050 1417751 1416631 1414352 1411815 1409527 1407174 1404226
60431 1404226 1400685 1397571 1396506 1398016 1400223 1400179 1396859 1392113 1388259 1385520 1382455 1378271 1373816 1370456
60417 1370456 1368765 1368364 1368319 1367450 1364837 1360613 1356077 1352584 1350283 1348332 1346228 1344360 1343004 1341363 1338313
60402 1338313 1333933 1329627 1326625 1324927 1323832 1322839 1321671 1320012 1317857 1315800 1314373 1313266 1311813 1310112
60388 1310112 1308894 1308154 1306712 1303738 1300229 1298273 1298797 1300615 1301855 1301869 1301387 1301119 1300834 1299999 1298774 1297894
60372 1297894 1297680 1297610 1296949 1295553 1293926 1292718 1292234 1292260 1292210 1291572 1290340 1289001 1288114 1287917 1288223 1288531 1288413 1287996
60354 1287996 1287923 1288533 1289352 1289928 1290955 1293732 1298359 1303300 1307110 1309832 1312116 1313745 1313988 1313075 1312285 1312473
60338 1312473 1313235 1313693 1313617 1313634 1314632 1316912 1319628 1321280 1321298 1320896 1321729 1323724 1325058 1324391 1322405 1320799 1320451
60321 1320451 1321002 1321728 1322300 1322897 1323983 1325833 1328148 1330399 1332579 1335150 1338026 1340220 1340880 1340277 1339369 1338770
60305 1338770 1338544 1338524 1338326 1337432 1335990 1335252 1336557 1339994 1344611 1349578 1354315 1357746 1358682 1357368 1355749 1355565
60289 1355565 1356773 1358349 1359948 1361905 1363933 1364914 1364285 1363010 1362742 1364313 1367225 1370342 1372700 1373874 1374078
60274 1374078 1374098 1374762 1376115 1377177 1376844 1375100 1373175 1372515 1373818 1376838 1380543 1383276 1383535 1381290 1378312
60259 1378312 1376594 1376503 1377001 1377479 1378669 1381588 1386183 1391261 1395418 1397843 1398601 1398364 1397752 1396985 1396283 1396150
60243 1396150 1396675 1396951 1396179 1395159 1395524 1397367 1399055 1399878 1401465 1405450 1410799 1414838 1416292 1416089 1415623 1415561
60227 1415561 1416122 1417204 1418199 1418666 1419142 1420271 1421419 1421439 1420700 1420898 1422678 1424879 1426496 1427918 1429640 1431193
60211 1431193 1432171 1433072 1434120 1434473 1433727 1433248 1434674 1437826 1441283 1444412 1447470 1450258 1452121 1453131 1453935
60196 1453935 1454495 1454219 1453341 1453026 1453957 1455825 1458229 1460982 1463471 1464902 1465484 1466323 1467720 1468661 1468471 1467999
60180 1467999 1468492 1470095 1472079 1473823 1474810 1474417 1472719 1471164 1471536 1474210 1477896 1481001 1482866 1483808 1484455
60165 1484455 1485072 1485310 1484732 1483651 1483179 1484237 1486730 1489783 1492437 1494130 1495064 1496345 1499119 1503278 1507507
60150 1507507 1510900 1513801 1516622 1518680 1519042 1517884 1516060 1513810 1511008 1508375 1507093 1507072 1506831 1505606 1504569
60135 1504569 1505310 1507783 1510586 1512857 1515011 1517510 1519645 1519973 1518012 1515190 1513865 1515216 1518232 1520904
60121 1520904 1522162 1522374 1522315 1522349 1522593 1523115 1523706 1524025 1524267 1525085 1526474 1527329 1526754 1525369 1524557 1524714 1525152 1525676
60103 1525676 1527180 1530176 1533448 1534993 1534108 1531974 1530237 1529487 1529121 1528328 1526986 1525792 1525529 1526154 1526676 1526116
60087 1526116 1524472 1522524 1520951 1520054 1520067 1520925 1521687 1521119 1519366 1518293 1519429 1522060 1524120 1524559 1523856 1522580
60071 1522580 1520766 1518946 1518448 1519816 1521632 1521783 1519615 1516299 1513377 1511460 1510109 1508448 1506134 1504071
60057 1504071 1503894 1506189 1509454 1511397 1511114 1509472 1507600 1505734 1503586 1501057 1498210 1495052 1491791 1489033
60043 1489033 1487315 1486416 1485368 1483356 1480687 1478724 1478492 1479279 1479093 1476839 1473515 1470780 1468852 1466733 1464197
60028 1464197 1462324 1461789 1461741 1461055 1459857 1458931 1458119 1456316 1453052 1449211 1446002 1443784 1442253 1441319 1441271 1442142
60012 1442142 1443305 1443898 1443521 1442404 1441058 1439970 1439462 1439287 1438305 1435240 1430361 1425894 1423833 1423476 1422101
59997 1422101 1418242 1413361 1409857 1408424 1408195 1408640 1409993 1411967 1413343 1413296 1412393 1411757 1411617 1411127 1409446 1406666
59981 1406666 1403783 1401874 1401191 1400963 1400128 1398289 1395911 1393707 1392031 1390822 1389917 1389308 1389149 1389400 1389467 1388628
59965 1388628 1387139 1386463 1387726 1390097 1391483 1390959 1389733 1389352 1389679 1389269 1387305 1384455 1381906 1380195 1379054
59950 1379054 1378010 1376981 1376368 1376591 1377479 1378355 1378901 1379640 1381272 1383705 1386115 1387797 1388598 1388635 1387995 1386765
59934 1386765 1385156 1383537 1382393 1381941 1381639 1380560 1378657 1377191 1377265 1378318 1378942 1378955 1379615 1381686 1384484 1387214
59918 1387214 1390173 1393796 1397300 1399349 1399778 1399757 1400213 1400728 1400242 1398495 1396613 1396160 1397478 1399109 1399323 1398184
59902 1398184 1397397 1398015 1399285 1400164 1400903 1402231 1403929 1405361 1406787 1408802 1410829 1411598 1410984 1410057 1409297 1408216
59886 1408216 1406899 1406379 1406952 1407547 1407555 1408059 1410261 1413692 1416999 1419702 1422007 1423589 1423812 1422868 1421688 1420921
59870 1420921 1420875 1422074 1424757 1427911 1429826 1429782 1428516 1427122 1426323 1426751 1428893 1432379 1436042 1439024 1441375
59855 1441375 1443351 1444755 1445291 1445140 1444792 1444574 1444508 1444492 1444585 1445270 1447238 1450441 1453477 1454502 1452945 1449992 1447456
59838 1447456 1446541 1447453 1449479 1451369 1452353 1452894 1453870 1455028 1455192 1454238 1453810 1455311 1457943 1459595 1459303 1458037
59822 1458037 1457334 1457968 1459825 1462294 1464653 1466667 1468934 1472180 1476133 1479557 1481540 1482245 1482229 1481579 1480154
59807 1480154 1478313 1476827 1476155 1476237 1476899 1477900 1478502 1477701 1475366 1472759 1471313 1471119 1471233 1471374 1472388 1474782
59791 1474782 1477687 1479839 1480997 1481708 1482231 1482564 1483126 1484324 1485545 1485681 1484908 1484965 1487162 1490824 1494208 1496309
59775 1496309 1497244 1497418 1497005 1496013 1494372 1492172 1490178 1489679 1491309 1494219 1496863 1498386 1498926 1498982 1499089 1499768
59759 1499768 1501106 1502487 1503328 1503891 1504756 1505723 1506138 1506240 1507122 1509054 1510798 1511253 1511017 1511450 1512728 1513810
59743 1513810 1514152 1514433 1515366 1516680 1517745 1518563 1519509 1520467 1520958 1521116 1521915 1524252 1528077 1532540 1536626 1539503
59727 1539503 1540703 1540439 1539712 1539716 1540915 1542687 1543869 1543730 1542606 1541612 1541579 1542197 1542478 1542151 1542247 1543961 1547201
59710 1547201 1550667 1553234 1554776 1555701 1556234 1556458 1556653 1557215 1558295 1559810 1561788 1564495 1568095 1572271 1576358
59695 1576358 1579909 1582925 1585389 1586863 1587015 1586498 1586723 1588529 1591484 1594619 1597390 1599716 1601739 1603953 1606876
59680 1606876 1610053 1612063 1612213 1611619 1611711 1612364 1612721 1613300 1615650 1619900 1624291 1627578 1630454 1633915 1637527 1640238
59664 1640238 1642007 1643602 1645381 1647095 1648377 1648796 1648044 1646783 1646686 1648792 1652200 1655140 1656962 1658451 1660615
59649 1660615 1663881 1668023 1672170 1675233 1677103 1679025 1682087 1685760 1688771 1690911 1692902 1694712 1695233 1693791
59635 1693791 1691174 1689017 1688808 1691348 1696232 1701739 1706074 1709061 1711946 1715370 1718250 1719188 1718544 1718579 1721393
59620 1721393 1726739 1732023 1734790 1735245 1735806 1738158 1741667 1745140 1748813 1753368 1758015 1761269 1763233 1765285
59606 1765285 1767586 1768784 1768611 1768983 1771645 1776049 1780486 1784184 1787270 1789669 1791230 1792479 1794297 1797167
59592 1797167 1801270 1806698 1812851 1818242 1821752 1823663 1824796 1825264 1824926 1824517 1825145 1826909 1829076 1831613 1835514
59577 1835514 1841326 1848108 1854249 1858938 1862679 1866683 1871821 1877829 1883429 1887482 1890147 1892794 1896814 1902597
59563 1902597 1909430 1916181 1922182 1927636 1932987 1937890 1941278 1942691 1943022 1943568 1944785 1946499 1948886 1952466
59549 1952466 1957325 1963027 1969240 1975836 1982356 1987980 1992265 1995554 1998578 2001879 2005561 2009280 2012516 2015169
59535 2015169 2017901 2021698 2027209 2034598 2043534 2052822 2060593 2065809 2069558 2073950 2079491 2084315 2086463 2086389
59521 2086389 2086687 2089576 2095131 2101833 2108415 2114838 2121558 2128219 2133673 2137490 2140859 2145374 2151192 2157184
59507 2157184 2162750 2168571 2175281 2182245 2188259 2192873 2196346 2198697 2199675 2199762 2200517 2203438 2208556 2214347 2219120
59492 2219120 2222491 2225525 2229402 2234160 2238980 2243504 2248275 2253723 2259392 2264745 2270229 2276649 2283562 2289275
59478 2289275 2292846 2295350 2298426 2302121 2305113 2307056 2309633 2314682 2321925 2329258 2334968 2338961 2341908 2344156
59464 2344156 2345867 2347593 2350000 2353155 2356487 2359392 2361585 2363018 2363847 2364496 2365485 2367048 2369094 2371389 2373547
59449 2373547 2374927 2374993 2373955 2372611 2371269 2369159 2365485 2360980 2357740 2357146 2358381 2359503 2359702 2359782 2360517 2361481
59433 2361481 2361994 2362420 2363659 2365610 2367082 2367197 2366153 2364530 2362608 2360584 2358748 2357000 2354816 2352189 2350092
59418 2350092 2349407 2349677 2349486 2347934 2345383 2342906 2341344 2340757 2340440 2339564 2337953 2335945 2333379 2329240 2322900
59403 2322900 2315432 2309159 2305849 2305493 2306507 2306842 2305336 2302563 2300160 2298939 2297981 2295951 2292772 2289315 2285921
59388 2285921 2282166 2277870 2273395 2268891 2264068 2258870 2253661 2248636 2243612 2238483 2233280 2227847 2222137 2216723
59374 2216723 2212241 2208322 2203957 2198986 2194238 2190109 2186104 2182098 2178797 2176296 2173321 2168795 2163278 2157941
59360 2157941 2153029 2148421 2144877 2143239 2142685 2141141 2137400 2131852 2125359 2118676 2112941 2109173 2106712 2103357
59346 2103357 2097895 2091663 2086838 2083804 2081063 2077274 2072512 2067621 2063218 2059484 2056440 2054067 2052187 2050339
59332 2050339 2047928 2044774 2041473 2038740 2036245 2032697 2027501 2021808 2017259 2014103 2011309 2008262 2005322 2002704
59318 2002704 1999930 1996831 1994172 1992533 1991289 1989531 1987500 1986159 1985588 1984808 1983124 1980731 1977924 1974738
59304 1974738 1971656 1969659 1968978 1968548 1967338 1965548 1963814 1961975 1959543 1956890 1954790 1953084 1950972 1948643
59290 1948643 1947390 1947748 1948518 1948168 1946424 1943948 1941188 1938187 1935036 1931822 1928562 1925790 1924772 1926288 1929324
59275 1929324 1931735 1932281 1931459 1930357 1929431 1928644 1928164 1928277 1928844 1929413 1929897 1930634 1931517 1931509 1929653 1926518 1923944
59258 1923944 1923020 1922828 1921746 1919511 1917143 1915115 1912768 1909758 1906952 1905192 1903972 1902284 1900332 1899373 1899919
59243 1899919 1900877 1900698 1898901 1896379 1894564 1894380 1895600 1897078 1897708 1897124 1895456 1892839 1889595 1886508 1884218
59228 1884218 1882382 1880117 1877355 1875171 1874622 1875733 1877818 1880221 1882451 1884126 1885281 1886464 1888064 1889680
59214 1889680 1890570 1890607 1890341 1890089 1889466 1888074 1886332 1885135 1884717 1884292 1883096 1881488 1880563 1880812 1881661 1882372 1882740
59197 1882740 1882570 1881243 1878640 1876145 1875678 1877501 1879786 1880730 1880457 1880345 1881041 1881960 1882504 1882915 1883703 1884810
59181 1884810 1885729 1886167 1886198 1885902 1885217 1884261 1883554 1883721 1884917 1886632 1888111 1889063 1889946 1891465 1893630 1895339 1895186
59164 1895186 1892909 1889870 1887753 1886816 1885770 1883561 1880815 1879158 1879400 1880942 1882914 1885135 1887603 1889555
59150 1889555 1889900 1888625 1887146 1886866 1887768 1888904 1889951 1891534 1893880 1895949 1896431 1895220 1893278 1891338 1889522
59135 1889522 1888261 1888794 1892175 1897924 1903930 1907791 1908542 1907446 1906958 1908426 1910828 1912182 1911902 1911002 1910184
59120 1910184 1909048 1907534 1906798 1907744 1909592 1910979 1911786 1912751 1913836 1914336 1914318 1914616 1915342 1915753 1915808 1916631 1918901
59103 1918901 1921808 1924208 1925982 1927672 1929522 1931460 1933472 1935350 1936550 1936856 1936784 1936886 1937094 1937200 1937435 1937909
59087 1937909 1938007 1937085 1935592 1934818 1935637 1937893 1940778 1943296 1944622 1944748 1944747 1945783 1947767 1949413 1949685 1948854 1948174
59070 1948174 1948879 1951361 1954818 1957639 1958646 1958198 1957849 1958786 1960727 1962394 1962834 1962253 1961774 1962446 1964494 1967463
59054 1967463 1970888 1974461 1977667 1979927 1981475 1983458 1986590 1990060 1992428 1993345 1993725 1994382 1995194 1995578 1995223
59039 1995223 1994443 1994315 1996168 2000023 2003806 2005241 2004687 2004937 2007754 2011814 2014744 2016082 2017104 2018563 2020074
59024 2020074 2021474 2023349 2026047 2029239 2032769 2036942 2041439 2044699 2045186 2043075 2040297 2039090 2040598 2044285
59010 2044285 2048245 2050480 2050494 2049701 2050001 2052075 2055344 2059222 2063772 2069146 2075009 2080773 2086029 2090452 2093619
58995 2093619 2095295 2095946 2096636 2098309 2101133 2104500 2107605 2110086 2112129 2114016 2115735 2117231 2118830 2120891
58981 2120891 2122986 2124008 2123571 2122879 2123610 2126078 2129190 2132182 2135624 2140332 2145905 2150982 2154707 2157380 2159714
58966 2159714 2161960 2163943 2165645 2167458 2169776 2172413 2174614 2175920 2176940 2178722 2181195 2182876 2182761 2182050
58952 2182050 2183123 2186917 2192151 2197138 2201302 2204571 2206454 2206752 2206528 2207212 2208966 2210922 2212893 2215617 2219119
58937 2219119 2222132 2223891 2225525 2228585 2232822 2236595 2239240 2241733 2244873 2248055 2250534 2252903 2256367 2260988
58923 2260988 2265634 2269510 2272954 2276569 2280223 2283136 2284522 2284106 2282490 2281086 2281145 2282569 2284224 2285646 2287730
58908 2287730 2291238 2295218 2297867 2298642 2298572 2298538 2298406 2298304 2299579 2303380 2308700 2313023 2315024 2315799 2317154 2319525
58892 2319525 2322125 2324467 2326799 2329223 2331362 2333097 2334879 2336837 2338121 2337818 2336298 2335004 2334911 2335779 2336968
58877 2336968 2338363 2340183 2342444 2345084 2348266 2352009 2355760 2358958 2361952 2365654 2370167 2374462 2377757 2380483
58863 2380483 2383183 2385040 2384687 2382574 2381424 2383657 2388869 2394398 2397952 2399150 2398963 2398657 2399220 2400796 2402355
58848 2402355 2402614 2401704 2401303 2402685 2405209 2407344 2408685 2410236 2413024 2417262 2422641 2428564 2434043 2438168 2440983
58833 2440983 2443367 2445942 2448600 2451142 2453613 2455772 2457040 2457465 2458133 2460046 2463011 2466151 2469074 2471996
58819 2471996 2474984 2477797 2480317 2482683 2485137 2488153 2492428 2498092 2504046 2508756 2511859 2514471 2517794 2521843
58805 2521843 2525677 2528451 2530039 2531002 2532310 2534967 2539598 2546115 2553690 2561048 2567083 2571502 2574924 2578351
58791 2578351 2582599 2588111 2594792 2601805 2607918 2612534 2616244 2620136 2624820 2630318 2636497 2643146 2649955 2656898
58777 2656898 2664362 2672366 2680006 2686291 2691322 2696121 2701516 2707822 2715119 2722982 2730199 2735892 2740947 2747294
58763 2747294 2755620 2764790 2773662 2782347 2791246 2799994 2808005 2815275 2822005 2828172 2834096 2840705 2848488 2856809
58749 2856809 2864868 2872587 2879923 2886209 2891299 2896731 2904416 2914346 2924719 2934293 2943634 2953931 2965495
58736 2965495 2977652 2989407 3000005 3009360 3018017 3026412 3034356 3041717 3049195 3057618 3066762 3075856 3085155
58723 3085155 3095858 3108261 3120981 3132420 3142168 3150671 3158465 3166323 3175323 3185957 3197659 3209741
58711 3209741 3222286 3235425 3248346 3259929 3270163 3280039 3290077 3299836 3309094 3318684 3329482 3340969
58699 3340969 3351616 3360927 3370544 3382685 3397597 3413151 3427151 3439457 3451456 3464076 3477243 3490960
58687 3490960 3505768 3521789 3538145 3553720 3568075 3581376 3594101 3607035 3620800 3634962 3648284
58676 3648284 3660352 3672252 3685027 3698301 3711284 3724375 3738529 3753456 3767825 3781267 3794914
58665 3794914 3809720 3825359 3841159 3857024 3872764 3887564 3901069 3914441 3929422 3946629 3965488
58654 3965488 3985410 4006014 4026374 4045218 4062292 4078832 4096262 4114866 4134055 4153303 4172239
58643 4172239 4190391 4207701 4225227 4244490 4265835 4288039 4309817 4331174 4352711 4374138 4394371
58632 4394371 4413093 4431467 4450968 4472013 4494039 4516459 4539040 4561660 4584235 4606872 4629680
58621 4629680 4652507 4675221 4698163 4721908 4746583 4771839 4797487 4823647 4850140 4876271 4901478
58610 4901478 4925851 4949812 4973880 4999037 5026596 5056851 5088263 5118887 5148451 5178071 5208140
58599 5208140 5237828 5267021 5297306 5329941 5363830 5396842 5428585 5460459 5493238 5526230 5559081
58588 5559081 5592820 5628338 5665018 5701817 5738757 5776257 5813864 5850911 5887995 5926401 5966240
58577 5966240 6006480 6046935 6088826 6132898 6178036 6222405 6265147 6306433 6346647 6386380 6426682
58566 6426682 6468441 6511660 6555920 6601249 6647898 6695430 6742743 6789097 6834710 6880222 6925937
58555 6925937 6971792 7017932 7065070 7114087 7165082 7216935 7268179 7318253 7367579 7416550 7465158
58544 7465158 7513735 7563297 7614612 7667408 7720805 7774005 7826259 7876974 7926553 7976474 8027750
58533 8027750 8079812 8131691 8183688 8236856 8291289 8346164 8401293 8457346 8514470 8571840 8628875
58522 8628875 8685934 8743509 8801599 8860123 8918944 8977219 9033716 9088212 9141664 9194544 9246116
58511 9246116 9296106 9345983 9397521 9450729 9504278 9557524 9611108 9665938 9722613 9781647 9843215
58500 9843215 9906659 9970981 10035912 10101850 10168947 10237048 10306343 10377106 10448715 10519886 10590190
58489 10590190 10660450 10731323 10802379 10873086 10943872 11015361 11087093 11157912 11227525 11296958 11367498
58478 11367498 11439758 11513724 11589014 11664891 11740635 11816259 11892495 11969765 12047593 12125482 12203850
58467 12203850 12283253 12362776 12440301 12514924 12588488 12664069 12743373 12826146 12911574 12999200 13088603
58456 13088603 13179352 13271625 13366135 13463124 13562138 13662983 13765944 13870576 13975297 14079019
58446 14079019 14182392 14286392 14390389 14492904 14593944 14695176 14797726 14901145 15004947
58437 15004947 15109962 15217443 15327643 15439957 15553917 15669370 15786117 15903944 16022662
58428 16022662 16141483 16258665 16372478 16482512 16589533 16694196 16796600 16897109 16996825
58419 16996825 17096733 17196782 17296491 17396399 17498276 17603643 17712525 17824030 17937675 18053520
58409 18053520 18171273 18290331 18410975 18534618 18662148 18792552 18923892 19055284 19187151
58400 19187151 19319704 19451829 19581398 19706222 19824924 19937498 20044968 20148087 20246638
58391 20246638 20340339 20429735 20515370 20596854 20674170 20749632 20827037 20908737 20994926 21085811 21182805
58380 21182805 21287016 21398119 21515500 21639093 21768118 21900406 22034241 22169947 22308563
58371 22308563 22450062 22594060 22741122 22891688 23044542 23198031 23352171 23507857 23664554
58362 23664554 23820907 23977649 24138017 24305015 24479754 24662494 24853455 25052097 25257221
58353 25257221 25468163 25684224 25902395 26117511 26325666 26525908 26717703 26898646 27066382
58344 27066382 27221547 27367214 27506635 27643407 27782781 27930174 28087932 28255016 28429908
58335 28429908 28612357 28802116 28997543 29196144 29395656 29594242 29790509 29983685 30173216
58326 30173216 30358351 30539167 30718058 30899015 31085052 31277344 31477152 31687005 31908750
58317 31908750 32141171 32380613 32623537 32867763 33112032 33355903 33600385 33847719 34099961
58308 34099961 34357777 34620338 34885879 35152550 35419554 35687756 35958762 36233165 36509883
58299 36509883 36787177 37063840 37339271 37612898 37884124 38152733 38418931 38682783 38943785
58290 38943785 39201357 39455905 39709424 39965095 40226484 40497151 40780401 41078413 41391130
58281 41391130 41716337 42051065 42392574 42737880 43083308 43425803 43764872 44102617 44441757
58272 44441757 44784144 45131084 45484013 45844188 46212401 46589959 46979751 47385318 47808251
58263 47808251 48246457 48694769 49146730 49595799 50035704 50460874 50867519 51254765 51624948
58254 51624948 51982743 52333873 52684497 53041458 53412413 53804922 54224736 54674313 55152016
58245 55152016 55652015 56165005 56679780 57184842 57669133 58122277 58535664 58904789 59231487
58236 59231487 59524440 59797649 60067699 60350824 60660514 61006088 61392058 61817930 62278524
58227 62278524 62765131 63267342 63774624 64277163 64766111 65233571 65672497 66076970 66443055
58218 66443055 66769648 67058621 67314750 67546257 67764924 67983908 68213718 68459448 68720960
58209 68720960 68994169 69271400 69541731 69793137 70015719 70203865 70357082 70480476 70584547
58200 70584547 70682980 70788909 70911799 71055970 71220290 71398984 71583742 71766083 71938302
58191 71938302 72093222 72224244 72325936 72394455 72428390 72430737 72409976 72377431 72342513 72310708 72285624
58180 72285624 72270694 72267478 72273294 72281745 72284929 72274112 72239550 72172203 72066826 71923073 71743790
58169 71743790 71533172 71296438 71039796 70769515 70490921 70208265 69924838 69642556 69361307
58160 69361307 69078820 68791115 68493299 68180539 67849134 67497506 67126987 66741972 66348993
58151 66348993 65955123 65566895 65189890 64827863 64481065 64145396 63813644 63477593 63129276
58142 63129276 62761643 62369810 61952315 61511005 61049879 60574457 60091529 59607822 59127599
58133 59127599 58651113 58174974 57693426 57199487 56686112 56147931 55583050 54993721 54385205
58124 54385205 53763663 53134821 52504282 51877781 51259495 50649753 50045415 49442931 48840024
58115 48840024 48234173 47621332 46997738 46362072 45714450 45054248 44380951 43696857 43007074
58106 43007074 42316648 41629019 40946953 40272842 39607338 38949132 38296769 37649689 37007451
58097 37007451 36369605 35737020 35111907 34495602 33887372 33285986 32691194 32102838 31519822
58088 31519822 30941068 30366513 29796216 29229416 28665457 28104756 27547929 26995041 26446947
58079 26446947 25906392 25376230 24856917 24346982 23845643 23353917 22873543 22405943 21952006
58070 21952006 21511993 21085774 20673540 20275616 19890993 19517139 19152307 18797015 18451973
58061 18451973 18115715 17786161 17463793 17151178 16849401 16556874 16271698 15993392 15722016
58052 15722016 15457497 15200461 14952215 14713043 14481641 14256842 14038811 13827862 13623216
58043 13623216 13423743 13229158 13039706 12855225 12675126 12498929 12326525 12158221 11994573
58034 11994573 11835614 11680510 11528832 11381945 11241865 11108672 10980443 10856068 10736714
58025 10736714 10623845 10517099 10415013 10316859 10222832 10133160 10047856 9966677 9888719 9812813
58015 9812813 9738964 9668642 9602935 9541101 9481614 9423857 9368036 9314162 9261946 9211158 9161507
58004 9161507 9112817 9065797 9021586 8979751 8937926 8894705 8851942 8812701 8777488 8744089 8710806
57993 8710806 8678193 8647475 8618764 8591351 8564808 8539246 8515081 8492891 8473157 8456029 8441564
57982 8441564 8429910 8420806 8413321 8406873 8402382 8401707 8406023 8415271 8428945 8446653 8468013 8492639 8520239
57969 8520239 8550306 8582020 8615035 8649952 8687354 8726760 8767298 8808976 8852351 8897277 8943006
57958 8943006 8989267 9036221 9083623 9131219 9179798 9230516 9283148 9336350 9389852 9445007 9502747
57947 9502747 9562262 9622290 9682638 9743755 9805776 9868679 9932627 9997529 10063053 10129603 10198334
57936 10198334 10269505 10341698 10413624 10485945 10560199 10636383 10712777 10788054 10862674 10938194 11015926
57925 11015926 11096292 11178880 11262934 11348117 11434694 11522759 11611551 11700007 11787844 11875689 11964266
57914 11964266 12053864 12144589 12236660 12330288 12425364 12521263 12616961 12711558 12804852 12897314 12989610
57903 12989610 13082489 13177004 13274042 13373194 13472585 13570405 13666463 13762033 13858511 13956563 14056162
57892 14056162 14156837 14257938 14358988 14459792 14560224 14660351 14760957 14863409 14968468
57883 14968468 15075461 15183076 15290831 15399523 15510525 15624912 15742796 15863108 15984368
57874 15984368 16106193 16229758 16356301 16485469 16615720 16746197 16877624 17011348 17147886
57865 17147886 17286345 17424985 17562543 17699418 17837357 17977717 18120282 18264061 18408662
57856 18408662 18554312 18701139 18849310 18999422 19151562 19304067 19454550 19602566 19750311
57847 19750311 19900219 20052666 20206482 20360842 20515879 20671970 20829244 20987633 21146913
57838 21146913 21306904 21468085 21631721 21798989 21970220 22145330 22324392 22507046 22691779
57829 22691779 22876792 23061629 23247111 23433625 23620351 23806407 23991933 24177649 24364177
57820 24364177 24552343 24743319 24937466 25133557 25330182 25527739 25728084 25932306 26139891
57811 26139891 26350163 26563332 26779631 26998397 27218879 27441409 27667171 27897225 28132165
57802 28132165 28372095 28616356 28863917 29114689 29369816 29629976 29894197 30161354 30432017
57793 30432017 30707438 30987223 31269703 31554389 31842268 32133422 32426067 32718583 33011093
57784 33011093 33304362 33598527 33893772 34190892 34490099 34790290 35090651 35392082 35695829
57775 35695829 36001493 36307687 36614161 36922029 37232155 37544360 37857940 38172028 38485644
57766 38485644 38798224 39109895 39420640 39729830 40037373 40344620 40653007 40962379 41271757
57757 41271757 41581086 41890824 42200486 42509549 42819733 43134423 43455315 43781067 44109734
57748 44109734 44441234 44776959 45118392 45466864 45823525 46188543 46560941 46939822 47325264
57739 47325264 47717667 48116833 48521831 48931141 49343014 49756814 50174003 50596439 51023375
57730 51023375 51451632 51879341 52307972 52739844 53175217 53613135 54053754 54498104 54946299
57721 54946299 55397620 55851922 56309477 56769729 57231597 57694978 58160710 58629104 59099559
57712 59099559 59571501 60044559 60517746 60989701 61460090 61929901 62400063 62870567 63341222
57703 63341222 63812619 64285992 64762571 65243173 65727837 66215519 66704441 67192874 67679577
57694 67679577 68163882 68645921 69126365 69605137 70080467 70549938 71012422 71468283 71917922
57685 71917922 72361262 72798887 73232622 73664372 74095049 74525078 74955322 75386850 75820283
57676 75820283 76255977 76694584 77136956 77583638 78034802 78490573 78951157 79416710 79887179
57667 79887179 80361906 80839258 81317056 81793856 82269708 82745433 83221403 83697398 84173679
57658 84173679 84651871 85134641 85624586 86123461 86632363 87152322 87684315 88228661 88784884
57649 88784884 89352566 89932012 90523676 91127319 91742651 92370821 93014384 93675347 94353776
57640 94353776 95048681 95759542 96486052 97226560 97977576 98735234 99497024 100262011 101029618
57631 101029618 101798395 102565792 103328834 104084867 104831731 105567375 106289323 106994385 107678922
57622 107678922 108339806 108975550 109586558 110174199 110739902 111285502 111814240 112330761 112839817
57613 112839817 113345059 113848926 114353073 114858615 115366257 115876558 116390015 116906849 117427030
57604 117427030 117950905 118479862 119016263 119562663 120120963 120692102 121276494 121874793 122488091
57595 122488091 123117314 123762787 124424851 125104620 125803332 126520876 127255859 128007654 128777706
57586 128777706 129568048 130378909 131208773 132056845 132924538 133813969 134725439 135656916 136605575
57577 136605575 137568963 138544339 139527533 140513249 141496695 142474726 143445543 144407782 145360169
57568 145360169 146301694 147231725 148150176 149057960 149957252 150850909 151741555 152631355 153522532
57559 153522532 154417599 155318849 156227588 157143705 158065662 158991020 159917471 160843636 161768896
57550 161768896 162692716 163614571 164534558 165453609 166372856 167292963 168214076 169136150 170059326
57541 170059326 170984412 171913036 172846888 173786431 174730430 175676731 176623112 177567188 178505733
57532 178505733 179434151 180346419 181235664 182095424 182920704 183707475 184451045 185145400 185784632
57523 185784632 186364966 186885587 187348398 187757811 188120681 188445830 188743364 189024322 189300262
57514 189300262 189582255 189879770 190200378 190550279 190934746 191358016 191822887 192330492 192880720
57505 192880720 193473325 194108841 194788217 195511526 196277358 197083554 197928170 198809609 199726277
57496 199726277 200676080 201655423 202658118 203675911 204700651 205725467 206743438 207746383
57488 207746383 208726790 209681131 210610219 211516254 212401010 213267807 214124341 214982319 215854387
57479 215854387 216751973 217685774 218666933 219706508 220813334 221992187 223243383 224563221
57471 224563221 225944265 227375591 228843786 230334322 231832012 233320377 234781432 236196716
57463 236196716 237548275 238818416 239989393 241044607 241970712 242758675 243403686 243905251
57455 243905251 244267691 244500103 244615884 244632746 244572671 244460438 244321395 244180788 244064836
57446 244064836 244001023 244016388 244135563 244380051 244767754 245311818 246019903 246894688 247934333
57437 247934333 249131746 250473967 251943107 253517973 255175052 256889497 258637014 260395321
57429 260395321 262143606 263861506 265529998 267133642 268661282 270104487 271455724 272707760
57421 272707760 273854038 274889651 275812483 276622849 277320667 277902645 278363050 278697215 278903367
57412 278903367 278981475 278932773 278762122 278480138 278101890 277644027 277123927 276560497 275973812
57403 275973812 275383547 274808384 274266452 273774681 273346909 272992805 272718269 272525902 272415118
57394 272415118 272383062 272426235 272541257 272724566 272972494 273281709 273648339 274066213 274527061
57385 274527061 275023091 275548625 276098795 276667716 277248796 277835807 278422593 279002404 279568674
57376 279568674 280115853 280638324 281129263 281582288 281994244 282365090 282695421 282986310 283242221
57367 283242221 283472119 283685869 283889583 284084551 284269101 284440111 284593682 284726424 284837029
57358 284837029 284926617 284998270 285057081 285109949 285163613 285222185 285286927 285358214 285436643 285522011 285612281
57347 285612281 285704389 285795457 285882204 285959250 286019033 286054289 286060824 286037999 285986971 285908990 285805237
57336 285805237 285677387 285527682 285358918 285175436 284984173 284793775 284611728 284441816 284283376
57327 284283376 284131719 283979077 283816534 283636201 283431563 283196110 282923370 282609426 282254239
57318 282254239 281859009 281422826 280943352 280420285 279856721 279257790 278630408 277984759 277333767
57309 277333767 276689721 276062432 275461044 274895276 274372453 273893671 273453970 273045339 272657913
57300 272657913 272278985 271893362 271485571 271040752 270543571 269978299 269331267 268592396 267753623
57291 267753623 266807164 265747426 264575078 263298559 261931493 260489434 258989160 257449705
57283 257449705 255892399 254339240 252811247 251327761 249905812 248558599 247293834 246113245
57275 246113245 245013368 243986840 243024281 242117183 241260788 240455055 239703391 239010800 238382488
57266 238382488 237822343 237331119 236905599 236539120 236221867 235940264 235677711 235418368 235151332
57257 235151332 234871284 234576070 234265425 233942436 233614643 233292228 232984925 232700462 232444414
57248 232444414 232219727 232026031 231860064 231716842 231589549 231467316 231332288 231158254 230912837
57239 230912837 230564585 230093556 229500050 228805560 228045165 227256782 226473248 225718640 225007085
57230 225007085 224343382 223726102 223151722 222616401 222114113 221634208 221162035 220682326 220182186
57221 220182186 219652320 219087982 218490551 217867865 217231536 216592538 215958355 215333093 214718928
57212 214718928 214116753 213525839 212943880 212368258 211797569 211231662 210669697 210107541 209536382
57203 209536382 208943152 208312340 207628856 206881356 206064285 205176910 204220502 203196846 202109185
57194 202109185 200962891 199763690 198515363 197219970 195879762 194497114 193071620 191597552
57186 191597552 190064141 188457543 186762693 184965466 183056146 181032975 178903525 176683192
57178 176683192 174391950 172050761 169679107 167294891 164916424 162563969 160258678 158019649
57170 158019649 155861358 153791898 151810610 149905221 148051083 146215073 144363551 142471076
57162 142471076 140526083 138531306 136499504 134447551 132392235 130348700 128330061 126346827
57154 126346827 124406423 122513653 120671647 118882083 117144339 115454531 113805539 112188377
57146 112188377 110594342 109016910 107452242 105897992 104351547 102809559 101269447 99731163
57138 99731163 98196597 96666328 95136738 93600779 92052058 90488461 88912570 87330042
57130 87330042 85748548 84177412 82626019 81100796 79603103 78129732 76674837 75231380
57122 75231380 73792204 72351773 70908073 69462646 68018287 66576148 65134341 63688370
57114 63688370 62232538 60761710 59273244 57768532 56253133 54734973 53221532 51717761
57106 51717761 50225721 48745412 47275676 45814932 44361966 42916250 41477103 40042526
57098 40042526 38609593 37176213 35741574 34303951 32858772 31400297 29925684 28437018
57090 28437018 26939862 25441446 23951043 22481083 21046555 19663091 18345587 17107443
57082 17107443 15959260 14907147 13951768 13088228 12305965 11588642 10914954 10260761 9602390
57073 9602390 8920879 8206122 7458818 6689388 5915809 5162292 4457340 3828769 3297147
57064 3297147 2872145 2553394 2332811 2195887 2123110 2093259 2087192 2090001 2091971 2089882 2088207
57053 2088207 2098662 2138180 2226534 2383515 2625012 2958898 3382639 3883180 4438566 5021307
57043 5021307 5603370 6160768 6675705 7137342 7544003 7906642 8250233 8611294 9033446
57034 9033446 9563000 10244130 11113372 12195598 13503214 15037127 16787174 18732776 20845892
57025 20845892 23095429 25449973 27877999 30347860 32828839 35291888 37709062 40053383
57017 40053383 42300903 44433759 46441658 48320984 50072481 51698252 53198874 54572498
57009 54572498 55817115 56934035 57929465 58814261 59604775 60325040 61006371 61681739 62378474
57000 62378474 63114896 63901542 64742750 65636140 66572031 67535289 68508756 69476133 70423895
56991 70423895 71342972 72229673 73084945 73912262 74715364 75496257 76253492 76981485 77671620
56982 77671620 78314421 78901335 79425961 79885366 80281220 80619435 80907924 81153789 81361495
56973 81361495 81532520 81666374 81762559 81822587 81850962 81854756 81842495 81823034 81804590 81793980 81796166
56962 81796166 81814040 81847987 81895023 81948032 81996145 82026970 82029992 81999198 81933164 81833081 81700863
56951 81700863 81538511 81347919 81130288 80885902 80614855 80317685 79994893 79646388 79272255
56942 79272255 78873936 78453836 78013685 77553847 77074052 76573924 76052806 75510255 74947433
56933 74947433 74367421 73773622 73168311 72553112 71930218 71302396 70672108 70041169 69410816
56924 69410816 68781210 68151029 67518565 66883623 66247807 65612570 64977397 64340464 63700985
56915 63700985 63060455 62421434 61785449 61152452 60522102 59894687 59270122 58646214 58018543
56906 58018543 57382169 56733215 56068902 55386436 54681595 53947604 53175116 52354312 51478676
56897 51478676 50548708 49573608 48569017 47549554 46518882 45464804 44363996 43190601
56889 43190601 41919754 40529104 39010622 37391107 35736516 34120539 32576111 31074698
56881 31074698 29554487 27969810 26317412 24625868 22930781 21260979 19638521 18081191
56873 18081191 16601524 15205689 13895599 12672496 11538752 10497085 9548761 8692395
56865 8692395 7923929 7237328 6625382 6080387 5594858 5162003 4775725 4430511 4121644
56856 4121644 3845319 3597973 3375402 3173070 2987546 2817297 2661873 2520547 2391902
56847 2391902 2274200 2165706 2065022 1971598 1885697 1807296 1735138 1667421 1603339 1543309 1487694
56836 1487694 1436047 1387837 1343056 1301471 1261921 1223193 1185352 1149468 1116109 1084811 1054956
56825 1054956 1026351 998704 971289 943624 916109 889614 864715 841566 820125 800103 780884
56814 780884 761768 742236 722054 701505 681565 663292 646796 631309 616420 602413 589061
56803 589061 575047 559567 543773 529478 516799 504347 491695 480234 471158 463636 455723 446382
56791 446382 435990 425381 415090 405301 395908 386570 377001 367322 358154 350304 344040 338349 331337
56778 331337 322119 312220 304312 299423 296056 292072 286558 279663 271758 263464 255740 249081 243033 237046
56764 237046 231293 226159 221595 217592 214548 212221 208963 203170 195210 186866 179025 171067 162480 153890
56750 153890 146202 139578 133650 128054 122501 116934 111775 107353 103011 97565 90842 83902 77460 71015
56736 71015 64137 57755 53339 51225 50390 49555 47896 45000 40808 35616 29782 23593 17541 12265 7822
56721 7822 3484 -1318 -6312 -11144 -16281 -22344 -28884 -34710 -39383 -43648 -48418 -54028 -60415 -67172 -73271
56706 -73271 -77579 -79983 -81507 -83080 -84787 -86485 -88361 -90363 -91812 -92172 -91764 -91176 -90494 -89842 -90063 -91839
56690 -91839 -94390 -96260 -97439 -99380 -102417 -104428 -103181 -99317 -95676 -93856 -92665 -90242 -86548 -83107
56676 -83107 -81011 -79976 -78991 -77116 -73909 -69887 -66664 -65862 -67471 -69639 -70390 -69331 -67532 -66172 -65726
56661 -65726 -66207 -67590 -69774 -72447 -75160 -77495 -79016 -79149 -77348 -73610 -68843 -64440 -61245 -59042 -57346
56646 -57346 -56510 -57466 -60190 -62967 -63737 -62051 -59348 -57426 -56993 -57562 -58209 -58264 -57590 -56509 -55370 -54148 -52568
56629 -52568 -50578 -48465 -46471 -44565 -42698 -41040 -39761 -38832 -38263 -38300 -39061 -40110 -40732 -40587 -39728 -37936
56613 -37936 -34560 -29373 -23344 -18105 -14696 -13097 -12838 -13484 -14397 -14505 -12847 -9261 -4321 1226 6661
56598 6661 11135 13982 15295 15855 16356 16973 17856 19583 22735 27184 32112 36708 40684 44318 48255 53184
56582 53184 59307 65967 71926 76189 78703 80470 82931 86959 92219 97602 102380 106694 110909 114991
56568 114991 118918 123261 128572 134177 138282 139683 139141 138828 140509 144358 149288 154141 158578 162948 167507
56553 167507 171925 175524 177845 178934 179426 180444 182955 186808 190777 194029 197235 201642 207348 213371
56539 213371 219338 226090 234412 243984 253923 263524 272034 278497 282640 285351 287720 290100 292780 296756
56525 296756 302717 309693 315941 321194 326784 333353 339642 344145 347058 349867 353711 358957 365755 373944
56511 373944 382573 390513 397714 405125 413127 420818 427299 433029 439139 445677 451508 456074 460425 465940
56497 465940 472655 479673 486863 495005 504051 512270 517916 521266 524277 528536 534208 540703 547527 554425
56483 554425 561451 569068 577529 585971 592837 597650 601773 606937 613475 620643 628202 636731 646320 655842
56469 655842 664030 670872 677426 684559 692426 701119 711047 722133 732998 741737 747719 752160 756726 762063
56455 762063 767999 774619 782306 790881 799517 807656 815453 823165 830667 837763 844487 850855 856866 863080
56441 863080 870666 880432 892122 904881 917913 930259 940624 948344 954370 960552 967977 976482 985620
56428 985620 995392 1005974 1017399 1029684 1042794 1056295 1069435 1081679 1092859 1102938 1112222 1121856
56416 1121856 1133313 1146958 1161493 1175236 1187649 1199387 1211296 1223853 1237242 1251358 1265658
56405 1265658 1279430 1292383 1304922 1317848 1331797 1346758 1362007 1376713 1390886 1405632 1422247
56394 1422247 1440997 1460786 1479888 1497034 1512076 1525814 1539104 1552063 1564340 1576158 1588650
56383 1588650 1602913 1618984 1636098 1653587 1671139 1688390 1704954 1720998 1737416 1755122 1774284
56372 1774284 1794246 1813871 1831933 1847707 1861812 1876457 1894186 1915755 1939270 1961811 1982039
56361 1982039 2000945 2020024 2039452 2058590 2077657 2097869 2119930 2143360 2167536 2192430 2217873
56350 2217873 2243047 2267506 2291944 2317013 2341939 2365508 2388168 2411927 2437982 2465490 2492924
56339 2492924 2519751 2546385 2573305 2600822 2629151 2658181 2687488 2716821 2746195 2775338 2803715
56328 2803715 2831462 2859750 2889739 2921540 2954416 2987404 3019425 3049736 3079087 3109808 3143725
56317 3143725 3180221 3217110 3253078 3288353 3323235 3357097 3389201 3419885 3450648 3483285 3518652
56306 3518652 3555739 3592260 3626879 3660581 3695022 3730005 3763987 3797002 3831271 3868144 3905917
56295 3905917 3941972 3976195 4010956 4048171 4087590 4127788 4167715 4207191 4246839 4287726 4330438
56284 4330438 4374276 4417828 4460415 4502561 4545072 4588082 4631049 4673246 4714309 4754553 4794549
56273 4794549 4833991 4871452 4906116 4939606 4975049 5014143 5055970 5098844 5142214 5186119 5229734
56262 5229734 5271752 5312114 5352461 5394631 5439131 5485251 5532311 5580470 5630261 5681469 5732774
56251 5732774 5782847 5831705 5880632 5930794 5982422 6035367 6089704 6145227 6200871 6255337 6308224
56240 6308224 6360131 6411761 6463332 6514769 6566034 6617180 6668287 6719328 6770035 6820113 6869778
56229 6869778 6919790 6970634 7021958 7073237 7124733 7177246 7230975 7285129 7338817 7392167 7446584
56218 7446584 7504033 7565638 7630557 7696462 7761644 7826524 7892652 7960603 8029641 8099334 8170430
56207 8170430 8243834 8319424 8396240 8473311 8550050 8626426 8703053 8780529 8858430 8935588 9011707
56196 9011707 9088003 9165807 9245277 9326091 9408544 9492971 9578646 9664327 9749497 9833956 9916580
56185 9916580 9995948 10072279 10147328 10221991 10295438 10367238 10438856 10511777 10585263 10657640 10729333
56174 10729333 10802916 10880034 10959873 11041085 11123879 11209354 11297869 11389102 11482934 11579020 11675967
56163 11675967 11772344 11868528 11966290 12066144 12166122 12263525 12356826 12445223 12527650 12603614 12674459
56152 12674459 12742231 12807327 12868660 12926365 12982990 13041258 13101902 13164727 13230910 13302722 13381069
56141 13381069 13464504 13550951 13639552 13730395 13823174 13916855 14010682 14105152 14201758 14301632 14404550
56130 14404550 14509644 14617077 14728322 14844205 14963354 15083422 15203453 15323915 15444644
56121 15444644 15564330 15682711 15802085 15925679 16055126 16190382 16331433 16478783 16632232
56112 16632232 16790136 16950256 17110827 17270518 17427545 17579074 17721760 17853468 17974985
56103 17974985 18089722 18201295 18311523 18421063 18531375 18645140 18764812 18891479 19025159
56094 19025159 19165446 19311742 19463468 19620209 19781214 19944861 20109335 20273734 20437594
56085 20437594 20599398 20756967 20910017 21061091 21212945 21365893 21518929 21672752 21830026
56076 21830026 21992671 22160389 22332382 22509576 22694551 22889931 23097227 23316434 23545810
56067 23545810 23782083 24021325 24259807 24494225 24721678 24939851 25147350 25344215 25532656
56058 25532656 25717100 25902472 26091916 26286686 26488446 26700472 26925489 27162686 27407757
56049 27407757 27655584 27901960 28143262 28376449 28600682 28818436 29034175 29252006 29474837
56040 29474837 29704984 29944526 30195075 30457984 30734853 31027074 31334404 31654483 31984049
56031 31984049 32320084 32659189 32996486 33326656 33646882 33958535 34265716 34572585 34882381
56022 34882381 35197936 35521398 35852710 36189078 36526670 36862843 37196516 37526980 37853134
56013 37853134 38174051 38490022 38803266 39118233 39441329 39779489 40137900 40518346 40919324
56004 40919324 41337362 41767909 42204951 42640344 43064582 43469306 43849877 44205999 44540670
55995 44540670 44859447 45170716 45485092 45812630 46159757 46528824 46919993 47332447 47763672
55986 47763672 48208982 48662936 49121051 49579391 50032674 50473604 50894357 51288502 51651748
55977 51651748 51981922 52279180 52546501 52789877 53017904 53240637 53467379 53703785 53949877
55968 53949877 54200677 54448859 54686996 54907973 55105107 55273898 55414511 55532058 55633980
55959 55633980 55727298 55818053 55911697 56012290 56121263 56237910 56361076 56489529 56620839 56751330
55949 56751330 56877768 56998266 57111171 57214339 57306604 57389265 57464962 57535369 57600839 57661798
55939 57661798 57719269 57774039 57826184 57875186 57919241 57954322 57975221 57978266 57962397 57927202 57870698
55928 57870698 57789631 57681529 57546042 57384836 57200849 56997681 56779770 56553477 56327687
55919 56327687 56112039 55913719 55735916 55578925 55441296 55319449 55207330 55097581 54982674
55910 54982674 54854828 54706515 54532591 54331154 54101188 53840399 53547177 53224047 52877005
55901 52877005 52511416 52130585 51738593 51342282 50949224 50565008 50193194 49835883 49492272
55892 49492272 49157166 48822291 48478851 48118445 47733216 47317582 46870386 46394419 45893920
55883 45893920 45373147 44836497 44288174 43731249 43167957 42601024 42033723 41468474 40906375
55874 40906375 40348073 39793709 39241379 38686716 38125080 37553975 36973210 36383751 35787386
55865 35787386 35187031 34586187 33987660 33392790 32801669 32213786 31628817 31047215 30470031
55856 30470031 29898025 29331178 28769176 28211930 27659309 27110724 26565413 26023019 25483685
55847 25483685 24947818 24415908 23888144 23363833 22841496 22320012 21799668 21282027 20769119
55838 20769119 20262882 19764816 19275550 18794935 18323008 17860811 17410112 16972512 16548951
55829 16548951 16139522 15743286 15358636 14984271 14619572 14263843 13915852 13574754 13240828
55820 13240828 12914438 12594711 12280272 11971048 11668234 11372580 11083858 10802186 10528719
55811 10528719 10264361 10008491 9759418 9515557 9275985 9040681 8810712 8587455 8371078
55802 8371078 8160253 7953656 7750988 7551989 7355433 7160081 6966250 6775498 6589060
55793 6589060 6407427 6231088 6060614 5895970 5736610 5582386 5433637 5290279 5151553
55784 5151553 5016865 4886225 4759668 4636907 4517832 4402688 4291352 4183029 4077105
55775 4077105 3973781 3873415 3775834 3681037 3589997 3503591 3420574 3337639 3252128 3164261 3076333
55764 3076333 2990139 2905793 2822779 2741260 2661941 2585015 2509644 2434453 2358427 2281533 2204785
55753 2204785 2129709 2057388 1987768 1919819 1852349 1784802 1717514 1651394 1587197 1524879 1463787
55742 1463787 1403717 1345506 1290198 1237753 1187181 1137987 1090886 1046939 1006599 969929 937102
55731 937102 908141 882612 860142 840834 824528 810042 795877 781439 766860 751998 736649
55720 736649 721667 708592 697912 688694 680192 672677 666054 658950 650308 641042 632853 625895 618830
55707 618830 610891 602564 594385 586476 579421 574153 570422 566495 561161 555077 549444 544221 538597 532491
55693 532491 526519 520952 515700 510993 506984 502903 497785 492066 487406 484650 482819 480393 476849 472672
55679 472672 468637 465393 463032 460736 457475 453326 449369 446072 442692 438733 434950 432208 430233 428384
55665 428384 426899 426351 426467 426486 426089 424929 421924 416542 410539 406836 406423 407527 407941 406876 404441 400863
55649 400863 396858 393585 391426 389636 387650 385724 383780 380889 376795 372937 370904 370572 370704 370568 369983
55634 369983 368512 365850 362550 359319 355993 352293 349102 347747 348253 349421 350350 350703 349754 346813 342808
55619 342808 340076 339991 341664 343262 343719 342970 341512 340165 339334 338238 335747 332286 329743 329010 328716 327081
55603 327081 323991 320393 316669 312842 309645 307955 307344 306448 304863 303615 303521 303951 303652 302260 300510 299201
55587 299201 298343 297315 295691 293760 292058 290558 288750 286668 285326 285606 287030 288122 287906 286616 284993
55572 284993 283332 281392 278890 276014 273571 272697 274131 277546 281488 284020 283736 280544 275687 270805 266853
55557 266853 263879 261646 260091 259197 258821 258769 258714 257967 255844 252520 249144 246840 245846 245815 246478 247624 248758
55540 248758 249315 249203 248912 249120 250206 251866 253088 252837 250927 247967 244540 241028 238321 237699 239367 241713
55524 241713 242843 242467 241604 240891 240156 239509 239743 241246 243146 244060 243516 242402 242041 242841 243790 243473 241669
55507 241669 239665 238805 239106 239553 239325 238309 236848 235617 235424 236440 237799 238487 238471 238346 238125 237159 235151
55490 235151 232565 230017 227889 226463 225663 224653 222577 219866 218066 218100 219380 220854 222155 223310 224087
55475 224087 224322 224381 224670 225004 225096 225387 226599 228425 229376 228362 226050 224218 223726 223581 222280 219738 217344
55458 217344 216131 215578 214572 212991 211792 211872 213392 215924 218639 220578 221414 221792 222383 222867 222594 221980
55442 221980 222234 223650 225159 225802 225735 225408 224576 222701 219810 216490 213458 211375 210639 211029 211929 212922 213704
55425 213704 213510 211578 208458 205956 205274 205877 206606 207129 207814 208853 210159 211447 211937 210745 208250 206341
55409 206341 206497 208194 209954 211281 212624 214046 215037 215321 214858 213373 210916 208581 207556 207619 207675 207690 208799
55392 208799 211330 213997 215489 215888 216016 216307 216893 218002 219456 220287 219630 217776 215810 214487 213961 214359
55376 214359 215837 217954 219616 220174 220390 221687 224231 226203 225591 222615 219663 218724 219625 221059 222344
55361 222344 223361 223582 222503 220814 220023 220756 222213 223225 222999 220951 217063 212635 209601 208557 208258
55346 208258 207477 206493 206216 206636 206835 206052 204211 201938 200495 201043 203371 205854 207234 207895 208896 210424
55330 210424 211929 213247 214697 216434 218360 220328 221749 221634 219907 218159 217918 218517 217927 215628 213300
55315 213300 212526 213125 214121 215037 215566 215234 214404 214664 216988 220042 221530 220920 219720 219216 219239 219286 219466 219675
55297 219675 218929 216668 214149 213292 214179 214874 214079 212947 213505 215938 218470 219722 220111 220803 222322 224729
55281 224729 228311 233030 237635 240215 239808 237076 233593 230985 230332 231357 232166 230821 227540 224493 223103
55266 223103 222526 221408 220040 219725 220751 222284 223805 225288 226074 225113 222607 220136 218633 217502 216348
55251 216348 216243 218106 220812 222456 223015 224227 226814 229278 229833 228462 226545 225305 225176 225967 226961 227344
55235 227344 227089 227081 227931 229134 229862 230046 230054 229817 229191 228847 229692 231304 232018 231036 229670 229766 231371 232719 232371
55216 232371 230609 228597 226809 224857 222702 221283 221532 222956 223856 223249 222163 222586 225281 229194 232902
55201 232902 235880 238075 239039 238340 236646 235543 236022 237582 239063 239911 240343 240572 240447 239889 239368 239774 241773
55184 241773 245083 248294 249736 249006 247501 246872 246949 245893 242720 239026 237501 239132 242569 245972 248518
55169 248518 250098 250637 250380 250109 250301 250323 249104 246477 243366 240852 239584 239906 241786 244421 246479 247125
55153 247125 246624 245798 245171 244762 244399 243961 243462 243112 243155 243510 243745 243653 243733 244791 246933 249160 250209 249780
55135 249780 248754 248171 248238 248501 248690 248887 249034 248976 249214 250803 253859 256747 257644 256787 256258 257479 259716
55118 259716 261337 261749 261488 260985 260008 258217 255710 252969 250649 249393 249456 250359 251139 251199 250910 251231 252620
55101 252620 254312 254872 253670 251716 250793 251817 254188 256605 258083 258286 257509 256625 256561 257455 258595 259388
55085 259388 259984 260647 261086 260925 260461 260218 260021 259246 257911 256695 255887 255150 254593 255130 257180 259684 261271
55068 261271 262015 263124 265011 266596 266796 265980 265453 265881 266736 267119 266712 265951 265579 266099 267560 269755 272513
55051 272513 275580 278263 279695 279695 278969 278112 276857 274930 273263 273361 275286 277217 277491 276485 275838 276292 276978
55034 276978 276630 274858 272338 270336 270102 272087 275476 278683 280499 280767 280150 279539 279524 280079 280758 281367 282246
55017 282246 283642 285155 286304 287327 288726 290223 291013 291047 291064 291164 290364 288174 285747 284621 284821 285027
55001 285027 284427 283609 283787 285812 289757 294681 298661 299876 298118 294943 292007 289606 287137 284605 283046
54986 283046 283246 284546 285470 285542 285958 288056 291364 293818 293951 292437 291222 291530 292955 294239 294657 294796
54970 294796 296068 299170 302902 304989 304332 302089 300335 300156 301336 303102 304400 304061 301862 299337 298521
54955 298521 299712 301280 301763 301303 300843 300963 301993 304284 307375 309532 309267 307250 305841 306581 308766 310633
54939 310633 311312 311296 311480 312212 313141 313717 313863 314192 315410 317406 319230 320113 320302 320557 321125 321556 321507 321170
54921 321170 320819 320362 319685 319199 319658 321414 324050 326714 328733 330027 331100 332503 334153 335394 335951 336465
54905 336465 337539 338459 337658 334667 330923 328203 326736 325428 323593 321780 320906 321169 321979 322547 322335 321233
54889 321233 319675 318498 318364 319156 320018 320191 319804 319781 320959 323548 327400 332271 337384 341187 342409 341382
54873 341382 339631 338098 336547 334857 333791 333784 333865 332817 330918 329446 328806 328368 328131 329175 332005 335518
54857 335518 338301 340178 341631 342256 340874 337159 332435 328628 326811 326840 327969 329584 331468 333449 334800
54842 334800 334359 331762 328556 327485 330101 335152 339613 341312 340405 338507 336947 336048 335622 335561 335900 336621
54826 336621 337524 338248 338543 338675 339342 340877 342706 343969 344539 344928 345266 345095 344238 343158 342091 340531 338167
54809 338167 335841 334856 335461 336541 336758 335609 333512 331320 329749 328999 328841 329085 329775 330884 332240 333918
54793 333918 336201 338960 341549 343636 345579 347563 349095 349890 350627 351980 353376 353540 351948 349074 345712
54778 345712 342929 342028 343369 345525 346763 347034 347320 347479 346432 344405 343148 343526 344588 345571 347052 349103
54762 349103 349975 348129 344643 342127 341782 342661 343280 342839 341223 338931 336952 335964 335762 335868 336196 336661 336861
54745 336861 336866 337586 339428 341329 342147 342394 343353 345021 346292 346797 347093 347186 346372 344768 343618 343714 344660 345961
54727 345961 347588 349068 349294 347995 346385 345687 345932 346944 349330 353244 356959 358129 356421 353762 352014
54712 352014 351468 351719 352721 354312 355480 355121 353353 351404 350220 349748 349645 349960 350677 351157 350750 349807 349391
54695 349391 349882 350613 351103 351913 353714 356009 357459 357271 355790 354037 353188 354097 356473 358581 358647 356738
54679 356738 354669 353887 354027 353696 352025 349131 345588 342031 339112 337484 337622 339522 342393 344930 346372
54664 346372 347302 348944 351603 354193 355242 354011 350762 346567 342902 340777 340018 339737 339439 339160 338702 337758
54648 337758 336923 337524 339939 342856 344724 345203 344661 343202 341082 339336 338873 339289 339602 339894 341177 343709
54632 343709 346429 348161 348502 347529 345728 344515 345688 349403 353280 354442 352404 349398 347786 347686 347347
54617 347347 345533 343069 341834 342455 343503 343220 341488 339558 338165 336877 335361 334318 334521 335591 336491
54602 336491 336852 337068 337230 336845 335743 334484 333567 332827 332085 331878 332871 334772 336469 337306 337671 338168 338712
54585 338712 338792 338362 338088 338725 340409 342507 344018 344241 343166 341296 339241 337710 337623 339479 342342 344195
54569 344195 343940 342706 342524 343919 345515 345934 345279 344598 344526 344728 344264 342312 339020 335764 334065 334155 335088
54552 335088 336248 337885 339887 341139 340954 340425 341336 343996 347005 348869 349051 347771 345851 344781 345842
54537 345842 348802 352116 354561 356025 356637 356147 354629 352854 351289 349434 346944 344771 344209 345080 345896
54522 345896 345793 345401 345661 346748 348566 351403 355141 358315 359084 357424 355646 356201 359318 363157 365883
54507 365883 366935 366570 365263 364011 364240 366361 368700 368945 366786 364277 363318 363638 363766 363155 362392 361765
54491 361765 360742 359049 357534 357475 359247 361862 363824 364468 364503 364989 365812 365748 364317 362695 361993 361441 359638
54474 359638 357226 356529 358345 360782 362123 363189 365505 368350 369470 368232 366338 365384 365172 364682 363464
54459 363464 361729 360076 359475 360560 362630 364257 365157 366423 368600 370688 371599 371396 370306 367836 364102
54444 364102 361062 360870 363385 366643 369405 371815 373796 374485 373626 372186 370947 369443 366886 363451 360146
54429 360146 358048 358010 360330 364161 367800 370114 371296 371918 371917 371110 370079 369814 370692 372454 374964 378294
54413 378294 382012 384970 386136 385585 384626 384847 386768 389363 391087 391435 391202 391256 391616 391901 392042 392155 392095
54396 392095 391734 391357 391277 391174 390289 388379 386255 385267 386145 388142 389466 388894 386961 385170 384286 384138 384794
54379 384794 386658 389059 390139 389124 387658 387762 389228 390287 390289 390294 391254 393033 395298 398035 400810 402511
54363 402511 402320 400384 397474 394741 393673 395146 398213 400808 401932 402220 402207 401422 399815 398747 399411 401074
54347 401074 401998 401587 400696 400299 400850 402556 405123 407332 407878 406865 405778 405828 406816 407646 407411 406003 404159
54330 404159 402956 402806 402950 402418 401349 400770 401086 401555 401474 401257 401816 403219 404492 404807 404537 404930 406671
54313 406671 408939 410132 409571 408245 407841 409390 412777 416813 419556 419423 416800 413894 412312 411478 410375
54298 410375 409904 411714 415059 417002 416288 415078 415732 417489 417952 416762 415904 416683 418173 418895 418650 418131
54282 418131 417722 417359 417133 417488 418859 421202 423735 425263 425135 423837 422400 421405 420861 420713 420852 420895 420639
54265 420639 420655 421672 423387 424708 425234 425692 426561 427057 426085 423768 421561 421018 422576 425141 426790 426428
54249 426428 425002 424523 425700 427216 427678 427428 427734 428833 429734 429653 428819 427958 427707 428529 430515 433135 435658
54232 435658 437898 440231 442851 445303 446756 446574 444854 442600 441002 440178 439013 436751 434282 433213 434032
54217 434032 435975 438365 441049 443596 445116 445137 443917 441782 439033 436554 435468 435793 436328 436347 436474 437416
54201 437416 438800 440023 441380 443309 445159 445768 444969 443565 442146 440924 440463 441372 443123 444203 443825
54186 443825 442805 442361 442711 443146 443015 442231 441198 440659 441359 443474 446334 448851 450292 450852 451595 453584
54170 453584 456703 459563 461009 461444 462089 463169 463749 463408 462981 463218 463547 462954 461473 460054 459313 459187 459556
54153 459556 460421 461521 462472 463324 464323 465084 464728 463122 461331 460437 460359 460320 460023 459731 459476 459023 458773 459896
54135 459896 463098 467570 471692 474582 476441 477544 477650 476775 475885 476042 477050 477706 477577 477693 479012 480861
54119 480861 481791 481673 481823 482886 483686 482806 480475 477979 475811 473591 471590 470909 471834 473152 473763 474045
54103 474045 474888 476273 477799 479817 482656 485092 485150 482668 479793 478565 479165 480962 483915 487798 491006
54088 491006 491665 489888 487864 487580 489137 491336 493264 495013 497271 500391 503770 506280 507487 508121 509000
54073 509000 509855 509813 508795 507690 507191 507142 507134 507191 507642 508721 510324 511761 511882 510186 507906 507251 509208 512594
54055 512594 515517 517216 518186 519259 521096 523993 527370 529771 530098 528814 527441 527055 527752 529192 530812
54040 530812 531652 531020 529637 529227 530443 531958 532226 531460 530919 530734 529771 527754 526281 527001 529537 532013
54024 532013 533224 533549 533985 535113 536988 539292 541419 542884 543789 544454 544691 544199 543730 544983 548628 553000
54008 553000 555458 554967 552925 551605 552258 554587 557546 560339 562702 564404 564870 563769 561832 560455 560307
53993 560307 560915 561723 562739 563827 564280 563843 563454 564098 565480 566733 567913 569715 571979 573603 573989 573718
53977 573718 573761 574683 576441 578190 578658 577715 577236 579134 582746 585601 586759 587651 589340 590825 590953 590348
53961 590348 590118 589952 589011 587817 587676 588730 590048 591358 593273 595852 598206 599729 600749 601809 603160
53946 603160 605066 607745 610731 612998 614057 614478 615175 616634 618864 621562 624179 626332 628310 630793 633939
53931 633939 637010 638955 639217 638179 637132 637437 639191 640975 641457 640895 640297 639562 637740 635094 633456 633951
53915 633951 635573 636870 638046 640330 643829 647319 649922 651860 653387 654098 653701 652753 652042 651621 650984 649922
53899 649922 648809 648237 648681 650348 652820 655051 656274 656989 658552 661548 665069 667901 670010 672319 675268
53884 675268 678303 680821 683009 685308 687403 688258 687289 685276 683767 683437 683210 681544 678659 676860 678079
53869 678079 681541 684590 685633 685481 685873 687623 690360 693142 694847 694780 693682 693587 695913 699855 703124 704140
53853 704140 703047 701048 699438 699210 700902 704413 709002 713590 717273 719904 722183 724749 727225 728698
53839 728698 729170 729685 730703 731293 730662 729752 730336 732870 736138 738822 740657 742098 743597 745366 747424 749763
53823 749763 752488 755463 757715 757961 756261 754486 754470 756323 759162 762569 766144 768454 768200 766345 765511
53808 765511 766963 769459 771378 772745 774546 777173 780310 783715 787405 791388 795586 799719 803249 805882
53794 805882 808130 810680 813267 814958 815646 816358 817909 820115 822629 825681 829561 834125 839127 844366 849349
53779 849349 853648 857810 862853 868525 873168 875844 877472 879146 880496 880793 880699 881622 883818 886311 888480
53764 888480 890749 893853 898179 903693 909837 915688 920701 924998 928540 930745 931664 932777 935517 939413
53750 939413 942825 945225 947645 950950 954858 958827 962850 967102 971569 976332 981471 986492 990608 993890
53736 993890 997456 1002101 1007314 1012010 1015733 1018713 1021189 1023257 1025201 1027440 1030085 1032837 1035487 1038418
53722 1038418 1042390 1047656 1053394 1058348 1062145 1065597 1069526 1073681 1077140 1079428 1080849 1082013 1083558 1086018
53708 1086018 1089372 1092876 1095947 1099111 1103396 1108808 1114184 1118843 1123629 1129689 1136562 1142254 1145469 1147275
53694 1147275 1149909 1153978 1157632 1159127 1159585 1162034 1167714 1174621 1180113 1183686 1186379 1188740 1190878 1193723
53680 1193723 1198388 1204328 1209580 1213070 1215515 1218019 1221162 1225681 1232409 1240619 1247638 1251305 1252261 1252982
53666 1252982 1255119 1258595 1262738 1267128 1271422 1275267 1278658 1281911 1285309 1289127 1293899 1300049 1307075 1313541
53652 1313541 1318199 1321138 1323746 1327552 1333007 1339292 1345200 1350025 1353602 1355945 1357428 1359211 1362781 1368693
53638 1368693 1376082 1383529 1390076 1395378 1399501 1402987 1406682 1411102 1416178 1421853 1428457 1436017 1443524 1449422
53624 1449422 1452896 1454539 1456020 1459182 1464877 1472152 1478933 1484096 1488642 1494227 1500832 1506719 1510791 1514049
53610 1514049 1518210 1523461 1528416 1532256 1536187 1542250 1550795 1559737 1566734 1571849 1577352 1584786 1593024 1599893
53596 1599893 1605071 1610279 1616704 1623599 1629979 1636543 1644710 1654267 1663295 1670431 1676122 1681442 1686919 1693167
53582 1693167 1701440 1712180 1723589 1733091 1740252 1746959 1754583 1762366 1769219 1775770 1783434 1792237 1800792
53569 1800792 1808104 1814288 1819728 1824636 1829517 1835218 1842381 1851545 1863451 1878077 1893278 1905705 1913727
53556 1913727 1918739 1923315 1929082 1936825 1947158 1959742 1972537 1983383 1992322 2001257 2011351 2021791
53544 2021791 2031337 2040037 2048819 2058104 2067539 2076889 2086495 2096752 2107454 2117983 2128153 2138666 2150437
53531 2150437 2163416 2176340 2187872 2197855 2207321 2217447 2228702 2240717 2252641 2263775 2274286 2285166
53519 2285166 2297008 2308892 2319104 2327214 2334885 2344099 2354873 2365402 2374512 2383269 2393669 2406054
53507 2406054 2418486 2428697 2436102 2441775 2447225 2453781 2462588 2474006 2486875 2499283 2510581 2522074
53495 2522074 2535177 2549363 2562518 2573122 2581511 2589198 2597562 2607279 2618382 2630396 2642467 2653611
53483 2653611 2663109 2670892 2677627 2684195 2690898 2697350 2703300 2709317 2716360 2724821 2734346 2744491 2755129
53470 2755129 2766149 2777114 2787448 2796882 2805588 2814035 2822756 2832123 2842025 2851693 2860097 2866896 2872999
53457 2872999 2879812 2887787 2896140 2904228 2912525 2921528 2930286 2937257 2942574 2948128 2955068 2962572 2969752 2977399
53443 2977399 2986550 2996338 3004964 3012441 3020623 3030343 3040052 3047837 3053591 3058523 3063526 3068839 3074616 3080846
53429 3080846 3086966 3092292 3096808 3101196 3106235 3112432 3119904 3128237 3136615 3144389 3151376 3157516 3162563 3166271
53415 3166271 3168587 3169559 3169683 3170484 3173915 3180420 3188166 3194975 3200602 3206135 3211458 3214634 3214227 3211323 3208622
53400 3208622 3207976 3209235 3211032 3212135 3212291 3212283 3213241 3215688 3219224 3223033 3226309 3228234 3228223 3226771 3225519 3225726
53384 3225726 3226800 3227081 3226081 3225120 3225525 3226946 3228010 3228001 3227084 3225239 3222017 3217622 3213426 3210784 3209600 3208464
53368 3208464 3206029 3201832 3196059 3189156 3181818 3174836 3168572 3162862 3157831 3154455 3153547 3154058 3153169 3148830 3141914
53353 3141914 3135193 3130281 3126373 3122057 3117228 3112484 3107465 3101046 3092979 3084216 3075532 3066886 3058513 3051487
53339 3051487 3046393 3042067 3036614 3029442 3021640 3014567 3008643 3003241 2997063 2988799 2978202 2966545 2955407
53326 2955407 2945033 2934439 2923007 2911162 2899488 2888109 2877196 2867199 2858023 2848693 2838380 2827245
53314 2827245 2815716 2803589 2790630 2777561 2765519 2754617 2743803 2732042 2719063 2705096 2690703
53303 2690703 2676885 2664561 2653597 2642740 2630633 2616572 2600637 2583888 2568394 2555829 2545574
53292 2545574 2534912 2521623 2505844 2489140 2472776 2457454 2443647 2430986 2417925 2403274 2387785
53281 2387785 2373135 2359589 2345839 2330961 2315253 2299128 2282613 2266281 2251312 2237958 2225052
53270 2225052 2211685 2198286 2185327 2172116 2157926 2143262 2128774 2113774 2097395 2080680 2065799
53259 2065799 2053245 2041231 2028088 2013956 1999844 1986161 1972658 1958858 1944270 1928977 1914230
53248 1914230 1901432 1890196 1878443 1864845 1850196 1835841 1821880 1807743 1793662 1780521 1768759
53237 1768759 1758170 1748323 1738473 1727577 1715158 1701821 1688385 1675015 1661778 1649287 1637852 1626584
53225 1626584 1614425 1601711 1589653 1578498 1567260 1555208 1542601 1529957 1517546 1505772 1495145
53214 1495145 1485613 1476590 1467714 1458894 1449531 1438588 1425711 1411632 1397193 1382643 1368180 1354527
53202 1354527 1342435 1331922 1322342 1312975 1303373 1293418 1283187 1272640 1261541 1250013 1238888 1228948
53190 1228948 1219907 1210764 1201082 1191255 1181579 1171882 1162208 1152980 1144212 1135276 1125844 1116406 1107462 1098786
53176 1098786 1089854 1080439 1070497 1060126 1050108 1041783 1035613 1030269 1023791 1015552 1006598 998221 990692
53163 990692 983331 975500 967421 960011 953811 948309 942742 937312 932734 928616 923370 916300 908800 902693
53149 902693 898037 893458 888211 882996 878860 876029 873763 870889 866635 861369 856227 851610 846531 840124
53135 840124 833286 827847 824265 821133 817025 811955 806827 802312 798685 796096 794415 793102 791625 789815
53121 789815 787617 784807 781337 777708 774632 772296 770219 767898 765417 763306 761909 761101 760592 760197 759640
53106 759640 758442 756410 753993 751679 749202 746058 742625 739879 737839 735332 731790 728313 726186 725162
53092 725162 724172 723095 722698 723123 723544 723238 722055 719917 716904 713904 712183 711967 712219 712094 711831 711965 712394
53075 712394 712667 712576 712021 710804 709099 707657 706956 706420 705086 703027 701621 702091 703907 704903 703150 698712
53059 698712 693463 689329 687090 686595 687266 688052 687890 687012 687028 688683 690217 689341 686502 684502 684761 685623 685106
53042 685106 683867 684262 687271 691479 694735 695957 695588 694989 695257 696260 696979 696908 696514 696170 695565 694650 694188
53025 694188 694455 694295 692703 690746 690442 691912 693110 692720 691899 692444 694207 695363 694775 693033 691141 689126
53009 689126 686541 683910 682753 683862 686064 687302 686776 685384 684183 683236 682252 681396 680797 679879 678044 675764
52993 675764 674192 673765 673742 673102 671436 669155 667286 666951 668463 670968 673315 675056 676259 676768 676419 675610
52977 675610 674913 674319 673730 673933 675937 679249 681933 682733 682211 681458 680726 679877 679185 678885 678697 678578 679225 680880
52959 680880 682190 681450 678799 676122 674850 674811 675261 675975 676957 677989 678969 680117 681412 682315 682538 682592 683057
52942 683057 683688 683798 683217 682318 681340 680367 679821 680129 680754 680385 678536 676409 675675 676822 679208 682115 684856
52925 684856 686170 684912 681704 678896 678141 678670 678703 677848 677023 676424 674977 672084 668675 665951 663991 662437
52909 662437 661758 662711 664833 666583 667128 667060 667097 666955 666062 664653 663377 662182 660507 658547 657431 657775 658742
52892 658742 659118 658893 659121 660373 662051 663281 663772 663512 662373 660675 659781 661149 664723 668844 671915 673599
52876 673599 674304 674241 673531 672723 672438 672638 672872 673052 673369 673394 672126 669275 665896 663293 661772 661057 661415 663403
52858 663403 666453 668776 669190 668581 668909 670954 673481 674574 673423 670827 668284 666696 665841 665062 664438 664958
52842 664958 667296 670647 673237 673965 673204 672025 671060 670214 669091 667548 666047 665456 666158 667396 668036 668079
52826 668079 668783 671003 674017 676470 677881 678589 678726 678126 677166 676784 677527 679142 681124 683053 684246 683822
52810 683822 681588 678529 676030 674768 674459 674409 674150 673784 673788 674276 674488 673515 671636 670467 671418 674249 677325
52793 677325 679066 678989 677775 676575 676042 675805 675143 674202 674011 675120 676804 678111 679106 680452 682107 683236
52777 683236 683355 682911 682614 682688 682916 683071 683205 683734 685164 687479 689947 691849 693312 694965 696852 698089
52761 698089 697647 695137 690942 686071 681884 679420 678766 679302 680558 682413 684522 686138 686755 686568 686139 685999
52745 685999 686618 688213 690321 692055 693133 694168 695551 696567 696312 695243 695100 697167 700966 704746 706887
52730 706887 706893 705538 704315 704464 706096 708162 709386 709412 709080 709513 710845 711974 711785 710387 708825 707712
52714 707712 706874 706369 706873 708475 709918 710042 709526 709987 711431 711947 710393 708297 708209 710792 714354 716901
52698 716901 717881 718149 718997 721209 724409 727259 728751 729263 729777 730292 729955 728832 728452 729934 732465 734488
52682 734488 735804 737459 739928 742631 745221 748083 751125 753157 753310 752415 752123 752863 753402 752413 750062 748033
52666 748033 748115 750528 753515 755098 755476 756979 761107 766339 769677 769776 767637 764808 762317 761087 761772 763827
52650 763827 765955 767876 770389 773453 775724 776873 778832 783381 789421 794097 796007 796020 795520 795288 795812
52635 795812 797185 798648 799440 800128 801928 804723 807035 808074 808463 808712 808375 807316 806471 806564 807108 807511 808226
52618 808226 809863 812011 813954 815915 818461 821142 822850 823334 823451 823988 825037 826490 828378 830649 833060
52603 833060 835271 836800 837336 837568 839058 842425 846089 847903 847787 847641 848679 850137 850914 851356 852674 855361
52587 855361 858849 862276 865014 866749 867649 868338 869424 871090 873191 875454 877488 878917 879674 880110 880862
52572 880862 882747 886348 891049 894815 895855 894565 893008 892409 892205 891813 892132 894512 899013 904413 909366
52557 909366 912934 914792 915722 917255 919898 922270 922826 921849 920722 919953 919318 919476 921718 925928 930261 933156
52541 933156 934482 934664 934245 934701 937865 943401 948289 950124 949899 950198 951758 953564 955502 958638 962864
52526 962864 966371 968120 969163 970671 972059 972261 971823 972451 974970 978847 983338 987992 992169 995215 997345
52511 997345 999585 1002568 1005983 1009367 1012721 1016022 1018689 1020081 1020332 1020412 1021485 1024303 1028793 1033998 1038752
52496 1038752 1042783 1046826 1051298 1055276 1057426 1057773 1057840 1058984 1061321 1064468 1068407 1072906 1076632 1078042 1077233
52481 1077233 1076160 1076705 1079029 1082040 1084915 1087643 1090504 1093555 1096476 1098594 1099325 1099042 1099219 1101201 1105044
52466 1105044 1110032 1115928 1122714 1129344 1134073 1136524 1138415 1141559 1145890 1150068 1153292 1155696 1157697 1159908
52452 1159908 1163150 1167286 1170525 1171322 1170905 1172400 1177082 1182849 1186997 1189318 1191629 1195277 1200137 1205375
52438 1205375 1210171 1214120 1217809 1222607 1229066 1235878 1241335 1245445 1249608 1254455 1259124 1262731 1265406 1267685
52424 1267685 1269874 1272431 1276042 1280720 1285383 1288956 1291544 1294186 1297823 1302766 1308631 1314388 1318935 1322092
52410 1322092 1324796 1328055 1332140 1337100 1343363 1351049 1359102 1366034 1371561 1376771 1382585 1388726 1394409 1399397
52396 1399397 1403971 1408278 1412328 1416422 1421073 1426475 1432431 1438837 1445849 1453410 1460999 1468226 1475320 1482483
52382 1482483 1488976 1493641 1496570 1499498 1504009 1509957 1516257 1522666 1529747 1537329 1544303 1550316 1556551 1564127
52368 1564127 1572432 1579854 1585707 1590646 1595370 1599843 1603993 1608580 1614812 1623087 1632279 1640544 1647097 1653133
52354 1653133 1660537 1669603 1678579 1685790 1691637 1697958 1705778 1714331 1722127 1728456 1733856 1739526 1746171 1753250
52340 1753250 1759677 1765562 1772617 1782082 1792823 1802567 1810721 1818653 1827169 1835226 1841815 1847815 1854896 1863367
52326 1863367 1872303 1881307 1890855 1900918 1910439 1918597 1925888 1933447 1941695 1950007 1957567 1964289 1971003 1978796
52312 1978796 1988032 1998000 2007677 2016753 2025694 2034938 2044355 2053508 2062096 2070105 2077863 2085951 2094676 2103604
52298 2103604 2112061 2120194 2129009 2139044 2149584 2159574 2168819 2177665 2185965 2193294 2200055 2207335 2215399
52285 2215399 2223260 2230242 2237125 2244843 2252625 2258685 2262878 2267506 2274913 2284923 2295376 2304784 2313588
52272 2313588 2322726 2331893 2339840 2346030 2351295 2356831 2363123 2370134 2377960 2386632 2395495 2403650 2411224 2419459
52258 2419459 2429060 2438967 2447397 2453828 2459312 2465104 2471707 2479115 2487065 2494845 2501672 2507673 2513861 2520802
52244 2520802 2527961 2534870 2542183 2550715 2559834 2567838 2573937 2579065 2584631 2591075 2597942 2604810 2611789 2619238
52230 2619238 2627227 2635143 2641961 2647265 2651985 2657643 2664679 2671899 2677825 2682290 2686437 2691413 2697478 2704179
52216 2704179 2710929 2717217 2722522 2726405 2728862 2730584 2732755 2736439 2741976 2748725 2755304 2760351 2763599 2766332
52202 2766332 2770410 2776426 2783035 2788344 2791813 2794538 2797940 2802638 2808456 2814934 2821687 2828543 2835366 2841581
52188 2841581 2846124 2848429 2849416 2850948 2854154 2858756 2864051 2869824 2875880 2881354 2885234 2887508 2889272 2891649
52174 2891649 2894709 2897377 2898348 2897480 2896564 2898337 2904150 2912684 2921323 2928630 2934962 2940860 2945703 2948582 2949959
52159 2949959 2951448 2953772 2955675 2955587 2954140 2954095 2957463 2963294 2968906 2972738 2975263 2977434 2979436 2981248 2983373
52144 2983373 2986267 2989637 2993034 2996775 3001445 3006670 3011159 3014157 3016341 3019079 3023106 3027959 3032369 3035167
52130 3035167 3036182 3036457 3037324 3039097 3040842 3041577 3041551 3042195 3044884 3049868 3056285 3063032 3069453 3075203 3079779
52115 3079779 3082699 3084192 3085245 3086582 3087869 3088349 3088011 3087601 3087565 3087603 3087395 3087248 3087685 3088775 3090173 3091562
52099 3091562 3092721 3093417 3093590 3093577 3093811 3094330 3094781 3094851 3094424 3093478 3092188 3091236 3091584 3093602 3096545 3099083 3100385
52082 3100385 3100600 3100435 3100426 3100522 3100181 3098860 3096608 3094263 3092916 3093002 3093832 3093943 3092026 3087853 3082547 3077821 3074627
52065 3074627 3072530 3070618 3068809 3067762 3067581 3067369 3066318 3064639 3062879 3060871 3057987 3054097 3049561 3044557
52051 3044557 3039156 3033880 3029288 3025017 3020123 3014536 3009228 3004647 2999844 2993729 2986451 2979018 2972217 2966461
52037 2966461 2962076 2958947 2956269 2953308 2949975 2946115 2940903 2933821 2925663 2917498 2909112 2899649 2889424 2879604
52023 2879604 2870163 2859985 2849527 2841595 2838076 2837005 2834418 2828632 2821341 2814650 2808518 2801546 2793158
52010 2793158 2784145 2775403 2766785 2757293 2746202 2733891 2721544 2709996 2699073 2688181 2677288 2666929
51998 2666929 2657368 2648271 2639280 2630503 2622132 2613743 2604343 2593208 2580613 2567699 2555714 2545419 2537104
51985 2537104 2530664 2525239 2519019 2510234 2498653 2485663 2472565 2459345 2445596 2431980 2419722 2408840
51973 2408840 2398045 2386766 2376266 2367969 2361268 2353876 2344209 2332670 2320588 2308611 2296523 2284183
51961 2284183 2272088 2260953 2250961 2241526 2231750 2221090 2209638 2197864 2186261 2175254 2165129 2155804
51949 2155804 2146721 2137194 2126894 2115912 2104446 2092696 2081021 2069931 2059793 2050603 2041981 2033211
51937 2033211 2023429 2012204 2000158 1988863 1979873 1973708 1969519 1965505 1959863 1951947 1942677 1933421 1924448
51924 1924448 1915004 1905033 1895908 1888727 1882547 1875450 1867153 1859354 1853194 1847503 1840344 1831604 1823027 1815904
51910 1815904 1809694 1803093 1795784 1788568 1782051 1775769 1768843 1761258 1754119 1748415 1743774 1738845 1732987 1727053
51896 1727053 1722218 1718419 1714543 1709960 1705181 1700723 1695974 1689906 1682748 1676209 1671620 1668166 1663542 1656383
51882 1656383 1647737 1640022 1634890 1632211 1630694 1628966 1626195 1622225 1617436 1612320 1607090 1601664 1595879 1589569
51868 1589569 1582766 1576140 1571068 1568649 1568561 1569178 1568851 1566749 1562747 1557279 1551497 1546807 1543721 1541522 1539308
51853 1539308 1536905 1534504 1532084 1529712 1527828 1526527 1525047 1522839 1520837 1520644 1522449 1524614 1525565 1525250 1524370
51838 1524370 1522915 1520183 1515966 1511114 1506944 1504328 1503215 1502601 1501083 1497891 1493667 1490081 1488354 1488186
51824 1488186 1488256 1487713 1486813 1485994 1484841 1482566 1479320 1476262 1474168 1472651 1471089 1469660 1468857 1468436 1467573 1465967
51808 1465967 1464179 1462919 1462423 1462520 1462928 1463497 1464340 1465534 1466464 1465883 1463200 1459456 1456452 1455043 1454795 1455024
51792 1455024 1455366 1455423 1454734 1453347 1451857 1450693 1449875 1449540 1450061 1451445 1453085 1454254 1454452 1453322 1450973 1448465
51776 1448465 1447202 1447462 1448202 1448595 1449085 1450479 1452571 1454329 1455064 1454920 1454496 1454395 1454900 1455790 1456769 1458186 1460741
51759 1460741 1464149 1466825 1467542 1466909 1466497 1466922 1467650 1468372 1469516 1471260 1472909 1473702 1473767 1473849 1474414 1475352 1476404
51742 1476404 1477558 1478940 1480463 1481713 1482304 1482258 1481888 1481329 1480473 1479409 1478619 1478482 1478915 1479733 1481109 1483248
51726 1483248 1485764 1487715 1488432 1488231 1488302 1489787 1492726 1495929 1498189 1499643 1501514 1504463 1507702 1510007 1511021
51711 1511021 1511239 1511320 1511991 1514046 1517533 1521064 1522716 1521814 1519510 1517701 1517751 1519963 1523546 1527058 1529528 1531419
51695 1531419 1534061 1537992 1542227 1545259 1546429 1546221 1545612 1545299 1545199 1544588 1543092 1541604 1541701 1543867 1546759 1548801
51679 1548801 1550175 1552482 1556459 1560794 1563656 1564915 1566075 1568141 1570443 1571954 1573030 1574959 1577982 1580715
51665 1580715 1581828 1581656 1581771 1583444 1586849 1591304 1595776 1599429 1602221 1604821 1607581 1609831 1610630 1610101 1609582
51650 1609582 1610403 1612760 1615646 1617571 1617508 1615605 1613166 1611741 1612189 1614564 1618494 1623329 1628168 1632207 1635178
51635 1635178 1637318 1639056 1640858 1643089 1645735 1648396 1650699 1652470 1653456 1653457 1653104 1653822 1656338 1659698 1662567
51620 1662567 1665045 1668288 1672525 1676627 1679712 1682106 1684389 1686454 1688075 1689600 1691385 1693065 1694156 1695098
51606 1695098 1697073 1700823 1706072 1711972 1717579 1722011 1724753 1726181 1727485 1729725 1732977 1736615 1740243 1743969
51592 1743969 1747723 1750858 1752994 1754898 1757753 1761501 1764748 1766611 1767876 1769769 1772267 1774491 1776320 1778578
51578 1778578 1781695 1785011 1787526 1788776 1789012 1789086 1790120 1792606 1795771 1798452 1800524 1802708 1805025 1806496 1806741
51563 1806741 1806908 1808263 1810447 1811934 1811927 1811108 1810589 1810738 1811208 1811601 1811736 1811445 1810616 1809707 1809813 1811655 1814477
51546 1814477 1816658 1817628 1818462 1820128 1821933 1822494 1821604 1820183 1818809 1817486 1816592 1816743 1817647 1818258 1818227 1818085 1817776
51529 1817776 1816303 1813403 1810435 1808833 1808450 1808100 1807047 1805356 1803410 1801703 1800587 1799706 1798164 1795634 1792692
51514 1792692 1789847 1787082 1784690 1783377 1782849 1781430 1778178 1774516 1772524 1772277 1772089 1770914 1769241 1767817 1766772
51499 1766772 1765990 1765308 1764264 1762514 1760509 1758998 1758017 1757151 1756573 1756667 1756560 1754283 1749025 1742534 1737702 1736023
51483 1736023 1736575 1737074 1735795 1732832 1729697 1727579 1726319 1725283 1724491 1723972 1722641 1719332 1714963 1712083 1711614
51468 1711614 1711413 1709049 1704936 1701377 1699184 1696935 1693624 1690464 1689179 1689513 1689706 1689139 1689131 1690695 1692548 1692425
51452 1692425 1689957 1687143 1685851 1685914 1686135 1686302 1687301 1689682 1692878 1695780 1697555 1698114 1698232 1699007 1700675 1702089
51436 1702089 1701872 1699933 1697423 1695466 1694454 1694329 1694876 1695725 1696644 1697868 1699726 1701995 1703997 1705207 1705557
51421 1705557 1705513 1706170 1708594 1712401 1715568 1716655 1716713 1717880 1720425 1722665 1723709 1724702 1726797 1729332 1730918
51406 1730918 1731417 1731889 1733056 1734655 1736090 1737297 1738995 1742130 1746631 1750870 1753117 1753620 1754307 1756325 1758935
51391 1758935 1761163 1763249 1765685 1767866 1768845 1768784 1768636 1768792 1768879 1768502 1767453 1765712 1763976 1763577 1764829 1766094
51375 1766094 1765635 1764051 1763516 1764843 1766776 1768238 1769628 1771305 1772250 1771412 1769443 1767972 1767619 1767742 1767810 1767837
51359 1767837 1767417 1765527 1761878 1757800 1755033 1753885 1753212 1752080 1750661 1749267 1747299 1743900 1739441 1735495
51345 1735495 1733100 1731570 1729339 1725568 1720658 1715592 1711258 1708280 1706880 1706722 1706940 1706456 1704370 1700427 1695306
51330 1695306 1690281 1686354 1683635 1681491 1679050 1675704 1671659 1668084 1666105 1665336 1663986 1660849 1656586 1652511
51316 1652511 1648764 1644535 1639623 1634754 1630493 1626904 1624205 1622605 1621178 1618089 1612669 1606599 1602359 1600987
51302 1600987 1601745 1603199 1603755 1601813 1596742 1589808 1583197 1577756 1572325 1565538 1557684 1550411 1545088 1541803
51288 1541803 1539631 1537366 1534212 1530213 1526097 1522533 1519604 1517055 1514659 1512006 1508328 1503177 1497322 1492367
51274 1492367 1489221 1487358 1485751 1484142 1483009 1482556 1482179 1480981 1478591 1475398 1472098 1468996 1465792 1462087
51260 1462087 1457962 1453786 1449571 1445007 1440249 1436149 1433440 1432088 1431755 1432426 1434135 1436499 1438976 1441264
51246 1441264 1442945 1443310 1442284 1441111 1441102 1441947 1442256 1441643 1441068 1440939 1440183 1437802 1434332 1431121 1428985 1428316 1429637
51229 1429637 1432942 1436929 1439887 1441269 1441710 1441788 1441577 1441309 1441675 1443273 1446103 1449584 1452778 1454897 1456066
51214 1456066 1457317 1459357 1461600 1463007 1463541 1464080 1465105 1466285 1467286 1468226 1469287 1470526 1472029 1473523 1474008
51199 1474008 1472839 1471354 1472179 1476287 1481652 1485619 1487827 1489854 1492596 1495275 1497027 1498269 1500026 1502591
51185 1502591 1505425 1508061 1510614 1513442 1516579 1519598 1521950 1523449 1524418 1525342 1526472 1527869 1529688 1532050
51171 1532050 1534577 1536410 1537093 1537378 1538809 1542323 1547348 1552343 1556079 1558376 1559873 1561396 1563485 1566147
51157 1566147 1568934 1571492 1574124 1577608 1582197 1586944 1590292 1591509 1591512 1592227 1595036 1599722 1604922 1609632 1614143
51142 1614143 1619435 1625936 1633163 1640297 1646500 1650815 1652636 1652646 1652639 1653955 1656531 1659851 1664077 1669368 1674663
51127 1674663 1678375 1680382 1682354 1685759 1690355 1695105 1699838 1705264 1711633 1718117 1723647 1727960 1731704 1735756
51113 1735756 1740600 1746162 1751983 1757441 1761983 1765512 1768605 1772100 1776256 1780520 1784358 1788058 1792364 1797498
51099 1797498 1803032 1808680 1814639 1820947 1826991 1832108 1836516 1841321 1847496 1854953 1862649 1869577 1875587 1881327
51085 1881327 1887596 1894900 1903298 1912117 1919898 1925462 1929393 1933839 1940298 1948119 1955799 1963007 1970301 1977351
51071 1977351 1982936 1986887 1990783 1996167 2003048 2010667 2018796 2027444 2036025 2043812 2050980 2058443 2066760 2075705
51057 2075705 2084651 2092811 2099420 2104432 2109045 2114925 2122780 2132026 2141691 2151137 2160091 2168670 2177459 2186947
51043 2186947 2196723 2205850 2214235 2222899 2232429 2241842 2249785 2256522 2263826 2272824 2282799 2292454 2301636 2311189
51029 2311189 2321489 2331867 2341423 2349781 2357011 2363401 2369558 2376261 2383872 2392190 2401090 2410883 2421680
51016 2421680 2432725 2442904 2451807 2459949 2468132 2476992 2487001 2498312 2510497 2522750 2534406 2545141
51004 2545141 2554959 2564356 2574252 2585223 2596843 2608286 2619420 2630697 2642110 2653011 2663086 2672816
50992 2672816 2682758 2693088 2704093 2716313 2729690 2743083 2755274 2766076 2776015 2785330 2793875 2801821
50980 2801821 2809863 2818664 2828264 2837957 2846686 2854003 2860898 2869206 2879743 2891363 2902268 2911969 2921436
50967 2921436 2931607 2942385 2953106 2963382 2973347 2983419 2994016 3005272 3016874 3028225 3038801
50956 3038801 3048431 3057394 3066277 3075466 3084722 3093508 3101815 3110312 3119497 3129075 3138449 3147524 3156671 3166174
50942 3166174 3176057 3186326 3197092 3208393 3219946 3230925 3240209 3247415 3253704 3260918 3269714 3279159 3288337
50929 3288337 3297438 3306758 3315602 3323198 3330073 3337503 3345877 3354551 3363055 3371526 3380065 3388609 3397380 3406540
50915 3406540 3415441 3423143 3429876 3437074 3445691 3455267 3464898 3474376 3483942 3493539 3502845 3511600 3519576 3526609
50901 3526609 3533013 3539649 3547292 3556132 3566014 3576821 3588330 3599926 3610676 3619686 3626655 3632392 3638541
50888 3638541 3646189 3654825 3663156 3670822 3678563 3686841 3695267 3703604 3712342 3721712 3730919 3739083 3746501 3754255
50874 3754255 3762740 3771109 3778198 3783791 3789047 3795664 3804324 3813979 3823061 3831325 3839885 3849428 3859173 3867898
50860 3867898 3875333 3882180 3889434 3898075 3908757 3921146 3933940 3945900 3956552 3965788 3973563 3980357 3987047
50847 3987047 3993749 3999590 4004379 4009610 4016748 4025041 4032233 4037210 4040969 4045122 4050428 4056696 4063226 4069279
50833 4069279 4074858 4081029 4088770 4097581 4105980 4113269 4120030 4127008 4134366 4142062 4150013 4157811 4165061 4172035
50819 4172035 4179087 4185499 4190124 4193392 4197336 4202963 4208831 4213176 4216589 4221368 4228631 4237072 4244413 4249286
50805 4249286 4251879 4253544 4255931 4259954 4265319 4271076 4276424 4280919 4284424 4287293 4290200 4293400 4296536 4299513
50791 4299513 4302887 4306783 4310126 4312018 4313430 4316252 4320719 4324986 4327607 4329285 4331657 4335369 4340087 4345470
50777 4345470 4350971 4355176 4356804 4356633 4357407 4361157 4367087 4372526 4375584 4376371 4376013 4375339 4374726 4374516 4374950 4375764
50761 4375764 4376357 4376469 4376392 4376385 4376132 4375119 4373526 4372404 4372680 4373971 4374693 4373744 4372079 4372205 4375703 4381411 4386453
50744 4386453 4388969 4389380 4389098 4388834 4388548 4388432 4389007 4390397 4392162 4393906 4395589 4397170 4398454 4399412 4400149 4400369
50728 4400369 4399506 4397864 4397142 4398998 4402996 4406572 4407446 4405842 4404104 4404226 4406063 4407940 4408679 4408769 4409622 4411963
50712 4411963 4415140 4417925 4419789 4421470 4424436 4429752 4437177 4445131 4451671 4455757 4457639 4458154 4457972 4457709 4458401
50697 4458401 4461114 4465822 4471159 4475703 4479363 4483160 4487912 4493653 4500174 4507301 4514419 4520488 4525152 4529331
50683 4529331 4534025 4538885 4542869 4546128 4550170 4555864 4562162 4567390 4571188 4574549 4578386 4582692 4586865 4590308
50669 4590308 4592957 4595732 4600128 4606667 4613911 4619704 4623365 4626081 4629247 4633221 4637581 4641704 4644854 4646669
50655 4646669 4648040 4650723 4655387 4660612 4664476 4666719 4668706 4671562 4675042 4678137 4680209 4681554 4683206 4686018
50641 4686018 4689639 4692759 4694728 4696414 4698780 4701205 4702350 4702435 4703302 4705868 4708732 4709945 4709316 4708158 4707534
50626 4707534 4707662 4708471 4709655 4710279 4709510 4707949 4707352 4708639 4710793 4712185 4712391 4712117 4711804 4711168 4710037 4708877
50610 4708877 4708244 4708179 4708371 4708405 4707603 4705238 4701545 4698129 4696538 4696456 4696142 4694769 4693454 4693648 4695303 4697312 4699027
50593 4699027 4700400 4701015 4700083 4697522 4694332 4691712 4690283 4690113 4690870 4691901 4692735 4693562 4694696 4695755 4696169 4696420
50577 4696420 4697692 4700043 4701913 4701885 4700101 4697583 4695296 4694407 4696089 4699859 4703100 4703615 4702052 4700541 4699614
50562 4699614 4698132 4695780 4693663 4692229 4690396 4687347 4683739 4680574 4678206 4677171 4678441 4681738 4684732 4685262
50548 4685262 4683581 4681267 4678815 4675780 4672642 4670727 4670216 4669744 4668309 4666405 4664866 4663636 4662153 4660071
50534 4660071 4657057 4652619 4646829 4640720 4635466 4631442 4628370 4625923 4623868 4622005 4620241 4618279 4615116 4609725
50520 4609725 4602803 4596954 4594165 4593506 4592389 4589727 4586684 4584330 4582006 4578610 4574362 4570228 4566225 4561404
50506 4561404 4555292 4548401 4541241 4533858 4526723 4521192 4518160 4516593 4514180 4509524 4503090 4495859 4487796 4478289
50492 4478289 4467793 4458175 4450973 4445662 4440149 4433008 4424851 4417251 4410598 4403602 4395033 4385528 4377112 4370954
50478 4370954 4366068 4360363 4352620 4343224 4333371 4323996 4315318 4306873 4297918 4288145 4278021 4268177 4258565 4248696
50464 4248696 4238665 4229245 4220725 4212325 4203264 4193812 4184580 4175142 4164237 4151289 4137020 4122582 4108750
50451 4108750 4095952 4084181 4072626 4060242 4047159 4034843 4024297 4014718 4004530 3993105 3980712
50440 3980712 3967395 3952991 3938051 3923661 3910251 3897397 3884822 3872746 3861110 3849342 3837149
50429 3837149 3824745 3812068 3798730 3785136 3772607 3761611 3750716 3738295 3724683 3711546 3699478
50418 3699478 3687398 3674323 3660604 3647094 3633933 3620711 3607338 3594245 3581773 3569629 3556984
50407 3556984 3543262 3528944 3515343 3503361 3492808 3483153 3474315 3466018 3456971 3445927 3433489 3421759
50395 3421759 3411968 3403396 3394846 3386110 3377362 3368140 3357858 3346807 3335791 3325058 3314305 3303503
50383 3303503 3293006 3282938 3273061 3263208 3253378 3243425 3233088 3222455 3212116 3202814 3194864 3187696 3179937
50370 3179937 3170423 3159416 3148445 3138653 3129760 3120928 3112067 3103736 3096239 3089422 3082934 3076026 3067589
50357 3067589 3057330 3046638 3037322 3029576 3022100 3014100 3006067 2998484 2991020 2983446 2976299 2969916 2963601
50344 2963601 2956488 2948636 2940539 2932093 2922819 2912728 2902293 2891903 2882135 2874075 2868298 2863536 2857433
50331 2857433 2849038 2839840 2832000 2826188 2821432 2816351 2809857 2801199 2790342 2778406 2767077 2757359 2749231
50318 2749231 2742416 2736852 2732232 2727724 2722706 2717343 2711929 2706006 2698862 2690759 2682797 2675441 2668008 2659914
50304 2659914 2651631 2643941 2636941 2630500 2624979 2620634 2616755 2612503 2608320 2605239 2602743 2598627 2591519 2582487
50290 2582487 2573616 2565944 2559545 2554571 2551037 2548208 2545485 2543571 2543423 2544102 2543110 2539303 2534249 2530044 2526770
50275 2526770 2523085 2518501 2513869 2509923 2506601 2503957 2502557 2502410 2502308 2501013 2498637 2496109 2493588 2490372
50261 2490372 2486458 2483170 2481673 2481489 2481233 2480546 2480467 2481786 2483731 2484681 2483909 2482277 2481361 2482110 2484242 2486676
50245 2486676 2488471 2489358 2489499 2489039 2488190 2487595 2488111 2490065 2492960 2496019 2498746 2500906 2502387 2503334 2504140 2505007
50229 2505007 2505740 2506225 2506876 2508240 2510407 2513173 2516593 2520847 2525532 2529587 2532209 2533578 2534439 2535204 2535782
50214 2535782 2536328 2537761 2541143 2546531 2552807 2558855 2564488 2569784 2573920 2575586 2574770 2573243 2572808 2573686 2575196
50199 2575196 2577236 2580087 2583146 2585116 2585746 2586495 2589070 2593803 2599724 2605660 2610873 2615137 2618781 2622545
50185 2622545 2627039 2632322 2638031 2643780 2649423 2655116 2661039 2666835 2671531 2674571 2676899 2680402 2686129 2693516
50171 2693516 2701352 2708810 2715428 2721020 2726054 2731310 2736581 2740508 2742501 2744089 2747304 2752238 2757324 2761768
50157 2761768 2766386 2772010 2778336 2784717 2791093 2797616 2804163 2810708 2817531 2824635 2831574 2838170 2844624 2850512
50143 2850512 2854744 2857424 2860883 2867505 2876858 2886164 2893660 2900297 2907907 2916798 2925776 2933840 2941039 2947992
50129 2947992 2955189 2962731 2970426 2978006 2985362 2992428 2998932 3004616 3009866 3015726 3022979 3031393 3040151 3048846
50115 3048846 3057629 3066523 3075057 3082886 3090504 3098867 3108126 3117035 3124158 3129727 3135778 3143984 3153775 3163225
50101 3163225 3171505 3179582 3188479 3197924 3207188 3216319 3225677 3234853 3243082 3250487 3257868 3265296 3271940 3277602
50087 3277602 3283508 3291062 3300412 3310755 3321453 3332201 3342561 3352171 3361305 3370497 3379710 3388649 3397866
50074 3397866 3408544 3420591 3431818 3439988 3445444 3450780 3457845 3466006 3473643 3480413 3487201 3494438 3501604
50061 3501604 3508454 3515725 3524141 3533329 3542189 3549906 3556188 3561053 3565181 3570223 3577812 3587928 3598674
50048 3598674 3607983 3615257 3621277 3626983 3632704 3638260 3643347 3647856 3652083 3656649 3662068 3668431 3675580 3683442
50034 3683442 3692014 3701087 3710165 3718645 3726063 3732269 3737660 3743222 3750088 3758794 3768899 3779319 3789042
50021 3789042 3797573 3804872 3811057 3816240 3820526 3824125 3827516 3831538 3837030 3844022 3851396 3857890 3863538 3869584
50007 3869584 3876685 3883795 3889456 3893759 3898136 3903264 3908130 3911474 3913471 3915567 3919212 3925114 3933098 3942000
49993 3942000 3950027 3955998 3960241 3963960 3967869 3971900 3975911 3979962 3983898 3987377 3990591 3994379 3999246 4004635
49979 4004635 4009535 4013558 4016984 4019846 4021580 4021851 4021497 4022189 4024882 4028761 4031967 4033418 4033668 4033914 4034489
49964 4034489 4034678 4033762 4031804 4029377 4026957 4024797 4023183 4022559 4023332 4025385 4027669 4028479 4026666 4022793 4018802
49949 4018802 4016321 4015386 4014908 4013961 4012303 4010023 4007331 4004748 4002871 4001621 4000063 3997311 3993339 3988610 3983309
49934 3983309 3977572 3972255 3968502 3966243 3963885 3960031 3955022 3950165 3945923 3941667 3936879 3931642 3926029 3919994
49920 3919994 3913967 3908564 3903388 3897047 3888851 3879634 3870430 3861329 3852401 3844737 3839254 3835038 3830197 3824205
49906 3824205 3818118 3812549 3806728 3799851 3792169 3784183 3775710 3766338 3756111 3745306 3734102 3722981 3712828
49893 3712828 3704075 3696207 3688467 3680512 3672008 3662352 3651493 3640411 3629957 3619693 3608743 3597421
49881 3597421 3587007 3578028 3569686 3561014 3551636 3541217 3529154 3515454 3501330 3488269 3476663 3465740
49869 3465740 3454638 3443192 3431759 3420629 3409735 3398895 3388263 3378297 3369091 3359855 3349478 3337676
49857 3337676 3325321 3313605 3303180 3294017 3285562 3276863 3267157 3256743 3246820 3238008 3229442 3219891 3209441
49844 3209441 3199192 3189427 3179132 3167618 3155794 3145171 3136232 3128424 3121198 3114142 3106400 3097075 3086339
49831 3086339 3075291 3064585 3053982 3043407 3033363 3023855 3013987 3003444 2993376 2984741 2976567 2967230
49819 2967230 2956925 2947333 2939059 2931140 2923230 2916420 2910996 2904953 2896047 2884448 2872219 2860926 2850920
49806 2850920 2842331 2835312 2829355 2823463 2817077 2810099 2802218 2793246 2783994 2775716 2768431 2760654 2751178 2740399
49792 2740399 2729636 2719853 2711358 2704061 2697478 2690847 2683727 2676317 2668984 2661729 2654251 2646227 2637417 2627818
49778 2627818 2617924 2608486 2599891 2591933 2584186 2576285 2567883 2558767 2549051 2538914 2528208 2516781 2505121
49765 2505121 2494052 2483819 2474175 2465286 2457512 2450002 2440714 2428752 2415898 2404810 2396144 2388424 2380392
49752 2380392 2372317 2364851 2357755 2350284 2342143 2333446 2324085 2313802 2302787 2291635 2280594 2269365 2258029
49739 2258029 2247817 2240059 2234225 2227861 2219224 2209404 2200873 2194200 2187469 2179040 2169544 2160482 2152038 2143287
49725 2143287 2133836 2124177 2114889 2106537 2099903 2095062 2090351 2083561 2074517 2065491 2058608 2053569 2048313 2041315
49711 2041315 2032765 2024009 2016438 2010672 2006303 2002381 1998201 1993527 1988200 1982044 1975370 1969138 1964149 1960141
49697 1960141 1955985 1950850 1945117 1940079 1936564 1933887 1930503 1925859 1921166 1917833 1915512 1912364 1907123 1900236
49683 1900236 1893052 1886670 1881655 1877970 1874787 1870960 1866199 1861380 1857475 1854594 1852314 1850361 1848558 1846593
49669 1846593 1844316 1841902 1839385 1836403 1832776 1828982 1825657 1823034 1821255 1820766 1821766 1823518 1824759 1824667 1823120
49654 1823120 1820320 1816682 1812832 1809207 1805863 1802991 1801208 1800699 1800390 1798833 1795837 1792578 1790093 1788283
49640 1788283 1786470 1784272 1781799 1779438 1777534 1775917 1773839 1770857 1767630 1765197 1763609 1762075 1760427 1759427
49626 1759427 1759283 1758863 1757063 1754288 1751873 1750465 1749675 1748994 1748366 1747917 1747687 1747544 1747038 1745405 1742209 1738019
49610 1738019 1734163 1731797 1731206 1731805 1732652 1733225 1733904 1735339 1737254 1738491 1738671 1739092 1741088 1744028 1746088 1746873
49594 1746873 1747931 1750288 1752698 1753272 1752014 1750702 1750569 1751221 1751801 1752261 1753132 1754647 1756602 1758651 1760330
49579 1760330 1761038 1760470 1759105 1757990 1758001 1759372 1761800 1764816 1768131 1771782 1775930 1780352 1784335 1787352 1789706
49564 1789706 1792147 1794784 1796766 1797164 1795847 1793411 1790713 1788786 1788643 1790478 1793171 1795239 1796377 1797589
49550 1797589 1799699 1802274 1804316 1805575 1806815 1809038 1812789 1817977 1823879 1829287 1833042 1834722 1834869 1834623
49536 1834623 1835125 1837094 1840630 1845256 1850143 1854447 1857773 1860498 1863463 1866953 1870122 1871949 1872809 1874496
49522 1874496 1878428 1884346 1891064 1897740 1903737 1907952 1909540 1909300 1909273 1910637 1912773 1914673 1916428 1918802 1922137
49507 1922137 1926367 1931465 1936964 1941455 1943751 1944572 1945979 1948861 1951877 1953495 1954267 1956237 1960551 1966548
49493 1966548 1973016 1979277 1984844 1989045 1991781 1994156 1997435 2001434 2004613 2005918 2006000 2006368 2007794 2010007 2012601
49478 2012601 2015591 2018945 2022105 2024406 2025945 2027695 2030647 2034945 2039953 2044966 2049681 2053981 2057752 2061229
49464 2061229 2065317 2070970 2078027 2084998 2090398 2094189 2097685 2102165 2107903 2114352 2120696 2125946 2129109 2129973
49450 2129973 2129805 2130734 2134054 2139234 2144662 2149160 2152609 2155407 2157898 2160427 2163480 2167400 2172090 2177237
49436 2177237 2182749 2188746 2195195 2201762 2207955 2213239 2217157 2219736 2221753 2224204 2227384 2230771 2233920 2237076
49422 2237076 2240687 2244660 2248590 2252619 2257574 2264139 2272019 2279963 2286498 2290801 2293294 2295552 2299348 2305322
49408 2305322 2312404 2318684 2323060 2326162 2329634 2334538 2340513 2346421 2351526 2355816 2359482 2362623 2365494 2368539
49394 2368539 2371922 2375276 2378298 2381424 2385594 2391293 2397926 2404308 2409829 2415146 2421405 2428610 2435125 2439410
49380 2439410 2442040 2445220 2450245 2456391 2462535 2468804 2475777 2482927 2489080 2494124 2499149 2504858 2510710 2515756
49366 2515756 2519605 2522588 2525610 2529740 2535174 2540649 2544812 2548188 2552684 2558997 2565753 2571645 2577075 2582751
49352 2582751 2587985 2591800 2594994 2599477 2605818 2613001 2620562 2629308 2639308 2648551 2654742 2657872 2660212 2664140
49338 2664140 2670555 2678927 2688000 2696481 2703698 2709803 2715259 2720400 2725773 2732287 2740291 2748740 2756149 2762408
49324 2762408 2768825 2776316 2784459 2792551 2800599 2808697 2816447 2823862 2832007 2841528 2851127 2858857 2864686 2870305
49310 2870305 2876529 2882542 2888007 2894106 2901558 2909203 2915882 2922478 2930559 2939860 2948825 2957109 2965774 2975108
49296 2975108 2983924 2991255 2997482 3003552 3010220 3018050 3026949 3035650 3043012 3049919 3058406 3068750 3079112
49283 3079112 3088401 3097512 3106993 3115660 3122991 3130991 3141749 3154444 3166801 3178411 3190331 3202157
49271 3202157 3212097 3219951 3227711 3236786 3246591 3256333 3266280 3276448 3285790 3293775 3301484 3310082 3319357 3328760
49257 3328760 3338814 3350197 3362275 3373837 3384841 3396191 3408113 3419926 3431344 3442931 3455101
49246 3455101 3467417 3479093 3489730 3499518 3509238 3520021 3532528 3546221 3559838 3572693 3585226 3598320
49234 3598320 3612386 3627043 3641326 3654235 3665572 3676356 3688074 3701399 3715782 3730239 3744158
49223 3744158 3757350 3769834 3781880 3793969 3806360 3818794 3830886 3842722 3854841 3867594 3880756
49212 3880756 3893820 3906548 3919110 3931778 3944593 3957294 3969485 3980938 3991888 4003068 4015260
49201 4015260 4028690 4042975 4057795 4073494 4090752 4109535 4128478 4145548 4159588 4171368 4183102
49190 4183102 4196742 4212610 4229521 4245992 4261270 4275587 4289939 4305486 4322559 4340121 4356651
49179 4356651 4371728 4386322 4401489 4417393 4433732 4450296 4466652 4482055 4496428 4510833 4526211
49168 4526211 4542172 4557811 4573161 4588821 4604630 4620005 4635348 4651684 4668737 4684751 4698740
49157 4698740 4711824 4725736 4740953 4756929 4773266 4789789 4806049 4821618 4836594 4851220 4865323
49146 4865323 4878669 4891659 4905124 4919534 4934633 4949706 4964123 4977936 4992046 5007440 5024234
49135 5024234 5041831 5059745 5077537 5094197 5108840 5122185 5136065 5150998 5165498 5178417 5190684
49124 5190684 5203818 5217984 5232688 5248198 5264637 5280529 5294044 5305407 5316506 5328299 5340143
49113 5340143 5351629 5363493 5376407 5390135 5404259 5418550 5432371 5444814 5455875 5466559 5477522
49102 5477522 5488654 5500271 5513441 5528385 5543483 5556765 5567909 5578166 5588846 5600367 5612346
49091 5612346 5624107 5635359 5646559 5658198 5669791 5680345 5689964 5700069 5711675 5724310 5737013
49080 5737013 5749370 5761061 5771433 5780505 5789591 5799916 5811142 5822090 5832401 5842550 5852843 5863549
49068 5863549 5875498 5889217 5903512 5916245 5926765 5936520 5946951 5957803 5968101 5977916 5988233 5999474
49056 5999474 6010967 6021953 6032490 6043063 6053579 6063226 6071456 6078789 6086292 6094414 6102910 6111908 6122228
49043 6122228 6134120 6146266 6156827 6165318 6172908 6181147 6190873 6202021 6213701 6224556 6233888 6242449
49031 6242449 6251524 6261248 6270573 6278941 6287105 6295997 6305683 6315864 6326636 6338043 6349407 6359943 6369789
49018 6369789 6379794 6390426 6401443 6412545 6423724 6434927 6445944 6456829 6468042 6479944 6492364
49007 6492364 6504752 6516480 6526870 6535315 6541828 6547500 6554106 6562971 6574180 6586840 6600006 6613243
48995 6613243 6626360 6639017 6650870 6662050 6673150 6684671 6696668 6708961 6721409 6733872 6746234
48984 6746234 6758688 6771730 6785526 6799498 6812970 6826065 6839442 6853107 6866170 6878138 6889918
48973 6889918 6902890 6917147 6931329 6944309 6956540 6969376 6983428 6997924 7011614 7023988 7035685
48962 7035685 7047966 7061708 7076690 7091824 7106274 7120230 7134395 7148926 7163403 7177753 7192487
48951 7192487 7207551 7221575 7233093 7242383 7251386 7261613 7272891 7284608 7297436 7312787 7330598 7348783
48939 7348783 7365494 7381247 7397843 7415462 7431988 7445688 7457605 7470386 7485203 7500837 7515694
48928 7515694 7529577 7543141 7556492 7569109 7580701 7591530 7602155 7613318 7625683 7639066 7652220
48917 7652220 7664068 7674950 7685955 7697259 7708093 7718412 7729438 7741972 7755022 7766979 7777726
48906 7777726 7788691 7800800 7813003 7823126 7830065 7835122 7841142 7850029 7861041 7871828 7881126 7889803
48894 7889803 7899077 7908680 7917486 7925223 7932387 7938902 7944158 7948504 7953450 7959906 7967101 7973743 7979516 7984879
48880 7984879 7990117 7995235 8000330 8005385 8010101 8014451 8018968 8023859 8028238 8031018 8032280 8033060 8033961 8034780 8035340
48865 8035340 8035822 8036138 8035745 8034411 8032716 8031607 8031754 8033255 8035400 8036831 8036661 8035505 8034743 8034713 8034531 8033911
48849 8033911 8034035 8035888 8038495 8039689 8038280 8034802 8030509 8026426 8023115 8020533 8018017 8014843 8010843 8006203
48835 8006203 8000879 7994599 7987227 7978753 7969292 7959493 7950448 7942489 7934542 7925535 7916182 7908251 7902134 7896264
48821 7896264 7889159 7880832 7871819 7862036 7851550 7841570 7833356 7826482 7819255 7810796 7801688 7792395 7782093
48808 7782093 7769684 7755403 7740738 7727021 7714651 7703525 7693504 7684160 7674584 7663954 7652199 7639734
48796 7639734 7626682 7612735 7597826 7582486 7567373 7552807 7538955 7526055 7514015 7502067 7489251
48785 7489251 7475265 7460622 7446092 7432193 7418990 7406115 7393112 7379994 7367169 7354557 7341245
48774 7341245 7326517 7310823 7295075 7279346 7263102 7246581 7230887 7216515 7202679 7188482 7173997
48763 7173997 7159693 7145396 7130451 7114616 7098305 7082124 7066471 7051423 7036764 7022225 7007768
48752 7007768 6993405 6978746 6963107 6946186 6928356 6910240 6892358 6875107 6858543 6842129 6825246
48741 6825246 6808062 6791317 6775176 6758959 6742193 6725267 6708738 6692674 6676871 6661020 6644390
48730 6644390 6626290 6607277 6588962 6571995 6555173 6537285 6518848 6500997 6483575 6465698 6447702
$$ [...]
##END NTUPLES=NMR SPECTRUM
##END=
