##TITLE=AC1553_ROEFFECT0015_8269100_z1duvgGJgS
##JCAMPDX= 6.0         $$ Bruker NMR JCAMP-DX V2.0
##DATA TYPE= NMR SPECTRUM
##DATA CLASS= NTUPLES
##ORIGIN= BRUKER
##OWNER= Administrator
$$ 1.72 TOPSPIN		Version 2.1
$$ 2013-10-12 18:30:16.499 -0700  Administrator@X
$$ Compression mode = diff/dup
##.OBSERVE FREQUENCY= 400.02188249412
##.OBSERVE NUCLEUS= ^1H
##.ACQUISITION MODE= SIMULTANEOUS (DQD)
##.ACQUISITION SCHEME= undefined
##.AVERAGES= 8
##.DIGITISER RES= 22
##SPECTROMETER/DATA SYSTEM= spect
##.PULSE SEQUENCE= zg30
##.SOLVENT NAME= COFFEE_meoh
##.SHIFT REFERENCE= INTERNAL, COFFEE_meoh, 1, 14.98509
##AUDIT TRAIL= $$ (NUMBER, WHEN, WHO, WHERE, PROCESS, VERSION, WHAT)
$$ ##TITLE= Audit trail, TOPSPIN		Version 2.1
$$ ##JCAMPDX= 5.01
$$ ##ORIGIN= Bruker BioSpin GmbH
$$ ##OWNER= Administrator
$$ $$ E:\/data/COFFEE/nmr/AC1553_ROEFFECT0015_8269100_z1duvgGJgS/10/pdata/1/auditp.txt
$$ ##AUDIT TRAIL=  $$ (NUMBER, WHEN, WHO, WHERE, PROCESS, VERSION, WHAT)
(   1,<2013-10-12 18:30:09.671 -0700>,<Administrator>,<X>,<go>,<TOPSPIN 2.1>,
      <created by zg
	started at 2013-10-12 18:29:03.860 -0700,
	POWCHK enabled, PULCHK disabled,
       configuration hash MD5:
       C8 4E 4E 5D D3 5C D8 9E 9F 52 82 E0 59 8A DE 15
       data hash MD5: 64K
       41 97 C2 1F 20 E5 5A BF B9 AF D2 A9 26 BD 22 01>)
(   2,<2013-10-12 18:30:12.656 -0700>,<Administrator>,<X>,<proc1d>,<TOPSPIN 2.1>,
      <Start of raw data processing
       efp LB = 0 FT_mod = 6 PKNL = 1 PHC0 = 0 PHC1 = 0 SI = 32K 
       data hash MD5: 32K
       37 FB DF DD 94 86 23 A4 E9 88 E4 7D A7 16 B8 66>)
(   3,<2013-10-12 18:30:12.937 -0700>,<Administrator>,<X>,<proc1d>,<TOPSPIN 2.1>,
      <pk PHC0 = 96.64124 PHC1 = 0 
       data hash MD5: 32K
       D5 A8 D4 B3 5E AA BC 21 6B 51 84 13 BD 0E 58 D8>)
(   4,<2013-10-12 18:30:13.046 -0700>,<Administrator>,<X>,<proc1d>,<TOPSPIN 2.1>,
      <abs ABSG = 1 
       data hash MD5: 32K
       90 07 67 EE EE DD 44 23 DB 28 DA 94 83 D2 29 1A>)
(   5,<2013-10-12 18:30:13.328 -0700>,<Administrator>,<X>,<proc1d>,<TOPSPIN 2.1>,
      <abs ABSG = 2 
       data hash MD5: 32K
       0C AF 8C 93 37 41 0B EB F6 9F 28 96 56 41 67 42>)
(   6,<2013-10-12 18:30:13.374 -0700>,<Administrator>,<X>,<proc1d>,<TOPSPIN 2.1>,
      <abs ABSG = 3 
       data hash MD5: 32K
       DC 7E BD 63 12 D8 9E 23 EF 88 02 51 8B D9 5F DA>)
(   7,<2013-10-12 18:30:13.453 -0700>,<Administrator>,<X>,<proc1d>,<TOPSPIN 2.1>,
      <abs ABSG = 4 
       data hash MD5: 32K
       CF 9E F9 40 21 6B 00 F9 4E A5 DE 56 32 DB 33 A1>)
(   8,<2013-10-12 18:30:13.499 -0700>,<Administrator>,<X>,<proc1d>,<TOPSPIN 2.1>,
      <abs ABSG = 5 
       data hash MD5: 32K
       E5 AB 43 28 C0 D1 6D 30 86 87 7F 12 70 DF D9 5C>)
$$ ##END=
$$ 
$$ $$ hash MD5
$$ $$ 6E 36 15 CD 5E EE 88 CE 7A 05 71 CD 17 30 DA C1
##$RELAX= 
##$RELAX= 
##$RELAX= 
##$RELAX= 
##$RELAX= 
##$RELAX= 
##$RELAX= 
$$ Bruker specific parameters
$$ --------------------------
##$DU= <E:\>
##$EXPNO= 10
$$ [...]
150 150 150 150 150 150 150 150
##$TP07= 0
##$TPNAME0= <>
##$TPNAME1= <>
##$TPNAME2= <>
##$TPNAME3= <>
##$TPNAME4= <>
##$TPNAME5= <>
##$TPNAME6= <>
##$TPNAME7= <>
##$TPOAL= (0..7)
0.5 0.5 0.5 0.5 0.5 0.5 0.5 0.5
##$TPOFFS= (0..7)
0 0 0 0 0 0 0 0
##$TUNHIN= 0
##$TUNHOUT= 0
##$TUNXOUT= 0
##$USERA1= <user>
##$USERA2= <user>
##$USERA3= <user>
##$USERA4= <user>
##$USERA5= <user>
##$V9= 5
##$VALIST= <valist>
##$VCLIST= <CCCCCCCCCCCCCCC>
##$VD= 0
##$VDLIST= <DDDDDDDDDDDDDDD>
##$VPLIST= <PPPPPPPPPPPPPPP>
##$VTLIST= <TTTTTTTTTTTTTTT>
##$WBST= 1024
##$WBSW= 4
##$XGAIN= (0..3)
0 0 0 0
##$XL= 0
##$YL= 0
##$YMAX_a= 634923
##$YMIN_a= -539815
##$ZGOPTNS= <>
##$ZL1= 120
##$ZL2= 120
##$ZL3= 120
##$ZL4= 120
##$ABSF1= 14.98509
##$ABSF2= -5.573092
##$ABSG= 5
##$ABSL= 3
##$ALPHA= 0
##$AQORDER= 0
##$ASSFAC= 0
##$ASSFACI= 0
##$ASSFACX= 0
##$ASSWID= 0
##$AUNMP= <proc_prof1d_extract_pilot.lims>
##$AXLEFT= 0
##$AXNAME= <>
##$AXNUC= <1H>
##$AXRIGHT= 0
##$AXTYPE= 0
##$AXUNIT= <>
##$AZFE= 0.1
##$AZFW= 0.1
##$BCFW= 0
##$BC_mod= 0
##$BYTORDP= 0
##$COROFFS= 0
##$CY= 15
##$DATMOD= 1
##$DC= 0
##$DFILT= <>
##$DTYPP= 0
##$F1P= 0
##$F2P= 0
##$FCOR= 0.5
##$FTSIZE= 32768
##$FT_mod= 6
##$GAMMA= 0
##$GB= 0
##$INTBC= 1
##$INTSCL= 1
##$ISEN= 128
##$LB= 0
##$LEV0= 0
##$LPBIN= 0
##$MAXI= 10000
##$MC2= 0
##$MEAN= 0
##$ME_mod= 0
##$MI= 0
##$NCOEF= 0
##$NC_proc= -8
##$NLEV= 6
##$NOISF1= 0
##$NOISF2= 0
##$NSP= 0
##$NTH_PI= 0
##$NZP= 0
##$OFFSET= 14.98509
##$PC= 1
##$PHC0= 96.64124
##$PHC1= 0
##$PH_mod= 1
##$PKNL= yes
##$PPARMOD= 0
##$PPDIAG= 0
##$PPIPTYP= 0
##$PPMPNUM= 2147483647
##$PPRESOL= 1
##$PSCAL= 4
##$PSIGN= 0
##$PYNMP= <proc.py>
##$REVERSE= no
##$SF= 400.02
##$SI= 32768
##$SIGF1= 0
##$SIGF2= 0
##$SINO= 400
##$SIOLD= 32768
##$SPECTYP= <>
##$SREGLST= <1H.CDCl3>
##$SSB= 0
##$STSI= 32768
##$STSR= 0
##$SW_p= 8223.68421052631
##$SYMM= 0
##$S_DEV= 0
##$TDeff= 65536
##$TDoff= 0
##$TI= <>
##$TILT= no
##$TM1= 0
##$TM2= 0
##$TOPLEV= 0
##$USERP1= <user>
##$USERP2= <user>
##$USERP3= <user>
##$USERP4= <user>
##$USERP5= <user>
##$WDW= 1
##$XDIM= 32768
##$YMAX_p= 447627682
##$YMIN_p= -734931
##$CURPLOT= <Network HP LaserJet P1505>
##$CURPRIN= <$Network HP LaserJet P1505>
##$DFORMAT= <normdp>
##$LAYOUT= <+/1D_H.xwp>
##$LFORMAT= <normlp>
##$PFORMAT= <normpl>
##$SURQMSG= 1
$$ End of Bruker specific parameters
$$ ---------------------------------
##NTUPLES= NMR SPECTRUM
##VAR_NAME=  FREQUENCY,     SPECTRUM/REAL,   SPECTRUM/IMAG
##SYMBOL=    X,             R,               I
##VAR_TYPE=  INDEPENDENT,   DEPENDENT,       DEPENDENT
##VAR_FORM=  AFFN,          ASDF,            ASDF
##VAR_DIM=   32768,         32768,           32768
##UNITS=     HZ,            ARBITRARY UNITS, ARBITRARY UNITS
##FACTOR=    0.250966925370066, 1,           1
##FIRST=     8223.43324360094, -78496,       -79737
##LAST=      0,             -33977,          -166569
##MIN=       0,             -734931,         0
##MAX=       8223.43324360094, 447627682,    0
$$ Real data points
##PAGE= N=1
##DATA TABLE= (X++(R..R)), XYDATA
$$ [...]
19559b57362A26060a04769B08399i3910M4960j89742B18824m9447N7011b11801
19548I6296m7848A8416F271J72849a63560J7123K5830I5086h1725N087C3686J49661
19536A83347b58769M4469A47970E045c2501k3906j9503d759B04115g5286a1147
19524a04517l357r5582n2389F2647a8244q9165j19875J0863a8193q3617m1879
19513a43689I2707J57671b5445j70800A61851C0999K04943a35003A2674b30892
19502A53171e7651E4679b27603C24249H5522a62057O1978A14096m1151c9214j2330
19491e1544A57063L1934a70823j5401B38957a42135A2835c79084a79124k2290
19481b01414g1963B08499a56603C6488b37144j93356a72885B34937g7036C3138
$$ plain form
19559 -257362 126060 -104769 208399 -93910 -48950 -238692 218824 169377 226388 -211801
19548 96296 48448 18416 6271 179120 -163560 -146437 -120607 95086 -81725 -76638 33686 183347
19536 183347 -258769 -214300 147970 5045 -32501 -56407 -75910 -4759 204115 -75286 -11147
19524 -104517 -107874 -203456 -255845 62647 -18244 -107409 -227284 -216421 -18193 -101810 -143689
19513 -143689 92707 250378 -25445 -196245 161851 30999 235942 -135003 12674 -230892
19502 153171 -57651 54679 -227603 324249 85522 -162057 -100079 114096 72945 -39214 -51544
19491 -51544 157063 188997 -170823 -186224 238957 -142135 12835 -379084 -179124 -201414
19481 -201414 -71963 208499 -156603 36488 -237144 -430500 -172885 234937 -77036 33138
19470A447N8901O5754a92392P4611j2837A13008P915b03807e2711q8870E2881
19458H384b318A52104D2343d31995K04414B2190c16454A33687l9854i081E2451
19446i2953j31746a04213A16685a46041P2026K45A66634k3179C3821a18946A09697
19434A205Q7945c67306D7994a01911E7334P1106a46711k49315n391A19790k4776
19423I5014J12442d1893k2699q497b622A98224a85352c9765A76600A229P9436
19412H0665C1494g5584C5073K079J65476a4927D3136R8373a5579j56910K6460
19401a46029b0039k1166J7802M178l42908A90032a33941L3782A71537O3366b27336
19389a22665C7417e44191J69632A76051c11397E7427f0443B1950d1959J8964j31276
$$ plain form
19470 1447 60348 126102 -192392 -117781 -130618 113008 120923 -203807 -52711 -141581 52881
19458 8384 -2318 152104 42343 -431995 -227581 22190 -316454 133687 93833 -9081 52451
19446 -92953 -224699 -104213 116685 -146041 -74015 -73770 166634 143455 33821 -118946 109697
19434 1205 89150 -367306 47994 -101911 57334 128440 -146711 -396026 -401417 119790 95014
19423 95014 207456 -41893 -64592 -73089 -2622 198224 -185352 -39765 176600 1229 80665
19412 80665 31494 -75584 35073 37152 202628 -14927 43136 141509 -15579 -172489 -146029
19401 -146029 -20039 -41205 -23403 -19225 -362133 190032 -133941 -100159 171537 234903 -227336
19389 -122665 37417 -544191 -374559 176051 -311397 57427 -60443 21950 -41959 -22995 -154271
19378a54271B84066c3390H8880i4417B649P8739b08623O3904e8340j178A55677
19366b38867o9376A623R759J01138a22342B39434p9104P9269a25280j21114m0435
19355b86829a22710J4693G5993a6759D4091a84674d193A2638b97817O4878b3918
19343c05350g3922J0338k50721D8357b52636a26285k38365o6042H4393d1045j02266
19332a43311A77615l0692o0073f5261l29617G3759b81853J13389j02959c6968
19321a05417M2112j08193N5671n5062n7849g6390C6839g9802B57554a16164J5447
19310a00717m7575B145J52136f9480F6338b70229B85574c16408B37395b90108
19299c88274O4046a21813e228j40571J4951A8748c23259C1274c21442J07933H6872
$$ plain form
19378 -154271 284066 -33390 88880 -94417 2649 81388 -208623 -144719 -58340 -59518 155677
19366 -238867 -308243 1623 11382 112520 -122342 239434 160330 239599 -125280 -246394 -286829
19355 -286829 -122710 -108017 75993 -16759 44091 -184674 -4193 12638 -297817 -232939 -23918
19343 -305350 -73922 -63584 -314305 48357 -252636 -126285 -364650 -430692 84393 -41045 -143311
19332 -143311 177615 146923 86850 -65261 -394878 73759 -281853 -168464 -271423 -36968
19321 -105417 -63305 -171498 -115827 -170889 -228738 -76390 36839 -79802 257554 -116164 -100717
19310 -100717 -148292 2145 154281 -69480 66338 -270229 285574 -316408 237395 -290108
19299 -388274 -324228 -121813 -5228 -145799 -130848 18748 -323259 31274 -321442 -213509 86872
19287G0296g6441A56931f6158b002F1520a05084A26372c17012J05693A11717g4826
19275c4272n01B39483r1794a10303j77371K6087L5533Q5766D8294f1446G5779
19263B9788a40522H9021j4010J75276a43349L5547o2353C8054c2608k1389A23431
19251B5511b98742e0147j25710j50720Q5266f4563K9089k51087f1678j01869A85582
19239b66697G6921b27081m653G3298d127m823n7699j01613B07672I909N1613A3496
19226A8448a98544E2153a34375E2397c3584H6398C3287d37851E8796h4249A81821
19214i681j92698j02641E0426a57823B9652K72215A22926f3896j62174f2332A3684
19202a81815O1712D7672c20533a297B0854d8900A70051a84583g9943k35591B0488
$$ plain form
19287 70296 -76441 156931 -66158 -2002 61520 -105084 126372 -317012 -211319 111717 -74826
19275 -34272 -34773 239483 147689 -110303 -287674 -261587 -226054 -140288 48294 -61446 75779
19263 29788 -140522 89021 75011 250287 -143349 -107802 -170155 38054 -32608 -53997 123431
19251 25511 -298742 -50147 -175857 -326577 -241311 -64563 -35474 -286561 -61678 -163547 185582
19239 -266697 76921 -227081 -231734 73298 -4127 -8950 -66649 -168262 207672 9909 61522 13496
19226 18448 -198544 52153 -134375 52397 -33584 86398 33287 -437851 58796 -84249 181821
19214 -9681 -202379 -305020 50426 -157823 29652 301867 122926 -63896 -226070 -62332 13684
19202 -181815 -120103 47672 -320533 -1297 20854 -48900 170051 -184583 -79943 -315534 20488
19190c50951d2556j01909j25058h4187a6139k34186k05120F3905G402N4877c29193
19178D9290k3730b3764A34446n0425C3870a05637o2183m6446a4563A34180D3413
19166b57449d368F9688c89505h7389K9547q2023M3183b0366k0639C4472a11101
19154a61461C20b53471A99451i9199m8023C3942b17859I099a49859A503J38271
19143A39774b44309A0025a08486j91802I159J8359Q0225a66592j01162B56258
19132e9906k11785a29900O4602j24994f274B78557A10253b41694E5192N0083K91463
19121C96738d9756B38197I102O8044a31639A9350n118b00422Q1025E4204N7611
19110A11815m5380c5272j12777I4865i1136j46762C1013b44328A09124d229B9109
$$ plain form
19190 -350951 -42556 -144465 -269523 -84187 -16139 -250325 -455445 63905 7402 62279 -329193
19178 49290 25560 -23764 134446 84021 33870 -105637 -167820 -214266 -14563 134180 43413
19166 -257449 -4368 69688 -389505 -87389 -57842 -139865 -96682 -20366 -41005 34472 -111101
19154 -161461 320 -253471 199451 -99199 -147222 33942 -217859 9099 -149859 1503 139774
19143 139774 -244309 10025 -108486 -300288 9159 27518 107743 -166592 -267754 256258
19132 -59906 -271691 -129900 -65298 -190292 -6274 278557 110253 -241694 55192 105275 396738
19121 396738 -49756 238197 9102 77146 -131639 19350 14232 -200422 -119397 54204 111815
19110 111815 66435 -35272 -148049 94865 -91136 -237898 31013 -244328 109124 -4229 29109
19098A04940a60529A36270g2952p1323j7886D6775K0029b39768a1924l3224p5499
19087a20647k28437g0754C36893b53064B11160a72814a6992l20668I4670k5986
19077F8684d00102J90122k6387B53256I6525b52708b5899l5066H6625R1838g4502
19065c5327d181B99087a47317k9100B83753a51738A92145b09189Q7773j2859A31957
19053B62342c128j03452D09060E5192a96757E4692J57650c4294j95017Q8392J4235
19042a26684o2526f3442a2069B6941h1470o0611e4156k17767A41602a17456a0521
19030f8709B5546R8441Q1015l790o7612e044C64073f6795A92622o9475b36472
19018a16764G7716R943K81097I9750a32278d7113C2497K65779G5158h9364j79212
$$ plain form
19098 104940 -160529 136270 -72952 -144275 -162161 46775 66804 -239768 -11924 -45148 -120647
19087 -120647 -349084 -70754 336893 -253064 211160 -172814 -16992 -337660 94670 68684
19077 68684 -400102 -209980 -236367 253256 96525 -252708 -25899 -60965 86625 178463 -74502
19065 -35327 -4181 299087 -147317 -176417 283753 -151738 192145 -209189 -121416 -134275 131957
19053 262342 -3128 -106580 409060 55192 -196757 54692 212342 -34294 -229311 -140919 -126684
19042 -126684 -189210 -63442 -12069 26941 -81470 -142081 -54156 -271923 141602 -117456 -10521
19030 -68709 25546 123987 205002 201212 133600 -5044 364073 -66795 192622 123147 -236472
19018 -116764 77716 87659 368756 99750 -132278 -47113 32497 298276 75158 -89364 -268576
19007b68576i7814B94139b02037o0967p7531J02337F0825f7772H8777a59671q4715
18996b44386A4173b6392I753J19506J63884e5985A89930C0818E316d73975a91471
18984e2659h153B6812b68027i0070n8497A66994c9591C88045H5292A4749a98354
18972e5519l03537j61402D5312O573f8695b2809j5135D6803a20991k1139r3760
18961b35890H9022K32911A22412b39237B8262J41412H0149d3858B0016b44248
18950A41063c2089r1081L166H7815f4414j58545m4155B37224c01732I1271a63886
18938b89772P0770L1876h8777a6329r8996H6758a47836M8903a767j08162A4538
18926a59875L6120A73985e511l33450e0412j02041a7667A78252h539A52800g3893
$$ plain form
19007 -268576 -97814 294139 -202037 -263004 -340535 -238198 60825 -67772 88777 -159671 -244386
18996 -244386 14173 -26392 9753 129259 293143 -55985 189930 30818 5316 -473975 -191471
18984 -52659 -8153 26812 -268027 -90070 -148567 166994 -39591 388045 85292 14749 -198354
18972 -55519 -359056 -520458 45312 51885 -68695 -22809 -37944 46803 -120991 -142130 -235890
18961 -235890 89022 321933 122412 -239237 28262 169674 80149 -43858 20016 -244248
18950 141063 -32089 -123170 -120004 87815 -64414 -222959 -267114 237224 -301732 91271 -163886
18938 -289772 -219002 -187126 -88777 -16329 -115325 86758 -147836 -98933 -1767 -109929 14538
18926 -159875 -123755 173985 -5511 -338961 -50412 -152453 -17667 178252 -8539 152800 -73893
18914H1538J2797E664K4710b20462i3879A21791b26036H2360c69889a26956A93411
18902a85423M9078q8761b2429D9275B1350J25146a0477k01477J350K1199B6073
18890i5302B0435L30800C1044b48754O7758Q1747D70427B4549a24871C04214j50440
18879A53774a49327N7872B63021I251K2383a34550j24780F0359b29109a06682
18868A59323a47383K0672G4538p557b34307C2899a47419H9459a52570l12313A06260
18856b10591j7738A02012a1028A0385e8526A76469a33757C37400m6018g3404b5937
18844d60064A44324a29434d3991G7102A198O2244b76612A46079b39836J19785
18834a20051A6757b50325N1768b4215j87660a00373k5483c3527F7524b0864C53250
$$ plain form
18914 81538 94335 5664 30374 -220462 -93879 121791 -226036 82360 -369889 -126956 193411
18902 -185423 -136345 -225106 -22429 49275 21350 146496 -10477 -211954 -210604 -189405 26073
18890 -95302 20435 351235 31044 -248754 -180996 -99249 470427 24549 -124871 304214 153774
18879 153774 -149327 -91455 263021 9251 31634 -134550 -259330 60359 -229109 -106682
18868 159323 -147383 -126711 74538 66981 -234307 32899 -147419 89459 -152570 -464883 106260
18856 -210591 -228329 102012 -11028 10385 -58526 176469 -133757 337400 291382 -73404 -25937
18844 -460064 144324 -129434 -43991 77102 1198 63442 -276612 146079 -239836 -120051
18834 -120051 16757 -250325 -198557 -24215 -211875 -100373 -125856 -33527 67524 -20864 353250
18822a99611H5714h2933A80166a42870e0677C3924J36402B990J26870D223N1406
18811E5629J17822M5668j9182j0968g0528I9199h2603p2592a8751B75027g8229
18799d31180R2877e7258n5000E8363a59380A57749a65306m9149J03229a5127B17516
18787a63090N7820b4066j82317N9289c7997A97772a20202j30969a09479r4545
18777b04024o031b67q6599F159b33845i1224p8321O4250D2388K27481a05845D5730
18764a62774A32980c39357C68183i2780r4744f3613l00902c2561j73603B2406
18753b59541e7908A58894a24672D07721E6225c50403J62835c2083k7497A63421
18742i4606c3148J0931F8367b52525a16207J1370A23896e7391j42098r5011b8025
$$ plain form
18822 -199611 85714 -82933 180166 -142870 -50677 33924 170326 2990 129860 4223 55629
18811 55629 173451 219119 199937 188969 -70528 99199 -82603 -155195 -18751 275027 -78229
18799 -431180 -338303 -57258 -112258 58363 -159380 157749 -165306 -214455 -111226 -15127 217516
18787 -163090 -105270 -24066 -206383 -147094 -37997 197772 -120202 -251171 -109479 -204024
18777 -204024 -210055 -267 -86866 6159 -233845 -91224 -169545 -105295 42388 269869 -105845 45730
18764 -162774 132980 -339357 368183 -92780 -187524 -63613 -364515 -32561 -206164 22406
18753 -259541 -57908 158894 -124672 407721 56225 -350403 -187568 -32083 -59580 163421
18742 -94606 -33148 -22217 68367 -252525 -116207 -104837 123896 -57391 -199489 -294500 -28025
18730a66072G6642G284e2311B678a45322B79445b02818f3382k4457k0694E3907
18718c62812f7633G0402a29215k1169F9520a13772j48242I9925a54237D7448h1319
18706b16860h2120k19807A2714M1478J28130c97090C79779b2869I9601P4377g7756
18694f266A14092e6041B924b462D3195a89302m669C1148a44050K8584H1430b10217
18681b32540A17863i7957K4265B12529p2879c65312I5802g0630k50973a4634j07094
18670a21728F765M70041c4264n1934j62941I477i8164j7509C0296a68130g0170
18658A64409n9800a47417c847j27243r8845g453k0187j63936h8470A83940a69987
18646E7301b94682A14854a44497r3915A00048D5767a6890j83884o0098b2705H4167
$$ plain form
18730 -166072 76642 7284 -52311 2678 -145322 279445 -202818 -63382 -87839 -108533 53907
18718 -362812 -67633 70402 -129215 -150384 69520 -113772 -262014 99925 -154237 47448 -81319
18706 -216860 -82120 -301927 12714 54192 182322 -397090 379779 -22869 99601 173978 -77756
18694 -6266 114092 -56041 2924 -2462 43195 -189302 -193971 31148 -144050 -115466 81430 -210217
18681 -232540 117863 -97957 -73692 212529 139650 -365312 95802 -70630 -321603 -14634 -121728
18670 -121728 6765 476806 -34264 -86198 -249139 9477 -98164 -115673 30296 -168130 -70170
18658 164409 104609 -147417 -3847 -131090 -229935 -7453 -27640 -191576 -88470 183940 -169987
18646 57301 -294682 114854 -144497 -238412 100048 45767 -16890 -200774 -260872 -22705 84167
18634h2829A52314j0205l1578b33896j15800a2802k26872J07332C76680a03383
18623i168r5456H9543a31453p4570b0702C8420J58176K6657a42974b0190j83143
18612b03333N8463d5602h581n3974j3511F6894e112I8077i3298m7769O2506j75712
18600b54273m0947B40447d17974b6779k5213j06282f9530n3085I415M9776c80276
18588b84632E6254J71988b76011R5823e6384q833B13834a51269O9461m7154a966
18576c5750P183A8534f26H3584O8820B3992b16655o6941q4895J38018L1405G3627
18563b09305G652c60685a13164O2j00048A89465a60968d1521l269j75125A39015
18551b31452r844A16739C3958g1294C8685c5215o8690A84749E4084P9951f5779
$$ plain form
18634 -82829 152314 142109 110531 -233896 -349696 -12802 -239674 -132342 376680 -103383
18623 -9168 -104624 89543 -131453 -206023 -20702 38420 196596 223253 -142974 -20190 -203333
18612 -203333 -144870 -45602 -8581 -62555 -76066 66894 -5112 98077 -93298 -141067 -78561 -254273
18600 -254273 -295220 240447 -417974 -26779 -51992 -158274 -69530 -122615 9415 59191 -380276
18588 -284632 56254 228242 -276011 -180188 -56384 -65217 213834 -151269 -81808 -128962 -1966
18576 -35750 -28567 18534 -626 83584 152404 23992 -216655 -283596 -368491 -230473 -199068 73627
18563 -209305 7652 -360685 -113164 -113102 -213150 189465 -160968 -41521 -44790 -219915 139015
18551 -231452 -241296 116739 33958 -71294 38685 -35215 -103905 184749 54084 134035 -65779
18539d4878k2362r8938d9703C03030K09911f3110A45797a66450C57302b16553
18528a45073N5830B45529b71044g2904A4198J32136e0798A02404M5576a03831
18517e5713A86042F5841K05579b536C04279A48841c06814h1737A30227C3826M2917
18506G6743Q1862d86667A28436a54013p3809k5213R3586j84065A24651a68191
18495b2750l14833i0428j19325A6915K75701d5468j88009B69757f3574C0501L57663
18484C88164a24417j4791o0586L87B6245d29338A77723f8328j27920M6065k07383
18473c57566B87845G0551K68552G0223K1296d0278A36938d20610f5957k6068n3950
18462a45975j00264k7242a22189C87950c40230a24444j30239A1199b37054f3743
$$ plain form
18539 -44878 -67240 -166178 -49703 303030 512941 -63110 145797 -166450 357302 -216553
18528 -145073 -89243 245529 -271044 -72904 14198 146334 -50798 102404 147980 -103831
18517 -55713 186042 65841 271420 -2536 304279 148841 -306814 -81737 130227 33826 76743
18506 76743 158605 -486667 128436 -154013 -227822 -253035 -159449 -343514 124651 -168191
18495 -22750 -337583 -90428 -209753 16915 292616 -45468 -233477 269757 -63574 30501 388164
18484 388164 -124417 -139208 -199794 -199407 26245 -429338 177723 -68328 -196248 -150183 -357566
18473 -357566 287845 70551 339103 70223 91519 -40278 136938 -420610 -65957 -92025 -145975
18462 -145975 -246239 -273481 -122189 387950 -340230 -124444 -254683 11199 -237054 -63743
18451h76k17105j93975J33794h244q6407b3316n5830M404G2553b53883a1267q3855
18439i5122I1305B3340J01938c73976F365a6584n7186o6019C783L2852L8083a42335
18426d36842J59870a15925J1729A35318c3877l05704G5024l890K85525a2846C9881
18414a88846d7893A76801N9081k2920a94547A51394J80753A49117m8509f5984
18403a67724C12675a82916G5143O0253i6036j40439C29070a36554A90091q8885
18393A01206g5324a0877j25543A58975g8120j38302F4949K00351i7253K8266k48374
18382c17361J44500A02691g8916A26565F2250q86b27747C85528c1219d366F5442
18370I5375a38651M9024A95573e28446a83333A39253M5504i3847A97793I7445
$$ plain form
18451 -876 -217981 -411956 -278162 -8244 -94651 -23316 -79146 -74742 72553 -253883 -11267 -95122
18439 -95122 91305 23340 125278 -373976 6365 -16584 -73770 -139789 3783 36635 74718 -142335
18426 -436842 -276972 -115925 -104196 135318 -33877 -339581 75024 71134 356659 -12846 39881
18414 -188846 -47893 176801 235882 212962 -194547 151394 332147 149117 100608 -65984
18403 -167724 312675 -182916 75143 135396 -96036 -236475 329070 -136554 190091 101206
18393 101206 -75324 -10877 -136420 158975 -78120 -216422 64949 265300 -97253 -68987 -317361
18382 -317361 -172861 102691 -78916 126565 62250 61364 -227747 385528 -31219 -4366 65442
18370 95375 -138651 -89627 195573 -528446 -183333 139253 184757 -93847 197793 97445
18359A56678a43263j86733A01235c9389A62804b57368e6156C1485c13445A78183
18348d33037A21047b18818L0702d8343A03697c2537l0841C4364J6018N8311i7383
18336a69203I7611d8012l38559e6684l8768k5369o341b513C70950D0190K0287
18325F0477B9466J1326i2879B84596b91274c9931C99792A79068a73966c9115p1924
18314a11039M4466n5518F9876a36469b5534A63060a7406I212a95675B93247b20265
18302b02624m6993A09392Q6741q7835a61967L5087H1319d7291A10210D9219c0170
18290d6792J2770B14762a17905A85079b51705b9812j63717A32728d66411a10704
18279a64230C56163d0526A1723a27303A38525f6173J3789j88004K7034c8312A24763
$$ plain form
18359 156678 -143263 -329996 101235 -39389 162804 -257368 -56156 31485 -313445 178183
18348 -433037 121047 -218818 -188116 -48343 103697 -32537 -63378 34364 50382 108693 -97383
18336 -169203 97611 -48012 -386571 -56684 -95452 -120821 -127162 -2513 370950 40190 60477
18325 60477 29466 40792 -92879 284596 -291274 -39931 399792 179068 -173966 -39115 -111039
18314 -111039 -66573 -122091 69876 -136469 -25534 163060 -17406 9212 -195675 293247 -220265
18302 -202624 -249617 109392 196133 108298 -161967 -126880 81319 -47291 110210 49219 -30170
18290 -46792 -34022 214762 -117905 185079 -251705 -29812 -193529 132728 -466411 -110704
18279 -164230 356163 -40526 11723 -127303 138525 -66173 -52384 -240388 -213354 -38312 124763
18267a65108A6684J49495c84455A41285o0406j1058e6520j87414A20782l4074
18257H6708G869L7565a77357H5573K0856J70899A21042i0812A74867b10910h3915
18245B43056b3583C38283a03399J0364j25124G7992a86869P8012B01704c497C12704
18233d2937o1999A27162r416a6078p6334A18965c50421J12333A31495A4307R4194
18222A08501N1436h4369m6132A79500a17728l6650n7029J4008k9435g9684k8438
18211a08122c8216p8617Q289j32088q7050N7060K4848F640K1764c94835E7993
18199h7263j80997a23752p8829D12198a32578o778K7259B82063a26180B02422
18188a08212N1396K7989B1886c88928J76885A07271b74904H455f6641J3002o8932
$$ plain form
18267 -165108 16684 166179 -384455 141285 80879 69821 -56520 -243934 120782 86708
18257 86708 7869 45434 -177357 85573 106429 277328 121042 -90812 174867 -210910 -83915
18245 243056 -23583 338283 -103399 -93035 -218159 77992 -186869 -108857 201704 -3497 312704
18233 -42937 -104936 127162 117746 -16078 -92412 118965 -350421 -238088 131495 14307 108501
18222 108501 159937 -84369 -130501 179500 -117728 -154378 -211407 -197399 -226834 -79684 -108122
18211 -108122 -38216 -116833 -108544 -240632 -327682 -270622 -245774 6640 28404 -394835 57993
18199 -87263 -268260 -123752 -202581 412198 -132578 -139356 -112097 282063 -126180 202422
18188 -108212 -56816 -28827 21886 -388928 -212043 107271 -274904 8455 -66641 -53639 -122571
18177a22571M9439k17634B13821F1942a39662A80107F5653j5941b23548B1165
18166c30630Q3037G9730A6067J18747a04013o1874m311B6809d05216a27464I2529
18154c60575F8258a83336f3259l75196b10836C4075b99273E9793J90614c24380
18143A74547C120a24075j64473j63056E0892a4993H5314d8221j3783A47698N4947
18132B02645M5363i4648d414B74372f5397l057A65167b8115j66639b4113j19200
18121a43313k7528c6557A6927K16646j00472B0085a85164d2859l36653B6642a81138
18109a59317I8118i8308j08662J03057I5587J02526a40487b3906m7555A13040
18098b92372G6556K68431e7491o5963H909M4307K11067j06157O5128c7959j23881
$$ plain form
18177 -122571 -73132 -290766 213821 61942 -139662 180107 65653 49712 -223548 21165
18166 -330630 -247593 79730 16067 134814 -104013 -165887 -170198 26809 -405216 -127464 92529
18154 -360575 68258 -183336 -63259 -438455 -210836 34075 -299273 59793 250407 -324380
18143 174547 3120 -124075 -288548 -451604 50892 -14993 85314 -48221 -62004 147698 202645
18132 202645 248008 -94648 -4414 274372 -65397 -68454 165167 -28115 -194754 -24113 -143313
18121 -143313 -170841 -36557 16927 233573 133101 20085 -185164 -42859 -379512 26642 -181138
18109 -159317 98118 -98308 -206970 -103913 95587 198113 -140487 -23906 -71461 113040
18098 -292372 76556 344987 -57491 -123454 8909 53216 264283 158126 223254 -37959 -161840
18087a61840A86262m1132j6453b47450H5578b52267A37151m24A3516c08028J34430
18076a73598q775O8981C07507i0122M4918B49950c21806a38819e6373A39499e3563
18064a68276C76284a08861j35687J09464B10476o4611M0579J8997c5390j16566
18054a51956e2147j64929a9753B19320c24967j32534e5569j022C68941a47078
18043A60918J74152c30135F3402J75435b07934C3181a608A32412l0252b96665
18032A72377b90242i2044A45246J37557c5141I3102A5145e3854C13892a80594
18021i087j85306N2813p2639E3882a29731J0509r0625D6403h0664B21849i7184
18009i3285l5657j66330O803L1540a5698p4072c3065H0019a19570j8402j27512
$$ plain form
18087 -161840 186262 145130 128677 -247450 85578 -252267 137151 136727 13516 -308028 -173598
18076 -173598 -182373 -113392 307507 -90122 -45204 249950 -321806 -138819 -56373 139499 -53563
18064 -168276 376284 -108861 -244548 -135084 210476 145865 186444 205441 -35390 -151956
18054 -151956 -52147 -217076 -19753 219320 -324967 -457501 -55569 -56591 368941 -147078
18043 160918 335070 -330135 63402 238837 -207934 33181 -1608 132412 102160 -296665
18032 172377 -290242 -92044 145246 282803 -35141 93102 15145 -53854 313892 -180594
18021 -9087 -194393 -141580 -214219 53882 -129731 -119222 -209847 46403 -80664 221849 -97184
18009 -93285 -128942 -295272 -288469 -256929 -15698 -89770 -33065 80019 -119570 -137972 -265484
17998b65484B72911D3864b48812i1705m9797A35777J13428a69303k69120M7874
17988c90549E2932a53602D8570J24263b63913J06470A37670a06392A7647a43776
17977C8165b03499f0610j87451A12316K5696A6677J50160h7965P754l4724F6934
17965I8417f7108B0063J48703G8775c6108A68110d99706A63240a55019c3893B99322
17953g2394A51614a12256l7913D62a9839p6318l02975B22996d26499H4030a4604
17941b0229A82999j1719g771A12993M8439i6894B88029C6237K7345i4255A29124
17929h507k80345c3488j39206A41025a82124j26097A77338c20293f7332F5243
17918A78709a08474B13815c22635F4306a90045d8386I6342e4404j73563A40119
$$ plain form
17998 -265484 272911 43864 -248812 -91705 -141502 135777 249205 -169303 -438423 -390549
17988 -390549 52932 -153602 48570 172833 -263913 -157443 137670 -106392 17647 -143776
17977 38165 -203499 -60610 -248061 112316 138012 16677 166837 -87965 -80211 -114935 66934
17965 98417 -67108 20063 168766 78775 -36108 168110 -499706 163240 -155019 -33893 299322
17953 -72394 151614 -112256 -150169 462 -19839 -96157 -399132 222996 -426499 84030 -14604
17941 -20229 182999 171280 -7771 112993 161432 -96894 288029 36237 63582 -94255 129124
17929 -8507 -288852 -33488 -172694 141025 -182124 -308221 177338 -320293 -67332 65243
17918 178709 -108474 213815 -322635 64306 -190045 -48386 96342 -54404 -227967 140119
17907f1590A80467a68592b0356D0347h8520K7175E8994e585k82396a27848M2916
17896h4932C39821h8067C18278c6515j18316q2793j19819a53228a4706j00025
17886a14731A60015a64919A75827J4778i9932D16129f732l72219A37006m6332
17876I0674J37195F1020b58700A05653J04128a29736E9632A009a28344c6767n4428
17865i1195K8918j78376e1789B00539J5180O4035a08325A06550Q7652A8195a80482
17853b37192l5726c1851k61406e8050A29752D185d4526m377j49711E8843k4558
17842C4285b5829D449e12764g2448l7655b425j14985j06605J1302b726A29252
17830A25628a80304A98331h3438A23414g9897A59259g9178B83552b28014A72299
$$ plain form
17907 -61590 180467 -168592 -20356 40347 -88520 -61345 58994 -5585 -287981 -127848 -84932
17896 -84932 339821 -88067 318278 -36515 -154831 -237624 -357443 -153228 -14706 -114731
17886 -114731 160015 -164919 175827 190605 -99932 416129 -6732 -378951 137006 90674
17876 90674 227869 61020 -258700 105653 209781 -129736 59632 1009 -128344 -36767 -91195
17865 -91195 -62277 -240653 -51789 200539 215719 279754 -108325 106550 194202 18195 -180482
17853 -237192 -272918 -31851 -293257 -58050 129752 4185 -44526 -48903 -198614 58843 34285
17842 34285 -25829 4449 -512764 -72448 -110103 -2425 -117410 -224015 -212713 -2726 129252
17830 125628 -180304 198331 -83438 123414 -79897 159259 -79178 283552 -228014 172299
17819f4278C871L00010a26618A09039N7988c5164C20531n4968f7595j31300C38832
17807D5849a58487C67016e8006E5238i7667B45096C2167c36420b4719h306G8370
17795C0037a96964b3683r6640j27011A06496j1869R9010F9653J64753b95991A95130
17783b25622C40888D1413d86571d3920q1885C5329a58177B79437J1907j25678
17773A65666h76j40983e5423G038c35377J42376j22295o723B00279i0461k3687
17762a14148c7962B02437a34049I070k103a25158f1418C4349a59137A42513a66339
17750b91037A29761G286K81287C383i011a837k38444B23187r2574a55713m8499
17739b04212E6879r130j7632J21094R566b3112k52629A64894B1844K12540o3289
$$ plain form
17819 -64278 3871 303881 -126618 109039 167027 -35164 320531 265563 -67595 -198895 338832
17807 45849 -158487 367016 -58006 55238 -97667 245096 32167 -336420 -24719 -8306 78370
17795 30037 -196964 -23683 -120323 -247334 106496 94627 193637 69653 234406 -295991 195130
17783 -225622 340888 41413 -486571 -43920 -125805 35329 -158177 279437 291344 165666
17773 165666 -876 -141859 -55423 7038 -335377 -193001 -315296 -322019 200279 -90461 -114148
17762 -114148 -37962 202437 -134049 9070 6967 -125158 -61418 34349 -159137 142513 -166339
17750 -291037 129761 7286 288573 3383 -9011 -1837 -240281 223187 130613 -155713 -204212
17739 -204212 56879 47749 30117 151211 160777 -23112 -275741 164894 21844 234384 171095
17728A71095a25355O1198j6812B37278a035A00906i7050B0335a5562p484l2528
17717e5574j15456C8319Q411k2667a74202B82243A24396c35482B15452h404r4966
17706a03370A88794e13542A64497g4797C6597J14237i1554B92846A31914a25728
17695C6332L86243G760J20876J51585A9178c2807r2816D36230d4730F4568a23008
17683B15b2029c004H6069a7257q1009k46295a09987A85736h8011A0493d8153m1690
17671h9843B28040a47103A65933a9942A8387a71596A06755d6961g136C35022b26812
17659A32318a20734L6093L0915D965J35973b92172E4147L5762k0415a21587n9237
17648a80824e9734k04452a27347A0000a1844F5276J1800J08893a23677r9521D72694
$$ plain form
17728 171095 -125355 -64157 -80969 237278 -1035 100906 -97050 20335 -15562 -23046 -55574
17717 -55574 -171030 38319 46730 24063 -174202 282243 124396 -335482 215452 -8404 -103370
17706 -103370 188794 -513542 164497 -74797 36597 150834 -91554 292846 131914 -125728
17695 36332 422575 7760 128636 280221 19178 -32807 -125623 436230 -44730 64568 -123008
17683 215 -22029 -3004 86069 -17257 -98266 -344561 -109987 185736 -88011 10493 -48153 -89843
17671 -89843 228040 -147103 165933 -19942 18387 -171596 106755 -46961 -7136 335022 -226812
17659 132318 -120734 -84641 -53726 4965 140938 -292172 54147 89909 69494 -121587 -180824
17648 -180824 -59734 -264186 -127347 10000 -11844 65276 77076 185969 -123677 -223198 472694
17636A22903J57864H20h6053B92145H5489C3050e1960h495j44495L9226A84993
17624A92139o4824j3699J80421b4889E3013d0183l2324m0934C03850h7881c6939
17612e7952D8579b16266H8336J1506P2404k6390n1121A2015J65725K22127h8131
17600b8777E0770a70013g6225A6731K42298a70513q1403I4876J22693g9322j58832
17589b38154o0411A30110b53046R9338j40533a45677l8836g7119B12743R7446
17579C10189i202K110l35029G09J46386A5084K9903K38799O5577j21139l8637
17568A89587e8234B33170o2945b77780A72659F3274J43380g0971D5272L3994d6095
17556E3425j5581c34137R5673E3021M29231c8799j72700B9251N6155C8559J60120
$$ plain form
17636 122903 280767 820 -86053 292145 85489 33050 -51960 -8495 -152990 -113764 184993
17624 192139 127315 113616 294037 -24889 53013 -40183 -72507 -113441 303850 -87881 -36939
17612 -57952 48579 -216266 88336 99842 172246 145856 94735 12015 177740 399867 -88131
17600 -28777 50770 -170013 -76225 16731 259029 -170513 -251916 94876 217569 -79322 -238154
17589 -238154 -298565 130110 -253046 -153708 -294241 -145677 -184513 -77119 212743 310189
17579 310189 -9202 -7092 -342121 709 147095 15084 44987 283786 349363 228224 189587
17568 189587 -58234 233170 170225 -277780 172659 63274 206654 -70971 45272 79266 -46095
17556 53425 37844 -334137 -238464 53021 482252 -38799 -211499 29251 85406 38559 198679
17545A98679a64268e8636j58109E8138K16052H6248B1290K70384F9452B3159L8498
17534F1657J1886J96020Q7048a306B25919B7836K0834f9793A31050K08563g4609
17522B54769a56527c2007p5499C6286K05942a68751N0547B94711a70106a6112
17511I3672i0287B00027h1161B47546a59631A03903J55653a65028B47786B3157
17500D50995H5900l1167a56968D36317p2666j12164D3975a49006A98440c1200
17489A15420i3703B45814j01552L08229g4153B03246a4216F5166B0367K52375
17479B72742H7262J94475a54690I9560L76121b31814C33542A21152H404M9860
17469E8264J72310j1448a37234G8505B566K14988O769p7946L15265a6358G699
$$ plain form
17545 198679 -164268 -58636 -216745 58138 274190 86248 21290 291674 69452 23159 61657
17534 61657 73543 269563 356611 -1306 225919 27836 48670 -69793 131050 339613 -74609
17522 254769 -156527 -32007 -107506 36286 242228 -168751 -118204 294711 -170106 -16112
17511 93672 -90287 200027 -81161 247546 -159631 103903 259556 -165028 247786 23157
17500 450995 85900 54733 -156968 436317 363651 251487 43975 -149006 198440 -31200
17489 115420 -93703 245814 144262 452491 -74153 203246 -14216 65166 20367 272742
17479 272742 87262 281737 -154690 99560 475681 -231814 333542 121152 8404 58264
17469 58264 230574 219126 -137234 78505 2566 217554 224323 146377 461642 -16358 7699
17457C7575J78440n9428J24753d8384F9897J69307r0442J79948A12697J79011
17447B91708H9449K08684J80910k39092C4680L01995j29043p3243Q5154H0239
17436A79260L8222C9833d5910j29394f4954C96074j78436C8255K23947J03147
17426C65349E0615a73759B13622c8783j17940d1995C41466I6145K74801p3751
17416B97195R10K19179A76910J51001P216A39555K23413b63684e0737B00287o5879
17405A34408b48074f1062M323A52102K1096H6487J19895a57472A12513b36091
17394d0847B49214n1175P0855M8917c5647j25114A57010C0116a20052c8252B56769
17382A3329M34266A84120m4725M3346r1146C1429b90885A21582h6529B70161f9768
$$ plain form
17457 37575 216015 156587 281340 -48384 69897 239204 148762 328710 112697 291708
17447 291708 89449 298133 479043 239951 34680 336675 207632 134389 219543 80239
17436 179260 217482 39833 -45910 -175304 -64954 396074 217638 38255 262202 365349
17426 365349 50615 -173759 213622 -38783 -156723 -41995 341466 96145 370946 297195
17416 297195 298105 517284 176910 327911 335127 139555 362968 -263684 -50737 200287 134408
17405 134408 -248074 -61062 -56739 152102 173198 86487 206382 -157472 112513 -236091
17394 -40847 249214 198039 268894 317811 -35647 -160761 157010 30116 -120052 -38252 256769
17382 13329 447595 184120 139395 182741 91595 31429 -290885 121582 -86529 270161 -69768
17370A57773B8063J91975c7468J760C16910A29285k9919J15915K69294C7457J58040
17359A95497c90279D65084j72792r0048p0905B1433L29447p5615b7692B69756
17348e9748B63042j04823K27403A52753l1982O464N8389G7285J02085a75490A88534
17336A41799o3285l3336a06586B41823m251J24898j22466j08294a86622d9114
17325D55501G9021J07824B4338L33414A58034O7669m6104m878C3030i217B32931
17313B30271H2493K8082J7058p548J01943D0247g0577E07a44832B15086C6215
17301B774c0326A95311J21471A57820A6871f1020B15618R7770H9333K78273J11167
17290D78773B13924G7204B9770b4231C47253G6665K55674B9994O0210K04589j45159
$$ plain form
17370 157773 28063 220038 -37468 -35708 316910 129285 99366 215281 484575 37457 195497
17359 195497 -390279 465084 292292 202244 131339 21433 350880 275265 -27692 269756
17348 -59748 263042 158219 385622 152753 120771 127235 185624 77285 179370 -175490 188534
17336 141799 78514 45178 -106586 241823 237572 362470 240004 131710 -186622 -49114
17325 455501 79021 186845 24338 357752 158034 225703 179599 174721 33030 -9217 232931
17313 230271 82493 110575 127633 120085 222028 40247 -70577 507 -144832 215086 36215
17301 2774 -30326 195311 316782 157820 16871 -61020 215618 313388 89333 367606 478773
17290 478773 213924 77204 29770 -24231 347253 76665 332339 29994 90204 294793 149634
17279A49634a2692C26641B3040r060h028D0225f0692A48485g3510E5223L92249
17268D47472A64223Q0039M4091E7741J20809J54135a2312B70535a61307B7845
17257i4648M2731A02468O0450D0973f3316C99868D2150L14673j68788P6895A01277
17245b898A16981L10845K9735A88453D0412J42543J02971r1321p0726J00769R3663
17234C18311m9497H7147L3512K5504l6200O042J17545e0826A21810J47898E4902
17222B78634O6835j60712f593A44330L26287I9477a12992B85898p5591J0797O9043
17211B90147D395b2657A47843J21123j8951d0659A55869l6945e1549C82186j12756
17200B69430a11277B32130P0739F6765P6480L49057A87349K92542F5767J90085
$$ plain form
17279 149634 -12692 326641 23040 13980 -8028 40225 -60692 148485 -73510 55223 447472
17268 447472 164223 244262 288353 57741 178550 332685 -12312 270535 -161307 27845
17257 -94648 -51917 102468 162918 40973 -63316 399868 42150 356823 188035 264930 101277
17245 -2898 116981 427826 457561 188453 40412 182955 285926 194605 123879 224648 318311
17234 318311 268814 87147 120659 146163 109963 116005 233550 -50826 121810 269708 54902
17222 278634 345469 184757 -6593 144330 470617 99477 -112992 285898 210307 221104 290147
17211 290147 4395 -22657 147843 268966 250015 -40659 155869 118924 -51549 382186 269430
17200 269430 -111277 232130 302869 66765 143245 492302 187349 479891 65767 255852
17190B55852O9432K67812D1270L9829a40649A34007J07051A00170N3045Q8747
17180B41962K4392j02198J87729L6367I3395K85988J39809k42445d3398A09067
17169A73616m3842J94865b720o9067G7103J60367J7304j19649K08835A23347D1899
17157f4465B28459J96279j45274K17334j94818O7100f8076B01943E4570k5649
17147B8921K70287C7138d0200A32470J59278Q5532A46595a05465A05670L64977
17137D70647j03835A51637K53513m0807l5376A30644L46255k04754j35335J89994
17127C26804M32012j91170A11869J57992m0809J93371A75966K7744M4349M29231
17117F77290o9146q9109D3431M30320j51326J20131q4027K1230j2007o3054A34004
$$ plain form
17190 255852 325284 593096 41270 81099 -140649 134007 241058 100170 153215 241962
17180 241962 266354 164156 351885 388252 93395 379383 519192 276747 -43398 109067
17169 173616 129774 324639 -2720 -71787 77103 237470 254774 135125 343960 123347 41899
17157 -64465 228459 424738 279464 496798 301980 369080 -68076 201943 54570 28921
17147 28921 299208 37138 -40200 132470 291748 377280 146595 -105465 105670 470647
17137 470647 366812 151637 405150 364343 328967 130644 476899 272145 136810 326804
17127 326804 758816 567646 111869 269861 229052 422423 175966 203710 248059 677290
17117 677290 608144 519035 43431 473751 322425 442556 358529 379759 367752 304698 134004
17105B73877K38262q6363L9540A65349K18047n8981J82199M7436B22973O1661
17095B84634j9544J37478k9507A49500K84737j53319J71576B12106J17576H4422
17084B13050Q9391R209m6773C0548K45316K6182M1459R6164K64633k72944m4342
17073C87016J33767k02837l5981K55507j64172R7688A31662L94191L4799K4743
17063E85395M765B40212k7681L08138j49767m7623J62553J90800m395k27689J61813
17052F06361k64650J3233J10196j37759J18607I7289L44854J6851R7409O816P6503
17041F39722C07370K42562o8447A07420J44386J78142O0184J17475N8296J97302
17031H63205l65859o2315o1771J48083P8325j98236K10946k09983K48507j01514
$$ plain form
17105 273877 512139 425776 465316 165349 383396 324415 506614 554050 222973 284634
17095 284634 265090 402568 373061 149500 434237 280918 452494 212106 329682 84422
17084 213050 302441 311650 264877 30548 275864 302046 343505 439669 704302 431358 387016
17073 387016 520783 317946 281965 537472 373300 470988 131662 525853 560652 585395
17063 585395 590160 240212 212531 520669 370902 323279 485832 676632 672237 444548 606361
17052 606361 341711 354944 465140 327381 445988 97289 442143 458994 556403 563219 639722
17041 639722 307370 549932 481485 107420 251806 429948 490132 607607 665903 863205
17031 863205 497346 435031 373260 521343 599668 401432 612378 402395 650902 549388
17021E49388O1398j11438K80882l58258K68920j68519k15562K12349J69136j69670
17011E18626J34684o4407l2056J13026C06413J94599J29122K07080C28807O3803
17001C92610K88645l30673L55201k2848J97849k19870j82543J63030k02073R954
16991D49282P1737K27678j67980p1297l7383M14467l78746J07457N8006O1350
16981G34571R7588P4266j71547m5098K1774j76381Q1548L4035K54511m18647k7198
16970D59422K03888L35234k19628J33003l58057O973M80255j35056J34214j17877
16960I22371j28793J61727r7075J16484j94667L49922j04276R766k19308O8238
16950H84389K65787o4603K2001j52220l67469M25373n6945P0086K49282k8309
$$ plain form
17021 549388 610786 499348 780230 421972 690892 522373 306811 519160 688296 518626
17011 518626 653310 588903 556847 669873 306413 501012 630134 837214 328807 392610
17001 392610 681255 350582 705783 682935 880784 660914 478371 641401 439328 449282
16991 449282 521019 748697 580717 509420 472037 886504 507758 615215 673221 734571
16981 734571 832159 906425 734878 689780 711554 535173 616721 650756 905267 486620 459422
16970 459422 663310 998544 778916 911919 553862 560835 1041090 906034 1040248 922371
16960 922371 793578 955305 858230 974714 780047 1129969 1025693 1035459 816151 884389
16950 884389 1150176 1085573 1107574 955354 587885 1013258 956313 1026399 1275681 1247372
16940A247372j94062j31742J1819N2855J46476L31931m04801l4260J42492m01944
16930G66136L17054p2507J83599m620m1852k9780j16766J32733J10539O7453k08681
16919A103308K36339m02753L98535N3620j96049K66265l65176M68345L822k87867
16909A278389K60865j52620r2924K1987K14357Q182J39131k22931m9807J57922
16899A562551K1327k41433J88377L23J13350N3286k00131J86854k12442N17652
16889A989714l63759P9282L66377l81958J1245K18944k74510J33629J94914j62773
16879A811105o0073J48045j68443J78768R2626k38543M52381r7343l2911J23787
16869B209399m05964K38140J70267M542k4547J23883l35817M74966r5330J70564
$$ plain form
16940 1247372 1053310 921568 933387 986242 1132718 1464649 1059848 1025588 1168080 766136
16930 766136 1083190 1010683 1194282 1189662 1147810 1118030 1001264 1133997 1244536 1311989 1103308
16919 1103308 1339647 936894 1335429 1389049 1193000 1459265 1094089 1562434 1566256 1278389
16909 1278389 1539254 1386634 1293710 1315697 1530054 1538236 1677367 1454436 1404629 1562551
16899 1562551 1583878 1342445 1530822 1531145 1644495 1697781 1497650 1684504 1472062 1989714
16889 1989714 1625955 1705237 2071614 1689656 1700901 1919845 1645335 1778964 1973878 1811105
16879 1811105 1751032 1899077 1730634 1909402 2002028 1763485 2215866 2118523 2085612 2209399
16869 2209399 1803435 2041575 2211842 2216384 2191837 2315720 1979903 2454869 2359539 2530103
16859B530103p019J4570J12244r6817P9034p5628O9464J14832l3663L51477J588
16848C060185k34248J00067j6290R4110K63963m29635M36901k42395N3219K9236
16838C115113K7173K5995O11171k87899J02215N9440r9813P4268L09709J53775
16828D091147j05335k10922O38589j38944L7393Q4962k50721N23791K6522l14138
16818D382344M61151j79519K22166L41000k45183J79194K93544Q5487j39065L54644
16808E755763l9149L84942r5874K13315L17094R1347P6692m8405N14769O4035
16798G234529K25141j81176N31957k04309N15472J80024M32116N0153R8127K63381
16788I145415M01986K90497J27756J96334J11514J28672J084339J93914j02102
$$ plain form
16859 2530103 2523084 2537654 2649898 2553081 2632115 2556487 2625951 2740783 2707120 3058597 3060185
16848 3060185 2825937 2926004 2909714 3003824 3267787 2838152 3275053 3032658 3085877 3115113
16838 3115113 3142286 3168281 3779452 3491553 3593768 3653208 3553395 3627663 3937372 4091147
16828 4091147 3985812 3774890 4413479 4274535 4311928 4396890 4146169 4669960 4696482 4382344
16818 4382344 4843495 4663976 4886142 5227142 4981959 5161153 5454697 5540184 5401119 5755763
16808 5755763 5716614 6101556 6005682 6218997 6536091 6627438 6704130 6655725 7170494 7234529
16798 7234529 7459670 7278494 7810451 7606142 8121614 8301638 8733754 8783907 8882034 9145415
16788 9145415 9547401 9837898 9965654 10161988 10273502 10402174 11486513 11680427 11578325
16779A1578325K61389M21270N95428N65922L67133N21519P02397J57666M05210
16770A5576259N70295O39261K15841R95807Q61160O95800O72316P94692J047545
16761B2068976P68022J226960R96771J186361Q86828J132396J178997J598255
16753C1043566J376179J517619J629820J732036K046782K252913K124264K588136
16745D6311315K591631K551204K828945L575452L511353L951488L779258M577256
16737G3677902M735847N369685M964609O519493O454988O611720P202671Q054158
16729A23591073Q195810Q602865R152134R566081Q759536Q805827Q753952Q097891
16721A93525169O671480N739402M405188K416315P18561q51960k760554m873015
$$ plain form
16779 11578325 11839714 12260984 12856412 13422334 13789467 14310986 15013383 15171049 15576259
16770 15576259 16146554 16785815 17001656 17997463 18858623 19554423 20226739 21021431 22068976
16761 22068976 22836998 24063958 25060729 26247090 27133918 28266314 29445311 31043566
16753 31043566 32419745 33937364 35567184 37299220 39346002 41598915 43723179 46311315
16745 46311315 48902946 51454150 54283095 57858547 61369900 65321388 69100646 73677902
16737 73677902 78413749 83783434 88748043 95267536 101722524 108334244 115536915 123591073
16729 123591073 131786883 140389748 149541882 159107963 167867499 176673326 185427278 193525169
16721 193525169 200196649 205936051 210341239 212757554 213476115 212624155 209863601 204990586
16713B04990586n848355p209838q403591q762286r260246r344307r856070r012690
16705A37293203q973632q421481p894227p666062p103151n937682o355487n577425
16697G9364056m735514m916795m564745l832643l927174l657434k883360l083600
16689D7762791k691479k153776k596798k177643j851666j733113j886656j813406
16681C0858254j045150j838569j139620j325351j261685r24983q65724j262341
16673B1194831n67428j064998n15143j178978l51462j177641N4841m74598j169050
16664A4750374p52198L40162j040784k99172m11179k40300m33081l73138o64451
16655A0876233l13017k55196m18736k24158p1315p79292n7006j04430l62941j56471
$$ plain form
16713 204990586 199142231 191932393 183528802 174766516 165506270 156161963 146305893 137293203
16705 137293203 128319571 119898090 112003863 104337801 97234650 91296968 84941481 79364056
16697 79364056 74628542 69711747 65147002 61314359 57387185 53729751 50846391 47762791
16689 47762791 45071312 42917536 40320738 38143095 36291429 34558316 32671660 30858254
16681 30858254 29813104 27974535 26834915 25509564 24247879 23322896 22457172 21194831
16673 21194831 20627403 19562405 19047262 17868284 17516822 16339181 16394022 15919424 14750374
16664 14750374 13998176 14338338 13297554 12998382 12587203 12346903 11913822 11540684 10876233
16655 10876233 10563216 10308020 9889284 9665126 9593811 8814519 8757513 8653083 8290142 8133671
16645H133671l68646m28989L85899q07326K07324l51248j86780m891j93461j28718
16635F256835j90499j50927j7115j71605m09413R6831k89101q4715j4125k87259
16625D738907k39142J66976J63446m47400j72645K9225j84093j20091J77698K30738
16615D343619o91585L52228l95497J43830l11741J32477j50148k49873o7370j2718
16605C093222L0093j37216M30700l71341j73695M3603k09758Q7377j31706k3154
16595B638125k91619O64795l75073k01610j81018K31304k12468M15950n06128
16586B182258N7294q329J72600l57709N045O1047k89974n5501J677J3216R175
16575A790799O9423j85279n160M683M93559n43458J46716j77848k6918K31424
$$ plain form
16645 8133671 7765025 7336036 7721935 6914609 7121933 6770685 6583905 6579014 6385553 6256835
16635 6256835 6066336 5915409 5898294 5726689 5317276 5414107 5125006 5040291 5026166 4738907
16625 4738907 4499765 4666741 4830187 4382787 4210142 4239367 4055274 3935183 4112881 4343619
16615 4343619 3652034 4004262 3608765 3752595 3440854 3573331 3423183 3173310 3105940 3093222
16605 3093222 3123315 2986099 3416799 3045458 2871763 2915366 2705608 2792985 2661279 2638125
16595 2638125 2346506 3011301 2636228 2434618 2253600 2484904 2272436 2688386 2182258
16586 2182258 2239552 2231223 2403823 2046114 2051159 2112206 1822232 1766731 1768408 1781624 1790799
16575 1790799 1860222 1674943 1669783 1674466 2168025 1624567 1771283 1593435 1566517 1797941
16565A797941j93864M6664Q914m9894P3075o7172k32915J42103j74920J66268
16555A516200J04374k38283n4479J97427m2916j84946P4781L51418m33003M883
16545A295456j97097k00782L14060P4962k13588j17739K19728L4089R3164m64570
16535H37683K36333K02780n2316m93653M57152j57577k57841K12998j17833M73815
16525A341541j36450E49263P96994o15750J50998L3267j924j43263R8753j44114
16515G24224J14395j01892K62556j32124m9437p3040n5682L20002J41697m57163
16505F93536J62819J59503k65307j74819O1822J54382o3610j48065J25647k63159
16495D42749K26908m6781K24335k07616j43108J35868m008J74434R5743D41135
$$ plain form
16565 1797941 1604077 1650741 1659655 1609761 1682836 1615664 1382749 1524852 1349932 1516200
16555 1516200 1620574 1382291 1327812 1525239 1482323 1297377 1372158 1723576 1290573 1295456
16545 1295456 1098359 897577 1211637 1286599 1073011 955272 1175000 1209089 1302253 837683
16535 837683 1074016 1276796 1224480 730827 1187979 1030402 772561 985559 867726 1341541
16525 1341541 1205091 549263 1346257 730507 881505 914772 912848 769585 868338 724224
16515 724224 838619 736727 999283 867159 817722 744682 689000 1009002 1150699 693536
16505 693536 856355 1015858 750551 575732 637554 791936 728326 580261 705908 442749
16495 442749 669657 622876 847211 639595 496487 632355 628347 802781 898524 441135
16484C04543M06649J0323B65579N76360k3259k65859K50659l00416j16714Q468
16474C94818L4518K56486p0199O5240L61071B56698K01462j5789O4074K3795A58137
16462A31939L29874J20288J07801l27047r4410M49576j86393J48152l15608K72786
16452F36958j95058m7033K66501B70467K38643B41257K59545j06188k3332M1346
16442D12628J54515J73319j92617o6198k0795j32749r2551K81750o4442j01162
16432C51698H6789M51962k63949o0479L26645j85865K07890j60777j96555K65748
16422D71409J9128k21270J68950A54376N47121k69516p727n8892P06K04393n3363
16411E17098A92065M58251A40711M19932j71740l7972J70192L009A54780K55028
$$ plain form
16484 304543 711192 721515 265579 841939 818680 552821 803480 503064 386350 394818
16474 394818 429336 685822 615623 680863 1041934 256698 458160 442371 506445 530240 158137
16462 131939 461813 582101 689902 362855 268445 718021 531628 679780 364172 636958
16452 636958 441900 394867 661368 270467 509110 241257 500802 394614 371282 412628
16442 412628 567143 740462 547845 481647 460852 328103 235552 517302 452860 351698
16432 351698 86789 538751 274802 214323 540968 355103 562993 402216 205661 471409
16422 471409 490537 269267 438217 154376 701497 431981 424254 365362 366068 570461 517098
16411 517098 192065 650316 140711 560643 388903 350931 521123 524132 154780 409808
16401D09808O6384o9323j53176E1800M12051Q7256r3360A99167F9205K09853K88969
16390E68027p4344k35725L16534j57103j34447k5365J06297q0309J45800A49654
16379D17002j40579j4497K23237K4302A68918L25815B04044K29256K56623k67911
16369D22012F0444c5107E17414B13145K53971k12825A1923N09257C4689O16113
16359F50802B90271J69261j84064A01950K61788J83784B49802O6086j15672J62010
16349C62226A60078K54643j86602J3533J80466A57370J78181p3939I78K99760
16339C00738d3736C48833j47173J66922H6081R657R3612J67929C4945K88990N0622
16328C74557M2053q4993K76518k46687I1550J93992I4734K42551A7099h5344C37652
$$ plain form
16401 409808 476192 406869 253693 51800 463851 551107 457747 199167 69205 279058 568027
16390 568027 493683 257958 574492 417389 282942 257577 363874 283565 429365 149654
16379 417002 276423 261926 485163 509465 168918 494733 204044 433300 689923 422012
16369 422012 60444 -35107 517414 213145 467116 254291 11923 521180 34689 650802
16359 650802 290271 459532 275468 101950 363738 547522 249802 315888 200216 362226
16349 362226 160078 414721 228119 241652 422118 157370 335551 261612 978 300738
16339 300738 -43736 348833 201660 368582 86081 95738 189350 357279 34945 323935 374557
16328 374557 416610 331617 608135 361448 91550 285542 94734 337285 17099 -85344 337652
16316A89699l0518P3665a03785C98610b4493r5060I3612K3395J077A1420a90119
16304B63644n9651j9864R4328O037K50035A88103G8585l8282N9882L45199B09497
16292A43401k9385L07076d6974E1252e5245B96963K9497i3665D7372J5425P6165
16281A38962F5430k3709M32634j50999A36446K85502A46571L34460A47402l1488
16271A15914J74253I2320h145n6171C16478A16073J84883d5748C57849A67139
16260B40871E3413A1263J31249K28344r3030D1205J33041N2893m0261K0670f2841
16248a3630F1471b43913F3614J02659J77612j5306R3171D300L10368A7285O5740
16237H3025a24558N6698D09378m6897A15832B354L32814j15700L0183b46189B9456
$$ plain form
16316 189699 159181 232846 -103785 398610 -24493 -119553 93612 117007 118084 11420 -190119
16304 263644 203993 184129 278457 284494 534529 188103 78585 40303 100185 445384 209497
16292 143401 114016 421092 -46974 51252 -55245 296963 326460 -93665 47372 62797 138962
16281 138962 65430 41721 474355 323356 136446 421948 146571 481031 147402 115914
16271 115914 290167 92320 -8145 -64316 316478 116073 300956 -45748 357849 167139
16260 240871 53413 11263 142512 370856 277826 41205 174246 227139 186878 207548 -62841
16248 -13630 61471 -243913 63614 166273 343885 328579 421750 4300 314668 17285 83025
16237 83025 -124558 -67860 409378 362481 115832 2354 335168 219468 249651 -246189 29456
16225B68181m7517F7746M1714M1293b25745f6306I971e3356C20834A21289R2211
16214B13500F2780o416J9462P975K88394j059j43693F9493b37002D71211c00848
16202a52571C3748R8838D7112M6163l3119K73356R5950j80542B3838K85917k5043
16191B84712G5221M9370n220J19544L6534a0550B94881D6202J58993A3352a42114
16179A04449h3774E8446A9993J77367K0546C4567N6456P901A3431K9346O8514
16168A11291a6280o6165H450L473h8823C23437I4007i8366F1885a24479B75718
16156b47552A98958b47352o8757f140F8308R1771J79912C1870A3939J14735l5112
16145I3562Q2161o883g4352C70138a40939B42198f3489b2748A85588G251e1495
$$ plain form
16225 268181 220664 67746 109460 150753 -225745 -66306 9971 -53356 320834 121289 213500
16214 213500 62780 56364 75826 83801 372195 371136 227443 69493 -237002 471211 -300848
16202 -152571 33748 132586 47112 93275 60156 333512 429462 248920 23838 309755 284712
16191 284712 75221 124591 119371 238915 275449 -10550 294881 46202 205195 13352 -142114
16179 104449 -83774 58446 19993 197360 217906 34567 91023 98924 13431 42777 111291
16168 111291 -16280 -82445 8450 11923 -88823 323437 94007 -98366 61885 -124479 275718
16156 -247552 198958 -247352 -316109 -6140 68308 160079 339991 31870 13939 128674 93562
16145 93562 175723 168840 -74352 370138 -140939 242198 -63489 -22748 185588 7251 -51495
16133b07965B72379R9076d09456B84329c13965A41976b6061A29251e8716A08896
16122a65965b6812K337B61205d07716a42640j26547K0361n7073J33055F7679a35043
16110C80691a36165l7739P2340G3393g4332C7754N1745P1733a51635B99963c46696
16098c03649I7177k1315J39176J89192A74989F0894J48458D9915e5040A01446
16087b55670c9862p8282A95424D6043h1834A61245a33309f4052A82268a19852
16076a38841m6917B40660b5220B25689n3782k7676b67327J13666C23611b57987
16065G3765a85372c211k9528j60519a9858A6995i1658F5689Q4578o233b42537
16053b56118i8140a5889k04052J8090A18972J34259e1362B22021D4112N7919M9901
$$ plain form
16133 -207965 272379 371455 -409456 284329 -313965 141976 -26061 129251 -58716 108896
16122 -165965 -26812 -24475 261205 -407716 -142640 -269187 -248826 -305899 -172844 67679 -135043
16110 380691 -136165 -173904 -101564 73393 -74332 37754 89499 161232 -151635 299963 -346696
16098 -303649 97177 75862 215038 404230 174989 60894 209352 49915 -55040 101446
16087 -255670 -39862 -118144 195424 46043 -81834 161245 -133309 -64052 182268 -119852
16076 -138841 -185758 240660 -25220 225689 171907 144231 -267327 -153661 323611 -257987
16065 73765 -185372 -3211 -32739 -193258 -19858 16995 -91658 65689 150267 144034 -242537
16053 -256118 -98140 -15889 -219941 -201851 118972 253231 -51362 222021 44112 102031 151932
16042A51932g5525A59664A0875b87869G9757a38019A12112N558l6275a52634n4741
16031b07375A7423g3550A41535J48708a57709e121j7444B28184A11208n2183d14748
16019H2993N7338d4297A56542e0898A00399c99715B92169i38H7821K495e5089
16007A20048b07499A32724f5441I5489b31225I0004b18872K6103d4538n1918B19516
15995b09346i4108B04736a89890d2951k03867j1169e6922A45379J16023d5778
15984B43409D8315i5537j53989C1745i4039B28189b4486l19268a28246A43547
15973G6829f8677j11463j75551B22382a17634o300j25589j39596A57898J19245
15963B77143D2248a55099C65230h8550q8259B41431K307E3790e6458a2074D4186
$$ plain form
16042 151932 -75525 159664 10875 -287869 79757 -138019 112112 117670 81395 -152634 -207375
16031 -207375 17423 -73550 141535 290243 -157709 -5121 -22565 228184 111208 59025 -414748
16019 82993 140331 -44297 156542 -50898 100399 -399715 292169 -938 87821 90316 -55089
16007 120048 -207499 132724 -65441 95489 -231225 90004 -218872 -192769 -44538 -96456 219516
15995 -209346 -94108 204736 -189890 -42951 -246818 -257987 -56922 145379 261402 -45778
15984 243409 48315 -95537 -249526 31745 -94039 228189 -24486 -343754 -128246 143547
15973 76829 -68677 -180140 -355691 222382 -117634 -123934 -249523 -389119 157898 277143
15963 277143 42248 -155099 365230 -88550 -176809 241431 243738 53790 -56458 -12074 44186
15951a07755l0311f2483b7920D2948R6845k6916a61817J586g9783F0066a5766
15939F8090d74275K23903a13853B36505a45435J985A11308D0723a69561O6250
15929a03311m2445G3143A9624i0282K7570D3578a89840C05129b64839A24049b21742
15917A2571i5230B12811H1979J97705g0726B853L1813a14960l2618k53461I4179
15905d7114j81106a7129F0036d9569E2641b90573e3834j75091D046b24542j94843
15894d19385K05968A55073D4340J58729I1184a27239j34174Q0129g3531l9146
15884a12677k736d5637K388j43025A01218M0792M6767K15470d1218J6830H6776
15872H7379a46649a4823A45358a20147E7399o847a19383D688O8832a13727C1738
$$ plain form
15951 -107755 -138066 -62483 -27920 42948 139793 112877 -161817 -160231 -79783 60066 -15766
15939 68090 -474275 -250372 -113853 236505 -145435 -143450 111308 40723 -169561 -103311
15929 -103311 -145756 73143 19624 -90282 -62712 43578 -189840 305129 -264839 124049 -221742
15917 12571 -95230 212811 81979 279684 -70726 2853 34666 -114960 -147578 -401039 94179
15905 -47114 -228220 -17129 60036 -49569 52641 -290573 -53834 -228925 4046 -224542 -419385
15894 -419385 -213417 155073 44340 203069 91184 -127239 -261413 -181284 -73531 -112677
15884 -112677 -115413 -45637 -43249 -186274 101218 142010 188777 404247 -41218 -24388 86776
15872 87379 -146649 -14823 145358 -120147 57399 50552 -119383 4688 73520 -113727 31738
15860c6427D7444b24948c4654j99545Q7060d0861k7485j62253B91528p4592j04349
15849A12587a07998I8548J95988b23088f3380B4742A2235i5937J30b8608j77713
15838b06321d0604l3936B94168I2759J22596b69718g1457k83565D5662a02043
15827h5582F8860b99626h6129a3768a369k93669C3303c45057O7709h2166l80087
15816d62253b2742n6669J1169K8536C65248b15854B14722b22580c5911m3287B5384
15804A35540f5r7905E7790d0842C8852c74507D4409J42900a4722k00295d03A71793
15791D10958b15848D012a31714K6527a4066j08799G9363g9048j15318F7920J05051
15780A72971a5511o2054k05910A50694a23488e1559b3791o1460D4717P2128A2296
$$ plain form
15860 -36427 47444 -224948 -34654 -234199 -147139 -40861 -68346 -230599 291528 216936 112587
15849 112587 -107998 98548 294536 -223088 -63380 24742 12235 -95937 -95807 -28608 -206321
15838 -206321 -40604 -74540 294168 92759 215355 -269718 -71457 -355022 45662 -102043
15827 -85582 68860 -299626 -86129 -13768 -1369 -295038 33303 -345057 -277348 -82166 -462253
15816 -462253 -22742 -79411 -68242 -39706 365248 -215854 214722 -222580 -35911 -79198 25384
15804 135540 -65 -97970 57790 -40842 38852 -374507 44409 187309 -14722 -215017 -403 171793
15791 410958 -215848 4012 -131714 -105187 -14066 -122865 79363 -79048 -194366 67920 172971
15780 172971 -15511 -77565 -283475 150694 -123488 -51559 -23791 -85251 44717 116845 12296
15768H0471H600J22048e8207A31520m7697i6354o7733D38989A04135N3937P9468
15757B37540A6506b6792D030e2468A09441m2645c600A11261k8425i9771A79011
15745a23189D72627F0564d37795g9819p912o3246M2609A40852b2986j87037p705
15734b17728C37156o6087a27405B10458a0708E3700a7310m8647A16719K05367
15724C22086f8676b7392A12282Q01a21832k75262J00591A6176c11363B3811P6410
15713A00221g6344D4043J9589c9244l49373a31963j08008K6714C5915a59427F2222
15701A9711b78110a01712H3200a45183q6964b2347A89253f9558D5505O6403b85388
15689a05267B06384L0137J09583A13113h7548j5m2564M9308n5431J5114D549c6323
$$ plain form
15768 80471 8600 130648 -58207 131520 83823 -96354 -164087 438989 104135 158072 237540
15757 237540 16506 -26792 4030 -52468 109441 66796 -3600 111261 82836 -99771 179011
15745 -123189 472627 60564 -437795 -79819 -87731 -150977 -108368 140852 -22986 -210023 -217728
15734 -217728 337156 271069 -127405 210458 -10708 53700 -17310 -65957 116719 322086
15724 322086 -68676 -27392 112282 113083 -121832 -397094 -296503 16176 -311363 23811 100221
15713 100221 -76344 44043 63632 -39244 -388617 -131963 -239971 -213257 35915 -159427 62222
15701 19711 -278110 -101712 83200 -145183 -232147 -22347 189253 -69558 45505 111908 -285388
15689 -105267 206384 236521 346104 113113 -87548 -87563 -130127 -80819 -136250 -121136 4549 -36323
15676A59039a13439I4388N362O3369a63766g4740l58560a48769B19239a29865
15665D3404Q8039J36271D3939c68728h1873A61499a43284A74661a16187F5921
15654d19202I5305a59571k42038a47377D7161N245O7531c8558A48419f2990c849
15642e0274A44578d8072l72402b08040k86936d1533B19120G5273c56372a28296
15631b55229g1887b531B89870A33054C3065A0809b25492L5353A64276M3653E2233
15619A53020J51968b8513r7160I6574b72614d0662j21179D2763a28145c4823n9951
15608i4774b5762o4458j4123B45044C6517a84780l3306G0141B4419b86451g6441
15596b03693B5892h8186j86092j529l4619B2489a24771F023h1430k7482K0264
$$ plain form
15676 159039 -113439 94388 99750 163119 -163766 -74740 -433300 -148769 219239 -129865
15665 43404 131443 267714 43939 -368728 -81873 161499 -143284 174661 -116187 65921
15654 -419202 95305 -159571 -401609 -147377 47161 52406 119937 -38558 148419 -62990 -3849
15642 -50274 144578 -48072 -420474 -208040 -494976 -41533 219120 75273 -356372 -128296
15631 -255229 -71887 -2531 289870 133054 33065 10809 -225492 -190139 164276 207929 52233
15619 153020 304988 -28513 -125673 96574 -272614 -40662 -161841 42763 -128145 -34823 -94774
15608 -94774 -25762 -90220 -104343 245044 36517 -184780 -218086 70141 24419 -286451 -76441
15596 -203693 25892 -88186 -274278 -275807 -310426 22489 -124771 6023 -81430 -108912 -88648
15585h8648l5677j74412a37001H6961h4386L3222k86411H995J49694p3167j4863
15574G0659o304k5134P7068a85721e2703A4142J06768E3790i5272A29264b93286
15562c823C3036j277h5174j57614k6879F4235J41502I3463b42761O3184j13923
15551b93500f9049k16517d3893A50993a3851C33690a16122i589A5975c1931A3348
15539A92590J32190E9784b52980E5299a44359e1304F769a47177m3616b6610A34727
15527a26700A66603e0558p0761a4629j89002j07931I9428b5081Q959k59254C2925
15515C98239b0156E5889K7072J43933a48041B15590b75340d6984q5629d0104g92
15503F8389J2241e3854A09848l5604K54951f2020D7756j7223b9820k7256j04457
$$ plain form
15585 -88648 -124325 -298737 -137001 86961 -84386 -51164 -337575 8995 158689 85522 70659
15574 70659 64355 39221 116289 -185721 -52703 14142 120910 53790 -95272 129264 -293286
15562 -3823 33036 31759 -85174 -242788 -269667 64235 205737 93463 -242761 -179577 -293500
15551 -293500 -69049 -285566 -43893 150993 -13851 333690 -116122 -9589 15975 -31931 13348
15539 192590 324780 59784 -252980 55299 -144359 -51304 6769 -147177 -190793 -26610 134727
15527 -126700 166603 -50558 -121319 -14629 -203631 -311562 99428 -25081 -16122 -275376 32925
15515 398239 -20156 55889 82961 226894 -148041 215590 -275340 -46984 -132613 -40104 -792
15503 68389 80630 -53854 109848 74244 329195 -62020 47756 30533 -29820 -57076 -161533
15492a61533A08721F547K17558c7815B04290F9854m947O1353o2799a62408D8441
15480a89493O9096B3444M5041a85482C5638K49406i8626G3432a79478D0179b58463
15468A40490K69224b14525B88317A7742d44753A13371a18625M0429a8925j9177
15458c8102G790L9588J67822D5797J81276k6861a79209b0743j45658d4299j83263
15447b27562i5398d5177A71088n4863a60967c3591B0397J62084a97439g5058A10224
15435E9012k7590J51408j8136i3883A51074J00381B8193J10808a57537B00237
15424c27728a08054L3636n2478e3250A59466D3084b13683A17716J50075E696M6877
15413E2573d7704j40619F4890M1435K79055r2609d1900E0470i3711B10727a79376
$$ plain form
15492 -161533 108721 6547 224105 -37815 204290 69854 64907 126260 63461 -162408 48441
15480 -189493 -120397 23444 68485 -185482 35638 285044 -98626 73432 -179478 40179 -258463
15468 140490 409714 -214525 288317 17742 -444753 113371 -118625 -78196 -18925 -38102
15458 -38102 7790 47378 215200 45797 227073 200212 -179209 -20743 -166401 -44299 -227562
15447 -227562 -95398 -45177 171088 116225 -160967 -33591 20397 182481 -197439 -75058 110224
15435 59012 31422 182830 164694 -93883 151074 251455 28193 139001 -157537 200237
15424 -327728 -108054 -74418 -126896 -53250 159466 43084 -213683 117716 267791 5696 52573
15413 52573 -47704 -188323 64890 106325 385380 292771 -41900 50470 -93711 210727 -179376
15401c6291C30616K40619i7671b465B39097a01077k0886J3151p2938C9298c58243
15389h0500C937g9786J6324a0650k3184n6780A25948a1247j77925A87174b22777
15377A13146a10516B12031k5905c1972l2007k6629k21328I928a75551A21677b27125
15365D6743p271M866a67401g9658A80464K01511E098a28512A84585c68404A86103
15353b36691C6146K2145a25218p3039A16574J55052A32815i0375B06116i4563
15342A82125a43059A48489b01704m9771B4265K12258b08532C76400f5917q9594
15332a55511f0077I0357J22500F8838b37052G0071l2346J13670E1775a57931B26951
15320F6411c81738J17801A88081l3277E3421J20623o3554A0898L28207F8169B2567
$$ plain form
15401 -36291 330616 571235 -97671 -2465 239097 -101077 -121963 -108812 -181750 39298 -358243
15389 -80500 3937 -79786 -63462 -10650 -33834 -90614 125948 -11247 -189172 187174 -222777
15377 113146 -110516 212031 186126 -31972 -63979 -90608 -311936 9928 -175551 121677 -227125
15365 46743 39472 44338 -167401 -79658 180464 381975 5098 -128512 184585 -368404 186103
15353 -236691 36146 58291 -125218 -198257 116574 271626 132815 -90375 206116 -94563
15342 182125 -143059 148489 -201704 -251475 24265 236523 -208532 376400 -65917 -155511
15332 -155511 -60077 90357 212857 68838 -237052 70071 37725 151395 51775 -157931 226951
15320 66411 -381738 -263937 188081 154804 53421 174044 110490 10898 339105 68169 22567
15308b13888j4255B58166O0208a93868E3615P3695l9370J40404J14347d4749p3166
15297a17915B12096L7070L4347G6847d0067C25258H822b3903D210J36606a60994
15285F1008J98447A08808K5610B9526a09837C9118R1023L26891f1345A43279l9711
15274A03568J13722F0722J88882F3736d7543B79061j22043a49108A03076J95097
15264B98173b41702D18703E0655f9913D12464A80337b3366A45485c8343J1613
15254b6730n0305G8485J18827E2281K26075N84081L42448M68866q15348O17736
15244A476139n02304m41664B08439f6944B67027O364F1194J1126O1677J04216
15234B38213f8274A15335J79428m0081b1197l51044F20b29357A89404A2183K19380
$$ plain form
15308 -213888 -228143 258166 318374 -193868 53615 127310 87940 228344 342691 -44749 -117915
15297 -117915 212096 249166 283513 76847 -40067 325258 8822 -23903 4210 140816 -160994
15285 61008 259455 108808 134418 29526 -109837 39118 130141 457032 -61345 143279 103568
15274 103568 217290 60722 249604 63736 -47543 279061 157018 -149108 103076 298173
15264 298173 -241702 418703 50655 -69913 412464 180337 -23366 145485 -38343 -26730
15254 -26730 -77035 78485 197312 52281 278356 862437 1204885 1673751 858403 1476139
15244 1476139 973835 532171 208439 -66944 267027 273391 61194 72320 133997 238213
15234 238213 -68274 115335 294763 254682 -21197 -372241 620 -229357 189404 12183 231563
15223B31563c2306B68714J35920A33624a39710h564j09102J9543a6858A4621O6848
15212H1469a5854B6893J15825b89717N4621F3737b32004C50347f0788k31255a35409
15200B83065a23392C23511j26163b38519H1215B4202a05976E9265Q8562a37243
15189G03840f694B87664r9379h067K924A51455a00658C09245A5408a69019j23784
15178b92803A13487l8896a8064l4284A51810m4492a26905C469a11019C20593L6719
15167C57312E0091a35518A62178K21679A00542k324k550K60953A1719J27736a81630
15155A06729f7444C79093b0710B45921g70A84641j0954a84455N1490C2412K04699
15144B37111k0247q1386B377a73897B06682d6695j21151A83770K768l7379m7017
$$ plain form
15223 231563 -32306 268714 404634 133624 -139710 -8564 -117666 -98123 -16858 14621 81469
15212 81469 -15854 26893 142718 -289717 -235096 63737 -232004 350347 -60788 -292043 -135409
15200 283065 -123392 323511 197348 -238519 81215 24202 -105976 59265 147827 -137243
15189 703840 -6694 287664 188285 -8067 -5143 151455 -100658 309245 15408 -169019 -292803
15178 -292803 113487 74591 -18064 -52348 151810 107318 -126905 3469 -111019 320593 357312
15167 357312 50091 -135518 162178 383857 100542 98218 95668 356621 11719 139455 -181630
15155 106729 -67444 379093 -20710 245921 -770 184641 173687 -184455 -132965 32412 237111
15144 237111 216864 135478 2377 -173897 206682 -46695 -167846 183770 186538 149159 102142
15133A02142c12833a34292H9547a35504B74576C6139h9801A22696B3596J22812
15123A46408J28595r0052J51285k7437G6524h6498j8477E5803K27491j12494p3121
15112I7679m2260J70941m3859O8031a70635A05470m9359J18253M35984b58390
15101C58670A77977k008d279H622i8201A24620d2700B31489B1149L77948j35866
15090B63231L1140a6916j47278A18364b773n9126g646D6988a21078L975E21169
15078B03048P7951C552a44334H7931J40857f6593A25047a3163A53099j0217O0641
15067B03523L83390C5506K71645B5668N6554j6898J36136b8468D4073J80640K28898
15056D53611I2912M03586k04775d1965C11545r2460E0492a0534D36545A44729
$$ plain form
15133 102142 -312833 -134292 89547 -135504 274576 36139 -89801 122696 23596 146408
15123 146408 275003 184951 336236 308799 76524 -86498 -104975 55803 283294 170800 97679
15112 97679 55419 226360 182501 250532 -170635 105470 56111 174364 610348 -258390
15101 358670 177977 175969 -4279 8622 -98201 124620 -42700 231489 21149 399097 263231
15090 263231 294371 -16916 -164194 118364 -2773 -61899 -7646 46988 -121078 -117103 521169
15078 203048 280999 3552 -144334 87931 228788 -66593 125047 -13163 153099 142882 203523
15067 203523 586913 35506 307151 25668 82222 65324 201460 -28468 44073 224713 453611
15056 453611 92912 496498 291723 -41965 311545 219085 50492 -10534 436545 144729
15045b3188B19747r8467K18077A19518J03683K6474j16929n0688J2727j8797K1910
15034I7898J82374A13097J37506E7897K88779F0718K04037B9962H256K08516C874
15022B53690q2682K20979m8923E9716J8783K07284r7845R8853F7845J84761J67908
15011D20514C579J65754E0862N9828K17401J11300B01320G138R7444J51792q8399
15000A67975J78560A60024a4167G5649J74254j13392n6844K33677R253A38978
14989B91159K1159H2893K36317a0932D67598A87925K61226B06432J18932J04370
14979D29734j12699J684h157C41408A05024R4694a69169D38437I4218M3077K17589
14968C54884K42143A32341m1842J80003e8826B76880A31518J25160L3431A43091
$$ plain form
15045 -23188 219747 121280 339357 119518 223201 249675 132746 82058 94785 75988 97898
15034 97898 280272 113097 250603 57897 346676 60718 264755 29962 8256 216772 3874
15022 253690 171008 391987 343064 59716 78499 285783 187938 286791 67845 252606 420514
15011 420514 3579 169333 50862 110690 328091 439391 201320 7138 104582 256374 167975
15000 167975 346535 160024 -14167 75649 249903 136511 79667 313344 322597 138978
14989 291159 312318 82893 319210 -10932 467598 187925 449151 206432 325364 429734
14979 429734 317035 318719 -8157 341408 105024 199718 -169169 438437 94218 137295 354884
14968 354884 597027 132341 90499 270502 -58826 276880 131518 256678 290109 143091
14957B65992K79843A24976I749K32777p7082F9612K50330A52742m3605J30389
14947B39526O9838H4873J84452K6807n9999r3117L6892p4585K84534A42774J83306
14936C26080J228A51508J00603J89572q0318A78104o368f3053E61130B666J57200
14925A59866N33183k00359j43777j12014K25496a8411A43272K18089L4895A47662
14914E11335j77621r8414O1974J18288M1946q7055j68591l1647a21476C40530
14903C65406I6119M97933D4716N53580B32312J40227n5161A44836E1235M63881
14893E15116J78955k64171A31545N7396Q5492j09779K30849A82015r0931J67564
14883B58648F4993K79341j8299J2911O0342L98715A44724k5611K07415A10411
$$ plain form
14957 265992 545835 124976 9749 242526 165444 69612 319942 152742 109137 239526
14947 239526 309364 84873 269325 296132 236133 143016 179908 105323 389857 142774 326080
14936 326080 327308 151508 252111 441683 361365 178104 171736 -63053 561130 2666 159866
14925 159866 693049 492690 348913 236899 462395 -18411 143272 361361 396256 147662
14914 511335 333714 235300 297274 415562 457508 370453 201862 170215 -121476 340530
14903 365406 96119 594052 44716 598296 232312 372539 317378 144836 51235 515116
14893 515116 694071 429900 131545 188941 274433 164654 395503 182015 91084 258648
14883 258648 64993 344334 326035 338946 399288 798003 144724 119113 326528 110411
14872C15664O1621A62897L69277A67260m2335J97797j15773K88888j48102r8783
14862B48952K23557B13937M77771l30942A71717J2854M72608k61454O0589k5542
14852D30772K7676A90927J84218L103K03884B09442N25490C34721j56426L20575
14842D98870n2421C8186P00637B97808n6278M04126B65223K27744j88207M86824
14832G91584l27773j89376L23933Q3864k21202K36232j07619J29496j76457B36746
14821C93724L63431j18863k73282q2448K04895L8174A48488L02247j80563K39841
14811E10013p8181j26831L22486q3203J405m0044L9170P4343L0639j47634J24884
14800F27047k8634k4080J0167K90657m31704K2474K2696j76673L17910K1814j20930
$$ plain form
14872 315664 377285 162897 532174 167260 124925 322722 206949 495837 347735 248952
14862 248952 472509 213937 691708 360766 171717 184571 657179 395725 456314 430772
14852 430772 458448 190927 375145 378248 582132 209442 734932 334721 178295 498870
14842 498870 446449 38186 738823 297808 241530 645656 265223 492967 304760 791584
14832 791584 463811 274435 598368 682232 461030 697262 589643 719139 542682 236746
14821 393724 757155 638292 365010 282562 487457 525631 148488 450735 270172 510013
14811 510013 431832 305001 627487 544284 545689 505645 544815 619158 649797 502163 627047
14800 627047 598413 574333 584500 875157 443453 465927 488623 311950 629860 651674 530744
14789E30744j91686J83095N434j9840Q9548M5140k93045M43657l28134Q4087j16771
14778D32229K90331k73344Q0628J77602m0404k4996n0888p8388J56323k19948
14768D49145M7222R8381Q5316j4170k41396K07563R1201k88078M72296j49878
14758G57602k96591J37975K74729l82286p9534K93818m3012R1845q3555R3856
14748G64847K87283J3684m79769K26225M7861j48612k48087R576M30346C50610
14737H97495l8926j64804Q1441j57688Q1525K21590K227j01843l39688K15200
14727F96529L12147m58883K061L60252o4903J42735j60587J04965j63519O1016
14717H31813M2562j70696K1806K76144j66729M2690L4016J773j72480P8685J00712
$$ plain form
14789 530744 339058 522153 527587 507747 597295 642435 349390 793047 464913 549000 432229
14778 432229 722560 449216 529844 707446 667042 642046 591158 512770 669093 449145
14768 449145 496367 594748 680064 665894 424498 632061 723262 435184 907480 757602
14758 757602 461011 598986 873715 491429 411895 705713 662701 754546 670991 764847
14748 764847 1052130 1065814 586045 812270 860131 711519 463432 473008 903354 350610
14737 897495 858569 693765 775206 617518 699043 920633 922860 821017 481329 696529
14727 696529 1008676 549793 551854 912106 847203 989938 829351 934316 770797 831813
14717 831813 874375 703679 725485 1001629 834900 877590 911606 913379 740899 819584 920296
14706I20296M36252m10986m4158K02101j12050j20340P991L447j0903J71774k19555
14695H23869L64099D88181L84555N6991K87646m09525J33193j54663L99003m70129
14685G15252L14127K29883j97762j82341j0734o945J9481O29954m30260m5518
14675A035137L5063q469j74007J33400K58681r6537J1077K44507n44766r5077
14665G99009L56656k8822n2577k09378J84889L00008k92588J0293j412M6439j82786
14654I29731l2451N9932L24718q254j62449l10411O48622j19035R178k42410L2021
14643A129192j04499M0786Q6689J76848R5716k11958R9711j47807M5277K81247
14633A491202k8185k37623K98184Q191l49599J25585J66433k34583n2177K89345
$$ plain form
14706 920296 1356548 945562 901404 1103505 991455 871115 879106 882553 871650 1043424 823869
14695 823869 1187968 488181 872736 929727 1217373 807848 941041 786378 1185381 715252
14685 715252 1029379 1259262 1061500 879159 868425 861480 880961 1510915 1080655 1035137
14675 1035137 1070200 1061731 887724 1021124 1279805 1183268 1194345 1438852 894086 799009
14665 799009 1155665 1126843 1074266 864888 1049777 1349785 1057197 1067490 1066078 1112517 929731
14654 929731 897280 957212 1281930 1273676 1111227 800816 1449438 1330403 1339581 1097171 1129192
14643 1129192 1024693 1065479 1152168 1329016 1424732 1212774 1312485 1164678 1209955 1491202
14633 1491202 1463017 1225394 1523578 1531769 1182170 1307755 1474188 1239605 1187428 1476773
14623A476773l2930n6013j9278J31007N6388l9708J7847R2251N6643j85296J45233
14612A642917l47218M74487m36151P0288J66638O7731J033M4188m6178n6088K40680
14601A822327O6463j32690q5006K60144n35958K51085o7458J45518J82815q7462
14591A819778J72907k29725K3322K26534j66746K12287m88807K63242N0311R9275
14581A982378k02476O2683J45830j17363N0346J27600R9177l99242N22419l4574
14571B236778j24792J45441p9235L828J61134J2724R5485N3470J33391k09411
14561B428813J92218K6736K31283J08100j05501J69646L43821J79474M28396L90637
14551D393623M75944J184944K142416M383424R092595J6435946M122348B0500881
$$ plain form
14623 1476773 1443843 1387830 1368552 1499559 1555947 1516239 1534086 1626337 1682980 1497684 1642917
14612 1642917 1295699 1770186 1334035 1404323 1570961 1638692 1639725 1683913 1637735 1581647 1822327
14601 1822327 1888790 1756100 1671094 1931238 1395280 1646365 1578907 1724425 1907240 1819778
14591 1819778 1992685 1762960 1786282 2012816 1846070 2058357 1569550 1832792 1883103 1982378
14581 1982378 1779902 1842585 1988415 1871052 1921398 2048998 2148175 1748933 2271352 2236778
14571 2236778 2111986 2257427 2178192 2182020 2343154 2355878 2451363 2504833 2638224 2428813
14561 2428813 2621031 2647767 2879050 2987150 2881649 3051295 3395116 3574590 4002986 4393623
14551 4393623 4869567 6054511 8196927 12580351 21672946 38108892 42231240 20500881
14542I765945D696998j721695p28099J83597q4942l43754K57519k06109L53214
14533B406729k63145k00108r552m3825O00837k39271N8557K34195K64j47519j09886
14522B287276K30673k56220R9125J3270J72411K77541O7656j96536K94770k59603
14512B730363k3320R7594O495K1354J68573M0551j8525K48043j95160n426J89494
14501C260036j67911R2427K12720r4452q3164j62021J49034L69384Q8731j53796
14491C510988j63205J43441k00276J07932K74383j81119K7271L91585K9344n8357
14481C881987j39427K86402J08240k92030Q1556N3171J63697m55116O28041p5336
14471D241185J32920L24782l02638P9404Q1450K3838j39724R8317J87182J98314
$$ plain form
14542 9765945 4696998 2975303 2247204 2430801 2345859 2002105 2259624 2053515 2406729
14533 2406729 2143584 1943476 1933924 1890099 2490936 2251665 2310222 2544417 2544681 2397162 2287276
14522 2287276 2517949 2261729 2360854 2374124 2546535 2824076 2891732 2695196 2989966 2730363
14512 2730363 2707043 2804637 2811132 2832486 3001059 3041610 3023085 3271128 3075968 3070542 3260036
14501 3260036 3092125 3184552 3397272 3302820 3219656 3057635 3206669 3576053 3664784 3510988
14491 3510988 3347783 3491224 3290948 3398880 3673263 3492144 3519415 3911000 3940344 3881987
14481 3881987 3742560 4028962 4137202 3845172 3926728 3979899 4143596 3688480 4316521 4241185
14471 4241185 4374105 4698887 4396249 4475653 4557103 4580941 4441217 4539534 4726716 4925030
14461D925030k03644J51519j28890L49024J44720k41758L4306L3809M70974k69246
14451E265844n0218j909M55308n6999j48439J56732J26468J28331j47653J95136
14441E922601O5176K08347j84827N98433J84334q0632k82872K91015J43704q690
14431F856589K42419l88071K81852J27215K35080j44098J39451J90286j76010
14422G364713M06204j18496K24914L26459m19480M33022l4944M27110j35836O03002
14412I076668q2283M7680j67746N38041p8143J36157L44911k26845N91265p200
14402A0172505K17334j46196L12468K96733J26071J94633m5046N21300o8557L03785
14392A1885030K01258O540M55454N11755n6289R6400M71308j42163q9795O76135
$$ plain form
14461 4925030 4721386 4872905 4744015 5093039 5237759 4996001 5030307 5064116 5535090 5265844
14451 5265844 5215626 5213717 5669025 5612026 5463587 5620319 5746787 5875118 5727465 5922601
14441 5922601 5987777 6196124 6011297 6609730 6794064 6713432 6430560 6721575 6865279 6856589
14431 6856589 7099008 6710937 6992789 7120004 7355084 7210986 7350437 7540723 7364713
14422 7364713 7770917 7652421 7877335 8203794 7784314 8217336 8182392 8609502 8473666 9076668
14412 9076668 8994385 9042065 8874319 9412360 9334217 9470374 9815285 9588440 10179705 10172505
14402 10172505 10389839 10243643 10556111 10852844 10978915 11173548 11128502 11649802 11581245 11885030
14392 11885030 12086288 12092828 12548282 13060037 13003748 13100148 13571456 13429293 13339498 14015633
14382A4015633j7632N27291K72150K91167J25092M45554K52532M35420J15872
14373A6463079L69432K00421N75354J84056O42154R2592M85490K58343M21336
14364A9692257N69928K49773L18709K97799R68585N29879K99097O60962O36073
14355B4223062L53837O26076O68330L33718M05776P94199P98715P51066O21351
14346B9576130P45266N49299P92248J295349N75900O59743J039836R74692R82701
14337C7191164J212684J080099R10263J401937J437484J162100J400679J413603
14329D7210013J625710J289994J399423J653732J619503J959299K364533J971675
14321F1093882J985027K276847K369029K511476K255227K865541L128681K964707
$$ plain form
14382 14015633 13998001 14525292 14797442 15088609 15213701 15659255 15911787 16347207 16463079
14373 16463079 16832511 17032932 17608286 17792342 18434496 18527088 19012578 19270921 19692257
14364 19692257 20262185 20511958 20830667 21128466 22097051 22626930 22926027 23586989 24223062
14355 24223062 24576899 25202975 25871305 26205023 26610799 27404998 28203713 28954779 29576130
14346 29576130 30321396 30870695 31662943 32958292 33534192 34193935 35233771 36208463 37191164
14337 37191164 38403848 39483947 40394210 41796147 43233631 44395731 45796410 47210013
14329 47210013 48835723 50125717 51525140 53178872 54798375 56757674 59122207 61093882
14321 61093882 63078909 65355756 67724785 70236261 72491488 75357029 78485710 81450417
14313H1450417L045395L503181L098562L877707M040583L985438M245526N016014
14305A12262823M936303M685739N388837O052333O008377O632515P086723P066718
14297A60120368P532918Q404707Q660089R081586R364532J0382493J0366930J1346476
14289B35260099J1709537J1979169J2895128J3215292J3702465J3891924J4021545
14282C26675159J4310461J3763904J4369096J3361413J3085526J2273132J1453131
14275D19291822R946645Q357019O304783L223327N04086j23740P0875j433491
14267D46141326m094215o026834q444620r918465j1696293j2683861j3984936
14260C79292102j4558129j4597241j4912748j5109977j5022699j4318837j2495477
$$ plain form
14313 81450417 84495812 87998993 91097555 94975262 99015845 103001283 107246809 112262823
14305 112262823 117199126 121884865 127273702 133326035 139334412 145966927 153053650 160120368
14297 160120368 167653286 176057993 184718082 193799668 203164200 213546693 223913623 235260099
14289 235260099 246969636 258948805 271843933 285059225 298761690 312653614 326675159
14282 326675159 340985620 354749524 369118620 382480033 395565559 407838691 419291822
14275 419291822 429238467 437595486 443900269 447123596 447627682 447503942 447574817 446141326
14267 446141326 442047111 436020277 427575657 417657192 405960899 393277038 379292102
14260 379292102 364733973 350136732 335223984 320114007 305091308 290772471 278276994
14253B78276994j3659413j2949406j2223905j1805036j1390484j0457656r854056
14246A95937038r676129q826751q017558q577127p299343o992820o644520o365625
14238A33537165n688040n262159n619728m906336n006569m180251m138485l462291
14230I5273306l757463m042674l426652l272507k893165k965560k738465k618481
14222F9558339k418516k026880k600819j947533k024950k257532j366278k036527
14214E2879304j309669j042313j822653j855672j580091j001717j352259o02529
14206D2312401j194954j448299j466507j147670q37111o94222n03512j170102
14198C3850024j187369p87559r60809m78400o92549o05615j053329r87576m17683
$$ plain form
14253 278276994 264617581 251668175 239444270 227639234 216248750 205791094 195937038
14246 195937038 186260909 177434158 169416600 160839473 153540130 146547310 139902790 133537165
14238 133537165 127849125 122586966 116967238 112060902 107054333 102874082 98735597 95273306
14230 95273306 91515843 87473169 84046517 80774010 77880845 74915285 72176820 69558339
14222 69558339 67139823 65112943 62512124 60564591 58539641 56282109 54915831 52879304
14214 52879304 51569635 50527322 48704669 46848997 45268906 44267189 42914930 42312401
14206 42312401 41117447 39669148 38202641 37054971 36217860 35523638 35020126 33850024
14198 33850024 32662655 31875096 30914287 30435887 29743338 29137723 28084394 27096818 26679135
14189B6679135p82955k71007p70684p37531n1223p92615m73313o37788m12630
14180B1749389n98242k78085n79152k56407j24371n35325p07512j2560p19979
14171A7937756k16890l62390m16847l14453j93663k04225k02968o44416n29743
14162A4852161K9029k14428o04099M774j09346j63605o39871p0459K2034l34927
14152A2771263j83011m25335P1975m47999j82369j53272j00228j91257j77649
14143A0982118k45076J23680p82506k5965l5687O126j39632j22756j60183n6531
14133I543588m69773K39453k87959J56908o41714J50048l90130J56061k48567
14124H207915k58194l05461L10905J09157n44792j20275K93692j93842j63818
$$ plain form
14189 26679135 25896180 25625173 24854489 24116958 24065735 23273120 22799807 22162019 21749389
14180 21749389 21151147 20873062 20293910 20037503 19913132 19377807 18670295 18657735 17937756
14171 17937756 17720866 17358476 16941629 16627176 16433513 16229288 16026320 15381904 14852161
14162 14852161 14881190 14666762 14062663 14067437 13958091 13794486 13154615 13084156 13106190 12771263
14152 12771263 12588252 12162917 12234892 11786893 11604524 11451252 11351024 11159767 10982118
14143 10982118 10737042 10860722 10078216 10052251 10016564 10022690 9883058 9760302 9600119 9543588
14133 9543588 9073815 9313268 9025309 9182217 8540503 8690551 8300421 8456482 8207915
14124 8207915 7949721 7644260 7955165 8064322 7519530 7399255 7692947 7499105 7335287
14115G335287j80792J66038J1141k89054j36014l08750j44106L92846k61106j99986
14105F385504K38926m73867j53583j45769r9951M46849l75285J72675k49459k73038
14095E473002J03035P8844l12464J99194j18879J19328m18013q0264M737Q5380
14085E133900l25056P9704L7673o9228P9356o4331k21712k06525J14135K23959
14075D781875k49973J29336k76436q1562j11980K42640O6317m9977m00687J74805
14065D224358j64078r9486p7681Q8871Q0757j46693j53941J11219k90968J52825
14055C725183J26205m20685K25795J58188j59549K5687l2962m10072K2606J49775
14045C410171J97281k68176K7641k79948m9779K55986l74153K0215j32664K34202
$$ plain form
14115 7335287 7154495 7320533 7331674 7042620 6906606 6597856 6453750 6846596 6585490 6385504
14105 6385504 6624430 6150563 5996980 5851211 5751260 6198109 5822824 5995499 5746040 5473002
14095 5473002 5576037 5654881 5342417 5541611 5422732 5542060 5124047 5043783 5048520 5133900
14085 5133900 4808844 4888548 4926221 4856993 4936349 4872018 4650306 4443781 4557916 4781875
14075 4781875 4531902 4661238 4384802 4303240 4191260 4433900 4500217 4450240 4049553 4224358
14065 4224358 4060280 3960794 3883113 3971984 4052741 3906048 3752107 3863326 3572358 3725183
14055 3725183 3851388 3430703 3656498 3814686 3655137 3680824 3647862 3237790 3260396 3410171
14045 3410171 3607452 3339276 3366917 3086969 3037190 3293176 2919023 2939238 2806574 3040776
14035C040776j88986J9395Q8321l4936J18253j25858K32255m41434j8301J50617
14025B840102k86873k0527J44936j06354P9119r0542j26475q2595K8958k14339
14015B165410K99955l21532Q5683J43884j57238M60452l64352J11541j27340Q4971
14005B381434r0245J8624j50817Q108j84774K03072K8373N6996J41083p26174
13995A685680K80092K92614k9833L9017M64633L74345J320772K704396Q133625
13986A5265341J7295663J0765040j9077498j1762528m812015j757385j401937
13979D514681l50147n01681o13627K09167o1274k20084l17843o8514K73387l96467
13969B467598j17082k6965J31499j72681o5658k86365m7815N5011P9727L685J87384
$$ plain form
14035 3040776 2851790 2871185 2959506 2924570 3042823 2916965 3149220 2707786 2689485 2840102
14025 2840102 2553229 2532702 2677638 2571284 2650403 2559861 2433386 2350791 2379749 2165410
14015 2165410 2465365 2143833 2229516 2373400 2216162 2676614 2312262 2423803 2296463 2381434
14005 2381434 2291189 2309813 2158996 2167104 1982330 2185402 2213775 2270771 2411854 1685680
13995 1685680 1965772 2258386 2228553 2267570 2732203 3106548 4427320 7131716 15265341
13986 15265341 32561004 43326044 24248546 12486018 7674003 5916618 4514681
13979 4514681 4164534 3662853 3049226 3258393 3197119 2977035 2659192 2590678 2864065 2467598
13969 2467598 2350516 2323551 2455050 2282369 2216711 1930346 1882531 1937542 2017269 2020954 2208338
13958B208338j55148P091Q0406l14720L21396l4102j70067K48975m88779K73161
13948A976551K79528m87878J22362J70211R1191m27369L68273n49156k5932L45829
13938A863610Q08j05918k47533O75024p49963K61185l44116M8584j05844J32215
13928A428052K12214j52976j04031q604K83139M846J17216l50699k63548N74795
13918A740404l75675J64976J9577K77175k25626p6035O1236k16581j04914J82174
13908A446711p9218J16602l68083J25833J88968J07863j49760p5999j7635J86281
13898A481563j17796k54174J65240j4194l3474M08126j95300p3015j76178K54410
13888A445208m94361K44061M95855l94706j11622p1038m6913M55812l3223l29625
$$ plain form
13958 2208338 2053190 2060281 2140687 1825967 2147363 2113261 1943194 2192169 1703390 1976551
13948 1976551 2256079 1768201 1890563 2060774 2151965 1724596 2092869 1543713 1517781 1863610
13938 1863610 1864418 1758500 1510967 2185991 1436028 1697213 1353097 1401681 1295837 1428052
13928 1428052 1640266 1487290 1383259 1374655 1657794 1662640 1779856 1429157 1165609 1740404
13918 1740404 1364729 1529705 1549282 1826457 1600831 1524796 1586032 1369451 1264537 1446711
13908 1446711 1367493 1484095 1116012 1241845 1430813 1538676 1388916 1312917 1295282 1481563
13898 1481563 1363767 1109593 1274833 1260639 1227165 1635291 1439991 1366976 1190798 1445208
13888 1445208 950847 1194908 1690763 1296057 1184435 1113397 1066484 1522296 1489073 1159448
13878A159448L5793r8274K63796p1265p887l6355l05382K64988r1420l00414J18359
13867I31387L72438k31084L2578O2159j87886K41358m35m73348K31860j10562
13857H68465L73800l28956J6984O8445k75145O2725K88916k08307J73689n6756
13847I83860N2511l4009j05877L78708j52214M2985l42259K14622m6191L34657
13837A326793m48443K81912l99356J75072P4307l68524K24435j50811K30109j2743
13827I32751L8840k5021K42665l55244C92119M70411Q0220l64308L70437k42301
13817G06578J76392p7159R9071p5461l5758J83084M1027l13249R2220j21336J4515
13806F89924p5212K86815J1833j17926j30654M1748J36766j05437C42194M64565
$$ plain form
13878 1159448 1195241 1096967 1360763 1289498 1281611 1245256 939874 1204862 1113442 813028 931387
13867 931387 1303825 1072741 1105319 1167478 979592 1220950 1220515 747167 979027 868465
13857 868465 1242265 913309 930293 998738 723593 786318 1075234 866927 1040616 983860
13847 983860 1036371 1002362 896485 1275193 1122979 1165964 823705 1038327 992136 1326793
13837 1326793 878350 1160262 760906 935978 1010285 641761 866196 715385 945494 932751
13827 932751 971591 946570 1189235 833991 392119 862530 942750 578442 948879 706578
13817 706578 882970 805811 904882 829421 793663 976747 1017774 704525 796745 675409 689924
13806 689924 614712 901527 913360 795434 664780 706528 843294 737857 342194 806759
13796H06759k10952L25644r1663n2053j89217j92349J13389L68345p6253J1044
13786H12694j7231j64649n7358K63991J74702l20027o0369K24630o8862j83038
13776F04483j62034O909L41926C43805K53876o9315O6567m7706Q5857K73365K67854
13765A174303n53650P9184l7046J32024l33883K7782L2888J46416N3445j13640
13755F07823O6011k82062P2516J88318M5371j96762L30592N9583k48203J20710
13745G63897l3237k80547P1959J30908A91960L12957K38802k94652P2645Q257
13735E29969Q1285K02196k86273A77142R4456M37158L2757k87481J1637P9705
13725E45374J30630j06230j56405K24982K49636k97225j40168L60626j61078l02059
$$ plain form
13796 806759 595807 921451 829788 777735 588518 396169 509558 877903 801650 812694
13786 812694 795463 630814 573456 837447 1012149 692122 631753 856383 787521 604483
13776 604483 442449 449358 791284 343805 597681 528366 594933 547227 633084 906449 1174303
13765 1174303 620653 699837 662791 794815 460932 488714 521602 668018 721463 607823
13755 607823 673834 391772 464288 652606 697977 501215 831807 891390 643187 763897
13745 763897 730660 450113 522072 652980 191960 504917 743719 449067 521712 529969
13735 529969 611254 813450 527177 177142 271598 708756 741513 454032 465669 545374
13725 545374 676004 569774 413369 638351 887987 590762 450594 811220 650142 348083
13715C48083O3146L5945A79026K49440L36442Q5170m17703J69822n5843j52826
13705C93528K32294j96206P3564j66069Q6192J67730j02267J58812B18262L52861
13695E71123B33273L58997O9811q9333J899k3262j24642A62429M28238l8044J0231
13684E62854l6591B58529M6658A07037O69208q3423B59937J51992L7971B23727
13673C02042J84206q2066P5609A83708L87141Q6617A78213J68802J11100J48990
13663F07105j80871J32538k01601K23857B65378L79917k68257K47182j23430J47052
13653F47842B76314j9937J15986j7425j3895J60035j59486K14979B43191L5209
13643B78400L46809o3450k02129O9308j61347J11892j40829n7180l8782K44485
$$ plain form
13715 348083 411229 447174 179026 428466 764908 850078 432375 602197 546354 393528
13705 393528 625822 429616 503180 337111 423303 591033 488766 647578 218262 571123
13695 571123 233273 592270 662081 572748 574647 551385 426743 162429 590667 552623 562854
13684 562854 526263 258529 305187 107037 776245 692822 259937 411929 449900 223727
13673 302042 486248 404182 479791 183708 570849 657466 178213 347015 458115 607105
13663 607105 426234 558772 357171 581028 265378 645295 377038 624220 500790 647842
13653 647842 276314 256377 372363 354938 341043 501078 341592 556571 243191 278400
13643 278400 625209 561759 359630 428938 267591 379483 238654 181474 142692 387177
13633C87177A89354L98389j88678K60494B37583K89266j81895J47931j22559j6573
13623C53753J46221j9139A74799K02169M3477d419D45233p9609J39898p2474n8363
13612C74685R4425j05134M0142p0302K08359N6473j23182j80949K75521j60638
13602D09400H5641K53491J9390C7188K11944n4926J34635n1190j37605K74693
13592D14739j40504G7190J42167J07442I3485K96286J9941q8231j06482K04046
13582D19045N0775j86114A25151m8490Q8281J00227J43825r9124J23406j1023
13572D22253j87634A8059M28394r0450k9708J81974B5060d8525E56129j14131
13562D41998L9262k23289K04326J07260B69183J92036j7420l6473j378p9397l8093
$$ plain form
13633 387177 189354 587743 399065 659559 237583 526849 344954 492885 370326 353753
13623 353753 499974 480835 174799 376968 420445 -4419 445233 365624 505522 433048 374685
13612 374685 469110 363976 404118 333816 542175 598648 475466 294517 570038 409400
13602 409400 85641 339132 358522 37188 249132 194206 328841 277651 140046 414739
13592 414739 274235 77190 219357 326799 93485 389771 409712 321481 214999 419045
13582 419045 469820 283706 125151 76661 164942 265169 408994 309870 433276 422253
13572 422253 234619 18059 446453 356003 326295 508269 25060 -48525 556129 441998
13562 441998 481260 257971 462297 569557 269183 461219 443799 407326 405948 326551 288458
13551B88458c1954C27359R4453j81050K24235j33047l1599L8953a28854C14803
13540B71359L6180d241E11652j34040n4212m1208j0076Q637J76838j89172J75010
13529D43429j67151m6502Q228J10778j65666P6591j24812K04974m2705a13475
13518C62564j10553K890J665J90582j02022K0050B3757M83716A24670N47052j37331
13507E34391B00339I5569M8512J04051G0860J55707J722J03123J89890A16851
13496c8606C24901I4039d7929D38623b2183A05471K28835a3625D9451K52718k2270
13485B79899m3137M8982A41481L05265h9074i867B62817L71818B28112K29639
13475D57751B07999m2609f1112C94816j21755k6024K6367J66674j57213G1330
$$ plain form
13551 288458 -31954 327359 421812 240762 464997 331950 300351 339304 -128854 314803
13540 271359 307539 -4241 511652 377612 323400 282192 272116 280753 457591 268419 443429
13529 443429 276278 229776 238004 348782 183116 259707 134895 339869 297164 -113475
13518 362564 252011 254901 256566 447148 345126 365176 23757 507473 124670 671722 534391
13507 534391 200339 95569 144081 248132 70860 226567 228289 331412 521302 116851
13496 -38606 324901 94039 -47929 438623 -22183 105471 334306 -13625 49451 302169 279899
13485 279899 236762 285744 141481 446746 -89074 -9867 262817 634635 228112 457751
13475 457751 207999 165390 -61112 394816 273061 247037 273404 440078 282865 71330
13464c533I9113C7078O7792K80722m1672p4434D2053M15142a56953C25811c8984
13452A59686K05522j00054B7090K73452L54374B61566k7327J37569H072J4960
13442B3032N6551J25077r2623b1471E39073f8922A81379c3067E08423B35694k1188
13431B14506M5118A16435J32541i1542D38314j52889j27633J95371j43775p454
13421B01934C8347L77511A73228A1033E171R9493K96468Q7690a86531B20528i6181
13409B89369A14379P1784a11464A02458K56310g0574B69673J26553M9256G169
13398b2754C87972A08885J50596j27975Q645a4506D27152r3124j57568B1197M47129
13387D68326j17297J48778a33552c7626A54838l39C8211K85157A59906b2544B38812
$$ plain form
13464 -3533 99113 37078 104870 385592 343920 269486 42053 457195 -156953 325811 -38984
13452 159686 365208 265154 27090 300542 654916 261566 234239 371808 8072 23032
13442 23032 79583 204660 112037 -21471 539073 -68922 181379 -33067 508423 235694 214506
13431 214506 259624 116435 248976 -91542 438314 285425 157792 353163 209388 201934
13421 201934 38347 415858 173228 11033 5171 104664 401132 488822 -186531 220528 -96181
13409 289369 114379 186163 -111464 102458 358768 -70574 269673 396226 445482 7169
13398 -22754 387972 108885 259481 131506 140151 -14506 427152 334028 176460 21197 468326
13387 468326 351029 499807 -133552 -37626 154838 154499 38211 323368 159906 -22544 238812
13375C42764A27780o184J16914C8204Q2350O8220O2095J34373i9959C52850A63944
13363B04234p9559K34680J08148a42774B70594H7776J37850R3795n5738a99571
13352A17947a73440A30392R5670f5091D26580B05062J35843M2161o2430A52514
13341E99287A26895K97739K17353k50493A23958K27152m4645N694p4304M9805
13331B87660j07339L85426m0841A76881n366K99052j66866A10057J79542n855
13321B83744a44966A75488R2600k9257m6014K32800j42992r0875a69539B96949
13310A13476J73922J3003k5450k3123h7373B41454l3828k4453p260J05704k252
13299B79365C9620K47399A20604B9287J55217a7674B754L08576A46685G1099L21457
$$ plain form
13375 342764 127780 121596 238510 38204 120554 188774 250869 385242 -99959 352850 163944
13363 204234 124675 359355 467503 -142774 270594 87776 225626 319421 263683 -199571
13352 117947 -173440 130392 226062 -65091 426580 205062 340905 383066 320636 152514
13341 599287 126895 424634 641987 391494 123958 351110 306465 312159 237855 287660
13331 287660 180321 565747 524906 176881 171515 470567 303701 110057 289599 283744
13321 283744 -144966 175488 268088 238831 192817 425617 282625 191750 -169539 296949
13310 113476 287398 300401 274951 251828 -87373 241454 207626 183173 175913 281617 279365
13299 279365 39620 287019 120604 29287 184504 -17674 2754 311330 146685 71099 392556
13288C92556I4159P476a35886A05499B183N6528J58909E3660A4346J1934b7762
13276B03158O8876K0566c2462C2864J31195m3205e8629B7882M87699D2293L26966
13265C69259g1370k06547f1582A66536N1539j08598J47373A09656N8291l5843
13255A32104F4581i2673B19322i066C1345K27574K13246j83577E6407M8622J59788
13244B64817K7249j43280F2073k1662c23147D752D26Q0316K22220R8605j71145
13233B30422D4909K51888j25264D9001J14326J32709E1882J69532a13381I680
13222b9343a1019B7853b1424B16078a50266A38113N1644L4199J92556j38570b59730
13210a3669j15002B96823j42068a1666B23150a25703A80606c8808R141A29193
$$ plain form
13288 392556 94159 101635 -135886 105499 2183 58711 217620 53660 14346 26280 -27762
13276 203158 272034 292600 -32462 32864 164059 120854 -58629 27882 515581 42293 369259
13265 369259 -71370 -277917 -61582 166536 218075 109477 256850 109656 167947 132104
13255 132104 64581 -92673 219322 -9066 31345 258919 472165 288588 56407 105029 264817
13244 264817 292066 148786 62073 40411 -323147 4752 426 80742 302962 401567 230422
13233 230422 44909 296797 171533 49001 163327 296036 51882 221414 -113381 9680
13222 -29343 -11019 27853 -21424 216078 -150266 138113 189757 223956 416512 277942 -259730
13210 -13669 -128671 296823 154755 -11666 223150 -125703 180606 -38808 -29667 129193
13199i2339E4768a04903A74192o6567b7950B45612a8920C6539g5411n4710G8382
13187B39594b2420I5191D2570a24394A35568k2737A2495b26279c0633A37175K48066
13176C85241C0358J55434J7247D1759J69257J55828G6458b1770C17660C3888J01628
13165A35516M0279j1706K9672m8600g357A41759h917F2204J19851l8446f9554
13153A58504F604J63128h1098A96834J27242r9014H0821k6513b70890c4182B44167
13141A69081i851C1233a77943P7503A60902i2881B50011l2965a32450m1210B50721
13129g069k6405K166A47284J43518b4399j08619B21733b8594j88774g3146C1743
13117b02251C85524A38528O0675d776H773K79a27049c4807J6414C0411O5662K31979
$$ plain form
13199 -92339 54768 -104903 174192 107625 -27950 245612 -18920 36539 -75411 -130121 78382
13187 239594 -22420 95191 42570 -124394 135568 112831 12495 -226279 -30633 137175 385241
13176 385241 30358 185792 203039 41759 211016 366844 76458 -21770 317660 33888 135516
13165 135516 175795 164089 193761 145161 -7357 141759 -8917 62204 182055 143609 -69554
13153 158504 6604 169732 -81098 196834 324076 225062 80821 54308 -270890 -34182 244167
13141 169081 -9851 31233 -177943 -100440 160902 -92881 250011 217046 -132450 -173660 250721
13129 -7069 -33474 -31308 147284 290802 -24399 -133018 221733 -28594 -217368 -73146 31743
13117 -202251 385524 138528 199203 -4776 8773 9052 -127049 -34807 -18393 30411 96073 328052
13105C28052e7645A50178J11541l8213A03181j5075L8435R2522a93669P8514A3130
13093A28439m5319P7819e1017A41632a02067C42717a87831A32057D0491a37310
13082E120K78621c9758A10042a03664A00804F275a02826C04182c4193A87545B9761
13070b825A26524M0786a05500K3622j6670C42378F3548L93374B27510q0139E509
13058I4738J37665l0578l940G722K76061A05303k6643P2804K94135c6677A77165
13046C47758o6480C8947b48931E2695K09315G4758J95961P9674b12398E3256J47776
13035B01032J00777j05335b48413a4470A37155l7739D4260b74067I9410d9026
13024d1833C9483J63523e5969K6112A90669R7335n2150O4361j42442C9880L55607
$$ plain form
13105 328052 -57645 150178 261719 223506 103181 88106 126541 219063 -193669 -115155 13130
13093 128439 83120 160939 -51017 141632 -102067 342717 -187831 132057 40491 -137310
13082 5120 283741 -39758 110042 -103664 100804 6275 -102826 304182 -34193 187545 29761
13070 -2825 126524 167310 -105500 -81878 -98548 342378 63548 456922 227510 147371 5509
13058 94738 232403 201825 197885 7722 283783 105303 78660 151464 445599 -36677 177165
13046 347758 281278 38947 -248931 52695 262010 74758 270719 350393 -212398 53256 201032
13035 201032 301809 196474 -248413 -14470 137155 99416 44260 -274067 99410 -49026
13024 -41833 39483 203006 -55969 -29857 190669 288004 235854 300215 157773 39880 395487
13013C95487A39770Q129b05344F9510K04910p5740m7486A1952J30542m3088a39115
13001a45825B43219e7334A27635O9114J05180c6270B13570c54686A3742K4386
12991C8128b8280G8004A6660K778O9444i8794E6449K97692a62549B11111G919
12979I2360Q2005D8556K80321A28048c31560E0153Q269g9584D0406K83260j51521
12968A72145c65965A48865D2246J2001Q215a35894B6571c30742i1678k05818J44421
12957a53075d6983B2336N0667a50336I2277b27941j78804B36231B2584J24445
12947A47029m245b17832A52454h7364l7784B01635c40019A61778n1169b21862
12936C3942J92178O8013B1445f3492k48189A67955b97814D70606A48874f7896
$$ plain form
13013 395487 139770 147899 -205344 69510 274420 198680 151194 11952 142494 99406 -139115
13001 -145825 243219 -57334 127635 196749 301929 -36270 213570 -354686 13742 38128
12991 38128 -28280 78004 16660 19438 88882 -98794 56449 354141 -162549 211111 7919
12979 92360 174365 48556 328877 128048 -331560 50153 58422 -79584 40406 323666 172145
12968 172145 -365965 148865 42246 54247 62462 -135894 26571 -330742 -91678 -297496 -153075
12957 -153075 -46983 22336 73003 -150336 92277 -227941 -406745 236231 22584 147029
12947 147029 142784 -217832 152454 -87364 -125148 201635 -340019 161778 110609 -221862
12936 33942 226120 294133 21445 -63492 -311681 167955 -297814 470606 148874 -67896
12925A4528c9525B93576q9105o8749a28183A5800J0641K62230G5878J15224a35365
12913B03664K9681A01847J10085A3528N3891a4183G415h0145k4245A11373J6349
12902A27722C1245P052K25251o6096K5342b1846A9580b06104A63827b63964a30320
12890a36196a3930B68469a3244j32134A09243N4001g3965A89366b4823F0144q066
12879E2078Q9993N5022J56003A14506J49034a31745A11509m8037i2432B81627
12868A22081d48989F8831i9652l59998A16223f1077J1399j41266o8514F1790J89911
12857B51701b17832B05369c5076A73004n0336a41127c5142j33300I9169L5671
12847A34840i7243K1214A74322b01121g2443A44933a12471L4123C68451A923K20422
$$ plain form
12925 14528 -39525 293576 204471 135722 -128183 15800 26441 288671 75878 191102 -135365
12913 203664 233345 101847 211932 13528 67419 -14183 7415 -80145 -104390 111373 127722
12902 127722 31245 38297 263548 197452 222794 -21846 19580 -206104 163827 -263964 -130320
12890 -136196 -13930 268469 -13244 -145378 109243 163244 -73965 189366 -24823 60144 52078
12879 52078 142071 197093 353096 114506 263540 -131745 111509 63472 -92432 281627
12868 122081 -448989 68831 -99652 -459650 116223 -61077 -49678 -190944 -259458 61790 251701
12857 251701 -217832 205369 -35076 173004 122668 -141127 -35142 -168442 99169 134840
12847 134840 -97243 -76029 174322 -201121 -72443 144933 -112471 -78348 368451 1923 222345
12836B22345K6228B4773c6409A16653e1111C800a52479A23371k3602a25137G0189
12824e619n1121D859d7954B10202E4278K56595E5408b53108A51402b83501D68672
12812G8614Q7332n3584P7546B528f6716l65999C67899a32818K9790F0264c74255
12800A79667h6332B14091j03561B2656J53732K33678I8738K3720F0260b1488b023
12788C70434a78136A03097b03536M4784A93524L2099A6613P0389C0146q419g3793
12776B63963r2569E4861d7332l0781F1882J42991i2298I1134i6176B29602m9917
12765A79685K5912C4838R0858a5740I1638M9016a84047A22960b17462F0259J73958
12754B34217i7865A56933i7945n4311j55903I9781d8237n6446b8653A95922r4022
$$ plain form
12836 222345 248573 24773 -36409 116653 -51111 3800 -152479 123371 99769 -125137 70189
12824 -5619 -56740 4859 -47954 210202 54278 310873 55408 -253108 151402 -283501 468672
12812 78614 165946 112362 189908 2528 -66716 -432715 367899 -132818 -103028 60264 -374255
12800 179667 -86332 214091 110530 22656 176388 410066 98738 122458 60260 -21488 -2023
12788 370434 -178136 103097 -203536 -158752 193524 225623 16613 87002 30146 21727 -73793
12776 263963 171394 54861 -47332 -78113 61882 204873 -92298 91134 -96176 229602 179685
12765 179685 205597 34838 125696 -15740 91638 140654 -184047 122960 -217462 60259 234217
12754 234217 -97865 156933 -97945 -152256 -308159 99781 -48237 -104683 -28653 195922 101900
12743A01900D6785J72608f602A07860J14653C6587a14949B8051g4291D5352J095
12732D6447G139a65904N3015L5934n0303E01944k08080f1274B19964p2624e1969
12720b9267B33775d6415G9972c66038h806q3747l5941E37365D6843G274J4729
12709B2003b8716A106R3846L83548h3736c7016J8070D61345B13623p406J47381
12698C53598B3569f2269A62548C0927D958O3264J64536q6380f5831C2998j5990
12687A7008R449J24940b52529j95729E2136A5639a13487A81218b09748A41332
12676B8243L44679j63237q2175C0796J26387p2677R5535H5443K280J19179b7712
12664h281o1034j19682G8591l7212e5634J4858A17052M1782k9339K56260A25990
$$ plain form
12743 101900 46785 219393 -6602 107860 222513 36587 -114949 28051 -74291 45352 46447
12732 46447 7139 -165904 -112889 -76955 -127258 501944 293864 -61274 219964 147340 -51969
12720 -29267 233775 -46415 79972 -366038 -8806 -92553 -128494 537365 46843 7274 22003
12709 22003 -28716 1106 94952 478500 -83736 -37016 -18946 461345 213623 206217 353598
12698 353598 23569 -62269 162548 30927 4958 68222 232758 146378 -65831 32998 17008
12687 17008 26457 151397 -252529 -448258 52136 15639 -113487 181218 -209748 141332
12676 28243 372922 209685 127510 30796 157183 84506 180041 85443 87723 206902 -27712
12664 -8281 -69315 -188997 78591 41379 -55634 -40776 117052 158834 129495 385755 125990
12652b22B42158c8278A46498a12081C43582d18688f9333b1879B18233p856A03053
12640A24020a09749a3120F2458g1817A66817J14768i1301A46707L8407L0531j04828
12629A10817b75190A42621E0888a02195m6653B85373H0660K05848R6544M5196
12619D28248q7245j41541O5255C3463L04878a21788K2388a1746A29631l6773J43029
12608B35887b80785i073l9923h457k0816m6410j20692B19055b0774H1183K63339
12597C44522G544R5190a55962I2167A8907e7040D18247c6487m3192K3684E878
12585a66344D1591i5965A28673J76419i8926a3235l3008B8327L8437h5497q0597
12574a66094B67017b37301a1306r3103l1525E6021a32259k5695B8667K6300B051
$$ plain form
12652 -222 242158 -38278 146498 -112081 343582 -418688 -69333 -21879 218233 210377 103053
12640 124020 -109749 -13120 62458 -71817 166817 281585 -91301 146707 185114 215645 110817
12629 110817 -275190 142621 50888 -102195 -148848 285373 80660 286508 383052 428248
12619 428248 341003 199462 264717 33463 338341 -121788 -99400 -11746 129631 92858 235887
12608 235887 -280785 -9073 -48996 -8457 -29273 -75683 -196375 219055 -20774 81183 344522
12597 344522 7544 102734 -155962 92167 18907 -57040 418247 -36487 -79679 -55995 5878
12585 -166344 41591 -95965 128673 305092 -98926 -13235 -46243 28327 66764 -85497 -166094
12574 -166094 267017 -237301 -11306 -104409 -135934 56021 -132259 -157954 28667 54967 2051
12562b74959B65909j01551p9211k2176L02087d8053k8236h209C8732a45826J5169
12551a30657D8279P385L13713a44596B81767o6178f3795F1898B5199b3002n7546
12540h0548C05042a70681G4161a4319B8894a24741b2537l7851k4224l2296d0083
12528A36138J14237h0092j64333i3354D6466K59217f6372b0382O466k91651A52692
12516C2370h5149A84585E3039h9791n0033A10155J08114a03777A46071A8751J90751
12505B09502L4961D9398R9681b553C11739A32251e917k29137e8156d795D08659
12493B31721j4322a1426G7186K04941N2913d8424F32290A64353p0082P3868p6474
12482I1665J63082M9763r8687b60055J25937A68894F5059L7273k9675g8851F6836
$$ plain form
12562 -274959 265909 164358 85147 62971 365058 -48053 -76289 -8209 38732 -145826 -130657
12551 -130657 48279 55664 369377 -144596 281767 215589 -63795 61898 25199 -23002 -80548
12540 -80548 305042 -170681 74161 -14319 28894 -124741 -22537 -60388 -84612 -116908 -40083
12528 136138 250375 -80092 -244425 -93354 46466 305683 -66372 -20382 -13916 -305567 152692
12516 32370 -85149 184585 53039 -89791 -139824 110155 218269 -103777 146071 18751 209502
12505 209502 244463 49398 149079 -2553 311739 132251 -5917 -235054 -58156 -4795 408659
12493 231721 217399 -11426 77186 282127 335040 -48424 632290 164353 94271 168139 91665
12482 91665 254747 304510 205823 -260055 -134118 168894 65059 102332 72657 -78851 66836
12470b1119l1935j22928f4977G4254e2605C19835a87370i1994A71229F5633k7990
12459C7643M4457a17552j40530i3350B71390q8614l8306N6430e1606j81015E961
12447f2604o126F8955P3980a32713A00706m4460J85931a0235j69918D44686d7637
12435b8463k24826g47j3079l699I5162a67161N6163I1941a35941B5543b63717
12423a69353D14751b47264I7454g9072m3875b8547A45804d88305A65363G9350
12412A94524a56991B40894F2689E924g6491r5207M2139R234A2236b03904c5298
12400a49809I7798b65239b5158n0437j68509B36264m6820p7321a53614A69829
12389A17209a39511H9947L72813A56783a65325C7774b65534M2075c4360A29324
$$ plain form
12470 -21119 -53054 -175982 -64977 74254 -52605 319835 -187370 -91994 171229 65633 37643
12459 37643 82100 -117552 -258082 -93350 271390 182776 144470 200900 -51606 -232621 5961
12447 -62604 -68730 68955 142935 -132713 100706 56246 242177 -10235 -180153 444686 -47637
12435 -28463 -253289 -747 -13826 -17525 95162 -167161 -110998 91941 -135941 25543 -263717
12423 -169353 414751 -247264 97454 -79072 -122947 -28547 145804 -488305 165363 79350
12412 194524 -156991 240894 62689 5924 -76491 -171698 -129559 -120325 12236 -203904 -35298
12400 -149809 97798 -265239 -25158 -75595 -244104 236264 189444 112123 -153614 169829
12389 117209 -139511 89947 462760 156783 -165325 37774 -265534 -223459 -34360 129324
12378D2000O9370a25672M0417A96611c3708B2506f0286a7238B15666b10871A63175
12366a24542M8359D9088c7159l34424A72072h1356K3318f855n2730A67163L0527
12355A97690m5135e3602D49161d2990D2970M2258C0635c02704J44758l256e6635
12343a42002k6726p1312A31650o891I60J05035O8324C4782b49907c3156C182J1450
12331A4632a29494A15420b37370G3930h316o214j02120B7503b30716f5782F5221
12319A41578c25064A61968J68752G2738b60061M8202I5276g2386a3641A91293
12308e5653C5283a39374c8952Q757j05991j875j53124e4403A77387a0433J852
12297h581F5406A7000J18036J69235A07046J10727j04659J92326D7260K05363
$$ plain form
12378 42000 111370 -125672 -85255 196611 -33708 22506 -60286 -17238 215666 -210871 163175
12366 -124542 -76183 49088 -37159 -371583 172072 -81356 -58038 -6855 -59585 167163 197690
12355 197690 152555 -53602 449161 -42990 42970 85228 30635 -302704 -157946 -161202 -56635
12343 -142002 -168728 -240040 131650 124759 960 105995 174319 34782 -249907 -33156 3182 14632
12331 14632 -129494 115420 -237370 73930 -8316 -14530 -116650 27503 -230716 -65782 65221
12319 141578 -325064 161968 330720 72738 -260061 -211859 95276 -72386 -13641 191293
12308 -55653 35283 -139374 -38952 -30195 -136186 -138061 -291185 -54403 177387 -10433 -8581
12297 -8581 65406 17000 135036 304271 107046 217773 113114 305440 47260 252623
12287B52623M7297I104L42890j69465q4001J62724J18109f3577m2390J1026E1156
12275I5257A3597O4777g8540C73885D3429d04862G4179C6119c7023F0073i8155
12263A7838a37616f0612p3532f1152A91688b7078C1301a13689H1757b37590D0379
12251A40532g5862I5557a5304j16263A22467a03876G1320K6653c18224A47870
12240B06956N089p5537a06582A6987e8117H9141J6161f0635A52135K38403b87646
12228D570J66306E7127P5131Q4247g9571D731J6240M0149K11620m0638P110n5507
12216A83705p1684a56675L6047A42543J20175l2280c14785a00956g757C92873
12205G3010e0650F9894a09079F6018N5831J93287m4574n5876n3130N07990C05010
$$ plain form
12287 252623 299920 9104 351994 182529 98528 261252 379361 -63577 -105967 -94941 51156
12275 95257 13597 78374 -78540 373885 43429 -404862 74179 36119 -37023 60073 -98155
12263 17838 -137616 -60612 -134144 -61152 191688 -27078 31301 -113689 81757 -237590 40379
12251 140532 -75862 95557 -15304 -131567 122467 -103876 71320 97973 -318224 147870
12240 206956 212045 136508 -106582 16987 -58117 89141 105302 -60635 152135 390538 -287646
12228 4570 170876 57127 132258 216505 -79571 4731 20971 61120 272740 232102 239212 183705
12216 183705 112021 -156675 -120628 142543 262718 230438 -314785 -100956 -7757 392873
12205 73010 -50650 69894 -109079 66018 121849 315136 270562 214686 161556 669546 305010
12193C27113B8901J83189J28398j01383q9142R1370A6651J4757R0900l4932j7324
12182G0052B8509M98559A94572I2583C8106J41220m2217L7708L35086B40625R0278
12171C30903b60247J7147j9392B41270Q1578D3282A444L36305A58799J59043l4162
12160B83680A07034a20523B44521d316j35967B5989J09522K14967c1309H3365
12149B78279a03695j53699J05442l4618F0453K2630J10842J99508G6587l1448
12139D5139J64231n222b4925k08411i7653j00554i8552K8978B2856Q1705J03600
12128B08161P5945F5295h8182B15628E8836B5236L4460B0919a92582D27157H2052
12116e3114K3553k87949e0723a5151H0223A1173a42134c4550A41751K74888c0419
$$ plain form
12193 327113 28901 212090 340488 239105 149963 241333 16651 31408 122308 87376 70052
12182 70052 28509 527068 194572 92583 38106 179326 137109 174817 509903 240625 330903
12171 330903 -260247 -243100 -262492 241270 322848 43282 1444 337749 158799 317842 283680
12160 283680 107034 -120523 244521 -4316 -140283 25989 135511 350478 -31309 83365
12149 278279 -103695 -257394 -151952 -186570 60453 83083 193925 393433 76587 45139
12139 45139 209370 204148 -24925 -233336 -97653 -198207 -98552 -69574 22856 104561 208161
12128 208161 284106 65295 -88182 215628 58836 25236 59696 20919 -192582 427157 82052
12116 -53114 -29561 -317510 -50723 -15151 80223 11173 -142134 -34550 141751 416639 -30419
12104b12139o7138A79178D2055b09245j24149J31575i0084N274m3252D75324A45262
12092b14150J4676p2410B32875I2823C9872c2871h138B4114g4564j12840A10240
12080C53675B0343a81633A8280J23706a98047A87903L0302c8845J3092C42425
12069a62706M5576L9739D9333d619j03902l8362M736G7231l6068J47547a96678
12057a16808J4578B14959A9835K8305K0036J76533G1004d0673q0405e4983a5419
12045b58874K8661J07597r1653C272a10820n1193N1608M5869p275D1079j2242
12034B8837d4571A5011g1905A89095H0402e3644N064I4524N92033N07284C15917
12022C04861c5279F1623a02992D6690h4085A51604F4092K41723I6648e5155A89346
$$ plain form
12104 -212139 -279277 179178 42055 -209245 -333394 -201819 -90084 -84810 -128062 475324 145262
12092 -214150 -199474 -271884 232875 92823 39872 -32871 -8138 24114 -74564 -187404 110240
12080 353675 20343 -181633 18280 141986 -198047 187903 218205 -38845 -25753 342425
12069 -162706 -117130 -77391 49333 -4619 -108521 -146883 -142147 77231 41163 188710 -196678
12057 -116808 -102230 214959 19835 48140 68176 244709 71004 -40673 -121078 -54983 -15419
12045 -258874 -230213 -122616 -214269 3272 -110820 -162013 -110405 -64536 -71811 41079 28837
12034 28837 -44571 15011 -71905 189095 80402 -53644 -48580 94524 686557 1193841 315917
12022 304861 -35279 61623 -102992 46690 -84085 151604 64092 305815 96648 -55155 189346
12010b7754q9874A30589D6032a46345B72077A22996c24525I9022L2728a86566
11999A82331E7196b49980a8308h374l01846h8271B11905C9618h8991F7319R9061
11988A66380h3606A45516P2902j00963J57388L61601a36977a2624A75097H606
11977a70934g4300j9514k39885d6453C6245L8094A6286a5277j8088o6739l5109
11966a35213C14222D6422a60004A72801c0374k00449J12071k17061P4970A50595
11955a68582A93575b11682f2590C03029b68475B56177j00507I731M8260G630J22994
11944A30624a97778l5400Q978K5622R6919o6641B65999c52137a46985e074j20965
11933a26039j15593r172E6892g9831k82626a56210B8856g230j61388d0030B16614
$$ plain form
12010 -27754 -117628 130589 46032 -146345 272077 122996 -324525 99022 131750 -186566
11999 182331 57196 -249980 -18308 -8374 -310220 -88271 211905 39618 -88991 67319 166380
11988 166380 -83606 145516 218418 117455 274843 636444 -136977 -12624 175097 8606
11977 -170934 -74300 -93814 -333699 -46453 36245 74339 16286 -15277 -33365 -100104 -135213
11966 -135213 314222 46422 -160004 172801 -30374 -230823 -118752 -335813 -260843 150595
11955 -168582 193575 -211682 -62590 303029 -268475 256177 155670 9731 57991 7630 130624
11944 130624 -197778 -233178 -224200 -198578 -101659 -168300 265999 -352137 -146985 -5074 -126039
11933 -126039 -241632 -250804 56892 -79831 -362457 -156210 28856 -7230 -168618 -40030 216614
11921A52151B8376r724a41000O9330b4437A37943c78003J63537c8848D9527h7498
11909B32154a1107j67791n5674b4206G9965f1103J4146C09379c9517A59837p3068
11898H6769D222J84232a63403n6603h1188n5456j28715f3912E9501a1625C09053
11886b55025A19549C3970i2020G3427K66337A16241G333b22591B01176c12458
11875a97217j9676A357K8798K8513N4280M9710D7501B1545i8835A27499b18340
11863A9836d2888j43548k04374a48404D4365a24152E7135c00559A10093c58628
11852h4836j7831l32168A6253a20360j4486l74161A80239C513K4596c18189D7975
11840A57050G5280g1574D8836b07664c865A07800b17020L0622B2005c43655a33442
$$ plain form
11921 152151 28376 18652 -141000 -71670 -24437 137943 -378003 -214466 -38848 49527 -87498
11909 232154 -11107 -178898 -234572 -24206 79965 -61103 -46957 309379 -39517 159837 86769
11898 86769 4222 188454 -163403 -220006 -81188 -136644 -265359 -63912 59501 -11625 309053
11886 -255025 119549 33970 -92020 73427 339764 116241 7333 -222591 201176 -312458
11875 -197217 -216893 1357 30155 58668 112948 162658 47501 21545 -98835 127499 -218340
11863 19836 -42888 -186436 -390810 -148404 44365 -124152 57135 -300559 110093 -358628
11852 -84836 -102667 -434835 16253 -120360 -134846 -509007 180239 3513 28109 -318189 47975
11840 157050 75280 -71574 48836 -207664 -3865 107800 -217020 -186398 22005 -343655 -133442
11828i1646C0089O8190a78722p1512c7116a8094A0605h0412k09592Q4595M4594
11817a60815K4833n5233A65888b03129j7377D5704c25137E05J58036o3596R1570
11806A86515H3889K531b9524C60787A15001J42225G2033d4465a891k69070k9360
11795c00321O9188D684c77348A52052c60712J41096A93291G1574d9628A65500
11784G6863J5160k4724N6843l5957a46100B19746r4729J81286A29463c69708I3085
11772i4949A05019J08773a73224B40135i2153c9174j642j34737b1518A42609o7263
11761G5346e7845B5798J59771p7315D2160J1032b33783D5542R8866j5213d031
11749b45168H71i5010B0428J11871f7442l33981A9704P4227J55563C6537a15702
$$ plain form
11828 -91646 30089 98279 -178722 -250234 -37116 -18094 10605 -80412 -290004 -205409 -160815
11817 -160815 -135982 -191215 165888 -203129 -220506 45704 -325137 505 158541 94945 186515
11806 186515 83889 86420 -29524 360787 115001 257226 72033 -44465 -1891 -270961 -300321
11795 -300321 -231133 4684 -377348 152052 -360712 -219616 193291 71574 -49628 165500
11784 76863 92023 67299 124142 88185 -146100 219746 125017 306303 129463 -369708 93085
11772 -94949 105019 213792 -173224 240135 -92153 -39174 -40816 -175553 -21518 142609 75346
11761 75346 -57845 25798 185569 108254 42160 53192 -233783 45542 144408 129195 -4031
11749 -245168 871 -95010 20428 132299 -67442 -401423 19704 93931 249494 36537 -115702
11737B5912a81263I835K48424a64147j47499C6478b19473H3788a77522A51199
11726h0960B36133O2793D1902d8964B9440a11B23292H03J32657a35928I8071c3594
11713b19666e73A40642b01451M9301B4628q307L19040A0347J53531Q7562o1045
11702A90395D2531J65080a25236l6219g6622E0635e1178A59299K63214a20540
11691A13754a17423I9247a19274B78041j29306p0399a25820C42435A43152b7401
11680B04819a37206C33233F0745N0388J73685d1342C7328K3604f4464E3630b76336
11668i3311A0941O9318b10172a9104n8630r3018A09648M673c92219A55437m0307
11657A15130a32830A20573C1378R5147A6123J6232e1817B27991b32077H1666Q3643
$$ plain form
11737 25912 -181263 9835 258259 -164147 -311646 36478 -219473 83788 -177522 151199
11726 -80960 236133 298926 41902 -48964 29440 -111 223292 803 133460 -135928 98071 -33594
11713 -219666 -573 140642 -201451 -152150 24628 16321 335361 10347 163878 251440 190395
11702 190395 42531 207611 -125236 -161455 -76622 50635 -51178 159299 422513 -120540
11691 113754 -117423 99247 -119274 278041 148735 78336 -125820 342435 143152 -27401
11680 204819 -137206 333233 60745 111133 284818 -41342 37328 60932 -64464 53630 -276336
11668 -93311 10941 80259 -210172 -19104 -77734 -170752 109648 114321 -392219 155437 115130
11657 115130 -132830 120573 31378 126525 16123 32355 -51817 227991 -232077 81666 165309
11646A65309e0658A19751l5317a74316B14490a17039A24577j8534D8903f0567
11635c3651j74892Q0902c1779B37122a31571A9724o500Q6843k098a21862I5243
11623A34026L4824c6145A2866M3214K15187j20534G2141K12624b11400E4292N2898
11612A07190J9551g4807C48657a59221F886a12623m815C97543H3833d9976A7953
11600B9482e0674n4192A27059a83031P5562I2625R8919H3988c55264F8105h3843
11588d3776p9861H6714g7060E4472K6562j0482b68348A97958o8053k8186D572
11576A84994a28912K3551d2728H0939A6557a42154F2535B0622b7415I6500J55653
11565B52153c4073H1531a05711k5263I8309J77381I577L04982b63862J20023f7416
$$ plain form
11646 165309 -50658 119751 84434 -174316 214490 -117039 124577 106043 48903 -60567
11635 -33651 -208543 -127641 -31779 237122 -131571 19724 13224 100067 97969 -121862 95243
11623 134026 168850 -36145 12866 56080 271267 150733 72141 284765 -211400 54292 107190
11612 107190 126741 -74807 348657 -159221 6886 -112623 -117438 397543 83833 -49976 17953
11600 29482 -50674 -104866 127059 -183031 -107469 92625 191544 83988 -355264 68105 -83843
11588 -43776 -123637 86714 -77060 54472 81034 70552 -268348 197958 129905 101719 4572
11576 184994 -128912 -105361 -42728 80939 16557 -142154 62535 20622 -27415 96500 252153
11565 252153 -34073 81531 -105711 -130974 98309 275690 9577 314559 -263862 -143839 -67416
11553B69129H4739k0649b14957A22303b42140A49574J00505D9290a94833I6515
11542B0608e9567H2814K36803a55099B33281n19C0413A1538J21634h584I5901
11530A47176l6499J9811d2181C24417p2498J10193D6937g7461J907A02237a02907
11518A3278D735Q4345J6446O2330C8347N2090C2178K43556b05540B8545d0604
11506B6923K21266J86219f8101B70229a26241K9375a3945B37799J22431A26648
11495A47568K3643K4017K2633o3825J55708G9953K10792a54572k2694A63122a14710
11483A84941j5782J16800C5458a51264J8898C46382K53049B74041o3019O6559
11473B77581Q2287d707E918J47217n596k7359N2868N898o9204J6486A8847J22996
$$ plain form
11553 269129 84739 64090 -214957 122303 -242140 149574 250079 49290 -194833 96515
11542 20608 -59567 82814 319617 -155099 233281 232762 30413 11538 133172 -8584 95901
11530 147176 110677 130488 -42181 324417 251919 362112 46937 -77461 -75554 102237 -102907
11518 13278 4735 89080 105526 167856 38347 90437 32178 275734 -205540 28545 -40604
11506 26923 248189 434408 -68101 270229 -126241 -96866 -13945 237799 360230 126648
11495 147568 171211 195228 217861 154036 309744 79953 290745 -154572 -177266 163122 -114710
11483 184941 169159 285959 35458 -151264 -132366 346382 599431 274041 211022 277581
11473 277581 359868 -4707 5918 153135 147539 120180 173048 178946 109742 126228 18847 141843
11461A41843O1195M4487E2617J36742b4360K579m8464n2146H6479L2122J35862
11450B54463p4776q595b55580B99512A17780L7830O4396a80183A86808J14694
11440C01502P289A23310n2291J38400K4209O0501j00767l114b33612A87646C6036
11428A59320k2672F4872K44726F4039i6334j36791H347P6222m0134b11776B7017
11416A01576c28116a0524H87b26656A71672G8373m098c8114j13968O929C2433
11404e4688B19597G9603K11515I5073J81408c35820a08001C25461g4042j10732
11394a84774g6143j97846d4532I1661K04923h8913A53975J78069a97264C4019
11383A41890P0363g9889G171K8045P1202a63775g2992l74585B7601d2064A83797
$$ plain form
11461 141843 203038 247525 52617 189359 -24360 -21781 -70245 -122391 86479 118601 254463
11450 254463 179687 171092 -255580 299512 117780 155610 220006 -180183 186808 301502
11440 301502 308791 123310 71019 209419 233628 294129 193362 190248 -233612 187646 36036
11428 159320 136648 64872 309598 64039 -96334 -233125 8347 84569 44435 -211776 27017
11416 101576 -328116 -10524 887 -226656 171672 78373 74275 -38114 -152082 -145153 32433
11404 -54688 219597 79603 291118 95073 276481 -335820 -108001 325461 -74042 -184774
11394 -184774 -76143 -273989 -44532 91661 296584 -88913 153975 332044 -197264 34019
11383 141890 212253 -79889 7171 35216 106418 -163775 -72992 -447577 27601 -42064 183797
11371A40454n4089e6611j75269b4141j21984F1364K12904c1780A19595a49240
11360f0983A89848g9360A66952a77414f9753K9443A17181a77407D2684c3515D6550
11348e47496e9137k5308q1288I2189b06702A84463R7419D5232h6518A36138E992
11336B28060I7043J49163j10694E1771J10268J14569c84508Q5980e565A67894
11325b868G8969a31167A54297d1080I8489a29460p769A43925F6656c6328o7508
11314a03836G5309A9787M970K11130d94271i6956j57685e4090A3197a83661C63311
11302B75870F1165J24009G582K81962E8749b47000F3259A0232a61295G2024a72992
11290b18612a09149m9129c7734F2170M8703a15843J7559A84416q9633e2454B6262
$$ plain form
11371 140454 86365 -56611 -231880 -24141 -146125 61364 274268 -31780 119595 -149240
11360 -60983 189848 -79360 166952 -177414 -69753 -40310 117181 -177407 42684 -33515 46550
11348 -547496 -59137 -84445 -165733 92189 -206702 184463 281882 45232 -86518 136138 5992
11336 228060 97043 246206 135512 51771 162039 276608 -384508 -298528 -5565 167894
11325 -2868 78969 -131167 154297 -41080 98489 -129460 -137229 143925 66656 -36328 -103836
11314 -103836 75309 19787 24757 235887 -494271 -96956 -254641 -54090 13197 -183661 363311
11302 275870 61165 185174 7582 289544 58749 -247000 63259 10232 -161295 72024 -172992
11290 -218612 -109149 -158278 -37734 62170 110873 -115843 -98284 184416 94783 -52454 26262
11278F704P1429K2850a01621J8829r3515e6215B4389a65279A51685D827g5017
11266a85214j92298J6170a2197G5252f0292A3290K13070d22565G5114b63712c5098
11254c22465c7205C9628b3427A45202O6656R892a99672E1047b17450d8410B7192
11242b95422F766K7476a70468L7175E4276A4304d81057I5030a63667k9182C2457
11230I7857d01446B22194c88923D3032a61939N6316e17F1881O91j7987h8643k59134
11218c47777B0727J5258b12948o8066A87472J90214A00238e644A28866a31828
11207a64648o891l5141A23743B8386c12720A46444a10910A71847b74528j33245
11197d07773J22507a1133n3757E410c8589I0152K01006A34824d17358J65017f3453
$$ plain form
11278 6704 78133 100983 -101621 -82792 -176307 -56215 24389 -165279 151685 4827 -75017
11266 -185214 -377512 -361342 -12197 75252 -60292 13290 226360 -422565 75114 -263712 -35098
11254 -322465 -37205 39628 -23427 145202 211858 221750 -199672 51047 -217450 -48410 27192
11242 -295422 6766 34242 -170468 -133293 54276 14304 -481057 95030 -163667 -192849 32457
11230 97857 -401446 222194 -388923 43032 -161939 -105623 -517 61881 62572 44585 -88643 -347777
11218 -347777 20727 35985 -212948 -281014 187472 377686 100238 -5644 128866 -131828
11207 -164648 -171539 -206680 123743 28386 -312720 146444 -110910 171847 -274528 -407773
11197 -407773 -285266 -11133 -64890 5410 -38589 90152 291158 134824 -417358 -252341 -63453
11185d0205n4803r8935Q2828L1773L018F7112b45137d4052j71029G399a24835
11173E822b30646F0680a89233N7645G9965l5040d69104C77375d1793A95374a81461
11161B6362J8259e1122k04780A13108f1239j71508K0007e3037k7144A1159J43875
11150A55034a79531O8296j42434d4244p0887N1203c0613B97551I2922b0525k0075
11139d0600J3560B39380A03385a32233M7746A58747h5206j19407e7760J1206B84115
11127e4037k15483H9556N1716d8504o4928A15023J0452n3416b33621A0174b00134
11115D5695a8111B50636m4924a3143k66734i3269B10143b36518B97318M5543O2973
11104D05834r8567J49989A40515R4437J38651D7516Q791k5232L25680o9638A9924
$$ plain form
11185 -40205 -95008 -193943 -111115 -79342 -76324 67112 -245137 -44052 -215081 7399 -124835
11173 5822 -230646 60680 -189233 -131588 79965 44925 -469104 377375 -41793 195374 -181461
11161 26362 44621 -51122 -255902 113108 -61239 -232747 -212740 -53037 -80181 11159 155034
11150 155034 -179531 -111235 -253669 -44244 -115131 -63928 -30613 297551 92922 -20525 -40600
11139 -40600 -27040 239380 103385 -132233 -84487 158747 -85206 -204613 -57760 -46554 284115
11127 -54037 -269520 89556 141272 -48504 -113432 115023 125475 72059 -233621 10174 -200134
11115 45695 -18111 250636 205712 -13143 -279877 -93269 210143 -236518 297318 342861 405834
11104 405834 307267 457256 140515 234952 373603 47516 56307 31075 356755 287117 19924
11092A99921I7982J76223I5726m4572L421J71875L14528B62637M7620k2602n7194
11081B30461l3761L2535a32065A79078o8597K06565A40520i631F08421B7831M12337
11070D40168k03032l6187K89603p6892r4574o0480c2176F03490L3329A95128J97397
11059C92525K72399B85436K59526k3413J58161Q3913o2740K0462j0079j38932
11049E72334j52177N47153m66729L55824k78451O44062j76662j72846j31556C29541
11038I93044k3912k3881P9801l19314j38131L01799j37018j99396r4800K98658
11028G36850m2572j398L05682l63912p3296L23758j35555j06758N8921j39876
11018E61844K51447k35854Q0241Q2457k97250J29331l8061J58821k75582M31887
$$ plain form
11092 199921 97982 274205 95726 51154 54575 226450 540978 262637 310257 287655 230461
11081 230461 196700 229235 -132065 179078 110481 317046 140520 -9631 608421 27831 440168
11070 440168 237136 200949 490552 413660 319086 258606 -32176 603490 636819 195128 392525
11059 392525 664924 285436 544962 521549 679710 763623 700883 721345 711266 572334
11049 572334 420157 967310 500581 856405 577954 1222016 1045354 872508 740952 329541
11038 993044 969132 945251 1025052 705738 567607 869406 732388 532992 438192 736850
11028 736850 694278 692880 998562 634650 561354 885112 749557 642799 701720 561844
11018 561844 813291 577437 657678 740135 442885 572216 534155 692976 417394 849281
11008H49281R474k3881j19715J56449q4765P9249l73018J98179J14297j00605
10998G04945J50142j20816j6227j01217K47745J27205B81196K10620J49901L25342
10988I67059M713m0233Q7786J74652n338l45614L14217M04362l33144L01224j35826
10977A393858M43896L63316O607L44738K33307J78508O50518m38921N20973l62043
10967C334757j38216l63352k11409n13585k86729j56204j5307j13910o3581J14256
10957A586720j48701J89261j1089m53469J60055m22999j91128P6978l89131Q9776
10947D86273p3597K0741o9311j68112a0222A48256K06766Q5640E6753P1101M9189
10936A77043b06963B29442j7198b1669o5724j28186B11703A03846e725F0881Q6299
$$ plain form
11008 849281 858755 834874 715159 871608 786843 866092 493074 691253 805550 704945
10998 704945 855087 734271 718044 616827 864572 991777 281196 491816 641717 967059
10988 967059 971772 931539 1019325 1193977 1188639 843025 1157242 1561604 1228460 1529684 1393858
10977 1393858 1837754 2201070 2207677 2552415 2785722 2964230 3614748 3175827 3696800 3334757
10967 3334757 3196541 2833189 2621780 2108195 1821466 1665262 1649955 1536045 1472464 1586720
10957 1586720 1438019 1627280 1616191 1162722 1322777 899778 708650 785628 396497 486273
10947 486273 412676 433417 364106 195994 -10222 148256 355022 440662 56753 127854 177043
10936 177043 -206963 229442 212244 -21669 -87393 -215579 211703 103846 -5725 60881 147180
10925A47180n1071K37959I5238k7794L70025A10926b17862H261c86115A6106Q4186
10914A00292J1271A7605a02801A20275A4343K11259g5981o5110B14972K05322
10904D20294a85769j56081a4208A37553q36b38827e837A14877C7763a88424j69872
10893c58296I5634i3436k8168A48702K2262c5757l7981j62579A71024a67001A0146
10881B1193g9886C8626P5286J42468o8024e868j9972j20675j47217M02A12031
10869b25047A37893L6980b50378g0152C6648l43a52221f748A41076H219a7505
10857a15619l33161B9868K0995b13276g2658j19895N1711A11038m5930c5242A95046
10845b57779A54507D9914d7514E1579J92589m46a73333A47421i3104d3592k28864
$$ plain form
10925 147180 96109 334068 95238 67444 437469 110926 -217862 8261 -386115 16106 100292
10914 100292 111563 17605 -102801 120275 14343 225602 -75981 -141091 214972 420294
10904 420294 -185769 -341850 -14208 137553 136717 -238827 -5837 114877 37763 -188424 -358296
10893 -358296 95634 -93436 -121604 148702 170964 -35757 -73738 -236317 171024 -167001 10146
10881 21193 -79886 38626 113912 256380 188356 -5868 -25840 -146515 -293732 -293330 112031
10869 -225047 137893 174873 -250378 -70152 36648 36305 -152221 -6748 141076 8219 -17505
10857 -115619 -448780 29868 50863 -213276 -72658 -192553 -140842 111038 65108 -35242 195046
10845 -257779 154507 49914 -47514 51579 244168 243722 -173333 147421 -93104 -43592 -272456
10834b72456B94991b69701c4305H2369L9765a10252j29912B01938L1319B8499
10823a63977C9228a55554m9519i7511K0589l08188J32132L6488N8767A4952e4261
10811f196A48940k8737a75382l9647d9791n8531c0917A54510J4993a60848A43783
10799b7493B35193M7861b53575K7323b9161q8249A5668A402Q0485a27588J3886
10788a13702C38682A9010b05029f3382D5071J41716J8406p6213J9909p4278L16400
10777C91011b29271P1199f9374l493A88569f5675o2381l2827A11382a36355l6643
10766a72998a4138j98514m5199d3345A21756H243a45651g2794a6625H5094c9111
10754a10066c9812o5113A29363b5049A94855F3255I514a09622j29884J11193j00602
$$ plain form
10834 -272456 294991 -269701 -34305 82369 122134 -110252 -240164 201938 233257 28499
10823 -163977 39228 -155554 -205073 -97511 -76922 -385110 -252978 -216490 -157723 14952 -54261
10811 -6196 148940 120203 -175382 -215029 -49791 -108322 -30917 154510 169503 -160848 143783
10799 -27493 235193 283054 -253575 -226252 -29161 -117410 15668 1402 81887 -127588 -113702
10788 -113702 338682 19010 -205029 -63382 45071 186787 205193 128980 148889 74611 391011
10777 391011 -229271 -158072 -69374 -72867 188569 -65675 -128056 -160883 111382 -136355 -172998
10766 -172998 -14138 -212652 -257851 -43345 121756 8243 -145651 -72794 -16625 85094 -39111
10754 -110066 -39812 -104925 129363 -25049 194855 63255 9514 -109622 -239506 -128313 -228915
10743b28915R8633A55630b0619k01415A65140C9063c23809J15559A33470n2419
10733H1051a54140j78828B86199j11786b278l6509j84663j6736H5526J89886k7715
10722B47697b95922a34172B09340i657k26449a5720q8680k8326A88692C729J7975
10711B1704d16438A17800e7180B00551e6039j30565R1938C0722a39070d0544G9981
10699a21250H5782J31666c69826d0577q3802o1150C18149a20802I162c93918B13600
10687d87030K01238p4103L6801o9289D65265a53162m646B05652a81822q9560C22631
10675d112k73874B23275A11076b27604P7470j37549a4066l28974A5773h5735C15918
10663a10879j67845K2654D6529a13897A31371Q2037a69332D3349c28104j37878
$$ plain form
10743 -228915 -130282 155630 -20619 -222034 165140 39063 -323809 -208250 133470 81051
10733 81051 -154140 -332968 286199 174413 -2278 -38787 -223450 -240186 85526 275412 247697
10722 247697 -295922 -134172 209340 -9657 -236106 -15720 -104400 -132726 188692 3729 21704
10711 21704 -416438 117800 -57180 200551 -56039 -186604 -94666 30722 -139070 -40544 79981
10699 -121250 85782 217448 -369826 -40577 -124379 -185529 318149 -120802 9162 -393918 213600
10687 -487030 -285792 -359895 -323094 -392383 465265 -153162 -157808 205652 -181822 -271382 322631
10675 -4112 -277986 223275 111076 -227604 -150134 -287683 -14066 -343040 15773 -85735 315918
10663 -110879 -278724 -256070 46529 -113897 131371 213408 -169332 43349 -328104 -465982
10653d65982A02187J4581a2960E3427d1571k58012c7289j15145A73680i1925r6936
10642a88861q2912f7987A60374g1409A1856a7165r8141C1742O1997M3901a62681
10630f5954A26278d7986F6887b41798j63908Q8363b9411m3600a7037j85227j14885
10619c17149A47485C2309c19693E1546M7937h4490l68010J92445k1158C2561q822
10608B3739F566Q988a708j82696q568B29592H5222k3730b70192b5442k45760j4472
10596b85674Q1918n9544g2003j85191g7292j1804p8609C31860a38336H2568b67667
10584B68013a43901j44316C2938a90506f8906C9786M7415d9652F0281a15779B37531
10572A11136a04621B8085e4110l3211a2585j13652p7489a4284L14l74071A02757
$$ plain form
10653 -465982 102187 116768 -12960 53427 -41571 -299583 -37289 -152434 173680 -91925 -188861
10642 -188861 -271773 -67987 160374 -71409 11856 -17165 -115306 31742 93739 137640 -162681
10630 -65954 126278 -47986 66887 -241798 -405706 -317343 -29411 -73011 -17037 -202264 -317149
10619 -317149 147485 32309 -319693 51546 99483 -84490 -452500 -260055 -281213 32561 23739
10608 23739 6566 15554 -1708 -184404 -192972 229592 85222 61492 -270192 -25442 -271202 -285674
10596 -285674 -203756 -263300 -72003 -257194 -77292 -89096 -167705 331860 -138336 82568 -267667
10584 268013 -143901 -288217 32938 -190506 -68906 39786 87201 -49652 60281 -115779 237531
10572 111136 -104621 28085 -54110 -87321 -12585 -126237 -203726 -14284 -13970 -388041 102757
10560A40609j3138l1979B5058a66149p9259p7117A54411E1582c5287R882j44440
10549a69845h0513H4555a43454c8548o8574j04167E9243b35636o0575A77715a4253
10537A15759k5465i8323H3501a03215B02338B1935d05117E3865K09362a62072
10526C24178d0689f16A45N5068i982r6228j54975a04771l9751c7567b942A75304
10513C00423j29807c9733j77395e2461l0641C1212a3122j61269c2624F459O6045
10502G2504J7066B1215a56442A55154N5188g6243j61842P157K7860C14809a54063
10490a40516F3524g2407A79968K57545d76670a10857B7708K14856K36939m243
10480D75260j89908m3593e3166C86125f6756B02309a1325B57565n0112m2217Q211
$$ plain form
10560 140609 127471 95492 25058 -166149 -245408 -322525 154411 51582 -35287 -25405 -169845
10549 -169845 -80513 84555 -143454 -38548 -107122 -211289 59243 -235636 -296211 177715 -14253
10537 115759 90294 -98323 83501 -103215 202338 21935 -405117 53865 263227 -162072
10526 324178 -40689 -616 145 55213 -9982 -106210 -261185 -104771 -144522 -37567 -2942 175304
10513 300423 170616 -39733 -217128 -52461 -83102 31212 -13122 -174391 -32624 6459 72504
10502 72504 89570 21215 -156442 155154 210342 -76243 -238085 -230928 -203068 314809 -154063
10490 -140516 63524 -72407 179968 437513 -476670 -110857 27708 242564 479503 475260
10480 475260 285352 241759 -53166 386125 -66756 202309 -11325 257565 207453 165236 173447
10469A73447H2476J2656a41576D513d8974I293g689A86947P6154E8290L72183
10458D30473a08798B12363b0328l56404e6321A56072b7658I6661J5756a33300
10447g0852H2549R2642a19695A5798K2726e01831E7827a51710C10936a45171r7236
10436b42407B8085J87264h0443B1447K60956A919a6394o4422a8757k59946H096
10424b47317J19369L1740A89419J78c4028n9390j19962A50385n6697K5150a12653
10412a88270M3028I5394l8440O2347c09374J46966q142a2872B22675b8409D04575
10400A61172p7389J46094h8435B90133L2031n3599M7603A13882b8982A7404c07714
10388B73243H6681K994L67244A63727l6140J30731A23218R4839p8484a10399A47240
$$ plain form
10469 173447 82476 95132 -141576 4513 -48974 9293 -7689 186947 263101 58290 430473
10458 430473 -108798 212363 -20328 -376732 -56321 156072 -27658 96661 112417 -133300
10447 -70852 82549 175191 -119695 15798 38524 -501831 57827 -151710 310936 -145171 -242407
10436 -242407 28085 215349 -80443 21447 282403 1919 -16394 -80816 -18757 -278703 8096
10424 -247317 -127948 -96208 189419 189597 -34028 -93418 -213380 150385 93688 118838 -112653
10412 -188270 -145242 95394 56954 119301 -309374 -162408 -170550 -12872 222675 -28409 404575
10400 161172 83783 229877 -88435 290133 322164 268565 316168 113882 -28982 17404 -307714
10388 273243 86681 89675 456919 163727 127587 258318 123218 218057 139573 -110399 147240
10376e0001F7636K08658R5861A63440K41107A57118K91393p1213j73068P8556
10366B82786K39259B58280L26321G3767L93287f8238A96823J59118J76906A41277
10355A26108j3938J15851J65416M9325K89344l31393J33900n7586G15J77601O3655
10344B41971A07334J61203j28310K75021A49856K65250A51589B3732M81646k14955
10334B90423A37914O5817K08694A61343h4251f951p9051j90391A13002a65358
10323H7920K40285A30228f9059C56430K20321k66797D5105J70327k8200l9139
10313A48093E7678h4011F8077e94k35538A16935a54645B68931N8988g8081B63511
10301B57865j00736F4312J86644E4948a16989C15835h9657A93097a10515A9665
$$ plain form
10376 -50001 67636 276294 372155 163440 404547 157118 448511 377298 204230 282786
10366 282786 522045 258280 584601 73767 467054 -68238 196823 355941 532847 141277
10355 126108 112170 228021 393437 442762 732106 400713 534613 477027 715 178316 241971
10344 241971 107334 268537 140227 415248 149856 415106 151589 23732 505378 290423
10334 290423 137914 203731 412425 161343 -84251 -6951 -86002 -276393 113002 -165358
10323 87920 328205 130228 -69059 356430 576751 309954 45105 215432 187232 148093
10313 148093 57678 -84011 68077 -594 -236132 116935 -154645 268931 327919 -78081 263511
10301 257865 157129 64312 250956 54948 -116989 315835 -89657 193097 -110515 19665
10290b85309a13452D7280J0340b5440A17729J71902e8048F8281h9674j5931K861
10279a02744F846J55257f5840A49754a29937e9887j33849B01797C9432J16921
10269A56353a6404C2966M19021B9549i222j22160j5793C424L87015j56007J67520
10258D01952A3257J86203b7951m9501m3302A81685b44996D8271J2938a27226A95422
10246a02575d8367k18307b4378k0977A7008J30097b57604e2979B5535L0736d141
10234a13667j2846n1910D2622c75836a63334L6483j08873C1345K37668b8226D8648
10222A54313c2588k51697B32663c59760a17006A4684a33956K0369C6450k170a60092
10210A5488g2821F3132a76412r0040a10859j13320Q8627H4543J22599I4350b28186
$$ plain form
10290 -285309 -113452 47280 57620 -25440 117729 289631 -58048 68281 -89674 -105605 -102744
10279 -102744 6846 162103 -65840 149754 -129937 -59887 -193736 201797 39432 156353
10269 156353 -16404 32966 451987 29549 -9222 -131382 -147175 3424 390439 234432 401952
10258 401952 13257 199460 -27951 -77452 -120754 181685 -244996 48271 61209 -127226 195422
10246 -102575 -48367 -266674 -24378 -45355 17008 147105 -257604 -52979 25535 56271 -4141
10234 -113667 -126513 -178423 42622 -375836 -163334 -126851 -235724 31345 269013 -28226 48648
10222 154313 -32588 -284285 232663 -359760 -117006 14684 -133956 -113587 36450 34280 -160092
10210 15488 -72821 63132 -176412 -266452 -110859 -224179 -135552 84543 207142 94350 -228186
10198a08434k22522m9102a35704k96198R4869c649F2823c4144k54989F4264a21490
10186e5505q4586k23755d3919j32852D6939g1000k38009o7478c9949n4963H5024
10174A24621D374J34953a77324D00880b5952p4310b2847H3701C6098J70039g3603
10162c468A86b43325p6312g2695j55257j49596e5504o6676C6716b3435j2892j22548
10150a58875k56322i1135M573r18K5403d958k15879h7959A83239c82672A97863
10138A07417A007a01700A04066Q3876A5085K29822a89085l64975A6319J48207
10128A64526f5333q8705E8019k036O513c24094a23910A13947L075l4396a65599
10116a58565d0072k37474A78931n1221k3220g5370C05513A24913a50940E2431
$$ plain form
10198 -108434 -330956 -380058 -135704 -431902 -337033 -3649 62823 -34144 -289133 64264 -121490
10186 -55505 -140091 -363846 -43919 -176771 46939 -71000 -309009 -376487 -39949 -94912 85024
10174 124621 4374 139327 -177324 400880 -25952 -100262 -22847 83701 36098 206137 -73603
10162 -3468 186 -243325 -319637 -72695 -227952 -377548 -55504 -122180 36716 -23435 -36327 -158875
10150 -158875 -415197 -91135 -86562 -87480 -62077 -4958 -220837 -87959 183239 -382672 197863
10138 107417 1007 -101700 104066 187942 15085 244907 -189085 -554060 16319 164526
10128 164526 -65333 -154038 58019 55983 62496 -324094 -123910 113947 117022 82626 -165599
10116 -158565 -40072 -277546 178931 127710 104490 -75370 305513 124913 -150940 52431
10105d0666j37004A24789b53594g6802k31023A28896J3501b3716A9623a80233
10094a41058k51460a63057B3030g2385A7793a72945A0207b67410h6334j31881
10084b18215i0614m3645p2247i5186c4699B29830G1225J2234J00633G2317b0237
10072I4589A7791h9879A36240n1903a60952m9353A94680B160c83359A41181K8535
10061A69716a68470A98285m2706g2715j01736A5496a74657A25813E5972P5117
10051A31089a3616j66845Q3356d5734j21167e1542p9276d667A79319C9687Q6015
10040A25702b96963B80930b95944P0336B35451f6276j68551k24317A19139b42371
10029a92835A05440b0291B4457J92829J5157c95504a39176G3808K1037b95622
$$ plain form
10105 -40666 -177670 124789 -253594 -76802 -307825 128896 142397 -23716 19623 -180233
10094 -141058 -392518 -163057 23030 -72385 17793 -172945 10207 -267410 -86334 -218215
10084 -218215 -90614 -134259 -206506 -95186 -34699 229830 71225 83459 184092 72317 -20237
10072 94589 17791 -89879 136240 84337 -160952 -210305 194680 2160 -383359 141181 169716
10061 169716 -168470 198285 155579 -72715 -174451 15496 -174657 125813 55972 131089
10051 131089 -13616 -180461 -97105 -45734 -166901 -51542 -130818 -4667 179319 39687 125702
10040 125702 -296963 280930 -295944 -225608 235451 -66276 -234827 -459144 119139 -242371
10029 -192835 105440 -20291 24457 217286 232443 -395504 -139176 73808 94845 -295622
10018a60071D2253B543b57464D3769a84838b6013k52166C14164a9934k03368R7222
10007a26080k94629A51633o6666C4106f017p2722k09920e6371b6602C0930b35
9995C5615J30351h8678B35430b27462O2277F632P5509m0029K3679a10962j6024
9984a26986l026A10660A5661O1279b00643A71897e9027H6053a92234A23669P8665
9973B02334d0599B10660a4678B42661C4419J47371F7400J29674a6121j93251R3317
9962a16055E441a25044A20801J34484a52617J4683a0170j18261G1433n460K98710
9951C64683G8176a27354B16554E8563i0324q6433g0280A20973c07927K651Q9719
9940b15557c0277q5076j32868h3113k05671A04226l3755g6049Q321j15678j6698
$$ plain form
10018 -160071 42253 2543 -257464 43769 -184838 -26013 -278179 314164 -19934 -223302 -126080
10007 -126080 -420709 151633 84967 34106 -6017 -78739 -288659 -56371 -26602 30930 -235
9995 35615 165966 -88678 235430 -227462 -165185 6632 82141 42112 65791 -110962 -126986
9984 -126986 -130012 110660 15661 76940 -200643 171897 -59027 86053 -192234 123669 202334
9973 202334 -40599 210660 -14678 242661 34419 181790 67400 197074 -16121 -209372 -116055
9962 -116055 5441 -125044 120801 255285 -152617 -137934 -10170 -128431 71433 65973 364683
9951 364683 78176 -127354 216554 58563 -90324 -176757 -70280 120973 -307927 -305276 -215557
9940 -215557 -30277 -115353 -248221 -83113 -288784 104226 70471 -76049 -67728 -183406 -200104
9929b00104L1678F4842e3807a053k68554k2791j70888K10235k38629A11011d36429
9917h7521A6516p649g9847q639j51347J15709a3181j72102c3974o6349k5702a4529
9904a13157C9170a3709j9689j49220j79966a58825C6629J4202J12215Q435f894
9892b8449j44006h1234b3064H4068a52835L0261A92304I459c18510E0995a12461
9880D5470J67359a8211A90228d837j79345F7973b70705h7794C1595J62801o9565
9869A24831a32886j4034A12670b12621F7237B9087O737d69663A69184K4381B9960
9857b81450f379o6419A25980g8828A7541a3315A54894b42769a6288j37527k681
9846a56496A3679i2742a0929k21894J08310J3065m7212n6126g8869q6229D5595
$$ plain form
9929 -200104 -168426 64842 -53807 -1053 -269607 -292398 -463286 -253051 -491680 111011 -436429
9917 -87521 16516 8867 -79847 -88486 -239833 -124124 -13181 -185283 -33974 -100323 -126025 -14529
9904 -113157 39170 -13709 -33398 -182618 -362584 -158825 36629 50831 163046 171481 -6894
9892 -28449 -172455 -81234 -23064 84068 -152835 -122574 192304 9459 -318510 50995 -112461
9880 45470 212829 -18211 190228 -4837 -184182 67973 -270705 -87794 31595 194396 124831
9869 124831 -132886 -146920 112670 -212621 67237 29087 35824 -469663 169184 193565 29960
9857 -281450 -6379 -72798 125980 -78828 17541 -13315 154894 -242769 -16288 -153815 -156496
9846 -156496 13679 -92742 -10929 -232823 -124513 -111448 -158660 -214786 -78869 -165098 45595
9834e2310A7161a74261L6271k07544j5013i9243A95547c05346A8828Q6584a05947
9822B45182A2083a95339h0917j61523j31573M9195J55740H9515R0195b23957e0839
9810F4943K3044e3175r1003j09173B21745q0646D8857P5541b02143C699R3598
9799I7297J66018b60016C2912Q2850i4824d6939C48947q1996b43339A0650K31473
9788B42123a66103A2455J7071K07592i745k57252i1817K1902n1154I7729a82983
9776b18775B33504i873k94899L5498d0717I5853J935J24934b84834g0765k6371
9765i7136I5159k8452J32464a20381o0620N2500a4150A14822a83142A07475n3735
9754E3740d54191a9120q7215J7673j25302C18492c42376e5966k47307h3419m7223
$$ plain form
9834 -52310 17161 -174261 -137990 -345534 -360547 -99243 195547 -305346 18828 105412 -105947
9822 245182 12083 -195339 -80917 -242440 -374013 -324818 -169078 89515 179710 -223957 -50839
9810 64943 87987 -53175 -144178 -253351 221745 141099 48857 124398 -202143 3699 97297
9799 97297 263315 -260016 32912 115762 -94824 -46939 348947 266951 -243339 10650 242123
9788 242123 -166103 12455 29526 237118 -9745 -266997 -91817 -69915 -121069 97729 -182983
9776 -218775 233504 -9873 -304772 -269274 -40717 95853 97788 222722 -284834 -70765 -97136
9765 -97136 95159 66707 199171 -120381 -181001 -128501 -14150 114822 -183142 107475 53740
9754 53740 -454191 -19120 -106335 -88662 -213964 318492 -342376 -55966 -303273 -83419 -130642
9743a30642j59145i1009k4465I5128J0079O2973n8333a37937n3882p4267B7586
9731a35165M1639A4156J50658j8753h1085A88798D8141c15441l8098H5684a85936
9719c39943B41280b5392D02606d37977C8450P3815C5354K9575a36609A52141a34841
9707a7581A94371d80864A47696Q3218a73500H8767a51291j07253D07829a44708
9696a78312G3264h9951l3810f0889p97G1861b25388d6121J3772k17336D8520a81947
9683g2054B63217b11040L297i813m85903B2796b98147J35053p4734b6961j91267
9672b18228A24699C4406J84708b9447A75413a2596k657B4792a01844j07314R2807
9661a16351j67251R5401j05743l2183d2643l3644j04480B6023b37013c1368B55797
$$ plain form
9743 -130642 -289787 -91009 -115474 95128 105207 168180 109847 -137937 -191819 -266086 27586
9731 -135165 -93526 14156 164814 146061 -81085 188798 48141 -315441 -353539 85684 -185936
9719 -339943 241280 -25392 402606 -437977 38450 112265 35354 64929 -136609 152141 -134841
9707 -17581 194371 -480864 147696 230914 -173500 88767 -151291 -258544 407829 -144708
9696 -178312 73264 -89951 -123761 -60889 -61686 71861 -225388 -46121 -32349 -249685 48520 -181947
9683 -72054 263217 -211040 -207743 -9813 -495716 22796 -298147 -163094 -237828 -26961 -218228
9672 -218228 124699 34406 219114 -29447 175413 -12596 -15253 24792 -101844 -209158 -116351
9661 -116351 -283602 -188201 -293944 -326127 -42643 -76287 -180767 26023 -237013 -31368 255797
9649A15039b03566O2990A24515i2151A04508e9062j60260H6167a49402B34317
9638e852k50398a16969q0012q6847k1470a09362K0873j26517F1955c45237i9510
9626b0306k98490J49871o1482G9637Q5535a16675N6298j66906j7661B66047b22671
9614D9443g6442A38325b61846A50010a52265A64103Q401b98478c7085f965D7529
9602B2712a23841L6782Q842o6089L1671k42268L2904B55760F1109d30541a40968
9590a17289d8768A26471a0155D7436h478B2338K07163a12566j27173d3200A13726
9578A74308M4475a58406l09714Q1468A64133d8719m39929b0919j63905c9414k43986
9567b83400J00781E2455b0491N213r3775A91583q0479b44869A22115e2955A13860
$$ plain form
9649 115039 -203566 -140576 124515 -92151 104508 -59062 -219322 86167 -149402 234317
9638 -5852 -256250 -116969 -196981 -283828 -305298 -109362 -88489 -215006 61955 -345237 -99510
9626 -20306 -318796 -168925 -230407 79637 165172 -116675 -60377 -227283 -244944 266047 -222671
9614 49443 -76442 138325 -261846 150010 -152265 164103 172504 -298478 -37085 -6965 47529
9602 22712 -123841 -87059 -78217 -144306 -112635 -354903 -321999 255760 61109 -430541 -140968
9590 -117289 -48768 126471 -10155 47436 -8478 22338 229501 -112566 -239739 -43200 113726
9578 174308 218783 -158406 -468120 -386652 164133 -48719 -488648 -20919 -184824 -39414 -283400
9567 -283400 -182619 52455 -20491 -15278 -109053 191583 111104 -244869 122115 -52955 113860
9555I6496a75083r47L5588K6464k7905A1998J19841c92252a09392o5869p2343
9544b47604c230B67547b36572k26471a13905r9928B02442g4704j78521C7958a70010
9532d02601A78150F2675g443C45568a79918j60215B23178a84179h638q2620g14
9520d3549I5048i5426k66644c4412J1479p4046H2279L1869b4124H8291d1877E7815
9507a22167G5478b60316d7311p946C6592g084A93260b49813j00101B05004C8780
9495C62731C7343b56994C13278h8499l55261J60971i7500G1630a41530j95669
9485c37199g7212j86332A89816d0430A42921b68614a10180b3820k23437A83791
9474A2024J39722a46053C92428b37094B4686K00150e8549k33559a35711j3478
$$ plain form
9555 96496 -175083 -176030 -140442 -113978 -141883 11998 131839 -392252 -109392 -175261 -247604
9544 -247604 -3230 267547 -236572 -463043 -113905 -213833 202442 -74704 -253225 37958 -170010
9532 -402601 178150 62675 -7443 345568 -179918 -340133 223178 -184179 -8638 -91258 -714
9520 -43549 95048 -95426 -362070 -34412 -22933 -96979 82279 114148 -24124 88291 -41877 57815
9507 -122167 75478 -260316 -47311 -55257 36592 -7084 193260 -249813 -349914 205004 38780
9495 362731 37343 -256994 313278 -88499 -443760 -282789 -97500 71630 -141530 -337199
9485 -337199 -77212 -263544 189816 -40430 142921 -268614 -110180 -23820 -247257 183791
9474 12024 151746 -146053 392428 -237094 24686 224836 -58549 -292108 -135711 -149189
9464a49189K0069c7643A32078P5780h0686L7112J4107j17013d7361o4482H2487
9452d9553H2930e4965p5236j60204J19267a9498B83573b85729J13572p9868p580
9441b59605A55842l1182i6320A03226i2984j15866B48867a096j63164A83493a44448
9429a43433C7574L23640a56742O89K797a4213k58193D9810Q0530b548D6641K45199
9417B91840i2823F3379A2473b08781Q6015j38304e463k02359N5682E2732K7338
9406H0070d44797a62176j05704N1002E12126h6613H2025a91512C9941b9632G8496
9394A90965g2030k59950a08811L6710b4821f062m43789A89960a18648B972c53424
9382a76971H0263M208a32386A8494J7829a52646A02916a31328k83776A37953e05000
$$ plain form
9464 -149189 -129120 -37643 132078 207858 -80686 -43574 -29467 -146480 -47361 -111843 82487
9452 -49553 82930 -54965 -130201 -290405 -171138 -19498 283573 -285729 -172157 -252025 -259605
9441 -259605 155842 124660 -96320 103226 -92984 -208850 248867 -1096 -164260 183493 -144448
9429 -143433 37574 361214 -156742 -156053 -153256 -14213 -272406 49810 130340 -2548 46641 291840
9417 291840 -92823 63379 12473 -208781 -122766 -261070 -5463 -207822 -152140 52732 80070
9406 80070 -444797 -162176 -267880 -216878 512126 -86613 82025 -191512 39941 -29632 78496
9394 190965 -72030 -331980 -108811 -72101 -24821 -6062 -449851 189960 -118648 2972 -353424
9382 -176971 80263 84471 -132386 18494 36323 -152646 102916 -131328 -415104 137953 -505000
9370C3925e2092m0822A11751a97436G2018A111J1638c97570B45489G9626d2618
9358a63539k01461M0090a60416l4365D4954b26667C06437a55540K169j44421J40325
9347a57467b0953k35116A5568c2592A52676g5307l16357b0737I1980a06960j07341
9336b14301F5927a98031j02695p9701B8804b2187H303J24735K08275o2956A3405
9324a21300G3351c28693c3920I2308M4262b63734a01304k3897d6968A06677J48921
9313B55598a41980j88429C56255c3318m5228q2239d6100H8234a68215P7254B94967
9301f498C14667e6324F858a79709g0267L077A49635k0710R621M57458b0364n4332
9289g4696n8609L337H6762e3888F7595i4173j586o1007m0921f4190A92779b43555
$$ plain form
9370 33925 -52092 -92914 111751 -197436 72018 1111 12749 -397570 245489 79626 -42618
9358 -163539 -365000 -324910 -160416 -194781 44954 -226667 306437 -155540 -153371 -297792 -157467
9347 -157467 -20953 -256069 15568 -32592 152676 -75307 -391664 -20737 91980 -106960 -214301
9336 -214301 65927 -198031 -300726 -380427 28804 -22187 8303 133038 341313 278357 13405
9324 -121300 73351 -328693 -33920 92308 136570 -263734 -101304 -125201 -46968 106677 255598
9313 255598 -141980 -330409 356255 -33318 -78546 -160785 -46100 88234 -168215 -90961 294967
9301 -6498 314667 -56324 6858 -179709 -70267 -67190 149635 128925 138546 596004 -20364 -74696
9289 -74696 -133305 -129968 86762 -53888 67595 -94173 -95759 -156766 -197687 -64190 192779 -243555
9276a72569c9888B70767a00540M0468A60829B5128a42077f7515b2529B08086a00401
9264d1854r216E0531a5147j61182G74d1738a8199n9403P909j60056A18351D9493
9251B5559d5741R37j41721A9779L39785a70328C8872g0019j46290d1982j845B13549
9238B66362b97813f9529C3940M5544a08417d7627C03416a01095k2370N0302H0518
9226c7730r4721A18302r725e3746j34526A46770b7438C08296g502p0498j67119
9215b45119J08822A10588d7186q4135A43134l4721g8933A8580f1511j66732M6227
9204a82016h5769q4708j13660O0802C5747g8096k24100A75914b22299E4531d3544
9192b23449b1212k09097m3351J05476a0314B42681A3126e191J771G6195J18119
$$ plain form
9276 -172569 -39888 270767 -100540 -60072 160829 25128 -142077 -67515 -22529 208086 -100401
9264 -41854 -51070 50531 -15147 -176329 774 -41738 -18199 -77602 -69693 -229749 118351 49493
9251 25559 -45741 -44804 -186525 19779 359564 -170328 38872 -70019 -216309 -41982 -43827 213549
9238 266362 -297813 -69529 33940 79484 -108417 -47627 303416 -101095 -123465 -73163 80518
9226 -37730 -132451 118302 108577 -53746 -188272 146770 -27438 308296 -7502 -78000 -245119
9215 -245119 -136297 110588 -47186 -131321 143134 108413 -78933 18580 -61511 -228243 -182016
9204 -182016 -85769 -170477 -284137 -223335 35747 -78096 -302196 175914 -222299 54531 -43544
9192 -223449 -21212 -230309 -273660 -168184 -10314 242681 13126 -5191 -3420 76195 194314
9181A94314b62449D273d04309a77456m5483E4591J89949a87569j87592a42021
9170G4145b25895A4340a80308A79334N7357M3750r366c33603J25629p2964J10883
9159a70055a4763k73947J29853o880k9649h9811o373G932N6078a72649D0601i5225
9146B37878F1861f0888n5858p7371I9162B7797Q2733l3329a29683r4999F8547
9134c24988E528b75784b8181k55265J11172n2910O930G6670c27604A4291a33469
9122a58260A1517c06474a11093A2091c24410A19384c05991P0922h5391J4062J598
9111f9731C20520b20135I1852O1667c4409k55876m0986B31313q2270p0300a5379
9099g037A87265a14053B3042J74089b28815B04013a30059F8935d62332E445h809
$$ plain form
9181 194314 -262449 4273 -404309 -177456 -222939 54591 244540 -187569 -375161 -142021
9170 74145 -225895 14340 -180308 179334 236691 280441 271075 -333603 -207974 -280938 -170055
9159 -170055 -14763 -288710 -158857 -165737 -195386 -89811 -96184 7932 64010 -172649 40601 -95225
9146 237878 61861 -60888 -116746 -194117 99162 27797 110530 77201 -129683 -224682 68547
9134 -324988 5528 -275784 -28181 -283446 -172274 -225184 -218254 76670 -327604 14291 -133469
9122 -158260 11517 -306474 -111093 12091 -324410 119384 -305991 -235069 -85391 -71329 -69731
9111 -69731 320520 -220135 91852 153519 -34409 -290285 -331271 231313 149043 78743 -15379
9099 -7037 187265 -114053 23042 197131 -228815 204013 -130059 68935 -462332 5445 -8809
9087A49933a72416G0242L1245a51648B40782K3483a24225j00621B08082b59108
9076a29070C5117a6602j1507A50737c0569A5344L8412J9510b33421M7356k19355
9065d05420b7909j3126j37266K5450C5601a99392Q6168A13776a13383l2504f9334
9053D6367a47332j46366F0796A7021b74265A66321i589q8373r2973A96772b13903
9041d44928a36607h218I8628d62626c83l92032a16015k59246O8015B21413h1320
9029B63625a84098m1043A42818j7780J14538a74695M6102A98962b02620A792a80594
9017c67612e8404J5374D3128b48861B0296b69998A41511a50755I0463h0320j57839
9006b38159B1848a59370M8269n1767P6764j79982G7773B3972a980B9060L05498
$$ plain form
9087 149933 -172416 70242 101487 -151648 240782 264265 -124225 -224846 208082 -259108
9076 -129070 35117 -16602 -28109 150737 -30569 15344 53756 73266 -233421 -186065 -405420
9065 -405420 -27909 -41035 -178301 -152851 35601 -199392 -113224 113776 -113383 -145887 -69334
9053 46367 -147332 -293698 60796 17021 -274265 166321 -9589 -97962 -190935 196772 -213903
9041 -444928 -136607 -8218 98628 -462626 -383 -392415 -116015 -375261 -307246 221413 -81320
9029 263625 -184098 -225141 142818 125038 239576 -174695 -128593 198962 -202620 1792 -180594
9017 -367612 -58404 -43030 43128 -248861 20296 -269998 141511 -150755 90463 -80320 -238159
9006 -238159 21848 -159370 -111101 -162868 -86104 -266086 77773 23972 -1980 29060 334558
8995C34558A40371J40996g2779r4129j28741A7111c06083J1323j7704J14899A54927
8983D2117J10418a17604e0616A61391k271J7805i7463d225A28287L2949R234b15262
8970a29544d176j32743n8301e0398n5907m5008N4750l2397a7222j30816p0534
8959b18572B29899f6233o73k28561R012J37343J1119I7661a56662k914A98562
8947a24265L7216m37443E7652J35579A6729P3353a41795I771K11349B719K24391
8936B27110B5219K52745p8637a67932B33832i3236B69912j32981K48286I1320
8925D83048N10648J813559N328591J2163292E383745A021606m73204k05575j6124
8916C26703A45557L3992a12658M1841A54022Q7464J08355R5115A15503C8981J2879
$$ plain form
8995 334558 140371 281367 -72779 -166908 -295649 17111 -306083 -294760 -312464 -197565 154927
8983 42117 152535 -117604 -50616 161391 159120 176925 -97463 -4225 128287 161236 170470 -215262
8970 -129544 -4176 -136919 -195220 -50398 -106305 -151313 -96563 -128960 -17222 -148038 -218572
8959 -218572 229899 -66233 -66906 -295467 -286455 -149112 -137993 97661 -156662 -159576 198562
8947 -124265 -87049 -524492 57652 193231 16729 90082 -141795 9771 221120 2719 227110
8936 227110 25219 277964 199327 -167932 233832 -93236 269912 136931 385217 91320
8925 483048 993696 2807255 8135846 20299138 5383745 1021606 548402 342827 326703
8916 326703 145557 179549 -112658 -70817 154022 241486 349841 444956 115503 38981 51860
8905E1860g2121k43789A08655a5943j22305A30443b03356F2352b01751G3162k9103
8894D4059c9909J2011n8648n3462d7602F2725a55206r3366A9223c18911a05808
8882A30809n7790b4224r9586j13154I3040a51369l8716B57122c54783a8155r1333
8871a09488j90559a0969A239a69496l069M5802K7964j91036H6927a15208A11413
8859A41830e962A65986d40924a64471A76074a49225f0966a2971j13879B03072
8848a35034A63097G9722a8664k04599R6787A7202a91711f7555A74523f6376o0817
$$ plain form
8905 51860 -72121 -315910 108655 -15943 -138248 130443 -203356 62352 -201751 73162 44059
8894 44059 -39909 -27898 -86546 -140008 -47602 62725 -155206 -248572 19223 -318911 -105808
8882 130809 73019 -24224 -123810 -236964 93040 -151369 -190085 257122 -354783 -18155 -109488
8871 -109488 -300047 -10969 1239 -169496 -172565 -126763 -98799 -289835 86927 -115208 111413
8859 141830 -5962 165986 -440924 -164471 176074 -149225 -60966 -12971 -126850 203072
8848 -135034 163097 79722 -18664 -223263 -126476 17202 -191711 -67555 174523 -66376 -127193
$$ [...]
##END NTUPLES=NMR SPECTRUM
##END=
