##TITLE=AC1554_ROEFFECT0016_8268924_2ToXJO43Cp
##JCAMPDX= 6.0         $$ Bruker NMR JCAMP-DX V2.0
##DATA TYPE= NMR SPECTRUM
##DATA CLASS= NTUPLES
##ORIGIN= BRUKER
##OWNER= Administrator
$$ 1.72 TOPSPIN		Version 2.1
$$ 2013-10-12 00:26:59.251 -0700  Administrator@X
$$ Compression mode = diff/dup
##.OBSERVE FREQUENCY= 400.02188249412
##.OBSERVE NUCLEUS= ^1H
##.ACQUISITION MODE= SIMULTANEOUS (DQD)
##.ACQUISITION SCHEME= undefined
##.AVERAGES= 8
##.DIGITISER RES= 22
##SPECTROMETER/DATA SYSTEM= spect
##.PULSE SEQUENCE= zg30
##.SOLVENT NAME= COFFEE_meoh
##.SHIFT REFERENCE= INTERNAL, COFFEE_meoh, 1, 14.98509
##AUDIT TRAIL= $$ (NUMBER, WHEN, WHO, WHERE, PROCESS, VERSION, WHAT)
$$ ##TITLE= Audit trail, TOPSPIN		Version 2.1
$$ ##JCAMPDX= 5.01
$$ ##ORIGIN= Bruker BioSpin GmbH
$$ ##OWNER= Administrator
$$ $$ E:\/data/COFFEE/nmr/AC1554_ROEFFECT0016_8268924_2ToXJO43Cp/10/pdata/1/auditp.txt
$$ ##AUDIT TRAIL=  $$ (NUMBER, WHEN, WHO, WHERE, PROCESS, VERSION, WHAT)
(   1,<2013-10-12 00:26:52.642 -0700>,<Administrator>,<X>,<go>,<TOPSPIN 2.1>,
      <created by zg
	started at 2013-10-12 00:25:46.876 -0700,
	POWCHK enabled, PULCHK disabled,
       configuration hash MD5:
       C8 4E 4E 5D D3 5C D8 9E 9F 52 82 E0 59 8A DE 15
       data hash MD5: 64K
       77 9E DC C1 C9 09 15 FC 34 5E 52 8C C4 96 65 17>)
(   2,<2013-10-12 00:26:55.532 -0700>,<Administrator>,<X>,<proc1d>,<TOPSPIN 2.1>,
      <Start of raw data processing
       efp LB = 0 FT_mod = 6 PKNL = 1 PHC0 = 0 PHC1 = 0 SI = 32K 
       data hash MD5: 32K
       65 8F 4E 6C 85 D5 42 76 CB 24 74 67 0A 41 12 74>)
(   3,<2013-10-12 00:26:55.892 -0700>,<Administrator>,<X>,<proc1d>,<TOPSPIN 2.1>,
      <pk PHC0 = 95.28992 PHC1 = 0 
       data hash MD5: 32K
       84 2D DC 13 2F DA 2C 4F 84 F6 04 D0 BC 0F B4 E3>)
(   4,<2013-10-12 00:26:55.986 -0700>,<Administrator>,<X>,<proc1d>,<TOPSPIN 2.1>,
      <abs ABSG = 1 
       data hash MD5: 32K
       80 64 2C D4 61 A0 B4 24 72 69 E6 84 5C F4 97 75>)
(   5,<2013-10-12 00:26:56.048 -0700>,<Administrator>,<X>,<proc1d>,<TOPSPIN 2.1>,
      <abs ABSG = 2 
       data hash MD5: 32K
       7F AB 1E F3 DB 39 15 7F 12 83 E3 4D 0B FA BC F9>)
(   6,<2013-10-12 00:26:56.126 -0700>,<Administrator>,<X>,<proc1d>,<TOPSPIN 2.1>,
      <abs ABSG = 3 
       data hash MD5: 32K
       B6 8A AE 8F 58 5E 9E AD 07 6D 9F BE 02 EE D2 E9>)
(   7,<2013-10-12 00:26:56.204 -0700>,<Administrator>,<X>,<proc1d>,<TOPSPIN 2.1>,
      <abs ABSG = 4 
       data hash MD5: 32K
       BB 3F 16 87 C5 8E EB 62 B0 6A F0 6C 18 FB 7F 5D>)
(   8,<2013-10-12 00:26:56.236 -0700>,<Administrator>,<X>,<proc1d>,<TOPSPIN 2.1>,
      <abs ABSG = 5 
       data hash MD5: 32K
       75 A1 D4 80 39 59 CD B6 5D ED C4 DF F3 75 58 70>)
$$ ##END=
$$ 
$$ $$ hash MD5
$$ $$ 0E B3 56 E3 68 CC 9F CC C1 D0 D5 79 7B 03 F2 62
##$RELAX= 
##$RELAX= 
##$RELAX= 
##$RELAX= 
##$RELAX= 
##$RELAX= 
##$RELAX= 
$$ Bruker specific parameters
$$ --------------------------
##$DU= <E:\>
##$EXPNO= 10
$$ [...]
150 150 150 150 150 150 150 150
##$TP07= 0
##$TPNAME0= <>
##$TPNAME1= <>
##$TPNAME2= <>
##$TPNAME3= <>
##$TPNAME4= <>
##$TPNAME5= <>
##$TPNAME6= <>
##$TPNAME7= <>
##$TPOAL= (0..7)
0.5 0.5 0.5 0.5 0.5 0.5 0.5 0.5
##$TPOFFS= (0..7)
0 0 0 0 0 0 0 0
##$TUNHIN= 0
##$TUNHOUT= 0
##$TUNXOUT= 0
##$USERA1= <user>
##$USERA2= <user>
##$USERA3= <user>
##$USERA4= <user>
##$USERA5= <user>
##$V9= 5
##$VALIST= <valist>
##$VCLIST= <CCCCCCCCCCCCCCC>
##$VD= 0
##$VDLIST= <DDDDDDDDDDDDDDD>
##$VPLIST= <PPPPPPPPPPPPPPP>
##$VTLIST= <TTTTTTTTTTTTTTT>
##$WBST= 1024
##$WBSW= 4
##$XGAIN= (0..3)
0 0 0 0
##$XL= 0
##$YL= 0
##$YMAX_a= 648263
##$YMIN_a= -550619
##$ZGOPTNS= <>
##$ZL1= 120
##$ZL2= 120
##$ZL3= 120
##$ZL4= 120
##$ABSF1= 14.98509
##$ABSF2= -5.573092
##$ABSG= 5
##$ABSL= 3
##$ALPHA= 0
##$AQORDER= 0
##$ASSFAC= 0
##$ASSFACI= 0
##$ASSFACX= 0
##$ASSWID= 0
##$AUNMP= <proc_prof1d_extract_pilot.lims>
##$AXLEFT= 0
##$AXNAME= <>
##$AXNUC= <1H>
##$AXRIGHT= 0
##$AXTYPE= 0
##$AXUNIT= <>
##$AZFE= 0.1
##$AZFW= 0.1
##$BCFW= 0
##$BC_mod= 0
##$BYTORDP= 0
##$COROFFS= 0
##$CY= 15
##$DATMOD= 1
##$DC= 0
##$DFILT= <>
##$DTYPP= 0
##$F1P= 0
##$F2P= 0
##$FCOR= 0.5
##$FTSIZE= 32768
##$FT_mod= 6
##$GAMMA= 0
##$GB= 0
##$INTBC= 1
##$INTSCL= 1
##$ISEN= 128
##$LB= 0
##$LEV0= 0
##$LPBIN= 0
##$MAXI= 10000
##$MC2= 0
##$MEAN= 0
##$ME_mod= 0
##$MI= 0
##$NCOEF= 0
##$NC_proc= -8
##$NLEV= 6
##$NOISF1= 0
##$NOISF2= 0
##$NSP= 0
##$NTH_PI= 0
##$NZP= 0
##$OFFSET= 14.98509
##$PC= 1
##$PHC0= 95.28992
##$PHC1= 0
##$PH_mod= 1
##$PKNL= yes
##$PPARMOD= 0
##$PPDIAG= 0
##$PPIPTYP= 0
##$PPMPNUM= 2147483647
##$PPRESOL= 1
##$PSCAL= 4
##$PSIGN= 0
##$PYNMP= <proc.py>
##$REVERSE= no
##$SF= 400.02
##$SI= 32768
##$SIGF1= 0
##$SIGF2= 0
##$SINO= 400
##$SIOLD= 32768
##$SPECTYP= <>
##$SREGLST= <1H.CDCl3>
##$SSB= 0
##$STSI= 32768
##$STSR= 0
##$SW_p= 8223.68421052631
##$SYMM= 0
##$S_DEV= 0
##$TDeff= 65536
##$TDoff= 0
##$TI= <>
##$TILT= no
##$TM1= 0
##$TM2= 0
##$TOPLEV= 0
##$USERP1= <user>
##$USERP2= <user>
##$USERP3= <user>
##$USERP4= <user>
##$USERP5= <user>
##$WDW= 1
##$XDIM= 32768
##$YMAX_p= 456840266
##$YMIN_p= -683117
##$CURPLOT= <Network HP LaserJet P1505>
##$CURPRIN= <$Network HP LaserJet P1505>
##$DFORMAT= <normdp>
##$LAYOUT= <+/1D_H.xwp>
##$LFORMAT= <normlp>
##$PFORMAT= <normpl>
##$SURQMSG= 1
$$ End of Bruker specific parameters
$$ ---------------------------------
##NTUPLES= NMR SPECTRUM
##VAR_NAME=  FREQUENCY,     SPECTRUM/REAL,   SPECTRUM/IMAG
##SYMBOL=    X,             R,               I
##VAR_TYPE=  INDEPENDENT,   DEPENDENT,       DEPENDENT
##VAR_FORM=  AFFN,          ASDF,            ASDF
##VAR_DIM=   32768,         32768,           32768
##UNITS=     HZ,            ARBITRARY UNITS, ARBITRARY UNITS
##FACTOR=    0.250966925370066, 1,           1
##FIRST=     8223.43324360094, -186138,      -167214
##LAST=      0,             -189024,         -109651
##MIN=       0,             -683117,         0
##MAX=       8223.43324360094, 456840266,    0
$$ Real data points
##PAGE= N=1
##DATA TABLE= (X++(R..R)), XYDATA
$$ [...]
23822 -15865 77382 -53254 200100 158321 -64675 72734 130750 128807 381527 -58787 -203952
23811 -203952 -304264 305322 69150 -21099 132539 -50294 -58564 -54380 91596 -176974 417589
23799 32483 116727 -74993 -73278 48004 97293 373568 -445565 -184998 13192 -161049 134821
23787 -158288 -154205 -103661 -134492 -191868 -249938 104403 -55466 -321240 -3438 -60900 367809
23775 -109041 31870 102529 -67895 -315471 493735 299206 -145215 -157106 316902 -84203
23764 -124246 -201996 -200183 253305 83997 -61895 -317278 -147723 11019 -20078 -60352 -155084
23753 -155084 56395 -305457 -67697 -94217 68604 55940 -160510 279695 -142134 -4038 -445857
23742 -445857 73962 -123736 26111 1955 85161 -11395 -66209 17198 142062 -95093 209191
23730 34334 -15338 239181 185846 -134057 -1034 283792 -204132 146649 103104 242429 -133939
23718 36304 175974 60161 44244 -135699 163565 87822 -42796 67223 -94263 -242988 148748
23706 -223563 328114 173548 -228282 203514 -63855 -319773 -130704 135205 37713 206930
23696 206930 204556 4467 -333389 -70242 -59407 184543 26637 -265353 -192522 -3527 -215078
23685 -215078 110029 -44100 -249086 16968 138457 21754 211826 264545 337874 -365427
23674 222031 91470 -80144 326039 -151669 -10910 -106271 -212046 -107879 58255 70065 -92882
23662 63895 -182922 -312837 89856 -73366 8620 -274083 290388 -107370 296137 -176941
23651 -126037 126667 -139999 -28946 195683 -68473 30665 -74537 -163919 -54045 222043 -310100
23639 -230857 186292 184642 -165990 169800 390034 36414 -89777 224740 -157178 -225757
23629 -225757 -76442 -260687 -32937 -112246 3071 -387818 -205501 320257 118755 200883 -319293
23617 496374 38365 -63309 6937 62701 -36020 178081 69564 31709 129068 -183062 -114254
23606 -114254 1759 36420 -20443 55510 -252654 -298078 66174 -113466 -123089 142648 -289692
23594 247042 -58352 145195 111878 43974 -85660 -43630 137262 -39857 -269191 458303 -51727
23582 -196037 11298 -207178 77389 23824 -54101 195830 -116095 -186780 7265 -149689 109616
23570 190337 83623 101198 84795 -32454 -192051 -66179 168225 62862 354018 379393 -373553
23558 -296288 -68414 124169 66763 94315 76359 -9681 -488563 -106889 -263904 142982 -335238
23546 12547 65404 -127610 -133684 131603 80077 283981 -16343 -160748 142217 -40872 381041
23534 135144 -304126 -48847 -95563 205301 -126538 24161 -211249 -264879 -164586 220955
23523 -27654 -149080 304061 -71687 -61686 -54514 472164 237192 158489 -334651 37264 -45468
23511 -224637 9095 57569 -16938 -284012 -35967 -250599 98614 -130500 -126062 -78153 -269825
23500 -269825 3737 -232295 75057 -137721 174883 230023 -11489 64650 87982 144067 -57714
23488 35501 271206 -190833 49227 71186 161485 211728 199948 -104153 -38564 -121323 -257229
23477 -257229 -235633 199520 138924 177565 -278826 3903 164212 -107052 -225253 157012
23466 94181 -104509 -37328 304664 25301 -18303 279693 -18650 169089 -298766 15020 87175
23455 87175 -102217 -24099 17141 -160533 -62074 20678 -70476 -175622 111922 -105420 102946
23443 182977 -242878 50217 231467 22967 -374264 -152973 107495 72981 342146 170570
23432 -43483 -192582 -214912 -260802 166990 216645 233388 -1349 193197 85258 9358 -286158
23420 -95554 -95386 -10023 -53836 86380 -65708 171875 93658 145938 186927 -73578 78393 38387
23407 -451790 -480881 204197 -76610 -36336 -215009 7301 253997 -8608 -116077 32165 220246
23396 220246 -200843 -179586 268458 172575 -118322 96978 -64113 -252309 -194216 -239555 -26489
23384 -100864 -9262 -122323 116313 -21701 -114600 -302438 -87721 85391 221015 -203326 -13683
23372 212914 -51074 -116482 232619 39562 -151822 79701 22649 141263 -39015 -62121 -353698
23361 -353698 51158 86506 63021 176185 -93807 183285 -231990 -74755 -31424 285564 119598
23349 110951 -149243 15739 -163836 82537 96820 -80265 97673 -94771 238493 139752 -15266
23337 16541 -135419 200359 -28397 134332 -42198 233810 -76889 -179627 -57945 49747 -5165
23325 -57360 180030 -4119 73387 -194935 96975 -33527 134061 111679 -79319 -83395 108171
23313 146040 -48069 -135308 136830 234082 188777 212784 -92573 -52445 -120269 -247614 -160745
23302 -160745 -252576 52374 -98351 -93218 12451 -200261 -34208 -86983 -442512 -241567 -57723
23290 262295 -33313 -33479 -159502 -85516 -61361 -122325 -125894 -75709 -96560 231862 -62568 102260
23277 72438 -248549 -141171 -81717 -98915 27246 239754 -3150 -299185 39157 161250 -83535
23265 -31321 417078 -74978 43771 92962 39344 -134728 -142521 -292405 -272947 -106656 394127
23253 617 -151236 -87859 82913 6267 -135849 -147356 -180374 -14336 -224664 -331266 -49390
23241 181130 139601 -250134 -19883 -411284 86469 -112723 -544314 -25336 -25130 -273392 24598
23229 86370 -28777 -338650 -230505 76439 151412 -202784 70989 66481 210229 28732 -86011
23217 77164 -60200 59974 277277 -56558 195437 -30893 -116604 -297705 1126 168012 247719
23206 247719 -191607 58037 244397 -438194 -225898 109022 249029 83217 324958 -183318
23195 -130006 57986 -29244 436787 -146767 -177501 120443 -173480 -88082 -106573 163079
23184 -32803 37228 -141307 -141513 -135826 -29945 -187122 -26864 35966 -229539 154646 -281631
23172 -153067 -63902 -157969 198648 105032 196563 -48176 -60129 90418 114412 242925 80736
23160 -162750 -34979 -193135 169286 -98636 -15856 -102706 -137279 168335 183651 69792 291083
23149 291083 -220321 -206756 -63692 -71813 -110242 163467 -192888 -80291 -121640 -63344 181375
23137 27173 -75122 -86202 -104201 298635 1671 17567 -317377 -91619 -90316 50877 -204703
23125 207510 -143263 -155281 -205865 -161754 -183855 -250155 98820 -234256 137559 -245726 8147
23113 77788 356398 110664 -231949 292772 -142002 -111034 111130 -32728 251128 227963
23103 227963 -26220 155776 182177 104445 29732 23425 -250546 -139970 -153905 -212137 89627
23091 -40269 -943 93787 -143737 -2668 -100086 -86946 -10026 54798 17861 56412 258768 -38597
23078 1078 -55389 175587 146975 -285777 323974 230881 -167842 99522 148884 -5898 2739
23066 122891 115400 31156 27732 -89814 10095 -149804 -43653 -11056 -204886 70993 -18885
23054 298302 201627 -124399 139406 -165852 -282697 -240260 -222993 277113 -118466 -99254
23044 -99254 -49370 -1466 -167920 -45122 -122937 85342 73638 -20273 208021 7319 71289 -314530
23031 64317 7679 -67939 254674 -158514 -87713 -78972 -144173 -308294 -6872 -31472 279552
23019 13440 369980 43366 35462 -6658 -37583 102202 -397333 -49726 -148242 -265958 -123251
23007 -48196 -71331 154310 -65165 7106 160915 -127358 -141714 48832 58487 81491 -156053
22995 3916 -2061 -160218 17502 218574 14081 -87220 -97636 72056 -23937 107282 101347 -344373
22982 185715 -171219 89743 17450 -2193 -450529 111332 -141676 653616 -227382 -98578
22971 -126371 120202 292554 -110825 258882 -16956 -86921 279983 -74394 247197 64333
22960 -230574 79211 -38660 144901 19496 -219488 57473 -18964 -18654 84023 267746 -96588
22948 -137208 -119056 -183412 -123863 34559 -192835 -146185 38991 -81332 -170949 -360289 243166
22936 217907 -74796 -211660 -243076 -31276 116358 -119020 148378 305827 -210554 32940
22925 -298924 -8077 221291 270106 31311 38669 -135686 -208801 -155563 -130246 4003 184316
22914 184316 -28126 227507 70410 1339 -370003 -25405 70220 -32467 -234566 100968 -27300
22902 -125376 253963 -195720 146801 -26930 166697 263364 -258430 85622 52987 207336
22892 207336 21094 -213729 -186663 -75438 -51456 -393711 -37430 130281 -8504 -264507 -279943
22881 -279943 -114801 88231 -331680 -291375 -360993 -155900 30131 312825 27848 23442 -141464
22869 209864 -113306 -119644 -4074 -168522 153505 -292500 113065 380817 -192942 131226
22858 103516 -219914 -36076 75929 127475 -27147 -101251 -204562 -27935 -29386 -211373 166071
22846 -83795 -78212 -29216 207668 -40654 -377906 -30815 100394 42538 196322 -21073 232151
22834 -425468 -39706 193758 -42607 271733 186311 -241677 -74701 194376 -303509 -93504
22823 -99902 -292304 -233137 -265397 -288754 -310379 -401933 -117075 -45219 122418 -397388 -407127
22812 -407127 -148845 -52083 171021 243131 272536 99355 -32123 14183 134626 -279190 -164261
22801 -164261 72203 27595 -180117 249544 267791 -136028 -159803 -235086 9088 -180481 -47507
22789 -44527 -139368 -104546 88605 27336 95373 1662 -40115 105383 -133162 326172 -146067
22777 -52860 -23583 -352671 321511 -5291 -135778 -117105 105139 278108 -84359 -276943 -72684
22765 101812 -71083 -115001 -258551 -60683 262595 -168995 382687 127561 -456656 -75362
22754 -153797 -77364 -133190 328954 139224 104893 124496 -210538 238483 59983 -8396 102665
22742 -49235 49030 131201 -311407 -221171 135094 567015 52455 84897 -11010 -85059 -107997
22731 -107997 127916 -126082 90120 -314702 -17028 -339817 -244864 -434320 -79046 28741
22720 304845 42065 140280 -109636 -205840 116980 -10119 -85103 -120501 113829 -332879 64694
22708 392091 -321914 303 -9037 -27916 110126 -131740 -51392 -154960 -248247 -243785 -37539
22696 -233562 -134070 345517 130389 59406 -88328 -53342 -256454 154821 -81391 31521 -174902
22684 1775 -16325 -161546 252893 -242671 67518 50278 120797 -137233 -48923 3055 56981
22673 56981 231330 -155801 -70347 -165984 -199589 -24387 197465 192516 172059 181434 215905
22662 215905 127444 -98972 75007 -359398 -175394 63404 -283687 -110946 425813 109785
22651 -84918 190763 -286156 86481 62260 -197814 -242516 -66176 137921 304946 312208 -108189
22639 -121959 -224156 -12594 -230818 -222245 55789 109189 -367964 108558 -193722 5852 -208843
22627 -93605 28149 92182 103499 6354 113905 -72473 -43792 153441 16130 168595 61011
22615 26043 -239383 -17325 226474 -106862 125507 6893 -244201 -52736 26070 -272964 -407494
22604 -407494 -355826 -10923 174717 -172165 -6070 -2471 -19608 229924 -69869 -4341 -10066 204192
22591 -130431 -270765 -281873 83881 -317338 -67008 -120270 -21437 -275264 170772 102240 140195
22580 140195 -130874 -25227 -34696 -205847 141937 -50549 -263805 129205 -5329 -9353 -178289
22569 -178289 33588 -138689 54565 102374 -145633 -70057 -301539 132133 121372 -7379 -410067
22558 -410067 -134641 -166852 125944 -90789 -14002 115935 137682 83575 -83440 -156496 -167517
22547 -167517 -320181 -36386 20437 -127456 -18778 23302 56425 -204257 134652 -249553
22536 49950 83695 -126825 -284781 63603 -76644 192147 -92394 291544 -80509 75560 274580
22525 274580 -317721 92813 -183034 -256782 -285892 40814 2414 -170293 -43514 -45350 165386
22513 -20017 -255333 -100337 -465615 117316 -60457 16359 47935 -114560 -250940 7390 -12858
22501 152487 75317 185362 -304893 67760 -41131 -272872 -188134 -181833 -59460 102301 86111
22490 86111 129774 -142314 -287187 -156645 -75296 221967 198716 -131242 -179108 42541 -124746
22478 128607 1479 -262225 225861 84307 -465037 -154905 -138927 158891 127166 42257 172066
22467 172066 323462 92254 346494 -315863 -48804 169677 -126547 -54561 -198176 94079
22456 13251 -320310 249665 -111215 -44620 -261517 12796 305230 -54834 -85785 -158391 -170186
22445 -170186 -307896 -210342 -258756 -219844 1545 127525 23647 218441 -52514 171921 -44540
22433 -138151 -70335 6218 -359976 -296488 53034 82898 149508 157263 64018 -147831 117921
22421 69751 -290647 -74301 96856 161696 83322 -23781 107022 141659 201492 135951 14823
22409 -74248 107340 -159533 139378 -238348 586560 -19037 -28718 410616 123663 -19915
22398 374164 196361 -42913 -109784 40651 -192766 -11984 59145 270622 -57466 5900 -92166
22386 -83871 -148811 -118623 -195043 100926 -144331 -300450 -16898 -116541 -47249 -69359 260257
22374 79526 -32633 -326260 -217901 -145762 -170929 -6055 -247907 75222 214189 17351 -71671
22362 72374 -247984 -35414 -193828 -207142 -342361 -225259 107760 -77827 -26826 -224910
22352 -224910 207791 -70497 26034 92265 -46141 -96041 -203557 -38639 7652 -70099 -45193
22341 -45193 -16360 227452 -313501 108329 -77727 168796 -462273 2723 109688 -210469
22330 -256894 -353670 -246850 25817 -497395 -70713 55968 -130995 40796 188124 87234 71008
22319 71008 -70641 -279853 -98188 122021 -198020 139991 152823 -101261 118562 260297
22309 260297 -480012 56127 98498 104377 202346 315785 -407106 221249 -70472 -243296 -44858
22297 -63607 56974 134394 55525 -155738 299 -23272 -84333 -339015 77239 74907 -75035 100379
22284 -186553 42727 11684 -5922 -66240 80528 -222534 229814 40763 -202127 -276438 -92139
22272 209208 -28538 -258102 -193628 -387894 -167772 -177536 1101 -64143 -197815 -33467 234423
22260 -3722 41548 -323595 98500 -222672 -9819 255380 235812 250771 48569 70318 -316237
22248 -122442 19502 -99684 -109703 95817 -64925 160050 -53735 19944 -89203 168154 42984
22236 -264941 20779 55381 54368 -106796 2380 22095 -219124 30502 -11525 56139 820 -210167
22223 -94383 101124 80433 5224 -122106 -212378 -38344 -352368 -123708 112463 31756 140003
22212 140003 -24073 -196710 -84268 -490440 -177520 -9079 161176 191892 301592 103523
22201 -102144 -253819 -103286 163618 -150984 -114172 183149 59532 53562 32365 189288
22191 189288 36678 -145214 34878 101003 -31003 207955 -93122 -128203 41108 21752 96804
22180 96804 125714 87955 -236589 -129305 30969 -165622 346413 231850 -9617 -235713 -180879
22169 -180879 26099 -15049 58465 -92485 108303 -272453 197677 161229 -290779 -98073 -235985
22158 -235985 -1283 167574 9773 -170772 289954 -195134 -59183 -90829 -78114 -425140 -102763
22146 -1476 -272768 122051 146146 -117643 2534 338165 -232617 -146038 -8723 -96825 111521
22134 70639 234277 -280316 -370188 -54658 -24287 -147697 13805 -139132 16473 -41905 -363461
22123 -363461 168202 -54302 -131823 -47837 -95012 279912 -344636 111701 30889 30665 2300
22111 -60732 -10886 117840 156519 -124879 -115738 -61056 -341672 211642 217005 -53562 -59083
22100 -59083 -283974 -79170 -110738 23119 7793 -126429 149366 212119 161827 -305431 -31106
22088 -303626 -162375 60524 -133096 145822 96531 -184197 -108167 -160904 -342196 -96421
22077 34647 231638 -42067 -225071 -187472 83832 11092 -117897 -72655 -81380 -238758 -155252
22066 -155252 -226267 -108090 23500 -71250 -193072 210047 13765 48450 -219598 93365 166712
22055 166712 10722 -96223 158376 -193391 -85222 -104708 69175 284037 71583 -154629 26110
22043 54640 -169178 120928 -264264 -300060 -304812 -252268 -129001 56604 17681 -172085 86963
22031 70109 -95000 -471638 -293540 73960 7131 219590 13798 121792 289439 -1203 -36464
22020 -36464 -115186 43269 45120 97354 -106382 -36026 5798 118340 -164326 -155329 61697 222973
22008 222973 -185751 101114 130691 -380248 11209 84459 90952 240727 85785 180929 134187
21997 134187 -84274 -382255 -145914 -83021 58961 -100922 -26536 -27326 144583 -25529 -37400
21986 -37400 -287540 -34098 -126052 36951 -139807 -24482 97542 -121486 -84913 59884 -343180
21974 -90140 18123 52898 -121245 -217119 -45578 -16203 46880 132476 -110991 110249 -314907
21962 -86303 205639 -63975 -10064 116362 28252 -179190 -28463 136189 46226 -229417 22594
21950 166224 16701 -160844 -489768 -32852 133491 70047 -191683 -29432 104623 66643
21940 66643 -200715 -130747 -49054 270847 -112033 -195831 -60514 -245014 -263235 -16419 -75879
21929 -75879 -171604 -142393 61566 43959 38391 -189235 -130018 90795 -15514 -100192 -164899 -306204
21917 -306204 -393807 80920 -262713 56206 21088 -225193 182143 -254880 116427 -280478
21906 52643 139484 236690 -173980 -89288 -105214 66028 -19934 -241578 132696 -59226 541662
21894 -11109 -17570 -84387 232099 -213195 -206034 183104 -323515 119365 -15013 245661 -35522
21882 -407923 53056 -118392 73341 161606 -14721 -45504 -70647 -33695 116276 1164 383243
21871 383243 -17157 -100467 49898 -89754 90658 -13174 6942 268430 59325 -187218 107878
21859 -25477 -42302 -77328 -14023 3278 -153751 85804 -235898 -100191 11514 -116336 -216212
21848 -216212 112370 -42618 -298407 -26213 274366 126077 -404244 117650 47435 68603
21838 68603 -154482 -239423 18568 -226519 126211 25550 -32001 -23611 260381 8386 167921
21827 167921 370718 40269 -71408 -103675 -23677 -199550 68305 338136 -20521 -143489 -272943
21816 -272943 -128020 37651 109355 -10985 209623 -114925 -167501 34824 -253791 -368882
21806 -368882 -53959 35982 -80725 219201 173314 159433 45848 86127 -147124 -100135 -146192
21795 -146192 16408 -164375 -81632 -280106 -134284 283886 117054 -344827 226846 8909
21784 -177386 63767 71394 -141195 268849 144601 -159154 92844 -171194 125247 -123 178955
21772 -146189 -365067 -82598 -283815 -238721 -87652 -13756 -84423 -74372 5618 -210391 -133011
21761 -133011 52192 -304154 195606 -140040 -124865 178753 -1529 -156587 91806 -202621
21750 -81643 13087 366806 175901 -198442 -168313 252638 101461 -59636 -87686 -71371 -267082
21739 -267082 -152429 156291 -138898 -93547 164888 -74305 -290990 114929 250172 107403
21728 45673 165468 33164 157571 -7700 -199597 -132601 -125223 -22885 163453 220832 -106351
21716 -25796 78629 29961 -175925 54795 -2411 -293891 -2164 -160449 -141987 26958 191926
21705 191926 -236333 -253041 312048 -205328 -73480 12108 15495 -164676 -98144 -37756 103614
21693 -79323 -73022 -80961 145976 126290 197232 -73555 -217891 -77361 -21937 -149985 -70749
21681 -67939 392380 -61480 -183342 62293 -251659 -117182 -219887 -12093 197194 133805
21671 133805 -243157 -102274 -58647 78638 -163339 -59936 4060 -260100 -86665 -40971 -238800
21660 -238800 -140879 125640 -113327 -284946 -182685 787 -140109 -35534 166526 -102984
21649 60151 111905 -204392 243971 120081 -405928 88503 -167293 -128242 46132 80564 250763
21638 250763 -50840 82353 103788 -335499 -54717 -55143 -3626 20132 -217983 96426 173679 152903
21626 152903 -63439 324008 121940 10807 -62670 -244198 534 -73160 -231790 -169076 443495
21614 -154970 -62640 21643 51795 -43224 -171933 -143389 31761 -125608 -1734 -85461 -119037
21603 -119037 129355 -226709 -200930 106120 -280985 121788 177173 -61003 -63017 -221533
21593 -221533 -318001 -100157 -100921 -331967 -56165 31383 437118 55751 -41767 316858 -100929
21581 -180438 -47781 -259655 -285236 -46740 54700 136291 -294159 35694 136369 -79012 -139972
21570 -139972 35914 -239974 36152 -53699 98935 -150880 -234878 198017 -216340 271356
21559 -183783 -154953 -13274 338717 -131051 117342 206735 -221966 -27572 -178613 -71784
21548 -276439 54525 50954 -161372 -205782 65454 -147557 -48620 -133640 218335 -171698 -104398
21537 -104398 232378 356485 -49891 -179313 104060 -76678 82100 40224 -189093 -76103
21526 -173095 -52493 -232326 -38789 -135542 16290 -173015 -14408 62407 273082 -65733 -350588
21515 -350588 -18816 -176529 186116 147375 137312 54628 -195090 -251455 105416 -195648
21504 -98029 33147 54863 20026 -21338 142011 -295333 58954 -213435 95617 130046 76017
21493 76017 84682 -167691 -57931 228120 -124532 -39820 119366 166032 274280 -300922 -103450
21481 288729 8241 -165106 -27437 19 -190178 -26009 -108614 -186640 -82819 -27348 287690 146392
21469 146392 252470 -157881 -71107 142868 -478645 -182518 -2551 -124560 -132759 163665
21458 -17083 -251565 -95954 163988 -227050 13815 111381 -91313 -31415 95264 -174283 2840
21446 14091 124057 -542719 42970 26464 107517 38423 17491 109504 458162 149356 310133
21435 310133 347162 383214 82034 378741 103000 95440 -145557 -4296 -315140 15715 -30681
21423 -12880 -46551 1729 -262277 -169833 -54074 -54370 -43215 -68912 93608 59633 -7420 -117850
21411 -117850 187930 -232770 -105881 -123614 212176 -46245 -102720 -43759 -74816 92428 -124680
21399 -10008 -235560 65989 -316114 -94771 -41976 -34335 -53092 -309659 20984 -86955 -179381
21388 -179381 -278479 -137335 -198950 51422 -335415 152038 121866 -71975 74248 -141254 23767
21376 -191221 -56006 108417 -419861 143022 24304 -146579 -101740 -143998 93357 -380868
21365 117171 -84334 286291 -259669 -364130 164142 180717 94434 131701 6722 -128978 -149996
21354 -149996 131198 80143 185759 155902 259334 -164606 233566 -192342 -136574 -99239
21344 -99239 83010 -159681 -152557 -400670 198415 -119745 196678 218014 -34738 170660 -115684
21332 161098 -183068 284643 -38213 -53435 110659 39137 151598 -215661 -35263 -51433
21322 -51433 -83168 153296 36577 -56361 -128420 -213033 56910 -161369 -37887 -193044 -153368
21311 -153368 -7701 124748 -85927 128835 -191817 -48713 -124002 211967 -235642 -193275 219621
21299 113407 -268819 -25722 -178412 214 154187 -86904 330531 -77654 -262218 -204190 -277403
21288 -277403 -201031 279413 -23714 -87085 4866 83581 213579 49622 -200152 -19271 -102488
21277 -102488 -97243 -12807 -116716 166480 65038 -92410 119831 -81452 180370 241665 48195
21265 125111 -155135 -163096 136439 103638 -326939 -260501 -53434 155558 -157111 -18658 -121876
21254 -121876 19700 -71248 28687 -22252 -78591 -110667 15921 -231269 -190445 -96921 46659
21242 -17927 201721 -16515 68929 39959 214307 -107067 -40314 168768 226774 -120124 -93468
21231 -93468 -34125 -112708 -282912 -97502 -23051 -179434 -116728 -8449 -148764 6987 -37500
21219 -80222 -52444 -182303 -67044 -294209 110663 197980 -193917 100244 -117607 -187652
21209 -187652 -74519 80921 -5632 11075 -60800 -153897 277684 -311280 119735 -86996 -93785
21198 -93785 47515 43698 269991 -179734 -205891 -128032 -42460 67429 222500 107685 -536267
21186 -193125 139010 36174 -206943 -284502 -48416 -27662 31840 -118945 -304397 -187899
21176 -187899 -85328 -269403 -189767 -31384 -45532 211599 -61746 -22613 -172859 -5122 -85696
21165 -85696 -260736 -48385 70486 -27002 -178620 -162072 -124528 -64166 -15903 41928 -4416
21153 -93189 -74041 110813 -355649 -35789 179290 -302183 -111717 -3217 -184658 84188 -85025
21141 120627 27115 72685 53881 62234 -238878 21550 -202446 -85645 329057 11381 -54930
21129 -69925 -53694 -102584 -66215 -217970 -16677 171371 -205890 -137416 37406 -239347 -344798
21118 -344798 -98862 -95063 32709 -313001 -118462 69939 -83351 -12024 -93598 201137 -161625
21106 -260868 -276989 71934 48203 -73990 -416444 -2639 -45534 191616 -127992 102490 255414
21095 255414 -38362 -85890 268140 125847 -207953 227259 105316 162245 17888 65440
21085 65440 99734 -155333 105550 127699 -183207 -196963 -220504 115550 -31893 59390 -19391
21073 -41854 -268470 -188198 -254699 103330 -464403 56958 -470595 -239985 265011 -221090
21062 -2949 -56681 205420 105736 -45621 70 -248127 -131116 -104557 151365 -315867 -12168
21050 -132038 -134569 153907 -439505 -298953 -222602 -49115 -125936 -153374 -43621 25804 137106
21039 137106 77708 -43645 -143527 -11608 -228518 -163644 -165937 -498106 226261 -99491 -101370
21028 -101370 -408429 -251107 258687 -47146 196704 156984 -79488 142113 -332398 -290768
21018 -290768 116769 -12039 136693 -29006 32910 -287469 -105478 -64992 109917 127594
21008 127594 26910 -46110 -156947 216633 -100503 -268627 -57033 -36974 -84915 7065 -114407
20996 -293733 133634 126835 -145404 -16187 -320838 87371 40283 120212 -100886 51578 176969
20985 176969 -109979 301411 -122156 30662 -326196 -217402 -325825 -151053 195135 -50064
20974 145372 310571 535175 133847 -46174 330922 -137398 -209856 66175 -89769 -202246
20964 -202246 -135712 259013 -530419 -160119 96623 -103990 138716 -42175 -29311 -4732 161940
20952 -139987 -25447 -192136 96587 -184156 243440 32178 147061 -18423 -125689 229877
20941 296585 -187851 206364 -156470 -300877 -113084 -9122 -50139 66413 111341 -22762 -313933
20930 -313933 -162967 -137578 -95801 36982 -23171 5524 14380 -118263 -309885 -8051 54045
20918 -377561 4593 26553 -131243 68085 -155177 210780 117204 -222290 129376 -13910 61030
20906 -17153 -280186 140385 75929 -35938 -226609 -83686 -42238 101507 -172206 32381 -85024
20894 -122667 185294 -77469 -418196 -348604 -143195 -228894 -65811 -40153 -84230 2194 -95983
20882 -262418 -17132 56626 -207246 -206632 -13327 -101276 -95041 406251 -266344 -222893 -183666
20871 -183666 -167148 359455 42152 -49028 -37134 -103375 -205342 203620 -230511 263327
20860 -104528 -199139 114928 220878 -160924 126633 133460 -34737 -228805 -382772 -188073
20849 -289056 35932 283231 -235711 28630 104669 -305999 -334889 67998 -174417 103981
20838 -228839 -293451 -155317 122413 -111049 103310 34119 171123 109676 33008 -94813
20827 23781 -38348 144125 -4906 88195 -102928 -116484 -164622 -84340 -33464 96584 51345
20816 51345 -73614 22293 -46481 146222 278702 -262644 -84591 89908 -11632 267984 -141328
20804 -178733 -420528 24234 -179964 -381968 -172349 28199 -81349 -143574 -103952 -222081
20794 -222081 -199334 121246 50153 -187108 32149 -217176 -286753 111681 96273 -33058 -58891
20783 -58891 174745 140729 342975 -152260 -88431 -199019 133673 290709 284223 -231374
20772 -281021 -93655 -493462 160915 -12677 -80574 -74864 210927 71389 -74089 -274551 -92980
20760 -73103 -110463 146734 -350799 -106194 -95293 -178281 -37304 110589 -182835 -23649 -171761
20749 -171761 33434 294124 197113 -7272 -240902 137294 -119920 -46017 -313235 -147650
20738 -135027 33826 -423927 -137969 126508 104649 -63050 30736 102467 30299 30839 -297754
20726 -183330 140258 262076 473714 70303 -131757 -63684 -401091 -28750 -212151 -325456
20716 -325456 -274960 -196105 -254987 224138 88285 -207756 -24268 160257 -174829 46539 -172269
20704 -229960 -35949 92310 -105996 -74686 -130423 12906 -62520 75083 -16222 193060 -110627
20692 -98045 -151975 -65005 125374 -304521 -10060 -58886 -263162 -334630 137380 -122342 -143506
20681 -143506 183659 140735 -87841 27888 247017 -482274 -141037 -50425 -249693 118588
20670 -151581 114730 -12238 36181 -328653 -216552 -136731 -31328 -44081 -201624 58424 -40333
20658 140870 156303 115544 13481 160671 -331322 17266 173808 -26240 -3713 -165263 -204281
20647 -204281 81445 -235135 205581 -15491 -140389 175942 443362 -347296 -128294 -79050
20637 -79050 -223320 -631833 -115289 -155760 94914 121820 169388 58777 89177 45205 -134349
20625 -130717 116036 70356 109541 4989 108593 132771 -172871 -112326 296677 113673 -284978
20613 -194766 139867 283487 -227113 -430664 -274823 -91546 -316764 -484463 110011 -276355
20602 112923 23703 -188381 241784 -73684 -163607 -234227 -117005 21938 244924 84930 -61047
20590 99169 277755 103510 -85972 -118009 228636 -10927 37912 106558 100605 -109265 53146
20578 -246043 -55971 392290 -28489 -139192 -193914 21231 149597 3527 54677 -341713 -192783
20567 -192783 -227776 -254245 -28091 -226919 -90405 -74217 26610 -364664 -472668 42564 -32918
20555 -237111 50491 171076 -237386 -242925 -129266 -6675 -55080 -87751 153044 -36375 23719
20543 8725 -193887 -329658 66686 -17071 135039 -50015 -166069 -319249 -126142 -14374 -115229
20532 -115229 213598 79874 -26147 94576 42719 -176709 310662 585904 -287028 230234
20521 236765 -364806 -161811 111404 -126435 266837 28303 42718 -137302 136977 -497633
20510 223053 -142543 291421 -67190 -86333 -52224 -301121 31385 -289982 -64931 -76658 -86885
20499 -86885 -66943 115968 -109555 79264 74326 4096 6047 -22539 -71758 -181711 236645
20487 22261 -143599 -20299 294888 206107 -188956 -25249 -323446 -65594 76121 -68467 -248156
20476 -248156 -49968 -8466 -172326 -221338 -123535 105120 197628 69973 -310416 104521 -69689
20464 -245984 -41745 162367 132002 222437 131948 68472 -24736 127469 60257 136165 57627
20452 209358 291676 -158997 -34189 4537 -292363 -200626 -72131 -129176 101544 421500 59274
20440 2828 -236738 41321 -69503 277569 -184702 38640 -126137 -112384 -979 -287212 -56085
20428 -361576 19032 -41561 140513 -224223 88939 41000 -188707 -30646 -291084 -31810 -52744
20417 -52744 85089 8848 83596 -243379 29865 -33294 -46562 32949 21940 52490 60274 -107357
20404 -200790 -246489 -224216 7688 -95190 -224382 -148949 123492 79743 27305 -127008 -183345
20393 -183345 -265097 -228978 -230502 -146698 -162346 21460 159740 -222006 311468 -128220 81720
20381 -94528 40849 -167849 222603 -25972 91861 -46145 -256450 -282173 18758 -94390 -124671
20370 -124671 194133 23419 -122788 133678 -82083 -162339 61653 -115663 74765 -130318
20359 -109364 69898 -117763 166230 -254997 -134501 81816 273746 -182312 -339771 -12688
20348 -125554 135319 -150774 75599 -10201 121078 66802 240506 108909 -57366 -133053
20338 -133053 -60660 -163241 84807 25190 -35055 -130527 62517 -265960 84399 -125144 96889
20326 -24724 -431278 -123134 -188096 -385472 382738 243688 -56647 -242019 -59045 -114269
20316 -114269 -62041 -70653 -75978 292330 -353342 -26135 880 58565 -55043 -596291 -469467
20305 -469467 -244250 -69687 15939 192531 -307080 -286443 -70867 -109650 155420 192657 -153050
20293 -152502 -105271 132527 -411026 -115337 -7307 -125059 196863 76802 157566 81068 -290549
20281 -78789 -300367 138537 -28427 -30072 406359 -57254 48991 341261 -167449 -200889 22258
20269 -233907 -152432 -73637 122410 -104768 135244 19828 -101929 222325 145951 28594
20258 41989 -153080 -509348 6601 96730 23372 -157152 -198466 -370976 42538 129292 -73727
20246 -178839 -116963 -285777 -198538 199063 160549 -153388 -330297 -47860 225425 82760
20235 8779 -132984 -15884 -206906 -219288 26906 -160999 -315356 -444718 28821 -42376 180110
20223 -118919 257492 -353968 -162219 125979 -382430 15080 -50593 112862 -300718 182774
20212 -208298 -303196 -103075 17077 -118073 -100870 -289348 22284 -15424 -99825 -84193 -345998
20201 -345998 -150647 -184509 -157473 -124030 -136343 -93346 -43385 -396810 -7517 54759 -48359
20189 -16323 -41267 -290132 -67380 269355 -305866 173934 -119365 -52108 -98934 -256921
20179 -256921 -122664 -250668 -14424 272758 813 -13638 186002 1190 320277 19880 55598
20168 55598 -122966 -301497 -389765 -175976 -17623 -137418 -106110 -219967 -33461 169326
20157 -204820 124809 -62818 -367352 -150940 -36418 -42413 -28006 38824 -40250 11891 -288746
20145 -52146 79694 -85299 -197002 109882 95976 -131534 -8930 126271 200373 -22683 108186
20133 -248064 -220250 -86174 66172 223279 -50543 -188407 -85920 59203 -203442 271013 142212
20122 142212 13630 49623 -262420 -215098 1182 -99121 -106247 -174530 332580 -4090 329053
20110 -27582 -66374 -160180 -12170 95413 52384 183271 -141220 -301442 -119342 -323153 -66587
20098 -163967 -222178 -233333 268322 -181063 3918 14322 -71353 -121906 -90533 -406871 -298042
20087 -298042 -306417 94501 -156852 -71996 -60346 185648 74685 -275794 -96602 136046 -192705
20075 208032 161585 -128231 -242597 96228 -304 -223686 -87263 -8558 -169665 -275873 96903
20063 -6785 -261219 115943 80849 104330 -90376 -27028 -225897 -356388 -11461 -126224 -73804
20052 -73804 156923 -141424 27294 -74572 51643 -299131 -131538 -300607 -274064 -85750 180247
20040 -278776 59990 -48364 -93364 -180182 -158697 -300070 49679 -59521 76214 54827 -277714
20028 216468 164242 -234905 41874 -189934 67661 -8952 106343 126661 -81211 68415 -228963
20016 42642 -88645 150844 -144599 -139884 -97767 -112733 -195945 -32530 -81482 -179012 -84415
20004 -107707 -17927 128266 -57555 -112065 -19136 -46011 -141038 -140830 -416555 76867 164781
19993 164781 -433254 -49048 50560 -242881 -135297 45598 -521137 -117834 -134668 -169448
19983 -169448 -246548 86760 55737 98425 -126537 -15405 -211674 -436037 288481 270225 -68525
19971 -160791 -182277 152638 -117355 158557 117597 -10352 13375 22231 1072 170787 -19803
19959 -246113 -184970 -44497 -341433 210673 53361 -134597 -107347 12576 46714 -64255 -217778
19948 -217778 -40779 189721 -113001 -519539 -188836 -473565 -73890 47284 -112102 -357200
19938 -357200 27091 177402 -64212 437811 -390903 -133604 109182 66265 -97999 161521
19927 -359477 -305392 -324392 -92484 54778 -5271 74805 -228662 -217184 -1339 -128992 -162635
19916 -162635 -161915 183707 363630 -96679 -27427 -463262 -35442 78981 52640 114873 -14016
19904 -71173 -71174 81510 -132195 26403 -180403 112867 -28619 157813 -225298 -204165 -204032 -139847
19892 -139847 175832 -468460 -362516 223555 -148222 325208 -272745 -65166 -105624 155929
19881 -288299 171156 141692 177605 -46434 -265567 183257 -101952 -401493 85413 -4295 -19923
19870 -19923 -185469 -144042 -167907 94611 -423155 4810 13693 65326 52278 -71139 160672
19858 1393 -143008 -210987 -125052 -187950 31914 391987 -203815 190948 150339 -56276 18865
19846 26393 -262253 -289477 23588 11350 -184444 -1641 134956 191207 -411906 69004 -240334
19834 235690 -139919 -5752 -291223 -65404 29608 54021 -33534 -73550 -192069 -47535 118223
19822 -58554 215005 -167138 -79963 -43273 -177709 222315 -237010 -16523 29687 -140387
19811 -202871 -174753 -10750 -261241 -30871 -270528 -35255 -100235 -63381 169607 -9539 -151498
19800 -151498 -227137 44028 -183394 -123020 -309166 142568 -69400 2801 23161 109602 -288675
19788 -49079 -197659 13107 66546 -148558 -88846 212251 -178752 60496 -16364 -25197 -3443
19776 -226835 -320930 -8051 18984 -62833 251621 -177983 -98140 -140269 -219334 -167449 105315
19764 -122744 -82595 12775 49655 103325 -86300 -116097 182187 138222 8238 -107180 -152091
19753 -152091 -2931 -133356 -292092 140548 10887 -65792 167729 290135 -38509 -39697 -50713
19742 -50713 -333258 -238975 17237 34160 348700 -32418 138517 -217973 -30535 -11902 -13703
19731 -13703 -116210 262536 -5001 69938 405237 -425907 -50897 -92382 123674 -143371 -407709
19720 -407709 -105618 63405 170547 -45869 -306795 -9385 -13877 226308 15621 162578 1023
19708 193 -24609 120467 -71038 -33388 183889 -2861 -96079 230598 82136 -69960 116144
19696 45887 -16911 -249420 59213 -47671 -112227 -134891 -73784 39029 -278839 25798 -188601
19684 -114423 100252 430010 -267176 -34844 -208560 390397 -46584 -101742 -523575 -212376
19673 8084 -51502 123350 -386054 -4891 45998 67694 -63270 -242074 156231 -152575 -104138
19662 -104138 208189 -214412 -223270 -240066 -167691 196521 -235820 100495 -165422 -328191
19652 -328191 123483 -123946 114424 -148884 -176738 -35981 -48694 -64729 -4347 -146618 41294
19640 -17822 -117411 -199402 -21841 -115656 86151 -164123 136053 -116610 -218092 -301910 34117
19628 -109859 174434 95577 -180501 32645 -109482 -217342 -266602 2102 21970 97027 -207349
19616 -231653 -141977 -200564 -224177 -69264 134608 229008 10245 -79066 -482705 -26892 2897
19604 113778 -43848 -150414 305071 -8678 203010 4702 -88833 93463 -41460 -50092 -219183
19593 -219183 81677 200844 -257182 -239641 -408153 -115458 33117 51028 201373 164320
19583 164320 372884 -228079 95874 -198526 -254175 100149 -308127 97231 -31821 -67121
19573 -67121 -30463 207777 -52732 -53096 -284868 -149646 349382 21821 -75737 -1453 -336693
19562 -336693 255726 -184077 -87949 -605809 245247 -92977 -34621 -51653 35218 -237232
19551 77789 -151605 112720 -86110 -271182 -99930 -41118 -274534 65197 -92953 -258547 8681
19539 -58841 -261167 -82396 -113585 161795 -198546 -315306 -12600 35231 30003 78192 43561
19528 43561 -135616 -58861 -375284 -157026 26902 -225546 201790 -62530 -31640 -135606
19518 -135606 -10359 -351145 -249653 103565 -101299 159137 -122899 -115341 259395 -344027
19507 184135 118295 174413 -29104 -68119 -7997 -184263 -114225 7500 73411 -334701 -180038
19496 -180038 -58344 -412249 -471760 138148 -166128 -105971 -15409 -184147 16661 -10340 -18022
19485 -18022 -91461 -101251 -326965 52171 -97247 -217429 7864 -335360 -109068 -146367 -164443
19474 -164443 2839 135097 -100990 -151625 -315266 -442731 18153 239563 95566 -196281
19463 103410 -354042 -221094 202329 -52334 -36942 -133960 -226517 192361 -277508 124067
19452 308129 -152230 -33590 28942 -207218 -59518 190077 -157117 -31203 -220027 -50571
19441 -251268 212697 28299 117892 207108 -284836 168683 -155121 273739 -5861 41699 -216586
19429 73739 -236174 -71103 -108550 3376 407091 -60659 -246908 -86010 -29574 -334223 27762
19417 163054 -112346 -261059 -48228 -103676 -103848 54565 -161513 160338 -58007 -398536 118634
19405 -258199 -310807 40688 -246552 -99625 148874 -36111 17060 -128370 129290 322301
19395 322301 151615 132322 190722 250358 239020 195516 -239802 -2685 -174507 -4417 -47408
19384 -47408 -56286 -182336 -237097 -43964 -413000 17552 65543 -86231 -13929 -281054 -201239
19373 -201239 74865 45351 23078 63931 85894 -48620 308004 -160488 164145 -142501 246906
19361 -88098 -126729 -214151 -385343 26092 -124133 81234 158656 -15688 -32209 -163023 -265776
19350 -265776 49204 -1896 -227919 68575 173062 -127524 -84001 -131832 -128243 -199925 167113
19338 10609 59071 -26562 -136026 196937 38381 120985 -60290 28475 18671 -176418 -182506
19327 -182506 -269613 -33297 -19384 -120425 -74506 -34669 -139805 -48965 -73522 -167619 361915
19315 -164308 -319904 -301222 -22193 -265335 -142368 113955 -86521 191649 -120437 -202417
19305 -202417 -47560 5730 56685 14525 162127 -163937 -298638 72402 4913 157846 261191
19294 261191 -194238 -103695 -261185 -79998 -206020 33371 10350 184759 120608 -68334 -364914
19283 -364914 -258446 -106200 -89233 -131557 -40194 89298 -71461 150806 -300808 -1069 260142
19271 -315481 -42386 -68562 -97470 -254607 -495723 83828 -512247 -194698 -309075 262087
19260 -54808 -227514 40067 -56638 7617 -130985 88726 -182564 85729 67310 -286810 -115927
19248 -98640 15601 135380 -251775 -297441 310880 15879 -196988 -358894 -121299 -173456
19238 -173456 -282196 -90565 -190771 74037 -335375 182566 -173478 63624 -120967 52227
19227 -154774 -77468 -42844 94186 29710 34767 -143402 -129131 16633 -209335 -192650 59222
19215 -20217 -68000 -109438 -171308 -118096 -301691 -106562 -167396 -34016 -32217 -51389 103295
19203 350781 -81517 -210575 -367922 91025 -15797 175689 81528 -41502 -189766 -68829 105265
19191 158813 -129396 -555793 9589 18320 44987 -293679 67668 38424 69229 242512 -160987
19179 -255258 -156372 -364421 -194431 -87571 77120 -299624 -250850 -131627 93020 138082 -26398
19167 -161936 102137 167542 -168645 77000 -196218 -49388 -68258 -134171 214023 393227
19157 393227 128679 -114397 69528 -206694 82727 62309 -34224 -155033 -74582 81312 -112586
19145 -324777 -58046 -139240 146669 336043 -175902 356174 202606 -149431 62762 -44729
19134 -291408 -24341 -144935 423947 -284583 260985 152725 56707 -306426 123702 -34256
19123 -249493 197326 -83670 37460 -67231 -97316 37157 -198546 21820 48762 -101422 -161024
19112 -161024 -152580 -163623 -177725 227244 -153845 -295865 31757 -26890 -333153 104313 -274195
19100 45652 71970 -240441 -460300 -51344 -95776 -214266 -233763 -41184 -181565 -10365 -43463
19089 -43463 31956 -43041 13636 -304629 -99753 -26114 14228 -42451 27728 -51246 -198580
19078 -198580 108267 29001 -130436 -113818 -205837 394509 -123236 95265 42024 58085 -79049
19066 -303282 -92736 -165197 -29201 -16320 -278659 -426212 22652 20281 78909 -181458 204750
19054 30572 182536 -33541 -80291 -204607 -506636 -110869 -137806 42821 37530 -133765 226046
19042 -268042 -182002 76671 -125000 3658 88678 -254463 -70917 85045 -11856 -149029 228224
19030 40788 -202800 36599 -112910 54133 -13809 -143039 64036 73054 34772 410514 117887
19018 152500 -13085 -79493 -59472 -278662 -9159 -2956 -203576 123873 77520 -127668 3162
19006 -272860 261029 -178774 -106874 31991 -49090 -390474 -389989 -392330 -412240 -19368 -265349
18995 -265349 -20341 -210932 -236356 10692 -81381 -162434 -202848 -175909 -114211 -61634 -76484
18984 -76484 -30271 81159 -114685 91274 -91151 -115612 -97063 -58604 61194 6098 128794
18973 128794 -291062 286270 -306334 -77968 378484 -73358 258927 -307523 -66319 44705
18962 -234114 -74258 369577 -204503 22180 -221375 -86555 -147445 -150844 -140581 -74789 77107
18950 20508 -99920 -90952 -109891 88087 -112283 -104398 133631 -209985 76698 164960 24625
18938 80959 48419 68083 263471 -144474 178598 51575 -193707 261981 -3015 162497 48242
18926 -128703 102389 119451 -45555 63934 1815 -14631 87514 -229552 -87128 -189767 -399262
18915 -399262 -321125 -302870 34025 111308 -79640 5484 -28360 95354 -21621 -210369 -505 -110824
18903 -110824 -89459 121549 -90139 156555 -247800 -25120 -266956 185582 79290 -199482
18892 -177015 278783 95366 -40047 -147050 -167423 179826 -216833 -170349 -111296 1193 81913
18881 81913 -417048 -168125 -500727 85750 25533 -58483 359059 -49079 183117 -195548
18870 139314 -140788 -135372 -249264 22250 -70172 -72208 60312 2574 -203551 -123947 -42123
18858 88227 -36009 -158011 158529 -105728 -7522 18508 -70120 93314 -108671 84544 -283386
18846 -171461 -198226 -183963 -162921 -70279 102772 -197361 176788 -113944 117712 342894
18836 342894 -19976 -71874 195967 -140141 39212 -1519 -87475 -178900 -172373 125034 -18986
18824 166173 -33589 -67494 13062 56333 143473 88611 -168012 168019 -257436 -162811 27815
18812 -134438 113999 96220 131311 351433 84487 12522 402474 -21227 62690 234765 -92038
18800 -135171 -281168 -225799 -39731 -34036 1608 29964 215381 -60344 168066 -256464 40105
18788 76095 -129423 133614 -162226 -121683 -25275 -53456 -252684 -253936 -180781 -163462 -116889
18777 -116889 -15971 170131 190512 69602 -182941 -93300 -110622 -82345 -62345 -340663 -34736
18765 232993 -210614 -184869 96254 -216494 204354 -185174 124412 -71746 234933 -412402
18754 -110936 -239142 -484126 -12043 362649 -262436 26552 -252535 30578 -133088 3359
18743 56321 139776 -99499 -209644 -121009 52004 108848 -155464 -299150 -163859 168833 321932
18732 321932 367410 -148315 -255026 -96490 92518 -79873 22680 267061 -132024 102542
18721 -16515 -130118 -21779 -190951 213105 427007 -126380 -85362 -258882 -132200 -94705
18711 -94705 -60693 -175904 55648 109279 -22604 56635 -45952 110813 124259 -126929 59280
18699 329837 16839 167734 -383452 -132160 36990 -259726 -154684 -462787 -205731 -170579
18689 -170579 -97595 -205574 -277482 -224337 -391782 313 12545 -26036 2318 -133951 -55440
18677 274137 -103198 -3875 196910 -160170 85352 -65437 243949 209989 -286367 -213444 77358
18665 145643 -232981 63248 -201158 -145520 -107864 -294161 48455 59968 -64019 -222308 -197007
18654 -197007 -227170 135868 -112626 83705 -23479 -196115 -65154 189102 253592 -14457 -2828
18642 -1909 9656 31349 -171831 -36016 -143154 -356455 -43527 122440 199671 102983 -182737
18630 -348639 -321486 -353787 -189314 101108 -522649 -52308 -117091 117493 -22966 -42033 -99256
18619 -99256 -90276 47315 233945 231979 -58907 89363 -329290 -403216 -109980 39146 194996
18608 194996 -77094 -259099 -242375 -294502 143106 -89119 -254734 -115789 -367864 -47048
18597 -140269 124185 -70513 2654 -96315 -141424 104398 177556 147102 -20308 -49691 51986
18585 -66126 -17505 -31029 76839 -164803 102309 -11716 -216259 -84330 -152335 -77475 -267507
18574 -267507 98074 -172635 -199721 -231179 -85282 95464 -180939 14300 81557 -103569 -57079
18563 -57079 126063 -270841 61848 -49559 -138046 258847 199007 -221296 -50604 282125 131620
18551 -206316 -116152 46889 -160277 -52080 -166716 25232 92565 -256209 296521 46946 -119279
18539 42587 130457 21074 -22263 316446 293496 -287620 -249221 285863 17597 -163492 -50567
18527 -59757 -231638 -224234 -52996 -88425 -161393 -357318 174051 -383476 163736 -174010 -233572
18516 -233572 -3558 32865 -484653 119619 -331980 -180067 -191334 -305148 -196912 -413864
18506 -413864 53923 17567 -278262 -67180 -234326 61720 -280552 -94177 -197004 87019 -15338
18494 166536 -53573 342776 73815 18637 215215 328754 134088 136731 -137720 -43145 -174276
18483 -174276 -318114 -104066 -68893 195099 -14133 100241 4105 -401662 -96639 -511681
18473 -511681 191925 3737 -49415 53227 -166715 -13382 244285 -395655 156815 8905 53866
18462 53866 15885 12546 -35787 -295804 -100524 -198896 2341 196455 190511 -172445 78796
18450 79697 -382619 -248096 145896 -65382 111022 88905 -329567 -200988 -111937 -12101
18439 -310115 -8013 5793 -82448 29850 -70994 -38672 -29443 -258076 -116165 -195414 -218276 -151766
18427 -151766 -215768 -133226 -33434 156883 -103991 103942 -260951 -12356 304679 -246378
18416 -17897 135297 -198879 -146399 -44926 175340 187279 -6213 -185013 -39854 125536 -118874
18404 93805 -455312 202478 44723 -93269 -89285 141036 -111494 -62830 202893 -178688 -283430
18393 -283430 -115007 127459 -236795 -18248 235079 284245 -170765 -108427 292528 -174468
18382 -15156 117237 216691 -145781 -307706 274130 -54749 88226 48149 -4777 -16371 -48302
18371 -48302 -151904 274216 -256071 244949 -57739 -103589 286595 14217 71401 -307458
18360 -55990 39574 -297277 -141901 -42776 -54817 -123762 -167996 141027 -14615 95291 186325
18349 186325 -104024 278535 -275235 -54578 13858 -135754 -78745 -164965 -1164 46059 160691
18338 160691 96424 -267675 -68522 -72632 256122 212221 178995 -14177 -231837 -134747 -62943
18326 -41244 -222926 -100136 -253403 -269855 61919 -105523 -4601 -63145 231253 -50984 319565
18314 -11255 22316 -39138 192891 210456 -205203 90400 -150217 -204622 -45226 -306502 -37493
18302 -43155 -245758 56470 50899 -300992 70488 -247524 -311379 -233143 -186908 95436 -165978
18290 24789 61336 122130 70309 -72242 177786 91740 107760 -177734 -111677 12096 135756
18279 135756 32600 -150167 2363 -119735 191010 7012 -202114 4497 -112158 -293944 -75950
18267 63365 76210 -47530 -193203 161244 -356126 -158247 -114922 -473307 148499 57132
18256 185683 133484 44993 -98760 -105914 -275003 -122434 39894 -113544 67389 92654 -146616
18244 -253665 -42607 138045 -143354 349279 179162 172053 -8185 -91874 -237901 112932 138050
18233 138050 -15033 -160588 -446941 -367247 -355155 99160 -181883 -17245 -163369 -20442 315058
18221 176369 -398359 -229438 -67915 -15611 -277194 200258 -303953 -134069 -164306 -232293
18211 -232293 255933 244810 77628 -105230 32135 -31412 -274407 -129550 -373472 -168835
18200 -53728 65839 -192742 -5916 -62969 -78588 -92808 -203083 63634 -167675 -238474 -218645
18189 -218645 231253 94502 68371 -182138 -131846 -201772 19318 -110073 4574 121133 -126433
18177 116304 -62080 45755 -120740 451863 39015 -11083 100180 -144442 -30318 -465951
18167 -465951 -93385 48250 -54874 15101 125340 -100714 99651 1747 -207046 -37003 155603
18155 53574 -92491 252295 -164378 117052 81004 -262811 174529 140975 -110786 6856 -233059
18143 -184698 -136924 -168074 40675 -306560 -231158 -266803 -544307 -182935 106838 -102850
18132 -121508 -134119 -98319 -294193 -86217 167957 120230 -6320 -109219 -293145 284500 210217
18121 210217 141421 -131994 69308 -164416 -12708 54020 -435698 -51454 -282410 -151559
18111 -151559 -96314 106242 132217 -55887 220065 110972 -104461 71610 -2630 121502 -236788
18099 -136120 87187 370750 -88924 218321 -101204 386812 -20207 -191459 15106 -176524
18088 -215950 38426 112226 -235461 -368919 35290 2044 41955 -222365 -221259 -147422 -59144
18076 -129989 -108293 -1733 98975 88139 -229097 102515 -258274 149744 282551 91365 -209658
18064 -160605 -82513 132624 -129885 -312247 -287596 -89538 -173302 -172969 116318 -89563 -273862
18053 -273862 20579 16949 28521 -37481 236810 -93379 -134851 -223253 26476 82077 123648
18042 123648 -179582 -61624 274141 -115666 74635 -43429 35762 -82139 -87545 227731 -171298
18030 157500 -227245 172656 66709 -96225 -285386 -81796 -74590 37273 -221618 145382 -308448
18018 289436 -209023 46389 73764 206928 310708 314837 -78043 -314382 -144333 141409
18007 276496 -146507 11540 354757 126951 -265523 145850 1676 76732 -106213 -203812
17997 -203812 -49821 15221 -66038 22291 -50594 111138 -52387 -148805 164697 57418 5509
17985 -418949 188316 121572 -14559 207858 -898 -65523 -52052 -206199 382454 -264689 129464
17973 -276954 -203882 139472 -87627 -192168 89666 -95577 -195050 105791 -305676 236917
17962 -289065 -64217 118905 -99622 206167 -151552 -64362 456052 160980 -332934 -323125
17952 -323125 -159368 147694 -129134 193989 -109115 189321 9898 -163170 169001 -208137
17941 -11925 59743 16949 60194 3749 -168311 -13419 31999 -445930 83937 -1984 -294805
17930 -294805 98412 -267096 -53005 25762 214429 -27026 -313049 -79265 65026 -125166 114482
17918 280489 62832 241280 225686 -116600 -52758 -511421 65286 138895 -26567 56653 137138
17907 137138 69797 -90711 -232612 -241271 -292559 118832 81096 -54073 -67685 -221065 -298300
17896 -298300 -37455 -116080 -254674 -84779 -43545 -19294 -309555 100598 414245 78278 -63297
17884 -26659 62508 -82365 223669 162708 -81986 -127266 6300 -131563 393007 -210803 105247
17872 -380246 -120293 228256 -159438 -175084 -122982 -129343 -429933 303043 191919 93171
17861 -258893 96967 126325 79525 113771 -22137 -101874 79281 -174822 -34072 -113948 186916
17849 81695 -5433 -279318 286001 -355788 88183 99048 -70231 -144105 -232072 -138129 63358
17837 -20753 -273002 37980 72759 -182320 -325985 -235028 -48023 202332 87463 104673 -296374
17825 113652 -313842 -412929 -51021 -356475 -105963 -225160 123087 -85131 -75078 -86529
17815 -86529 133055 236980 -65929 71677 78464 27961 -232928 -269832 11929 146257 -22736
17803 11546 168971 23495 171462 24801 77752 -90167 147399 -56969 188933 97219 63622
17792 63622 1957 -416618 -276585 113948 -99233 19397 345141 96600 106028 262995 207174
17781 207174 20206 -107594 164530 -28532 54360 -39867 321584 6597 -158417 -62367 202733
17769 -29624 138489 -46997 98531 27631 -54839 -123099 -131932 -37647 -133122 -81924 -365193
17758 -365193 215886 104159 -47670 234171 -151396 -48987 16421 414353 -372160 -41069
17747 99287 276522 190774 19287 -243759 87776 -116924 -66360 -93938 83688 -210990 32618
17735 151661 116515 -161728 6064 -97326 234096 23585 76082 -426698 238404 402664 190154
17723 234728 -88940 -211370 -143341 212138 62834 120515 -193339 189735 95793 -134609
17712 -133109 124244 -168936 223892 -46565 49211 69139 63425 344940 -90469 -133456 -68928
17701 -68928 -7430 -40589 -230446 -227435 236112 -164705 -151512 168697 -76878 158548 137722
17690 137722 -271659 -145514 -256712 -61696 61390 -136664 9769 74848 301922 -26022 -132180
17679 -132180 -8083 104953 44753 310046 214461 -167014 36937 290331 354724 -255139 -80784
17667 -54423 100292 -50367 -149435 137110 223669 -298146 -184199 28951 229866 244261 114390
17655 -170865 190694 10264 335388 -321289 -166167 19311 27998 -194832 148588 -21416
17644 200649 -13497 -244871 119380 220193 -87463 170928 99832 -324914 214655 -171400
17633 -174908 240638 -113455 -224688 -49440 289614 157288 147947 81659 23460 89339 201530
17622 201530 -8214 96295 63151 -179423 -86680 283876 -59034 9348 121883 97219 23088
17610 22178 342942 375382 235292 -103864 23285 366559 -74406 20868 -417521 -101786
17599 -103380 197190 -45633 -24882 -467102 316944 312199 -174361 -576532 -309066 15691
17588 131924 53335 297207 -2116 -4825 -184028 -308865 404640 59427 159393 243834 -202063
17576 -45136 -188379 -90719 180229 -337600 318060 -124131 -55168 292454 143666 413624
17566 413624 29501 -212628 193389 -53603 -91428 -100518 255016 397261 -287471 251043
17555 31845 -157864 360992 -58982 -28248 107803 3697 -50834 -137710 -86811 -26878 14904
17543 -1047 125695 -80524 76661 29172 213212 85296 25038 -95131 -244976 138907 -155089
17531 123440 168897 202436 212946 38305 202117 268689 -225141 -147538 -21910 36490 63043
17520 63043 191148 225850 289347 165595 -213606 -39868 388453 43717 -262335 185595
17509 -186928 100431 214317 71513 36889 253463 263119 255193 256677 253911 -85425 -8293 247705
17496 103160 196641 318115 -28307 -53484 -19002 148073 -68316 -143484 52755 -88274 -76361
17485 -76361 22521 -126416 51724 382788 -147715 -34254 -316041 177459 5529 -56721 227238
17473 343635 78771 -157159 65461 -136524 64444 18131 88608 -111905 481906 213871
17462 10983 -82128 84263 161266 38392 70196 35746 678 418000 192168 385356 339002
17451 339002 244916 100126 203164 147805 401450 306916 275804 353718 315980 115740 626706
17440 626706 234240 175701 25389 -116137 299650 49291 107478 250477 335852 60577 140465
17429 140465 431943 -66304 184483 45728 202524 72687 272949 -45832 510266 238900
17418 421588 -71096 425293 77933 181430 347618 106701 112107 237473 92353 94050 -40492
17406 198264 254800 25715 114772 308791 -327938 -85852 18220 392352 348489 195727 240182
17395 240182 321261 134654 -56916 101275 -42833 -44338 227987 204439 23968 240272 281633
17384 281633 278136 -99799 135858 185487 331004 196751 111471 292899 173459 337372
17374 337372 220098 306832 337066 520006 217649 111248 -72161 36924 186575 -6602 94970
17362 -17758 364817 -142877 212604 -76634 -133846 364166 215922 227478 258543 -234319
17351 277399 55631 329458 283963 24401 314800 129490 41448 157306 306136 236578
17341 236578 44385 232223 51580 202260 45854 -246867 -110105 -179837 288951 128574
17330 61891 -33183 167403 -125290 239118 -40930 194418 -226601 107213 97611 103114 -33812
17318 -24847 -41904 110926 27721 303065 -165861 295952 145263 -85844 324480 -242283
17307 165752 -110387 -95100 -85184 232699 -261861 122851 -143574 -33689 230868 354394
17297 354394 -28323 76660 329604 203781 -83221 174792 260669 89812 94162 42535 57012
17286 57012 363506 192188 -5799 449099 197632 103135 186302 183285 149575 31338 100435
17275 100435 193014 365609 96405 158551 196402 73316 170068 356334 247428 135308 216957
17264 216957 115589 148371 126650 273383 51853 116202 -42889 36227 56441 248674 149447
17253 149447 102390 27021 -57698 262725 141272 -112501 313596 197603 301052 421511
17243 421511 207176 135169 176241 -74154 391365 359828 254389 441968 233973 -7066 38782
17231 258888 284260 42524 250760 416049 295534 447037 152768 234433 -114223 238004
17220 -207578 97004 213938 458264 379751 62445 72896 447114 313700 279574 438067
17210 438067 460835 275445 576165 467491 496288 265662 122702 71314 2188 311157
17200 311157 134422 -60391 147082 311073 35968 281697 243423 270034 -72774 162567
17189 97468 274249 357059 285392 95889 197441 202776 81269 176553 -137421 173703 442018
17178 442018 354234 137322 233752 -101015 378190 419751 226337 -135059 255872 89949
17167 351306 -24982 701007 149616 601425 447602 361009 132377 123126 217658 357794
17157 357794 223411 389993 311663 176080 247066 359141 330005 159538 235627 127731
17147 127731 -7321 -23698 235228 220453 544767 -65542 558073 226995 217270 473265 337547
17136 337547 66847 29899 215242 411113 531940 73144 -60569 334514 327207 315233 -1263
17124 368528 -35866 345741 66962 350677 321930 126855 300548 277330 217942 454858
17114 454858 375896 206833 7623 38 249671 307849 195718 387774 473500 374112 402476
17103 402476 59682 324098 352410 105367 172519 221463 417760 31509 323153 427810
17093 427810 251566 195945 470198 497613 268213 422835 371627 321919 397114 172758
17082 264916 639538 141900 144305 442644 212111 385042 607364 496386 501893 289947
17072 289947 606285 862471 503970 863384 490655 240549 228623 679115 625283 391890
17062 391890 425827 340811 372155 611471 333879 595513 736263 732311 748519 418252 610568
17051 610568 564544 322147 194678 586159 324048 492335 135065 369042 632602 454893
17041 454893 610788 678665 647750 736573 381514 220189 535871 378936 803294 710554
17031 710554 431644 553061 488071 587875 461022 786360 656507 706657 388680 569463
17021 569463 464755 775252 850245 962503 920061 448214 552984 470434 885552 780280
17011 780280 530288 682533 887111 869614 759389 476784 524003 541654 512301 542566
17001 542566 753246 826470 517188 591815 752894 972632 842969 983370 799184 828592
16991 828592 505673 463568 938611 482833 705756 653524 686008 804842 941100 623393
16981 623393 915255 937238 816696 778496 872516 755715 974988 683451 503022 528465
16971 528465 881146 749460 836658 457780 1131461 691796 870793 921450 570192 909896
16961 909896 966546 786751 840566 920685 972631 1024994 666623 1000659 726480 915290
16951 915290 1047387 781193 1154735 1127512 837620 869878 1018948 1008741 1092198 814279
16941 814279 1223063 1047950 1007911 941472 1047574 1295524 1226949 1153872 1320999 1208475
16931 1208475 1395881 1107656 1046338 1176596 1145192 1070766 1214372 1383129 1355273 915581
16921 915581 1026596 1295349 1306118 1142127 1338179 1495654 1304580 1556175 1216651 1524055
16911 1524055 1303440 1347667 1182774 1555877 1303412 1116154 1534662 1450297 1347142 1773127
16901 1773127 1411655 1672204 1456546 1775196 1915330 1577170 1621480 1545215 1456586 1852773
16891 1852773 1584154 1788695 1896292 2049145 2001948 2157663 2155163 1980406 2173067 2045663
16881 2045663 1975906 1973877 1931948 1992674 2500073 1937253 2117135 2160501 2145776 2527664 2293522
16870 2293522 2727487 2288773 2294675 2402407 2559610 2580734 2487282 2602437 2676556 2564109
16860 2564109 2797328 2700531 2848642 2954625 2892906 2573090 2910483 2870939 3396328 2948588
16850 2948588 2870753 3157481 3380532 3449461 3288767 3227114 3706647 3635206 3345072 3318449
16840 3318449 3334282 3538461 3392718 3882556 4127634 3963596 4010846 4002307 4140120 4200942
16830 4200942 4047391 4546982 4286977 4829733 4604605 4925964 4705194 4736550 4828591 4970549
16820 4970549 5200554 5219016 5464972 4988016 5468497 5244375 5683664 5651427 5642133 6055896
16810 6055896 6203104 6322729 6249915 6466590 7129245 7239980 7019638 6809784 7164477 7870096
16800 7870096 7482757 7817573 8130345 8444853 8449287 8878844 8548190 9315238 9525191 9642880
16790 9642880 10362698 10144597 10411123 10647057 11125299 11443848 11687859 12021895 12586839
16781 12586839 12566548 13190748 13437614 13773708 14526486 14809884 15358202 15616492 16099364
16772 16099364 16727904 17378610 17890153 18830446 19425790 20352879 20664831 21720753 22536389
16763 22536389 23211727 24020180 25123798 26382381 27329752 28641141 29917315 31040813
16755 31040813 32930014 33949921 35787860 37417116 39429431 41276588 43386846 45634767
16747 45634767 48209981 51021804 53558226 56391684 59651703 63161609 66515809 70652000
16739 70652000 75417600 79740825 84848867 89760863 95609622 101671519 108212976 114591830
16731 114591830 121904733 129573734 137287986 145557360 153333121 161478635 169399740 176760890
16723 176760890 184009108 189910655 195362762 199391506 202277294 203361301 203363523 201538169
16715 201538169 198366571 194253196 188603328 182175497 174507346 166854040 158911778 150767649
16707 150767649 142543921 134353017 126609228 118893693 111377647 104887328 98269721 92291752
16699 92291752 86488652 81710063 76809103 71801090 67639916 63680560 60210741 56411031
16691 56411031 53626646 50506783 47864812 45485364 43151751 40620540 38678120 36735334
16683 36735334 35143717 33502048 31693396 30477982 29103257 27814985 26619151 25436384
16675 25436384 24363294 23375948 22380948 21358178 20633385 19883822 19199703 18379071 17835069
16666 17835069 17215656 16810040 15703094 15473235 15104475 14423887 13896981 13526399 12907764
16657 12907764 12667815 11811500 11640589 11556826 11350781 10342664 10565879 10138941 10031961
16648 10031961 9747766 9475632 9182235 8915113 8579841 8430296 8106278 8068674 7626113
16639 7626113 7559274 7574517 7116175 7094207 6591939 6349304 6090636 5881975 6189980 6158917
16629 6158917 5891003 6018593 5764712 5566302 5399386 4988236 5083342 4777884 5029602 5016085
16619 5016085 4793683 5008744 4758646 4799998 4515131 4345553 4487249 4597071 3854765 3984653
16609 3984653 4045366 3564689 3822369 3403286 3410689 3647012 3140230 3757886 3462752 3392839
16599 3392839 3431631 3265757 2711645 3058647 3314513 2697290 3056524 2802227 2839866 2862389
16589 2862389 2647395 2868217 2798116 2602389 2735866 3018303 2341989 2082750 2507094 2602757
16579 2602757 2364993 2233052 2264585 2220843 2495212 1998385 2040682 1993673 2361534 2150561
16569 2150561 2041841 1622275 1870211 2125889 2191986 1900744 1679874 1969693 1856092 1747342
16559 1747342 1718337 1533616 1803201 1786951 1477454 1660814 1577371 1587712 1512696 1454739
16549 1454739 1965999 1659844 1324580 1469582 1378484 1364044 1344745 1321600 1251807 1199401
16539 1199401 1235502 1648970 1426016 1539114 1446570 1191736 1256345 1160556 1240268 1139959
16529 1139959 1317162 1160809 1260073 757248 1455089 1204674 1204425 1197837 959799 1034345 1074277
16518 1074277 1100378 1159136 1093460 943673 1080248 629734 1083398 1101843 883762 1122903
16508 1122903 1149356 985911 878828 1115823 1175097 1188311 843813 658035 1021557 1103167
16498 1103167 936041 777220 965938 977255 1033752 882320 834393 838910 1288180 991886
16488 991886 757962 851113 896258 891423 761093 582044 832525 638966 355548 800213
16478 800213 669516 478920 819455 677032 702124 872203 617506 476216 552731 679207
16468 679207 810956 883579 588167 583515 581767 674101 798568 535241 556281 258497 619791
16457 619791 624784 438799 874215 445267 531670 770847 801562 400191 719706 459137
16447 459137 303004 354465 602416 622413 744953 504978 729725 582573 437986 478696
16437 478696 578835 242980 389559 321759 220358 638202 44609 78140 749240 472953
16427 472953 597848 299008 210271 236072 474737 320864 438683 395686 346307 555958
16417 555958 463583 767257 395603 101372 423232 341496 204625 383410 179059 329476
16407 329476 764223 311681 353657 494097 800771 31273 333065 249704 444381 225770
16397 225770 126932 185140 441352 381606 -49176 516146 167256 176310 319452 252886 392279
16386 392279 270000 258281 43385 487600 451070 608604 105341 12307 232792 77227
16375 347785 247578 -61531 438503 403113 430670 574033 546650 39635 119642 388648 529408
16364 529408 97227 402823 242369 219412 61290 -35509 166156 188982 465123 410999 283647
16353 283647 216500 400970 464883 349029 58243 342696 117983 284287 332863 429486
16343 429486 431844 318013 144293 273346 313887 146601 287804 156966 343425 733012
16333 733012 409200 167760 -70883 175776 342668 164671 422269 70473 -38146 129257
16322 25605 267258 171296 444198 499808 6972 -266874 597045 188531 327204 44474 93482
16311 93482 119817 33782 -17406 -29732 190519 146499 -91866 308642 171993 136802 232667
16300 232667 148377 135961 152776 433736 -101322 -237266 306229 189203 10697 147340
16290 147340 172462 -125304 597686 341475 60572 398941 122306 344268 24998 206543
16280 206543 -152674 -106702 -105964 348090 315087 359001 52897 295452 -78637 236286 89810
16268 32597 55627 35032 -116407 -116740 -128128 172823 -48865 205197 322063 306170 248265
16257 248265 -8214 468936 -32549 -105450 155083 287046 -197578 127100 -325861 69755
16246 221663 -31963 -108546 214761 124927 128740 -33395 128820 -8650 63609 125668 -90503
16234 243714 58259 219420 19674 -462 -38723 -63075 252652 117381 289004 35021 -141374
16222 74294 165007 223538 126670 -111295 141374 -4726 -102473 78180 -12032 302719 7803
16210 -50839 -18516 -113432 373507 103336 319187 29199 259092 174477 -40362 -151501 176022
16198 20590 102318 -121086 -237590 5901 35 259166 6552 -45024 -144353 -174111 -74354 -9530
16185 243894 -204593 -195325 -14367 -11074 -36335 351056 -84926 -202260 -81925 -100118 30219
16173 -98861 266384 258152 -14965 120418 -168606 118320 152852 11610 312162 133762 144250
16162 144250 -88763 -287067 28031 -302840 108951 42496 15494 130238 81809 56658 183890
16151 183890 297 -102965 -6012 6189 -50237 363509 27155 233787 -337260 -241613 -45247
16139 -214024 -19989 105596 244884 -67858 -35696 -46329 19404 -163341 -34200 -332132 113281
16127 130802 -469825 203942 65195 87223 -152736 -206559 183260 320967 57077 -198864
16116 2266 102708 -288291 74901 32023 -326635 229494 97540 86531 33662 -194724 -96465
16104 -202873 165146 152644 231635 320934 213285 65983 -35533 113092 -23925 309644 -36784
16092 -201025 103282 74489 89723 20385 -80413 -7914 136699 -89980 -121671 186243 -92682
16080 -512771 -259655 -175098 8336 153722 28008 -44426 -382441 239406 -311105 -134216
16069 58387 -119800 -143444 70947 245668 -29419 -87734 -38959 -153007 -33331 130397 -283908
16057 163801 91574 -78001 -80728 247747 -15145 -186403 -53852 -188872 17911 56458 -299129
16045 -16030 -141626 7436 -149223 17826 -160148 275746 221708 -238269 141055 207755 35282
16033 -182613 -75790 -210967 -174274 -57118 92900 -251564 11193 -104195 269082 22472 -105823
16021 -84456 -328714 137212 -2879 107287 -148440 -210375 -179860 -210916 261384 74723 138705
16010 138705 141713 159272 -156452 -151839 -173082 15966 -190157 -198649 -64765 70521 -152689
15998 -34310 -102523 16225 127688 35497 -155805 137616 -355298 138190 40528 244541
15988 244541 218746 -403592 -55784 309596 73860 38081 64000 430499 192223 267488 -15154
15976 -285569 -254266 275498 -194527 212415 -291772 -197117 133641 -7900 1754 -43045 120896
15964 -80168 79448 186483 91287 138222 -16222 -155354 -28099 -291981 -164935 24861 35445
15953 35445 -62681 -335326 -74462 -204325 -105817 290172 -411034 -9425 -303290 -161269 -45958
15941 -112947 -268407 477309 -172886 -312731 47530 -136583 69676 -173343 193883 38541
15930 -438867 -265994 329380 -135763 48280 86515 82276 -347222 -51710 -143410 -180335 -100397
15919 -100397 -132299 96719 34457 325205 339537 -363918 243494 -36958 78791 107077 -211267
15907 115275 -334604 -34134 -109680 -200317 56278 27682 90797 -232585 -104200 235250 -114012
15895 40080 242424 -376126 36273 98012 139706 -106730 -20335 25849 -304930 -20856 -91474
15884 -91474 284871 -43275 69666 -229628 -184716 -284898 -414813 -59162 -386099 105062
15873 -42416 -187572 280522 92523 -121392 -38110 107664 96509 -415532 -38414 228469
15862 -160952 211654 -102283 -242638 115444 -217484 -153788 -78665 -855 -122973 94920 37617
15850 -127929 113244 -58946 -99342 -32244 250545 -144567 217709 -145628 104020 141102
15840 141102 151927 220769 -259966 -4397 208829 -157557 157568 -343082 -140819 121971
15829 -428536 8505 65905 18912 -138320 -318504 171476 -67956 -206312 -153862 11151 114679
15818 114679 -10012 85431 3823 -335290 -156585 112500 -192481 -221591 -279990 178475 -82168
15806 53782 -7914 -164487 -215303 53569 -102466 -232252 368141 51147 -145525 -328439 -23508
15794 -89135 156907 -76469 -215627 -300329 -396957 -40266 94374 -162324 -71815 153132 -135321
15782 -346952 -135382 -228544 -205653 -27075 -12106 -268078 -186789 -186168 -309739 -155676 30584
15770 35939 23634 -64138 -290067 18440 378865 -213920 -371038 41108 175219 182073 -44311
15758 -26488 123896 53769 6095 202283 -249450 -70822 -50712 -80714 -264058 -162684 -31031
15746 107379 -151894 27308 125375 169045 -244627 209544 104537 3944 53038 154777 -190479
15734 -229704 -361764 -142411 -79523 -271061 105709 -337825 222369 -152467 300631 121121
15723 -353 214675 93866 20054 -18505 -181677 362953 186297 -205323 -249176 -176260 90486
15711 -329772 12844 -24011 118135 -145403 -102451 -61810 219624 16870 -275160 -55838 22975
15699 121788 -106279 -363501 41126 182200 174613 -116408 115994 379537 61983 28487
15688 83359 61294 91226 295395 367861 -305 -208762 21507 38185 124383 714 -77409 -260282
15676 -260282 -204766 -73202 -186834 225465 145944 53808 226234 248247 175046 303866 99730
15664 -171979 89468 -100943 -16179 37350 -150608 -4906 133552 -32673 197223 -105525 -320856
15653 -320856 11195 -33527 124054 143291 -127747 315005 -171113 64036 -18289 -149770
15643 -149770 -129207 81428 -97328 247518 -325790 -79159 -456393 -136431 225292 -156619
15632 101497 96900 -252781 191382 -424029 177286 366069 212151 -178967 319612 129550
15621 -143413 186612 -73093 -116870 -164195 -246332 200393 163691 -86223 175798 -146828 85864
15609 137645 -139156 -196856 -46912 98692 47653 -232618 -279937 -22864 -2169 -139185 -115612
15598 -115612 -185764 -58086 -310702 -39775 -3398 -6707 44995 173312 118683 18604 130320
15587 130320 -8035 -132171 -50612 224176 342876 -260890 -173350 11461 147728 -90264 -2566
15575 251851 -241550 -42998 -133292 -54659 -223129 161910 190205 -161069 -76893 -69463 204126
15563 -115255 -390193 -229413 89397 177852 -32840 40053 -12922 66118 -216622 -36349 102906
15551 -259931 283582 115083 -228624 -257483 -348462 -173653 -59894 -169367 -206129 -74719
15540 308895 101067 265605 -137430 -260948 -54194 -289914 -248655 -84826 278807 -138763
15529 -70806 322987 -175442 93050 -32166 -124524 -96851 -466398 -317727 -161731 -237888 85063
15517 -51288 115479 -32790 46354 256078 -126781 -213923 115933 -140605 -251140 -15808
15506 -71363 -36163 -210547 356048 -69197 -82391 -36414 -44233 108326 -150773 -102738 -6714
15494 276147 552887 -210647 -90634 -233204 -196390 190597 -98903 -43 -221890 -141156 -210205
15483 -210205 -47892 466773 -231146 -11601 123785 -12280 227727 121247 -60926 29755
15472 -98193 155171 -63163 -230095 5120 -38275 227319 -129980 49394 -166611 36385 -34198
15460 298572 -96033 62830 72694 -27413 -105733 -205499 9796 -70296 -103040 -47414 -17668 -21023
15448 -21023 -140820 142403 350169 -199263 -174423 50993 263878 -72276 -255707 47948
15437 -386779 136824 80584 -15820 -139228 169850 40982 374377 -81641 67629 -20233 97813
15425 153584 109326 -225527 30011 -3016 -300395 -75386 129348 -73930 114267 212089 -180901
15413 -46128 106676 199153 4690 -142101 -275595 -13293 -40893 -161585 115954 -204975 26676
15401 310743 -225076 -76267 -24649 -99598 152765 -67302 -114154 -105207 -219736 105350 174891
15390 174891 82529 -75699 209221 -186141 92073 55542 83800 -14189 -436601 24959 -104084
15378 -86274 38446 50111 -112921 78925 -261065 -57861 8706 -395689 -986 -9944 92581 161128
15366 161128 129350 89176 -214161 -292053 -95054 -155442 36879 -202405 315978 -22264 25718
15354 199569 -135912 154735 138527 328986 -88228 -319235 -86963 36215 -5870 13629 -315561
15342 -75971 -97638 -88956 -168282 161029 -79285 152159 -38276 -17786 -116817 -304343 345871
15330 -203468 -145690 48068 9503 -62817 161974 -16017 66070 336999 76304 -29736 275353
15318 103989 303500 -193251 -140532 174791 -244549 -80881 -448227 -36935 -74225 -84788
15308 -84788 27103 171053 114621 -133154 -136864 104361 33994 -242265 -271099 -285727 -178382
15297 -178382 -123886 45579 265833 -44973 -189181 48445 -43356 332169 173267 125348 286151
15286 286151 23397 -39070 44538 151660 -132974 182727 -78531 50486 251750 -162123
15275 166969 138577 12580 -87618 -76134 -42540 -217400 392440 -374944 279590 153111
15265 153111 40057 -94192 107665 314910 92275 114277 382979 253407 2689 83100 180808
15254 180808 170639 263117 315971 159390 157959 505422 858910 1524771 1150474 1390818
15244 1390818 1392547 548070 425520 213887 -79569 34826 47521 -101527 241256 -10721
15233 -174177 153503 92199 -81078 -79438 279353 62882 369364 153052 -277910 -176915
15223 -176915 -85787 275672 -88999 -119511 113975 188829 120217 33844 73248 -29566 226938
15211 13599 -51295 -289214 -233477 -226198 -11517 221985 166425 284896 -162768 134927 -10846
15199 17238 -45553 8896 544410 -148853 123232 169481 -92763 -75032 128879 246607 -48544
15187 -181367 419185 21035 380477 51727 38263 92002 150277 200272 -102347 39569 210175
15176 210175 154957 172414 117061 -6759 -49810 164695 -85644 -135406 75 26832 -67826 323178
15163 68591 325949 -269359 107186 -100510 -1195 19755 263458 186024 -23503 225161 -109310
15151 -44762 -396964 -85661 155756 115251 76768 151462 309706 -56997 -27123 352040 -120710
15139 129243 203022 9725 -70151 -150741 314134 272830 34538 72650 270216 188090 -62384
15127 145471 5205 20986 3653 77595 61974 8796 69231 -30505 351015 -219985 169434
15115 272898 -151985 157402 -55649 95707 -96829 504950 -47413 5791 103198 213350 336651
15104 336651 75205 237679 20749 -95798 217721 -26197 -258564 10067 145517 61628 -87214
15092 217548 -264544 28741 462502 90942 -237242 20559 517507 -112767 142926 -168267
15081 48379 212807 370717 -279661 -17826 246090 128375 257812 -279009 194476 141210
15071 141210 42806 58299 76796 157258 139850 -67358 -103221 205019 394831 254581 -8616
15059 269683 71743 407911 351797 227231 -94830 254178 -107542 26230 266269 -67678
15048 309468 399041 192050 283614 418950 513004 191550 385760 286047 60391 145760 -134929
15036 185164 127987 104894 67780 210859 -221258 193780 131222 585268 205157 267396
15026 267396 -57433 288072 97882 220655 -7384 230427 -8229 273695 170469 -55555 268362
15014 112897 86821 124109 -111449 230732 118729 33378 -33440 -116815 405860 262518
15004 262518 -17660 212917 119152 250217 441920 325288 237066 320485 516742 100683
14993 134718 381789 490937 281346 127487 332377 212212 62473 45974 65661 73324
14983 73324 428236 265692 117041 223185 73386 -1911 -25103 77064 299834 161029 40975
14971 -65190 170090 362998 100530 114740 187049 532514 386481 34184 245789 439 334898
14960 334898 253676 -87437 274147 400012 159721 -144152 93829 220562 75273 324560
14950 324560 509262 166813 12025 14927 415280 248192 -75323 459457 320158 293016
14940 293016 -46108 112471 397541 -119236 202484 231978 483761 364719 150292 422861
14930 422861 193735 283309 403171 -104940 87672 175675 208863 177725 359221 -76109 518713
14918 340742 497407 295902 292890 400093 -59590 -226064 342313 157814 230097 664379
14908 664379 616459 417263 150432 225866 494165 332933 566766 192021 165437 417789
14898 417789 496875 214616 229193 379188 152137 133338 643343 505881 139219 405175
14888 405175 390439 -21683 329368 113803 527731 121836 68934 403962 530080 469915
14878 469915 346355 598021 358745 416851 329135 211976 250891 482616 239750 799811
14868 799811 584832 348201 387565 378083 77015 369398 400227 285083 540645 292192
14858 292192 739130 258331 449925 481985 813281 127494 321854 548119 251781 300622
14848 300622 477040 154164 821200 465999 195132 178627 460698 727867 386582 602980
14838 602980 117222 443555 427662 670143 430316 213435 648943 531969 365020 235669
14828 235669 120051 260998 260834 219346 454215 829237 351078 461892 451651 363693 471621
14817 471621 794263 514885 608766 439473 439881 570690 380991 451894 434861 441740 89378
14805 535363 475330 662840 290945 462519 325479 538574 529416 1124665 781625 415775
14795 415775 300713 806568 638466 627291 479914 723217 448952 548165 523352 375278
14785 375278 574907 437697 617119 414660 646224 540371 186797 358245 539205 357901
14775 357901 699774 823930 538517 699295 465803 717734 542790 442815 556984 585653
14765 585653 399640 627308 568843 478027 278497 768610 572464 378065 738610 480450
14755 480450 436926 636500 536462 503415 718813 765444 628548 689682 449263 343123
14745 343123 272200 810556 804409 500421 490985 794840 677740 544355 868960 559865
14735 559865 644922 907785 748007 569311 997039 667500 672796 869041 498294 604750
14725 604750 471176 850295 528958 740295 772191 908874 500896 619144 751330 795283
14715 795283 878437 878984 687523 716068 1003325 897715 720630 611084 830054 643570
14705 643570 673396 732693 647619 1065126 638165 741959 859391 1053709 874832 809773
14695 809773 675251 991800 877758 711985 622695 614497 708876 677326 840424 1044528
14685 1044528 744734 989340 655207 959437 1390810 785096 740811 839964 1183348 689301
14675 689301 856248 1255040 1073344 1033706 1040839 983161 1156640 1043171 989534 929893 835174
14664 835174 1076370 927652 1063727 1091685 1089027 1111890 912533 1142109 1066438 956286
14654 956286 1186123 812542 1210259 1031521 970110 1115827 1109938 1312918 1036549 767669
14644 767669 849453 1492948 1129897 1016258 1028264 1189680 1429993 1441792 1188451 1215135
14634 1215135 1530583 1098469 1597816 1077748 1122214 1162323 1331105 1247379 1292862 1381559
14624 1381559 1292769 1601716 1140344 1449438 1082252 1481244 1591558 1075631 1462689 1536523
14614 1536523 1332299 1440908 1508454 1819849 1595100 1660213 1462100 1215607 1260873 1402566
14604 1402566 1513158 1348386 1445138 1579701 1445890 1528871 1402945 1399430 1739165 1652047
14594 1652047 1867880 1661592 2042204 2071580 1934253 1370219 2025267 1988252 1846341 2169038
14584 2169038 1753395 1537736 1925853 1953871 2211019 1863755 2156605 2106321 2059403 1853388
14574 1853388 1783715 1782117 2071914 2365242 2215898 2138261 2524592 2048971 2341001 2513008
14564 2513008 2539713 2393905 2645288 2690934 2787441 2624699 2634964 3117559 2921690 3076387
14554 3076387 3718073 3940306 3927586 4583930 5836202 7081496 11347345 20247438 38401964
14545 38401964 45499569 22551115 12468491 5794536 3390983 2545243 2071916 2045911
14537 2045911 1951209 1867081 1989307 1777056 2116176 2032465 2002188 1996901 1950897 2100625 2116481
14526 2116481 2346078 2282520 2541478 2661259 2634894 2014621 2769313 2479355 2379150 2683548
14516 2683548 2844919 2492184 2498800 2590367 2613626 2572332 2376854 2878949 2946099 2736425
14506 2736425 2801582 3080642 3129061 2898380 2884744 3274781 3234137 3286495 3290088 2989269 3014227
14495 3014227 3255882 3096629 3250065 3359708 3465288 3376238 3221729 3459447 3405561 3557579
14485 3557579 3378915 3590212 3523284 3814864 3527722 3565660 4123471 3746609 4121586 3966716
14475 3966716 3871664 4080354 3953069 3941181 4084001 4051729 4349531 4355175 4122910 4279699
14465 4279699 4473369 4746617 4207719 4889890 4835364 4703722 4451956 4935138 4539289 5176593
14455 5176593 5034067 4948515 5260656 5200473 5255641 5245595 5421056 5528021 5453033 5611792
14445 5611792 5520393 5812576 5935708 6164641 6362214 6126557 5948866 6635923 6275498 6476337
14435 6476337 6206340 6651475 6493881 6625143 6988342 6771527 7072639 7410632 7141149
14426 7141149 7147188 7674651 7442297 7568609 7807121 7544365 7984957 8028594 8044850 7992095
14416 7992095 8665277 8364212 8750439 8555280 8826299 9111159 9093997 9293303 9148921 9500799
14406 9500799 9658601 9669534 10011975 10265133 10170232 10564067 10687464 10881867 11167790 11098619
14396 11098619 11410953 11273463 11549270 11900896 12138732 12374874 12488327 12928643 12737147
14387 12737147 13079272 13529155 13463360 13909714 13983056 14672578 14200248 14989250 15327084 15414173
14377 15414173 15835399 16177108 16138832 16839126 16739310 17403333 17875208 18210060 18311160 18981345
14367 18981345 19143817 19775639 19836700 20325474 20770666 21222177 21563487 22117340 22841416
14358 22841416 23062701 23542115 23965934 24771220 25579081 25728750 26167583 27159708 28043025
14349 28043025 28643035 29010565 30109875 30681291 31303236 32429279 33060197 34339954 34574755
14340 34574755 36009668 36648357 37992073 39092990 40231865 41177162 42602973 43835343
14332 43835343 45179292 46519733 48096222 49629003 50898998 52971160 54439032 56312349
14324 56312349 58125237 60017947 61946828 64399940 66574314 68721695 71420888 74014739
14316 74014739 76875702 79605040 82661493 86343235 89446499 93305368 96992739 101142009
14308 101142009 105015090 109554347 114546342 119541218 125160189 130828396 136569701 143184427
14300 143184427 150070720 156993295 164757160 172813696 181543946 190232218 199441306 209682146
14292 209682146 219899710 231145408 242731083 255017223 267609689 280877667 294423925
14285 294423925 308423303 323007872 337707819 352490377 367167916 381833073 395489265
14278 395489265 408818794 421631958 433100767 443099110 450923720 455350807 456840266
14271 456840266 456507590 455386545 455717939 449782267 445464548 440631899 432980811 423451410
14263 423451410 412348945 399665084 386242220 371945898 356531267 341452242 325986748
14256 325986748 310813942 296033682 282475352 269135641 256046606 243599179 231523968
14249 231523968 220231553 209637715 199384647 189601738 180690911 172391917 164400522
14242 164400522 157029824 149295735 142636092 136143264 130512109 125371497 119670864 114410856
14234 114410856 109459644 105142712 101205537 97563568 93770046 89662182 86299372 82778290
14226 82778290 79895251 77155503 73948822 71728582 69305604 66683378 64210791 62253057
14218 62253057 59852719 58280982 56228619 54455374 53093922 51817924 49804513 48494916
14210 48494916 46795413 45075457 43931206 43644987 42658553 40839111 39606151 38304874
14202 38304874 37634740 36564433 35865839 35070842 33806330 32636933 32414045 31371847 30730447
14193 30730447 30017819 29175407 28419316 27788490 27022646 26414906 25727885 24968953 24669351
14184 24669351 24275621 23737998 23112789 22505372 22185428 22104967 21000796 20893135 20250386
14175 20250386 19927521 19789890 19270276 18792518 18746841 18271377 17805553 17597749 17240089
14166 17240089 16657862 16347486 16187924 15660759 15529291 15246766 14891815 14900955 14777539 14153477
14156 14153477 13922170 14257827 13388597 13646072 13015206 13154470 12784047 12673657 12434959
14147 12434959 12137520 12219805 11715685 11375115 11519049 11088094 11193109 10713222 10660468 11070038
14137 11070038 10374439 10341776 10193921 10115433 9554019 9894387 9564271 9736956 9447998 9071462
14127 9071462 8926146 8582927 8937809 8721854 8742341 8670373 8253284 8220997 8055673 8188775
14117 8188775 8028431 7537539 7795949 7853003 7822287 7359554 7393543 7112734 7302892 6883546
14107 6883546 6747557 6679382 6904760 6961398 6630437 6382735 6338735 6684065 6413283 6326579
14097 6326579 6174362 6277428 6171874 6055294 5959039 5826646 5702254 6017183 5484928 5656613
14087 5656613 5270924 5662306 5833175 5464715 5689696 5242767 5487557 5374909 5351463 4877712
14077 4877712 5065550 5047177 4990992 5130727 5031590 5115441 4760785 4480565 4618416 4428502
14067 4428502 4560520 4505845 4407838 4561915 4414733 4246221 4654675 4090112 4461193 4253370
14057 4253370 4374485 4434926 4070604 4176976 4100492 3896320 3836773 3701553 3736748 4295562
14047 4295562 3643269 3616951 3488710 3818869 3739864 3568626 3355995 3800113 3435492 3204230
14037 3204230 3681888 3387211 3365060 3254942 3425975 3159988 3398749 2861239 3427127 3234694
14027 3234694 3374820 3372938 2915025 3147687 2971441 3125293 2705290 2964738 2792555 2683367
14017 2683367 2669583 2571795 2488032 2897366 2766483 2721133 2922167 2378244 2428087 2460146
14007 2460146 2560720 2355814 2589860 2139420 2494791 2352971 2225673 2037394 2750701
13998 2750701 2219760 2411856 1851312 2063867 2216705 2497632 2122403 2481934 2533158 3791483
13988 3791483 6205337 13712989 31465348 46358680 27275469 15016313 9128691 6341490
13980 6341490 5204527 4711057 4016642 3615072 3521294 3258612 3125560 3171298 3070814 2792199
13970 2792199 2910670 2399994 2567696 2682795 2512176 2655854 2190603 2628309 2116379
13961 2116379 2169046 2214310 2488839 2237014 2240265 2052144 2231010 2155275 1826474 2110868
13951 2110868 1907545 2093873 2328091 2333614 1665428 1670564 1843205 2137309 1660705 1673489
13941 1673489 1964237 1830646 1944762 2001493 1607430 2139870 1741963 1961478 1675248 1824633
13931 1824633 1721624 1869535 1892939 1788159 1900761 1771200 1730151 1798401 1755721 1518842
13921 1518842 1724925 1892266 1375135 1801072 1786121 1597721 1477537 1742890 1716721 1573848
13911 1573848 1663524 1442473 1855634 1756001 1221090 1432423 1476279 1547873 1438941 1464473
13901 1464473 1021636 1453687 1604414 1469087 1735455 1650938 1626792 1407403 1374131 1260224
13891 1260224 1409389 1358521 1576021 1784182 1745004 1048817 1263352 1319257 1432660 1386360
13881 1386360 1244773 1359925 1184869 1074555 976236 1210675 1427529 1575528 1561331 1359607
13871 1359607 1376870 1158459 992865 1298247 1592619 1305020 1349994 1359945 1243283 1003919
13861 1003919 941519 854165 1188894 1138411 1276578 1213897 1441023 1371852 1333251 1024574
13851 1024574 1330713 1268901 1135284 1076994 1196710 808902 1274581 1097761 1032283 1124492
13841 1124492 975369 1087085 1036970 1185938 1307805 1189648 898103 1240690 1004840 852628
13831 852628 1030047 1244005 1197281 1122643 1353390 1036612 974567 858450 646176 708560
13821 708560 751960 720355 931982 1085061 610166 780405 1004530 995147 931495 584507
13811 584507 879790 454925 964680 793257 1147398 1050501 1010965 917711 432714 845010
13801 845010 871487 869755 853759 847193 1196142 846941 784230 1056701 920792 771159 762251
13790 762251 856358 1071531 1085766 591986 894100 577370 873831 1039518 892837 905857
13780 905857 928790 892905 669129 725962 718639 485330 1020354 564963 625953 807950 876930
13769 876930 725848 767726 533898 929767 814954 596500 650393 1139669 885716 567172
13759 567172 531774 679285 907995 591634 661006 1016083 309737 1091390 709677 611624
13749 611624 464460 504980 538238 635286 712302 340139 691422 632432 559279 534821 782473
13738 782473 666012 734636 820163 911492 522162 607933 518564 548565 608408 569551 565380
13727 565380 721421 733707 590109 760358 411177 772799 708777 444799 514902 632387
13717 632387 689886 716010 530085 1081207 684997 669039 588756 696140 888214 693588
13707 693588 431433 644112 636410 505742 165902 674360 535896 774955 586514 568112
13697 568112 483258 590593 635499 575438 868090 957816 537827 487669 288900 654502
13687 654502 443170 504446 488592 726427 530322 697968 733791 550520 479888 598645
13677 598645 211114 543637 541826 749140 548143 446577 338945 741642 623800 459279
13667 459279 489952 593877 320339 510265 550500 315486 895188 510524 355328 497701
13657 497701 216625 517230 578178 464510 618382 366198 699490 653139 709445 412412
13647 412412 355201 336698 497146 781336 708197 391803 386919 346442 254975 170967 451103
13636 451103 317674 405625 567937 357315 535752 496160 285481 552573 385814 173398
13625 390745 373862 106691 361755 349455 207750 317214 177384 642458 246081 776091
13615 776091 319449 467963 423035 559845 253032 251806 673771 440505 733507 550579
13605 550579 217926 625839 345128 276522 349955 770784 73657 226418 307240 564301
13595 564301 173327 381969 471257 152963 663221 552858 332963 346824 531158 175917
13584 263786 340051 52105 261411 367248 534931 85898 321759 455320 631384 682568
13574 682568 236120 309177 198547 713439 238560 527059 521019 377856 386360 572726
13564 572726 131289 453101 425353 198439 395039 687101 656474 472353 277460 169112
13554 169112 41252 497143 282216 495856 539113 287800 156067 428878 337851 69728
13543 529486 507616 320700 35540 212986 323457 320004 576941 145847 524587 598420
13533 598420 30283 276396 429093 323397 120825 79670 382633 224148 567553 314272
13523 314272 60897 614050 447140 581223 349468 224876 197722 410723 329985 350452
13513 350452 52496 71221 572853 397814 398521 366178 146610 291694 504489 432877 174883
13501 369296 494025 324978 216592 183424 424268 491985 559797 431038 269239 149725
13491 149725 566624 566010 341565 281239 277824 490288 127931 290438 362769 350879 293139
13480 293139 164587 273700 129891 118993 244847 480956 78454 556990 364903 263874
13470 263874 191576 262925 8913 202904 -26230 11656 140924 152893 268342 329724 74067
13458 849787 281897 352215 414367 272454 128174 232823 192112 609974 97432 188474
13448 188474 382427 371384 521668 145298 449721 -221337 335302 115615 52340 243934
13438 243934 301386 253142 153985 652345 75637 130755 153377 522515 21987 137258 229616
13427 229616 138164 409998 114951 357215 389840 232402 146966 358554 174626 335736
13417 335736 -70663 69836 306116 244720 362360 177357 117652 274166 541031 393845
13407 393845 103380 175351 91763 490218 41611 162640 323445 561324 199146 304828
13397 304828 454902 236490 -113076 352059 106398 131103 581407 143798 -28246 447822
13386 180406 597494 276978 129111 122097 386943 356621 -19437 -75276 261085 291172 566851
13375 566851 406824 251975 614054 195291 78545 312893 189528 40989 393617 228922
13365 228922 538486 -20012 493482 162712 354604 137348 101530 286006 111073 123261
13355 123261 226310 483664 68175 412708 177884 220896 382407 168751 132056 644063
13345 644063 732930 244923 449501 540541 -36528 133455 422883 271436 -105982 520101
13334 75174 105389 332292 418978 331581 -36641 101081 242306 142498 158976 233214 327404
13323 327404 441936 446218 296938 60896 -17483 108866 543791 293216 -61559 30610 6783
13311 137025 296434 170571 287795 478984 264182 73059 61360 -113595 108317 -11520
13300 113317 476872 117103 -55952 355179 115709 -239821 91187 73133 -224904 284083
13289 356859 231493 131333 -155199 -177774 335380 189237 259392 204538 174667 240518
13279 240518 -12309 -22219 189458 201252 259053 103406 83980 341517 241802 361687 256500
13268 256500 270497 137019 -5469 344109 22546 183456 -297047 148677 -64718 213287
13257 243649 284395 111062 87770 -109637 95723 371826 406797 332251 198156 280144 95797
13245 176922 154452 187080 131090 21899 40190 201127 22349 11823 -103381 228853 -47962
13233 418954 52291 137289 251546 -76865 308522 71002 52503 -201352 323071 75622 41994
13222 41994 306830 948 364474 40923 98376 48271 195708 424062 -95835 304413 -60033
13210 -230367 -135572 96439 277470 113540 237765 58644 278809 67531 -16206 9273 198268
13199 198268 55930 118882 -140753 308416 166534 -307871 433541 274763 -119802 -87368
13189 -87368 133428 88454 163058 10504 372483 147223 67138 230968 582667 141389
13178 -194573 22458 253463 330591 178515 43965 -106065 182271 249120 183262 252977 263753
13167 263753 135203 -107186 169826 -74165 -50941 -56087 70390 294467 271575 119111 57711
13155 74870 54253 78098 -9181 175545 -532678 -136063 164352 305700 -13946 109386 309900
13144 309900 164936 273368 197026 36576 122453 267341 86088 -66496 375823 303917 -27678
13132 -205110 276244 214971 -368517 -8809 110612 253404 304981 -185617 206276 129969
13122 129969 128110 -40527 96977 -89691 64212 29324 84943 -54823 114618 49105 6170 -90326
13109 9605 -32581 62021 194244 189726 401969 113379 -70717 454102 378564 -182482 133205
13097 294594 314700 12345 308300 190620 340463 -144797 153423 268027 243322 58821
13086 -270814 233891 -192465 57253 68382 -116753 241712 211770 -27673 -138470 43987
13075 114891 52736 275191 118071 -73917 131913 138720 298698 -69670 358656 164935
13064 75775 376162 228770 -4407 126496 215693 206289 294125 -58125 -111138 25858 -8373 9128
13051 302298 200058 101769 286166 304217 -18579 128875 -14229 313776 -293916 -41919
13040 167413 133464 -48283 157051 348325 335125 -13066 -300107 201855 101711 174367
13030 174367 -54501 360125 139102 293414 271760 233444 330892 205418 -71401 218821
13019 105642 313648 46799 143960 4433 239196 -27070 -115835 -62865 422287 278755 249271
13008 249271 108444 -41150 234133 107483 124239 121092 176969 456960 378430 557656 182970
12996 -206447 -289094 151055 147199 308739 -166487 144753 278174 381599 133545 -56408
12985 -168351 96304 -52778 311542 54078 112389 35263 45361 463032 -241048 19460 -135490
12973 -90508 -355207 157338 -9569 234085 46931 -84824 338212 39289 120356 278109 163644
12962 163644 -108929 -130733 295602 -48037 -60002 219939 259796 212986 166623 135222 170104
12951 170104 127751 -6997 90181 172848 -109732 -210056 308648 -10802 349623 -47697 346480
12939 16236 -103341 123483 365730 -152309 -98010 -841 186138 190618 251687 -31347 178623
12927 -9745 156932 214702 201549 -48974 63014 -16444 -162993 11987 49040 -3591 -69511 37081
12914 52616 -44664 -447991 8214 -83715 -21683 12686 -5777 47902 -84980 -153716 -194455 -87679
12901 46081 -20633 146686 174732 -161858 -85918 5065 -45774 184124 176879 226607 67106
12889 -210166 75915 351471 95181 198184 71504 -102815 30748 -23192 75310 323717 271692
12878 271692 198897 23082 242679 190260 95925 282664 -209357 137440 291735 118866
12867 307050 165375 250252 231342 -1549 -106477 4720 351224 42516 134573 -55211 39921
12855 225624 -84974 -14 -16192 65390 -101882 -78207 94536 242544 85378 20437 179843
12844 179843 -17924 196968 156056 91738 337755 -221542 148262 78579 -218675 297222
12833 177497 744 -85103 -81921 123242 -19291 -341761 -30271 -81108 -37040 -206236 319449
12821 157092 270169 -11169 158495 31347 165540 114553 -104595 91728 443846 -135721
12810 -109310 131665 -27441 -326500 -29583 93692 62981 45747 100682 156404 49067 325206
12799 325206 -141845 164324 39772 33122 158305 61155 -15211 279157 -249811 86197 -55394
12787 71540 201157 109490 -341495 83639 177051 120902 14751 -150944 145746 -225716 -323037
12776 -323037 -149023 -143480 60840 275384 190512 -146974 -252937 -43025 81417 79266 94376
12765 94376 -234998 210602 247267 -32564 134302 60991 -165894 277446 28357 -67040 171718
12753 -31435 -82521 -294856 161950 6550 -133129 311868 10464 -4501 320995 -21190 69244
12741 207540 -334393 244019 81691 -61455 84277 181048 334975 305747 -109039 359098
12730 161651 -18447 126151 77726 229668 -174961 173520 98322 -86210 -46362 -7968 -23308
12719 -23308 -84308 85561 245809 -5144 425426 212471 353819 96703 -504954 194133 -63247
12707 361464 -98657 266643 95359 296565 -44244 214494 141102 348524 -9825 -77445 -107579
12696 -107579 285861 155717 -11084 44246 46774 121232 15059 72528 -214985 32049 314459
12685 314459 19207 -156006 42425 -40133 -48304 -58770 8999 217098 184600 76527 41148
12674 41148 65845 171433 552763 95824 96478 -408812 200911 -71534 214648 246854 -177180
12662 -53597 118198 63431 95096 227630 152576 106770 98065 12972 272440 -148109 278936
12650 -130961 158025 -22789 338868 297010 35534 354463 -136496 280742 114798 146696
12640 146696 45997 88360 22044 198344 -23859 148408 -16571 -64410 467622 68171 358900
12629 358900 431475 263975 143689 389862 469114 317901 205241 -25716 28393 632535
12619 632535 -123447 -97392 107149 284615 -141291 15628 -166452 355818 -24417 102174
12608 -156571 160597 227887 42601 -14737 -15807 340667 82029 445820 279164 180022 191171
12597 191171 -52258 -17540 -13543 -70630 236859 173026 -6919 -39354 157370 431295 294482
12586 294482 -53189 152204 -1177 -109164 -67750 -19811 -2258 -103418 32408 8874 108722
12575 108722 -217179 -72662 -57247 246960 36023 125091 302378 -144882 -17222 302312
12564 -57917 42594 -180005 638 290937 -191736 -82537 -194552 1724 8977 171276 5447 194360
12552 194360 18238 83850 187620 112273 176903 422500 30682 88903 29533 130949 -133626
12540 116339 167592 -85076 273038 8935 135937 -126837 179088 -166889 47999 -166974
12529 -71690 22511 228322 99901 35561 257452 32234 275759 -67782 226178 -43881 -23584
12518 -23584 -44735 258239 40013 103217 -149505 -56959 203338 202447 -126984 -250360 234683
12506 -75860 100560 -38071 37158 41484 428060 243018 -284551 -276073 -162297 111762 63825
12495 63825 121430 -44299 121508 -80802 273612 175189 -95893 110110 -10284 -27878 15217
12483 -18770 187262 -183874 203641 -210169 -36936 461678 9038 18792 -143099 -144170 -121445
12472 -121445 46962 261945 -15957 91236 -62999 -21852 -279568 -66717 -304623 -194066 -219015
12461 -219015 276848 116245 -186691 -17426 288772 145572 318461 -92957 -120556 43113
12450 414105 -301888 -117561 110973 191445 28996 -54767 -12694 88141 -17407 -104767 35361
12438 -153764 10677 -63007 -213998 -101580 335043 397639 -426573 -303204 -91799 -236977
12428 -236977 -48569 84479 72462 161488 287438 -182843 153539 -51412 152261 198443 -26636
12416 -3745 107743 -38544 63983 121450 184339 219976 234059 -1497 -52309 -38574 -178063 178838
12403 272449 257777 10901 157908 -125533 122780 15185 165706 86227 96045 -181002 155224
12391 -99600 -53617 78715 274379 221625 -201020 -110667 -19935 -138145 -90120 -2059 21955
12379 -163042 173175 -46358 104620 -104654 323530 -313542 77776 -37396 -20343 -235593
12369 -235593 -199959 -68473 302348 -142021 -50377 -447 -126899 -54331 142016 -79503 -29924
12357 185930 41312 -127996 298624 -10662 127883 -163192 147869 217687 41203 369808
12347 369808 275927 -193606 190981 -100582 -194763 -8641 -126419 409662 -51483 112414
12336 275397 64460 -15718 264176 183940 -216439 -138231 97379 -283578 28588 101479 -97026
12324 156503 160492 -136188 -142424 377665 -95741 -225442 -335391 -167322 -232903 -191179 3234
12312 82217 -110836 36489 44217 -58670 -111538 155894 316387 51568 -200439 15 -92706 169484
12299 77620 -107812 44484 108748 -17181 188458 16491 -22860 87292 -13411 214299 4902
12287 248804 184073 197709 -155000 162482 166091 -9391 2791 53319 323788 -117728 13929
12275 -34121 -142032 103073 -31622 118047 245768 108763 -6113 -84259 252587 220010 69629
12263 450182 126466 -5563 14611 -22965 -206272 133108 235981 240658 235462 425740 208638
12251 261319 -105240 464150 148974 -133611 -209613 60568 -39980 -56583 -139254 44656 128324
12240 128324 30421 -131434 180016 -12999 56855 575235 119558 436253 6717 112549
12230 112549 418739 359531 -112381 248291 -181746 552892 -45451 79215 178964 -43943
12219 278606 522172 13800 502756 430671 165837 105500 119185 261326 -274674 -41810
12208 26461 48958 303924 535886 356271 309834 270887 199143 444106 3929 96367 190166
12197 190166 -30611 220168 348331 119920 71271 352388 -51322 39874 24479 -51685 541166
12185 304984 420963 274452 331186 38911 227077 -45321 171758 335404 -189628 21072
12174 -136572 228687 -69296 116657 171586 111730 493409 153985 136495 203181 54185 101895
12163 101895 203776 -109878 -24608 -269928 -52577 126646 -86018 64387 -114254 27272
12152 -191350 249065 52004 -262129 231133 207836 -21120 250185 78080 52273 -104084
12141 42858 165074 -102969 -239333 148 150734 42330 107709 -290827 189292 34916 -195789
12129 71063 237032 66293 51254 -55151 -138993 174099 -24726 70847 -54661 -123488 426850
12117 146327 269098 100538 -24662 75873 110909 -225213 190494 -11292 -34294 82976 -47003
12105 -306292 -165671 201378 -13306 98025 139055 65297 153494 -175911 99978 160722 116073
12094 116073 62114 -249115 173844 231219 59417 -48387 -316205 -267778 129813 -223592
12083 -198439 -309199 -83227 155007 164483 -34503 47449 165143 -328597 -218149 -59342 -145956
12072 -145956 6665 -61535 -266543 200531 -233633 243589 -12479 356968 321694 121562
12061 653705 1523007 1763531 531194 -89781 179435 178051 95393 8297 -660 315808 250802
12050 250802 -71328 -152139 -220745 365014 -29467 40963 -320871 25051 -87356 52763 322640
12039 322640 312656 -153392 92544 -363748 -45037 183721 -152640 91163 127602 -99019 161612
12027 154842 50713 -145569 -275954 -173945 126727 133095 -20447 5147 -161364 -217492 182113
12015 322406 -228551 6814 -32814 -32928 37704 -65247 -112892 59105 -51370 418533 -25867 138912
12002 28121 251646 255019 77014 -109033 195986 -3972 235972 -139403 -140954 204267 -255724
11990 10431 -412378 -280425 -378468 17948 218611 165280 -18149 -242082 -35810 111087 40765
11978 34990 -105497 105774 -299973 -133879 127007 -84552 81009 13890 13996 48756 -63969
11966 161287 42273 -240453 55146 -26576 -50540 -162292 58557 279404 116810 -167216
11955 184536 -40450 -154324 -74704 -105879 -28367 207194 77259 -21856 368368 323400 50581
11943 229816 -304149 341874 -39377 -116917 -119579 44747 -358103 49996 148418 -15476 -136252
11932 -136252 -59230 -159196 -135928 125077 -102208 47790 -285 -75620 -116847 152633 -18610
11920 -356333 70455 -86547 -300409 260050 293522 -76167 107481 -42193 197128 -171766
11909 -161496 119710 107929 -50764 -104913 86460 150521 -298848 46345 -43522 -171887 16340
11897 417930 -76471 -27210 -35962 -53202 -182329 -121420 -48254 192303 9743 -90663 -79592
11886 -79592 210376 -340647 104935 172634 -257443 -30670 -236765 79569 284396 235045
11876 235045 59576 -19564 -45453 62241 235688 -473963 -84480 -99644 42975 -275385 82394
11864 192791 -3109 -79416 7850 -65876 -254253 -15325 220974 122950 -536000 101875 -11160
11852 -206380 169158 113524 3534 -293050 68007 292679 15003 256395 63274 -128961 -87639
11841 -87639 143506 -70376 -54664 160234 288989 20717 -54076 -17066 -160487 -371759 -12649
11829 -145760 -143024 -126125 -158255 -28843 -20270 -35377 -282871 211340 -380306 54352 -82946
11817 235384 -46050 61960 -57249 -157548 363880 15437 262033 182166 -27862 -185428 -67500
11805 -100428 -150332 -98684 -249769 -5496 210727 -208687 -168122 -10857 -44915 -149947 184133
11793 37268 -21556 179881 171031 403934 -44061 -85386 77077 90062 44628 -16541 54986
11781 -145008 78903 184918 -269894 17859 -63213 275235 151109 211762 33200 63389 -41453
11769 -124028 9086 222598 139935 -74078 8133 -197686 -210584 73186 -199172 -412684 -13640
11757 128558 -53329 -206404 45562 32796 391227 207484 65911 -5575 -102348 135873 -72143
11745 -237223 -140193 -211286 -55113 214639 -302863 -33455 67203 -21477 432540 -10045 -260909
11734 -260909 -323052 -142048 -41393 40458 -91039 80330 -106791 35602 206188 22027 -93244
11722 48238 72848 8416 -125996 166517 104167 154771 -303139 338143 581633 96149 382609
11711 382609 -39950 32807 263858 -46930 276235 -147268 88832 -105504 329589 233748
11701 233748 149993 239956 128637 454788 -43195 15350 -69981 -167517 47392 123022 1376
11689 -82517 -70574 10089 -131561 82550 360348 69076 -36797 158716 111589 36268 -42409
11677 108648 68806 180681 -161762 -43853 -275544 354599 7660 -120106 100238 87072
11667 87072 233086 30675 208366 64883 159244 -130131 628772 196334 -45169 -34657 100410
11655 -41394 -131533 236827 158982 184939 -245674 -102380 -74352 71568 54784 150226 127521
11644 127521 -146246 -109209 98574 16118 -63965 -180030 -105402 -208202 208339 -165953
11633 -40672 -17327 23592 197873 95800 142340 6480 276773 -34662 -6639 -176123 -177670 -253228
11621 -253228 -235514 -23133 -102185 -380774 -15040 -116496 182566 75397 200216 18115 -65016
11609 222309 -374122 201598 118789 317542 147598 -73020 20117 -315205 312024 -99177
11598 3703 163683 193916 194554 275132 199324 -7838 349262 -21423 63655 220866 236619 153777
11586 153777 171753 317886 131647 148639 381971 401171 -36186 -45910 -18912 33404 41334
11575 41334 328029 -206723 288648 125908 152859 145681 67156 148054 298944 -106590 258476
11563 36961 -292328 -11048 -74708 -166888 -73938 -63815 70952 17829 -190735 -249399 117753
11551 275576 124050 140917 122611 38188 -179232 -10687 175968 126362 111224 9918 253661
11540 253661 38256 81764 25105 -292776 -102207 115728 363339 120490 58175 329148
11530 329148 -131901 301149 -228406 -123721 92577 -107321 -97535 48509 313314 -101792
11519 67025 79794 227563 -38771 -263354 506264 78591 320423 161019 104677 412311
11509 412311 7356 169761 167353 286178 483191 275199 136421 304622 246546 -205257
11498 221813 522846 46156 262643 299324 92335 137890 137931 64628 199531 18986 249725
11487 249725 364596 532097 131867 23009 43212 296032 -108668 450004 59511 61008
11477 61008 209200 338763 213790 -138174 375964 155494 180718 -50726 111640 196800
11467 196800 216202 525652 153912 -111668 -261688 157613 116197 150218 86198 311490
11457 311490 -43961 -2003 66599 -180364 -45637 -32579 476734 82424 41256 -2738 -72278
11446 -72278 53905 237909 51851 -176195 223230 -254009 102481 206535 305904 -498524
11435 -93706 402149 -185108 -137752 70466 6352 155880 34305 50824 290290 58893 164432
11424 164432 84589 63077 231806 207714 145278 -111827 -98485 -137821 -94480 128356 14831
11412 20406 62123 -156220 147343 -113108 13216 -247030 316120 -263868 121519 -89673
11401 113438 -362718 205713 284265 60681 178664 -58967 174766 -17248 -170244 47009
11390 16785 199833 23656 -37870 -148859 113010 -180927 -107440 -87586 -102668 189926 200505
11379 200505 -80523 169037 -330591 -32637 -23505 133447 -22993 -267199 109384 106217 -43045
11367 301483 223045 -128677 87829 -281973 133446 101874 4186 -53605 99934 96511 230517
11356 230517 -3029 -267278 -26199 -163271 65862 -45684 -461850 83396 140102 7798 194751
11345 194751 98170 18938 70383 159318 -243310 -115711 -42146 -48664 -16191 -282684 131857
11333 19475 135670 -113429 -23126 -344795 18243 66845 152854 -304921 136379 104108 -92891
11321 21019 -167654 315094 -51138 281714 -131194 -19694 -56113 247503 74244 -108848
11310 -86560 -130520 -217644 27111 241400 116296 57747 109570 159374 180449 211532 200995
11299 200995 106485 30663 91240 -16472 96497 141830 -432127 108089 -13452 47844 -174459
11287 -282264 -10995 5627 -170907 -52620 -322803 183830 222373 19841 145200 -54413 70605
11275 -60245 -126544 136199 202116 89636 -41209 -170732 229848 -182287 -243525 -127875 -262764
11264 -262764 -183864 413786 -147278 114777 266518 79273 -99201 45528 158640 -7987 -193013
11253 -193013 -86015 -176593 -254874 66017 229465 49435 74518 104218 255215 147365 227264
11242 227264 -266683 112800 -54278 -196115 90583 -74567 -202428 191196 178373 -139943
11231 -54061 -49977 -98780 3182 -158906 -159779 -253356 -351851 -14524 181117 -248456 -100650 -455264
11219 -455264 134010 99991 430565 181707 -22353 -2098 90664 288615 -145432 73187 -133853
11207 -81311 155626 34931 -76323 -76392 204728 -21206 17184 22031 106526 -115173 -106637 61298
11194 -185439 -93835 -341239 -368557 -5950 385589 225340 74328 349580 -306486 237001
11183 -60785 -39969 -77867 414871 -114160 -207291 5808 -259754 -286383 -43456 -520881 -215198
11171 -171206 128914 -120680 -23600 214080 -125478 27759 -98215 -394799 -110405 -29489
11160 -19268 299672 -68332 144907 -87454 -143075 -47558 46247 283378 51366 -178361 -5943
11148 -111887 -15045 -38057 10285 -165134 -228390 253189 75434 -82658 -197629 4244 -176658
11136 49322 96706 26708 -165210 242210 -27442 31006 209191 -16512 273019 158199 212922
11125 212922 291619 291653 106095 181014 -211173 -191536 -217037 -53942 -182798 59755 59641 -135694
11112 -126777 266199 -100277 128238 -204049 -53452 210508 365208 306440 102945 274355
11102 274355 256102 242490 170860 90270 109488 -159305 107873 985 159845 193844 550 6300
11090 6300 419751 408401 44547 452227 285905 398041 346448 347379 4719 118062 47003
11078 231464 56109 119834 49285 263162 207146 218668 11833 212861 95159 525525 468612
11067 468612 396177 467323 342782 280481 425773 8394 414517 515422 282551 353373 793725
11056 793725 615693 599352 649982 762738 465420 1002930 995848 409890 828336 769809
11046 769809 836591 501154 710182 800869 616448 728724 809538 790549 640696 734789
11036 734789 754433 888130 706055 971846 661852 328771 823411 812552 857243 950417
11026 950417 836735 736600 819617 874385 735713 832193 1055464 243246 604769 656400
11016 656400 834975 596016 548928 551842 803180 857025 564333 494471 560909 794846 534443
11005 534443 467435 568400 645278 797812 694034 686127 768195 582138 700756 519910
10995 519910 807847 567729 732668 813101 652478 667658 626521 718261 766427 624956
10985 624956 981639 757964 1207876 1209134 1422257 1584132 1320914 1547386 1533305 1677902
10975 1677902 2126822 2402495 2743557 2601840 3077452 2914008 2857586 2722901 2565554 2708198
10965 2708198 2106195 2149773 2189202 1737072 2417677 1799488 1833027 2184330 2004513 2140888
10955 2140888 1970829 1715954 1433661 1517033 1016317 868222 673256 558810 456252 95038
10944 537628 260216 248979 439106 -8696 333407 102356 312735 232250 142075 554301
10934 554301 55354 346205 169920 298054 107239 337434 -41812 252480 147223 -21244
10923 -4157 101578 -74620 12609 -13616 167048 145613 21704 -159489 196853 197639 -42283
10911 215167 19148 77824 81147 43166 -90022 517398 -215703 35928 157225 392249 -308853
10899 -89711 477653 -96061 -9511 -74198 -216155 -108772 226515 10135 -64825 91679 -10680
10887 121439 -127942 283339 57968 60849 71661 48272 -94726 -62366 -197127 -13808 -56314
10876 -56314 263847 -86391 38657 244802 266922 77206 -113001 -182503 125845 -181116 156582
10864 103243 24251 -140263 114986 77758 31581 149771 180726 -37690 -364423 -142541
10853 41966 -68720 28166 -103876 -55653 81212 -166896 -242663 -11566 176046 16282 231689
10842 231689 -266258 375882 -310657 -36367 -234710 17092 -23041 -176589 -50091 -61889
10832 -61889 85315 10361 -308741 -211147 -18488 22046 -62166 -67637 -341750 81642 -242632
10820 120981 -235798 9574 21578 183153 -72206 145515 -88871 -36341 -288076 63545 -63536
10808 -105494 325825 -296897 -122766 81569 -340150 -54731 -93453 -135406 -74470 47608 -72234
10796 51989 -7847 -150964 45165 364724 -279801 69811 -30933 -63760 -27080 -198887 118570
10784 -78687 -402217 -348686 -107082 40362 -110640 -144864 96296 191281 -39091 -101484 -114706
10773 -114706 45404 18135 -155666 -114697 186403 75756 139146 -180292 32304 -24440 -137046
10762 -137046 262644 -132894 -116207 -132648 229282 -247950 -212414 104383 -56839 -170644
10752 -170644 -67 37706 -84185 -191033 -156345 -257899 102607 -196457 -119410 388559 60299
10740 -160929 178895 131517 63230 348796 -236242 -58577 66324 -60914 -2039 -142261 -107989
10729 -107989 -135524 133274 -129086 -185176 -301378 -290205 60953 148350 78926 -152602 201114
10717 -38109 338615 -23539 -220704 49729 18165 -340661 -83181 -173205 236215 270139 259284
10706 259284 -76207 65658 -209305 138809 -157100 -197827 -273016 155198 154786 352142 -160096
10694 73177 128721 213152 -14356 -157583 -173465 -69736 -144229 44294 105113 133507 46028
10682 -69577 -18414 -260537 -215618 -256531 -32210 -63657 -187126 -43715 -42921 84548 134052 100525
10670 100525 160144 42649 -37804 -355760 16220 -113462 -5286 100415 124217 178675 148750
10659 148750 -80740 90043 -141315 -504325 79437 -366621 -103856 -236759 -314969 -113435
10648 29615 -16954 -11484 166556 245411 -9539 -98837 37049 -276519 -147596 -47999 13109
10636 147547 -163505 -162274 177655 -12193 -347674 75896 -95361 134504 197757 -307687 -184178
10625 -184178 23800 320169 29015 201231 375846 75581 -139348 -143007 -6378 -9951 -3667
10613 67108 393994 14856 87369 24131 241820 -16362 -80186 205071 -26321 -145075 185059
10601 -53516 -36085 -50845 -161857 -189995 270812 65396 281471 -56087 -83254 -121445 113835
10589 -209471 -53699 191706 -91677 -208604 -9362 175648 -229033 355655 -39473 193889
10578 -315675 -219753 -136741 54103 -267084 -33410 -108913 -134159 42304 41860 -94746 207450
10566 27224 -12489 -339121 -163546 33106 273450 -144348 -113532 -84594 249356 -65664 -32641
10554 -40350 -136459 -295650 214319 73629 249034 36080 149511 -277028 -80607 14212 -73844
10542 28191 -31219 -7018 11312 -74571 -60352 -51525 -73919 -116259 -305432 -24336 -204734 -103583
10530 -103583 45585 190066 177890 -24358 148074 95892 13066 164175 -72605 -117334 -107398
10519 -107398 341997 -237274 -77185 -132738 130738 -97592 173222 47105 94503 -215094
10508 -448588 -155775 43945 -165350 22826 7706 467038 242839 -275729 -11366 -80127 -305132
10497 -305132 -135894 -82139 51184 24761 238743 140002 -49424 267967 -121177 -204382 150797
10485 -29918 -173409 263663 172834 -115122 496416 697492 468116 19988 175523 210118
10475 210118 9694 -100909 157202 -326466 44572 27735 -53177 -265759 -89186 246088 188818
10464 188818 232939 140609 -80600 -220011 -81497 144545 -48770 57832 -324929 -133814 -192477
10453 -192477 85712 215830 -128747 -82038 -376557 -165435 -546035 388521 200689 -61953
10442 -97324 -195211 -18988 324845 279030 67144 -130760 -112490 -95902 -368293 -142186 -52163
10430 -70579 -10672 78304 158111 159459 -171374 -146817 60109 -373822 170456 -211362 -32221
10418 351568 242268 355783 -128102 -165245 -302245 3934 104599 17545 -45299 86860 -130251
10406 -229181 -142339 -85109 -146863 -89714 124650 -93479 180874 -208423 98916 151761 248766
10395 248766 243158 -72657 -17602 62495 -212680 7551 104060 133492 218737 4736 200949 -109398
10382 47074 202105 175979 324373 -21661 86022 -155809 193734 349765 289842 198628 115233
10371 115233 174905 485949 282370 378370 65680 571537 524016 448787 175309 323832
10361 323832 192447 167819 475283 143352 123525 338149 -123916 72380 458617 168532
10350 434662 733226 613642 675700 244099 367118 299925 -32262 342609 272708 152228
10340 152228 327166 307111 324840 -55499 267187 358024 136258 113308 320319 131612
10329 82601 275905 -156506 139507 -88166 -165333 112410 369189 226775 418723 245630
10319 245630 333946 6987 8790 303092 82979 51870 213084 -135837 304965 -53316 86002
10307 -73602 194902 -314406 179751 357042 -219129 30725 90521 -3116 551335 -212990
10296 260746 477797 -171212 138074 -60406 48660 22981 17553 49165 41063 -253135 68278
10284 -108766 -80473 -137697 -42639 275370 -255335 255621 308229 -189238 148711 140625 -55681
10272 -51758 -182920 -113162 -218708 -171689 -224697 -182930 -34354 -128281 104204 372443 -77190
10260 458126 288881 147276 245638 490898 240482 318554 319060 124536 24214 -21205 123251
10248 35875 -307751 84301 12209 -270655 51532 -98219 -33962 -43639 -109539 -395158 67627
10236 -94085 111272 27573 -150200 177119 91178 -219847 -100662 -91883 -22775 -175147 218730
10224 68424 55672 -284046 -173485 87038 -66836 226460 275692 198019 -209636 -142358 -281086
10213 -281086 -16065 104664 50609 63274 -165314 -110206 151298 474241 18007 -88043 5652
10201 -369317 -334394 -177311 -101059 -152853 -58023 -287320 -253170 31316 99225 81639 -393348
10189 -30943 90977 -154735 -288928 -83085 -164469 106709 -250657 93185 -236828 -191627 -148381
10178 -148381 -56987 -145763 146549 -162558 14856 -20414 -182781 64194 -64394 73909 101025
10167 101025 -133543 -208340 -174920 -7962 -48581 -99115 -105838 172572 -81477 257871 -199897
10155 80188 -19192 159159 -33019 -494124 -201541 31219 97020 86414 -122701 -19929 -228777
10144 -228777 -132097 -85612 -38384 -11095 241372 28984 151792 -9090 -168315 -274505 -130609
10132 -22151 47587 -3372 -189087 141986 -226416 -249393 -145742 -74221 90253 -161572 -35121
10120 105219 -78700 312489 41324 -211213 -68050 63942 141447 -19924 -127879 166346 158601
10109 158601 -204114 -49766 -281523 -316350 -322356 46167 -258555 -192879 56336 -39008 87012
10097 -172260 15768 -179631 -123802 -152254 -78748 248582 -186705 -69111 -47273 4295 101220
10086 101220 -133515 -133504 -198239 245931 -65184 -55472 128901 -231250 5193 -85012 10643 -398212
10073 -327578 181279 358877 -69476 226090 -289179 28569 -83184 -367678 -52092 283853
10062 -52243 31235 -195127 -90441 -301605 194751 205924 -22093 -22041 -192125 -342224 82716
10050 140130 332720 27174 -16681 85509 51800 -12140 161942 156341 -112311 13949 -41071
10038 -256863 -118216 -124994 -72356 -228874 -192265 248560 122843 182206 -278084 127168
10027 -28169 -75543 -13671 -203885 70011 -109267 168968 -194391 -287957 -257747 -70050 -92382
10016 -92382 44308 131765 22360 214146 -413999 70409 -163211 -289363 -285581 -117817 -92064
10005 -92064 201987 -18338 31743 76805 -365610 8561 -29134 -35463 -217104 -5134 -76420 219244
9992 -84973 -49549 -112692 45074 -55890 -171956 73472 -17591 35413 287187 91410 145228
9981 145228 30718 -139375 -180057 63044 14912 -155588 -206559 -114970 84487 -169181 -64119
9969 200852 -94911 13818 -473747 -47618 -164064 -149640 776 2394 14315 250927 -314182
9957 -71742 -102843 134995 -74361 28816 -53821 -531344 -105823 74685 8877 35527 23160
9946 23160 -140953 -3812 -324218 115436 -61683 195682 -210679 -268356 -48726 -57244 -101430
9935 -101430 -231566 392571 -273581 -2445 -481214 -255739 -228209 -100020 233511 208863
9925 208863 -152684 229953 -258169 -3666 -331612 -41156 -298616 -330620 -356475 -112675 -231895
9914 -231895 -157323 34217 40850 53336 -60250 -104209 -104642 -145472 69666 27032 -238007 -381339
9902 -381339 -16944 112446 -190105 -45867 -36383 261294 111580 -182422 84316 -409257 8455
9890 -260957 -38409 -38188 -120148 292132 88132 -232064 -92665 -329817 -157902 -209633 -143885
9879 -143885 -74958 60534 62407 -81640 -202739 96984 -420317 -91609 -175650 115639 -8644
9867 -30026 -326273 -43220 148385 315260 -399587 -25912 -64670 -236969 -54808 -95625 -12061
9855 -232791 -37849 100997 18851 90922 79166 184228 -76001 139361 306600 -16154 -261614
9844 -261614 -15718 70561 132607 199061 -78620 5711 34285 61611 222962 -107456 -43606
9832 -106668 122979 -21686 50504 -327245 137589 -235793 -129938 -371735 -246919 -255475
9822 -255475 -135648 -390034 -329448 -185708 39271 42091 158487 -282169 -113869 184376
9811 -4632 -106657 5748 -56317 212403 -240013 -85887 -220303 -261579 -99205 -134819 115083
9799 137530 18784 31193 -304722 3545 89756 -205810 120201 -178519 -421550 -313235 -159106
9788 -159106 -57269 -279701 -50680 -223396 -92086 -233748 145959 -117451 -227595 -79805
9777 -340256 33291 -3122 143205 -23424 57973 33542 -60801 73763 166460 7609 155752 157582
9765 157582 -19852 -194235 -251006 -415546 -251515 153854 -265839 -79139 -311912 -314888 55783
9753 248540 103063 -302394 -74000 -322372 286040 -55722 80232 17703 285689 56692 -236161
9741 -115589 -74649 -316543 -248053 -128363 -144908 213847 -255521 168196 42905 225140
9731 225140 -105124 -41025 101235 -222445 -26843 166539 -105794 -24768 114307 -243407
9720 73590 -112079 -53207 15212 -147819 -16337 -151847 -55204 118047 1496 -187489 -184038
9709 -184038 -124850 138518 -51165 -434641 -223840 75136 -599000 298483 177649 42998
9698 -84426 -102798 117090 -60258 -201588 -54524 -557919 82021 141221 -165678 67731 -44302
9686 -212268 -188927 -75029 126225 -179399 -21572 -70592 -393815 -24010 -99037 -62605 1944
9674 41775 -319999 -180275 -225517 88536 -15968 -425920 -61316 -290257 234706 -9245 139417
9662 -263426 -136941 11435 -61599 372328 38151 57388 141410 -12532 21775 67556 -61355
9650 -169300 -45672 -176428 291749 -215292 -165367 190796 38357 -209994 -180760 171342
9639 -25894 171383 -304600 -385180 -6733 -484093 -204881 52051 21423 194115 -180327 -171481
9628 -171481 -28626 -41271 -306372 18553 -74361 -306655 -235047 -101679 -181678 -115970 115067
9616 19738 -16292 -159505 139371 251623 -161042 -255130 253166 -173169 -17848 -82085 103957
9604 -145331 -14057 -236563 -80526 -64962 -331724 -121574 34628 -114892 -122659 -30235 -62843
9593 -62843 157696 -19466 -322406 33803 181024 -175492 55667 -117505 -57987 220797 152608
9582 152608 1736 53630 88691 -144535 -77575 -89085 -76690 -965 -42993 -128780 -210672 -180331
9570 -180331 -157839 44917 -31050 338174 78305 -243814 116835 -262457 -74110 64541 -92203
9558 25594 186630 -93445 -195928 87687 106692 68943 123683 -147734 79191 -361972 -62380
9546 26069 78251 -374271 56617 -121838 110863 93182 86142 -38454 -76748 -110350 -98445
9535 -98445 -108452 -158084 -114851 20710 -115044 41395 -10762 -19869 114996 -253440 32593
9523 229431 -66599 156369 -194365 -213281 -93795 -279090 -219410 138666 -36484 -35667 15240
9511 -246588 -140816 -356887 -409843 -372915 652 -178010 -123632 -281014 116531 8915 -396518
9499 8307 -457749 -56082 -15872 -296562 -121263 -294018 -436315 -133326 -52283 -58689 160475
9487 -113717 303539 154765 49319 44911 -171993 -322172 -325449 -232697 41164 46415 -44284
9475 -334081 128229 268829 94526 11361 -14923 239825 -268763 231716 -214446 -88024
9464 -257301 -279555 161177 -73368 -177407 258257 -20269 269898 -158390 -295959 -81466
9453 -87673 -172464 -215475 95241 58839 182356 -67017 46651 -94864 171341 22743 -223296
9441 -10089 147431 -11108 -114564 -178411 205503 -278103 -17304 241976 33890 -306632 -71686
9429 -106998 -146493 157163 -427827 -164071 199058 111229 66254 132907 -122220 -150988 -109768
9418 -109768 106012 -26243 88954 179613 113804 86709 -28607 -216995 -252571 103378 -142173
9406 -3320 -62499 -419002 -49718 -172092 -44910 141679 -113638 -113543 -324638 180283 126412
9395 126412 -221503 -330380 140739 -79031 -64540 122413 -8824 69424 -88153 243454 105779
9383 152395 -26618 -186642 -330072 113760 -135563 -5181 -59787 269070 -115377 -78815 -186100
9372 -186100 -85502 -271752 -328128 11189 -53484 -143209 281027 163938 58059 174018 -136177
9360 -408388 41991 -141916 -97050 -419384 -218731 -80368 125862 258172 -277504 -13800
9349 175459 108014 -69070 -52744 -162248 -22885 171531 -256777 -147861 -229626 62239 33683
9338 33683 37071 44501 -42855 -106352 -175510 -356866 -190540 -135487 -68069 -164683 -36085 184020
9325 -77314 77155 -358153 -282534 -159009 -80843 12328 111652 95600 6774 -1486 -31764 -209645
9313 -209645 264971 -69991 -320374 2838 29440 -54071 -374215 86011 44891 104426 -216431
9301 -22738 60624 -295069 -43871 86799 32746 -200088 -191950 19490 -526100 122182 48888
9289 -20520 78575 9593 -295858 -190936 56233 -25594 93798 -10580 -342982 -64815 164352
9277 310194 -436440 -111757 4491 74290 -136404 -126417 -400917 -199045 286145 -53435 -19335
9265 163717 59015 -151274 273893 -17615 -293141 -210603 -140441 -17457 -41660 144669 -11922
9253 -381195 -34696 16409 -332506 -87714 -125815 -110850 -36327 58678 175387 25146 23920
9242 23920 33653 -200267 -147498 -295431 -73777 -110195 -41245 165121 177182 218529 -198969
9230 30019 -14637 -70055 34838 26751 -10408 167358 4283 131041 -193600 -86764 -193404
9219 -193404 -315072 262406 -22000 -123895 149682 -336229 -67885 59514 137382 -183255
9208 -400480 -54891 348294 -150035 -52592 48621 -155279 -198545 -105808 -292526 73506 -125478
9196 -118886 -110498 -55100 26868 -68430 -90616 -84851 132619 56805 166031 -15788 -55564 -68470
9184 -68470 -67263 -239819 -268305 -109654 46522 187216 -223809 98494 13014 378046 -252991
9172 18613 170868 73431 -108969 -199956 -134497 -2054 60996 109977 -79185 -69193 101539 104290
9160 104290 -150456 66998 77513 -73090 -314870 -419684 -46242 41246 45442 113891 6520
9148 -25914 -191004 -115571 -242927 -181183 -32351 160857 -127941 -206215 26814 124000 100008
9137 100008 133931 19141 -179351 -100234 113588 -62366 -268159 -171992 -49172 -147771 5926
9125 -86965 -126151 32190 -152097 163612 253340 -287771 -162498 127783 -89079 -347708 -42489
9113 59848 239355 234937 234058 -157565 235897 -59136 303674 -327441 4139 -31302 -143430
9102 -143430 -25140 -59643 -134979 226725 -279258 126742 -60959 17101 36393 4157 -174467
9090 -674463 -6807 -74784 -124730 -54216 -81922 -272714 -128406 -63398 -184691 41445 71705
9079 71705 -49751 -46557 -103024 246687 42437 12439 -208712 -125008 -152087 -142308 -86980 -291598
9067 -291598 -79840 -196119 -351375 128034 -73785 164603 -187583 -31329 -210006 -201861 57886
9055 -134803 20203 -139169 -79473 -195764 -21424 135322 -109797 -281064 90303 -14673 187231
9043 -226379 -157666 -187921 26488 -356032 -8150 -58155 -16552 -202020 -223479 211579 -26856
9031 37780 158676 13079 -2730 -128401 -65343 44485 -181595 -105986 262932 -81553 132683
9019 -193681 -16991 -175805 37217 -26309 -256939 -95724 -180195 278269 248454 170443 142117
9008 142117 61584 -2350 232440 194557 215006 -40310 -84007 50886 -157207 -306150 -269967
8997 -269967 85842 94033 74341 13373 -23967 130067 49754 -328227 -424657 114655 -323738
8985 8886 58411 -404522 -206651 -40467 -179410 -193385 -244082 -147945 -228394 -174719 -11026
8973 50950 -180914 -39395 85106 105703 99317 -65176 -78770 -323038 -353176 -10806 37499 188900
8961 188900 -205873 14807 -274608 22666 -209644 27643 -273095 10010 -46748 187880 -347688
8949 204121 103961 -331861 -328690 163165 188066 -90187 80015 -434 347619 -321450 107007
8937 -179037 122065 -124074 165282 41695 -24608 -2979 272123 246475 -216213 422545 64766
8925 40462 652821 1170008 3713008 12491021 12389959 3954978 1504086 843822 614206
8916 614206 267749 80714 -37036 140212 -7826 65950 -45291 403940 426288 174413 -283610
8904 129848 173725 366010 280661 -36661 424 117826 -45002 -443401 -17421 -10017 -201383
8893 -201383 48229 -241859 131691 -73356 -202918 320643 -154450 -32745 -46525 -98392 51869
8881 -139819 -17402 -103932 -122122 325945 254688 -119681 -59024 -172060 -239619 -30518 41712
8869 -219172 98341 151211 -206943 -186545 5176 -150178 274930 -397712 418613 129465 -24081
8857 303369 713 -139872 -62313 255803 -18806 174855 -108289 -191757 -38533 13186 84776
8846 84776 -63730 -130773 182836 -134652 121167 64751 283507 165215 -238559 -182501 -84299
8834 -314503 -426847 89937 27325 -23737 254563 -115952 -64325 -123426 -270372 -398479 272491
8822 -214807 -94875 -239265 -229727 -30785 -11516 -80004 -56758 -222620 39789 -211277 11563
8810 -8925 -87130 -297452 82845 100037 -226114 -64205 373967 65508 -36468 -88033 282058
8798 96776 -104803 211007 -67233 -52784 -131651 -188659 -86016 -207662 -226288 150174 -26751
8786 39085 -140452 -467599 46408 183839 20931 -261307 168484 1785 -290156 12116 -278405
8774 47040 -322606 -10575 -55139 -165097 -141563 86450 251507 36025 -247960 -290915 300117
8762 238427 -183705 -5813 -303964 -112113 -289223 264422 -128410 -184086 -214185 202093
8751 -37249 -172529 -384605 -223929 43678 -224792 -345744 -225276 87304 132679 -69233 177926
8739 -8597 132748 -56314 59565 -79344 57270 -372053 -425067 149054 -110896 -39402 -254210
8728 -254210 -307273 -134746 -83185 -81063 -205720 12524 26199 202974 -230729 -242736 -204201
8717 -204201 74539 -148541 -440361 -63449 -75984 -97527 107175 -97926 -43998 -371498 214078
8705 -217609 -475615 136313 109229 -128666 -217492 100295 232580 -100448 -130168 -130104 -68598
8694 -68598 656 -125035 264864 224215 74567 -30650 -144787 -33232 71572 11917 -76273 256107
8681 138077 -88567 -107655 -173600 43157 -148109 435629 -143335 235169 -188945 -61807 -108723
8670 -108723 11813 -166728 -203071 -144601 -249322 -85113 -162864 -155115 226990 -114676 -279497
8659 -279497 -154669 -144574 -68909 -109658 -103105 63974 -96131 -124360 -79213 -17086 -5097 -274756
8647 -274756 28073 -35079 -199202 -128890 107192 -255175 -1820 -71944 140730 204740 -30061
8635 204376 78624 225034 105379 -200361 -102901 -344993 -153651 71831 -202325 152739
8624 -284600 -85512 -328580 -236671 268122 -117014 -200902 -288685 -5928 -83699 12968 -197869
8612 -173386 -17124 -328194 -80221 69640 161572 -107112 83608 73007 -65363 -130751 11495
8600 154336 -312384 -238979 -454575 -346605 -31627 61998 -69220 -220524 -84129 21573 -207799
8588 -369402 72805 179115 170060 -262195 155823 -206450 -30627 -86753 -69212 141167 409602
8577 409602 -194448 231272 -15914 -37419 69334 -139558 37699 182017 210982 262182 344581
8566 344581 -44522 -2119 127723 72022 -209545 90990 74364 3826 -209564 393343 -70053
8554 -92643 -118181 -115286 -277463 332849 53109 -43171 54881 120985 -277728 -120158 -78835
8543 -78835 -241752 19730 103404 -258008 -5493 162383 -105303 -92470 -117669 -204001 -96975
8531 -215335 63205 -380139 -24747 -84041 -10102 -122894 212461 -154726 -127549 -63547 -43017
8520 -43017 96862 53514 325275 104249 210142 -13601 -308036 130654 -270642 -2530 -9399
8509 -9399 -150674 -193642 113904 -237229 -394261 284973 -109725 255958 -200159 -64579
8498 -38759 -127897 -13926 26712 -161743 -261 104617 -244529 15616 -62924 -91258 169541
8486 216727 -276443 -39288 23640 -379876 -227987 344846 326999 -283194 -158297 -100412
8476 -100412 122269 190942 -181572 -22337 -159416 -8186 -40442 -109708 -253427 214362 -91663
8464 -65223 -365980 10373 81675 -24851 -189932 -220022 -343580 244742 24107 -355871 -248441
8453 -248441 -154423 9296 3626 241873 2595 150034 -102177 -6107 -130918 -153573 26158 198046
8441 198046 18289 23893 -69716 49698 -21985 241288 238707 -68628 -164219 109634 80149 -312143
8428 -324950 -36048 -258062 -2160 -61572 -189691 -238631 -53737 91228 51283 -44181 -344232
8417 -344232 183914 371637 -204012 -92854 -185608 -155159 -10184 34744 -241445 -291052 -299247
8406 -299247 -35378 138804 -172028 -69519 -184329 -101088 -4003 13966 -113057 -178082 16235
8394 100709 108760 158420 108851 -5263 -372108 25532 -127534 -78428 -102049 -267662 -374338
8383 -374338 27876 143433 36979 -120258 -23585 2819 50820 221717 -58562 -249569 80653
8371 -384236 -171142 -9250 34113 -57775 -92293 143195 -431 356118 188724 12438 18505 -155780
8358 -78093 15916 -174545 -20310 -105823 54286 -216538 -144063 -163971 22359 -36740 93041
8346 -157765 -56164 2091 -125717 -154312 174311 80579 -206357 102963 109225 -189343 -84894
8334 -319148 377961 -266695 149725 -216545 -222182 157686 -223574 -378736 -96208 -51408
8324 -51408 20862 -134492 128735 -57765 -250884 93293 10165 72611 56382 71860 226269
8313 226269 -270405 394285 -51671 -244201 -43829 -396937 -286160 137469 -148008 -311277
8303 -311277 -51204 -373657 -486963 285412 19475 -229386 35825 -111397 77216 14984 -51016
8291 -158439 66523 199922 161703 -227605 -17051 -115863 -82322 5517 -393952 50680 157509
8280 157509 -154141 14759 -9878 47809 14137 -74534 -38038 -199811 92056 -437213 -165812
8268 -165841 -426020 235475 -147905 -91259 -75624 -51776 -12916 -95382 -361427 -123933 -29049
8256 129896 -50397 7 -354277 -150756 431596 97414 -104610 94679 -225803 -91704 168365
8244 21260 -51490 -120043 -71534 302128 -187946 -190280 -106260 9059 -12176 -18420 -215444 -176640
8232 -176640 158124 -236299 -234706 -255854 137445 -63427 39724 -12937 213737 351873 -26351
8220 358915 -61553 58656 135325 171151 -122147 130713 2177 92284 -219850 10115 -60895
8208 129893 -54575 -109123 152024 -501476 -85783 -42139 176393 -158265 96627 205597 -178184
8196 -205748 141533 -75505 -110903 -8138 -44661 161625 -46430 255271 -74690 169303 -112530
8184 -28985 -38688 79173 -222865 -330724 -135389 -228096 103117 109422 -105446 30390 -47927
8172 10290 -99088 134441 321447 -152980 -172753 -150633 -209123 -16956 -53445 -322910 155928
8160 147329 163661 -225625 -423216 -91782 -145258 202634 176041 -17397 -147415 -182587 325215
8148 -124629 60038 241864 23618 -77456 -136602 -164678 -105611 294608 84337 150603 48429
8136 -304656 -90390 -26857 -132726 -136715 -78493 -229775 118904 -287848 -189183 429061 -332279
8124 -218346 -28045 262751 231368 -22532 34621 -470093 -12081 -62993 88121 31183 243509
8113 243509 124194 56477 -82092 -162971 55275 105405 209435 144703 59651 157115 -77273
8101 111409 -168117 -226628 -138837 -87386 49048 -10505 70767 -237287 228431 -264567 -63019
8089 -79162 -80303 -129511 -209824 -413712 121146 -159539 354673 108919 -381649 -57802 -184895
8078 -184895 -20000 -211607 -25054 212607 76034 198908 -122982 -216141 138366 161187 -52400
8066 -62194 36312 182038 187354 -262281 32211 -8269 -193067 -186824 -198387 -86560 -35575 -51088
8054 -51088 -329814 -56348 -77998 -257619 -286220 117094 -13263 118292 86577 160378 -198567
8042 -54812 -114769 -149871 -97271 -164727 -237718 -235702 -108550 -117261 4123 38506 -359258 59791
8029 -315757 -92447 -147255 -294998 -158095 35733 -127440 146885 -19684 6886 -174907 178032
8017 -583565 -79489 13260 -83613 118979 -35032 -37303 -153763 89321 304222 -424733 -79898
8005 58290 -138712 -66785 -85244 -8536 -150534 9883 65849 171467 68702 -407582 98509
7993 -29998 -208125 133265 -50083 -275461 -431505 121247 31997 -79889 -72528 62131 297163
7982 297163 362136 -233707 -21230 -99544 -169646 -171033 -167775 -95416 -22056 -21289 285272 -55426
7969 168474 -129438 133165 -132153 124875 -110797 -364891 102794 19274 -106624 96895
7958 11633 -301060 93907 61199 94356 52834 203837 18915 138079 171840 76213 -197716
7946 -124863 -280748 -351011 -32313 175326 178247 216402 2878 -24627 -716 15025 -395912 -262919
7934 -262919 283233 160328 138449 -52938 -231037 92301 -155298 40762 -94160 -36934 188195
7922 22973 -125726 -424204 -251194 -49899 -203485 -183947 -49418 -68686 22597 -19183 -117539
7911 -117539 -222369 299324 -35583 -134054 70318 -57046 58932 172090 1973 -116348 -165135
7900 -165135 -367122 -340733 102823 164310 68498 139231 205812 -188224 -142614 26087 -24182
7888 254610 -118650 27634 45603 -268262 -9457 -119697 334422 61431 166992 177607 136473
7877 136473 -143995 -91904 -221002 -334089 47233 -37883 -22250 -222682 -165065 88492 -171203
7865 -118590 103125 -84080 104390 144888 -131621 -103199 41117 -107030 -70299 -25135 -36767
7854 -36767 -311750 79865 -369414 20399 296896 174013 -286434 -2355 210177 8016 -59876
7842 -157702 -232831 101492 65896 -191196 -7530 105407 -168225 -31148 -501466 -51249 -230366
7831 -230366 316915 -243311 36098 -291251 -151123 -334890 212184 -217797 3707 -15450
7820 157407 -27016 76461 8368 -32311 -13807 29168 -117497 64777 96203 -31532 174594
7808 -91530 335979 -23204 -335940 -69915 -28837 -225324 34858 -109313 -113779 -142994 67390
7796 -2822 66340 -276485 61302 40579 216108 144563 -102765 -53494 -20951 -249456 60926
7784 1786 68614 -96972 -157572 -401282 125442 -1351 -176511 -304550 254438 237225 216761
7773 216761 80291 251029 -260971 136690 -100309 73409 58139 -38748 -72399 -212316 245175
7761 -149309 -270257 -147851 34169 214519 -80352 -212165 194843 15081 73092 -111714
7750 -89859 169946 -219709 44418 69750 58353 327039 74609 -44901 -135528 -355128 29648
7738 -291940 -198103 -181286 9783 -301173 -158596 -64482 -330446 -81468 17046 -48008 -142773
7727 -142773 -58077 -240671 17753 -21517 12965 -152913 17735 -103665 -217654 31368 -322187
7715 116173 -361569 118070 -67903 -175533 26276 -79807 -52700 165408 -76448 -396497 -279020
7704 -279020 -112732 -16781 -368271 -187223 -172941 198640 3536 -12787 -324477 248214 -96086
7692 -135533 235212 80222 -7723 103780 332890 -301687 406002 -57362 135887 1159 -230065
7680 -174534 -22004 28181 -128569 -158687 -75550 -149278 -124088 -80014 -41150 -284454 -165223
7669 -165223 -99688 222977 -137721 -84437 -123835 -166025 -98705 -125104 85795 190909 -310331
7657 92150 -68254 26395 -64223 158499 -4885 -378613 132938 187712 -219315 -230892 -6730
7645 -98438 17308 69676 -145104 11446 12778 -6390 14287 148960 -103859 -191994 -170468 -102828
7633 -102828 -30507 -284876 -93230 126966 -316408 57424 88092 53209 -235107 -9135 187857
7621 -8145 118617 217910 -154845 139298 272587 200208 -212306 -78125 63625 333677 -131039
7609 -21889 -18188 83308 -225995 -142811 -288963 -117466 -33006 351600 -85963 -37765 193050
7597 103781 202301 -14249 -208866 -95870 3348 -258843 54667 -113470 170350 -134093 -57677
7585 7630 -77236 -216740 -62702 198915 13168 54187 173299 275399 220652 42340 139409
7574 139409 339323 -127741 232302 -35041 5352 -426517 -82053 -70344 -143714 -450084 203121
7562 173838 -52293 199337 -10355 133403 237836 -44040 278857 -172344 -166528 68755 24775
7550 38147 -23465 -37361 -189034 647889 -387414 239117 53567 -51384 -83444 -287095 26191
7538 -243582 43992 -102804 -112290 -73533 -29967 165278 270572 43438 221009 -49289 -71919
7527 -71919 -120003 -151742 -139435 244160 -166478 -267119 -104146 -212441 -148304 -232562 -10732
7515 -115292 21284 -629203 -192917 -197256 27898 -247392 299534 48612 -24022 -77994 -3933
7503 279040 129119 135305 -42586 -48796 273665 204277 201970 -39115 -171271 41363 -243430
7491 30947 289847 -29871 -48322 -137285 471438 -456767 386884 -60158 265196 329577 -18230
7479 -94906 168359 94711 284673 118553 -132147 -13714 -88851 223863 113361 252795
7469 252795 -194807 139780 118921 -253282 214475 -116445 10121 282070 -512821 227552
7458 -213970 -51515 -434088 221540 -150149 14039 -251194 -250220 218532 321914 -40391 19485
7446 -27803 -383114 -246182 -5782 -51531 -154978 -257836 -46138 -169422 -96138 -76431 -117657
7435 -117657 20362 -99907 200708 -406792 -138986 58784 -265148 41917 40645 163969 127926
7424 127926 -28985 55691 74412 22391 161459 -132274 15624 169545 260097 143045 -50238
7412 -83610 -134509 -269898 5962 -35271 117711 -256888 -155795 14640 -145782 8762 -86291
7400 72855 -16539 14404 83979 -211445 -116135 -313472 91078 13206 -302631 137636 62674
7388 -186473 -79469 -173363 47980 -199497 58303 254873 2349 189185 -257483 -114605 -137142
7377 -137142 60937 -163188 -36083 -210532 -16342 -221582 2684 3350 -241540 -41823 12401
7365 47954 -64788 -403739 -118196 283579 -108988 -55186 -78866 116688 -311469 -434534
7355 -434534 -55053 -177681 187300 -165619 16859 -78878 -149254 -209355 213057 -83551 148870
7343 77455 87751 39536 -177014 -106606 -127628 -173549 -77706 -72311 -52221 -126830 197216 49257
7330 -265524 -176136 -91812 -260836 -19805 266303 39618 86146 -206715 12580 -1458 289655
7318 -9851 -7464 -168092 -270514 -227218 -89730 142277 103313 94648 -64262 -61270 -168581 -106761
7306 -106761 -5729 -266984 221907 106461 225901 226836 59362 193065 -3687 56045 -213930
7294 -322217 248438 43493 -122900 -317134 31084 -6824 -102812 77427 -4360 60081 52309 -329112
7281 -68518 -179231 -313559 -223064 -439426 -249641 60895 -185494 18019 209569 -61107 -62867
7270 -62867 -21771 67956 -156581 12950 -240899 164683 -22303 84196 304463 -111604 13273
7258 -61134 124641 346766 -191253 3429 -259916 -14278 -110830 30967 113550 -73751 64239
7246 -43091 -42985 -141621 14928 -8814 13295 -2866 2740 -182316 51337 -27073 132227 -25911
7233 -115709 -62372 -54790 238816 -55099 -332711 -167303 38943 -138775 -260708 -156851 192731
7221 124617 115021 40538 -160692 52171 22805 -67595 139630 160667 91596 -202289 133117
7209 19841 146174 -239868 -238824 296958 76425 -224584 167757 1245 -104091 -15050 -121597
7198 -121597 -391671 -155457 -136758 207410 -154175 20923 136316 -400619 -138307 224843
7187 80985 -141500 83084 -22851 -56858 -212895 -227492 -14436 18381 -77408 -250485 423511
7175 154281 -11567 -241455 44305 -33292 45352 -287044 -75438 -158955 88453 -3150 124638
7163 -198779 39258 -320817 105945 142626 258101 111859 230781 181488 372851 -109563
7152 -137905 56381 -95231 -86746 -6756 -112987 -131852 -267056 4330 -51603 95602 -336592 -49588
7139 162648 -12568 -95124 -26572 246824 -81232 68033 26220 -284729 -301603 4019 31590
7128 31590 -38733 -148945 -266523 44095 59895 130722 -166103 171232 -521899 -224804 -189111
7117 -189111 -19138 -106356 72433 150561 29614 -122082 197870 -44108 104667 -41352 -114043
7106 -114043 -38610 -181611 113846 -347709 -44312 -35519 148933 -70758 -118175 -22273 -147312
7095 -147312 -31531 158144 125011 -41396 -111118 5296 67865 64102 -124263 -202966 -165886 -136926
7083 -136926 -70166 -289867 -243140 67747 -297488 2537 -119418 -166840 -265762 -263288 55185
7071 43200 141299 7410 -173917 -159117 -182372 74438 -259416 94740 -405564 148205 248464
7060 248464 -241000 15524 227839 -111096 -46028 -83765 -219415 -196069 -93925 -411996 -209740
7049 -209740 -19070 -82759 252473 -358232 97565 -126069 343220 446957 -231447 74963
7038 162413 -47564 -116183 112771 -216828 -113119 -43120 234172 -236879 101446 -135559
7027 -90124 -12957 133262 -186212 -154067 -22440 55148 -387652 183783 24187 -5637 197279
7015 261117 -93071 50553 122657 284720 87836 17780 -59054 213973 -170102 -173452 41156
7003 -192186 -56040 -51057 5085 -80365 -177266 -8796 -176722 88444 -188134 114061 -205884
6991 -266259 12149 237524 -13148 -344234 176064 27382 -8114 136384 -66568 -503256 -180411
6979 -298511 326807 -24512 164854 -199195 -178095 58142 -269492 36581 12696 18847 -218486
6967 119824 -170208 45001 295029 12341 226736 154205 174032 409413 -55195 -357088 -143318
6955 18720 -18392 -100823 95585 121751 111163 -285342 -218978 -124767 221765 -171467 -144365
6944 -144365 113571 -153502 153184 -84621 -175380 -55947 121216 176880 -189094 205267
6933 -264824 64895 -65476 -321238 74698 -369717 -117261 -47356 -308284 48501 -287745 234712
6921 -41799 -171911 2687 -23185 -87774 -5960 198161 -231332 152031 -68366 218760 -107930
6909 175812 -65700 28922 416459 -156818 121965 299904 8809 -29958 215142 -81139 -1652
6897 60365 424333 -282323 40208 330753 18175 37363 246384 -171779 -72746 213223 -232838
6885 141322 39430 -15955 84176 -67898 -16116 -84727 -185122 125010 -210727 -84757 -103384
6874 -103384 -98735 -125645 -416517 152060 -4470 143551 -61490 -45097 -289277 -68073 -276779
6863 -276779 -70424 183772 32346 -15114 -174366 -83867 -123583 -62541 -72958 80957 236889
6852 236889 -271831 -137046 -70804 -111508 195221 -183803 -43051 -60440 -252129 207725
6841 -293820 71746 -7055 179678 -126201 -181650 -44711 -311378 45651 251579 56961 -18220
6829 -203426 -28133 -110581 -97531 -138409 -159129 90984 -65738 345682 76180 -14830 68771
6817 159052 54753 -179575 313090 222978 197321 -257051 -314480 -167150 -149249 117704 -1708
6805 391197 339352 -265811 -322559 -92019 244201 -7972 -101589 -55093 -87617 29246 147632
6794 147632 476231 -155609 24899 -61269 50050 144886 169260 -369429 39064 -2812 140858
6782 -126991 51010 -258391 167731 -86929 447 -210027 -278270 353782 70291 -43943 -168596
6771 -168596 -41774 222761 -297098 -235317 -61337 -29144 134592 -104216 -206969 38814 -90209
6759 -378821 54871 -248100 -294961 106443 -6782 59281 -127638 122853 -17887 12488 183811
6748 183811 -22924 -171770 -37627 41919 54094 -288006 80133 -147103 -7663 -208369 -108129
6737 -108129 -12572 24645 -66370 306593 -173719 -194531 96450 -225992 143418 -127389 -95226
6726 -95226 -261663 -192285 215807 -143349 114848 102913 -311919 51829 -121906 79102 -74329
6714 120009 -147840 490214 -124760 215253 93109 14163 -92462 -226662 -22279 -34638 -102228
6703 -102228 258349 -303529 344600 65582 -259859 -27973 -40897 20224 -142154 22561 5887
6691 27826 -91503 -30361 -149204 -43481 98079 239237 -126916 32283 -139715 -306402 -190553
6680 -190553 -134892 -95829 129981 -54676 -27663 46134 -100145 157408 -197238 79372 -131982
6668 136192 -21528 89835 -518936 161995 -140069 138852 -303643 -246941 -151336 85483 -244217
6656 -459866 138049 -238130 -67615 -117844 -240221 -176621 170459 -68128 18587 21214 -19437
6644 -277861 -63684 84105 344825 105662 242447 -229205 -121244 -70615 53944 -174802
6633 -73868 -57251 166064 -7722 300167 58568 -62608 156618 -179030 -225758 -224875 319 -101587
6620 -35958 360042 373405 30025 146673 144062 150219 -187730 88523 -8477 182130 -111852
6608 -81755 -26822 94080 -311487 7668 184573 148096 -135256 -247489 -26861 -222689 497150
6596 -269400 -133933 -353482 48426 -207394 -139732 -231705 304445 -44151 304776 -73401 163975
6584 41638 -140940 -204019 -118828 -83823 -148873 -128373 -185188 -557787 12463 84081 104596
6573 104596 63389 178663 7268 -68571 138454 -240539 -1858 96851 -33786 207396 15664
6561 -226134 -118372 28696 -271502 48220 -315470 -24587 -96939 71189 -111082 -17227 338708
6549 115340 118935 -449034 -120336 -184652 -286077 46990 101998 31850 -58547 -24344 -102247
6538 -102247 -167009 -33794 -98980 247049 52052 104437 -239493 22028 97578 21355 -7446
6526 27332 -218693 -195965 173630 411166 62036 -157783 325635 -322620 -239116 271549
6515 -268163 -2160 -367851 138387 -32022 -30984 -80503 130263 -107217 -129131 -25692 -171936
6504 -171936 302517 135854 48304 48669 -169092 -223141 108611 -315308 -99729 -300709 -60702
6492 115969 55545 -148249 -146158 -222316 154818 -87160 -109108 -109289 184697 18625 -548 -241333
6480 -241333 14721 -223327 356557 93253 -33515 183877 248694 -109268 259908 264294 26564
6468 440626 233730 121870 213725 -217593 30558 18809 -230688 -96916 112514 -13412 -140228
6457 -140228 114889 -166477 -154 -81337 -55893 187724 200139 45931 -63281 37874 -69530
6445 293124 -61335 -103168 -87307 -268846 -359442 -28082 53231 96870 203011 -47107 -116058
6434 -116058 135729 142031 58055 -121307 -463111 -79286 113608 -159957 -105299 -34630 97102
6422 -340159 -152891 84411 -77636 219772 -90063 -169430 6387 229690 55860 137295 -160517
6410 110490 -39388 -47037 237446 -137124 300341 102331 141825 47736 131163 92199 102161
6399 102161 -134065 239707 -27162 28838 49358 -88476 -183185 296721 -109557 -91420 242220
6387 -156822 -11876 143647 122093 180466 -7239 -39789 -305939 -52200 -530667 407793 -28645
6375 145820 -96416 17593 194447 -217837 170588 159766 -92146 77786 259483 205921 79694
6363 11329 -122586 -136157 386900 -250799 51340 -252238 221992 -35835 30877 -106988 75207
6351 -372596 170741 145880 -22417 -15982 -218694 155748 247644 -249642 150976 -115525 178858
6339 -39671 -91196 -330487 -115133 -194156 200611 130366 -35513 -128966 -127336 -87827 138681
6327 -24119 95017 -8033 68904 11040 24988 328433 45226 -337474 102402 -251386 56225
6315 110711 -87272 -127891 -50696 -44453 83134 -159847 18413 16087 82381 -139869 -222491 55333
6302 102035 -85207 157394 -36957 -241988 -10554 -52228 74137 142425 -35502 -200738 35299
6290 6742 -96347 -18447 -30962 -313494 58974 158680 58664 16158 -138586 -28977 -314199
6279 -314199 -51530 199992 -14523 -24404 16856 340590 -64830 259546 -118899 -175232 -311529
6268 -311529 153174 -232293 -37538 152685 83987 30928 75499 -200330 -71240 119123 -132681
6256 95187 245592 -64657 -102078 -257830 162263 328537 -347546 -137365 30972 -149933
6245 61264 153431 43348 -71186 242484 -176554 -32834 -126984 326967 34885 -182816 146622
6233 93396 38921 23472 -3501 -42034 -173709 107111 246176 -18177 7205 6776 -85877 -320780
6221 -320780 294923 53745 -299604 323435 -18680 -116400 115881 -265745 -102960 48660
6210 44853 -157150 -68447 -56544 -62828 98782 -197228 -160004 178497 207938 -325977 317133
6198 -248403 -180216 -197154 -130968 -254916 -110823 75218 -18477 255037 86264 280055 -25118
6186 -68048 -128755 32493 -168282 -244476 153994 29007 383415 229529 50087 916 -264787
6174 -234393 77809 1843 18921 -194426 22253 -184680 83977 -38449 -25054 -216691 43572
6162 304244 -101069 -346075 -44545 -59967 84072 -10398 47389 100601 21341 -32111 179526
6150 38334 -133572 -199039 310712 58894 -42531 186051 -171761 59014 2569 140194 209680
6139 209680 253926 -80833 179498 273323 9927 -57094 -22837 -269114 -228808 -104766 -56036
6128 -56036 -325576 -157339 -165859 -183959 -181253 -163512 33152 121917 64182 1223 -303232 165874
6115 -164807 1096 -46604 61224 163864 -31263 -27710 -26178 -127875 -125520 -16517 -73602 -11534
6102 144795 218323 138641 -5363 -147025 95794 -324681 -218087 25053 31781 -1186 228483
6090 -76929 -123140 243547 -100560 146142 97425 155806 -7732 -81360 -60417 146434 -69337
6078 -59778 -240974 238667 -124366 117222 131906 120986 -255766 -97702 -314335 -224454 93791
6066 -1387 74680 160618 -67385 -412438 -211476 62992 66301 233880 -110970 44935 17988
6054 -296119 94227 -108145 -205096 14481 149262 -78700 -251870 90754 84359 -292926 121946
6042 24112 147537 181938 395500 -220724 -199569 141850 56139 -76714 -98476 168638 -283550
6030 -40650 -74573 260006 74727 -43635 298152 92769 -64844 26292 32343 57782 -355479
6018 40879 37937 -277787 11889 -177568 140671 -49664 149035 -67235 350194 -33034 -178771
6007 -178771 -264256 39155 -107777 -252789 -116705 13797 -122404 67402 -108520 -72274 43350
5995 103288 -48987 -20292 -8259 -278991 -320627 84355 134007 -121164 7641 221212 -105678
5983 -10957 -51119 15525 205672 -396160 -170593 -33566 375252 -96206 -9803 64872 274686
5972 274686 196512 -55239 56754 125315 211202 332342 173042 181941 -143688 -344468 -94896
5960 21577 -35110 81093 -174675 120456 256069 -331564 -26413 -141262 2786 -58500 67207
5948 -51296 41446 -19247 -142154 -149745 -189440 -97556 143918 67946 -131166 189267 29227
5936 -74532 -143961 184357 -47927 -311278 -153008 284388 4007 -61315 101339 -57172 -16597
5924 -307881 222809 297242 70804 -50107 36302 250104 -55139 -66830 -42373 -20900 -60156
5913 -60156 -217504 148566 124610 -139662 -355813 -110468 -92525 -64250 38469 104245 -120544
5901 76294 -215427 -211500 141909 366797 26204 179734 -148228 226966 64001 -164861 -129517
5890 -129517 -329984 14931 20565 480892 -29382 54095 -63253 133308 93365 -168090 -44852
5878 64241 -135008 -172116 164965 155773 -23009 115951 -308899 15439 -172761 -49012 30254
5866 102742 -86676 39022 -217765 -63574 -133883 -249207 242724 -116578 189012 -320182
5855 -45396 -95934 21464 -130525 50414 19416 -124419 -77094 -63534 473643 -171897 37157
5843 33598 164753 4697 -135093 -146249 415778 69077 289768 45085 -205988 -364200 -253991
5832 -253991 -154232 -230021 135754 24865 36421 -33379 -77453 274448 -343201 -223592 -300395
5821 -300395 -219593 6612 195293 -80856 -190400 -48400 274355 31269 -231909 -57785 -242376
5810 -242376 35801 12962 110291 148027 -46803 171749 -43832 83945 63307 55332 91353 -214428
5797 -9079 -93469 96237 -167051 53628 267986 -98128 12020 63291 -139407 -255655 28557
5785 1364 46495 31135 -188865 208765 63144 441926 -87728 -174417 82192 -17365 -78153
5774 -78153 240724 172538 -234730 -73764 99421 179337 -43726 -136806 -149398 169464 -44459
5762 107498 -223027 -25671 191390 116184 -166828 -70189 -237007 132003 90043 15196 -69283
5750 15476 15040 2077 -256702 -75322 -53113 171490 -134540 117828 155375 258389 -104424
5738 -51848 -35384 -104952 163546 146965 -75077 80114 136777 -20043 -117508 144536 -272027
5726 -98948 -89981 71105 -254545 -272409 75692 109030 217320 95293 -126300 116952 -31163
5714 -282501 207104 93498 -21824 1241 30614 -147098 58252 -381074 -96565 32590 8752
5702 -619 25326 366940 -96686 -82797 -230541 39035 182135 -24554 293538 235394 91918
5690 -49891 144060 -146302 79922 -73167 -6077 -220284 -167517 -153051 366 -61702 -148741 74856
5677 -34147 9477 47917 -220857 -711 -88078 279946 -142460 152851 -179463 -133309 106881
5665 266027 -296679 37775 -117747 228059 43067 257673 97685 -262885 830 -35737 -97240
5654 -97240 105743 9451 -53350 83005 -135918 -266197 72979 56950 352953 -108236 -178118
5643 -178118 -157776 -182767 -65594 16098 -131095 155492 -87701 123577 212150 -80129 -104090
5632 -104090 107645 -307264 -95961 -66564 -35103 -94109 130263 149278 15043 -148001 -81529
5621 -81529 33681 50133 -172963 -87056 93619 -107212 190288 113133 168388 -175802 23674
5609 199727 38941 133265 -164478 -67021 -280724 -94470 -57479 -136301 167155 91270 -86151
5597 60631 60457 73280 -88106 114424 -63284 -99946 67674 156329 -81715 140663 47571 -9434
5584 11252 82622 84018 -70179 369699 -32290 -77013 232209 -34243 373449 18700 181834
5573 181834 172684 175608 -44033 -87291 217198 170786 -5997 109788 61647 -68528 -30025 -163532
5561 -163532 50852 147768 142975 8340 115772 238067 99884 -229305 -123525 -172765 -134729
5550 -134729 38913 -104899 -259015 -28283 141411 -90935 -32913 -32388 90811 -56482 -34749
5539 -34749 224159 -258572 243439 223182 -225075 28259 -16637 -275571 33804 -294737 193917
5527 8583 113788 -180374 169971 55136 -275041 226546 151520 48552 -231995 -316085 42125
5515 -127244 213434 62866 138968 -24167 -149239 179891 81677 -11135 -61408 79893 284471
5504 284471 166373 -454746 -133601 -108804 68057 -4271 -210694 -54210 8837 -11356 126531
5492 13161 -62412 105821 -56645 243240 -5410 23086 23489 67137 -91346 28696 -336792 -224037
5480 -224037 39309 -90734 42854 209993 231606 211335 280552 196823 -92263 -268427 110483
5468 -46769 46379 -16195 204064 -217211 -231462 -43903 260641 -48545 -14925 627617 110580
5456 -31251 218110 -229293 -33834 123188 -146822 -186527 300989 -219045 341541 -46589
5445 43979 -321508 141641 322145 145006 370172 -26298 -364313 155237 -195165 122603
5434 -115250 -60428 -151418 -137860 -46709 39660 -165105 -345929 -117203 -233297 -203471 -414720
5423 -414720 177438 -59483 143084 258828 -3520 -176247 -183023 -187593 -145112 -45699 183323
5411 -134280 -7944 -212637 163575 -87701 -262058 39280 75770 -182750 -11173 35415 119551
5400 119551 -136754 477956 -96901 2089 -479806 205050 171125 -41732 129261 -2506 -286402
5389 -286402 -269330 -101954 114415 -310602 142388 221943 36246 -43416 68652 141982 -116874
5377 128848 170025 -232347 92222 149761 173784 -100844 89474 -89338 -91060 294006 7483
5365 -129306 242293 244602 -194229 -254655 -21804 233007 18629 -80850 -141607 -140784 -230859 169676
5352 -168306 -78336 70510 184466 168626 -269836 332666 -126294 66585 -5291 55867 -8822
5340 -164187 -108233 16704 248561 -249833 -250557 -41119 313887 108376 -190276 -282812 -18236
5328 -210735 -146328 84356 -22702 128718 -282289 48347 97592 136946 172162 -37383 -98789
5317 -98789 17428 -59525 164078 -68899 139786 47793 128399 151751 -144506 85600 9920
5305 38179 301385 141165 -88317 -35474 66117 84829 37900 -320992 -209504 30755 299405
5294 299405 -113583 -211102 157472 90241 -70420 -27121 145131 -83550 -182449 -141519 109463
5282 -210534 64405 253210 48429 164085 149726 -95462 18148 53566 -11696 -89316 5121
5270 -8316 -11378 -484913 68374 -290035 -453056 -72135 386004 -113641 100230 74312 -102593
5258 184100 -21795 241697 -196576 -257084 -142274 -22226 199895 39926 179991 72624 -48336
5246 149397 -232724 4751 285822 -90274 163535 232595 317652 123772 34282 48326 -187020
5234 40662 106220 258464 61558 344125 52513 23450 195857 87618 13217 -67462 -9682
5222 124731 -378240 -111246 55965 -19328 -508806 -34454 119061 259726 -111175 144213
5211 32936 103244 6385 -38406 -148054 -133259 69442 -221582 -58451 -60469 43108 148786 -169112
5198 -28354 -55002 299386 36693 182829 -37060 86686 -148082 43637 43776 286620 -447586
5186 51566 27610 205365 51826 -60101 238126 -3337 -120058 110221 325810 61883 -45261
5174 262373 -169129 -114097 -314270 314048 -6049 159075 6488 -1166 -71439 -1062 471117
5162 196864 50831 50363 -163991 -81348 172673 235729 121280 -256340 -201791 -193683 130014
5150 195383 81579 60143 -80839 -286273 62245 -95348 -128076 190747 -210517 -168454 -13719
5138 -63730 -80613 34961 169899 -261223 -100352 -234195 475 3345 428262 -291630 -280085
5127 -280085 96753 -250374 118308 54903 -117018 -35497 101799 -41757 100736 48310 -250072
5115 132310 135179 -106062 -268194 64625 -194436 200613 87788 -160022 -173376 -44203 -16491
5103 327754 173248 446480 -37713 28982 155252 -169765 94004 256868 14429 189645
5093 189645 115655 237139 126399 -285562 70980 35565 56406 -50249 -99991 -120546 -254775
5082 -254775 -62228 -155759 -219830 123056 58516 141999 182490 46077 200783 -85143 256260
5070 -117526 -121017 -9922 107874 34070 -440287 -97292 -195587 4970 31995 97855 -83674 211625
5057 164896 260413 -128113 47122 44984 -349138 202383 -152122 -177849 139129 306671 440879
5046 440879 35960 -52904 -81401 172831 151036 -44646 77023 -101200 80598 -396703 141288
5034 38652 -60364 -136635 29188 -87124 215135 -55423 -209510 -215078 133118 -55251 -46972 146031
5021 -34284 -179109 -76407 -394947 51171 9497 -213363 27437 23419 -13651 46785 -220328
5009 -134314 -54988 -10714 237234 -73106 260840 109411 -74626 32553 -311920 -37907 -123136
4998 -123136 178415 380985 -171069 -22861 -5535 -330902 8272 70289 115658 38108 111459
4987 111459 -110484 -260921 -78373 -235462 50485 -176104 -140498 -234821 107999 50643 38486
4976 38486 51943 -142001 392661 271627 115786 509578 217781 -73162 8520 -4975 278203
4964 127483 249129 -18782 94103 99068 58350 -122366 137347 52500 358347 -177292 -213917
4953 -213917 -111778 -65092 249051 23709 -148782 -43397 -6177 387160 -33550 210567 29776
4941 208012 -429053 46967 -75090 170933 -294115 51162 -186717 216811 -24606 79697 -70526
4929 168069 362302 43762 190536 -253879 288130 -170167 29761 35170 377128 -72553 97123
4917 249896 -57737 -189850 -375578 40514 -171621 47524 -16662 241083 142736 176294 158250
4906 158250 -94571 -163781 60315 225442 -199417 57037 -7654 -102492 138274 -215822 -162741
4895 -162741 -32440 -116166 25946 -68180 -152323 -197072 -229530 21909 156755 -273606 -202074
4884 -202074 -82633 392165 -1312 156693 -143624 -135221 -305689 101282 32799 91354 296298
4873 296298 -134096 -72209 -153898 327659 331414 245016 65102 -155044 -45745 195990 63789
4861 -61741 -30647 254105 178113 -51221 264507 48626 352831 -138284 75594 -62769 289376
4849 120140 -51370 -206996 -251994 27480 268450 -194823 -35535 -137252 107862 -125526
4838 -3854 -187268 200777 163233 101786 241130 83825 80961 22408 9829 68821 207392 64343
4825 -103168 -96276 45301 -380058 -232013 265723 123176 57217 -61246 -55422 52296 -354654
4813 -26877 57712 -40742 -185882 49091 -337233 -92433 -313075 -23092 -235462 -160970 180678
4801 186591 155850 314005 40257 243382 175154 147835 179181 77468 42766 45462 149013
4790 149013 14129 237162 188226 -87674 149373 -135161 106159 191003 -5713 123578 38087
4778 79634 66784 175295 -75606 -163339 153178 192768 -134693 -47395 93851 100778 -151006
4766 12785 -40006 -126243 233733 -87763 -129705 -228135 -152839 -85660 -223501 131165 56792
4754 -28888 -112414 -61861 -208997 -122549 -88324 -158294 -75193 -225480 166046 89961 73898
4743 73898 -121358 -85038 -163411 1324 87574 -133573 -79800 -152357 -361088 -16741 80634
4731 143739 -252877 -39794 30726 -335072 266225 143275 -179889 -228137 -375005 -423610
4721 -423610 -95220 182510 232245 253548 265073 -271866 -44843 173353 -22924 140882 75292
4710 75292 -138635 238485 -9940 -262480 109716 -106711 -93312 253167 192073 127519 -152912
4698 115147 73496 -284595 -9933 148611 30190 -177017 -173010 135255 115014 336186 -273220
4686 -333677 60639 110813 -58135 60271 136403 221761 139153 -5017 88509 -123149 -148697 -28297
4673 104658 39902 -185271 30710 249350 443349 101817 -48819 63557 125769 -42108 301122
4661 158624 250830 -33023 -286865 279849 -121132 -45128 332460 -281825 -300703 -69911 -386940
4650 -386940 -105528 458907 -286309 -46775 -57690 54392 224194 -197091 237007 -89915
4639 274508 -119522 159844 361732 223568 -238405 -139510 99326 -29016 -45977 106626
4628 -200764 -69110 -24013 136342 -345476 113563 -162451 -26969 -141436 -144438 191105 398619
4617 398619 170118 -123566 -172861 -56089 -118731 204269 -148680 10232 -286923 120142
4606 -257677 -1879 130005 161648 -121703 -40574 -65959 111469 -91269 -67024 -38026 -34241
4595 -34241 -3612 -47211 -47737 -31390 -180393 -18920 -16690 31792 259108 -80781 71923 -10132
4582 -1080 -231207 129171 -99247 512645 -144217 -83813 -37811 106552 -334083 130543 -115940
4570 76000 149688 157827 230631 -165887 142123 288187 -80855 -20879 20874 394628 -1042
4558 45989 155797 279008 280218 125669 -64390 75104 321605 -54299 243779 52132 -56159
4546 -60801 -486008 166155 117320 -396172 365582 15619 421061 -168283 210294 -215285
4535 -159702 12130 113983 34052 -14510 -142731 -109187 144656 96734 -225698 -83897 -221197
4524 -221197 75848 164279 -136824 -331838 373698 482423 183097 1083 -5528 -6571 125677
4512 -187705 60601 159368 -113444 31281 92835 116396 205960 -26185 20394 -20625 -65913
4501 -65913 135351 -466453 240259 132322 5810 55797 40634 -138790 173546 263537 70571
4489 -194361 210629 13348 16266 97742 -138490 417861 -151854 -66769 -71685 -128424 -19859
$$ [...]
##END NTUPLES=NMR SPECTRUM
##END=
