##TITLE=AC1554_ROEFFECT0016_8268924_2ToXJO43Cp
##JCAMPDX= 6.0         $$ Bruker NMR JCAMP-DX V2.0
##DATA TYPE= NMR SPECTRUM
##DATA CLASS= NTUPLES
##ORIGIN= BRUKER
##OWNER= Administrator
$$ 1.72 TOPSPIN		Version 2.1
$$ 2013-10-12 00:39:57.579 -0700  Administrator@X
$$ Compression mode = diff/dup
##.OBSERVE FREQUENCY= 400.02188249412
##.OBSERVE NUCLEUS= ^1H
##.ACQUISITION MODE= SIMULTANEOUS (DQD)
##.ACQUISITION SCHEME= undefined
##.AVERAGES= 64
##.DIGITISER RES= 22
##SPECTROMETER/DATA SYSTEM= spect
##.PULSE SEQUENCE= noesygpps1d.comp
##.SOLVENT NAME= COFFEE_meoh
##.SHIFT REFERENCE= INTERNAL, COFFEE_meoh, 1, 14.96094
##AUDIT TRAIL= $$ (NUMBER, WHEN, WHO, WHERE, PROCESS, VERSION, WHAT)
$$ ##TITLE= Audit trail, TOPSPIN		Version 2.1
$$ ##JCAMPDX= 5.01
$$ ##ORIGIN= Bruker BioSpin GmbH
$$ ##OWNER= Administrator
$$ $$ E:\/data/COFFEE/nmr/AC1554_ROEFFECT0016_8268924_2ToXJO43Cp/12/pdata/1/auditp.txt
$$ ##AUDIT TRAIL=  $$ (NUMBER, WHEN, WHO, WHERE, PROCESS, VERSION, WHAT)
(   1,<2013-10-12 00:39:52.579 -0700>,<Administrator>,<X>,<go>,<TOPSPIN 2.1>,
      <created by zg
	started at 2013-10-12 00:28:22.970 -0700,
	POWCHK enabled, PULCHK disabled,
       configuration hash MD5:
       C8 4E 4E 5D D3 5C D8 9E 9F 52 82 E0 59 8A DE 15
       data hash MD5: 64K
       84 02 E5 B0 1C 25 08 44 6C 7C 46 BD C5 F5 4C EE>)
(   2,<2013-10-12 00:39:55.642 -0700>,<Administrator>,<X>,<proc1d>,<TOPSPIN 2.1>,
      <Start of raw data processing
       efp LB = 0.3 FT_mod = 6 PKNL = 1 PHC0 = 0 PHC1 = 0 SI = 128K 
       data hash MD5: 128K
       2B 96 FA 25 F6 C5 65 A6 BD 21 03 3C 8B A0 10 A9>)
(   3,<2013-10-12 00:39:56.564 -0700>,<Administrator>,<X>,<proc1d>,<TOPSPIN 2.1>,
      <pk PHC0 = -82.89734 PHC1 = 0 
       data hash MD5: 128K
       04 B1 A0 CE CF 32 94 45 E0 39 87 F0 18 39 1A E5>)
(   4,<2013-10-12 00:39:57.001 -0700>,<Administrator>,<X>,<proc1d>,<TOPSPIN 2.1>,
      <abs ABSG = 1 
       data hash MD5: 128K
       3B 0D 94 F0 88 A8 2A 69 47 16 C8 AF 63 4F ED 40>)
(   5,<2013-10-12 00:39:57.095 -0700>,<Administrator>,<X>,<proc1d>,<TOPSPIN 2.1>,
      <abs ABSG = 2 
       data hash MD5: 128K
       33 05 B5 15 D1 9D E1 5E BC ED 0C 0F 37 0C FA B6>)
(   6,<2013-10-12 00:39:57.173 -0700>,<Administrator>,<X>,<proc1d>,<TOPSPIN 2.1>,
      <abs ABSG = 3 
       data hash MD5: 128K
       38 66 06 1F 5F 68 57 61 11 79 C0 06 21 F4 1C 33>)
(   7,<2013-10-12 00:39:57.267 -0700>,<Administrator>,<X>,<proc1d>,<TOPSPIN 2.1>,
      <abs ABSG = 4 
       data hash MD5: 128K
       21 B3 D3 40 DF DF 30 D5 F4 74 58 5C 5B 73 7A 69>)
(   8,<2013-10-12 00:39:57.345 -0700>,<Administrator>,<X>,<proc1d>,<TOPSPIN 2.1>,
      <abs ABSG = 5 
       data hash MD5: 128K
       B4 67 53 52 56 50 5B ED 59 19 31 2D AB E0 7C CE>)
$$ ##END=
$$ 
$$ $$ hash MD5
$$ $$ A1 FE E7 8C 55 B2 78 E9 7E B5 49 EE 76 14 87 12
##$RELAX= 
##$RELAX= 
##$RELAX= 
##$RELAX= 
##$RELAX= 
##$RELAX= 
##$RELAX= 
##$RELAX= 
$$ Bruker specific parameters
$$ --------------------------
##$DU= <E:\>
##$EXPNO= 12
$$ [...]
##$TP07= 0
##$TPNAME0= <>
##$TPNAME1= <>
##$TPNAME2= <>
##$TPNAME3= <>
##$TPNAME4= <>
##$TPNAME5= <>
##$TPNAME6= <>
##$TPNAME7= <>
##$TPOAL= (0..7)
0.5 0.5 0.5 0.5 0.5 0.5 0.5 0.5
##$TPOFFS= (0..7)
0 0 0 0 0 0 0 0
##$TUNHIN= 0
##$TUNHOUT= 0
##$TUNXOUT= 0
##$USERA1= <user>
##$USERA2= <user>
##$USERA3= <user>
##$USERA4= <user>
##$USERA5= <user>
##$V9= 5
##$VALIST= <valist>
##$VCLIST= <CCCCCCCCCCCCCCC>
##$VD= 0
##$VDLIST= <DDDDDDDDDDDDDDD>
##$VPLIST= <PPPPPPPPPPPPPPP>
##$VTLIST= <TTTTTTTTTTTTTTT>
##$WBST= 1024
##$WBSW= 4
##$XGAIN= (0..3)
0 0 0 0
##$XL= 0
##$YL= 0
##$YMAX_a= 6166865
##$YMIN_a= -13529105
##$ZGOPTNS= <>
##$ZL1= 120
##$ZL2= 120
##$ZL3= 120
##$ZL4= 120
##$ABSF1= 14.96094
##$ABSF2= -5.597241
##$ABSG= 5
##$ABSL= 3
##$ALPHA= 0
##$AQORDER= 0
##$ASSFAC= 0
##$ASSFACI= 0
##$ASSFACX= 0
##$ASSWID= 0
##$AUNMP= <proc_prof1d_extract.lims>
##$AXLEFT= 0
##$AXNAME= <>
##$AXNUC= <1H>
##$AXRIGHT= 0
##$AXTYPE= 0
##$AXUNIT= <>
##$AZFE= 0.1
##$AZFW= 0.1
##$BCFW= 0
##$BC_mod= 0
##$BYTORDP= 0
##$COROFFS= 0
##$CY= 15
##$DATMOD= 1
##$DC= 0
##$DFILT= <>
##$DTYPP= 0
##$F1P= 0
##$F2P= 0
##$FCOR= 0.5
##$FTSIZE= 131072
##$FT_mod= 6
##$GAMMA= 0
##$GB= 0
##$INTBC= 1
##$INTSCL= 1
##$ISEN= 128
##$LB= 0.3
##$LEV0= 0
##$LPBIN= 0
##$MAXI= 10000
##$MC2= 0
##$MEAN= 0
##$ME_mod= 0
##$MI= 0
##$NCOEF= 0
##$NC_proc= -2
##$NLEV= 6
##$NOISF1= 0
##$NOISF2= 0
##$NSP= 0
##$NTH_PI= 0
##$NZP= 0
##$OFFSET= 14.96094
##$PC= 1
##$PHC0= -82.89734
##$PHC1= 0
##$PH_mod= 1
##$PKNL= yes
##$PPARMOD= 0
##$PPDIAG= 0
##$PPIPTYP= 0
##$PPMPNUM= 2147483647
##$PPRESOL= 1
##$PSCAL= 4
##$PSIGN= 0
##$PYNMP= <proc.py>
##$REVERSE= no
##$SF= 400.020009659282
##$SI= 131072
##$SIGF1= 0
##$SIGF2= 0
##$SINO= 400
##$SIOLD= 131072
##$SPECTYP= <>
##$SREGLST= <1H.CDCl3>
##$SSB= 0
##$STSI= 131072
##$STSR= 0
##$SW_p= 8223.68421052631
##$SYMM= 0
##$S_DEV= 0
##$TDeff= 65536
##$TDoff= 0
##$TI= <>
##$TILT= no
##$TM1= 0
##$TM2= 0
##$TOPLEV= 0
##$USERP1= <user>
##$USERP2= <user>
##$USERP3= <user>
##$USERP4= <user>
##$USERP5= <user>
##$WDW= 1
##$XDIM= 131072
##$YMAX_p= 392722955
##$YMIN_p= -11897
##$CURPLOT= <Network HP LaserJet P1505>
##$CURPRIN= <$Network HP LaserJet P1505>
##$DFORMAT= <normdp>
##$LAYOUT= <+/1D_H.xwp>
##$LFORMAT= <normlp>
##$PFORMAT= <normpl>
##$SURQMSG= 1
$$ End of Bruker specific parameters
$$ ---------------------------------
##NTUPLES= NMR SPECTRUM
##VAR_NAME=  FREQUENCY,     SPECTRUM/REAL,   SPECTRUM/IMAG
##SYMBOL=    X,             R,               I
##VAR_TYPE=  INDEPENDENT,   DEPENDENT,       DEPENDENT
##VAR_FORM=  AFFN,          ASDF,            ASDF
##VAR_DIM=   131072,        131072,          131072
##UNITS=     HZ,            ARBITRARY UNITS, ARBITRARY UNITS
##FACTOR=    0.0627417313425164, 1,          1
##FIRST=     8223.62146879497, -4878,        -64361
##LAST=      0,             -3274,           -65577
##MIN=       0,             -11897,          0
##MAX=       8223.62146879497, 392722955,    0
$$ Real data points
##PAGE= N=1
##DATA TABLE= (X++(R..R)), XYDATA
$$ [...]
$$ plain form
63838 1531195 1492362 1450059 1404139 1354420 1301424 1246050 1188949 1130634 1071963 1014063 957865
63827 957865 903943 852737 804631 759848 718467 680571 646204 615199 587134 561484 537775
63816 537775 515725 495351 476914 460629 446358 433603 421851 410915 400936 392025 384006 376616
63804 376616 369898 364179 359559 355658 351978 348335 344722 340943 336666 331861 326974 322596 318954 315648
63790 315648 311924 307395 302538 298263 294981 292446 290533 289511 289215 288559 286576 283607 280772 278480 276241
63775 276241 273882 272081 271424 271526 271474 270759 269542 268300 267396 266761 265934 264638 263315 262691 262829 263030 262701
63758 262701 261855 260715 259368 258040 257194 257060 257433 258142 259301 260839 262219 262959 263094 262843 262214 261291 260542
63741 260542 260387 260681 261062 261674 263092 265586 268746 271852 274456 276668 279046 282064 285585 289020 292098
$$ packed form
63838A531195l8833m2303m5920m9719n2996n5374n7101n8315n8671n7900n6198
63827I57865n3922n1206m8106m4783m1381l7896l4367l1005k8065k5650k3709
63816E37775k2050k0374j8437j6285j4271j2755j1752j0936r979q911q019p390
63804C76616o718n719m620l901l680l643l613l779m277m805m887m378l642l306
63790C15648l724m529m857m275l282k535j913j022k96o56j983k969k835k292k239
63775B76241k359j801o57J02n2p15j217j242r04o35q27j296j323o24J38K01l29
63758B62701q46j140j347j328q46j34L73P09J159J538J380P40J35k51o29r23p49
63741B60542j55K94L81O12J418K494L160L106K604K212K378L018L521L435L078
$$ plain form
63726 292098 295169 298590 302183 305633 309084 312929 317190 321557 325934 330517 335371 340280 345031 349502
63712 349502 353409 356243 357593 357378 355770 353009 349378 345232 341080 337557 335130 333662 332473 330997
63698 330997 329266 327672 326493 325889 326071 327070 328530 330161 332285 335423 339318 342953 345706 348042 350683
63683 350683 353510 355788 357313 358745 360705 362952 364779 365962 366950 368118 369216 369715 369597 369524 370265 372051
63667 372051 374523 377167 379749 382381 385228 388131 390477 391553 391098 389574 387802 386216 384419 381588
63653 381588 377327 372026 366278 360274 354063 348201 343532 340313 338080 336546 335979 336419 337199 337810 338721
63638 338721 340678 343638 347168 351469 357012 363310 369177 374294 379494 385232 390799 395588 400132 405184
63624 405184 410516 415574 420762 427127 434902 443301 451813 461027 471990 485156 500124 516154 532852
$$ packed form
63726B92098L071L421L593L450L451L845M261M367M377M583M854M909M751M471
63712C49502L907K834J350k15j608k761l631m146m152l523k427j468j189j476
63698C30997j731j594j179o04J82R99J460J631K124L138L895L635K753K336K641
63683C50683K827K278J525J432J960K247J827J183R88J168J098M99j18p3P41J786
63667C72051K472K644K582K632K847K903K346J076m55j524j772j586j797k831
63653C81588m261n301n748o004o211n862m669l219k233j534n67M40P80O11R11
63638C38721J957K960L530M301N543O298N867N117N200N738N567M789M544N052
63624D05184N332N058N188O365P775Q399Q512R214J0963J3166J4968J6030J6698
$$ plain form
63611 532852 550525 569858 591196 614313 638952 665207 693092 722104 751623 781472 811572
63600 811572 841149 868711 892764 912164 926011 933823 936022 933896 928880 921995 913924 905235 896334
63587 896334 887290 877774 867143 854648 839722 822080 801570 778208 752577 725991 699919 675265
63575 675265 652303 631178 612189 595645 581653 570102 560784 553628 548844 546621 546552 547645 549087
63562 549087 550842 553300 556701 561185 567129 574914 584365 594705 605160 615539 626441 639108 654905
63549 654905 674623 698269 725548 756324 790526 827936 868366 911810 958107 1006487 1055225
63538 1055225 1101140 1139361 1164738 1174782 1171405 1159369 1143119 1125264 1107292 1090443 1075555
63527 1075555 1062656 1051083 1039736 1027251 1012309 993959 971600 944905 914058 879854 843311
$$ packed form
63611E32852J7673J9333K1338K3117K4639K6255K7885K9012K9519K9849L0100
63600H11572K9577K7562K4053J9400J3847P812K199k126n016o885q071q689q901
63587H96334r044r516j0631j2495j4926j7642k0510k3362k5631k6586k6072k4654
63575F75265k2962k1125j8989j6544j3992j1551r318p156m784k223o9J093J442
63562E49087J755K458L401M484N944P785R451J0340J0455J0379J0902J2667J5797
63549F54905J9718K3646K7279L0776L4202L7410M0430M3444M6297M8380M8738
63538A055225M5915L8221K5377J0044l377j2036j6250j7855j7972j6849j4888
63527A075555j2899j1573j1347j2485j4942j8350k2359k6695l0847l4204l6543
$$ plain form
63516 843311 805457 767681 731628 698089 666453 636004 607383 581911 559831 540268 522738
63505 522738 507503 494346 482220 470507 459641 450006 441125 432486 424357 417172 410749 404747 399355
63492 399355 394912 391318 388338 386025 384328 382768 381093 379909 380062 381721 384462 387879 391587 395068
63478 395068 398185 401589 405966 411091 416161 420834 425329 429690 433614 436911 439539 441202 441545 440771 439571
63463 439571 438361 437031 435449 433699 431715 429225 426313 423646 421862 420926 420320 419664 419024 418710 418914 419424
63447 419424 419719 419494 419180 419836 422493 427595 434942 444035 454573 466814 481489 499280 520444 544902
63433 544902 572475 602904 635986 672027 711834 755560 801192 844339 879893 904412 917572
63422 917572 921789 920418 916094 910561 905627 903503 905967 913742 927045 946111 970543 998631 1028185
$$ packed form
63516H43311l7854l7776l6053l3539l1636l0449k8621k5472k2080j9563j7530
63505E22738j5235j3157j2126j1713j0866r635q881q639q129p185o423o002n392
63492C99355m443l594k980k313j697j560j675j184J53J659K741L417L708L481
63478C95068L117L404M377N125N070M673M495M361L924L297K628J663L43p74j200
63463D39571j210j330j582j750j984k490k912k667j784r36o06o56o40l14K04N10
63447D19424K95k25l14O56K657N102P347R093J0538J2241J4675J7791K1164K4458
63433E44902K7573L0429L3082L6041L9807M3726M5632M3147L5554K4519J3160
63422I17572M217j371m324n533m934k124K464P775J3303J9066K4432K8088K9554
$$ plain form
63409 1028185 1057903 1087124 1114393 1137303 1154060 1164488 1169231 1168768 1163702 1155350 1145292 1134513
63397 1134513 1123291 1111526 1098608 1083272 1064208 1040889 1013519 982416 947962 911098 873346
63386 873346 836147 800355 766375 734408 704467 676424 650350 626794 606502 589741 575923
63375 575923 564086 553845 545749 540497 537982 537451 538555 541685 547126 554464 563230 573729 586743
63362 586743 602657 621351 642717 666707 692973 721061 750973 783087 817468 853694 891327
63351 891327 929995 968901 1006773 1042506 1075395 1104573 1128773 1146990 1159004 1165006 1165289 1160691
63339 1160691 1152860 1143456 1133195 1122021 1109783 1096254 1080832 1062854 1042070 1018343 991223 960531
63327 960531 927210 892850 858480 824580 792161 762846 737618 716339 698802 685429 676512 671627
$$ packed form
63409A028185K9718K9221K7269K2910J6757J0428M743m63n066q352j0058j0779
63397A134513j1222j1765j2918j5336j9064k3319k7370l1103l4454l6864l7752
63386H73346l7199l5792l3980l1967k9941k8043k6074k3556k0292j6761j3818
63375E75923j1837j0241q096n252k515n31J104L130N441P338Q766J0499J3014
63362E86743J5914J8694K1366K3990K6266K8088K9912L2114L4381L6226L7633
63351H91327L8668L8906L7872L5733L2889K9178K4200J8217J2014O002K83m598
63339A160691p831r404j0261j1174j2238j3529j5422j7978k0784k3727k7120l0692
63327I60531l3321l4360l4370l3900l2419k9315k5228k1279j7537j3373q917m885
$$ plain form
63315 671627 670334 672358 676013 677041 670473 654023 629233 599612 568468 538346 511135 487753
63303 487753 467955 450941 436173 423572 413182 404830 398004 392071 386697 381952 377856 374039 370113
63290 370113 366119 362243 358388 354539 351283 349193 347713 345506 342125 338598 336049 334427 333057 331749
63276 331749 330670 329579 328070 326497 325899 326805 328601 330287 331493 332523 333667 334789 335634 336318 337353
63261 337353 339129 341545 344226 347042 350199 353883 358025 362455 367001 371443 375642 379762 384109 388683
63247 388683 393255 397890 402954 408434 413803 418920 424582 431583 439567 447523 455353 464214 475104 487628
63233 487628 500502 512977 525453 538800 553335 568513 583550 598246 613101 628658 644980
63222 644980 661907 679495 697778 716254 734116 751114 767792 784689 801669 818238 834211
$$ packed form
63315F71627j293K024L655J028o568j6450k4790k9621l1144l0122k7211k3382
63303D87753j9798j7014j4768j2601j0390q352o826n933n374m745m096l817l926
63290C70113l994l876l855l849l256k090j480k207l381l527k549j622j370j308
63276C31749j079j091j509j573n98R06J796J686J206J030J144J122Q45O84J035
63261C37353J776K416K681K816L157L684M142M430M546M442M199M120M347M574
63247C88683M572M635N064N480N369N117N662P001P984P956P830Q861J0890J2524
63233D87628J2874J2475J2476J3347J4535J5178J5037J4696J4855J5557J6322
63222F44980J6927J7588J8283J8476J7862J6998J6678J6897J6980J6569J5973
$$ plain form
63211 834211 849642 864176 876831 886458 892295 894088 891928 886070 876778 864246 848749 830930 811856
63198 811856 792660 774152 756833 741224 727964 717498 709818 704688 702049 702088 704998 710866 719779
63185 719779 731768 746607 763887 783496 805809 831162 859161 888670 918513 948147 977724
63174 977724 1007645 1037993 1068263 1097658 1125705 1152475 1178053 1201888 1222907 1240264 1253679
63163 1253679 1262930 1267298 1265892 1258440 1245397 1227114 1203274 1173485 1138337 1099402 1058138 1015116
63151 1015116 970553 925255 880603 837757 797286 759570 725091 694186 666779 642600 621394
63140 621394 602765 586063 570781 556992 545114 535200 526720 519133 512525 507440 504048 501638 499196
63127 499196 496440 494068 492849 492793 493462 494746 496800 499330 501620 503494 505711 509004 513078 516937 520010
$$ packed form
63211H34211J5431J4534J2655R627N837J793k160n858r292j2532j5497j7819j9074
63198H11856j9196j8508j7319j5609j3260j0466p680n130k639L9K910N868Q913
63185G19779J1989J4839J7280J9609K2313K5353K7999K9509K9843K9634K9577
63174I77724K9921L0348L0270K9395K8047K6770K5578K3835K1019J7357J3415
63163A253679R251M368j406p452j3043j8283k3840k9789l5148l8935m1264m3022
63151A015116m4563m5298m4652m2846m0471l7716l4479l0905k7407k4179k1206
63140F21394j8629j6702j5282j3789j1878r914q480p587o608n085l392k410k442
63127D99196k756k372j219n6O69J284K054K530K290J874K217L293M074L859L073
$$ plain form
63112 520010 522528 524988 527631 530460 533388 536270 538965 541452 543790 545998 548043 549802 550969 551209
63098 551209 550708 550373 551148 553134 555681 558277 560972 563856 566642 569125 571740 575131 579167 582773 584927
63083 584927 585488 584826 583021 579941 576051 572458 569882 568075 566705 566413 568315 572522 577794 582797 587217
63068 587217 591575 596530 602674 610459 619799 629961 640270 650827 662306 675257 689916 706508
63056 706508 725315 746454 769853 795456 823227 852996 884431 917147 950814 985347 1021144
63045 1021144 1058911 1099008 1141030 1184133 1227620 1271078 1314228 1356908 1399121 1440931 1482443
63034 1482443 1523936 1565736 1607741 1649298 1689651 1728100 1763583 1794573 1819790 1838567 1850164
63023 1850164 1853300 1847159 1832491 1810877 1783034 1748705 1708257 1663534 1616921 1570296 1525156 1483032
$$ packed form
63112E20010K518K460K643K829K928K882K695K487K338K208K045J759J167K40
63098E51209n01l35P75J986K547K596K695K884K786K483K615L391M036L606K154
63083E84927N61o62j805l080l890l593k576j807j370k92J902M207N272N003M420
63068E87217M358M955O144P785R340J0162J0309J0557J1479J2951J4659J6592
63056G06508J8807K1139K3399K5603K7771K9769L1435L2716L3667L4533L5797
63045A021144L7767M0097M2022M3103M3487M3458M3150M2680M2213M1810M1512
63034A482443M1493M1800M2005M1557M0353L8449L5483L0990K5217J8777J1597
63023A850164L136o141j4668k1614k7843l4329m0448m4723m6613m6625m5140m2124
$$ plain form
63011 1483032 1445160 1412120 1384328 1362651 1348137 1341261 1341722 1348898 1362310 1381777 1407336 1438917
62999 1438917 1475987 1517552 1562590 1610408 1660626 1713017 1767349 1823128 1879403 1935064 1989403
62988 1989403 2042260 2093584 2143096 2190413 2235166 2276780 2314150 2345560 2368878 2382045 2383774
62977 2383774 2373843 2352496 2319678 2275194 2219574 2154343 2081369 2002374 1919176 1833869 1748369
62966 1748369 1664051 1582069 1503743 1430267 1362170 1299250 1240937 1186676 1136269 1090036 1048416
62955 1048416 1011203 977428 946173 917207 890601 866028 842840 820658 799491 779347 760080
62944 760080 741571 723815 706781 690462 675074 661000 648403 636993 626196 615542 604930
62933 604930 594565 584708 575568 567553 561401 557615 555661 554109 551927 549444 547774 547416 547687 547470 546199
$$ packed form
63011A483032l7872l3040k7792k1677j4514o876M61P176J3412J9467K5559L1581
62999A438917L7070M1565M5038M7818N0218N2391N4332N5779N6275N5661N4339
62988A989403N2857N1324M9512M7317M4753M1614L7370L1410K3318J3167J729
62977B383774r931k1347l2818m4484n5620o5231p2974p8995q3198q5307q5500
62966A748369q4318q1982p8326p3476o8097o2920n8313n4261n0407m6233m1620
62955A048416l7213l3775l1255k8966k6606k4573k3188k2182k1167k0144j9267
62944G60080j8509j7756j7034j6319j5388j4074j2597j1410j0797j0654j0612
62933F04930j0365r857r140q015o152l786j954j552k182k483j670l58K71k17j271
$$ plain form
62918 546199 544132 541961 540301 539406 539164 539238 539267 539112 539078 539710 541102 542430 542523 540969 538374 535514 532631
62901 532631 529753 527186 525231 523670 522001 520113 518434 517489 517618 518952 521221 523587 525099 525450 525085
62886 525085 524565 524094 523624 523030 522074 520595 518923 517859 517969 519065 520529 521897 522902 523236 522686 521455
62870 521455 519959 518278 516151 513565 510917 508372 505459 501712 497515 493842 491230 489450 488162 487346
62856 487346 486943 486632 486343 486559 487672 489312 490728 491602 492094 492384 492663 493308 494410 495277 495109 494169 493576
62839 493576 493874 494517 494949 495341 495902 496236 495942 495277 494664 494076 493483 493360 493990 494712 494736 494420 494843 496251 497873
62820 497873 499319 501155 503811 506781 509376 511617 513816 515826 517298 518399 519649 521228 522938 524765
62806 524765 527025 529885 533160 536724 540881 546140 552634 559836 566918 573423 579618 586123 593320 601304
$$ packed form
62918E46199k067k171j660q95k42P4K9j55l4O32J392J328R3j554k595k860k883
62901E32631k878k567j955j561j669j888j679r45J29J334K269K366J512L51l65
62886E25085n20m71m70n94r56j479j672j064J10J096J464J368J005L34n50j231
62870E21455j496j681k127k586k648k545k913l747m197l673k612j780j288q16
62856D87346m03l11k89K16J113J640J416Q74M92K90K79O45J102Q67j68r40n93
62839D93576K98O43M32L92N61L34k94o65o13n88n93j23O30P22K4l16M23J408J622
62820D97873J446J836K656K970K595K241K199K010J472J101J250J579J710J827
62806E24765K260K860L275L564M157N259O494P202P082O505O195O505P197P984
$$ plain form
62792 601304 610264 620480 631870 643992 656836 671291 688421 708461 730942 755718 783399 814711
62780 814711 849884 888863 931807 979065 1030731 1086434 1145526 1207329 1271208 1336426 1401867
62769 1401867 1465850 1526378 1581677 1630516 1672006 1705261 1729359 1743522 1747205 1740199 1722838 1696056
62757 1696056 1660968 1618376 1568925 1513728 1454547 1393187 1330910 1268595 1207255 1148031 1091716
62746 1091716 1038524 988378 941241 897159 856213 818607 784655 754512 727958 704536 683934
62735 683934 666151 651245 638920 628413 618843 609769 601398 594248 588652 584597 581898 580312 579543
62722 579543 579367 579900 581586 584813 589644 596003 603970 613670 624931 637305 650558 665018 681380
62709 681380 700207 721667 745654 772147 801563 834852 873063 916629 965140 1018055 1075617
$$ packed form
62792F01304Q960J0216J1390J2122J2844J4455J7130K0040K2481K4776K7681L1312
62780H14711L5173L8979M2944M7258N1666N5703N9092O1803O3879O5218O5441
62769A401867O3983O0528N5299M8839M1490L3255K4098J4163L683p006j7361k6782
62757A696056l5088m2592m9451n5197n9181o1360o2277o2315o1340n9224n6315
62746A091716n3192n0146m7137m4082m0946l7606l3952l0143k6554k3422k0602
62735F83934j7783j4906j2325j0507r570r074q371p150n596m055k699j586p69
62722E79543j76N33J686L227M831O359P967R700J1261J2374J3253J4460J6362
62709F81380J8827K1460K3987K6493K9416L3289L8211M3566M8511N2915N7562
$$ plain form
62698 1075617 1138755 1208089 1283348 1363944 1449640 1540233 1634828 1731954 1830321 1928862 2025929
62687 2025929 2118981 2205294 2282569 2348587 2400841 2437094 2456113 2457490 2440944 2406425 2354955
62676 2354955 2288897 2211170 2124309 2030301 1931100 1829133 1727226 1627840 1532296 1440921 1354028
62665 1354028 1272465 1196995 1127620 1063969 1006040 953967 907233 864813 826162 791482 760864
62654 760864 733680 709098 686759 666636 648578 632265 617440 603904 591417 579754 568767
62643 568767 558292 548168 538432 529431 521656 515493 511018 507858 505407 503368 501926 501154 500574 499751
62629 499751 498990 498750 498511 497062 494099 490802 488469 487144 485905 483978 481192 477852 474636 472289 471045
62614 471045 470562 470588 471263 472589 474245 476312 479545 484326 489851 495043 499900 505218 511321 517947 525289
$$ packed form
62698A075617O3138O9334P5259Q0596Q5696R0593R4595R7126R8367R8541R7067
62687B025929R3052Q6313P7275O6018N2254L6253J9019J377j6546l4519n1470
62676B354955o6058p7727q6861r4008r9201j01967j01907r9386r5544r1375q6893
62665A354028q1563p5470o9375o3651n7929n2073m6734m2420l8651l4680l0618
62654G60864k7184k4582k2339k0123j8058j6313j4825j3536j2487j1663j0987
62643E68767j0475j0124r736r001p775o163m475l160k451k039j442p72n80q23
62629D99751p61k40k39j449k963l297k333j325j239j927k786l340l216k347j244
62614D71045m83K6O75J326J656K067L233M781N525N192M857N318O103O626P342
$$ plain form
62599 525289 534215 545226 557853 571463 586239 603071 622755 645486 670897 698317 727155 757129
62587 757129 788076 819496 850402 879716 906689 930836 951465 967382 977263 980497 977613 969725
62575 969725 957572 941284 920943 896972 870053 841120 811533 782656 754947 727854 700963
62564 700963 674935 651021 629912 611319 594398 578340 562862 548477 536048 525906 517682 511083
62552 511083 506294 503328 501487 499880 498021 495613 492376 488627 485457 483672 482975 482825 483507 485475 488101
62537 488101 490150 491432 493009 495730 499348 503126 506542 509305 511469 513773 517339 522798 530100 539120
62523 539120 549906 562378 576418 592357 610803 631926 655422 681239 709832 741745 777434
62512 777434 817402 861846 910182 961517 1015455 1071724 1129147 1185898 1240821 1293525 1343078
$$ packed form
62599E25289Q926J1011J2627J3610J4776J6832J9684K2731K5411K7420K8838K9974
62587G57129L0947L1420L0906K9314K6973K4147K0629J5917R881L234k884p888
62575I69725j2153j6288k0341k3971k6919k8933k9587k8877k7709k7093k6891
62564G00963k6028k3914k1109j8593j6921j6058j5478j4385j2429j0142q224o599
62552E11083m789k966j841j607j859k408l237l749l170j785o97j50O82J968K626
62537D88101K049J282J577K721L618L778L416K763K164K304L566N459P302R020
62523E39120J0786J2472J4040J5939J8446K1123K3496K5817K8593L1913L5689
62512G77434L9968M4444M8336N1335N3938N6269N7423N6751N4923N2704M9553
$$ plain form
62501 1343078 1387591 1425378 1455556 1477203 1489036 1490624 1483107 1468095 1446586 1419567 1388815 1356287
62489 1356287 1323344 1291427 1262828 1239672 1222310 1209661 1201134 1197455 1199578 1207415 1219778 1235203
62477 1235203 1252792 1272452 1294111 1316376 1336196 1350344 1357176 1356857 1350322 1338458 1321694 1299462
62465 1299462 1270137 1232350 1186739 1136090 1083652 1031460 980062 929302 879209 830486 784384
62454 784384 742069 704189 671025 642644 618592 597879 579864 564926 553719 545876 540087 535404
62442 535404 531790 529361 527893 527420 528601 531825 536301 540667 544355 547834 551508 554861 556904 557154 555928
62427 555928 553827 551190 547948 543768 538318 531588 524095 516643 509709 503119 496440 489633 483140 477380
62413 477380 472344 467726 463312 459152 455472 452435 449971 447764 445464 442913 440200 437595 435449 433976
$$ packed form
62501A343078M4513L7787L0178K1647J1833J588p517j5012k1509k7019l0752l2528
62489A356287l2943l1917k8599k3156j7362j2649q527l679K123P837J2363J5425
62477A235203J7589J9660K1659K2265J9820J4148O832l19o535j1864j6764k2232
62465A299462k9325l7787m5611n0649n2438n2192n1398n0760n0093m8723m6102
62454G84384m2315l7880l3164k8381k4052k0713j8015j4938j1207p843n789m683
62442E35404l614k429j468m73J181L224M476M366L688L479L674L353K043K50j226
62427E55928k101k637l242m180n450o730p493p452o934o590o679o807o493n760
62413D77380n036m618m414m160l680l037k464k207k300k551k713k605k146j473
$$ plain form
62399 433976 433049 432362 431871 431885 432610 433920 435743 438328 441732 445413 448812 452156 456052 460387 464235 466955
62383 466955 468907 470957 473729 477420 481918 486931 492322 498294 504954 511850 518505 525311 533186 542305
62369 542305 551882 561403 571397 582711 595648 610151 626208 643719 662542 683116 706538 733614
62357 733614 764321 798565 836891 879875 927250 978096 1031515 1086645 1142498 1198266 1253378
62346 1253378 1306592 1355379 1396875 1429334 1452309 1465861 1470314 1466596 1456050 1439782 1418472 1392657
62334 1392657 1362723 1328728 1290756 1249526 1206397 1162780 1119758 1078158 1038707 1002101 968868
62323 968868 938945 911441 885292 860235 836685 814583 793040 771315 749428 727496 705360
62312 705360 683378 662737 644151 626949 610239 594367 580315 568256 557723 548659 541214 534821
$$ packed form
62399D33976r27o87m91J4P25J310J823K585L404L681L399L344L896M335L848K720
62383D66955J952K050K772L691M498N013N391N972O660O896O655O806P875R119
62369E42305R577R521R994J1314J2937J4503J6057J7511J8823K0574K3422K7076
62357G33614L0707L4244L8326M2984M7375N0846N3419N5130N5853N5768N5112
62346A253378N3214M8787M1496L2459K2975J3552M453l718j0546j6268k1310k5815
62334A392657k9934l3995l7972m1230m3129m3617m3022m1600l9451l6606l3233
62323I68868k9923k7504k6149k5057k3550k2102k1543k1725k1887k1932k2136
62312G05360k1982k0641j8586j7202j6710j5872j4052j2059j0533r064p445o393
$$ plain form
62300 534821 528673 522966 518586 515673 513476 511613 510408 509933 509686 509380 509198 509215 509384 510138 512073 514924
62284 514924 517773 520363 523258 526553 529473 531607 533577 536052 538887 541622 544129 546361 548210 550062
62270 550062 552819 556970 562202 568218 575244 583465 592786 603613 617088 634009 654135 677054 703082
62257 703082 732754 766111 803178 844586 890956 942015 996843 1054629 1114581 1175476 1235789
62246 1235789 1293966 1348114 1395883 1435306 1465504 1486142 1496637 1496605 1486779 1468744 1443696 1411936
62234 1411936 1373496 1328857 1279080 1225602 1169895 1113201 1056645 1001591 949473 901073 856372
62223 856372 815287 778094 744930 715500 689623 667476 648775 632304 616877 602330 588967
62212 588967 576546 564572 553222 543173 534677 527471 521341 516028 510815 505102 499385 494947 492447
$$ packed form
62300E34821o148n707m380k913k197j863j205m75k47l06j82J7J69P54J935K851
62284E14924K849K590K895L295K920K134J970K475K835K735K507K232J849J852
62270E50062K757M151N232O016P026Q221R321J0827J3475J6921K0126K2919K6028
62257G03082K9672L3357L7067M1408M6370N1059N4828N7786N9952O0895O0313
62246A235789N8177N4148M7769L9423L0198K0638J0495l2r826j8035k5048l1760
62234A411936l8440m4639m9777n3478n5707n6694n6556n5054n2118m8400m4701
62223H56372m1085l7193l3164k9430k5877k2147j8701j6471j5427j4547j3363
62212E88967j2421j1974j1350j0049q496p206o130n313n213n713n717m438k500
$$ plain form
62199 492447 491510 491669 492955 495358 498398 501636 505190 509437 514502 520277 526707 533886 541998 551200 561388
62184 561388 572190 583337 594876 606738 618351 629145 639232 649026 658273 666120 672264 677502
62172 677502 682904 688911 695482 702795 711581 722993 738237 758070 782451 810918 843323 879938
62160 879938 920681 964565 1010127 1056239 1102242 1147335 1190010 1228273 1260511 1286115 1305112
62149 1305112 1317375 1322731 1321942 1316837 1308768 1297276 1280947 1259396 1233753 1205382 1175070 1143633
62137 1143633 1112458 1082888 1055468 1030151 1006853 985483 965835 947838 931743 917786 905846
62126 905846 895583 886639 878533 870745 863267 856940 852905 851793 853466 857268 862304 867793 873516 879864
62112 879864 887167 895001 902230 907570 909967 908764 903981 896552 888061 880017 873293 868067 864153 861310
$$ packed form
62199D92447r37J59J286K403L040L238L554M247N065N775O430P179Q112R202J0188
62184E61388J0802J1147J1539J1862J1613J0794J0087R794R247P847O144N238
62172F77502N402O007O571P313Q786J1412J5244J9833K4381K8467L2405L6615
62160H79938M0743M3884M5562M6112M6003M5093M2675L8263L2238K5604J8997
62149A305112J2263N356p89n105q069j1492j6329k1551k5643k8371l0312l1437
62137A143633l1175k9570k7420k5317k3298k1370j9648j7997j6095j3957j1940
62126I05846j0263q944q106p788p478o327m035j112J673L802N036N489N723O348
62112H79864P303P834P229N340K397j203m783p429q491q044o724n226l914k843
$$ plain form
62098 861310 859246 857402 855067 852024 849049 847406 847805 850092 854000 859764 867740 877726 889004 901002
62084 901002 913733 927648 943124 960017 977755 996102 1015800 1038031 1063126 1090249 1118531
62073 1118531 1147963 1178698 1209958 1240336 1269008 1296039 1321496 1344933 1365939 1384720 1401888
62062 1401888 1418029 1433745 1449861 1467179 1485989 1505924 1526311 1546663 1566851 1586790 1605870
62051 1605870 1622843 1636432 1645921 1650987 1651164 1645912 1635118 1619026 1597471 1569652 1534888 1493383
62039 1493383 1446051 1394003 1338498 1281064 1223154 1165673 1109111 1054001 1000986 950602 903409
62028 903409 860183 821553 787397 757025 729956 706083 685033 665978 648390 632469 618373
62017 618373 605409 592626 580035 568601 558986 550805 543255 535950 528878 522018 515486 509860 505890
$$ packed form
62098H61310k064j844k335l043k975j643L99K287L908N764P976R986J1278J1998
62084I01002J2731J3915J5476J6893J7738J8347J9698K2231K5095K7123K8282
62073A118531K9432L0735L1260L0378K8672K7031K5457K3437K1006J8781J7168
62062A401888J6141J5716J6116J7318J8810J9935K0387K0352K0188J9939J9080
62051A605870J6973J3589R489N066J77n252j0794j6092k1555k7819l4764m1505
62039A493383m7332n2048n5505n7434n7910n7481n6562n5110n3015n0384m7193
62028I03409m3226l8630l4156l0372k7069k3873k1050j9055j7588j5921j4096
62017F18373j2964j2783j2591j1434r615q181p550p305p072o860o532n626l970
$$ plain form
62004 505890 503871 503545 504587 506862 510174 514045 517962 521791 525820 530400 535500 540530 544595 547070
61990 547070 547973 547819 547123 546048 544384 541709 537657 532258 525974 519233 512039 504355 496842 490699 486550
61975 486550 483803 481370 478712 475888 473039 470448 468820 468762 469940 471396 472813 474711 477191 479305 480228
61960 480228 480341 480385 480118 478839 476930 475761 475946 476747 477477 478525 480461 482947 485326 487781 491099 495603
61944 495603 501122 507863 516532 527441 540058 553584 567595 581988 596721 611855 627640 644342
61932 644342 662022 680352 698558 715635 730964 744631 756918 767616 776195 782550 787078 789918
61920 789918 790552 788462 783952 778076 771864 765747 759662 753590 748015 743844 741882 742388 745240 750368 757929
61905 757929 768121 780874 795564 810956 825749 839368 851934 863237 872209 877810 879971 879100
$$ packed form
62004E05890k019l26J042K275L312L871L917L829M029M580N100N030M065K475
61990E47070R03j54o96j075j664k675m052n399o284o741p194p684p513o143m149
61975D86550k747k433k658k824k849k591j628n8J178J456J417J898K480K114R23
61960D80228J13M4k67j279j909j169J85Q01P30J048J936K486K379K455L318M504
61944D95603N519O741Q669J0909J2617J3526J4011J4393J4733J5134J5785J6702
61932F44342J7680J8330J8206J7077J5329J3667J2287J0698Q579O355M528K840
61920G89918O34k090m510n876o212o117o085o072n575m171j962N06K852N128P561
61905G57929J0192J2753J4690J5392J4793J3619J2566J1303Q972N601K161q71
$$ plain form
61893 879100 875059 867481 856872 844493 831129 816849 802073 787890 774944 762834 751127 740255
61881 740255 730744 722124 713302 703786 693970 684435 675404 666749 658135 649294 640418 632132 624889 618640
61867 618640 613177 608403 604149 600311 597472 596748 598511 601821 605713 610597 617668 627350 639125 652638
61853 652638 668087 685567 704868 726135 750074 777166 807047 838815 871625 904854 937958
61842 937958 970268 1000827 1028565 1052878 1073863 1091605 1105370 1113978 1117009 1115340 1110508 1103776
61830 1103776 1095727 1086468 1076281 1066278 1058221 1053469 1052321 1054607 1060409 1069611 1081087 1093005 1103797
61817 1103797 1112364 1117669 1118911 1115961 1108855 1097002 1079669 1057221 1030960 1001714 969555 935127
61805 935127 900225 866558 834695 804652 776735 751162 727551 705560 685583 668090 652652
$$ packed form
61893H79100m041p578j0609j2379j3364j4280j4776j4183j2946j2110j1707j0872
61881G40255r511q620q822r516r816r535r031q655q614q841q876q286p243o249
61867F18640n463m774m254l838k839p24J763L310L892M884P071R682J1775J3513
61853F52638J5449J7480J9301K1267K3939K7092K9881L1768L2810L3229L3104
61842I37958L2310L0559K7738K4313K0985J7742J3765Q608L031j669m832o732
61830A103776q049r259j0187j0003q057m752j148K286N802R202J1476J1918J0792
61817A103797Q567N305J242k950p106j1853j7333k2448k6261k9246l2159l4428
61805I35127l4902l3667l1863l0043k7917k5573k3611k1991j9977j7493j5438
$$ plain form
61794 652652 638307 624760 612565 602214 593577 586221 579874 574567 570537 567878 566055 564045 561324
61781 561324 558486 556510 555560 554922 553978 552767 551545 550270 548701 546841 545069 543861 543311 542996 542468 541941
61765 541941 542148 543314 544598 544948 544349 543857 544446 546188 548566 551227 554149 557222 559908 561616 562506 563724
61749 563724 566456 570656 575013 578339 580684 582933 585668 588748 591731 594219 595929 596872 597540 598541 599911
61734 599911 601025 601344 601149 601368 602618 604481 605877 606209 605971 605987 606262 606095 605320 604842 605615 607568 609823
61717 609823 611621 612642 612886 612826 613371 615014 617026 618049 617466 615722 613300 609966 605261 599271 592674
61702 592674 586177 580102 574327 568571 562898 557906 554140 551346 548659 545545 542235 539152 536329 533619
61688 533619 531114 529048 527462 526227 525238 524314 522991 520746 517518 513920 510792 508487 506549 504198 501153
$$ packed form
61794F52652j4345j3547j2195j0351q637p356o347n307m030k659j823k010k721
61781E61324k838j976r50o38r44j211j222j275j569j860j772j208n50l15n28n27
61765E41941K07J166J284L50n99m92N89J742K378K661K922L073K686J708Q90J218
61749E63724K732M200M357L326K345K249K735L080K983K488J710R43O68J001J370
61734E99911J114L19j95K19J250J863J396L32k38J6K75j67p75m78P73J953K255
61717F09823J798J021K44o0N45J643K012J023n83j744k422l334m705n990o597
61702E92674o497o075n775n756n673m992l766k794k687l114l310l083k823k710
61688E33619k505k066j586j235r89r24j323k245l228l598l128k305j938k351l045
$$ plain form
61673 501153 497889 494946 492223 489245 485999 483018 480607 478425 476039 473531 471336 469737 468769 468335 468184
61658 468184 467970 467603 467295 467080 466633 465878 465400 465780 466825 468056 469639 472055 474906 477018 477994 478821 480429
61641 480429 482417 483913 485057 486691 488839 490605 491550 492163 492634 492172 490209 487605 485724 484623 483062
61626 483062 480261 476787 473503 470429 467214 464150 461946 460628 459365 457584 455712 454494 453948 453389 452283
61611 452283 450602 448399 445582 442246 438820 435537 432036 427792 422788 417482 412282 407401 403082 399519
61597 399519 396541 393726 390865 387981 384910 381286 377108 372916 369213 366030 363214 360785 358737 356814
61583 356814 354758 352540 350122 347362 344439 341988 340345 338972 337146 334972 333169 332034 331277 330799 330853
61568 330853 331265 331213 330176 328645 327475 326835 326193 325138 323822 322689 322081 322064 322370 322484 322032 321141 320363
$$ packed form
61673E01153l264k943k723k978l246k981k411k182k386k508k195j599r68m34j51
61658D68184k14l67l08k15m47p55m78L80J045J231J583K416K851K112R76Q27J608
61641D80429J988J496J144J634K148J766R45O13M71m62j963k604j881j101j561
61626D83062k801l474l284l074l215l064k204j318j263j781j872j218n46n59j106
61611D52283j681k203k817l336l426l283l501m244n004n306n200m881m319l563
61597C99519k978k815k861k884l071l624m178m192l703l183k816k429k048j923
61583C56814k056k218k418k760k923k451j643j373j826k174j803j135p57m78N4
61568C30853M12n2j037j531j170o40o42j055j316j133o08j7L06J14m52q91p78
$$ plain form
61551 320363 320185 320687 321685 323053 324766 326617 328131 328960 329269 329507 329853 330194 330675 331789 333742 336096
61535 336096 338343 340451 342481 344094 345027 345852 347560 350376 353445 355714 356658 356208 354537 352077 349329
61520 349329 346515 343684 341077 338928 337042 335097 333410 332694 332961 333322 333153 332843 333005 333538 333878 333668
61504 333668 332722 330867 328406 326392 325719 326052 326201 325440 323953 322090 319868 317395 315241 313989 313563 313294
61488 313294 312671 311856 311438 311821 312985 314761 316988 319245 320788 321229 321125 321441 322467 323741 325012 326601
61472 326601 328598 330325 331114 331251 331649 332709 333920 334522 334329 333876 333841 334309 334685 334505 334107 334154 334646 334957
61454 334957 334847 334796 335187 335848 336602 337647 338985 340052 340389 340202 339913 339608 339356 339555 340465 341785 343145
61437 343145 344587 346214 347854 349560 351840 354780 357490 359201 360443 362326 364925 367257 368721 369764
$$ packed form
61551C20363j78N02R98J368J713J851J514Q29L09K38L46L41M81J114J953K354
61535C36096K247K108K030J613R33Q25J708K816L069K269R44m50j671k460k748
61520C49329k814k831k607k149j886j945j687p16K67L61j69l10J62N33L40k10
61504C33668r46j855k461k014o73L33J49p61j487j863k222k473k154j252m26k69
61488C13294o23q15m18L83J164J776K227K257J543M41j04L16J026J274J271J589
61472C26601J997J727P89J37L98J060J211O02j93m53l5M68L76j80l98M7M92L11
61454C34957j10n1L91O61P54J045J338J067L37j87k89l05k52J99R10J320J360
61437C43145J442J627J640J706K280K940K710J711J242J883K599K332J464J043
$$ plain form
61423 369764 371177 373363 376218 379135 381299 382553 383779 385797 388169 389929 391231 393256 396434 399746
61409 399746 401941 402667 402170 400732 398745 396688 394622 392230 389602 387377 385862 384566 383011 381472 380430
61394 380430 379682 378457 376329 373710 371534 370527 370632 371108 371323 371334 371489 371758 371879 371933 372141 372278 372005 371729
61376 371729 372295 373727 375084 375825 376536 377953 379964 382007 383821 385340 386432 387260 388454 390381 392590
61361 392590 394450 396039 397956 400551 403705 407072 410257 413122 416275 420814 427159 434486 441783 449064
61347 449064 456990 465646 474424 482970 491572 500550 509762 518825 527402 535188 542000 548012 553655 559130
61333 559130 564156 568201 570855 572030 571953 570951 569129 566371 562770 558928 555595 553053 551025 549137 547333
61318 547333 545895 545223 545538 546619 547821 548534 548780 549377 551377 555239 560546 566672 573616 581849 591281
$$ packed form
61423C69764J413K186K855K917K164J254J226K018K372J760J302K025L178L312
61409C99746K195P26m97j438j987k057k066k392k628k225j515j296j555j539j042
61394C80430p48j225k128k619k176j007J05M76K15J1J55K69J21N4K08J37k73k76
61376C71729N66J432J357P41P11J417K011K043J814J519J092Q28J194J927K209
61361C92590J860J589J917K595L154L367L185K865L153M539O345P327P297P281
61347D49064P926Q656Q778Q546Q602Q978R212R063Q577P786O812O012N643N475
61333E59130N026M045K654J175p7j002j822k758l601l842l333k542k028j888j804
61318E47333j438o72L15J081J202P13K46N97K000L862N307O126O944Q233R432
$$ plain form
61303 591281 600975 610272 619775 630617 642992 656011 668762 680636 690652 697448 700373 699969 697102
61290 697102 692213 685671 678107 669923 661008 651414 641806 632760 624111 615546 607369 600136 593976 588872
61276 588872 585219 583390 582988 583160 583563 584528 586464 589520 593611 598283 602853 607184 612047 618128 624983
61261 624983 631634 637938 644598 651960 659628 667260 675024 683213 692055 701891 712780 723829 733689 741841
61247 741841 748693 754294 757851 758908 758102 756175 752923 747763 740820 732809 724369 716219 709519 705093
61233 705093 702350 699794 696691 693616 691343 689937 689138 688994 689648 691004 693080 696386 701427 707948 715109
61218 715109 722324 729553 736846 744074 751226 758488 765776 772574 778562 784143 789831 795242 799259 801371
61204 801371 802436 803909 806568 810258 814637 819733 825826 833162 841954 852539 865342 880640 898385
$$ packed form
61303E91281R694R297R503J0842J2375J3019J2751J1874J0016O796K925m04k867
61290F97102m889o542p564q184q915r594r608r046q649q565q177p233o160n104
61276E88872l653j829m02J72M03R65J936L056M091M672M570M331M863O081O855
61261F24983O651O304O660P362P668P632P764Q189Q842R836J0889J1049R860Q152
61247G41841O852N601L557J057q06j927l252n160o943q011q440q150o700m426
61233G05093k743k556l103l075k273j406p99j44O54J356K076L306N041O521P161
61218G15109P215P229P293P228P152P262P288O798N988N581N688N411M017K112
61204H01371J065J473K659L690M379N096O093P336Q792J0585J2803J5298J7745
$$ plain form
61191 898385 918252 939794 962480 985601 1008360 1030210 1051003 1070573 1088293 1103374 1115657
61180 1115657 1125772 1134383 1141547 1146957 1150584 1152817 1154100 1154638 1154317 1152688 1149066 1142821 1133694 1121893
61166 1121893 1108020 1092832 1076767 1059589 1040734 1020151 998629 977138 956051 935109 913970
61155 913970 892633 871550 851504 833204 816859 802290 789479 778700 770019 763085 757651 753858
61143 753858 751635 750219 748732 746931 744837 741893 737221 730715 723311 716103 709729 704671 701502 700469
61129 700469 701269 703650 707990 714934 724611 736502 749993 764818 781068 799072 819354 842497 868868
61116 868868 898437 930810 965417 1001696 1039237 1077828 1117376 1157711 1198403 1238748 1277900
61105 1277900 1314990 1349183 1379891 1407051 1431054 1452171 1470128 1484389 1494636 1500626 1501692 1496898
$$ packed form
61191H98385J9867K1542K2686K3121K2759K1850K0793J9570J7720J5081J2283
61180A115657J0115Q611P164N410L627K233J283N38l21j629l622o245r127j1801
61166A121893j3873j5188j6065j7178j8855k0583k1522k1491k1087k0942k1139
61155I13970k1337k1083k0046j8300j6345j4569j2811j0779q681o934n434l793
61143G53858k223j416j487j801k094k944m672o506p404p208o374n058l169j033
61129G00469Q00K381M340O944R677J1891J3491J4825J6250J8004K0282K3143K6371
61116H68868K9569L2373L4607L6279L7541L8591L9548M0335M0692M0345L9152
61105A277900L7090L4193L0708K7160K4003K1117J7957J4261J0247N990J066m794
$$ plain form
61093 1496898 1485875 1469148 1447534 1421581 1391742 1358699 1323137 1285434 1245879 1205098 1164036
61082 1164036 1123602 1084471 1047106 1011728 978324 946793 917101 889367 863904 841050 820720
61071 820720 802306 785350 770151 757197 746160 736145 726910 719095 713122 708709 705731 704630 705444
61058 705444 707279 709429 712341 716728 722370 728594 735435 743429 752693 763115 775107 789208 805101
61045 805101 821981 839853 859662 882135 907219 934581 963860 994458 1025843 1058181 1092028
61034 1092028 1127381 1163628 1200408 1237855 1276028 1314749 1354035 1394129 1435089 1476844 1519536
61023 1519536 1563211 1607425 1651781 1696603 1742417 1789200 1837108 1887652 1943181 2005460 2075809
61012 2075809 2156298 2249482 2357171 2480880 2623604 2790117 2986222 3219776 3502519 3849011
$$ packed form
61093A496898j1023j6727k1614k5953k9839l3043l5562l7703l9555m0781m1062
61082A164036m0434l9131l7365l5378l3404l1531k9692k7734k5463k2854k0330
61071H20720j8414j6956j5199j2954j1037j0015r235p815n973m413k978j101Q14
61058G05444J835K150K912M387N642O224O841P994R264J0422J1992J4101J5893
61045H05101J6880J7872J9809K2473K5084K7362K9279L0598L1385L2338L3847
61034A092028L5353L6247L6780L7447L8173L8721L9286M0094M0960M1755M2692
61023A519536M3675M4214M4356M4822M5814M6783M7908N0544N5529O2279P0349
61012B075809Q0489R3184J07689J23709J42724J66513J96105K33554K82743L46492
$$ plain form
61002 3849011 4273944 4792716 5423998 6187348 7096244 8155904 9368069 10732321 12239910
60993 12239910 13873144 15615937 17451648 19324697 21094529 22550330 23509987 23931107
60985 23931107 23932787 23711972 23440504 23225631 23121435 23122590 23126295 22928981 22310346 21158019
60975 21158019 19529302 17604734 15588158 13635677 11840627 10247216 8865015 7681341
60967 7681341 6674832 5824770 5112042 4517222 4021683 3609615 3267304 2981509 2740006
60958 2740006 2532975 2352993 2194554 2054377 1931010 1822888 1727249 1641467 1564497 1496193
60948 1496193 1435998 1383098 1336909 1296309 1258994 1222636 1186337 1150194 1114056 1077710 1041893
60937 1041893 1007970 976619 947494 920010 893744 868268 843415 819699 797863 778042 759918
$$ packed form
61002C849011M24933N18772O31282P63350R08896J059660J212165J364252J507589
60993A2239910J633234J742793J835711J873049J769832J455801R59657M21120
60985B3931107J680k20815k71468k14873j04196J155L705j97314o18635j152327
60975B1158019j628717j924568k016576j952481j795050j593411j382201j183674
60967G681341j006509q50062p12728n94820m95539m12068l42311k85795k41503
60958B740006k07031j79982j58439j40177j23367j08122r5639q5782p6970o8304
60948A496193o0195n2900m6189m0600l7315l6358l6299l6143l6138l6346l5817
60937A041893l3923l1351k9125k7484k6266k5476k4853k3716k1836j9821j8124
$$ plain form
60926 759918 743447 728778 715542 702963 690679 678891 667734 657195 647595 639418 632505 626126
60914 626126 620098 615152 611835 609575 607361 604980 603121 602422 602851 603949 605340 606877 608480 609974 611164
60899 611164 612067 612878 613574 613666 612633 610562 608063 605582 603073 600346 597355 594067 590364 586240 581791
60884 581791 576914 571351 565224 559193 553807 548982 544449 540429 537441 535520 534091 532631 531178 530103
60870 530103 529669 529885 530603 531654 532987 534679 536713 538888 541197 544211 548712 554823 561760 568577 574958
60855 574958 581208 587740 594748 602111 609319 615657 620754 624962 629022 633447 638380 643857 649818 655800
60841 655800 660862 664046 664899 663641 660995 657854 654848 652083 649344 646595 644136 642230 640753 639416
60827 639416 638273 637730 637934 638308 638078 637363 637418 639352 642672 645526 646552 646145 645787 646602 648899 652563 657175
$$ packed form
60926G59918j6471j4669j3236j2579j2284j1788j1157j0539r600q177o913o379
60914F26126o028m946l317k260k214k381j859o99M29J098J391J537J603J494J190
60899F11164R03Q11O96R2j033k071k499k481k509k727k991l288l703m124m449
60884E81791m877n563o127o031n386m825m533m020k988j921j429j460j453j075
60870E30103m34K16P18J051J333J692K034K175K309L014M501O111O937O817O381
60855E74958O250O532P008P363P208O338N097M208M060M425M933N477N961N982
60841F55800N062L184Q53j258k646l141l006k765k739k749k459j906j477j337
60827F39416j143n43K04L74k30p15N5J934L320K854J026m07l58Q15K297L664M612
$$ plain form
60810 657175 661931 666158 670004 674130 678756 683634 688986 695698 704194 713771 723487 733195 743188 753305
60796 753305 763133 772861 783164 794163 805062 815000 823902 832371 841067 850338 860166 870299 880437
60783 880437 890314 899588 907909 915337 922483 929837 937009 943069 947653 951311 954591 957176 958280 957699
60769 957699 956158 954557 953119 951417 949193 946807 944661 942297 938536 932708 925336 917369 909129 900420
60755 900420 891272 881876 871940 860845 848572 835844 823158 810267 796914 783619 771325 760593
60743 760593 751423 743486 736129 728429 719716 710019 699771 689255 678574 667873 657249 646594 635848
60730 635848 625312 615466 606653 599115 593029 588106 583445 578281 572745 567438 562507 557778 553614 550743
60716 550743 549046 547292 544517 541058 537743 534622 531104 527048 523009 519528 516758 514705 513216 511630
$$ packed form
60810F57175M756M227L846M126M626M878N352O712Q496R577R716R708R993J0117
60796G53305R828R728J0303J0999J0899R938Q902Q469Q696R271R828J0133J0138
60783H80437R877R274Q321P428P146P354P172O060M584L658L280K585J104n81
60769I57699j541j601j438j702k224k386k146k364l761n828p372p967q240q709
60755I00420r148r396r936j1095j2273j2728j2686j2891j3353j3295j2294j0732
60743G60593r170p937p357p700q713r697j0248j0516j0681j0701j0624j0655j0746
60730F35848j0536r846q813p538o086m923m661n164n536n307m931m729m164k871
60716E50743j697j754k775l459l315l121l518m056m039l481k770k053j489j586
$$ plain form
60702 511630 509004 505007 500330 496000 492467 489472 486516 483261 479648 475913 472525 469955 468409 467674
60688 467674 467171 466263 464651 462529 460300 458290 456759 455944 455750 455596 454998 454286 454352 455576 457401 459048
60672 459048 460291 461327 462283 463075 463512 463322 462360 461022 460156 460341 461419 462882 464337 465386 465588 465061
60656 465061 464765 465577 467264 468896 470132 471535 473679 476558 479848 483208 486229 488647 490793 493358 496547
60641 496547 499770 502316 503913 504545 504199 503058 501572 500058 498477 496774 495127 493696 492402 491126 489877
60626 489877 488645 487397 486280 485466 484732 483613 482151 480952 480291 479627 478372 476675 475028 473477 471695
60611 471695 469581 467342 465178 463289 461941 461154 460505 459575 458423 457316 456298 455375 454781 454572 454216 453146
60595 453146 451578 450287 449667 449490 449471 449560 449731 449959 450424 451287 452244 452677 452292 451326 450220 449409 449243 449653
$$ packed form
60702E11630k626l997m677m330l533k995k956l255l613l735l388k570j546p35
60688D67674n03r08j612k122k229k010j531q15j94j54n98p12O6J224J825J647
60672D59048J243J036R56P92M37j90r62j338q66J85J078J463J455J049K02n27
60656D65061k96Q12J687J632J236J403K144K879L290L360L021K418K146K565L189
60641D96547L223K546J597O32l46j141j486j514j581j703j647j431j294j276j249
60626D89877j232j248j117q14p34j119j462j199o61o64j255j697j647j551j782
60611D71695k114k239k164j889j348p87o49r30j152j107j018r23n94k09l56j070
60595D53146j568j291o20j77j9Q9J71K28M65Q63R57M33l85r66j106q11j66M10
$$ plain form
60577 449653 450020 449842 449457 449637 450588 451948 453721 456550 460939 466702 473334 480478 487964 495890 504676
60562 504676 514531 524811 534492 543335 551834 559862 566191 569800 570927 570309 568024 563854 558342 552658
60548 552658 547602 543359 540086 538057 537241 537333 538315 540509 543997 548402 553330 558700 564553 570876 577713
60533 577713 585145 592934 600426 606954 612246 616279 618893 619682 618288 614821 610031 605019 600655 597223
60519 597223 594660 592984 592267 592230 592193 591649 590740 590020 589841 590171 590928 592165 593766 595276 596380 597484 599508
60502 599508 603095 608405 615718 625754 639027 655291 674170 696083 721898 751651 784206 818346
60490 818346 853608 889708 925545 959203 988707 1012415 1028885 1036872 1035580 1024799 1004832 976550
60478 976550 941535 902013 860467 819148 779661 742824 708953 678289 651070 627228 606319
$$ packed form
60577D49653L67j78l85J80R51J360J773K829M389N763O632P144P486P926Q786
60562E04676R855J0280R681Q843Q499Q028O329L609J127o18k285m170n512n684
60548E52658n056m243l273k029q16R2R82K194L488M405M928N370N853O323O837
60533E77713P432P789P492O528N292M033K614P89j394l467m790n012m364l432
60519E97223k563j676p17l7l7n44r09p20j79L30P57J237J601J510J104J104K024
60502E99508L587N310P313J0036J3273J6264J8879K1913K5815K9753L2555L4140
60490H18346L5262L6100L5837L3658K9504K3708J6470P987j292j0781j9967k8282
60478I76550l5015l9522m1546m1319l9487l6837l3871l0664k7219k3842k0909
$$ plain form
60467 606319 587883 571638 557188 543859 531152 519259 508792 500042 492752 486622 481671 477968
60455 477968 475136 472351 468842 464385 459369 454458 450235 447064 445095 444184 443839 443414 442467 440905 438896
60440 438896 436739 434739 432971 431171 429090 426964 425315 424258 423299 422001 420506 419209 418198 417371 416883
60425 416883 417116 418223 419969 421933 423627 424527 424389 423681 423432 424468 426772 429579 431971 433386 433812 433658
60409 433658 433462 433617 434238 435152 435947 436260 436154 436190 436910 438272 439727 440854 441773 442910 444496 446353 448060
60392 448060 449252 449862 450228 450923 452342 454312 456170 457318 457753 458027 458758 460253 462558 465649 469432 473617
60376 473617 477735 481292 483941 485650 486768 487835 489185 490794 492466 493943 494844 494877 494343 494056 494461 495182
60360 495182 495848 496900 498879 501174 502403 502122 501316 500974 501015 501116 501833 504102 508001 512775 517903 523482
$$ packed form
60467F06319j8436j6245j4450j3329j2707j1893j0467q750p290o130m951l703
60455D77968k832k785l509m457n016m911m223l171j969r11l45m25r47j562k009
60440D38896k157k000j768j800k081k126j649j057r59j298j495j297j011q27m88
60425D16883K33J107J746J964J694R00j38p08k49J036K304K807K392J415M26j54
60409D33658j96J55O21R14P95L13j06L6P20J362J455J127R19J137J586J857J707
60392D48060J192O10L66O95J419J970J858J148M35K74P31J495K305L091L783M185
60376D73617M118L557K649J709J118J067J350J609J672J477R01L3n34k87M05P21
60360D95182O66J052J979K295J229k81q06l42M1J01P17K269L899M774N128N579
$$ plain form
60344 523482 529611 536033 542556 549362 556674 564313 571679 578008 582609 585030 585068 582654 577864 571159 563425
60329 563425 555575 548185 541563 535911 531158 526807 522321 517671 513316 509692 506901 504841 503434 502682
60315 502682 502586 502952 503376 503641 504127 505498 507945 511195 515419 521518 530044 540341 551338 562872 575595
60300 575595 589912 605712 622902 641220 659460 675800 689215 699844 707604 711281 709695 703412
60288 703412 694642 685578 677198 669352 661397 652776 643489 634101 625012 615747 605371 593745 582078
60275 582078 572013 564229 558035 552171 545771 538657 531095 523653 517204 512518 509486 507008 504071 500852
60261 500852 498361 497009 496051 494549 492393 490115 488172 486789 486148 486191 486444 486525 486726 487667 489431 491572
60245 491572 493895 496616 499594 502079 503584 504561 505669 506743 507023 506302 505286 504797 505033 505630 506072 506060
$$ packed form
60344E23482O129O422O523O806P312P639P366O329M601K421L8k414m790o705p734
60329E63425p850p390o622n652m753m351m486m650m355l624k791k060j407p52
60315E02682r6L66M24K65M86J371K447L250M224O099Q526J0297J0997J1534J2723
60300E75595J4317J5800J7190J8318J8240J6340J3415J0629P760L677j586o283
60288G03412q770r064q380p846p955q621r287r388r089r265j0376j1626j1667
60275E82078j0065p784o194n864o400p114p562p442o449m686l032k478k937l219
60261E00852k491j352r58j502k156k278j943j383o41M3K53Q1K01R41J764K141
60245D91572K323K721K978K485J505R77J108J074K80p21j016m89K36N97M42j2
$$ plain form
60229 506060 505834 506257 508125 511281 514799 518159 521723 525734 529464 531953 533361 534910 537586 541471 546314
60214 546314 552062 558604 565531 572513 579716 587518 595957 604638 613066 621024 628756 636837 645567 654444
60200 654444 662511 669318 675288 680987 686403 691136 694956 697834 699709 700649 701086 701439 701494 700509 698070 694607
60184 694607 690956 687552 684149 680212 675433 669915 663985 657996 652195 646649 641213 635781 630677 626510
60170 626510 623390 620551 617159 613345 610006 607775 606742 607035 608792 611401 613619 614914 616016 617674
60156 617674 619516 620774 621516 622388 623521 624514 625187 625592 625552 625130 625377 627579 631599 635914 639526 643001
60140 643001 647229 652067 656925 662069 668428 676274 684814 693142 701080 708951 716889 724584 731519 737254
60126 737254 741471 743884 744352 743205 741354 739765 738831 738395 738297 738612 739380 740550 742286 744943 748455 752074
$$ packed form
60229E06060k26M23J868L156L518L360L564M011L730K489J408J549K676L885M843
60214E46314N748O542O927O982P203P802Q439Q681Q428P958P732Q081Q730Q877
60200F54444Q067O807N970N699N416M733L820K878J875R40M37L53N5r85k439l463
60184F94607l651l404l403l937m779n518n930n989n801n546n436n432n104m167
60170F26510l120k839l392l814l339k231j033K93J757K609K218J295J102J658
60156F17674J842J258P42Q72J133R93O73M05m0m22K47K202M020M315L612L475
60140F43001M228M838M858N144O359P846Q540Q328P938P871P938P695O935N735
60126G37254M217K413M68j147j851j589r34m36r8L15P68J170J736K657L512L619
$$ plain form
60110 752074 755013 757096 758452 758822 757688 755089 751809 748548 745252 741521 737373 733147 728732 723473
60096 723473 717111 710433 704578 699889 695890 692267 689289 687217 685912 685340 685968 688213 691833 696256 701240
60081 701240 706768 712508 717871 722501 726324 729248 731225 732391 732651 731264 727422 721221 713548 704992
60067 704992 695455 684877 673784 662884 652572 643063 634543 626905 619690 612608 605929 600135 595403
60054 595403 591541 588204 585117 582300 580123 578868 578235 577735 577589 578698 581524 585514 589928 594776 600519
60039 600519 607229 614492 621891 629095 635704 641422 646358 650754 654494 657155 658532 658761 657976 656105 653045
60024 653045 648750 643085 635811 626895 616758 606074 595242 584105 572345 560235 548796 538944
60012 538944 530598 522983 515829 509827 505751 503481 502142 500971 499846 499155 499417 500896 503394 506505 510100
$$ packed form
60110G52074K939K083J356L70j134k599l280l261l296l731m148m226m415n259
60096G23473o362o678n855m689l999l623k978k072j305n72O28K245L620M423M984
60081G01240N528N740N363M630L823K924J977J166K60j387l842o201p673q556
60067G04992r537j0578j1093j0900j0312r509q520p638p215p082o679n794m732
60054E95403l862l337l087k817k177j255o33n00j46J109K826L990M414M848N743
60039F00519O710P263P399P204O609N718M936M396L740K661J377K29p85j871l060
60024F53045m295n665p274q916j0137j0684j0832j1137j1760j2110j1439r852
60012E38944q346p615p154o002m076k270j339j171j125o91K62J479K498L111L595
$$ plain form
59997 510100 514272 518748 522687 525406 527097 528595 530632 533595 537712 543024 549110 555147 560398 564633
59983 564633 568206 571817 575939 580176 583291 584177 582827 580196 577132 573679 569388 564059 558023 551825
59969 551825 545844 540281 535370 531322 527997 524874 521639 518743 517065 517054 518370 520318 522362 524272 526106
59954 526106 528045 529942 531190 531438 531331 531883 533161 534321 535087 536286 538485 540977 542835 544257 545943
59939 545943 547627 548312 547738 546538 544913 542219 538221 533859 530193 527167 523985 520306 516533 513185 510546
59924 510546 508824 508101 508014 507826 507099 506187 505896 506604 507871 509032 510046 511485 513733 516512 519414 522466
59908 522466 525857 529404 532752 535975 539474 543346 547331 551351 555573 559864 563750 567122 570486 574247
59894 574247 578231 582267 586731 591963 597480 602384 606442 610231 614273 618592 623135 628055 633305 638409
$$ packed form
59997E10100M172M476L939K719J691J498K037K963M117N312O086O037N251M235
59983E64633L573L611M122M237L115Q86j350k631l064l453m291n329o036o198
59969E51825n981n563m911m048l325l123l235k896j678j1J316J948K044J910J834
59954E26106J939J897J248K48j07N52J278J160P66J199K199K492J858J422J686
59939E45943J684O85n74j200j625k694l998m362l666l026l182l679l773l348k639
59924E10546j722p23q7j88p27r12k91P08J267J161J014J439K248K779K902L052
59908E22466L391L547L348L223L499L872L985M020M222M291L886L372L364L761
59894E74247L984M036M464N232N517M904M058L789M042M319M543M920N250N104
$$ plain form
59880 638409 642969 647121 651172 655046 658468 661527 664651 667958 670903 672651 672616 670584 666573 660698 653083
59865 653083 643928 633776 623671 614730 607340 600926 594675 588375 582493 577656 574253 572372 571831 572354
59851 572354 573902 576805 581353 587361 594344 602038 610427 619349 628467 637754 647560 657877 667724 675597
59837 675597 680580 682859 683260 682602 681654 681443 683037 686614 690877 693781 694052 691868 688053 683030 676760
59822 676760 669318 661043 652225 643008 633521 623791 613648 603084 592653 583138 574819 567445 560886
59809 560886 555413 551286 548446 546667 545670 545021 544315 543560 543072 543009 543323 544062 545146 545833 545062 542584 539227
59792 539227 535812 532366 528654 524898 521467 518327 515320 512666 510685 509222 507782 506063 504022 501690
59778 501690 499299 497418 496530 496571 497120 497853 498579 499168 499753 500748 502268 503797 504853 505716 507051 509011 511226
$$ packed form
59880F38409M560M152M051L874L422L059L124L307K945J748l5k032m011n875p615
59865F53083r155j0152j0105q941p390o414o251o300n882m837l403j881n41N23
59851E72354J548K903M548O008O983P694Q389Q922R118R287R806J0317R847P873
59837F75597M983K279M01o58r48k11J594L577M263K904K71k184l815n023o270
59822F76760p442q275q818r217r487r730j0143j0564j0431r515q319p374o559
59809E60886n473m127k840j779r97o49p06p55m88o3L14P39J084O87p71k478l357
59792E39227l415l446l712l756l431l140l007k654j981j463j440j719k041k332
59778E01690k391j881q88M1N49P33P26N89N85R95J520J529J056Q63J335J960K215
$$ plain form
59761 511226 513552 516272 519531 523020 526335 529369 532262 535141 537936 540392 542457 544750 548294 553489
59747 553489 559581 565461 570690 575451 579832 583702 587089 590156 592933 595458 598022 600798 603446 605558
59733 605558 607318 609179 611054 612479 613464 614481 615604 616413 616853 617520 618773 620197 621291 622144 623042 623910
59717 623910 624665 625760 627783 630542 633042 634468 634947 635314 636301 638002 639965 641654 642819 643460 643617 643320
59701 643320 642764 642320 642287 642565 642598 641772 640038 638100 636812 636376 636452 637038 638668 641440 644290 645824 645723
59684 645723 644813 643900 643077 642207 641524 641459 642127 643166 643954 643936 642842 640681 637532 633502 628897 624145 619358
59667 619358 614245 608687 603113 598007 593360 588971 584931 581330 577800 573950 570106 567019 565004 563957
59653 563957 564055 565674 568598 572058 575730 579987 584902 589653 593305 595630 596774 596644 595160 592824 590467
$$ packed form
59761E11226K326K720L259L489L315L034K893K879K795K456K065K293L544N195
59747E53489O092N880N229M761M381L870L387L067K777K525K564K776K648K112
59733F05558J760J861J875J425R85J017J123Q09M40O67J253J424J094Q53Q98Q68
59717F23910P55J095K023K759K500J426M79L67R87J701J963J689J165O41J57k97
59701F43320n56m44l3K78L3q26j734j938j288m36P6N86J630K772K850J534j01
59684F45723r10r13q23q70o83o5O68J039P88j8j094k161l149m030m605m752m787
59667F19358n113n558n574n106m647m389m040l601l530l850l844l087k015j047
59653E63957R8J619K924L460L672M257M915M751L652K325J144j30j484k336k357
$$ plain form
59638 590467 588489 586675 584673 582389 580011 577937 576657 576468 577218 578380 579415 580085 580440 580529 580191 579250
59622 579250 577887 576608 575750 575289 575169 575423 575745 575455 574339 573155 572724 572809 572593 572063 572161 573520 575829
59605 575829 578626 582022 586257 591005 595511 599127 601463 602294 601630 599787 597197 594190 590926 587451 583856
59590 583856 580452 577625 575358 573207 571008 569237 568218 567345 565736 563400 561102 559186 557271 555033
59576 555033 552615 550208 547900 546014 544971 544681 544617 544484 544315 544002 543427 542987 543227 543967 544589 545150 546317
59559 546317 548176 550130 552127 554863 558381 561527 563381 564321 565167 566143 567202 568506 569885 570698 570928
59544 570928 571660 573786 577029 580968 586146 593193 601624 610567 620091 630846 643052 656976 673697
59531 673697 693621 714223 730771 739922 741967 739648 735841 732618 731359 732729 736605 742279 748676
$$ packed form
59638E90467j978j814k002k284k378k074j280j89P50J162J035O70L55Q9l38r41
59622E79250j363j279q58m61j20K54L22k90j116j184m31Q5k16n30R8J359K309
59605E75829K797L396M235M748M506L616K336Q31o64j843k590l007l264l475l595
59590E83856l404k827k267k151k199j771j019q73j609k336k298j916j915k238
59576E55033k418k407k308j886j043k90o4j33j69l13n75m40K40P40O22N61J167
59559E46317J859J954J997K736L518L146J854R40Q46R76J059J304J379Q13K30
59544E70928P32K126L243L939N178P047Q431Q943R524J0755J2206J3924J6721
59531F73697J9924K0602J6548R151K045k319l807l223j259J370L876N674O397
$$ plain form
59518 748676 754569 759108 762189 763972 764216 762511 758865 753434 745885 735868 724031 711699 699407
59505 699407 686576 672914 659348 647123 636594 627415 619484 613103 608358 604793 601761 598981 596753
59492 596753 595639 595756 596495 597163 597818 599142 601517 604618 607970 611560 615828 621382 628734 637888 648124
59477 648124 658594 669305 681166 694883 710114 725883 741425 756272 769782 781019 789214 794218
59465 794218 796536 796969 796163 794479 792401 791039 791847 795662 802182 810660 821044 834147 850687 870364
59451 870364 892038 914680 937949 961847 986054 1009762 1032039 1052159 1069623 1083923 1094180
59440 1094180 1098849 1095989 1084288 1064042 1037162 1006426 974857 945259 919375 897137 877207 858554
59428 858554 841215 825497 811125 797710 785661 776133 770195 768337 770532 776437 785680 798220 814253
$$ packed form
59518G48676N893M539L081J783K44j705l646n431p549j0017j1837j2332j2292
59505F99407j2831j3662j3566j2225j0529r179p931o381m745l565l032k780k228
59492E96753j114J17P39O68O55J324K375L101L352L590M268N554P352R154J0236
59477F48124J0470J0711J1861J3717J5231J5769J5542J4847J3510J1237Q195N004
59465G94218K318M33q06j684k078j362Q08L815O520Q478J0384J3103J6540J9677
59451H70364K1674K2642K3269K3898K4207K3708K2277K0120J7464J4300J0257
59440A094180M669k860j1701k0246k6880l0736l1569k9598k5884k2238j9930j8653
59428H58554j7339j5718j4372j3415j2049r528n938j858K195N905R243J2540J6033
$$ plain form
59415 814253 833534 855092 877848 901157 924413 946534 966488 984165 1000025 1013577 1022463 1023320
59403 1023320 1013822 994437 968672 941520 917050 896943 880908 868184 858674 852889 850673 849607
59391 849607 844960 832278 810694 783472 755188 728837 705520 685510 668576 653953 641129 630515
59379 630515 622610 616913 612453 609082 607264 606798 606749 606680 606997 607883 608793 609317 609829 610949 612985 616264 621315
59362 621315 628171 635871 643262 650200 657551 666038 675435 685021 694648 705135 717511 732069 748489
59349 748489 766832 787779 811573 837201 863197 888989 914888 940907 966189 989622 1010531
59338 1010531 1028637 1043688 1055193 1062380 1064528 1061583 1054227 1043051 1027939 1008719 986162 961743
59326 961743 936484 910605 884361 858602 834200 811231 789046 767228 746482 728453 714358
$$ packed form
59415H14253J9281K1558K2756K3309K3256K2121J9954J7677J5860J3552Q886Q57
59403A023320r498j9385k5765k7152k4470k0107j6035j2724r510n785k216j066
59391H49607m647j2682k1584k7222k8284k6351k3317k0010j6934j4623j2824j0614
59379F30515p905n697m460l371j818m66m9o9L17Q86R10N24N12J120K036L279N051
59362F21315O856P700P391O938P351Q487R397R586R627J0487J2376J4558J6420
59349G48489J8343K0947K3794K5628K5996K5792K5899K6019K5282K3433K0909
59338A010531J8106J5051J1505P187K148k945p356j1176j5112j9220k2557k4419
59326I61743k5259k5879k6244k5759k4402k2969k2185k1818k0746j8029j4095
$$ plain form
59315 714358 703752 695029 687170 680356 674731 669519 664070 659069 655756 654347 654105 654685 656476 659779
59301 659779 664563 670941 679060 688553 698820 709772 721587 733971 746466 759170 771916 782693
59289 782693 788200 786545 778736 767368 754763 742605 732183 724073 718008 713566 710738 709677 710494
59276 710494 713517 719167 727336 737472 749413 763468 779502 796695 814448 832705 850993 867985
59264 867985 882589 894812 904947 912490 916453 916264 911778 902914 890003 874207 856987 839245 821343
59251 821343 803692 786885 771410 757513 745204 734234 724394 715985 709660 705662 703620 703294 704926
59238 704926 708603 713761 719786 726671 734646 743511 752708 761757 770276 777861 784190 788935 791380 790584
59224 790584 786282 779184 770063 758954 745653 730627 715016 699982 686344 674464 664137 654879
$$ packed form
59315G14358j0606q723p859o814n625n212n449n001l313j409k42N80J791L303
59301F59779M784O378Q119R493J0267J0952J1815J2384J2495J2704J2746J0777
59289G82693N507j655p809j1368j2605j2158j0422q110o065m442k828j061Q17
59276G10494L023N650Q169J0136J1941J4055J6034J7193J7753J8257J8288J6992
59264H67985J4604J2223J0135P543L963j89m486q864j2911j5796j7220j7742j7902
59251H21343j7651j6807j5475j3897j2309j0970r840q409o325l998k042l26J632
59238G04926L677N158O025O885P975Q865R197R049Q519P585O329M745K445p96
59224G90584m302p098r121j1109j3301j5026j5611j5034j3638j1880j0327r258
$$ plain form
59212 654879 646575 639486 633352 627113 620033 612770 606772 602837 600654 599519 599027 599181 600160 601947 604065
59197 604065 605972 607839 610517 614462 619128 623710 628028 632257 636252 639725 642832 646082 649768 653812
59183 653812 657969 661804 664704 666344 667090 667664 668578 670067 672290 675323 679164 683972 690067 697499 705939
59168 705939 715238 725759 737862 751311 765407 779364 792474 804375 815402 826117 836139 843987
59156 843987 848487 849768 848367 843996 836032 824923 812236 799324 786489 773421 759937 746272
59144 746272 733020 720782 709640 699144 689051 679736 671537 664037 656571 649223 642782 637759 633923
59131 633923 630725 627841 625290 623356 622317 622111 622409 623226 625128 628525 633042 638000 643285 649359 656604
59116 656604 665036 674477 684583 694889 705091 715178 725072 734483 743350 752014 760524 768210 774451
$$ packed form
59212F54879q304p089o134o239p080p263n998l935k183j135m92J54R79J787K118
59197F04065J907J867K678L945M666M582M318M229L995L473L107L250L686M044
59183F53812M157L835K900J640P46N74R14J489K223L033L841M808O095P432Q440
59168G05939R299J0521J2103J3449J4096J3957J3110J1901J1027J0715J0022P848
59156H43987M500J281j401m371p964j1109j2687j2912j2835j3068j3484j3665
59144G46272j3252j2238j1142j0496j0093r315q199p500p466p348o441n023l836
59131F33923l198k884k551j934j039k06K98Q17J902L397M517M958N285O074P245
59116F56604Q432R441J0106J0306J0202J0087R894R411Q867Q664Q510P686O241
$$ plain form
59103 774451 779566 784332 788866 792659 795597 798301 801328 804461 806854 807650 806622 804521 802537 801052
59089 801052 799177 796023 792160 789128 787575 786558 784767 781779 777826 772845 766312 757950 748258 738234
59075 738234 728533 718986 709013 698421 687639 677273 667842 659926 653972 649618 645677 641233 636505
59062 636505 632233 628567 625047 621474 618280 616003 614703 613892 612859 611223 609338 607987 607526 607575 607613 607478
59046 607478 607061 606028 604260 602256 600735 600107 600465 601626 602880 603318 602923 602819 603882 605623 607032 608054
59030 608054 609455 611612 614293 617462 621436 626338 632085 638964 647517 657770 669086 680842 692822
59017 692822 704950 716988 728456 738512 746133 750881 753302 754191 753757 752021 749673 747789 746858 746799
59003 746799 747840 750548 754942 760309 766163 772830 780910 790643 801953 814584 827929 841116 853529
$$ packed form
59103G74451N115M766M534L793K938K704L027L133K393P96j028k101j984j485
59089H01052j875l154l863l032j553j017j791k988l953m981o533q362r692j0024
59075G38234r701r547r973j0592j0782j0366r431p916n954m354l941m444m728
59062F36505m272l666l520l573l194k277j300q11j033j636j885j351m61M9L8j35
59046F07478m17j033j768k004j521o28L58J161J254M38l95j04J063J741J409J022
59030F08054J401K157K681L169L974M902N747O879Q553J0253J1316J1756J1980
59017F92822J2128J2038J1468J0056P621M748K421Q89m34j736k348j884r31n9
59003G46799J041K708M394N367N854O667Q080R733J1310J2631J3345J3187J2413
$$ plain form
58990 853529 865005 875429 884463 891823 897506 901487 903385 902663 899166 893330 885858 877267 867908 858525
58976 858525 850463 844959 842325 842200 844451 849182 855941 863838 872776 883782 897679 914099 932231
58963 932231 951756 972368 993110 1012994 1031797 1049455 1065138 1077656 1086375 1090926 1090498 1084399
58951 1084399 1073058 1057615 1038695 1016421 991452 965127 938639 912762 888252 865747 845275
58940 845275 826536 809650 795057 782880 772981 765426 760158 756372 752899 749139 745086 740747 736286
58927 736286 732416 729754 727920 726027 723903 722042 720536 718922 716996 715019 713238 711990 712032 713826 716611
58912 716611 719108 721144 723688 727417 732250 738230 745753 754733 764522 774950 786619 799987 814893
58899 814893 831138 848748 867539 887150 907642 929339 952023 975080 998581 1023485 1050598
$$ packed form
58990H53529J1476J0424R034P360N683L981J898p22l497n836p472q591r359r383
58976H58525q062n504k634j25K251M731O759P897Q938J1006J3897J6420J8132
58963I32231J9525K0612K0742J9884J8803J7658J5683J2518Q719M551m28o099
58951A084399j1341j5443j8920k2274k4969k6325k6488k5877k4510k2505k0472
58940H45275j8739j6886j4593j2177r899p555n268l786l473l760m053m339m461
58927G36286l870k662j834j893k124j861j506j614j926j977j781j248M2J794K785
58912G16611K497K036K544L729M833N980P523Q980R789J0428J1669J3368J4906
58899H14893J6245J7610J8791J9611K0492K1697K2684K3057K3501K4904K7113
$$ plain form
58888 1050598 1079967 1111336 1144464 1179000 1214727 1251789 1289847 1326998 1360381 1387839 1408309
58877 1408309 1421035 1425696 1423293 1415490 1402689 1383833 1358384 1327407 1292412 1254347 1214296 1174149
58865 1174149 1135849 1100528 1068710 1040575 1015726 993427 973393 955607 939335 923370 907516
58854 907516 892729 879411 866581 853258 839665 826546 814248 803048 793450 785429 778180 771199
58842 771199 764852 759227 753278 745891 737287 728676 720933 714107 707765 701347 694617 688076 682490 677781
58828 677781 672985 667578 662226 657995 655440 654627 655310 656870 658825 661624 666179 672505 679633 686908 694330
58813 694330 701555 707874 713544 719824 727075 733985 739257 742910 745292 746094 745250 743688 742220 740511 737982
58798 737982 734784 731112 726536 721016 715597 711065 706719 701513 695630 689877 684350 678864 674057 670827
$$ packed form
58888A050598K9369L1369L3128L4536L5727L7062L8058L7151L3383K7458K0470
58877A408309J2726M661k403p803j2801j8856k5449l0977l4995l8065m0051m0147
58865A174149l8300l5321l1818k8135k4849k2299k0034j7786j6272j5965j5854
58854I07516j4787j3318j2830j3323j3593j3119j2298j1200r598q021p249o981
58842G71199o347n625n949p387q604q611p743o826o342o418o730o541n586m709
58828F77781m796n407n352m231k555q13O83J560J955K799M555O326P128P275P422
58813F94330P225O319N670O280P251O910N272L653K382Q02q44j562j468j709k529
58798G37982l198l672m576n520n419m532m346n206n883n753n527n486m807l230
$$ plain form
58784 670827 669145 668530 669246 671929 676332 681475 686740 691912 696462 699828 702249 704465 706652 708277 708815
58769 708815 708008 705741 702315 698542 694994 691453 687599 683781 680592 678106 676078 674397 672847 671068
58755 671068 669320 668681 669817 672200 675063 678363 682117 685717 688884 692472 697250 702608 707626 712752
58741 712752 719114 726633 734177 741322 748709 756685 764783 772565 779965 786768 792705 798221 804312 811403
58727 811403 818995 826445 833604 840715 848165 856202 864445 871887 877873 882850 887734 892981 898709 905188
58713 905188 912513 920161 927573 934812 942049 948775 954107 957454 958366 956330 951406 944456 935982 925275
58699 925275 911507 894989 876487 856039 833618 810404 788060 767039 746777 727367 709785
58688 709785 694524 681169 669441 659693 652171 646500 641936 637482 631958 624848 617079 610234 605022
$$ packed form
58784F70827j682o15P16K683M403N143N265N172M550L366K421K216K187J625N38
58769G08815q07k267l426l773l548l541l854l818l189k486k028j681j550j779
58755F71068j748o39J136K383K863L300L754L600L167L588M778N358N018N126
58741G12752O362P519P544P145P387P976Q098P782P400O803N937N516O091P091
58727H11403P592P450P159P111P450Q037Q243P442N986M977M884N247N728O479
58713I05188P325P648P412P239P237O726N332L347R12k036m924o950q474j0707
58699I25275j3768j6518j8502k0448k2421k3214k2344k1021k0262j9410j7582
58688G09785j5261j3355j1728r748p522n671m564m454n524p110p769o845n212
$$ plain form
58675 605022 601094 598107 596076 594792 593834 593387 594414 597817 603758 611706 620883 630852 642009 655105
58661 655105 669947 685082 699122 711672 722367 729946 733367 733236 731065 727481 722217 715474 708165
58648 708165 700940 693929 687286 681155 675321 669685 664786 661055 657938 654722 651922 650753 651450 653140
58634 653140 655282 658250 662470 667803 673768 679645 684513 687907 690253 692015 692765 691982 690402 689639 690604
58619 690604 693130 696914 701975 708378 716316 726276 738385 751861 765797 780045 794525 808146 819401
58606 819401 827646 832899 834863 833233 828671 822403 815061 806830 798255 789888 781488 772696 764128 756732
58592 756732 750415 744485 739159 735532 734275 735470 739318 745817 754030 762917 772667 784056 796778 809666
58578 809666 822222 834661 846701 857693 867838 877915 887938 897366 906524 916467 927442 938870
$$ packed form
58675F05022l928k987k031j284r58m47J027L403N941P948R177R969J1157J3096
58661F55105J4842J5135J4040J2550J0695P579L421j31k171l584n264o743p309
58648G08165p225p011o643o131n834n636m899l731l117l216k800j169O97J690
58634F53140K142K968M220N333N965N877M868L394K346J762P50p83j580p63R65
58619F90604K526L784N061O403P938R960J2109J3476J3936J4248J4480J3621J1255
58606H19401Q245N253J964j630m562o268p342q231q575q367q400q792q568p396
58592G56732o317n930n326l627j257J195L848O499Q213Q887R750J1389J2722J2888
58578H09666J2556J2439J2040J0992J0145J0077J0023R428R158R943J0975J1428
$$ plain form
58566 938870 950870 964548 980640 999046 1019705 1042813 1068084 1094807 1122554 1150761 1177816
58555 1177816 1201635 1221036 1235633 1244893 1248580 1247698 1243611 1236579 1226546 1214911 1203823 1193935 1184433
58542 1184433 1174958 1165718 1155906 1143964 1129513 1113276 1095131 1074140 1050789 1027207 1004676 982726
58530 982726 961250 941825 926139 914352 905595 898952 893649 889442 887115 887461 889784 892629 895860
58517 895860 900406 906083 911484 916076 920433 924111 925438 924124 922158 921144 920358 918334 914953 911039
58503 911039 907176 903737 900966 898283 894548 889607 884561 880102 875715 870837 865646 860296 854648 849209
58489 849209 845156 842974 842112 842220 843591 846249 849838 854637 861443 870281 880415 891637 904269 917990
58475 917990 932148 947064 963282 979541 993202 1002820 1008644 1010727 1008528 1002470 993870 983178 970359
$$ packed form
58566I38870J2000J3678J6092J8406K0659K3108K5271K6723K7747K8207K7055
58555A177816K3819J9401J4597R260L687q82m087p032j0033j1635j1088r888r502
58542A184433r475r240r812j1942j4451j6237j8145k0991k3351k3582k2531k1950
58530I82726k1476j9425j5686j1787q757o643n303m207k327L46K323K845L231
58517H95860M546N677N401M592M357L678J327j314j966j014p86k024l381l914
58503I11039l863l439k771k683l735m941n046m459m387m878n191n350n648n439
58489H49209m053k182q62J08J371K658L589M799O806Q838J0134J1222J2632J3721
58475I17990J4158J4916J6218J6259J3661R618N824K083k199o058q600j0692j2819
$$ plain form
58462 970359 957090 946238 938664 932783 927686 924430 923708 924743 927292 932403 940195 949099 958214 968191
58448 968191 978694 987197 991623 992297 990178 985078 976824 966396 954770 942298 930111 920228 913256
58435 913256 907795 903026 899999 899571 901150 904437 910154 917941 925856 933227 941794 952697 964557 975974
58421 975974 987674 1000436 1013020 1023899 1033148 1040868 1045644 1046433 1044322 1040662 1035029 1026657 1016368
58408 1016368 1005480 994301 983033 972549 962826 952370 940620 929244 919656 911177 903082 896427
58396 896427 892101 888972 885781 883102 881654 880459 878594 877021 876813 877089 876536 875434 874476 873174 871158
58381 871158 869507 869039 868837 868011 867397 867968 869327 871294 875196 881921 890466 899899 910810 923298 935704
58366 935704 947113 958978 972447 986288 999424 1013236 1029168 1046152 1062624 1079020 1096000
$$ packed form
58462I70359j3269j0852p574n881n097l256p22J035K549N111P792Q904R115R977
58448I68191J0503Q503M426O74k119n100q254j0428j1626j2472j2187r883o972
58435I13256n461m769l027m28J579L287N717P787P915P371Q567J0903J1860J1417
58421I75974J1700J2762J2584J0879R249P720M776P89k111l660n633q372j0289
58408A016368j0888j1179j1268j0484r723j0456j1750j1376r588q479q095o655
58396H96427m326l129l191k679j448j195j865j573k08K76n53j102r58j302k016
58381H71158j651m68k02q26o14N71J359J967L902O725Q545R433J0911J2488J2406
58366I35704J1409J1865J3469J3841J3136J3812J5932J6984J6472J6396J6980
$$ plain form
58355 1096000 1112209 1126129 1138235 1149096 1157329 1161762 1163664 1164537 1163745 1160674 1157136 1155108 1154081
58342 1154081 1153124 1153547 1156837 1161950 1167376 1174129 1183996 1196496 1210087 1224736 1240955 1258058 1275624
58329 1275624 1294651 1314998 1333949 1349732 1364099 1378777 1391910 1400904 1406389 1410337 1412626 1412630 1411987
58316 1411987 1412562 1413690 1414465 1416559 1421717 1428741 1436020 1444655 1455913 1468104 1479381 1491180 1505407
58303 1505407 1520690 1534973 1549339 1565616 1582672 1598762 1615008 1632813 1650474 1666239 1682035
58292 1682035 1700136 1718911 1736094 1753509 1774114 1797050 1820035 1843888 1870006 1896189 1919893
58281 1919893 1943088 1969022 1996864 2024397 2053072 2085084 2118325 2149776 2181218 2216018 2253002
58270 2253002 2289318 2326582 2368079 2412449 2456465 2501649 2551794 2606192 2661547 2718345 2779017
$$ packed form
58355A096000J6209J3920J2106J0861Q233M433J902Q73p92l071l538k028j027
58342A154081r57M23L290N113N426O753R867J2500J3591J4649J6219J7103J7566
58329A275624J9027K0347J8951J5783J4367J4678J3133Q994N485L948K289Mo43
58316A411987N75J128P75K094N158P024P279Q635J1258J2191J1277J1799J4227
58303A505407J5283J4283J4366J6277J7056J6090J6246J7805J7661J5765J5796
58292A682035J8101J8775J7183J7415K0605K2936K2985K3853K6118K6183K3704
58281A919893K3195K5934K7842K7533K8675L2012L3241L1451L1442L4800L6984
58270B253002L6316L7264M1497M4370M4016M5184N0145N4398N5355N6798O0672
$$ plain form
58259 2779017 2842204 2905245 2969887 3039018 3110308 3179680 3248307 3319409 3391186 3460316 3529473
58248 3529473 3603728 3682402 3762295 3845899 3938086 4037604 4140375 4248345 4366343 4493165
58238 4493165 4624881 4763925 4915415 5077577 5245710 5422607 5614761 5821260 6037096
58229 6037096 6264439 6509675 6772440 7049065 7343615 7663620 8008308 8373638 8765430
58220 8765430 9194312 9661405 10163002 10705641 11302001 11956095 12668376 13451405 14324037
58211 14324037 15294749 16368889 17568238 18925130 20463323 22206496 24201805 26514576
58203 26514576 29207595 32352276 36056541 40458042 45700166 51947915 59424009 68400316
58195 68400316 79160618 91993529 107182596 124930209 145281228 168145877 193341010
$$ packed form
58259B779017O3187O3041O4642O9131P1290O9372O8627P1102P1777O9130O9157
58248C529473P4255P8674P9893Q3604R2187R9518J02771J07970J17998J26822
58238D493165J31716J39044J51490J62162J68133J76897J92154K06499K15836
58229F037096K27343K45236K62765K76625K94550L20005L44688L65330L91792
58220H765430M28882M67093N01597N42639N96360O54094P12281P83029Q72632
58211A4324037R70712J074140J199349J356892J538193J743173J995309K312771
58203B6514576K693019L144681L704265M401501N242124O247749P476094Q976307
58195F8400316J0760302J2832911J5189067J7747613K0351019K2864649K5195133
$$ plain form
58188 193341010 220518133 249093962 278361954 307541675 335313213 359079643 375030162
58181 375030162 379611931 371468874 352199925 325411444 295076607 264392322 235378281
58174 235378281 208879069 184830508 162798304 142514873 124034770 107525376 93050707
58167 93050707 80545218 69866054 60809912 53135967 46624399 41103997 36423868 32436316
58159 32436316 29019942 26089289 23569407 21384054 19475119 17808444 16351142 15062398
58151 15062398 13911384 12883716 11964062 11130124 10368143 9676641 9050034 8474424 7943119
58142 7943119 7460286 7025076 6626917 6260013 5927870 5629629 5355740 5101024 4868824
58133 4868824 4658191 4459511 4266971 4083905 3912019 3746481 3585517 3434311 3295376
$$ packed form
58188A93341010K7177123K8575829K9267992K9179721K7771538K3766430J5950519
58181C75030162M581769q143057j9268949k6788481l0334837l0684285k9014041
58174B35378281k6499212k4048561k2032204k0283431j8480103j6509394j4474669
58167I3050707j2505489j0679164r056142p673945o511568n520402m680129l987552
58159C2436316l416374k930653k519882k185353j908935j666675j457302j288744
58151A5062398j151014j027668r19654q33938p61981o91502o26607n75610n31305
58142G943119m82833m35210l98159l66904l32143k98241k73889k54716k32200
58133D868824k10633j98680j92540j83066j71886j65538j60964j51206j38935
$$ plain form
58124 3295376 3164503 3039406 2923159 2816151 2713775 2614874 2523638 2440595 2360456 2281353
58114 2281353 2207470 2140096 2074803 2010149 1950575 1897730 1847098 1796194 1748242 1704702 1661865
58103 1661865 1617997 1576593 1539302 1502565 1464358 1427685 1394370 1361663 1327907 1295554 1265894
58092 1265894 1236727 1207679 1181793 1159377 1136248 1110697 1086497 1066469 1048684 1031446 1016291
58081 1016291 1003321 989052 971745 953967 937414 920181 901475 883986 869090 854548 839200
58070 839200 825139 813029 800246 785973 773234 763502 754149 743679 734622 728605 723225 716543 710167
58057 710167 705141 699168 690748 681992 674570 666836 657599 648820 641868 634857 626322 617919 611019 604284
58043 604284 597047 591377 588260 585315 580786 576306 573246 569928 565017 560185 556729 552857 547034 540797
$$ packed form
58124C295376j30873j25097j16247j07008j02376r8901r1236q3043q0139p9103
58114B281353p3883o7374o5293o4654n9574n2845n0632n0904m7952m3540m2837
58103A661865m3868m1404l7291l6737l8207l6673l3315l2707l3756l2353k9660
58092A265894k9167k9048k5886k2416k3129k5551k4200k0028j7785j7238j5155
58081A016291j2970j4269j7307j7778j6553j7233j8706j7489j4896j4542j5348
58070H39200j4061j2110j2783j4273j2739r732r353j0470r057o017n380o682o376
58057G10167n026n973q420q756p422p734r237q779o952p011q535q403o900o735
58043F04284p237n670l117k945m529m480l060l318m911m832l456l872n823o237
$$ plain form
58029 540797 535600 529968 522404 514154 506528 498441 489190 480778 474787 469597 463275 456688 451342 446631
58015 446631 441621 437134 433794 430290 425694 421203 417794 414597 411357 409737 410305 411018 410637 410788 412601
58000 412601 414344 414604 414912 416823 419176 420701 422602 425997 429485 431791 434270 438164 441833 443360 443562
57985 443562 443806 443197 440682 437694 435939 434536 432041 429312 427735 426541 424518 422538 421806 421446 420380
57970 420380 419771 420940 422647 423068 422848 423577 424917 425826 427022 429518 432194 433598 434798 437728 441836
57955 441836 444994 446655 447625 447757 446433 444478 443191 442236 440562 438575 437332 436487 435049 433283 432024
57940 432024 431161 430613 431625 435084 439746 444124 448934 455564 463297 470311 476477 482923 489622 495525 500360
57925 500360 504323 506746 506994 505915 504577 502338 497982 491905 485343 478280 470030 461177 453129 446400
$$ packed form
58029E40797n197n632p564q250p626q087r251q412n991n190o322o587n346m711
58015D46631n010m487l340l504m596m491l409l197l240j620N68P13l81J51J813
58000D12601J743K60L08J911K353J525J901L395L488K306K479L894L669J527K02
57985D43562K44o09k515k988j755j403k495k729j577j194k023j980p32l60j066
57970D20380o09J169J707M21k20P29J340R09J196K496K676J404J200K930M108
57955D41836L158J661R70J32j324j955j287r55j674j987j243q45j438j766j259
57940D32024q63n48J012L459M662M378M810O630P733P014O166O446O699N903M835
57925E00360L963K423K48j079j338k239m356o077o562p063q250q853q048o729
$$ plain form
57911 446400 440887 437010 434899 433334 431115 428661 426716 424612 421545 418457 416641 415376 412907 409022
57897 409022 404861 400848 396584 392079 387429 382017 375677 369809 365705 362651 359328 356087 354015 352700
57883 352700 350908 348784 347452 346995 346576 345952 345246 343907 341537 339009 337137 335034 331523 327347 324186
57868 324186 322204 320351 318396 316869 315551 313801 311931 310786 310466 310834 312427 315439 318741 321496 324772
57853 324772 329927 336378 342648 348566 354678 360553 365620 370669 376520 382154 386184 389125 392128 394570
57839 394570 395238 394930 395351 396226 396198 395916 397442 400754 403522 404390 404113 403435 402256 401077 400982 401828 402308 402016
57821 402016 401730 401720 401590 401636 402404 403057 402175 400156 398773 398402 397740 396249 394692 393018 389893 384766 378499
57804 378499 371590 363638 354957 346903 340102 333989 328497 324535 322233 320294 317658 314591 311751 309386
$$ packed form
57911D46400n513l877k111j565k219k454j945k104l067l088j816j265k469l885
57897D09022m161m013m264m505m650n412o340n868m104l054l323l241k072j315
57883C52700j792k124j332m57m19o24p06j339k370k528j872k103l511m176l161
57868C24186j982j853j955j527j318j750j870j145l20L68J593L012L302K755L276
57853C24772N155O451O270N918O112N875N067N049N851N634M030K941L003K442
57839C94570O68l08M21Q75k8k82J526L312K768Q68k77o78j179j179r5Q46M80k92
57821D02016k86j0j30M6P68O53q82k019j383l71o62j491j557j674l125n127o267
57804C78499o909p952q681q054o801o113n492l962k302j939k636l067k840k365
$$ plain form
57790 309386 307731 307055 307152 307781 309472 312700 316602 319867 322543 325485 328533 330999 333542 337487 342485
57775 342485 346937 350686 355065 360125 364091 366044 367025 367888 368058 367122 365806 364460 362245 358648 354293
57760 354293 349531 343723 336796 330133 325037 321312 318034 314625 310681 305936 301039 297354 295382 294224
57746 294224 292943 291533 290343 289589 289695 291066 293239 295172 296471 297379 297675 296823 295215 293972 293450 293111
57730 293111 292803 292875 293075 292830 292548 293147 294317 294878 294858 295437 296723 297491 297501 298107 299871 301379 301241 299778
57712 299778 297951 296061 294287 293085 292207 290473 287289 283349 279344 275249 271411 268963 268338 268447 268058
57697 268058 267027 265727 264402 263615 264101 265513 266324 265575 263796 261867 260153 259090 259267 260286 260807 260457
57681 260457 260614 262707 266894 273045 281805 293798 308767 326455 347660 373662 405104 441796 483054
$$ packed form
57790C09386j655o76R7O29J691L228L902L265K676K942L048K466K543L945M998
57775C42485M452L749M379N060L966J953R81Q63J70r36j316j346k215l597m355
57760C54293m762n808o927o663n096l725l278l409l944m745m897l685j972j158
57746B94224j281j410j190p54J06J371K173J933J299R08K96q52j608j243n22l39
57730B93111l08P2K00k45k82N99J170N61k0N79J286P68J0O06J764J508j38j463
57712B99778j827j890j774j202q78j734l184l940m005m095l838k448o25J09l89
57697B68058j031j300j325p87M86J412Q11p49j779j929j714j063J77J019N21l50
57681B60457J57K093M187O151Q760J1993J4969J7688K1205K6002L1442L6692M1258
$$ plain form
57668 483054 527899 575603 626190 679689 734561 787193 832362 863425 873331 858098 820183 767300
57656 767300 707676 647263 590438 540329 497478 460204 427432 399829 377686 359563 344046
57645 344046 331158 320980 312444 304744 298631 294999 293196 291847 290392 288880 287198 285418 284107 283499
57631 283499 283192 283215 284282 286355 288091 288444 287704 286297 283847 280323 276884 274553 273006 271552 270324
57616 270324 269624 269053 268182 267200 266123 264341 261796 259652 258979 259567 260619 261715 262464 262279 261227 260197
57600 260197 259653 259201 258746 258722 258702 257350 254476 251609 249630 247457 244145 240618 237912 235207 231288 226812
57584 226812 223397 221272 219357 216997 214273 211266 208271 206131 205136 204219 202331 199929 198020 196501 194655
57569 194655 192618 191114 190210 189424 188581 187653 186289 184435 182873 182306 182484 182887 183479 184113 184209 183891 184396
$$ packed form
57668D83054M4845M7704N0587N3499N4872N2632M5169L1063R906j5233l7915n2883
57656G67300n9624o0413n6825n0109m2851l7274l2772k7603k2143j8123j5517
57645C44046j2888j0178q536p700o113l632j803j349j455j512j682j780j311o08
57631B83499l07K3J067K073J736L53p40j407k450l524l439k331j547j454j228
57616B70324p00n71q71r82j077j782k545k144o73N88J052J096P49j85j052j030
57600B60197n44m52m55k4k0j352k874k867j979k173l312l527k706k705l919m476
57584B26812l415k125j915k360k724l007k995k140r95r17j888k402j909j519j846
57569A94655k037j504r04p86q43r28j364j854j562n67J78M03N92O34R6l18N05
$$ plain form
57552 184396 186327 188540 189928 191265 193976 197946 201871 204996 207167 207895 206849 204841 203117 202071
57538 202071 201573 201897 203212 204854 206163 207364 208559 208780 207337 205319 204303 204272 204197 204081 204794 206331
57522 206331 207811 208956 210239 211738 213171 214859 217428 220633 223600 226051 228266 230097 231097 231429
57508 231429 231617 231660 231338 231083 231498 232261 232506 232079 231520 231064 230518 229809 228840 227165 224589 221644 218739 215469
57490 215469 211608 208029 205632 204012 202259 200381 198820 197310 195523 194198 194196 194926 195118 194749 194787 195388
57474 195388 195782 195751 195813 195997 195727 194910 194087 193555 193308 193555 194233 194351 192974 190712 189193 189244 190507 192388
57456 192388 194208 194832 193529 191135 189266 188511 188352 188494 189080 189796 190023 189792 189654 189789 190121 190975 192574
57439 192574 194262 195264 195794 196392 196768 196470 196133 196682 197767 198377 198524 198927 199461 199535 199591 200535 201930 202492
$$ packed form
57552A84396J931K213J388J337K711L970L925L125K171P28j046k008j724j046
57538B02071m98L24J315J642J309J201J195K21j443k018j016l1p5j16P13J537
57522B06331J480J145J283J499J433J688K569L205K967K451K215J831J000L32
57508B31429J88M3l22k55M15P63K45m27n59m56n46p09r69j675k576k945k905l270
57490B15469l861l579k397j620j753j878j561j510j787j325kP30J92l69L8O01
57474A95388L94l1O2J84k70q17q23n32k47K47O78J18j377k262j519N1J263J881
57456A92388J820O24j303k394j869p55j59J42N86P16K27k31j38J35L32Q54J599
57439A92574J688J002N30N98L76k98l37N49J085O10J47M03N34P4N6R44J395N62
$$ plain form
57421 202492 202310 202862 204758 207080 209054 210764 211965 211836 210413 208963 208460 208703 209125 209429 209285 208529
57405 208529 207753 207741 208327 208791 209121 209716 210214 210058 209948 211096 213149 214517 214802 215197 216308 217381 218066
57388 218066 219191 221164 223108 224285 225146 226392 228166 230617 234018 237848 240967 243206 245633 248771
57374 248771 251726 253619 254721 255557 255919 255417 254182 252529 250626 248803 247481 246588 245732 244936 244425 243984
57358 243984 243572 244181 246705 250193 252883 254864 257843 262099 265690 267281 267872 268827 269877 270212 270166 270603
57342 270603 271603 272752 273943 275131 276014 276619 277400 278302 278631 278292 278158 278720 279382 279616 279804 280391 281190
57325 281190 282061 283357 285155 286990 288780 291067 293923 296606 298682 300437 301885 302594 302940 304202 306769
57310 306769 309466 311336 312894 314881 316987 318611 319899 321216 322550 324140 326708 330363 334142 337303
$$ packed form
57421B02492j82N52J896K322J974J710J201j29j423j450n03K43M22L04j44p56
57405B08529p76j2N86M64L30N95M98j56j10J148K053J368K85L95J111J073O85
57388B18066J125J973J944J177Q61J246J774K451L401L830L119K239K427L138
57374B48771K955J893J102Q36L62n02j235j653j903j823j322q93q56p96n11m41
57358B43984m12O09K524L488K690J981K979M256L591J591N91R55J050L35m6M37
57342B70603J000J149J191J188Q83O05P81R02L29l39j34N62O62K34J88N87P99
57325B81190Q71J296J798J835J790K287K856K683K076J755J448P09L46J262K567
57310C06769K697J870J558J987K106J624J288J317J334J590K568L655L779L161
$$ plain form
57296 337303 340144 343018 345644 347991 350699 353855 356450 357937 359318 361828 365394 369163 372697 375932
57282 375932 378876 382023 386204 391364 396378 400607 404602 408791 412726 416302 420396 425376 430248 434295
57268 434295 438383 443549 449360 454838 460021 465419 470821 475799 480670 485931 491435 497034 503185 510004
57254 510004 516609 522412 528129 534564 541336 547857 554516 561711 568781 575225 582008 590111 598628 605904
57240 605904 611950 618166 625207 632794 641222 651237 662358 672892 681955 690337 699191 708871 719228
57227 719228 730102 741302 752753 764821 777905 791698 805335 818187 830191 841701 853447
57216 853447 866283 880494 895673 911545 928311 945849 963434 980886 999185 1019172 1040411
57205 1040411 1062137 1084583 1108359 1133166 1158155 1183071 1208075 1232900 1257151 1281042 1304964
$$ packed form
57296C37303K841K874K626K347K708L156K595J487J381K510L566L769L534L235
57282C75932K944L147M181N160N014M229L995M189L935L576M094M980M872M047
57268D34295M088N166N811N478N183N398N402M978M871N261N504N599O151O819
57254E10004O605N803N717O435O772O521O659P195P070O444O783Q103Q517P276
57240F05904O046O216P041P587Q428J0015J1121J0534R063Q382Q854R680J0357
57227G19228J0874J1200J1451J2068J3084J3793J3637J2852J2004J1510J1746
57216H53447J2836J4211J5179J5872J6766J7538J7585J7452J8299J9987K1239
57205A040411K1726K2446K3776K4807K4989K4916K5004K4825K4251K3891K3922
$$ plain form
57194 1304964 1328730 1352104 1375561 1399605 1423720 1446928 1469040 1490559 1511805 1533077 1555233
57183 1555233 1579077 1604372 1630248 1656336 1682771 1709472 1736315 1763735 1792414 1822606 1854375
57172 1854375 1888051 1923758 1960904 1998825 2037433 2076611 2115596 2153772 2191495 2229260 2266661
57161 2266661 2303194 2339580 2377261 2416857 2457990 2500335 2543982 2589045 2635693 2684263 2734705
57150 2734705 2786371 2838905 2892753 2948112 3004043 3059431 3114142 3168385 3221717 3273724 3325117
57139 3325117 3377130 3430300 3484578 3539745 3594706 3647315 3696437 3743800 3792687 3845317 3902658
57128 3902658 3965947 4036524 4114083 4196333 4280462 4364307 4446858 4529123 4614313 4705717 4804177
57117 4804177 4908380 5017407 5132187 5254998 5388854 5537155 5702788 5887558 6093430
$$ packed form
57194A304964K3766K3374K3457K4044K4115K3208K2112K1519K1246K1272K2156
57183A555233K3844K5295K5876K6088K6435K6701K6843K7420K8679L0192L1769
57172A854375L3676L5707L7146L7921L8608L9178L8985L8176L7723L7765L7401
57161B266661L6533L6386L7681L9596M1133M2345M3647M5063M6648M8570N0442
57150B734705N1666N2534N3848N5359N5931N5388N4711N4243N3332N2007N1393
57139C325117N2013N3170N4278N5167N4961N2609M9122M7363M8887N2630N7341
57128C902658O3289P0577P7559Q2250Q4129Q3845Q2551Q2265Q5190R1404R8460
57117D804177J04203J09027J14780J22811J33856J48301J65633J84770K05872
$$ plain form
57108 6093430 6324273 6585949 6885514 7231697 7636083 8113148 8679833 9356488 10168470
57099 10168470 11146775 12328268 13756364 15480496 17553141 20026648 22951554 26373816
57091 26373816 30328900 34835776 39894362 45486049 51577457 58128853 65097774 72415376
57083 72415376 79928516 87344670 94239423 100147506 104689178 107654941 109009350 108836104
57075 108836104 107275413 104487971 100646126 95933810 90541512 84656733 78456240 72101664
57067 72101664 65736170 59482839 53446976 47719756 42377519 37476343 33047708 29098946
57059 29098946 25616732 22571548 19923543 17628945 15644082 13926607 12436836 11140127
57051 11140127 10007849 9016072 8144337 7375637 6695932 6092884 5555768 5076604 4649958
$$ packed form
57108F093430K30843K61676K99565L46183M04386M77065N66685O76655Q11982
57099A0168470R78305J181493J428096J724132K072645K473507K924906L422262
57091B6373816L955084M506876N058586N591687O091408O551396O968921P317602
57083G2415376P513140P416154O894753N908083M541672K965763J354409j73246
57075A08836104j560691k787442l841845m712316n392298n884779o200493o354576
57067G2101664o365494o253331o035863n727220n342237m901176m428635l948762
57059B9098946l482214l045184k648005k294598j984863j717475j489771j296709
57051A1140127j132278r91777q71735p68700o79705o03048n37116m79164m26646
$$ plain form
57042 4649958 4271003 3934459 3635288 3369088 3131652 2919375 2730246 2563119 2415834
57033 2415834 2285344 2169819 2069191 1983471 1912085 1855137 1813579 1787401 1774805 1773417 1781065
57022 1781065 1795671 1816505 1845302 1882467 1919843 1939490 1922951 1862828 1765787 1646395 1519341
57011 1519341 1395175 1279567 1174737 1081597 1000563 930720 869763 815794 768489 727886 693039
57000 693039 662672 636228 613273 592693 573461 555560 539303 524440 510752 498853 489385 482027
56988 482027 476200 472294 471250 473183 477144 482013 487086 491985 496273 498848 497688 490902 478324 461506
56974 461506 442150 421489 401202 383368 368768 356342 345101 335619 328970 325288 324267 326131
56962 326131 331107 338718 348524 360841 375857 392780 410710 429468 448329 464501 474108 474668 466095
$$ packed form
57042D649958l78955l36544k99171k66200k37436k12277j89129j67127j47285
57033B415834j30490j15525j00628q5720p1386n6948m1558k6178j2596j388P648
57022A781065J4606K0834K8797L7165L7376J9647j6539o0123r7041j19392j27054
57011A519341j24166j15608j04830r3140q1034o9843o0957n3969m7305m0603l4847
57000F93039l0367k6444k2955k0580j9232j7901j6257j4863j3688j1899r468p358
56988D82027n827l906j044J933L961M869N073M899M288K575j160o786j2578j6818
56974D61506j9356k0661k0287j7834j4600j2426j1241r482o649l682j021J864
56962C26131M976P611R806J2317J5016J6923J7930J8758J8861J6172R607N60q573
$$ plain form
56949 466095 449948 428676 405209 382095 360733 341690 325402 312167 301962 294867 291376 291880
56937 291880 296288 304463 316474 331995 350071 369931 391514 414706 438518 461166 480202 492265
56925 492265 493826 483208 461715 432657 399887 367111 337042 310228 285561 262611 242654 226829
56913 226829 214409 203781 194176 185514 177477 169920 163561 159170 156470 154629 153314 152545 152232 152693
56899 152693 154883 159147 164304 168990 173407 178832 185907 194387 204123 215290 227946 242175 258350
56886 258350 276470 295541 314277 331922 347642 359557 365321 363626 354845 340856 324696 309534
56874 309534 296959 286645 278170 272432 270582 272592 278014 287467 302192 322581 348193 378713 413706
56861 413706 451887 491874 533458 576852 620505 660364 691233 708451 709202 693834 666228 631946
$$ packed form
56949D66095j6147k1272k3467k3114k1362j9043j6288j3235j0205p095l491N04
56937B91880M408Q175J2011J5521J8076J9860K1583K3192K3812K2648J9036J2063
56925D92265J561j0618k1493k9058l2770l2776l0069k6814k4667k2950j9957j5825
56913B26829j2420j0628r605q662q037p557o359m391k700j841j315p69l13M61
56899A52693K190M264N157M686M417N425P075Q480R736J1167J2656J4229J6175
56886B58350J8120J9071J8736J7645J5720J1915N764j695q781j3989j6160j5162
56874C09534j2575j0314q475n738j850K010N422R453J4725K0389K5612L0520L4993
56861D13706L8181L9987M1584M3394M3653L9859L0869J7218P51j5368k7606l4282
$$ plain form
56849 631946 595654 560399 528555 502193 482474 469648 463952 466075 476821 496786 526190 564536
56837 564536 610541 662751 719972 781011 844790 910995 979220 1045795 1101759 1135626 1139312 1111983
56825 1111983 1059383 990533 914467 838263 766660 702739 648390 604107 569413 544186 529150
56814 529150 524631 529668 543046 564424 593607 629368 670042 714810 763251 813620 861899 901974
56802 901974 926421 928619 906139 862507 805023 740954 675845 613941 558279 510154 469529 436134
56790 436134 409807 390313 377688 372388 374277 381883 393504 408624 427422 449394 473350 498183
56778 498183 522334 542675 555063 556226 544825 521462 488732 450838 411819 373818 337498 303614
56766 303614 273303 247199 225176 206792 191290 177553 164865 153429 143585 135092 127824 122310
$$ packed form
56849F31946l6292l5255l1844k6362j9719j2826n696K123J0746J9965K9404L8346
56837E64536M6005N2210N7221O1039O3779O6205O8225O6575N5964L3867L686k7329
56825A111983n2600o8850p6066p6204p1603o3921n4349m4283l4694k5227j5036
56814E29150m519N037J3378K1378K9183L5761M0674M4768M8441N0369M8279M0075
56802I01974K4447K198k2480m3632n7484o4069o5109o1904n5662m8125m0625l3395
56790D36134k6327j9494j2625n300J889P606J1621J5120J8798K1972K3956K4833
56778D98183K4151K0341J2388J163j1401k3363l2730l7894l9019l8001l6320l3884
56766C03614l0311k6104k2023j8384j5502j3737j2688j1436r844q493p268n514
$$ plain form
56754 122310 118618 115467 111614 107498 104340 102259 100605 99514 99598 100366 100435 99277 97544 95782 94001
56739 94001 92352 91110 90064 88897 87946 87653 87679 87597 87953 89355 90939 91178 89950 88468 87454 86791 86726
56722 86726 87798 89599 91072 92131 93634 95662 97259 97987 98525 99557 101236 103731 107006 110058 111672
56707 111672 112037 112352 112857 112690 111815 111535 112673 114543 116116 117040 117153 116184 114439 112798 111679 110843 110330
56690 110330 110619 111670 112733 113230 113044 112061 110440 109103 108785 108792 108002 106868 106835 107870 108339 107534 106568 106312
56672 106312 106127 105342 104476 104195 104265 104306 104579 105363 106497 107952 109908 111878 112860 112778 112700 113279 114068 114721 115666
56653 115666 117132 118691 120257 122445 125398 128326 130646 132560 134103 134779 134643 134644 135367 136429 137510 138847
56637 138847 140300 141126 141221 141465 142312 143170 143674 144383 145610 146705 147122 147115 146830 145854 144305 143192 143045 143300
$$ packed form
56754A22310l692l151l853m116l158k081j654j091Q4P68O9j158j733j762j781
56739I4001j649j242j046j167r51k93K6q2L56J402J584K39j228j482j014o63o5
56722H6726J072J801J473J059J503K028J597P28N38J032J679K495L275L052J614
56707A11672L65L15N05j67q75k80J138J870J573R24J13r69j745j641j119q36n13
56690A10330K89J051J063M97j86r83j621j337l18Pp90j134l3J035M69q05r66k56
56672A06312j85p85q66k81P0M1K73P84J134J455J956J970R82q2p8N79P89O53R45
56653A15666J466J559J566K188K953K928K320J914J543O76j36JP23J062J081J337
56637A38847J453Q26R5K44Q47Q58N04P09J227J095M17pk85r76j549j113j47K55
$$ plain form
56619 143300 143608 144522 146146 147411 147610 147495 147938 148564 148721 148711 148955 148825 147510 145388 143526 142316 141448
56602 141448 140722 140145 139687 139450 139475 139020 136953 133445 130332 129053 129098 129231 129328 130033 131348 132617 133478 133993
56584 133993 134190 134160 134310 134989 136125 137485 138816 139641 139595 139124 139073 139498 139841 140330 141950 144721 147369 149289
56566 149289 151498 154908 158958 162884 167195 172885 180075 188345 197522 207210 216375 224341 231486 238145
56552 238145 243573 246857 248161 248331 247949 247450 247339 247558 247366 246482 245496 244531 242566 238953 234607 230760
56536 230760 227470 224345 221732 220002 218375 215804 212516 209541 207083 204456 201412 198537 196357 194803
56522 194803 193549 192449 191620 191225 190977 190006 187862 185485 184270 184115 183552 181866 179837 178160 176554 174945
56506 174945 174100 174366 175053 175769 177072 179096 180862 181770 182521 183722 184856 185493 186161 187057 187275 186326 185122
$$ packed form
56619A43300L08R14J624J265J99j15M43O26J57j0K44j30j315k122j862j210q68
56602A41448p26n77m58k37K5m55k067l508l113j279M5J33R7P05J315J269Q61N15
56584A33993J97l0J50O79J136J360J331Q25m6m71n1M25L43M89J620K771K648J920
56566A49289K209L410M050L926M311N690P190Q270R177R688R165P966P145O659
56552B38145N428L284J304J70l82m99j11K19j92q84r86r65j965l613m346l847
56536B30760l290l125k613j730j627k571l288k975k458k627l044k875k180j554
56522A94803j254j100q29l95k48r71k144k377j215j55n63j686k029j677j606j609
56506A74945q45K66O87P16J303K024J766R08P51J201J134O37O68Q96K18r49j204
$$ plain form
56489 185122 184405 183579 182220 181240 181291 181463 181002 180914 182218 183908 184350 183668 183030 182603 181932 181403 181531 181612 180859
56470 180859 180117 180641 181878 182319 182029 182470 184201 186472 188811 191273 193352 194281 194364 194576 195052 195242 195327
56453 195327 196004 197086 197681 197625 197482 197278 196562 195584 195268 195995 197366 198910 200146 200378 199469 198390 198062
56436 198062 198135 197898 197660 198041 198608 198538 198029 197688 197112 195571 193647 192629 192597 192523 192040 191719 191833 192120 192627
56417 192627 193591 194692 195482 196277 197582 199070 200117 200780 201180 200777 199584 199257 201345 204959 207747 208715
56401 208715 208551 207775 206353 204853 204217 204407 204701 205157 206333 207853 208774 209184 210017 211475 213037 214719
56385 214719 216859 218900 219927 220172 220635 221451 222127 222978 224693 226699 227608 227179 226398 225847 225561 226140 228296
56368 228296 231420 234180 236346 238400 239772 239373 237752 236763 237031 237664 238466 240376 243364 245863 246924
$$ packed form
56489A85122p17q26j359r80N1J72m61q8J304J690M42o82o38m27o71n29J28Q1p53
56470A80859p42N24J237M41k90M41J731K271K339K462K079R29Q3K12M76J90Q5
56453A95327O77J082N95n6j43k04p16r78l16P27J371J544J236K32r09j079l28
56436A98062P3k37k38L81N67p0n09l41n76j541j924j018l2p4m83l21J14K87N07
56417A92627R64J101P90P95J305J488J047O63M00m03j193l27K088L614K788R68
56401B08715j64p76j422j500o36J90K94M56J176J520R21M10Q33J458J562J682
56385B14719K140K041J027K45M63Q16O76Q51J715K006R09m29p81n51k86N79K156
56368B28296L124K760K166K054J372l99j621r89K68O33Q02J910K988K499J061
$$ plain form
56353 246924 247354 248164 249308 250427 251478 252172 252093 251718 252158 253556 254891 255542 255883 256255 256577 257114 258440
56336 258440 260481 262648 264872 267471 270163 272413 274526 277145 279930 282124 284088 286793 290033 292688
56322 292688 294605 296606 298757 300230 300865 301356 301946 302388 303077 304673 306698 307986 308394 308683 309070 309466
56306 309466 310643 313363 316712 319199 321171 324176 328285 332197 335809 340397 346212 352087 357510 362959
56292 362959 368092 371877 374742 378462 383536 388654 392963 396854 400407 403310 406531 411772 418850 425744
56278 425744 431646 437824 445168 453112 461420 470772 481082 491429 502151 514751 529284 544182 559219
56265 559219 576233 596146 617733 640229 664780 692259 721872 753152 787478 826535 870955
56254 870955 921230 978137 1041593 1110950 1187021 1271891 1366274 1469199 1580704 1702281 1833852
$$ packed form
56353B46924M30Q10J144J119J051O94p9l75M40J398J335O51L41L72L22N37J326
56336B58440K041K167K224K599K692K250K113K619K785K194J964K705L240K655
56322B92688J917K001K151J473O35M91N90M42O89J596K025J288M08K89L87L96
56306C09466J177K720L349K487J972L005M109L912L612M588N815N875N423N449
56292C62959N133L785K865L720N074N118M309L891L553K903L221N241P078O894
56278D25744N902O178P344P944Q308R352J0310J0347J0722J2600J4533J4898J5037
56265E59219J7014J9913K1587K2496K4551K7479K9613L1280L4326L9057M4420
56254H70955N0275N6907O3456O9357P6071Q4870R4383J02925J11505J21577J31571
$$ plain form
56243 1833852 1972771 2116761 2265334 2417245 2568943 2716841 2858816 2992210 3112571
56234 3112571 3215859 3300025 3363279 3402871 3417021 3406292 3372037 3315217 3237676 3142573 3032634
56223 3032634 2909906 2777906 2641610 2504296 2366675 2229969 2097279 1970813 1850429
56214 1850429 1736254 1630060 1532525 1441779 1356452 1277718 1206609 1141701 1081414 1026332 977339
56203 977339 933486 893552 857689 825738 796025 767641 741897 719759 699935 681310 665120
56192 665120 652647 642751 633625 625120 617440 609563 600988 593159 587188 582034 576793 572731 570922 569855
56178 569855 567694 565169 563997 564015 563950 563555 563076 562173 561177 561705 564232 566859 568233 569741 572952 576979
56162 576979 580469 584129 589053 594473 599474 605049 612184 619709 626387 633367 642248 652432 662678 673606
$$ packed form
56243A833852J38919J43990J48573J51911J51698J47898J41975J33394J20361
56234C112571J03288Q4166O3254L9592J4150j0729l4255n6820p7541r5103j09939
56223C032634j22728j32000j36296j37314j37621j36706j32690j26466j20384
56214A850429j14175j06194r7535r0746q5327p8734p1109o4908o0287n5082m8993
56203I77339m3853l9934l5863l1951k9713k8384k5744k2138j9824j8625j6190
56192F65120j2473r896r126q505p680p877q575p829n971n154n241m062j809j067
56178E69855k161k525j172J8o5l95m79r03r96N28K527K627J374J508L211M027
56162E76979L490L660M924N420N001N575P135P525O678O980Q881J0184J0246J0928
$$ plain form
56148 673606 686395 700809 716870 736731 762381 792981 826784 864221 906949 955490 1009995
56137 1009995 1071653 1141190 1217634 1300492 1391109 1489600 1592394 1694936 1794572 1888534 1971934
56126 1971934 2041212 2097877 2145987 2187636 2223503 2255344 2284143 2307056 2319508 2319610 2308340 2287097
56114 2287097 2257801 2223703 2186880 2145728 2097042 2039163 1971290 1892296 1803225 1709164 1615740
56103 1615740 1525423 1439529 1361342 1293971 1237034 1188569 1148349 1116388 1090355 1067797 1049133
56092 1049133 1035394 1025039 1016125 1009435 1006139 1004484 1002218 1000224 1000277 1001317 1001496 1001788 1003948 1007011
56078 1007011 1009526 1013028 1019453 1027213 1033788 1040105 1048410 1058011 1067265 1077586 1091134 1106553 1121303
56065 1121303 1136193 1153262 1171277 1187862 1204038 1222071 1240845 1258059 1274978 1294134 1314258
$$ packed form
56148F73606J2789J4414J6061J9861K5650L0600L3803L7437M2728M8541N4505
56137A009995O1658O9537P6444Q2858R0617R8491J02794J02542R9636R3962Q3400
56126A971934O9278N6665M8110M1649L5867L1841K8799K2913J2452J02j1270k1243
56114B287097k9296l4098l6823m1152m8686n7879o7873p8994q9071r4061r3424
56103A615740r0317q5894p8187o7371n6937m8465m0220l1961k6033k2558j8664
56092A049133j3739j0355q914o690l296j655k266j994N3J040J79K92K160L063
56078A007011K515L502O425P760O575O317Q305R601R254J0321J3548J5419J4750
56065A121303J4890J7069J8015J6585J6176J8033J8774J7214J6919J9156K0124
$$ plain form
56054 1314258 1332344 1348868 1366090 1383209 1398248 1412786 1429622 1447592 1463845 1479313 1496751
56043 1496751 1515495 1533538 1552557 1575177 1599475 1622178 1645110 1672254 1702500 1731863 1760942
56032 1760942 1793379 1828564 1862877 1896911 1934531 1975805 2017553 2059887 2105526 2153714 2201578
56021 2201578 2250412 2303822 2360729 2416972 2472701 2531457 2593299 2655728 2719898 2788795 2860923
56010 2860923 2933116 3007845 3090162 3179295 3271006 3366070 3468182 3575763 3684658 3796920
56000 3796920 3917975 4047209 4180633 4320425 4472000 4633997 4801476 4976776 5166457
55991 5166457 5369905 5582195 5805792 6047577 6306756 6578293 6865991 7179043 7518006
55982 7518006 7878047 8263751 8686091 9147044 9642685 10179387 10770717 11420576 12126912
$$ packed form
56054A314258J8086J6524J7222J7119J5039J4538J6836J7970J6253J5468J7438
56043A496751J8744J8043J9019K2620K4298K2703K2932K7144L0246K9363K9079
56032A760942L2437L5185L4313L4034L7620M1274M1748M2334M5639M8188M7864
56021B201578M8834N3410N6907N6243N5729N8756O1842O2429O4170O8897P2128
56010B860923P2193P4729Q2317Q9133R1711R5064J02112J07581J08895J12262
56000C796920J21055J29234J33424J39792J51575J61997J67479J75300J89681
55991E166457K03448K12290K23597K41785K59179K71537K87698L13052L38963
55982G518006L60041L85704M22340M60953M95641N36702N91330O49859P06336
$$ plain form
55973 12126912 12900290 13760727 14718446 15777628 16957845 18291815 19804934 21520356
55965 21520356 23483711 25760916 28416294 31521266 35184539 39548269 44761579 50994252
55957 50994252 58477821 67501546 78370922 91396123 106884440 125058554 145959462
55950 145959462 169464036 195359837 223307284 252757768 283041728 313447689 342781527
55943 342781527 368505246 386554287 392722955 384886949 364216086 334420280 299903183
55936 299903183 264328757 230176760 198872540 171030774 146728496 125787590 107941474
55929 107941474 92861438 80171603 69511898 60572979 53072575 46746190 41378910
55922 41378910 36814455 32920624 29571638 26669140 24149107 21955608 20028798 18323987
$$ packed form
55973A2126912P73378Q60437R57719J059182J180217J333970J513119J715422
55965B1520356J963355K277205K655378L104972L663273M363730N213310O232673
55957E0994252P483569R023725J0869376J3025201J5488317J8174114K0900908
55950A45959462K3504574K5895801K7947447K9450484L0283960L0405961K9333838
55943C42781527K5723719J8049041O168668p836006k0670863k9795806l4517097
55936B99903183l5574426l4151997l1304220k7841766k4302278k0940906j7846116
55929A07941474j5080036j2689835j0659705q938919p500404o326385n367280
55922D1378910m564455l893831l348986k902498k520033k193499j926810j704811
$$ plain form
55914 18323987 16818048 15487841 14301142 13234293 12278978 11424653 10651494 9946267 9308308
55905 9308308 8733690 8208617 7723666 7280021 6876342 6502964 6154003 5832384 5538170
55896 5538170 5263951 5006062 4768755 4553002 4352099 4162266 3987022 3827263 3677257
55887 3677257 3534220 3402105 3282314 3170004 3062920 2964750 2876391 2792757 2711492 2636245
55877 2636245 2568147 2502295 2435655 2370222 2305615 2236990 2163604 2091463 2024096 1958312 1892196
55866 1892196 1829586 1773046 1719636 1667286 1618610 1574971 1533260 1491971 1454160 1421111 1389193
55855 1389193 1356238 1325035 1297327 1270198 1241649 1214067 1188918 1163453 1135899 1108679 1083420
55844 1083420 1057896 1030910 1005142 982158 959587 936234 915018 897736 881655 864473 848049
$$ packed form
55914A8323987j505939j330207j186699j066849r55315q54325p73159p05227o37959
55905I308308n74618n25073m84951m43645m03679l73378l48961l21619k94214
55896E538170k74219k57889k37307k15753k00903j89833j75244j59759j50006
55887C677257j43037j32115j19791j12310j07084r8170q8359q3634q1265p5247
55877B636245o8098o5852o6640o5433o4607o8625p3386p2141o7367o5784o6116
55866A892196o2610n6540n3410n2350m8676m3639m1711m1289l7811l3049l1918
55855A389193l2955l1203k7708k7129k8549k7582k5149k5465k7554k7220k5259
55844A083420k5524k6986k5768k2984k2571k3353k1216j7282j6081j7182j6424
$$ plain form
55833 848049 834103 820694 806176 792468 781273 771021 760427 751125 743890 736242 726728 717709
55821 717709 710959 704237 695165 684911 675132 664868 653442 642981 634996 627540 618698 609873 602951
55808 602951 597216 591790 588166 587479 587996 588039 588841 592015 596686 601594 607498 615097 622853 629119 634178
55793 634178 638261 639955 638531 635460 631804 626597 619453 612007 604988 596725 586546 576844 569647 563791
55779 563791 557484 550924 544276 535866 524870 513453 504065 496814 491338 488628 488922 490430 492387 496806
55765 496806 504857 513804 519814 521559 519061 511651 499659 485886 472816 460138 447021 434623 424184
55752 424184 414845 405698 397881 392348 387647 382173 376583 371666 365966 358058 349300 341867 335772 330112
55738 330112 325326 321856 318381 313902 309890 307933 306934 305015 302548 300855 299505 297416 295087 293231
$$ packed form
55833H48049j3946j3409j4518j3708j1195j0252j0594r302p235p648r514r019
55821G17709o750o722r072j0254r779j0264j1426j0461p985p456q842q825o922
55808F02951n735n426l624o87N17M3Q02L174M671M908N904P599P756O266N059
55793F34178M083J694j424l071l656n207p144p446p019q263j0179r702p197n856
55779E63791o307o560o648q410j0996j1417r388p251n476k710K94J508J957M419
55765D96806Q051Q947O010J745k498p410j1992j3773j3070j2678j3117j2398j0439
55752D24184r339r147p817n533m701n474n590m917n700p908q758p433o095n660
55738C30112m786l470l475m479m012j957r99j919k467j693j350k089k329j856
$$ plain form
55724 293231 290631 285909 280128 275193 270998 266581 262801 261208 261321 261538 261765 262824 264282 265306 266789
55709 266789 270147 274717 278610 281518 284549 287902 290764 292846 294097 293604 290684 286365 282009 277250
55695 277250 271065 263958 257193 250843 244542 239217 235968 233990 231761 229623 229121 230368 232073 233715
55681 233715 235776 238280 240916 244180 248653 253582 257697 260913 263680 265433 265406 264337 263581 263084 261939
55666 261939 260293 258963 257723 255763 253391 251596 250441 249523 249522 251541 255229 259189 262897 266741 270610
55651 270610 273954 276803 279347 281029 281458 281549 282203 282470 280665 276773 272214 267731 263083 258247 253259
55636 253259 247377 240050 232313 225690 220187 214888 209885 205888 202456 198556 194572 191940 190893 190211
55622 190211 189132 187960 186866 185554 184082 182754 181384 179850 178944 179335 180063 179474 177312 174587 171843
$$ packed form
55724B93231k600m722n781m935m195m417l780j593J13K17K27J059J458J024J483
55709B66789L358M570L893K908L031L353K862K082J251m93k920m319m356m759
55695B77250o185p107o765o350o301n325l249j978k229k138n02J247J705J642
55681B33715K061K504K636L264M473M929M115L216K767J753k7j069p56m97j145
55666B61939j646j330j240j960k372j795j155r18jK019L688L960L708L844L869
55651B70610L344K849K544J682M29R1O54K67j805l892m559m483m648m836m988
55636B53259n882p327p737o623n503n299n003l997l432l900l984k632j047o82
55622A90211j079j172j094j312j472j328j370j534r06L91P28n89k162k725k744
$$ plain form
55607 171843 169013 166578 165264 164743 164018 162894 161857 160877 159594 158213 156911 154975 151958 149072 147790
55592 147790 147639 147106 146209 146231 147218 147746 147231 146674 146915 147676 148450 148964 148751 147649 146720 147344 149477 151983
55574 151983 154365 156775 158753 159701 160453 162689 166679 171042 174713 177706 180061 181620 182910 184751 186865
55559 186865 188192 188526 188442 187706 185344 181383 177095 173367 170105 167208 164732 162141 158848 155498 153347
55544 153347 152397 151570 150635 150427 151128 151965 152745 154166 156351 158480 160069 161334 162255 162673 163240 164724 166374
55527 166374 166604 165442 164562 164707 164803 164003 162884 162005 160845 158902 156520 154041 151271 148294 145704 143638
55511 143638 141640 139673 138119 136666 134533 131967 130110 129164 128161 126740 125619 124969 123984 122577 121902
55496 121902 122518 123478 123913 124160 124653 125093 125431 126350 127910 128895 128353 126775 125108 123655 122528 122099 122306
$$ packed form
55607A71843k830k435j314n21p25j124j037r80j283j381j302j936l017k886j282
55592A47790j51n33q97K2R87N28n15n57K41P61P74N14k13j102r29O24K133K506
55574A51983K382K410J978R48P52K236L990M363L671K993K355J559J290J841K114
55559A86865J327L34q4p36k362l961m288l728l262k897k476k591l293l350k151
55544A53347r50q27r35k08P01Q37P80J421K185K129J589J265R21M18N67J484J650
55527A66374K30j162q80J45R6q00j119q79j160j943k382k479k770k977k590k066
55511A43638j998j967j554j453k133k566j857r46j003j421j121o50r85j407o75
55496A21902O16R60M35K47M93M40L38R19J560R85n42j578j667j453j127m29K07
$$ plain form
55479 122306 122518 122651 123333 124490 124974 124330 123709 124242 125530 126546 127023 127144 126776 125843 124771 123923 123279
55462 123279 123033 123590 124542 124721 123815 122945 123043 123686 124035 123905 123247 121738 119651 118127 117814 118063 118145 118317
55444 118317 118946 119605 119846 120010 120418 120583 120001 119028 118206 117512 116962 117120 118185 119327 119744 119748 120091 120857 121745
55425 121745 122799 124134 125485 126637 127749 128749 129140 128921 128933 129670 130522 130764 130569 130433 130398 130450 130862 131502
55407 131502 131664 131275 131346 132420 133499 133391 132293 131032 129599 127585 125481 124243 123896 123629 123135 122901
55391 122901 123267 123965 124514 124529 123782 122477 121281 120680 120505 120392 120331 120491 120949 121846 123228 124470 124633 123744
55373 123744 122948 122928 122990 122341 121386 121002 121259 121643 121894 121847 121084 119640 118517 118591 119395 119739 119209 118351 117731
55354 117731 117536 117771 118198 118384 118314 118523 119155 119481 119014 118469 118839 119997 121031 121534 121716 121580 120872 119709
$$ packed form
55479A22306K12J33O82J157M84o44o21N33J288J016M77J21l68r33j072q48o44
55462A23279k46N57R52J79r06q70R8O43L49j30o58j509k087j524l13K49Q2J72
55444A18317O29O59K41J64M08J65n82r73q22o94n50J58J065J142M17ML43P66Q88
55425A21745J054J335J351J152J112J000L91k19J2P37Q52K42j95j36l5N2M12O40
55407A31502J62l89P1J074J079j08j098j261j433k014k104j238l47k67m94k34
55391A22901L66O98N49J5p47j305j196o01j75j13o1J60M58Q97J382J242J63q89
55373A23744p96k0O2o49r55l84K57L84K51m7p63j444j123P4Q04L44n30q58o20
55354A17731j95K35M27J86p0K09O32L26m67n45L70J158J034N03J82j36p08j163
$$ plain form
55336 119709 118499 117346 116139 115134 114865 115525 116830 118350 119617 120158 119807 118853 117660 116425 115419
55321 115419 114992 115054 115077 114829 114647 114752 115000 115478 116591 118191 119480 120191 121019 122282 123056 122422 120849 119539
55303 119539 118987 118911 119044 119235 119270 119243 119622 120401 120827 120494 120030 120009 119975 119308 118324 117642 117112 116261 115252 114576
55283 114576 114331 114562 115662 117628 119607 121022 122413 124210 125554 125525 124786 124638 125052 125079 124774 125109 126120
55266 126120 126638 126058 125062 124388 124016 123834 124074 124737 125368 125693 125885 126130 126489 127178 128316 129480 130161 130539
55248 130539 131124 131753 131727 130868 129700 128629 127649 126784 126118 125438 124506 123582 123025 122558 121663 120562 120017 120238
55230 120238 120728 121191 121798 122588 123346 124155 125375 126945 128233 128677 128211 127155 126091 125634 125874 126286 126632
55213 126632 127462 129104 130676 130976 130105 129325 129501 130422 131442 132008 131764 130901 130248 130271 130302 129512 128236 127420
$$ packed form
55336A19709j210j153j207j005k69O60J305J520J267N41l51r54j193j235j006
55321A15419m27O2K3k48j82J05K48M78J113J600J289P11Q28J263P74o34j573j310
55303A19539n52p6J33J91L5k7L79P79M26l33m64k1l4o67r84o82n30q51j009o76
55283A14576k45K31J100J966J979J415J391J797J344k9p39j48M14K7l05L35J011
55266A26120N18n80r96o74l72j82K40O63O31L25J92K45L59O89J138J164O81L78
55248A30539N85O29k6q59j168j071r80q65o66o80r32r24n57m67q95j101n45K21
55230A20238M90M63O07P90P58Q09J220J570J288M44m66j056j064m57K40M12L46
55213A26632Q30J642J572L00q71p80J76R21J020N66k44q63o53K3L1p90j276q16
$$ plain form
55195 127420 127131 126682 125962 125467 125199 124728 124294 124588 125337 125342 124178 122769 121956 121571 121314 121492 122311 123212 123470
55176 123470 122957 121954 120786 119936 119942 120811 121909 122583 122554 121774 120487 119497 119734 121373 123771 126201 128183
55159 128183 129291 129372 128929 128670 128704 128733 128804 129153 129508 129416 129106 129182 129631 130012 130465 131466 132681 133221 133123 133424
55139 133424 134521 135542 135662 135108 134535 134323 134730 135785 136743 136578 135373 134292 133863 133260 131693 129571
55123 129571 127794 126750 126435 126748 127120 126698 125399 124048 123118 122196 121113 120595 121091 121863 122078 122078 122717 123989
55105 123989 125165 125954 126800 128221 130369 133048 135808 138272 140580 143136 145756 147614 148261 148106 147624
55090 147624 146828 145883 145543 146343 147836 149133 149797 149864 149466 148841 148293 147821 147201 146603 146524 146898 146977 146363 145455
55071 145455 144619 143774 143175 143564 144900 145825 145226 143629 142252 141342 140322 139075 138127 137833 138114 138748 139359
$$ packed form
55195A27420k89m49p20m95k68m71m34K94P49Nj164j409q13l85k57J78Q19R01K58
55176A23470n13j003j168q50OQ69J098O74k9p80j287r90K37J639K398K430J982
55159A28183J108Q1m43k59L4K9P1L49L55r2l10P6M49L81M53J001J215N40r8L01
55139A33424J097J021J20n54n73k12M07J055R58j65j205j081m29o03j567k122
55123A29571j777j044l15L13L72m22j299j351r30r22j083n18M96P72K15%O39J272
55105A23989J176P89Q46J421K148K679K760K464K308K556K620J858O47j55m82
55090A47624p96r45l40Q00J493J297O64O7l98o25n48m72o20n98p9L74P9o14r08
55071A45455q36q45n99L89J336R25n99j597j377r10j020j247r48k94K81O34O11
$$ plain form
55054 139359 139493 139280 139552 140709 141950 142353 142243 142645 143763 144851 145359 145357 144988 144277 143465 142804 142002 140534
55036 140534 138502 136653 135518 135012 134824 134778 134750 134621 134362 133991 133585 133474 134097 135377 136575 137091 137055 136802
55018 136802 136229 135197 134172 133816 134163 134702 135093 135293 135232 134867 134473 134407 134745 135457 136619 138008 138843 138534
55000 138534 137478 136616 136356 136439 136646 137113 138043 139523 141445 143255 144133 143952 143720 144454 145880 146911 147138
54983 147138 147081 147127 147091 146934 147108 147886 148871 149460 149422 148919 148246 147694 147412 147418 147865 149056 150856 152394 152872 152466
54963 152466 151858 151140 149984 148767 148601 149938 151866 153167 153554 153527 153558 153868 154614 155727 156684 156816 155862
54946 155862 154073 151940 149990 148655 148065 147960 147988 148129 148750 150247 152591 155202 157303 158495 158952 159044
54930 159044 158970 158916 159331 160636 162599 164401 165559 166595 168573 172065 176759 182084 187908 194469 201730
$$ packed form
55054A39359J34k13K72J157J241M03j10M02J118J088N08kl69p11q12o61q02j468
55036A40534k032j849j135n06j88m6k8j29k59l71m06j11O23J280J198N16l6k53
55018A36802n73j032j025l56L47N39L91K00o1l65l94o6L38P12J162J389Q35l09
55000A38534j056q62k60Q3K07M67R30J480J922J810Q78j81k32P34J426J031K27
54983A47138n7M6l6j57J74P78R85N89l8n03o73n52k82OM47J191J800J538M78m06
54963A52466o08p18j156j217j66J337J928J301L87k7L1L10P46J113R57J32r54
54946A55862j789k133j950j335n90j05K8J41O21J497K344K611K101J192M57R2
54930A59044p4n4M15J305J963J802J158J036J978L492M694N325N824O561P261
$$ plain form
54915 201730 209103 215845 221530 226008 229159 230899 231236 230046 227039 222290 216628 210955 205278 198998
54901 198998 192233 186127 181574 178235 175306 172747 171108 170381 169724 168438 166799 165655 165442 165806 166166
54886 166166 166404 166771 167206 167295 167153 167874 170478 174690 179413 184148 189128 194208 198789 203068 208237 214810
54870 214810 221583 226925 230370 232267 232634 231308 228699 225397 221210 215501 208415 201071 194516 189023
54856 189023 184347 180158 176262 172791 170033 167784 165239 161968 158692 156506 155690 155764 156264 156703 156219 154314
54840 154314 151849 150332 150150 150308 150029 149708 149991 150768 151502 151947 152069 151745 151061 150590 150881 151823 152850 153691
54822 153691 154640 156077 157884 159361 159713 158665 156647 154450 152861 152500 153535 155309 156618 156799 156365
54807 156365 156225 156530 156688 156356 155907 155931 156611 157623 158422 158711 158815 159364 160411 161220 161282 161144 161650 162642 163059
$$ packed form
54915B01730P373O742N685M478L151J740L37j190l007m749n662n673n677o280
54901A98998o765o106m553l339k929k559j639p27o57j286j639j144k13L64L60
54886A66166K38L67M35Q9j42P21K604M212M723M735M980N080M581M279N169O573
54870B14810O773N342L445J897L67j326k609l302m187n709p086p344o555n493
54856A89023m676m189l896l471k758k249k545l271l276k186q16P4N00M39m84j905
54840A54314k465j517j82J58k79l21K83P77P34M45J22l24o84m71K91R42J027Q41
54822A53691R49J437J807J477L52j048k018k197j589l61J035J774J309J81m34
54807A56365j40L05J58l32m49K4O80J012P99K89J04N49J047Q09O2j38N06R92M17
$$ plain form
54788 163059 162229 160492 158645 157336 156971 157589 158691 159663 160451 161496 163057 164931 166759 168172 168848 168967
54772 168967 169507 171447 174680 178355 182253 187119 193428 200514 207293 213384 219174 225193 231721 238678
54758 238678 245516 251359 255532 257905 258675 257900 255310 250505 243485 235085 226677 219178 212479 206098 199998
54743 199998 194442 189456 185120 182051 180722 180281 178961 175963 172335 169752 169001 169879 171814 174093 175962
54728 175962 177174 178293 180107 182808 185970 189177 192484 196307 201062 206768 212947 218938 224334 228975
54714 228975 232626 235000 236085 236140 235271 233248 229804 224951 218972 212312 205571 199405 194316 190461 187504
54699 187504 184689 181332 177496 173891 170994 168618 166509 164848 163691 162455 160647 158734 157596 157343
54685 157343 157385 157431 157647 157973 158179 158565 159713 161411 162628 162780 162306 161805 161317 160687 159930 158923 157341 155279
$$ packed form
54788A63059q30j737j847j309l65O18J102R72P88J045J561J874J828J413O76J19
54772A68967N40J940L233L675L898M866O309P086O779O091N790O019O528O957
54758B38678O838N843M173K373P70p75k590m805p020q400q408p499o699o381o100
54743A99998n556m986m336l069j329m41j320k998l628k583p51Q78J935K279J869
54728A75962J212J119J814K701L162L207L307L823M755N706O179N991N396M641
54714B28975L651K374J085N5q69k023l444m853n979o660o741o166n089l855k957
54699A87504k815l357l836l605k897k376k109j661j157j236j808j913j138k53
54685A57343M2M6K16L26K06L86J148J698J217J52m74n01m88o30p57j007j582k062
$$ plain form
54667 155279 153443 152440 152286 152771 153726 154759 155324 155356 155375 155719 156147 156351 156333 156099 155566 155020 155048 155706 156343
54648 156343 156578 156881 157793 159069 160038 160410 160323 160019 159818 160049 160603 160900 160537 159686 158714 157891 157593 158181 159337
54629 159337 160113 160051 159755 159976 160625 161068 160910 160014 158329 156215 154556 153989 154285 154877 155635 156684 157858
54612 157858 158813 159436 159709 159493 158859 158319 158345 158939 159905 161106 162114 162235 161403 160568 160541 160888 160636 159658 158647
54593 158647 158003 157536 157129 156926 156813 156385 155557 154813 154729 155524 156928 158241 158694 158151 157302 156915 157147 157837
54575 157837 158967 160303 161021 160504 159309 158613 158778 159142 159170 159093 159263 159579 159747 159675 159386 158964 158682 158810 159180
54556 159180 159288 158851 157943 156626 154945 153344 152578 152962 154111 155552 157182 158932 160422 161373 162087 163063
54540 163063 164259 165067 165141 164961 165387 166696 168172 168783 168231 167237 166759 167083 167772 168336 168715 169112 169548 169755
$$ packed form
54667A55279j836j003j54M85R55J033N65L2J9L44M28K04j8k34n33n46K8O58O37
54648A56343K35L03R12J276R69L72q7l04k01K31N54K97l63q51r72q23k98N88J156
54629A59337P76o2k96K21O49M43j58q96j685k114j659n67K96N92P58J049J174
54612A57858R55O23K73k16o34n40K6N94R66J201J008J21q32q35k7L47k52r78j011
54593A58647o44m67m07k03j13m28q28p44q4P95J404J313M53n43q49l87K32O90
54575A57837J130J336P18n17j195o96J65L64K8p7J70L16J68p2k89m22k82J28L70
54556A59180J08m37r08j317j681j601p66L84J149J441J630J750J490R51P14R76
54540A63063J196Q08P4j80M26J309J476O11n52r94m78L24O89N64L79L97M36K07
$$ plain form
54522 169755 169505 168971 168632 168759 169064 169038 168543 167894 167456 167405 167849 168805 169932 170586 170350 169391 168292 167640 167704
54503 167704 168173 168232 167270 165562 163975 163071 162894 163502 165035 167142 169015 170222 170918 171074 170294 168784 167763
54486 167763 168212 169685 170946 171400 171311 171083 171003 171411 172367 173289 173536 173263 173188 173585 174023 174057 173734 173385 173263
54467 173263 173345 173289 172747 171955 171761 172753 174549 176202 177067 177121 176761 176507 176554 176415 175512 174231 173657 173989 174163
54448 174163 173581 173152 173699 174317 173589 171785 170472 170300 170551 170706 171015 171499 171701 171646 171889 172358 172331 171821 171839
54429 171839 172839 173964 174339 174156 173944 173717 173476 173685 174504 175295 175563 175794 176640 177832 178664 179114 179718 180660
54411 180660 181627 182335 182615 182222 181114 179766 178723 178045 177571 177458 177932 178736 179323 179573 179841 180414 181266 182287
54393 182287 183332 184094 184298 184081 183929 184193 184808 185445 185807 185888 186040 186697 187882 189120 189915 190169 190026 189577
$$ packed form
54522A69755k50n34l39J27L05k6m95o49m38n1M44R56J127O54k36r59j099o52O4
54503A67704M69N9r62j708j587r04j77O08J533K107J873J207O96J56p80j510j021
54486A67763M49J473J261M54q9k28q0M08R56R22K47k73p5L97M38L4l23l49j22
54467A73263Q2n6n42p92j94R92J796J653Q65N4l60k54M7j39r03j281n74L32J74
54448A74163n82m29N47O18p28j804j313j72K51J55L09M84K02n5K43M69k7n10J8
54429A71839J000J125L75j83k12k27k41K09Q19P91K68K31Q46J192Q32M50O04R42
54411A80660R67P08K80l93j108j348j043o78m74j13M74Q04N87K50K68N73Q52J021
54393A82287J045P62K04k17j52K64O15O37L62Q1J52O57J185J238P95K54j43m49
$$ plain form
54375 189577 188884 188097 187347 186619 185933 185557 185904 187219 189308 191464 192798 192967 192526 192301 192471 192671 192844
54358 192844 193341 194113 194469 193994 193160 192672 192672 192958 193477 194122 194407 193941 192992 192123 191457 190777 190090 189616 189373
54339 189373 189224 189221 189457 189759 190005 190574 191840 193323 194055 193943 194116 195599 198175 200958 203666 206740 210422
54322 210422 214396 218472 223099 228770 235056 240663 244613 247131 249177 251221 252759 252964 251507 248607
54308 248607 244608 239811 234637 229599 225039 220933 216997 212929 208654 204469 200885 198213 196295 194764
54294 194764 193509 192699 192333 191983 191214 190201 189688 190238 191623 193094 194112 194600 194571 193904 192693 191554 191189
54277 191189 191693 192511 193063 193214 193213 193419 194098 195267 196631 197789 198540 198916 198982 198723 198068 196901 195154 193093
54259 193093 191390 190648 190883 191660 192666 193857 195156 196385 197553 198885 200422 201847 202826 203344 203607 203814
$$ packed form
54375A89577o93p87p50p28o86l76L47J315K089K156J334J69m41k25J70K00J73
54358A92844M97P72L56m75q34m88%K86N19O45K85m66r49q69o66o80o87m74k43
54339A89373j49lK36L02K46N69J266J483P32j12J73J483K576K783K708L074L682
54322B10422L974M076M627N671O286N607L950K518K046K044J538K05j457k900
54308B48607l999m797n174n038m560m106l936m068m275m185l584k672j918j531
54294A94764j255q10l66l50p69j013n13N50J385J471J018M88k9o67j211j139l65
54277A91189N04Q18N52J51jK06O79J169J364J158P51L76O6k59o55j167j747k061
54259A93093j703p42K35P77J006J191J299J229J168J332J537J425R79N18K63K07
$$ plain form
54243 203814 204122 204643 205288 205677 205397 204411 203203 202395 202092 201654 200338 198207 196082 194502 193143 191504
54227 191504 189740 188447 187945 188208 189109 190220 190731 190259 189577 189829 191095 192391 192981 192972 192691 192360 192464 193590
54209 193590 195524 197210 197876 197648 196862 195540 193928 192775 192530 192808 193123 193642 194697 196081 197379 198573
54193 198573 199756 200583 200622 199968 199043 198052 197085 196420 196228 196250 196222 196344 196797 197140 196785 195883 195132 194858 194900 195283
54173 195283 196349 198122 200049 201565 202567 203263 203810 204132 203907 202837 201181 199848 199587 200126 200451 199902
54157 199902 198702 197447 196400 195328 193875 192028 190197 188698 187254 185425 183600 182960 184069 186013
54143 186013 187450 188106 188706 189816 191420 193284 194962 195655 194969 193830 193814 195364 197383 198753 199531 200309
54127 200309 201067 201262 200716 199864 199258 199119 199295 199446 199376 199301 199674 200683 202129 203798 205634 207476 208965
$$ packed form
54243B03814L08N21O45L89k80r86j208q08l03m38j316k131k125j580j359j639
54227A91504j764j293n02K63R01J111N11m72o82K52J266J296N90rk81l31J04J126
54209A93590J934J686O66k28p86j322j612j153k45K78L15N19J055J384J298J194
54193A98573J183Q27L9o54r25r91r67o65j92K2k8J22M53L43l55r02p51k74M2L83
54173A95283J066J773J927J516J002O96N47L22k25j070j656j333k61N39L25n49
54157A99902j200j255j047j072j453j847j831j499j444j829j825o40J109J944
54143A86013J437O56O00J110J604J864J678O93o86j139j6J550K019J370P78P78
54127B00309P58J95n46q52o06j39J76J51p0p5L73J009J446J669J836J842J489
$$ plain form
54110 208965 209939 210655 211376 211915 211857 211155 210258 209659 209446 209308 208929 208346 207843 207509 207035 206129 205054 204476 204775
54091 204775 205664 206545 207016 207021 206691 206225 205882 206022 206982 208753 210714 212002 212378 212559 213382 214765 215837 216041
54073 216041 215709 215550 215937 216870 218285 220120 222175 224066 225345 225726 225358 224846 224762 225092 225352 225272 225117 225280
54055 225280 225801 226428 226945 227278 227452 227676 228406 230099 232850 236308 239965 243501 246899 250348 254095 258375
54039 258375 263333 268889 274757 280716 286870 293454 300424 307471 314535 322015 330236 338929 347460 355433
54025 355433 362766 369308 374757 379037 382534 385814 389141 392256 394574 395680 395764 395516 395548 395996 396678 397410
54009 397410 398031 398435 398861 399991 402518 406737 412757 420832 431073 443052 456052 469485 482396 492563
53995 492563 496950 493617 483015 467153 447921 426652 404904 384696 367445 353038 340384 328816
$$ packed form
54110B08965R74P16P21N39n8p02q97n99k13j38l79n83n03l34m74r06j075n78K99
54091B04775Q89Q81M71Nl30m66l43J40R60J771J961J288L76J81Q23J383J072K04
54073B16041l32j59L87R33J415J835K055J891J279L81l68n12q4L30K60q0j55J63
54055B25280N21O27N17L33J74K24P30J693K751L458L657L536L398L449L747M280
54039B58375M958N556N868N959O154O584O970P047P064P480Q221Q693Q531P973
54025C55433P333O542N449M280L497L280L327L115K318J106Q4k48L2M48O82P32
54009C97410O21M04M26J130K527M219O020Q075J0241J1979J3000J3433J2911J0167
53995D92563M387l333j0602j5862j9232k1269k1748k0208j7251j4407j2654j1568
$$ plain form
53983 328816 318572 309972 302667 296031 289973 284885 280936 277867 275455 273650 272178 270482 268329 266095
53969 266095 264204 262622 261177 259955 259005 257955 256427 254742 253776 254031 255101 256056 256240 255793 255488 255992
53953 255992 257264 258852 260635 262816 265203 267156 268538 270100 272466 275367 278411 282035 286872 292533
53939 292533 297938 302743 307603 313017 318651 323943 328753 333219 337519 341942 346756 351827 356729 361287
53925 361287 365667 369978 374244 378799 384235 390807 398243 406206 414584 423332 432318 441361 450153 458336
53911 458336 466044 474121 483207 492755 501541 509016 515472 520955 524875 526822 527007 525694 522939 519161
53897 519161 515209 511441 507325 502318 496575 490409 483629 475920 467445 458629 449699 440788 432109 423649
53883 423649 415024 406006 396855 387887 379117 370652 363033 356769 351792 347683 344091 340678 337073 333218
$$ packed form
53983C28816j0244q600p305o636o058n088l949l069k412j805j472j696k153k234
53969B66095j891j582j445j222r50j050j528j685r66K55J070R55J84m47l05N04
53953B55992J272J588J783K181K387J953J382J562K366K901L044L624M837N661
53939B92533N405M805M860N414N634N292M810M466M300M423M814N071M902M558
53925C61287M380M311M266M555N436O572P436P963Q378Q748Q986R043Q792Q183
53911D58336P708Q077R086R548Q786P475O456N483L920J947J85j313k755l778
53897E19161l952l768m116n007n743o166o780p709q475q816q930q911q679q460
53883D23649q625r018r151q968q770q465p619o264m977m109l592l413l605l855
$$ plain form
53869 333218 329400 325697 321814 317795 314297 311709 309488 306904 304028 301425 299241 297220 295328 293750
53855 293750 292499 291609 291443 292175 293162 293486 293061 292571 292433 292507 292838 294000 296513 300445 305721 312347 320215
53838 320215 329148 339369 351547 366239 383563 403441 425740 450030 475571 501536 526584 547902
53826 547902 561455 564134 555972 539979 519908 498434 477231 457922 442156 430677 422701 416548
53814 416548 410928 405567 400639 395841 390252 383177 375031 367252 361183 357029 353955 351230 349147 348692
53800 348692 350432 353911 358107 362309 366567 371355 376765 381986 385854 388080 389652 391677 394074 395901
53786 395901 396778 397280 397896 398316 398009 396925 395239 392901 389853 386357 382653 378556 373733 368184 362148
53771 362148 355763 349139 342555 336255 330194 324252 318523 313190 308313 303961 300295 297254 294371 291187
$$ packed form
53869C33218l818l703l883m019l498k588k221k584k876k603k184k021j892j578
53855B93750j251q90j66P32R87L24m25m90j38P4L31J162K513L932N276O626P868
53838C20215Q933J0221J2178J4692J7324J9878K2299K4290K5541K5965K5048K1318
53826E47902J3553K679q162j5993k0071k1474k1203j9309j5766j1479p976o153
53814D16548n620n361m928m798n589p075q146p779o069m154l074k725k083m55
53800C48692J740L479M196M202M258M788N410N221L868K226J572K025K397J827
53786C95901Q77N02O16M20l07j084j686k338l048l496l704m097m823n549o036
53771C62148o385o624o584o300o061n942n729n333m877m352l666l041k883l184
$$ plain form
53757 291187 287678 284136 280886 278228 276278 274623 272595 270181 268274 267639 268018 268680 269422 270485 271781
53742 271781 272813 273218 273037 272635 272715 273943 276062 277755 277976 277105 276185 275439 274360 272952 271846 271208 270500
53725 270500 269543 268955 269259 270261 271615 273356 275505 277691 279534 281010 282250 283417 284957 287388 290478
53710 290478 293122 294454 294782 295099 296050 297692 299898 302523 305317 308056 310763 313629 316803 320327 324085
53695 324085 327729 330916 333709 336520 339619 342939 346400 350004 353446 355977 356938 356263 354424 352152 350238
53680 350238 349120 348431 347351 345607 343799 342542 341714 340834 339731 338507 337135 335555 333906 332356 330893
53665 330893 329565 328615 328069 327496 326579 325621 325054 324734 324206 323477 322913 322499 321789 320669 319642 319238 319487 320099
53647 320099 320809 321478 322177 323200 324664 326081 326730 326547 326295 326744 328051 329995 332304 334472 335819 336182
$$ packed form
53757B91187l509l542l250k658j950j655k028k414j907o35L79O62P42J063J296
53742B71781J032M05j81m02Q0J228K119J693K21q71r20p46j079j408j106o38p08
53725B70500r57n88L04J002J354J741K149K186J843J476J240J167J540K431L090
53710B90478K644J332L28L17R51J642K206K625K794K739K707K866L174L524L758
53695C24085L644L187K793K811L099L320L461L604L442K531R61o75j839k272j914
53680C50238j118o89j080j744j808j257q28q80j103j224j372j580j649j550j463
53665C30893j328r50n46n73r17r58n67l20n28p29n64m14p10j120j027m04K49O12
53647C20099P10O69O99J023J464J417O49j83k52M49J307J944K309K168J347L63
$$ plain form
53631 336182 336322 337117 338577 340085 341466 343228 345656 348300 350646 352915 355743 359279 363039 366609 370095
53616 370095 373753 377482 380945 384041 387060 390456 394608 399690 405475 411228 416093 419799 422942 426431
53602 426431 430659 435250 439482 442898 445568 447909 450212 452283 453594 453860 453359 452569 451578 450098 448024
53587 448024 445757 443876 442632 441807 440953 439724 438169 436740 435809 435102 433915 432044 430172 428906 427750
53572 427750 425656 422539 419622 418038 417690 417858 418361 419493 421108 422556 423569 424531 425713 426727 427068
53557 427068 426866 426734 427149 428205 429798 431745 433808 435813 437721 439542 441361 443568 446760 451194 456588
53542 456588 462739 470049 478977 489049 498953 507684 515157 521554 526629 530111 532482 534756 537456 540306
53528 540306 543100 546477 551427 558218 566256 575017 584733 595960 608772 622668 637116 651957 667340
$$ packed form
53631C36182J40P95J460J508J381J762K428K644K346K269K828L536L760L570L486
53616C70095L658L729L463L096L019L396M152N082N785N753M865L706L143L489
53602D26431M228M591M232L416K670K341K303K071J311K66n01p90r91j480k074
53587D48024k267j881j244q25q54j229j555j429r31p07j187j871j872j266j156
53572D27750k094l117k917j584l48J68N03J132J615J448J013R62J182J014L41
53557D27068k02j32M15J056J593J947K063K005J908J821J819K207L192M434N394
53542D56588O151P310Q928J0072R904Q731P473O397N075L482K371K274K700K850
53528E40306K794L377M950O791Q038Q761R716J1227J2812J3896J4448J4841J5383
$$ plain form
53515 667340 683540 700830 719343 739066 760054 782477 806286 831038 856372 882451 909539
53504 909539 937258 964807 991881 1018829 1045738 1071930 1096692 1120055 1142565 1164612 1186353
53493 1186353 1207917 1229284 1250158 1270338 1290093 1309844 1329643 1349254 1368623 1388042 1407882
53482 1407882 1428277 1448859 1468771 1487351 1504960 1522617 1540514 1557441 1572127 1584555 1595235
53471 1595235 1603673 1608578 1609502 1607422 1603584 1598462 1591904 1583543 1572804 1559214 1543079 1525419 1507014
53458 1507014 1487990 1468507 1449120 1430023 1410517 1389814 1368020 1345822 1323520 1300996 1278394
53447 1278394 1256111 1234172 1212274 1190634 1170160 1151485 1134260 1117867 1102512 1089022 1077676
53436 1077676 1067819 1058814 1050935 1044989 1041312 1039463 1038731 1038610 1038894 1039706 1041452 1044495 1048933 1054920 1062913
$$ packed form
53515F67340J6200J7290J8513J9723K0988K2423K3809K4752K5334K6079K7088
53504I09539K7719K7549K7074K6948K6909K6192K4762K3363K2510K2047K1741
53493A186353K1564K1367K0874K0180J9755J9751J9799J9611J9369J9419J9840
53482A407882K0395K0582J9912J8580J7609J7657J7897J6927J4686J2428J0680
53471A595235Q438M905R24k080l838n122o558q361j0739j3590j6135j7660j8405
53458A507014j9024j9483j9387j9097j9506k0703k1794k2198k2302k2524k2602
53447A278394k2283k1939k1898k1640k0474j8675j7225j6393j5355j3490j1346
53436A077676r857r005p879n946l677j849p32j21K84Q12J746L043M438N987P993
$$ plain form
53421 1062913 1073120 1084956 1097751 1111910 1128498 1147507 1167621 1188142 1210180 1235098 1262652
53410 1262652 1291689 1322076 1354661 1389631 1426179 1463899 1503308 1544745 1587791 1632273 1678927
53399 1678927 1728406 1780176 1833048 1886557 1941368 1998466 2058104 2119365 2180651 2240965 2300743
53388 2300743 2361052 2421928 2482057 2540242 2596595 2651936 2706446 2759272 2809148 2855115 2896938
53377 2896938 2935063 2969925 3001099 3027424 3048112 3063405 3073969 3080027 3081247 3077098 3067027 3050587
53365 3050587 3027654 2998281 2962302 2919484 2870294 2816093 2758402 2698358 2636978 2575347 2514151
53354 2514151 2453485 2393455 2334591 2277355 2221696 2167475 2114877 2063990 2014397 1965686 1917986
53343 1917986 1871442 1825475 1779236 1732759 1687250 1644227 1604572 1568104 1533692 1500030 1466732
$$ packed form
53421A062913J0207J1836J2795J4159J6588J9009K0114K0521K2038K4918K7554
53410A262652K9037L0387L2585L4970L6548L7720L9409M1437M3046M4482M6654
53399A678927M9479N1770N2872N3509N4811N7098N9638O1261O1286O0314N9778
53388B300743O0309O0876O0129N8185N6353N5341N4510N2826M9876M5967M1823
53377B896938L8125L4862L1174K6325K0688J5293J0564O058J220m149j0071j6440
53365C050587k2933k9373l5979m2818m9190n4201n7691o0044o1380o1631o1196
53354B514151o0666o0030n8864n7236n5659n4221n2598n0887m9593m8711m7700
53343A917986m6544m5967m6239m6477m5509m3023l9655l6468l4412l3662l3298
$$ plain form
53332 1466732 1434662 1405024 1378431 1354975 1334523 1316364 1299063 1281528 1264093 1247841 1233022
53321 1233022 1218852 1204778 1191174 1178689 1167643 1158342 1151280 1146518 1143148 1139837 1135891 1131766 1128718
53308 1128718 1127997 1130067 1134429 1140280 1147390 1156149 1166876 1179431 1193555 1209250 1226619 1245643 1266335
53295 1266335 1288944 1313758 1340678 1369120 1398339 1427809 1457386 1487185 1517344 1547779 1578042
53284 1578042 1607302 1634617 1659394 1681632 1701607 1719400 1734869 1747929 1758479 1766117 1770359 1771243
53272 1771243 1769277 1764607 1756711 1745197 1730492 1713372 1694150 1672771 1649441 1624682 1598914 1572395
53260 1572395 1545417 1518159 1490456 1462044 1432902 1403062 1372353 1340772 1308903 1277399 1246211
53249 1246211 1214887 1183604 1153207 1124054 1095393 1066218 1036413 1006773 978159 950904 924856
$$ packed form
53332A466732l2070k9638k6593k3456k0452j8159j7301j7535j7435j6252j4819
53321A233022j4170j4074j3604j2485j1046r301p062m762l370l311l946m125l048
53308A128718p21K070M362N851P110Q759J0727J2555J4124J5695J7369J9024K0692
53295A266335K2609K4814K6920K8442K9219K9470K9577K9799L0159L0435L0263
53284A578042K9260K7315K4777K2238J9975J7793J5469J3060J0550P638M242Q84
53272A771243j966m670p896j1514j4705j7120j9222k1379k3330k4759k5768k6519
53260A572395k6978k7258k7703k8412k9142k9840l0709l1581l1869l1504l1188
53249A246211l1324l1283l0397k9153k8661k9175k9805k9640k8614k7255k6048
$$ plain form
53238 924856 899688 875157 851204 827913 805466 784172 764443 746620 730824 716938 704522
53227 704522 692739 680816 668848 657808 648322 639695 630588 620438 609669 598696 587411 575724
53215 575724 563916 552191 540348 528250 516282 504987 494510 484666 475411 466977 459595 453271
53203 453271 447759 442643 437515 432207 426846 421610 416463 411157 405518 399718 394205 389270 384730 380184
53189 380184 375566 371180 367154 363253 359431 356168 353842 352063 350126 347973 346170 344952 343825 342285
53175 342285 340536 339241 338789 338986 339383 339742 340172 340809 341385 341344 340552 339665 339525 340278 341318 341966 341935 341271
53157 341271 340231 339207 338471 338009 337768 337916 338528 339161 339192 338572 337877 337557 337471 337170 336329 334881 333033 331226
53139 331226 329780 328564 327282 326098 325621 326186 327404 328486 328797 328123 326764 325428 324760 324813 325115 325273
$$ packed form
53238I24856k5168k4531k3953k3291k2447k1294j9729j7823j5796j3886j2416
53227G04522j1783j1923j1968j1040r486q627r107j0150j0769j0973j1285j1687
53215E75724j1808j1725j1843j2098j1968j1295j0477r844r255q434p382o324
53203D53271n512n116n128n308n361n236n147n306n639n800n513m935m540m546
53189C80184m618m386m026l901l822l263k326j779j937k153j803j218j127j540
53175C42285j749j295m52J97L97L59M30O37N76m1p92q87j40P53J040O48l1o64
53157C41271j040j024p36m62k41J48O12O33L1o20o95l20q6l01q41j448j848j807
53139C31226j446j216j282j184m77N65J218J082L11o74j359j336o68N3L02J58
$$ plain form
53123 325273 325340 325614 326281 327197 327823 327464 325917 323878 322441 322151 322713 323514 324118 324311 324015 323251 322022 320262
53105 320262 318048 315685 313365 310936 308334 305998 304472 303742 303353 302976 302424 301365 299643 297815 296729
53090 296729 296511 296451 295942 295070 294271 293930 294331 295430 296597 297062 296723 296093 295500 294839 294113 293653 293739 294463 295901
53071 295901 297826 299442 300148 300542 301764 303761 305150 305064 304211 303695 303712 303920 304228 304550 304519 304185 304427 305935
53053 305935 308190 310121 311401 312555 314176 316539 319535 322418 324177 324747 325311 326666 327861 327365 325151
53038 325151 322592 320559 318770 317007 315738 315181 314670 313494 311705 309650 307276 304454 301624 299524 298362
53023 298362 297690 297080 296615 296601 297058 297672 298239 298902 299781 300535 300671 300330 300360 301365 302977 304337 305087 305578
53005 305578 306252 307118 307744 307604 306525 304966 303699 303116 302982 302936 302876 302721 302252 301476 300771 300332 299874 299283
$$ packed form
53123C25273O7K74O67R16O26l59j547k039j437k90N62Q01O04J93k96p64j229j760
53105C20262k214k363k320k429k602k336j526p30l89l77n52j059j722j828j086
53090B96729k18o0n09q72p99l41M01J099J167M65l39o30n93o61p26m60Q6P24J438
53071B95901J925J616P06L94J222J997J389q6q53n16J7K08L08L22l1l34K42J508
53053C05935K255J931J280J154J621K363K996K883J759N70N64J355J195m96k214
53038C25151k559k033j789j763j269n57n11j176j789k055k374k822k830k100j162
53023B98362o72o10m65j4M57O14N67O63Q79P54J36l41L0J005J612J360P50M91
53005C05578O74Q66O26j40j079j559j267n83j34m6o0j55m69p76p05m39m58n91
$$ plain form
52987 299283 299164 300214 302311 304773 307246 309740 311943 313246 313557 313544 313907 314788 315989 317310 318530 319409
52971 319409 319993 320719 321995 323743 325470 326785 327814 329056 330761 332521 333779 334649 335799 337373 338577
52956 338577 338740 338294 338168 338483 338458 337505 335835 334004 332313 330738 329094 327199 325054 322829 320603 318342
52940 318342 316297 315074 314942 315374 315618 315481 315161 314708 314088 313470 312888 311931 310338 308678 307744 307543 307511 307504
52922 307504 307774 308075 307655 306200 304092 301742 299409 297712 297431 298538 300137 301540 302757 303833 304548
52907 304548 305043 305890 307124 307918 307744 307166 306970 307130 307227 307314 307688 308209 308508 308611 308765 308915 308823 308507 308045
52888 308045 307219 305888 304501 303707 303573 303655 303677 303649 303436 302770 301730 300791 300295 300161 300082 299737 298876 297537 296170
52869 296170 295273 294982 295188 295900 297157 298714 300168 301361 302371 303218 303922 304765 306120 308025 310177 312266
$$ packed form
52987B99283j19J050K097K462K473K494K203J303L11j3L63Q81J201J321J220Q79
52971C19409N84P26J276J748J727J315J029J242J705J760J258Q70J150J574J204
52956C38577J63m46j26L15k5r53j670j831j691j575j644j895k145k225k226k261
52940C18342k045j223j32M32K44j37l20m53o20o18n82r57j593j660r34k01l2p
52922C07504K70L01m20j455k108k350k333j697k81J107J599J403J217J076P15
52907C04548M95Q47J234P94j74n78j96J60R7Q7L74N21K99J03J54J50r2l16m62
52888C08045q26j331j387p94j34Q2K2k8k13o66j040r39m96j34p9l45q61j339j367
52869B96170q97k91K06P12J257J557J454J193J010Q47P04Q43J355J905K152K089
$$ plain form
52853 312266 313949 314650 313921 312057 309864 307747 305462 302848 300284 298148 296301 294482 292865 291776 291085
52838 291085 290265 288980 287241 285153 282890 280925 279839 279704 279892 279674 278940 278293 278495 279766 281522 282820
52822 282820 283228 283181 283331 283682 283661 282938 281764 280541 279549 279214 280054 282009 284288 286281 288183 290252 292005
52805 292005 292977 293896 296054 299412 302356 303687 303958 304271 304569 303895 301869 299005 295784 292262 288639 285568
52789 285568 283638 282804 282443 281817 280626 279317 278642 278686 278613 277720 276351 275260 274428 273344 272273 272336 274084
52772 274084 276762 279330 281631 284130 286950 289669 291860 293450 294667 295846 297130 298210 298492 297719 296291
52757 296291 294916 294095 293961 294330 294813 295107 295308 295793 296794 298277 300172 302336 304292 305561 306434 307984
52741 307984 310941 314797 318261 320419 321311 321641 322110 322765 322838 321498 318894 316159 314218 313021 312151 311684
$$ packed form
52853C12266J683P01p29j864k193k117k285k614k564k136j847j819j617j089o91
52838B91085q20j285j739k088k263j965j086j35J88k18p34o47K02J271J756J298
52822B82820M08m7J50L51k1p23j174j223r92l35Q40J955K279J993J902K069J753
52805B92005R72R19K158L358K944J331K71L13K98o74k026k864l221l522l623l071
52789B85568j930q34l61o26j191j309o75M4p3q93j369j091q32j084j071O3J748
52772B74084K678K568K301K499K820K719K191J590J217J179J284J080K82p73j428
52757B96291j375q21j34L69M83K94K01M85J001J483J895K164J956J269Q73J550
52741C07984K957L856L464K158Q92L30M69O55P3j340k604k735j941j197q70m67
$$ plain form
52725 311684 311937 312733 313521 314144 314930 315973 316761 316690 315754 314590 313935 313965 314120 313660 312483 311226 310449 309989
52707 309989 309333 308349 307345 306576 306061 305778 305675 305498 304912 303849 302544 301299 300428 300354 301389 303309 305315
52690 305315 306537 306590 305803 305040 305104 306067 307295 308391 309879 312543 316150 319388 321204 321796 322069 322490 322791
52673 322791 322551 321740 320768 320248 320625 321760 322944 323546 323615 323664 323929 324089 323755 322899 321738 320482 319410 318956
52655 318956 319383 320411 321433 322057 322269 322196 322016 322065 322606 323355 323592 322946 321817 320823 320123 319522 318998 318721
52637 318721 318703 318750 318722 318616 318465 318404 318722 319640 321191 323470 326732 330878 335134 338686 341480 343938 346045
52620 346045 347254 347186 345857 343331 339846 336301 333815 332541 331512 329924 327943 326057 324323 322691 321466
52605 321466 320845 320466 319948 319471 319342 319360 319230 319259 319960 321174 322213 322789 323193 323619 323955 324315 325195 326788
$$ packed form
52725C11684K53P96P88O23P86J043P88p1r36j164o55L0J55m60j177j257p77m60
52707C09989o56r84j004p69n15k83j03j77n86j063j305j245q71p4J035J920K006
52690C05315J222N3p87p63O4R63J228J096J488K664L607L238J816N92K73M21L01
52673C22791k40q11r72n20L77J135J184O02O9M9K65J60l34q56j161j256j072m54
52655C18956M27J028J022O24K12p3j80M9N41P49K37o46j129r94p00o01n24k77
52637C18721j8M7k8j06j51o1L18R18J551K279L262M146M256L552K794K458K107
52620C46045J209o8j329k526l485l545k486j274j029j588j981j886j734j632j225
52605C21466o21l79n18m77j29J8j30K9P01J214J039N76M04M26L36L60Q80J593
$$ plain form
52587 326788 328563 329759 330138 330140 330450 331468 333071 334809 336332 337517 338227 338323 338101 338262 338982 339362 338446
52570 338446 336687 335707 336496 338313 339601 339522 338424 337226 336720 337191 338273 339167 339238 338463 337269 335959 334438
52553 334438 332533 330525 329219 329240 330254 331116 330987 330136 329450 329371 329632 329928 330387 331163 331958 332248 332001 331920
52535 331920 332794 334608 336420 337286 337196 336921 337003 337244 337234 336967 336681 336466 336349 336521 337066 337642 337804 337619 337578
52516 337578 338007 338860 340067 341676 343603 345580 347488 349559 352101 355119 358266 361120 363503 365532 367242
52501 367242 368213 367829 366029 363470 360813 358158 355376 352585 349858 346840 343256 339589 336708 334872 333657
52486 333657 332832 332686 333379 334503 335570 336573 337830 339497 341420 343265 344672 345438 345634 345466 345101 344827
52470 344827 345165 346463 348431 350460 352368 354468 356909 359365 361490 363318 365145 367301 370045 373261
$$ packed form
52587C26788J775J196L79KL10J018J603J738J523J185P10R6k22J61P20L80r16
52570C38446j759r80P89J817J288p9j098j198n06M71J082Q94P1p75j194j310j521
52553C34438j905k008j306K1J014Q62j29q51o86p9K61K96M59P76P95K90k47q1
52535C31920Q74J814J812Q66r0k75Q2K41j0k67k86k15j17J72N45N76J62j85m1
52516C37578M29Q53J207J609J927J977J908K071K542L018L147K854K383K029J710
52501C67242R71l84j800k559k657k655k782k791k727l018l584l667k881j836j215
52486C33657q25j46O93J124J067J003J257J667J923J845J407P66J96j68l65k74
52470C44827L38J298J968K029J908K100K441K456K125J828J827K156K744L216
$$ plain form
52456 373261 376238 378100 378559 377941 376463 373941 370291 365841 361086 356528 352856 350657 349690 348962 347857
52441 347857 346734 346092 345621 344621 343016 341415 340319 339730 339441 339257 338992 338564 338105 337693 337103 336107 334980
52424 334980 334345 334476 335012 335429 335592 335814 336506 337790 339346 340632 341355 341810 342755 344912 348504 353173 358387
52407 358387 364038 370584 378489 387642 397580 408134 419435 431253 442721 452767 460425 464713 464828
52394 464828 460848 453871 445167 435554 425779 416824 409124 401957 394409 386881 380885 377422 376204 376509
52380 376509 377922 379942 381636 382362 382554 383245 385014 387804 391487 395985 400904 405670 410279 415375 421238
52365 421238 427010 431404 433981 435277 435751 435229 433610 431542 429890 428762 427577 426060 424628 423702 423080
52350 423080 422285 421234 420334 420114 420982 423126 426316 429814 432769 434829 436351 438046 440499 443963 448438
$$ packed form
52456C73261K977J862M59o18j478k522l650m450m755m558l672k199r67p28j105
52441C47857j123o42m71j000j605j601j096n89k89j84k65m28m59m12n90r96j127
52424C34980o35J31N36M17J63K22O92J284J556J286P23M55R45K157L592M669N214
52407C58387N651O546P905R153R938J0554J1301J1818J1468J0046P658M288J15
52394D64828l980o977q704r613r775q955p700p167p548p528n996l463j218L05
52380C76509J413K020J694P26J92O91J769K790L683M498M919M766M609N096N863
52365D21238N772M394K577J296M74n22j619k068j652j128j185j517j432r26o22
52350D23080p95j051r00k20Q68K144L190L498K955K060J522J695K453L464M475
$$ plain form
52335 448438 453858 460144 467106 474426 481911 489772 498491 508412 519570 531870 545204 559406 574338
52322 574338 590063 606686 624000 641555 659203 677131 695161 712356 727794 741581 754745
52311 754745 768149 781891 795750 809866 824722 840560 857028 873478 889601 905644 921933
52300 921933 938282 954114 969035 982952 995595 1006411 1015195 1022402 1028419 1032763 1034435 1032991 1028894
52287 1028894 1022989 1016049 1008780 1001750 995138 988837 982875 977489 972797 968760 965593 963850 963848 965234 967340
52272 967340 969871 973095 977530 983573 991254 1000147 1009589 1019229 1029381 1040745 1053724 1068016 1082848
52259 1082848 1097604 1112283 1127283 1142694 1157907 1172180 1185573 1198939 1212821 1226643 1239266
52248 1239266 1250180 1259805 1268630 1276367 1282082 1285014 1285234 1283651 1281452 1279445 1277773 1276194 1274503 1272607
$$ packed form
52335D48438N420O286O962P320P485P861Q719R921J1158J2300J3334J4202J4932
52322E74338J5725J6623J7314J7555J7648J7928J8030J7195J5438J3787J3164
52311G54745J3404J3742J3859J4116J4856J5838J6468J6450J6123J6043J6289
52300I21933J6349J5832J4921J3917J2643J0816Q784P207O017M344J672j444m097
52287A028894n905o940p269p030o612o301n962n386m692m037l167j743kJ386K106
52272I67340K531L224M435O043P681Q893R442R640J0152J1364J2979J4292J4832
52259A082848J4756J4679J5000J5411J5213J4273J3393J3366J3882J3822J2623
52248A239266J0914R625Q825P737N715K932K20j583k199k007j672j579j691j896
$$ plain form
52234 1272607 1270443 1268161 1266323 1265459 1265240 1264550 1262717 1260390 1258699 1257746 1256605 1254835 1253310 1253156 1254341
52219 1254341 1255914 1257366 1259139 1261726 1264843 1267823 1270565 1273728 1278025 1283555 1289929 1296837 1304300 1312356
52205 1312356 1320783 1329381 1338354 1348072 1358396 1368611 1378149 1387065 1395556 1403432 1410425 1416824 1423350
52192 1423350 1430517 1438366 1446678 1455036 1462859 1469801 1476060 1481868 1486848 1490375 1492397 1493214 1492475 1489226
52178 1489226 1483187 1475206 1466106 1455787 1444005 1431311 1418531 1405844 1393254 1381602 1372129 1365005
52166 1365005 1359185 1353934 1349759 1347527 1347288 1348507 1350999 1355007 1360428 1366482 1372286 1377465 1381933 1385261
52152 1385261 1386637 1385664 1383002 1379842 1376764 1373485 1369855 1366646 1364890 1364695 1365249 1365912 1366709 1367650 1368108 1367316
52136 1367316 1365200 1362396 1359521 1356674 1353575 1350000 1346155 1342792 1340971 1341507 1344655 1350410 1359002 1370787
$$ packed form
52234A272607k164k282j838q64k19o90j833k327j691r53j141j770j525j54J185
52219A254341J573J452J773K587L117K980K742L163M297N530O374O908P463Q056
52205A312356Q427Q598Q973R718J0324J0215R538Q916Q491P876O993O399O526
52192A423350P167P849Q312Q358P823O942O259N808M980L527K022Q17p39l249
52178A489226o039p981r100j0319j1782j2694j2780j2687j2590j1652r473p124
52166A365005n820n251m175k232k39J219K492M008N421O054N804N179M468L328
52152A385261J376r73k662l160l078l279l630l209j756j95N54O63P97R41M58p92
52136A367316k116k804k875k847l099l575l845l363j821N36L148N755Q592J1785
$$ plain form
52122 1370787 1385607 1402569 1420820 1440399 1462020 1485927 1511308 1536976 1562342 1587412 1612055
52111 1612055 1635804 1658377 1679935 1700558 1719774 1736932 1751908 1765260 1777826 1790318 1803088
52100 1803088 1815961 1828336 1839756 1850427 1861015 1871878 1882591 1892190 1899650 1904225 1905601 1903907
52088 1903907 1899420 1892107 1881618 1867963 1852132 1835783 1820159 1805559 1792036 1780334 1771631 1766299
$$ packed form
52122A370787J4820J6962J8251J9579K1621K3907K5381K5668K5366K5070K4643
52111A612055K3749K2573K1558K0623J9216J7158J4976J3352J2566J2492J2770
52100A803088J2873J2375J1420J0671J0588J0863J0713R599P460M575J376j694
52088A903907m487p313j0489j3655j5831j6349j5624j4600j3523j1702q703n332
$$ [...]
##END NTUPLES=NMR SPECTRUM
##END=
