##TITLE=AC1556_ROEFFECT0016_8268968_BvRczWPmyT
##JCAMPDX= 6.0         $$ Bruker NMR JCAMP-DX V2.0
##DATA TYPE= NMR SPECTRUM
##DATA CLASS= NTUPLES
##ORIGIN= BRUKER
##OWNER= Administrator
$$ 1.72 TOPSPIN		Version 2.1
$$ 2013-10-12 21:21:48.481 -0700  Administrator@X
$$ Compression mode = diff/dup
##.OBSERVE FREQUENCY= 400.02188249412
##.OBSERVE NUCLEUS= ^1H
##.ACQUISITION MODE= SIMULTANEOUS (DQD)
##.ACQUISITION SCHEME= undefined
##.AVERAGES= 8
##.DIGITISER RES= 22
##SPECTROMETER/DATA SYSTEM= spect
##.PULSE SEQUENCE= zg30
##.SOLVENT NAME= COFFEE_meoh
##.SHIFT REFERENCE= INTERNAL, COFFEE_meoh, 1, 14.98509
##AUDIT TRAIL= $$ (NUMBER, WHEN, WHO, WHERE, PROCESS, VERSION, WHAT)
$$ ##TITLE= Audit trail, TOPSPIN		Version 2.1
$$ ##JCAMPDX= 5.01
$$ ##ORIGIN= Bruker BioSpin GmbH
$$ ##OWNER= Administrator
$$ $$ E:\/data/COFFEE/nmr/AC1556_ROEFFECT0016_8268968_BvRczWPmyT/10/pdata/1/auditp.txt
$$ ##AUDIT TRAIL=  $$ (NUMBER, WHEN, WHO, WHERE, PROCESS, VERSION, WHAT)
(   1,<2013-10-12 21:21:41.879 -0700>,<Administrator>,<X>,<go>,<TOPSPIN 2.1>,
      <created by zg
	started at 2013-10-12 21:20:35.678 -0700,
	POWCHK enabled, PULCHK disabled,
       configuration hash MD5:
       C8 4E 4E 5D D3 5C D8 9E 9F 52 82 E0 59 8A DE 15
       data hash MD5: 64K
       12 BC 5B 0C 8C 0A AB F8 B2 66 CE 7A B7 F8 32 44>)
(   2,<2013-10-12 21:21:45.054 -0700>,<Administrator>,<X>,<proc1d>,<TOPSPIN 2.1>,
      <Start of raw data processing
       efp LB = 0 FT_mod = 6 PKNL = 1 PHC0 = 0 PHC1 = 0 SI = 32K 
       data hash MD5: 32K
       DF 8D B2 22 85 7E 4B FE E3 39 AA 41 58 13 E4 92>)
(   3,<2013-10-12 21:21:45.342 -0700>,<Administrator>,<X>,<proc1d>,<TOPSPIN 2.1>,
      <pk PHC0 = 97.33337 PHC1 = 0 
       data hash MD5: 32K
       D4 82 87 92 1E F2 2F 47 03 39 D5 45 69 4E B3 70>)
(   4,<2013-10-12 21:21:45.433 -0700>,<Administrator>,<X>,<proc1d>,<TOPSPIN 2.1>,
      <abs ABSG = 1 
       data hash MD5: 32K
       EF 4F AA 42 22 6B D6 C9 9E F8 7C 23 C7 A0 4B 7C>)
(   5,<2013-10-12 21:21:45.509 -0700>,<Administrator>,<X>,<proc1d>,<TOPSPIN 2.1>,
      <abs ABSG = 2 
       data hash MD5: 32K
       A0 58 44 23 0B CB DA F6 1A 29 F8 2A FF 2E 19 49>)
(   6,<2013-10-12 21:21:45.585 -0700>,<Administrator>,<X>,<proc1d>,<TOPSPIN 2.1>,
      <abs ABSG = 3 
       data hash MD5: 32K
       9B 4A C9 95 57 F3 EF 45 B5 89 68 88 88 34 36 22>)
(   7,<2013-10-12 21:21:45.646 -0700>,<Administrator>,<X>,<proc1d>,<TOPSPIN 2.1>,
      <abs ABSG = 4 
       data hash MD5: 32K
       98 E0 BE 69 A2 02 7C 28 85 E0 0A D2 E9 7F 7F 57>)
(   8,<2013-10-12 21:21:45.676 -0700>,<Administrator>,<X>,<proc1d>,<TOPSPIN 2.1>,
      <abs ABSG = 5 
       data hash MD5: 32K
       8F 32 60 A1 86 74 EB 8D CE 47 99 DC 19 16 70 FC>)
$$ ##END=
$$ 
$$ $$ hash MD5
$$ $$ 33 47 D4 79 21 96 6D B0 B7 CD 8A 0C E8 06 F9 D1
##$RELAX= 
##$RELAX= 
##$RELAX= 
##$RELAX= 
##$RELAX= 
##$RELAX= 
##$RELAX= 
$$ Bruker specific parameters
$$ --------------------------
##$DU= <E:\>
##$EXPNO= 10
$$ [...]
##$TP= (0..7)
150 150 150 150 150 150 150 150
##$TP07= 0
##$TPNAME0= <>
##$TPNAME1= <>
##$TPNAME2= <>
##$TPNAME3= <>
##$TPNAME4= <>
##$TPNAME5= <>
##$TPNAME6= <>
##$TPNAME7= <>
##$TPOAL= (0..7)
0.5 0.5 0.5 0.5 0.5 0.5 0.5 0.5
##$TPOFFS= (0..7)
0 0 0 0 0 0 0 0
##$TUNHIN= 0
##$TUNHOUT= 0
##$TUNXOUT= 0
##$USERA1= <user>
##$USERA2= <user>
##$USERA3= <user>
##$USERA4= <user>
##$USERA5= <user>
##$V9= 5
##$VALIST= <valist>
##$VCLIST= <CCCCCCCCCCCCCCC>
##$VD= 0
##$VDLIST= <DDDDDDDDDDDDDDD>
##$VPLIST= <PPPPPPPPPPPPPPP>
##$VTLIST= <TTTTTTTTTTTTTTT>
##$WBST= 1024
##$WBSW= 4
##$XGAIN= (0..3)
0 0 0 0
##$XL= 0
##$YL= 0
##$YMAX_a= 637956
##$YMIN_a= -543304
##$ZGOPTNS= <>
##$ZL1= 120
##$ZL2= 120
##$ZL3= 120
##$ZL4= 120
##$ABSF1= 14.98509
##$ABSF2= -5.573092
##$ABSG= 5
##$ABSL= 3
##$ALPHA= 0
##$AQORDER= 0
##$ASSFAC= 0
##$ASSFACI= 0
##$ASSFACX= 0
##$ASSWID= 0
##$AUNMP= <proc_prof1d_extract_pilot.lims>
##$AXLEFT= 0
##$AXNAME= <>
##$AXNUC= <1H>
##$AXRIGHT= 0
##$AXTYPE= 0
##$AXUNIT= <>
##$AZFE= 0.1
##$AZFW= 0.1
##$BCFW= 0
##$BC_mod= 0
##$BYTORDP= 0
##$COROFFS= 0
##$CY= 15
##$DATMOD= 1
##$DC= 0
##$DFILT= <>
##$DTYPP= 0
##$F1P= 0
##$F2P= 0
##$FCOR= 0.5
##$FTSIZE= 32768
##$FT_mod= 6
##$GAMMA= 0
##$GB= 0
##$INTBC= 1
##$INTSCL= 1
##$ISEN= 128
##$LB= 0
##$LEV0= 0
##$LPBIN= 0
##$MAXI= 10000
##$MC2= 0
##$MEAN= 0
##$ME_mod= 0
##$MI= 0
##$NCOEF= 0
##$NC_proc= -8
##$NLEV= 6
##$NOISF1= 0
##$NOISF2= 0
##$NSP= 0
##$NTH_PI= 0
##$NZP= 0
##$OFFSET= 14.98509
##$PC= 1
##$PHC0= 97.33337
##$PHC1= 0
##$PH_mod= 1
##$PKNL= yes
##$PPARMOD= 0
##$PPDIAG= 0
##$PPIPTYP= 0
##$PPMPNUM= 2147483647
##$PPRESOL= 1
##$PSCAL= 4
##$PSIGN= 0
##$PYNMP= <proc.py>
##$REVERSE= no
##$SF= 400.02
##$SI= 32768
##$SIGF1= 0
##$SIGF2= 0
##$SINO= 400
##$SIOLD= 32768
##$SPECTYP= <>
##$SREGLST= <1H.CDCl3>
##$SSB= 0
##$STSI= 32768
##$STSR= 0
##$SW_p= 8223.68421052631
##$SYMM= 0
##$S_DEV= 0
##$TDeff= 65536
##$TDoff= 0
##$TI= <>
##$TILT= no
##$TM1= 0
##$TM2= 0
##$TOPLEV= 0
##$USERP1= <user>
##$USERP2= <user>
##$USERP3= <user>
##$USERP4= <user>
##$USERP5= <user>
##$WDW= 1
##$XDIM= 32768
##$YMAX_p= 446244481
##$YMIN_p= -657481
##$CURPLOT= <Network HP LaserJet P1505>
##$CURPRIN= <$Network HP LaserJet P1505>
##$DFORMAT= <normdp>
##$LAYOUT= <+/1D_H.xwp>
##$LFORMAT= <normlp>
##$PFORMAT= <normpl>
##$SURQMSG= 1
$$ End of Bruker specific parameters
$$ ---------------------------------
##NTUPLES= NMR SPECTRUM
##VAR_NAME=  FREQUENCY,     SPECTRUM/REAL,   SPECTRUM/IMAG
##SYMBOL=    X,             R,               I
##VAR_TYPE=  INDEPENDENT,   DEPENDENT,       DEPENDENT
##VAR_FORM=  AFFN,          ASDF,            ASDF
##VAR_DIM=   32768,         32768,           32768
##UNITS=     HZ,            ARBITRARY UNITS, ARBITRARY UNITS
##FACTOR=    0.250966925370066, 1,           1
##FIRST=     8223.43324360094, -189237,      -238876
##LAST=      0,             159309,          9836
##MIN=       0,             -657481,         0
##MAX=       8223.43324360094, 446244481,    0
$$ Real data points
##PAGE= N=1
##DATA TABLE= (X++(R..R)), XYDATA
$$ [...]
23879 110480 -296501 129246 168926 -166718 439336 -180997 242216 205438 -306175 185739
23868 5120 -90715 98363 -296007 -52154 -250955 -113273 316224 114737 119266 89365 -150815
23856 -197203 -51971 6582 -167915 5213 260603 -34286 -49204 6623 44905 -80764 89996 -154148
23843 -343218 122507 138648 -140524 52515 134180 -48007 -292632 -2543 -38375 -113046 -74255
23832 -74255 -114379 -289052 -206411 201004 -66153 131940 243355 66448 -115132 -2646 100258
23820 -140534 -244612 -133625 -91816 269478 289597 167865 -195392 63226 128149 -109634
23809 -394794 -67291 -164661 -134227 -58598 -116041 -267458 234167 -49656 191806 27364 -159519
23797 -127527 -138697 187179 -160864 123855 146805 -137216 -122241 -102294 -143191 208866
23786 -21440 26146 -75842 162802 97186 88427 -19394 -319624 -58750 31956 -47777 235312
23774 -76454 -68249 238053 -62321 -100232 -114628 -165556 -5606 159671 -256420 -56143 -129567
23763 -129567 241322 212161 -262204 -153850 323479 98753 -206595 58104 -181906 -269033
23753 -269033 60473 54547 -147145 197259 52878 322867 88498 56407 228797 41461 -129339
23741 -83814 -183354 -38473 121309 54785 -197450 -13027 -165005 -76835 61600 -9789 83703
23729 -125366 -306387 -208556 -232827 110579 -208423 -248599 -118287 187066 491192 83793
23718 37194 84988 -52095 -149171 257740 -311099 104872 -173732 151535 -29884 260717
23707 -159120 13991 356651 3521 -127082 -190625 151340 65351 1278 -53242 -17267 -138744
23696 -138744 -50676 79990 -46702 -211633 300940 -250089 -53877 315181 86440 -150053
23685 94377 -80443 178838 47978 182656 -12579 -126867 -11634 -198012 -420344 -97105 98543
23673 -157253 46454 154442 84967 61864 -285833 -334010 -149466 47368 -295866 119946
23662 -176123 414256 -156517 337894 163858 -129833 -129385 201712 173616 297879 133911
23651 -34032 117535 101611 -282827 229946 134956 41393 279240 136450 -176972 -135497
23641 -135497 -90260 -72306 -86249 27628 -188161 -17766 157974 123686 -21491 66057 17233
23629 46253 -305218 20910 -40907 -60092 -29495 -220332 -141969 142848 -102617 118276 -402017
23617 193562 277167 252160 48458 28487 -342743 -234088 -49873 18517 -135883 72476 124367
23606 124367 -104574 -166087 -9231 114164 -116806 -82363 256035 3040 -146941 79896 -19219
23594 91938 439581 15880 44867 -202473 246398 -130053 96511 -121745 -148060 -221752 -275023
23583 -275023 -136181 -22044 -472146 -64874 166784 -26139 -47795 -56146 -120921 12630 182079
23572 182079 -31155 -5783 -42839 -180293 249595 39793 -83923 -397831 -522126 142234 -178170
23560 -83114 80464 251835 23515 238513 -65137 61364 -169871 -441171 -43216 -283000 45951
23548 190664 -104323 -36729 -354325 -14196 24878 -22400 395976 164673 76101 135135 69203
23537 69203 -57783 320844 -92324 26516 -71854 75318 -62619 -197170 -197412 98896 76430 -106631
23524 81792 85481 147990 7410 69879 5336 -43718 -28489 -122841 -337014 133242 247760 86513
23511 -161127 -81401 77860 40520 -49728 130721 104368 226242 14809 160229 -39346 -250438
23500 -250438 136894 -368313 -229649 317777 19753 -64443 -217167 55647 160185 -171790
23489 51460 -124213 -7504 -199269 143059 -423570 -62457 -148720 226239 186312 -4375 -147658
23478 -147658 75056 133928 -136249 163685 111589 -76630 -170046 -27507 -12541 242389 -436156
23466 -76194 70275 -87974 221410 -85815 175219 -84403 137554 -16161 200349 214830 -258454
23454 -235145 -40108 30122 155104 268864 88316 -62706 -331209 -92175 -145098 -88655 -94592
23443 -94592 -93377 -61817 34830 115892 -93108 50872 -217419 -122184 -209911 158523 -367987
23431 -269030 -57380 43707 -46948 -4972 183958 -258921 118848 -304064 185330 -48668 75150
23419 -194706 -81377 294303 284316 -36046 -62382 -331838 76014 97149 119031 -74907 -68168
23408 -68168 47978 -158407 215591 -89145 -284216 137333 17995 -289929 -218189 -211606 -30643
23396 95851 -96009 -122040 -135375 -88705 105064 -302625 336819 -106994 56767 -413123 202306
23384 -127774 -487165 215996 15634 180380 -131035 -90705 -12411 199940 33868 196853
23374 196853 -14760 146601 95360 -33913 1489 -145087 246922 -112501 -61012 -67618 72563
23362 15839 -290221 200802 5264 119823 -82852 -111629 -33080 -42493 60097 28853 145043
23351 145043 286581 -229586 -69796 21831 -39621 -249323 384513 -240052 -16671 12226
23340 401059 275902 -23884 -176837 -276837 -67522 298630 -134899 -281407 -197735 91105
23329 93557 -167738 -125591 -189059 -212680 -415964 216612 203927 -163010 -51158 -378012 100566
23317 128708 -73086 10484 191979 29130 -5478 184590 58474 -101497 -17117 98006 -150659
23305 24517 -258939 -124449 193378 102318 -5955 101161 -80584 -187977 297490 113790
23294 -209027 76111 -140348 -126488 -48718 -426055 75125 -194180 97062 152581 279029 -351780
23282 -293304 -161005 -30399 -12039 385956 -224085 -148424 -40372 107671 -59979 -73279 -280792
23271 -280792 -332982 343295 68123 -186080 -116864 136163 321214 -97904 30419 -193429
23260 181414 -159156 26441 -176749 58280 -58282 -197626 168297 -135937 -68861 24933
23249 51090 276822 -49756 39272 -125356 -259364 -34275 -53981 -74797 -20515 -221517 -2361
23237 -24683 222152 206881 44283 -119784 -5466 75673 341014 73512 -21150 -14282 -104580
23226 -104580 -94060 49597 -42745 -198425 649 -89411 -119558 39888 323725 163445 105842
23215 105842 -19782 300686 29266 -40263 80195 -203038 -31545 -331303 -424045 -131381 15958
23203 -134674 -53478 -74630 19474 -20669 314264 44756 -217824 -78498 -106509 -150770 -268292
23192 -268292 -88799 45255 66732 227585 10148 -228950 -74248 -322644 -116665 -78483 -169627
23181 -169627 300605 -377868 -181978 -180574 -99752 303498 -99653 -1587 53856 -13924 -52890
23170 -52890 -148002 -96909 -74460 -255559 -59481 225588 208427 -18717 -34683 28282 -119646
23158 -197959 239625 -113620 64077 167028 309209 -75658 -157974 -506212 173305 -20968
23147 31569 -265913 -157600 82940 46894 -200877 -268186 -7807 -66406 -14310 -8974 50052
23135 -88196 -353640 -199848 -43369 17561 634 172621 87438 230221 -119883 94085 154820
23124 154820 -50769 -66671 -76825 -30695 178432 157158 -242583 -285001 2168 -228514 -256562
23113 -256562 184627 -301526 105554 -18134 118402 269804 75609 -191107 -230981 -189030
23103 -189030 -111897 212929 -9742 256784 -153931 -55918 51483 -171799 -52266 198897 -115945
23091 320056 4907 79934 192116 320507 -266404 -57550 -237658 -147924 -73428 -182781 103581
23079 -100526 194604 63542 -60090 -96864 160600 -32583 100571 14073 -98477 97043 115458
23068 115458 -57567 -73636 -97384 -91326 195976 -223274 178820 -204538 -161552 171478 -160750
23056 -129685 172447 140777 120991 -165715 -40375 331828 261063 -149101 7755 -200116 -38586
23044 127599 213530 125817 4579 32366 151862 -164740 339751 -140738 98369 -114089 92586
23032 -34880 9062 49723 -200364 307634 136327 -470615 196541 -134766 234048 201640
23022 201640 4036 173402 -75000 -8670 22836 139733 -10374 -375151 -279026 152404 -130965
23010 423539 -54994 96812 -96888 -159314 84706 312634 -207928 540 -36761 261230 11810
22998 144831 86326 -158704 -131585 71806 207287 216297 -89734 -104208 190536 35332 -230805
22986 61784 132073 110183 7304 121949 113943 -292344 66524 -35183 -195526 -315412 133013
22974 -262087 -177564 -205395 -12292 -135790 -191166 344427 -29279 138482 -37884 26874 365014
22963 365014 -208033 -422719 182632 -336450 -493624 -171891 -215567 -171251 135762 -4316
22952 -105788 -91718 -54399 174499 -156594 142050 176484 132140 105251 78676 368344 -81518
22940 -82697 94893 -24171 118057 -28098 -232608 -108712 61530 15919 -52378 -109001 -47382
22928 -123836 -57486 -27732 -216316 -195883 -181281 -41877 -381370 99683 -15728 33740 -155760
22916 -84775 -113487 54958 -45978 -235673 -10362 122467 -297167 -161502 -92750 -122740 -96374
22905 -96374 158396 76359 155465 8672 148168 -172641 52226 -70587 -49593 -15424 -1116
22893 70069 131358 239682 33254 40590 116706 85362 -366513 15947 -220219 -165068 -287787
22882 -287787 -61573 80173 206639 118723 202008 -274700 25731 -291494 -57647 -72756 -153060
22871 -153060 390979 121702 -90278 297650 -51984 -131891 -106069 109976 -413014 -114544
22860 -77408 43806 212668 -439894 -234910 -86088 202881 -383024 224665 -83640 155545
22849 -327047 17533 -60325 -130817 69211 -35477 -356861 510916 -155484 -88653 158427 -231169
22837 297343 69956 94062 187730 42015 -204272 -64475 -134802 193681 49233 -134086 -59261
22825 -198503 -30183 -119449 46632 -718 -277942 -42460 -179057 46738 26500 -106592 -50041
22813 -61930 164987 -167068 32546 -227254 132552 135750 -185631 -21087 -324914 -258408 159800
22801 -136212 -215262 285982 -117824 -345829 -58409 77438 -115341 -22386 -10755 -43638 188198
22789 241680 -50971 -90849 -56685 -91894 -200221 189564 217439 46425 13258 222545 21003
22777 14076 -136117 106988 -218828 -131774 -3022 98118 150009 149385 -34583 -11479 43668 -5036
22764 -64909 164508 -4266 -64152 45480 -19891 -151964 54907 -279164 245336 -287766 39989
22752 445465 11158 29912 -210042 22706 -154711 -253055 94289 -4734 351196 -17141 -164497
22741 -164497 -182288 4444 -70435 43858 76754 184635 1637 -130858 -3693 -46843 -246421
22730 -246421 -327155 -88296 -347874 31058 -99320 -146242 -220551 146844 -132987 -236550 -126000
22719 -126000 -298565 111499 468647 -38102 -17178 73864 -187440 -27572 -106457 125705
22708 -139326 236983 -11987 94757 -214875 -289738 -228598 -182790 8282 215301 -161193 -21627
22696 -12666 -415051 70078 -129657 290920 -352199 -102975 -113574 -346353 127711 35671
22685 -181698 61258 -172922 -236865 178961 205757 -30714 203606 138971 123983 142297 121209
22674 121209 75362 170318 63204 -12031 -83407 -28675 -152431 -108582 169473 -77323 151692
22662 -212615 -53364 131890 144546 -119824 159876 -149699 -70715 51975 269635 45202
22651 -98624 -210898 -63108 -254900 150339 -47668 212004 -60893 53078 -93486 61876 157315
22640 157315 -13948 77290 -122927 97969 -188173 36527 -340017 91979 -143845 6949 -22409
22628 -254933 -68528 -264951 -196040 30550 -19648 -16602 -47228 -100449 -182425 -129347 60674
22616 -98096 -171170 -191940 -38371 132057 -210528 88647 43895 225086 -108049 -307372 -291805
22605 -291805 20215 214702 214409 151000 -140974 178378 303511 -67300 -288529 -240112 58145
22593 59075 -95910 -357148 -48915 -78477 -214184 1468 320922 -48743 7082 -71551 -60654
22582 -60654 -74452 30214 78607 -261607 219318 -323021 25618 -22721 150355 182926 53860
22570 -254341 8605 -249176 146606 -104940 109945 111516 -166441 53362 -54798 -158729 -193786
22559 -193786 59729 -285820 248027 -181179 -182093 -207305 121617 -40669 -221002 -207576 69232
22547 62285 -145372 -138256 -326292 244434 -25288 81854 46706 74115 -87481 -181698 194969
22535 -40692 -228024 213162 57870 107150 -260694 -158016 71958 218532 85090 -123813
22524 -72154 452271 367159 -85903 177905 -168342 -124924 -118482 95104 110747 7871 -208825
22512 -37556 94500 -243272 190484 51391 57969 -114713 30275 -230175 50243 -138912 -35270
22500 -63180 116052 231284 187428 -34667 46473 77047 191811 -101548 -32249 184008 -64358
22488 -147926 -261627 -226124 -8950 -125502 -125987 98921 -111521 -154347 -31543 41930 -769 -116751
22476 -116751 174059 100912 -348977 -167275 -210988 -182957 -125088 -381328 132252 -73473
22465 -212976 -86114 -56092 -284841 161222 -230927 203981 -13610 -104188 122017 146125
22455 146125 -88790 -242073 -116253 -161219 -61101 7134 271771 64888 -206906 -338595 -132055
22443 12373 -133583 -122091 -244685 -76201 -138987 -28109 -134549 31318 -425589 -233255 -146541
22432 -146541 159438 144248 -134142 154867 -362973 72686 -236036 38058 -8055 -53847 42012
22420 -75661 180491 207733 -341429 24419 137520 146374 -19904 -129094 94602 -107090 137990
22408 -61112 221142 354271 -124675 142973 464399 -255876 -116887 -224145 -106729 113361
22397 -154380 48896 -177984 -98248 172467 -148311 -102726 -159471 -414450 9819 325380 61588
22385 -84661 172133 326637 -171862 9500 62713 39564 10634 -144937 -333175 -91922 -68806
22374 -68806 76927 -218178 -223312 -181624 -353557 208615 248026 -243730 -31345 -246158 -101869
22362 86836 105753 -73804 -200854 44473 53749 -72657 -58632 -104653 -79119 114960 -30435
22350 -48774 -36879 -48152 -184492 -37163 -42569 -145966 70648 412486 -186825 183228 70583
22338 -215026 -108789 198137 -94213 231889 180705 -176182 258136 -213599 107410 80179
22328 80179 -213948 45416 89012 -715 256598 132120 -62788 -53054 -119099 -21141 -164295
22317 -164295 -114076 52912 -171767 -192014 -57234 247672 95442 -180851 6782 -112858 -242520
22306 -242520 -384049 138739 -324573 98813 -74186 15551 15725 -293779 -93639 -92784 -62898
22295 -62898 -256474 -164731 125588 -104092 157194 -87050 193206 100606 18841 148714
22285 148714 -295445 196834 -228268 -357065 -323959 -85974 -186455 -240203 128726 -138320
22274 114670 -192301 -185609 -43324 12468 56599 -138192 -38913 63262 129854 -40023 -288845
22263 -288845 -84507 245019 -155713 181238 2077 86908 212877 -273639 123594 -17341
22252 138900 334016 126394 262724 -54056 -265755 -3720 -422819 -88386 -2459 -163032 -92295
22241 -92295 -81893 164834 -102286 -363469 -60366 -104172 -98968 93848 24599 -6427 130514
22229 -3704 363078 -217158 -293213 -218255 -127210 56473 -170618 188861 -94014 -95813 227849
22217 138148 -144593 -80672 15757 225176 15491 147148 -209753 -73251 203967 -288225
22206 -319818 -366601 106897 225918 -271315 36622 85419 -57557 -294817 -66161 -91111 -152670
22195 -152670 150848 217550 -202935 1443 -144259 108760 -82529 60644 -123769 47109 -34964
22183 -291407 88125 -293188 12684 -176212 -297186 352298 -253422 -254109 -129569 -87456 -424231
22172 -424231 119100 158043 83783 -27572 -208091 -224390 36633 92123 -108357 -98563 46440
22160 56259 196723 -282787 46020 5549 -26330 -155999 371509 -34365 225909 -77689 -174971
22149 -174971 202910 64311 -345178 339424 -211207 -236364 -20511 -186563 -322382 265008
22138 267228 -390 96962 65001 -204888 -147981 -89681 170034 59369 -78196 -141888 -314279
22127 -314279 -109675 122814 34527 120940 -336874 -201758 -354954 -169154 -18345 -224370
22117 -224370 -338958 88598 176639 -198584 -35706 -102382 -28849 113378 22901 -59751 82469
22105 135071 -179108 -151198 32235 111096 -176605 -244771 30576 31550 235800 -1483 -141275
22094 -141275 -128403 -86251 201325 -42040 -241381 -131939 -428628 114293 117584 265783
22084 265783 -75685 -364720 68783 72907 60484 -335049 208492 -84645 55505 148768 121865
22073 121865 31915 -43316 -243859 -137356 167299 238589 62288 218350 -12603 -18066 26157
22061 -19752 -451046 -37426 -71055 -62053 -289067 -22949 9084 -62069 163945 -123369 13210
22049 155968 294598 -243162 -166892 -174218 -30048 47313 149203 -112615 -279585 -269067 -44972
22037 -113801 146339 66866 -252559 -21 124173 20592 -175143 23881 -35481 34619 -183080
22025 -40308 -65595 -19890 -137422 -100142 71214 -277389 149716 121479 235339 -191711 -70310
22013 65978 -127495 279058 -96459 -209960 -13554 -72621 172327 196723 -100403 -146645 -265613
22002 -265613 -219667 165390 117538 208 111735 -103933 -78733 -282887 6676 112122 248151
21991 248151 -63631 -162874 363617 19875 100829 -2022 -281637 210374 -238495 -189416 23229
21979 221356 -238583 -246653 62211 141508 -106362 287818 -118553 93530 226194 -103962
21968 -100259 117087 -24483 -106375 132443 51977 -248197 -62495 -87495 -215008 184869
21957 -17680 -182550 -129283 134145 -76812 197408 50580 81987 -41509 -201890 -181370 -401846
21946 -401846 45624 -232184 -301373 42564 -91389 229797 -43034 5841 -109513 -154927 166208
21934 -51465 171204 82839 -24352 -24036 68249 -223236 20569 101374 -289171 -99883 -56972
21923 -56972 -415441 -63504 -102790 71157 106695 111879 -46092 -99006 238136 -162274 147677
21911 -302647 343583 252450 -170827 145763 -24451 177834 35196 -30209 61121 -211238
21900 160707 49051 38192 -259647 -180401 -1923 -353308 -99431 241654 -122370 -216706 -3476
21888 -77586 -528693 -69808 -238981 182680 22950 7573 -181213 9265 -98451 70749 60379
21877 60379 -29637 67842 -203767 -112917 -280417 -267349 109480 124184 263601 163126 -119956
21865 -216919 193030 -230391 135417 -233116 26533 60862 -214178 70688 58386 165618
21855 165618 -352941 40038 -384902 107659 -437659 172577 38996 80234 -127076 -220183
21845 -220183 -102267 -6245 201368 -303470 172992 -154914 -214422 -135580 -329894 83091
21834 -101435 -74001 -103523 -79320 53081 94651 108789 -339948 816 -190597 -166951 -33848
21822 89267 51123 30802 -121615 -8954 33832 -330069 56289 99820 -192064 32438 -323871
21810 24283 -26963 322492 -72621 760 -199252 30623 -252392 -95364 186333 105104 -328864
21798 313838 -88318 5299 -391211 -107773 59779 192140 322476 -142538 -198656 -17720 278971
21786 -20682 -60162 -163693 -477438 41572 242219 -210275 187164 116098 -407807 -7849 -89250
21775 -89250 -119067 91933 2215 163171 -246760 -190795 182771 -169002 -181660 -259430 -106318
21763 10395 152348 106103 193050 -13803 52238 181780 -197245 -130816 -106359 -87602 -43510
21751 -159017 -352777 -34641 282456 -44940 78086 -75274 -283398 70906 -32804 -169773 -87503
21740 -87503 38773 142525 96528 -183349 -214155 -64568 -192175 -150837 352172 -24704 49046
21728 -162307 -16233 -56931 89039 127262 -283697 15562 -202220 -358307 -56954 -25581 -336428
21717 -336428 -108138 -26371 150207 -359968 -148536 103373 4684 35360 -341752 354304
21706 -4840 -56287 -77005 -194762 26466 217364 181337 -12883 -230689 -121635 -436066 -134831
21694 59020 -80884 223388 -105268 70753 -213439 41453 92912 106355 -80263 75886 -24075
21682 -18823 71706 -73151 -119869 -22669 -277495 -173910 -69709 -221714 -97086 -82940 108912
21670 159742 -248742 -120602 -248564 23164 105251 99068 33240 -231896 -7127 -269796 -25250
21658 183497 -43632 -78757 76710 56336 106517 -31541 189826 -68568 -197345 -261687 -310745
21647 -310745 -179977 42548 -242781 155093 71843 202650 -216881 152895 39551 -222648
21636 -22728 104521 -54948 -208540 -200451 22853 -310179 75983 200555 -30110 93889 -473932
21624 70951 -60502 -233268 69576 140277 -55464 41996 72794 -138032 110880 161898 141460
21613 141460 -221461 -135326 -224653 -167244 -167283 -236536 -103027 -53765 -50085 90023 192557 -171212
21600 3928 -238001 205310 -158902 107757 75075 247031 -65751 63745 -107020 136886
21589 -38120 -114368 -137446 51146 85658 -197960 -96613 -363400 -31048 -323244 -201495 -150377
21578 -150377 -122635 -6072 78089 51088 151398 191358 -131509 -61495 147416 111121 -275073
21566 -242915 -136962 -264683 -243472 252419 182717 -243759 192730 233840 -254630 37158
21555 -118829 83836 198233 49687 115718 87055 -78681 -194055 142630 65411 -154948 93463
21543 -225431 -150683 62658 122281 137773 9284 111309 74158 69345 55665 62251 63791 -147341
21530 44739 -104153 -7351 142632 -126884 4839 -198907 390249 147389 -165529 -173549 193053
21518 27140 47542 -320752 -172530 -189100 35908 90048 -8963 -120815 78837 -102206 -215013
21507 -215013 -21305 -150582 253213 214423 -218298 -185844 211121 -436250 -179164 -95250
21497 -95250 -432148 84074 -335180 -238862 14095 -163448 129352 -192095 -286137 320279
21486 -121610 69046 -167905 193537 -74694 58861 -436410 -41266 -101708 -12901 79175 4225
21474 -199631 52213 -371326 -145621 385762 75679 37573 -190935 -231952 -191450 164235
21463 -313879 -65994 -207837 95691 77260 -147966 -325181 -106 41266 308953 66093 -59113
21451 114707 116408 -85554 -30400 214722 75076 -116219 221002 26633 387455 23415 235948
21440 235948 170709 81637 5955 336824 157972 12830 29958 242383 -1726 -165969 95268
21428 -247350 -94316 25697 -139771 178778 95443 -159490 92032 -137969 1901 -300314 -339914
21417 -339914 200158 -328636 -47111 -25677 -189821 -211712 340931 257523 112835 70878
21407 70878 3679 -306585 127037 -213149 -441374 125272 -289398 -5621 -129256 4287 -62703
21395 -187209 -386228 59555 338851 -260538 -143748 -155222 -277063 319129 -97789 -50680
21385 -50680 -134467 -243772 18440 163477 -133521 -230887 -28343 -35509 168846 -169442 62228
21373 -306337 -92395 -241659 242712 30476 -527190 27123 -28847 32402 -45749 162419 -57759
21361 -22608 65224 194497 -72346 208200 -167389 -253941 89546 57552 -232481 200156 -46099
21349 -337541 -111792 55815 118374 -149334 263983 51051 119481 17249 -418766 -35982 11524
21337 128218 311610 -61540 -11523 129183 195412 -220825 -73133 -63867 128390 -436262 -149917
21325 -269965 -101517 -44811 -168314 -30516 141018 -184464 139656 134742 -381334 -6905 4903
21313 -211406 -350014 -97983 -4232 -447676 61 25184 111078 -320748 188846 13380 -1434 -10566
21301 -10566 134443 -176275 -71194 -53484 53928 -175590 -5816 -167221 265073 -122939 163778
21289 -56834 -191199 -37289 -31067 -312819 85517 -175768 66526 -212315 -54385 -118957 -203686
21278 -203686 -113892 183091 119920 -300062 -226763 -377055 136271 287856 -402762 -18178
21267 -127766 -119917 -50822 -185728 -28093 -7134 -95636 -52152 -247635 -375711 151640 -134451
21255 -94868 228419 -259553 -153791 159788 275260 -86530 16752 -126021 -38922 24864
21244 207713 -202315 127711 105727 -146162 -64597 60584 162066 20648 -216474 7868 130361
21233 130361 -277130 9895 -126656 -261453 -224779 -18518 22148 -64845 37349 -412366 -98818
21221 206921 213311 113808 386398 169707 167673 -178719 -139579 -308637 -313982 199344 -131510
21209 -116014 -97509 87329 91472 -324885 -358267 -349115 -177123 -521 -29262 -180924 209408
21197 -81320 -481549 -248791 113282 34791 297858 -170471 84346 288653 53213 114163
21187 114163 213340 -12832 -72221 89915 16764 -272603 -218443 -87768 291538 77815 198812
21176 198812 -88826 184496 -214942 187842 -221829 -35336 -14530 -30336 -291099 -221736
21166 -221736 40740 -104018 -318998 224352 38910 -317547 32973 -248132 -202376 291455
21155 -21240 145063 171082 164139 -184042 142679 249336 -184064 98459 -260865 236330
21144 250509 -163221 -29785 24911 -14054 201056 -66131 -246093 132458 119413 169657 -41597
21132 -81135 7039 -263904 197146 -101067 -246526 17920 -104449 174 41077 123738 120238
21121 120238 -230569 285686 162915 -84287 74187 -157900 267731 108860 119514 -215258
21110 184720 29616 -47327 -99085 -227834 61993 -64593 -186917 -30142 185994 -145529 -277815
21099 -277815 -94274 -73697 -121203 -222530 -228136 -109045 250224 -369882 180417 121008 -366154
21087 187891 -32095 -253432 87692 9022 -30432 -144033 -178716 -97836 113936 34027 -288145
21075 -35026 47552 -84599 80888 16873 -33331 180876 31267 112845 -79086 126376 23360
21063 -157362 90196 -225341 -144860 -290587 172839 -54439 -172552 69538 -109762 -56787
21053 -56787 -130193 80487 -116575 -325022 -515755 -32829 -63580 -58599 32297 -223217 -94457
21041 85139 178186 -110136 131908 -177262 -114531 107640 354129 168786 -51805 -113966
21031 -113966 16573 186924 -257771 -244948 -18774 -199313 263318 -149825 -215514 14705
21020 -38928 -194413 364451 -69976 -302534 -310397 -77181 54519 5993 -109505 -106042 17042
21008 -493922 -92996 -111174 171665 95601 -97899 -173636 288150 113687 173835 -123929 96522
20996 -198893 148931 103773 -284578 93348 -125428 -199382 -164770 66843 343250 140779
20985 210412 -9066 -131222 152443 -384130 -582119 -170288 215124 -188104 -153644 182093
20974 964 -282182 -338759 94606 185669 -299158 -286054 -70952 218796 -396598 -125293 36511
20962 29134 -161647 -110964 -279786 -106840 -95610 197261 -269643 -462521 -29022 5294 -93705
20950 15385 64434 -226869 -326018 -34379 178343 108846 -185693 204894 195985 -326387 239058
20938 -205777 42312 -167038 -183856 128980 -449481 -130870 104056 -202570 -247482 -14808
20927 130889 -67112 174597 -21922 400126 9924 18591 263516 -143285 -123000 -238729 -16795
20915 -142496 -108434 -284588 286530 11210 23183 389514 -104973 141543 -171732 -130807
20905 -130807 -77849 234657 16907 -210577 69849 -5798 -226858 11033 -150150 -125943 16902
20893 119914 41478 -105627 -83184 242299 -105045 -182240 -236454 50748 -173077 -121148 5970
20881 49717 298414 -174848 27877 49854 66447 119803 -174318 -121661 76391 -48414 255241
20869 -195886 4234 -72054 -214754 -119621 64597 12175 -110380 95988 225511 -11053 31383
20857 -43115 -214511 -287966 22432 142388 -87104 -410699 -124094 -226025 -160402 -28385 -262083
20846 -262083 126558 16033 -43214 -173059 16603 44137 -127215 11942 -29537 56026 71489
20835 71489 217553 -87983 -18551 228039 -54404 9604 -320027 -130262 -10397 28273 -9882
20823 -219628 244114 120746 -94415 -115268 -55169 -82945 143664 -131750 83420 295314
20813 295314 69970 -21833 -125552 -9128 -232526 -181227 87495 -73856 16867 214570 9184
20801 132463 -116392 64325 -96632 77519 -37516 32219 -158562 -118602 -231649 239218 -174954
20789 -126045 244237 52664 12338 -367024 138522 -232145 159335 131259 -99991 101240
20778 125820 -174236 -35291 -128803 -116741 -185106 -897 -285839 -115149 283218 -109602 -91053
20767 -91053 -192777 315419 -22562 304280 181379 -162349 124114 -254908 90441 -138078
20756 -61794 -206758 -268024 -135426 23333 -93456 -156474 -22028 -90787 7265 141317 -443148
20744 -383938 38641 -27746 87929 -188064 -54711 -58497 -145577 -66227 110250 19021 103344
20733 103344 211351 -2393 52464 -132051 -5889 -99717 -36710 54423 60293 126537 164051 445810
20721 445810 -257828 -150369 71310 -11365 -26783 -416829 -221512 -35263 23312 -162654
20710 71449 191761 52905 184868 72272 -237593 144692 156286 120115 14018 23006 -5585
20698 -80165 -7265 -18062 250820 -116793 200958 -366935 -128701 -230548 -83603 -13382 -94429
20687 -94429 26502 97238 -37747 -139052 54750 113780 -314576 -64931 43783 -40483 -206595
20676 -206595 94932 103969 -223877 146484 103095 -102546 -242205 126349 -416266 -49548
20665 -231892 -247054 68577 -126259 -80734 -170210 -190235 -199545 -306983 -208909 -35817 60655
20653 -49812 -120893 -368407 17497 -301545 -57302 85430 -259448 236916 191469 -48252 -33805
20642 -33805 -111544 -66151 66084 108759 97187 -51644 12424 12721 -3524 21572 -142966 -94810
20630 -94810 31290 236526 25176 -168927 -252270 25689 -123333 -259522 -55916 103047 -2428
20618 68188 -133228 250031 41898 -224251 -190552 69890 -443640 -236156 36270 209440
20608 209440 -202197 4665 -293114 -122500 109282 99830 -395647 -202028 -157591 -127050 -224486
20597 -224486 -190370 -1009 -95452 118243 -120525 42711 -44063 -195263 -16198 6431 196205
20586 196205 -267828 58606 -108572 5948 -155308 66877 26662 189761 164796 -223064 -257333
20575 -257333 225967 -252115 -194070 -13041 109286 -266100 -88490 153583 34046 -71526
20564 110943 -178488 16109 33977 -50941 9492 175131 31481 -469129 -134009 -88752 -76955
20553 -76955 88870 -137431 -237786 -310794 235597 -246930 109014 321935 84103 17765
20542 41972 117726 -149291 -77403 90280 -285818 241560 -239608 307411 -411992 133287
20531 -34460 -80197 -1800 -357551 85870 -26184 -6226 58657 -227152 -516995 -9385 -201498
20520 -201498 185808 78430 -26682 -10199 61567 45733 -95454 11980 196224 -288165 345420
20508 -239908 45899 88544 -107842 11400 -243562 -852 -424200 -150773 -24581 -243893 -41445
20496 29139 -186180 -100234 -132806 69530 62903 -85156 -7876 55312 3066 228583 -16027 -114970
20484 -114970 -203230 -157148 98929 -125165 -58958 -345521 -86564 -257037 -67832 51627 -87987
20472 9382 139943 -244 304696 -24255 -142898 84960 72231 -8289 263369 212130 -15381 50926
20459 23923 -159010 207649 -85164 94146 -90638 -161303 303670 294164 133486 -116704 60422
20447 14136 43726 -881 -78317 206548 -37302 -356761 -228308 -171775 -101967 -303036 -112124
20435 -272689 155392 -348648 -227808 -179983 -192510 28180 45143 39318 -390044 -135403 -36128
20423 22302 9242 -12613 -218309 34110 -248926 -31500 52948 33065 221626 -158386 -75779
20411 -65117 -160618 23802 -108916 -131388 -156408 100809 -195693 -283553 -76440 -93281 -96756
20400 -96756 -475463 -158925 -49372 7917 -228011 -114068 30277 -190829 103015 475135
20390 475135 200428 87959 -241586 -22220 107262 220419 146792 72686 56989 -239676
20379 -115464 -198904 -125583 -293636 22576 -114343 -139825 190370 92064 6314 -393489 277535
20367 81900 -154481 25720 -38513 51318 29958 -143939 -74702 -102192 -8468 -3389 -404045
20356 -404045 -16102 64721 -254555 -161506 -262210 151070 -191633 -152121 -139782 90577 204994
20345 204994 -122197 -105579 229929 15927 107639 -196790 251830 45679 120211 -144949
20334 -221004 -459427 -228590 86238 -27174 -445905 -313938 -198272 165305 -136621 -195858
20324 -195858 -18603 -59493 -339798 -59017 66462 143133 -118823 -374244 -125297 -118144 714
20312 -60870 -241031 63781 362696 -258416 -106244 -134392 -71941 -223011 -299291 -158389
20302 -158389 -184830 39473 22452 120810 -11731 167705 -156303 131376 -75867 259698 -109230
20290 -241384 -23751 103556 18126 -244711 84071 -309983 30397 61889 115128 -115301 138574
20278 -190882 11498 -152206 29164 -329385 -150611 -179965 20014 -5882 -1980 -215405 -214205
20267 -214205 -127356 -107778 -260279 -16487 -354497 238208 -69701 10429 -74220 -110269 -138259
20256 -138259 102666 38626 23509 -807 -183422 -76955 -105773 -338478 74653 172252 39311
20244 78409 49853 -144261 250372 -157630 -170643 149914 84095 -41334 -266476 -170700 166041
20232 -422787 -108612 -149761 295322 16895 -181189 89040 121210 -32861 189179 -20400 -60583
20221 -60583 -144051 95239 -54479 72766 -21734 29292 -226896 126007 -163488 -114335 74741
20209 -294161 -422440 460820 -44727 -385253 -25297 135627 -336578 32799 153566 87396
20199 87396 -74693 -84600 -110314 -30262 -237284 -203668 -73078 -117461 756 172229 -456293 40226
20186 -121144 261282 -153524 48 -7230 117813 -184145 10967 246759 -253135 108838 -61374
20174 -153831 105304 98268 155241 202675 37401 -5497 -160565 106383 -383426 5800 -58341
20162 -175338 -159232 -139209 90041 30891 440737 13981 -171906 -159107 -58889 -261849 85691
20150 78042 -232318 -18747 -146811 -196684 -224759 1259 -160342 -256862 -90609 -79064 -244862
20139 -244862 -183675 9570 -163831 -40762 26279 -26525 -34758 -93857 18710 -134040 53358
20127 -228273 -163630 113244 -226279 -143957 276660 -42831 -384820 -285568 18098 23714 -270984
20115 128790 -322680 -3064 293202 -49786 -95654 -68537 -294244 34405 3433 -62655 166111
20103 -178282 7034 -448833 -281580 -2026 -257603 296811 260154 -188163 -52352 -106170 -109100
20092 -109100 -101224 90308 -125110 -150880 -228297 -41264 -96712 126090 54241 -215353 72553
20080 -209881 -39751 -262127 -331116 -48508 99063 82698 -131938 114493 -215131 56556 -187815
20068 272474 -206842 -87900 -38079 -11654 241241 -254660 -81531 114060 -113416 270560
20057 -220584 -104811 -241606 87721 -70689 -271213 -151680 423626 17912 -14783 -339247
20047 -339247 164771 -218042 138740 4684 -45947 -54038 -88542 208488 172659 -43690 -36883
20036 -36883 -114200 -39586 -108127 -64029 83369 20220 -123560 105628 -168245 -126769 -287629
20025 -287629 107918 -203878 -152847 12399 148139 -355427 51014 -158777 304891 -240815
20014 -193306 -54878 -62899 260146 9134 -75300 -79554 -123329 -289268 -17405 145325 -143034
20002 -130015 -150506 -61157 -180334 10805 65231 72979 389992 5205 -96239 14875 -171134
19990 -56574 42832 -295872 55030 -17269 73054 108600 138674 -296272 148458 133266 25882
19978 -85783 20396 -234177 -147713 -83872 51296 242439 -147133 29744 -31548 -3199 274823
19966 -151213 234553 -226255 -348329 149711 -427654 216414 -72141 -210845 111576 -221723
19955 -82052 -134278 221137 98342 42843 47922 -98415 -146972 75653 140230 -100230 -191130
19944 -191130 59051 -358615 -34999 -115903 -351002 -49062 -49912 -35329 -32146 -93486 -352774
19933 -352774 -448035 -269277 263911 169803 154684 -243503 -84400 -10074 199703 335270
19923 335270 -59628 -14479 -140401 -416429 -241957 -61824 172614 -167809 -33939 -14313
19912 -92381 -140506 37464 -87853 -30352 148170 50474 -58519 142883 59855 22442 22144 -292616
19899 -74758 -153719 78570 145493 -147683 152631 -194475 192919 78577 -85270 -158680 100513
19887 -174615 -118595 173118 -582842 402769 177108 -71147 -74274 174522 94457 127450 -170153
19875 -1394 51747 -182800 17054 -314797 107737 68066 257660 -87001 -111889 46263 158487
19864 158487 -305584 265254 -110271 405465 -218703 -3868 -170207 53156 -181174 -87021
19853 -35778 53016 -198503 -484166 127166 -22624 -444840 -153111 -17480 -185899 41650
19842 -137062 59755 3594 75584 244402 127150 41123 233592 -249109 -199001 -2603 -24635
19831 -24635 -143137 -315904 -51182 242309 117532 -99490 -83170 -327324 234476 31874
19820 12220 -278379 10234 -155311 -110540 -128731 27721 -122150 -175091 -274364 103893 39384
19808 -178194 77666 11160 -320909 -297987 -337544 -55891 -125665 56235 265263 -15885 -264927
19797 -264927 -70467 61932 254229 -23292 -190481 214744 -46572 -19921 85557 6454 -186621
19785 -49303 33109 56429 -89891 -18309 -115231 209599 -31401 -76125 -163681 -384185 -56579
19773 -27427 -154069 -59041 -444578 181210 -64574 28983 8550 -226822 -115371 8441 89782
19762 89782 3293 -81250 49706 -44886 -173119 -91257 124449 -146453 -41391 -114362 -25474
19750 937 -255509 16421 317484 -197878 19724 -25148 -85925 184975 -383099 80326 -89542
19738 -237598 100527 55959 -232380 176283 -134457 -37899 232729 -182315 -296881 280408
19727 -39906 -444917 -17426 198951 95710 -207846 -99823 -109262 77313 -84990 -114805 -68505
19716 -68505 44762 309230 295098 88663 153092 19710 -221413 62125 -108523 24163 -223966
19704 10953 179096 -697 -183249 -3965 -172989 -183149 -293100 96352 190901 -77502 43467
19692 -57014 297169 -182767 -62132 -126858 124045 -201448 74547 365811 -323786 19085
19681 188963 38897 -100029 -41985 57574 -39808 16038 39687 -111766 -335287 46223 44482
19670 44482 -298897 5899 -157702 -248723 39492 -42096 298500 -13180 -158977 24536 -127262
19658 -51918 -121835 -399842 77913 42360 92978 43447 -192952 -20450 -181501 43584 -60541
19646 362819 69565 119065 -136786 -150003 4989 -89334 -29563 -18158 -243250 15155 159074
19635 159074 -193130 -191737 -67084 201153 -102801 -197279 -3413 -143324 -201308 -21443 206177
19623 -127031 -56877 158786 59833 520039 -89591 197983 -288717 -139207 -6039 -96789 -170329
19612 -170329 -116286 -417283 -356342 -60965 150689 -278574 -91382 -253777 -116354 -122654 -71311
19601 -71311 163500 29017 -274129 -84935 -17410 -300021 -180604 69431 189313 -157702
19590 -64043 -292338 -108165 57510 -112832 -57935 -94493 -109130 105407 2043 373991 -69937
19578 -252539 -110181 -19264 3633 36739 -230161 -357641 982 -403855 -293744 -48218 175143
19566 -153402 -350268 63980 -141462 -9885 -273467 -175987 250705 179376 147323 317828 -101574
19554 -105843 -175191 16911 275409 -188246 385929 -6512 186685 183147 -208294 -200508 243070
19542 -283368 -41906 -164831 12213 -90957 -53407 34187 -100747 -241399 159754 182560 -58972
19530 -254894 -277638 -33231 -56540 -139144 -32007 -47936 69384 -170419 -231097 31874 -283448
19518 -92930 43749 -249395 -304922 82196 -44441 168885 -6196 -283274 -22225 -105513 -3300
19506 -183230 225945 78243 -76181 319239 -216264 15956 135165 89116 -227372 -46794
19495 332419 26651 38839 -30397 -204144 313979 -134271 464073 -199645 -170934 13792
19484 -351342 -223705 73887 37986 -139790 72530 -454007 -81866 -9586 19703 -44022 -227733
19473 -227733 -147489 34841 90687 -302670 111245 -66439 -110391 167764 -53910 -65087 -268975
19462 -268975 37342 -33192 13483 168515 -205584 159869 -173924 -146654 -258943 -117215
19451 30119 192280 -83267 21277 148489 -60542 -240510 -62363 84293 259135 -267134 -196726
19440 -196726 -32813 -255507 -183188 -132367 -63259 82317 39951 -237013 -405086 -214344 104407
19428 -57664 -10131 28986 -255018 47209 -81883 274290 -160742 -118664 122656 -158532 -132824
19417 -132824 -122091 -258988 -274474 169589 -242163 -214121 -83982 -130059 -151703 225368 -213702
19405 -87208 71044 -118920 -13837 -28186 258578 231150 42730 -365356 -172730 145894 2379
19393 -89748 -49913 218608 20144 -149219 -55240 90679 -269957 -77951 6750 135377 -38540
19381 10465 -56568 33640 -146769 -371024 -52156 -67174 15408 -199560 -78239 -75965 117032
19369 -24230 -299091 78374 -347650 -302788 103382 -164037 80928 -224827 145956 -218274
19358 -46008 89724 68385 -84697 178847 -301258 -151881 -207285 205794 -240193 -404293
19348 -404293 254952 -2191 83239 32505 -40136 -214485 113003 -194163 -70948 68565 151812
19337 151812 145089 -113226 -78456 160224 95830 117991 75510 -202757 145721 -202063 154681
19325 28502 -256842 -153443 418429 -238145 -283388 7365 17155 -30169 -308752 -25877 95305
19313 -234056 -64448 64516 -163897 -183497 146122 24307 -115348 237387 -109955 -175518
19303 -175518 -99241 -120647 29226 -66809 -60848 46116 10216 104164 216116 -193105 -374411
19292 -374411 -147729 230745 16708 -104924 -42288 -134707 1185 -202730 -257538 -4324 138513
19280 258215 371370 -444723 -364718 -147333 17561 103192 42906 -359079 72576 129437 -43057
19268 74188 -109658 -87349 91039 -28356 -103978 -76449 -248888 -51880 -184370 190297 -83328
19256 8700 -657481 -166563 133968 -114323 -402547 119676 -63377 -345785 -67839 -203994
19246 -203994 85441 -204838 -162100 -129966 297341 -169963 -53696 -122295 183982 -325107
19235 -129640 -240259 -41877 -152798 175786 -182 214916 32680 -69753 -83450 -22646 160865
19223 -214668 17041 233377 -40128 126324 22334 150940 14879 40427 -106191 -187426 57650
19211 -124371 -73014 -400662 -229634 11273 145688 -160940 61626 -220216 -18094 -66761
19201 -66761 -27541 -124475 -74927 111301 58392 19296 -150746 -111615 1934 -44520 -146804
19190 -146804 -151787 436845 -79127 -44673 36284 -244283 49082 -156477 100730 233752 -185920
19178 -37666 -85711 85667 -85115 -223886 65667 258431 -139750 319490 -59762 -83357 -68860
19167 -68860 -119187 163466 -113626 -57600 -40570 -120048 -352412 22280 -122527 -81189 59698
19155 -177279 -46920 165672 197386 -114353 -204370 -46541 63942 44286 34472 -277615 93901
19143 -249029 87843 123143 -65613 364415 -264452 28346 -191670 19986 65109 321084 -89254
19131 -173499 93725 -207248 -380287 -345298 277525 -141739 -157167 -290466 -127154 -182125
19121 -182125 194715 56766 -8292 -298340 347384 -86340 -137779 -383732 284244 160057
19111 160057 -161591 -39644 -51947 363092 -18316 -74213 -103100 125720 -195180 75714 180254
19100 180254 -216577 -294494 -26331 -39128 -400304 -94992 16076 -301113 -175736 -283332
19090 -283332 -185729 33742 -304899 -148841 128101 -231479 -105289 -304236 -303868 -102506
19079 79992 -8400 -579943 -75580 -141485 -111490 -168286 -121071 4934 382898 -208855 -127460
19068 -127460 9688 4633 -192707 54722 94943 -33723 -203021 -6528 14507 155991 8454 126682
19056 126682 -170033 -9411 -166071 -67361 -88554 -139831 70944 -32124 -68150 -47485 15196
19044 -50891 67935 -78655 -26049 -288345 104827 -21877 -3787 49452 157122 32006 -9950
19032 -369783 -65297 82342 -339 -145811 107873 132667 226337 -4945 287132 -173284 25777
19020 79896 -489208 44217 -217553 -347315 -34386 8935 -51114 -53234 -33897 -250444 60540
19008 70553 -357004 -64263 120394 67983 173985 54283 -183835 -37196 145719 6153 -62219
18996 196697 217159 165766 206345 260734 25780 -26957 -186655 66685 -24377 -333920 -127314
18984 -62854 -272192 -372372 -391338 426076 -86885 78645 73794 -65051 -389822 48816 -150165
18972 114909 -135707 34924 -66406 -117952 -262657 -339072 -26663 -115921 24344 346153 -97010
18960 -309819 -190131 275649 47635 147699 -185931 -269059 3956 -7763 -180315 -163734 -30174
18948 -24402 22523 174303 -193947 58000 159207 152189 18534 53394 -191039 -153378 -56594
18936 33422 237737 -339992 169899 117432 271435 45506 -12191 -25083 35818 -317798 -73401
18924 105831 -32311 -371893 92194 180187 -20100 -3469 -40357 -194400 304823 -233077 24467
18912 -533593 126416 -213716 -205768 -30206 -37840 -173077 -43726 -62868 -240209 -76298 -105716
18901 -105716 36850 -10259 -5201 16696 -421746 -32264 8389 -37490 5413 -155778 34012 -281747
18888 -244749 -27175 -82117 146048 -93862 65955 -196144 146978 -44453 -136457 -146471 -168518
18877 -168518 -137959 -245388 66208 -107549 -58123 -15071 141164 86125 1576 -267911 -50391
18865 -124180 74432 173652 107220 171841 -23144 -88833 -80645 440661 -146361 30068 -225135
18853 134687 227476 -355660 148317 -101703 69802 -160707 200685 -116349 122143 42860
18842 -103092 80700 13966 -51377 268677 -399522 -305021 -30248 194395 -330756 -304231 231972
18830 122033 -93673 -379352 -201536 -104922 87611 56575 -137566 -238915 165515 -22089
18819 -225470 229276 50830 151362 100622 -113026 -44515 221605 118856 131298 140329 313755
18808 313755 320380 235518 164552 43977 75119 -301165 -16392 -245313 -240679 -130936 -171655
18797 -171655 -44953 256794 -37049 -131880 -152555 35943 -145989 -101709 -356114 108563 -197294
18785 -111788 12936 272019 137814 -97802 116909 -87978 35552 274115 -1527 -141487 -135168
18774 -135168 356409 -42307 225618 408558 -103451 -153192 -219667 140527 -129081 55505
18763 16317 -83827 -16891 -9071 86361 -244951 -106387 -233935 -51414 32615 26452 22980 -289355
18750 -192680 -149845 -328146 -515838 -25799 -88235 101463 87447 -234785 173079 -17777
18739 389348 -117626 43345 11067 -41050 -80975 12831 -250499 183113 160208 -87107 115538
18727 30201 -231298 -107204 -522275 92116 51026 -228081 16232 -212661 6953 -246294 -347519
18716 -347519 72630 287513 -221608 -240053 55589 173795 -132520 328097 -136069 -277763
18706 -277763 -334507 24254 153850 -63113 142061 -234179 -414197 -148703 -22084 -88774
18696 -88774 -216879 199327 -177607 9532 -16716 -31457 155933 120533 -92972 46571 7824
18684 52046 -60658 -117312 -99202 82854 -90630 -65972 82610 -177076 -214097 4687 225896
18673 225896 -122467 115807 98343 -234444 111532 -281781 -360298 181443 160855 -62552
18662 -222325 -315429 -61936 -48145 45604 -222753 847 -149134 16385 -41487 142980 -385689
18650 -200577 249816 256854 332430 -291122 -176819 187756 -95490 -59718 195685 65596 -187488
18638 267044 -106940 -211490 -61116 75392 -183639 37854 -207005 65228 -33141 -155035
18628 -155035 -91568 45819 7475 190403 -202881 -274595 -332519 -455141 -340704 -251624 21118
18616 -254722 -228068 -9057 -120025 181109 -146610 -243962 -257003 -35372 187569 -29824 18676
18604 251416 328979 -310554 -288691 -280590 -73459 311025 -32850 -164017 83839 -109027 -227611
18593 -227611 -182894 352106 -215406 -283922 19413 -83781 -20539 -430894 -174916 -175356 -79687
18581 -189920 -39842 419466 -1800 -173366 134941 -56661 353586 -194173 -41992 11139 162571
18570 162571 116283 -97313 191884 47040 -8821 -176038 -406238 -98461 150495 -391593 -55535
18558 -95166 -151912 -68269 -46933 103431 73261 -198740 -97881 -148837 -43839 -109410 -77574
18547 -77574 -62646 -92823 -294502 -330600 -128706 -87431 -186225 -169168 81981 -351375 -94259
18535 -211655 -246129 46279 306607 69872 -226953 -142116 -234100 -47645 34120 -72518 -77507
18524 -77507 206402 -15670 362944 -78586 -220724 20418 -110065 -57468 4980 -132843 57693
18512 349764 73453 159834 -181245 80586 -1163 -124684 -283960 139112 -176966 -95900 77382
18500 81874 222036 -265087 62 -104002 -87620 -72844 233814 -108561 34861 -39662 -148057
18489 -148057 85825 85953 176879 -260894 -51353 -100285 9823 -303938 323966 -196202 -362562
18478 -362562 -77233 -141956 47304 -159935 -73291 89841 -257703 -73109 294759 15049 -151162
18466 -85945 -93071 24238 43966 -219145 -67712 198333 164104 -195505 -47332 161611 -141417
18454 -141854 -173542 -2501 -357118 72357 -427291 83784 -80986 -19950 -50869 -273477 -148437
18443 -148437 -201871 -24867 -35879 -137601 -3253 27052 121930 69562 -101588 148003 60574
18431 121652 -310932 157391 15022 40694 -376682 -42769 205803 -80491 -356329 132420
18420 -328075 -48847 158574 -67807 -237366 40222 97964 59746 150887 -230535 -234773 -187494
18409 -187494 60548 -1400 111734 -202039 -147850 -40015 -81291 -270446 -319040 -8173 -67683
18398 -67683 61999 -355181 -29382 -34740 38691 126309 -107525 -117556 -253253 98127 40595
18386 -398527 70387 36640 -162597 -90745 -192250 -220253 12885 -246782 126118 97336 -2235
18374 180762 78638 99382 -364829 -3516 -163722 -157382 52111 315905 272106 334986 161282
18362 -41659 145121 125119 -138940 -243346 -62857 -190698 125229 113549 -342728 72126
18351 -220662 34746 -22537 -321413 -123836 -136161 -366992 108445 309397 -166430 120435
18340 -129071 -257424 136533 -292375 62223 -149757 -212786 79720 -106917 -73834 -277234
18330 -277234 286387 -185656 -478793 -110579 -82455 -70839 105342 -394135 -132319 44426
18319 193283 -165407 207655 -120659 -176234 -230004 -329751 -67153 -156284 -127727 -114005 102868
18307 -94244 -36751 -49455 46201 -119418 -33989 304498 -116970 125422 -30779 -110225 307450
18295 249507 -80455 -181743 -36442 42561 299865 81699 203837 -99262 146295 53044 -428479
18283 -288991 162103 -141491 -136737 37129 -8846 -3307 -42255 -119793 -374491 -13889 68517
18271 184180 178653 -36105 -212000 154548 -311591 -64555 -273634 32922 -185340 -144342 -206119
18260 -206119 -44025 -77784 325114 6431 24013 -255860 -323899 -71832 -140197 212205 262109
18249 262109 41868 -64385 53328 147682 -209556 -85225 37005 -16717 -4562 139177 -187954
18237 -158001 -63146 31758 -64612 30835 -68563 5958 140991 35547 -121344 -151097 57447
18225 380755 -111160 -294249 -125980 116694 -191267 -473262 -131483 -21297 163781 -43231
18214 12326 -178152 -301796 -131230 -172780 135918 -128282 193380 -134937 -306328 -13879
18203 152691 -49947 -187508 -79806 41674 -93281 -190971 -198580 84921 -391225 272785 -191371
18191 408705 -301849 51026 39012 -141009 -306371 247886 103448 -221219 333867 -135343
18180 44115 173145 -167053 -171845 -36861 110918 -61042 -110645 117677 37318 115050 -82775
18168 20980 65271 -147677 -168609 195098 5232 -159374 -239477 -22156 -62321 122430 54951
18156 12027 302700 80440 64181 47763 109235 -10408 -1749 366465 -74421 244049 137831
18145 137831 -131950 70969 -121262 20208 -90644 -102930 149621 -428144 44357 249769
18135 249769 -167865 -249496 64472 -98921 139721 86127 -95058 48252 -53004 -162629 118966
18123 -154281 43171 -98103 -72365 -51910 188642 -200803 -78988 109311 129013 173604 176085
18112 176085 180301 48901 -186879 -369998 -115634 142017 -468892 -97612 -244596 -111015
18101 -176416 -23607 -483821 -232291 87407 82667 278376 -44089 265215 181966 4116 -122116
18089 -275081 124316 -21408 -387890 -54106 -78393 103107 -86392 47778 -75230 168402 70807
18077 34411 -51421 107397 -249546 -329149 -210989 -193802 -78349 -197841 -18910 -137963 105549
18065 12591 8817 -210970 13832 -213845 221683 9414 -41053 27681 -61574 -289705 -387430
18054 -387430 141641 -167108 -250260 -208929 111535 -122068 -49004 112112 94503 -101692
18043 -212658 -245573 -419775 121899 -91360 -255057 -51125 -218700 -73587 310631 -333297
18032 -5587 90452 184466 -59438 222676 389814 -100902 -60776 -100387 162351 -120809 226859
18020 -14417 61562 -47403 105315 221578 -180579 -211707 -213081 -344158 97151 105487 -271724
18008 -124254 -254730 -159062 31724 -35988 129109 -61978 211291 -201676 -237070 75273 -110101
17996 113618 -119581 -214800 64146 -178553 296727 16920 128573 -113701 -110944 -155805 -175042
17985 -175042 -98434 190041 -406847 -232909 120285 46349 -81031 43383 -66567 -118640 -31349
17973 -154582 -21786 66329 -26507 50876 72058 8717 -338412 -40502 112566 -188793 -78258
17961 45281 268495 17587 73731 87086 -157309 44864 91859 17796 40957 143228 278530
17950 278530 141893 -103134 140610 -58346 49605 -99746 66574 263246 -251163 -91493
17939 -215599 194339 -190534 -109560 -245952 216832 -7708 137714 323608 132369 127520
17929 127520 -104598 -21408 -94110 -188857 309856 -40981 -129120 14391 -40201 272858 -116147
17917 -27277 -83929 -285766 -109145 -232204 -172418 -100767 -157795 -189494 138942 -74649 146848
17905 -205500 -60107 288053 -23947 -108574 -79069 255678 -283942 292346 -107508 -111181 280702
17893 303138 102042 -54896 -372018 -333658 -146051 -15092 -136675 -188315 -81079 42707 -390118
17881 -251792 107691 145184 -134148 -209842 71285 73745 -293193 -246467 447917 -83328 64559
17869 115894 116936 204142 182019 -131876 -151971 80705 -43892 -200353 -41863 -108902 -72885
17858 -72885 -132995 -247814 189766 310763 160298 172527 -117092 95296 -77649 12752 -33902
17846 -8897 16223 -196921 -225912 -233964 -162121 -9287 -128358 -386329 18388 -86067 59698 88113
17834 88113 97422 -72838 -243698 -65751 -66666 -18730 -186223 194930 -203441 213639 -265818
17822 -232767 -86884 -182020 337011 85654 -122385 -104950 242547 -208799 -97359 50691 -29506
17810 128938 -150509 486559 156304 -50972 117097 5236 -111624 91299 -58044 -27365 8853
17798 -3152 264744 37125 -17415 215384 9499 42944 -189326 31123 386605 -328016 -122293
17786 -130724 278895 -57290 328196 384590 4640 88236 476374 40954 192359 -377985 94944
17774 -186864 67392 116327 -57568 328059 63826 8602 79086 29022 -52963 139743 6947
17762 -421367 118026 -49498 -10887 165509 -132705 26897 -210772 -124699 -6240 -78108 -59502
17751 -59502 -75188 -120972 -69003 -70272 -173660 -337062 321358 19349 -124734 217411 405965
17740 405965 -340739 -192859 -156803 -387626 -60169 86635 337471 -18470 15626 138403
17730 138403 -79234 -140970 -35067 168640 244686 108697 180478 -152258 -97564 -133800 428380
17718 -47181 265021 188655 -268616 -210619 -128199 10827 225215 -181907 79077 140188 -1335
17706 -207108 -51048 -242195 81872 36690 63854 -129906 -159567 -379921 -93594 77847 -305258
17694 -46766 113119 128177 66165 27641 -286905 -42370 320141 375376 -42064 120244 -21590
17682 184505 234296 47958 42913 19681 32860 -105215 88538 14851 -174973 113840 183802
17671 183802 200655 231123 99221 252602 -85140 -213683 -83182 66362 59256 157566 25602
17659 90689 -180610 271470 266052 75296 11266 -297418 -156669 113096 -63472 -93552 -181054
17648 -181054 -128260 -30506 252042 113406 96494 -172414 112553 -58271 195967 204723 119486
17637 119486 12201 -252483 -20427 107061 -125658 83819 140167 -545089 82528 38278 75543
17626 75543 65482 -83536 -44316 317401 27987 -8460 -138380 -61057 433722 79279 -99481
17614 -186360 -17630 -249048 -21944 -35649 -164424 -150548 398531 -161080 255257 -68000
17603 -259735 72391 71878 82463 -92604 52809 119209 136213 107471 -158695 58933 257677
17592 257677 371289 -2122 -233618 127439 40635 -72364 -98838 -135856 -115286 81702 239997
17581 239997 -83142 -26820 289745 111906 -83870 170314 -137279 -12592 314368 4240 -87359
17569 -138445 136003 -40912 66327 -223786 109418 253276 134761 -73801 58993 -199557
17558 -19423 -85113 112658 142183 91380 192506 -307671 -76784 -407783 182817 -68148 323610
17546 -317917 115913 96941 50796 -242855 33853 6821 178437 -48555 60574 164400 185697
17535 185697 -83581 -42905 -19952 42505 -9916 17406 -61325 27903 143476 143413 187792 -273515
17522 126683 416284 185206 80009 199226 71457 73680 -79356 170218 273178 -88373 85205
17510 -60183 -33272 350578 5623 38927 47705 312602 90130 224479 120299 87555 76562
17499 76562 326492 168098 127807 269045 47564 836 -9015 65963 347939 -51572 326726
17487 51242 155384 109903 -239 -3375 -160815 71658 -302785 -23060 -214870 92102 182032
17476 182032 60240 -42988 4161 222501 -219128 82608 401602 96771 131554 -11020 -144468
17465 -144468 -31492 -18054 20881 12428 281237 55885 42477 73185 302293 -302442 -18284
17453 96801 357816 216643 419548 241284 483248 88982 606459 95304 145008 314720
17443 314720 391070 265911 161386 -116579 80981 -160586 309354 215538 304329 -22329
17432 189094 411184 237722 385464 101489 73797 137590 195395 -106192 235428 128675
17422 128675 158440 327155 -149302 367711 187616 405711 69695 -85567 468018 -92763
17411 290233 97485 380830 45774 -104178 90707 248503 45673 78195 166161 163414 113373
17400 113373 291133 127567 144408 167165 83411 356217 214356 252521 226117 20314 107023
17389 107023 -67789 -214 83178 -9823 42447 6850 71826 215842 179936 74636 190528 223150
17377 223150 370216 39748 -216668 382564 161234 151970 226673 299958 269861 9403 108342
17366 108342 164181 155748 189481 25690 197398 -46565 109166 90281 79452 516376 60489
17354 25346 -18195 153499 -103712 -10663 -22186 408327 -203862 117660 111988 163741 167472
17343 167472 37475 422784 153748 247542 145810 118971 150341 17693 172623 328874
17333 328874 -157758 193427 -114931 67615 218479 70383 -30094 -75864 83231 -142450
17322 -7621 181778 395835 35278 -285460 -4979 135702 -131887 -1358 301103 -278167 118076
17310 221165 200272 -4420 43138 319586 314331 29980 -41185 388195 -38991 146987 187635
17299 187635 269494 -8032 117242 196305 -71506 86577 205920 -100090 -123981 267547 23652
17287 171056 32926 115218 68777 167756 239741 -50687 251838 87002 23592 88462 416151
17276 416151 77892 315633 -1410 203905 230355 177971 -92720 35793 79609 341422 144016
17264 -2375 215537 456732 66469 -92177 373638 -192735 -1668 526135 194350 432862 152443
17252 511763 419184 168515 70728 -122947 161233 434602 490613 -25090 18261 516641
17242 516641 138184 -82577 86378 -238695 99911 -156109 356580 157761 35381 338797
17232 338797 -124591 99359 119521 256547 252399 43362 311516 92392 297361 -38121 493902
17220 36351 -73131 262885 13872 124738 31639 324459 -40498 377326 -62586 381500 86793
17208 246598 47410 -19108 319936 -14958 48769 435069 319842 -29380 106729 324329
17198 324329 186389 231551 189883 23835 -111305 -26156 213408 24398 69369 140020 196487
17187 196487 83356 687335 123131 62603 299673 188125 -82972 244853 14348 166481
17177 166481 338477 -110886 316265 203214 460782 292965 197853 276434 275305 288862
17167 288862 169586 -79499 -21130 203112 53161 30544 314379 425102 139776 222116
17157 222116 346145 359866 474847 136053 358240 214313 450833 158601 132080 59382
17146 313409 210301 -113332 215564 -5085 407850 461671 143032 206722 502183 435888
17136 435888 410179 363220 470513 285448 -14486 89550 504782 85926 218994 46098 193679
17125 193679 210812 290112 135514 204704 323474 340341 260576 156081 133342 106864 593450
17114 593450 438971 216940 349168 257710 409505 707683 5930 300324 194853 322734
17104 322734 -157292 288501 369546 437272 316915 147544 228931 298288 266134 479126
17094 479126 259948 255850 364288 157252 330003 217888 363576 398763 870434 467648
17084 467648 137589 438587 371845 463240 607408 291607 588920 382978 123961 451577
17074 451577 433262 173915 -61245 423211 314258 310699 110461 408578 392227 602504
17064 602504 472810 324999 423295 425834 509408 530200 422463 379969 486452 555473 543594
17053 543594 197931 577528 740031 251825 608835 582361 575567 7317 492161 554836 452180
17042 452180 327585 541976 287294 225009 558459 369673 340081 686468 231937 216891
17032 216891 421057 497284 471745 599034 442575 235499 500531 379778 505761 813540
17022 813540 302115 691832 517524 458810 612282 584895 664222 661118 590900 372216 382005
17011 382005 729795 651303 532255 658657 731521 754999 647086 401980 658832 692144
17001 692144 813098 505220 705044 594007 805645 665988 931481 830308 614836 496146
16991 496146 982486 772005 672174 961128 698136 703194 743434 791556 545672 590723 834982
16980 834982 764211 577721 411725 600405 464002 606897 868674 912637 927667 909889
16970 909889 782116 724872 1017190 969349 748566 850203 1011791 896618 576593 883770
16960 883770 739859 907257 777037 688823 619265 742860 1054908 711164 816169 1084693
16950 1084693 775814 819911 1071351 818840 1074844 975645 840141 1138722 888539 918102
16940 918102 1067840 927761 885399 1032563 1119819 1259533 1121156 1346989 1082172 1014076
16930 1014076 1166769 895510 1032305 1236590 1018115 965132 1086551 1024121 1253272 1258168
16920 1258168 1094548 1025538 1260194 1191356 1361114 1048212 1106521 1293738 1174704 1266837
16910 1266837 1271256 1363838 1650286 1526650 1363309 1260797 1650009 1235158 1285114 1319364
16900 1319364 1408073 1915672 1443281 1568591 1795855 1656896 1678300 1553044 1518655 1659573
16890 1659573 1357082 1567897 1770659 1992665 1751773 1885041 1551009 1766685 1550790
16881 1550790 1734152 1693886 1869720 1974263 2015271 1997592 2009196 1838713 1614636 2140682
16871 2140682 2139281 1981005 2457934 2105202 2457128 2582471 2287877 2071049 2389426 2564135
16861 2564135 2285581 2466492 2336213 2527549 2433995 2683535 2319306 2657779 2511716 2493221
16851 2493221 2874106 2657155 2863159 2718992 2954285 3051511 3338993 3152394 2803737 2954343
16841 2954343 3311145 3142482 3009666 3223139 3500070 3287397 3546234 3333028 3843415
16832 3843415 3608617 3712472 3635074 4195991 4149476 3755758 4079449 4166675 4271122 4691059
16822 4691059 4533951 4317697 4635840 4893258 5175514 4923191 4939409 4819097 5479576 5188781
16812 5188781 5310784 5566752 5502043 6059831 5707523 6240431 6081618 6389576 6684164 6714061
16802 6714061 6701436 7094465 6951082 7296268 7112977 7404812 7460166 7506663 7919390 8277513
16792 8277513 8371580 8440503 8840106 8970351 9202982 9561823 9783209 10356473 10469791 10535541
16782 10535541 11149214 11454601 11863047 11890629 12213892 12562338 13469584 13641169 14226382
16773 14226382 14134597 15134154 15325231 15962473 16409988 17323443 17776136 18536909 19388421
16764 19388421 19862124 20608917 21674310 22350969 23259205 24531995 25700659 26927746 27872266
16755 27872266 29344824 30820237 32256038 33817751 35519020 36941957 39238369 41185177
16747 41185177 43427795 45848328 48921375 51737846 54388252 57843337 61420310 65434301
16739 65434301 69296119 74005188 78576060 83838375 89424849 95681746 102254077 109068538
16731 109068538 116662506 124777259 132893843 141823162 150425981 159636024 168601588 177836934
16723 177836934 186206032 193826811 200361766 206041179 209954230 212604537 213287387 212385187
16715 212385187 209527890 205287434 199396580 192476579 184391937 175665277 166614685 157379180
16707 157379180 147888851 138685865 129431211 121362025 113113851 105621977 98981401 92002283
16699 92002283 86204957 80305012 75178371 70507429 66170058 61853281 58375304 55149518
16691 55149518 51646779 48540509 45885967 43476741 41014333 38831396 36437765 35027757
16683 35027757 33239106 31721370 30197473 28993674 27417011 26288464 25203138 23991257
16675 23991257 22792747 21841822 21396019 19928993 19506824 18551361 17949147 17041296 16270184
16666 16270184 15940762 15527228 14735656 14368085 13954319 13535133 13033896 12574832 11893456
16657 11893456 11789235 11382063 10822409 10625493 9867820 9893637 9541915 9198313 8861628
16648 8861628 8609504 8545139 8428440 8251251 7809208 7771385 7437632 7369713 6930319 6823791
16638 6823791 6590900 6530199 6463554 6086358 6269251 5823042 5739462 5579742 5872838 5655869
16628 5655869 5239774 5209191 4955606 4599897 4820290 4562312 4587489 4584212 4494809 4123054
16618 4123054 4390377 3977316 4046356 3853404 3932193 3960162 3944033 3782169 3576977 3414498
16608 3414498 3090177 3025887 3380122 3442910 3084273 3160087 2827227 3053902 2668118 2863306
16598 2863306 2976741 2875349 2591333 2519774 2881108 2465599 2299539 2601521 2496847 2438091
16588 2438091 2487889 2440305 2335881 1924402 2315055 2119307 2125031 1948123 1906008 1974376
16578 1974376 2064339 1993377 2106197 1941638 1918418 1913904 1880205 1882817 1891768 1944827 1698055
16567 1698055 1853373 1905645 1686459 1554067 1649181 1572932 1772290 1568300 1310845 1131840
16557 1131840 1319516 1311248 1335382 1342272 1501751 1539744 1379764 1291161 1382501 1062737 1433267
16546 1433267 1432983 1095694 1265057 1235450 1377051 1021952 1351471 890502 1057221 1368941
16536 1368941 1019327 1368664 864603 1179242 1235751 1095866 755127 684630 1132385 602750
16526 602750 1053026 1048006 999506 941641 689219 1047674 1059542 869615 733804 1218290
16516 1218290 1167931 1005741 859454 882321 854577 848593 1006769 778139 669370 752216
16506 752216 872460 660622 596431 924844 976365 748889 628764 463350 792544 679745
16496 679745 888673 627995 594638 391041 566708 697945 784962 626015 399071 616874
16486 616874 303494 668967 61526 666220 442610 492617 924177 644464 683614 635628
16476 635628 538119 687317 734757 669066 501520 309846 557861 572141 491133 637833
16466 637833 510465 933021 529776 498254 64039 553377 532181 423847 436928 685685
16456 685685 785170 240393 421063 528468 476689 522833 613067 310906 422651 218518
16446 218518 811459 461426 607831 600828 189210 623252 683361 617962 821089 418726
16436 418726 163480 293808 601219 430406 355439 194576 901181 232461 497157 554746
16426 554746 626774 360635 181351 339478 292983 449962 471317 452334 258405 649869
16416 649869 54898 123051 407790 142020 495121 331594 623770 231909 566207 292928
16406 292928 252443 178600 336858 318139 125969 383126 99955 516975 168428 223509
16396 223509 305732 285231 338454 352760 279708 105597 262149 772036 443641 261452
16386 261452 310718 168832 281647 349040 389947 400331 258498 456482 130261 134636 60006
16374 210557 240065 372964 63899 -235104 249471 200209 387928 -171490 663954 269635
16363 97615 208070 355972 148083 383123 505093 333894 109024 229317 309893 189064
16353 189064 30593 298826 21255 185589 233252 163890 346348 275872 343243 330915 108683
16341 32562 170976 105364 435716 -103434 334622 247170 -59446 179559 346997 89413
16330 204182 486176 543057 188319 213867 -152996 359155 224172 71739 -29032 -42145
16320 -42145 112750 107717 88879 -145996 238229 376814 358105 232291 357520 -70314 277204
16308 6225 113339 392686 275707 112443 59742 219361 -223468 101987 275486 125852
16297 235359 150841 71772 359071 -34180 -66041 232680 100542 110112 75155 268927 245947
16286 245947 75926 116214 247210 -6614 178037 107161 555983 243729 200486 285756 525386
16275 525386 -1172 61663 1419 148429 223311 -79149 212507 17881 57746 1053 -350069
16263 178258 -175525 -20643 -2007 252371 -184540 22641 -100538 -39906 147081 271309
16253 271309 -297191 223535 327566 57245 -53174 -125091 221793 178389 147423 72644 261279
16242 261279 -186520 100484 21840 53467 1910 48449 28975 305084 23600 191621 -48435
16230 40810 367915 -225224 368143 31016 -154295 -19661 263948 301629 -76547 -167328 -208242
16219 -208242 391945 208206 -120389 -114501 218405 442251 153762 338185 -36392 130221
16208 -132691 115957 39261 132619 140790 -103244 -205697 -59870 -92560 -20666 67725 213899
16197 213899 -236002 169469 334437 -31391 72966 302915 243759 149876 90128 24286 223677
16186 223677 23290 75203 6904 153648 -43182 -103881 -163247 114619 346237 -51356 -142425
16175 -142425 -137748 83847 160289 -49988 136705 79249 -75764 49566 -158903 -122037 -33156
16163 -154216 267880 126703 144946 64343 69944 -299604 138032 -67338 -6031 -276757 33144
16151 -49723 -53182 241388 66223 150182 115993 104084 -163282 214145 -37881 -177851 -228906
16140 -228906 -21240 104733 6607 44453 58248 136329 -40376 -64823 169797 17961 50661
16129 50661 -62208 292362 213698 -375063 124013 -50001 -228598 -291048 10636 19085 128861
16118 128861 45046 -286257 28065 280262 -218007 365894 -19308 -110015 138343 -8484 -16754
16107 -16754 28826 -200662 209309 -39936 155280 -50624 129885 200478 86266 96726 -65369
16095 210009 -339083 31739 185227 94691 159604 -91768 61736 -178105 19945 17356 14456
16084 14456 332921 215304 -198926 243529 -142988 -223658 -139170 212012 -331083 -226188
16074 -226188 -61045 -192414 -278559 111350 -78784 116347 227503 -76405 -7618 121999 -90792
16062 -18527 -47137 67611 112308 12961 -190770 50565 66370 114790 -261597 128763 -230203
16050 29833 -304025 -37100 13911 14769 88684 359635 -244093 -87996 167995 -226727 191448
16038 -72951 -141913 -186577 100648 -277828 -57548 87894 47199 -14645 174808 -72869 -83347
16027 -83347 -65096 243221 -238828 -232214 -215936 41805 23494 -192481 -199373 92060 55437
16016 55437 -220709 30104 -248610 -465150 162471 13432 -8189 22744 -225441 31701 -6690
16004 -83301 39576 59258 -45127 87965 -136186 -438762 -372243 143540 89731 -204410 -135138
15993 -135138 82573 82783 119287 49536 -122496 105414 3401 -32680 -46971 240033 236500 18420
15980 228225 228465 245147 -30932 -33172 -30228 -154510 -91019 68579 -19983 -12479 -360277 -131803
15967 -30090 157657 -392162 -167689 245760 311290 -1833 146549 -151917 57682 142731 19524
15955 199490 185457 -97711 -107870 -80876 -17093 -41976 -43373 8474 -6822 -247768 -157933 -195763
15943 -195763 -45751 -178625 -410738 203340 -15150 -90896 147306 234525 -24960 -84308 -3515
15931 -189439 -134417 24041 84126 375161 52556 -5677 -54474 -79781 -202201 -191180 -183847
15920 -183847 -174084 -206702 61313 -102276 -88586 -9106 -408926 -97333 -159459 40627 -247916
15908 -289779 28390 43733 -103580 -78028 -137416 103772 -81661 -121775 -25822 -514 -23631
15897 -23631 -27412 -92483 -12522 -212111 30066 -99165 41598 135945 272916 -469341 150531
15885 44686 69996 108155 265538 -184711 105626 -219882 43510 -147435 161710 -123537
15874 186514 -140232 -42158 -59095 -87175 -289178 -233186 130283 -80528 -174394 36305 -437559
15862 -170204 -48307 -81403 -131866 22440 38438 -108039 51620 -41818 -98612 11925 -430156
15850 267113 -214008 -136513 1344 -29884 47881 38988 -272780 -63611 -56472 106964 -25324
15838 72850 -174902 -124253 -176724 204405 -170416 -123733 -123368 -120885 -162284 -33504 -180863
15827 -180863 -78000 -61416 -94532 326565 -47638 -192644 -310402 -45059 -220901 45946 -170032
15815 73825 177961 -248520 42036 19093 -25655 -167446 10779 -142880 -211929 10263 44791
15804 44791 147624 217848 250306 98366 -93680 -159892 -183709 203651 81440 -94760 -223576
15793 -223576 -156777 -149525 176898 21156 38393 736 -263053 -471737 -166135 97 18525 -199433
15780 -8177 186889 -279881 115494 -306457 90394 -14238 193158 -232704 -72935 -74395 86818
15768 -196276 -237167 273993 -158076 110459 -17921 36312 262746 -163866 -161548 276869
15757 336543 -210946 -96107 205910 -85285 -178867 -75511 -87520 -46193 -186236 116178 -124436
15745 271432 33521 -168839 118141 -10098 104528 -19485 -30 -345316 -5358 -54675 -31317
15734 -31317 48428 -168428 -32551 14878 -84481 116861 -308993 61456 -65222 -280142 -258718
15723 -258718 4154 -82726 -94934 112152 -219233 -87115 -35362 -95426 -30379 -204123 -149774
15712 -149774 31646 -135806 -81545 -52667 -343687 -28543 -34380 -226982 8928 11993 -315929
15700 42671 43915 -82764 128629 -10346 -276187 -29311 -293621 -406486 81261 -73271 -108366
15689 -108366 -191592 -103006 -90729 276958 -264220 221687 -277401 88774 125352 -82398 -6419
15677 -26855 19063 -142389 -525619 155189 -217311 237075 353187 -80093 88109 -128060
15666 185395 114022 2801 23901 -45891 -477081 115914 34863 -108393 220495 107537 -2917
15654 -151873 -290617 -235436 -5110 -298606 -258807 97098 -147504 5609 211390 -13985 -119878
15643 -119878 72058 124831 -210200 -261045 -44490 -285051 216540 220390 -61814 -233771 88805
15631 87912 -190503 -132290 37136 -122739 89674 27409 285038 -444518 -69775 -106401 -75464
15620 -75464 116309 -6418 -488098 131939 -126326 -197410 -236131 112814 -64188 -333231 80617
15608 66584 4464 -373554 -31627 187384 114509 40583 116330 -534654 152687 10833 -118611
15596 -157952 -120984 91594 206524 177741 202109 -44364 37040 -10242 -50226 257096 320442
15585 320442 -86422 577658 80156 47074 -280471 -8059 -45529 208123 -24162 -45585 -159610
15574 -159610 149594 156102 -155693 -233197 74600 278938 47699 -21104 134862 -46944 -159755
15563 -159755 -199413 -114870 130891 -44015 -17449 127856 -108779 -186270 30109 40783 -19236
15551 -139691 -224828 -443441 193423 -5595 27466 -256084 29128 -308676 -54671 153874 114208
15540 114208 -96279 -218785 -40393 -64238 6188 85815 -91331 307978 -152155 -30096 215821
15528 196172 -40182 -217906 142787 13258 -264304 75114 338395 122425 181254 -107414
15517 -75645 -357794 44148 59333 288418 107961 -62301 296445 25521 148888 -307304
15506 -226863 137296 36603 196225 -45436 51045 -131799 16071 -47187 -223259 -238217 -132804
15495 -132804 -204538 228829 5725 -263222 7816 7616 57310 -291425 -348012 159781 -37673
15483 -1184 -388465 20191 -418023 19902 137314 -120253 257282 -193634 -26755 10349 128176
15472 128176 -361309 192460 149714 -71111 -301343 -100170 -350824 3322 -167270 2635 -84137
15460 -83596 -67846 107667 185882 20145 1166 138903 -228146 243640 -167113 -42167 -223471
15449 -223471 -152990 -43068 -135263 87839 -163163 -212788 195289 -227880 31738 -255814 -153820
15438 -153820 125698 125393 -68434 -31960 -58636 105030 150184 -408346 202325 -290628 -279180
15427 -279180 137174 217383 -158671 -20397 -62521 -430056 -210617 -224549 -232698 40742 164350
15416 164350 -44866 306265 -20890 337414 -295924 -105971 40634 20517 -158601 -73417
15405 -237080 247189 -33954 92043 -122195 -194013 -164599 100074 -94574 -76199 -109762 274941
15393 -42122 -11624 -36321 81914 -63211 177757 -23719 -8972 -26254 63872 76584 -21637 -158745
15381 -158745 51342 227013 -209395 -90422 -74623 -127778 -94224 -75253 311154 -117437 129462
15369 -206157 66718 80796 14660 45001 -248484 -314949 -112516 -246115 -270014 -208257 83606
15357 102364 -237305 -49122 47652 41627 -72010 -49788 -238233 279285 841 88618 94148 -60299
15344 -164853 149059 -211269 -376500 93763 144716 275606 -250615 206302 -234078 -67508
15333 -183945 -57700 -12695 -169599 -32224 -11006 261052 -111536 27577 121912 87248 -87648
15321 147215 78463 140948 -63188 263162 238448 32181 208417 -132644 -343963 -269511 8664
15309 198252 346035 341564 -104267 98550 8821 -226700 88184 235349 -55021 35529 -4526
15297 66428 130291 -221861 -121906 266707 291105 237042 -154977 176334 -64362 65510 42341
15286 42341 85624 -129458 131690 -88172 33952 233731 75391 -4786 85280 -38941 -377808
15275 -377808 432277 113843 -111775 14665 -34124 210450 209015 51611 329819 85084 222862
15264 222862 228582 377946 165821 127189 -49710 305471 -283955 -163761 151774 -85723
15253 277896 -32083 128440 201362 298175 690258 881482 1619302 983046 1047224 1003895
15243 1003895 244708 90976 230510 277748 216927 172552 258079 9193 48372 24693 -92643
15231 8893 -119229 52613 69213 43446 -270412 158791 228385 112285 19958 268110 -194790
15219 135509 131439 -62097 59873 424926 -215555 374397 -27929 8760 177610 -76653 156897
15207 -953 92813 -132022 60465 130514 151264 34714 225157 128775 63863 190214 90327
15195 471212 -188064 -193472 339058 81481 135144 -95531 -85250 94420 419730 71739 336478
15184 336478 -56841 130098 -93952 145275 -215803 193070 214747 170605 322115 -150771
15173 176562 -156001 266750 -384 311246 32376 25722 -51944 -228899 100960 116964 136552
15162 136552 155199 -162869 29153 73593 224001 14211 -41635 -95039 38464 155969 63712
15150 -235187 -42990 29178 -29760 145604 -136400 -105970 -75375 30105 -156834 322171 173807
15139 173807 96337 125239 15673 25316 -8358 -112464 316115 451139 63640 111536 142390
15128 142390 -35296 75207 116553 132005 45721 51077 276161 -26764 197711 144699 307142
15117 307142 224905 262127 -6801 201044 388653 -264817 247580 152022 231153 150850 281202
15106 281202 43200 128590 291446 -233760 71235 337348 61234 -129715 204202 108404
15096 108404 234065 56796 48106 27841 97242 -83119 -152976 184352 -8641 -77130 642529
15084 169215 184106 70203 539762 145136 171204 68929 -50189 416508 118418 -79410 94616
15072 61258 -175963 -105370 93753 191400 78689 217326 90829 55427 194583 250401 -134342
15060 101581 394276 511614 -89716 -83393 515987 121893 327327 333359 309816 -258527 234404
15048 -111513 50695 125908 114034 -26272 -112175 49143 297861 463874 99972 371472 -170739
15036 117929 384247 -34356 103096 -16574 551879 375342 203107 123247 126285 -146359
15025 274596 56981 -95466 69413 214204 225404 -34056 197711 43669 39733 488507 403814
15014 403814 440811 185471 -38679 271383 366088 75873 388630 208215 152435 204590 206452
15003 206452 -14264 480702 -24358 64902 469952 372040 15689 -5501 203561 139541 72317
14992 72317 -119246 -161641 -46114 -149151 -164160 89509 96252 4186 20019 109291 61737 246282
14980 246282 418041 63620 -37507 307337 209697 447515 229412 -131879 55645 316697
14970 316697 223063 384505 256666 52768 288077 130576 353786 430437 47588 146825
14960 146825 94497 65516 186821 277905 321663 130805 366229 286836 289513 155092 341425
14949 341425 237670 222810 277668 17669 -59594 268113 324163 243896 -54047 -167295 183396
14937 334858 108658 357406 10481 51758 245584 363765 597004 367628 179424 532928
14927 532928 61779 241354 417955 295361 248183 396896 498902 225514 304633 557572
14917 557572 317096 170357 385419 214479 525905 9357 426469 270516 322562 403974
14907 403974 303868 423412 67721 212569 353543 90508 391430 298229 178507 161030
14897 161030 223432 448707 424550 73946 299667 369822 405066 258795 281037 436269 176948
14885 588336 630156 284732 285860 182563 158261 383636 244967 111315 264964 59914
14874 131487 234308 -118304 246343 247981 -103173 529053 687025 437425 278402 420382
14864 420382 166082 583522 585503 623134 330170 525165 382950 408700 631195 479318
14854 479318 465027 92985 577199 374824 404828 388053 633140 338622 588112 193516
14843 110728 290752 728480 336875 428242 497138 342563 668146 621469 697277 665267
14833 665267 509363 379185 484678 530368 284313 471002 157840 572283 219986 252779
14823 252779 356564 516570 596904 407193 597194 404142 556791 478248 144661 770719
14813 770719 320918 764762 261441 302118 452616 468787 651489 412818 259168 521305
14803 521305 474586 416471 312689 178203 553902 681662 646816 412110 376516 379371 520650
14792 520650 645081 611278 591734 683132 366329 738872 550386 423281 352975 464945
14782 464945 777772 369451 197171 679001 262457 540397 642299 426042 658058 465975
14772 465975 270483 710013 450212 378012 782743 572872 832090 793231 563811 849652
14762 849652 475808 347994 710072 433657 529973 503921 282561 682080 335378 653958
14752 653958 736951 679562 641552 441153 623962 568078 563982 776040 554422 995599 424061
14740 603819 663079 696096 767156 428491 736498 734133 690505 766025 783616 625692 469895
14729 469895 513781 775718 487590 627293 712469 514332 685318 898572 832286 928658
14719 928658 1046973 718268 969433 1130783 513121 511615 747980 955130 610425 520028
14709 520028 784131 389654 814119 989391 697481 719569 782211 451224 930966 599216
14699 599216 876531 463273 770657 1008413 794125 883883 1292843 640248 948470 979229
14689 979229 989726 823526 522296 1016812 965698 986012 1048919 1017746 605277 774893
14679 774893 930966 570732 1088989 736399 843757 1041117 833214 1168423 980987 637798
14669 637798 1006412 1061004 989689 758019 1128818 1007914 1056204 984083 961718 929388 1030973
14658 1030973 592165 1244305 1015399 1217257 1362517 1239880 1335591 713595 1143347 750644
14648 750644 959933 1075725 1131131 1179762 953233 1425246 1279172 1317305 1051388 1041767
14638 1041767 1485534 1240954 1292061 1227234 1223644 1378008 1145638 1249788 1148880 1206861
14628 1206861 1092816 1053619 1325977 1179866 1350748 1228869 1327468 1409902 1185250 1511148
14618 1511148 1451641 1503423 1458569 1544233 1481011 1319964 1677325 1508143 1273529 1535527
14608 1535527 1183975 1520297 1396879 1636550 1890078 1513795 1579083 1424689 1554532 1505996
14598 1505996 1442646 1565011 1536278 1831578 1589057 1668359 1721905 1534438 1778353 1703840
14588 1703840 1882900 1840442 1786002 1788865 1904634 1990332 2035309 1773877 1780278 1833866 1971558
14577 1971558 1891374 1885433 2053721 1886830 1901668 1957106 1972795 2070431 1973745 2167569 2125462
14566 2125462 2193145 2318658 2483553 2163395 2513333 2648306 2675973 2742302 2749417 3076146
14556 3076146 3329700 3395837 3375066 4048773 4059095 5111591 6903514 9592265 14681649
14547 14681649 23944294 32832428 39800884 21259534 9055765 4570381 2890894 2507501
14539 2507501 2328724 2299552 1858364 1747462 2089771 1879317 1747391 1989136 2031956 2069027
14529 2069027 2416380 2073549 1934333 2142204 2526706 2536960 2441143 2113267 2457974 2386539
14519 2386539 2542934 2625040 2369592 2741243 2449219 2455017 2644266 2842165 2478171 2785038
14509 2785038 2898863 2964089 2598243 2737570 2976481 3048721 3139756 2642051 2743188 3261172
14499 3261172 3032305 2893888 3364107 3071045 3396705 3323003 3368551 3204946 3411310 3647311
14489 3647311 3325513 3430636 3491362 3766322 3526567 3534925 3772074 3528924 3544878 3708222
14479 3708222 4094268 3465682 3986210 4160872 4009300 3946455 3861441 3961800 4181971 4474005
14469 4474005 4149584 4318095 4338929 4549366 4289309 4525853 4607464 4586271 4723971 4809816
14459 4809816 4524396 4838896 4827308 4818017 4949502 4652819 5201444 4988954 4803065 4842990
14449 4842990 5353697 5334278 5709988 5507170 5490985 5745402 5738379 6002029 6196520 5992376
14439 5992376 5889142 6028886 6015632 5982504 6325358 6602912 6650592 6462097 6749171 7057680
14429 7057680 6779030 6982118 7001380 6947741 7405686 7025984 7682480 7552971 7792495 7885520
14419 7885520 7821696 7944446 8088874 7891846 8150992 8839988 8710920 8864543 8789681 8831254
14409 8831254 8890623 9155223 9263196 9402154 9655925 9754060 9749714 9977949 10365970 10435265
14399 10435265 10464923 10721094 10766309 11210756 11152768 11556592 11672357 11684811 12112830 12208587
14389 12208587 12200053 12359203 13027221 13214345 13540647 13502752 13920584 13956353 14005304 14569430
14379 14569430 14561188 14808723 15407876 15888799 15805180 16187860 16641500 17019409 17143721 17662555
14369 17662555 18060788 18208377 18590367 18992370 19304887 20046495 20382169 21079642 20997312
14360 20997312 21533720 22074606 22832420 23138853 23488496 23966587 24928741 24972273 26019630
14351 26019630 26597389 27063639 27632056 28547903 29152130 29921353 30579967 31568751 32237197
14342 32237197 33284037 34276539 34878676 35829041 36543400 38159195 38900681 39701651 41090791
14333 41090791 42411085 43585675 44928548 46369803 47780859 49403434 51068175 52539331
14325 52539331 54263536 55984060 58105212 60029581 62013309 64603374 66705565 68886128
14317 68886128 71738270 74375204 76855560 80266713 83347471 86631149 90225449 93924440
14309 93924440 97873273 102189838 106398999 111223318 116008887 121338801 127229772 133018654
14301 133018654 139033084 145558944 152644642 160071992 167797536 176041555 185103514 194349276
14293 194349276 203890786 214369611 225142563 237098503 249078262 261564551 274812848
14286 274812848 288527754 302523094 316596854 330892412 345377577 359710586 374028989
14279 374028989 387695346 400342205 412454242 423708045 433306109 440164562 441387958
14272 441387958 442488492 440570080 442552088 446244481 445900127 443341170 437518702 429283416
14264 429283416 419945239 408443748 395354675 381354296 366958315 351688710 336663055
14257 336663055 321645716 306603340 292379162 279217992 265667381 253181902 240315816
14250 240315816 228439784 217637470 206921278 196766470 187496986 178649565 170564575
14243 170564575 162435159 154763953 147772861 141169675 134646271 129180710 123820418 118535328
14235 118535328 113412769 108392559 104403793 99966169 96391207 92480751 88334748 85482362
14227 85482362 82145997 78925253 76238654 73215979 70602160 68144463 66014693 63929819
14219 63929819 61641960 59719536 57889334 55780648 53884630 52350476 51238366 49204871
14211 49204871 47682839 46141652 45005168 43819766 43133550 42173485 40559503 39129428
14203 39129428 38068750 37074436 36419062 35464168 34471354 33425550 32604785 31520158 30866406
14194 30866406 30538033 29809416 28705919 28051885 27173890 26359150 25895575 25296344 24967840
14185 24967840 23959833 23883699 23593239 22445858 22425239 21721528 21399223 20455349 20290318
14176 20290318 20117233 19397378 19158100 18931982 18486459 18279754 17866766 17362150 17031451
14167 17031451 16732865 16100306 16116647 15917134 15612889 15379310 15009374 14683633 14347458
14158 14347458 14276856 14252281 13478726 13497797 13210180 13034331 12816810 12859862 12434840 12138126
14148 12138126 12378085 12010043 11479791 11645801 11401425 11088974 10678791 10492311 10629126
14139 10629126 10686973 10631259 10251494 9968923 9991901 9876668 9548667 9580763 9376748 9020557
14129 9020557 9196967 8986254 8893354 8369325 8447515 8509404 8581710 8377864 8260480 7861355
14119 7861355 7925921 8093693 7715536 7774716 7536197 7365626 7289985 6987336 7110471 6842959
14109 6842959 7122919 6904222 6945475 6768824 6911916 6579011 6278589 6594104 6071993 6453284
14099 6453284 6041534 6201266 5920276 5881278 6050533 5700508 5597309 5747676 5670073 5523587
14089 5523587 5451638 5468490 5367970 5400563 5033659 5105227 5827036 5200856 4853382 4963997
14079 4963997 4941330 4868932 4572421 4854659 4634043 4545722 4908019 4903489 4581053 4787295
14069 4787295 4683744 4500316 4575313 4455136 3990934 4097516 4373689 4179058 3951380 4118429
14059 4118429 4093067 4103235 4039224 3997995 3839272 3678333 3852850 3746380 4031449 3732259
14049 3732259 3559324 3652442 3780874 3728505 3404234 3361428 3365033 3452473 3286752 3118619
14039 3118619 3181804 3000335 3075845 3260342 3207507 3297016 3024200 3186176 3388570 3016999
14029 3016999 3109426 3270430 3382559 3023239 2826382 2758320 2887342 2880713 2805798 2571052
14019 2571052 2630720 2557394 2646656 2781437 2577128 2743396 2423136 2683758 2479258 2327512
14009 2327512 2713889 2454692 2276613 2115518 2451274 2405927 2370844 2515125 2500616 2168177
13999 2168177 2343547 2253784 2237281 1924208 2187754 2423732 2281529 2515874 2759980 3695593
13989 3695593 6075067 10135252 18884953 28604033 40248474 25823889 12522459 8023908
13981 8023908 5780290 4583180 4271085 4159388 3472741 3276522 2975379 2755592 2629924
13972 2629924 2802664 2909740 2815116 2405569 2853173 2570893 2263931 2391612 2361458 2353149
13962 2353149 2251894 2226214 2549770 2271499 2392093 1912570 2138889 2169530 2218658 2164455
13952 2164455 2032956 1824610 2122730 2021145 2242451 2136446 1932785 2215840 2271771 1972400
13942 1972400 2291379 2014524 1818298 1590400 1822673 1879558 2131822 1693453 2080594 1804185
13932 1804185 1668863 1730872 1679092 1811250 1523099 1636276 1865276 1338905 1695101 1625486
13922 1625486 1634554 1652629 1397801 1261935 1771062 1621465 1699603 1875005 1655704 1850479
13912 1850479 1540854 1406024 1344757 1681554 1759124 1474060 1545637 1491063 1560952 1746862
13902 1746862 1714745 1442045 1296279 1812279 1355711 1789055 1474178 1650600 1379206 1422733
13892 1422733 1243678 1214418 1505794 1432043 1050299 1345374 1459929 1525303 1466333 1345413
13882 1345413 1311849 1354675 1214209 1232172 1117299 1118363 1107395 1261785 1278930 1183482 1065343
13871 1065343 1406025 1015584 1187785 1058348 1127826 957797 968749 1165681 1287007 1018259
13861 1018259 977023 786653 1203422 920542 1402178 1125438 1317300 1098956 1021616 1098449
13851 1098449 963833 1224512 1039635 904449 1068746 1299701 1297817 895943 1071424 1104674
13841 1104674 1052626 1039627 1245170 1082043 1053634 1025605 1098915 1046470 1144562 721018 1154095
13830 1154095 1307429 670980 978593 778837 1219094 1117548 1021768 879350 1033612 1060457
13820 1060457 1208338 903067 949819 650686 1069667 1182631 1048122 1197903 755063 1054302
13810 1054302 848004 905844 928015 703766 821731 831447 1055865 1102431 713644 936030
13800 936030 761500 937008 902034 674274 959214 897867 909406 694974 886433 772393
13790 772393 973001 947196 673275 571973 722067 498006 575555 795865 533994 839626
13780 839626 852055 870896 1035770 835266 856849 767813 765627 835199 835352 752963 744384 942413
13768 942413 493938 665748 681356 837664 773847 759823 850015 764122 527281 1045850
13758 1045850 1020115 784761 545771 724967 533167 859337 713127 762984 642156 659213
13748 659213 580794 717149 892340 619294 648807 774833 537113 753423 681568 699108
13738 699108 544322 741199 573757 600091 752272 711895 505494 596285 882877 564355
13728 564355 451643 564134 594691 478267 661712 750322 394256 927813 434486 97219
13717 665426 774080 685582 598829 487287 805477 442895 632962 618149 715452 695295
13707 695295 839128 588142 507526 886314 515428 605734 512861 798513 564146 816304
13697 816304 402781 370124 662400 476165 626876 232419 282454 198512 648721 589326
13687 589326 289459 501845 242460 802509 596170 534589 612530 497341 510350 597004
13677 597004 99229 818832 841074 286186 428116 574156 664393 726950 563489 305784
13667 305784 492449 570424 463067 298603 507192 342815 724915 71248 535370 760100
13657 760100 511387 318501 510338 610049 338277 477441 564671 494632 523829 331061
13647 331061 560683 669050 653224 577921 518218 467078 521308 334474 313533 493950 336115
13636 336115 306626 468760 463599 527162 337613 780441 395051 625226 378783 436630
13626 436630 416953 395974 691057 205620 505358 391966 422718 262059 104298 566845
13616 566845 462888 385274 32815 546231 562265 410717 519721 340780 349374 744076
13606 744076 391959 328501 561646 506323 264415 817146 503790 535050 390538 251780
13596 251780 238891 360799 481036 503716 351445 409112 541576 380574 175756 430220
13586 430220 525880 327783 409297 539972 212246 620596 648207 425218 377692 162736
13575 433340 324839 459038 268627 387127 96850 622353 116421 592784 547247 165698
13564 556019 196898 113783 387778 350518 233807 313395 226008 178781 244557 319212 422249
13553 422249 454381 30291 71217 532472 539321 195146 474923 575923 179001 510883
13543 510883 247890 205472 146535 441455 224972 497616 198935 456476 150504 323541
13533 323541 383181 615527 420464 567963 220467 140067 177430 184630 547529 101378
13522 213429 480439 113090 189661 163085 -1595 306313 250774 236429 36828 364020 163939
13510 441013 231515 281826 650736 202749 134937 269288 490005 431410 90175 171421
13500 171421 221241 413144 281844 465388 398099 267313 383558 269699 48380 75060
13490 75060 231780 250896 322869 153145 274135 261678 279905 309561 462405 18456 423821
13479 423821 10388 80345 387771 -94017 166557 182860 112406 263495 214584 498984 204289
13467 -169439 360569 52908 49406 361277 341389 30151 556216 119440 189790 53253 324130
13456 324130 42251 140628 417397 471065 412431 481029 175064 140691 134381 142783 77575
13445 77575 511525 232761 455018 20619 440352 314174 270199 380502 301511 232283
13435 232283 401468 465045 134530 141569 -121305 166199 388876 -82351 279768 241061
13425 241061 565670 124745 308877 5096 276008 286702 357719 252321 520537 312030
13415 312030 255117 -2159 107804 470778 476319 113840 170277 234070 201290 424989 -897
13403 200318 435133 483255 307625 -16361 189431 265454 187314 579 -22155 -3346 440123
13391 203209 -8897 412887 -85475 352808 343902 166890 103395 191854 77982 139760 310552
13380 310552 63041 -94771 277226 -98220 177553 162616 518565 359437 259709 266122 274651
13369 274651 348324 164969 313189 340589 -7961 292105 227492 146365 345523 149881 15219
13357 182421 58484 281985 475819 494554 532024 286931 127547 5178 304496 384894 543416
13346 543416 397058 305372 163483 354934 314509 219144 324723 289832 297676 442207 362465
13335 362465 92720 227026 -69022 237148 52072 137557 -39598 301038 461958 142409
13324 -191 -36756 -212966 407978 297889 293311 330253 584836 222914 170994 310231 250629
13313 250629 104985 227749 24184 30774 29216 260221 34548 453685 401416 88572 267827
13302 267827 187833 145841 333829 216697 -45080 297320 448567 235841 154612 21712
13291 38794 451592 29770 265949 205930 239740 408244 202266 200794 429389 386408 309815
13280 309815 373212 133900 84776 247620 364372 178451 151816 104832 -71044 329897
13269 47842 -31539 348015 251820 331079 -130633 179919 107395 415205 -49211 404091 66022
13257 216602 36299 154878 242090 220902 261675 196753 -7851 234832 133471 -50345 94979
13245 556766 380198 203743 149327 388248 9544 75597 150883 17078 133775 191929 331660
13234 331660 118922 143229 127015 244395 103762 355447 180669 -230112 159158 17791
13223 130763 -31240 -298156 162034 291627 153042 -65298 235736 127692 200293 384304
13213 384304 40215 154619 38594 139137 253983 -58751 334105 194139 263090 93202
13202 113964 133232 375483 67543 -1966 247282 141893 553203 89789 -86715 -129618 125611
13190 123931 165898 173525 206918 -81404 272494 85908 72713 221804 198772 281715 34584
13178 15022 -196356 -118248 225790 323575 30675 74389 452808 -69486 392022 620791 92042
13166 72029 32302 71584 324493 -73028 336138 -48875 164088 261895 -265822 214914 129854
13155 129854 116664 156582 45757 128689 -57291 269385 -15351 208738 53737 -187278 281014
13143 249099 143560 -135645 -256136 236065 245620 -123999 95690 112322 324908 454864
13133 454864 188455 -216141 76498 -32034 251631 223429 568450 167360 119071 16976
13122 40034 144312 196518 99358 508176 -32976 282678 -43855 83717 31452 -265381 -32077
13110 -57712 85753 259926 202877 227394 53841 366466 480344 146059 10799 240465 45856
13098 99697 153544 -41562 83064 207709 -31883 388607 173536 190197 87859 141176 -230547
13086 -55319 98875 179763 -134754 75386 289823 -25135 361630 21374 -72625 161449 402208
13075 402208 314200 45657 -41299 113507 -134969 252855 34046 265870 87872 97830 -16459
13063 132805 75275 93010 49439 -255896 166903 38575 -105269 -81261 -54470 -198577 96543
13051 -135198 101298 406226 395662 59807 213266 139411 14021 178095 149665 353559
13041 353559 -358147 298505 190330 -52725 -214862 328350 95496 104833 180551 404490
13031 404490 71974 461414 340893 22154 171184 282598 192548 369343 -17077 -64452
13021 -64452 -15788 330330 175341 128871 154012 -268097 191085 31187 554013 106676
13010 76809 352155 -43174 211325 106949 -1632 162428 391956 246993 -210 12175 -97809
12998 -26500 261799 -89573 54152 59520 -142546 348862 82779 -65070 73341 29291 114201
12987 114201 -176960 -80794 292242 293007 -255642 -253655 36955 241683 362776 -138422 -11706
12975 -91538 -4011 220856 28176 245612 -194786 224048 250177 457163 -13531 -22204 -93898
12964 -93898 352013 43560 -152966 109099 229364 -242232 59001 -176102 17208 225939
12954 225939 242957 47805 96162 -65989 -245948 181205 249670 520156 97743 -49572 123628
12942 250455 40877 216135 5381 227324 171 219314 234554 -52982 36034 -162546 -126250
12931 -126250 101673 -126540 235056 295116 183973 79477 52350 194158 -35775 191821
12920 -47000 -10783 155625 172952 -113989 56703 56171 137888 273626 79933 -168624 243003
12908 20877 96215 266009 499657 367051 158285 -14174 121532 64002 63176 9965 134475
12897 134475 395636 382674 -33847 -68701 232612 187094 211009 182647 288498 303763 -8098
12885 -212568 -59901 -68603 57582 126052 -6902 -25449 212804 25001 363958 -77282 374644
12873 -214661 -108082 195874 -113445 -306205 233121 -213358 143874 75999 -45299 -284029
12863 -284029 352059 220275 -3429 56919 17909 25247 -274344 623 178725 -137097 105440
12851 197432 208556 5961 122183 -135986 47013 -476575 -198560 -7102 286476 114138 -21737
12839 115683 305544 -1478 -87670 113663 1355 -143605 -122214 -121615 -61080 134174 215763
12828 215763 101530 147499 -73451 87481 122675 210535 14368 65005 5138 32461 276513
12817 276513 48074 73747 -55539 311499 272125 -23597 37274 40636 391412 -238153 16132
12805 91130 402647 405018 -91036 124733 -59133 81781 157223 355574 8023 -243134 -159657
12794 -159657 -306400 -279602 43447 -62458 512424 117569 178696 100766 -125173 209091
12783 -105925 -271480 70857 14361 -67016 38970 14454 -36021 140905 -23060 -3191 50570
12771 31629 -10229 -101542 83598 -17196 102839 118522 171252 436336 209079 87410 61426
12760 61426 25356 246430 237699 43496 269126 -61462 81430 -92560 41237 120106 -47766
12748 298321 -85710 170635 277295 -63250 194444 -13935 521574 -129512 92077 259384
12738 259384 168493 77269 180035 78282 -26452 79868 14123 60914 41441 -39427 -121279
12727 -121279 -77292 138367 -117064 -163076 -375604 279863 206052 238952 164885 -151461
12716 7864 -396947 107427 -244902 435713 -77108 33097 200814 141988 -6565 408999 130510
12704 243335 84145 -51948 335728 456910 226164 55227 -166880 98413 343633 164849
12693 -124799 409285 -235439 -16481 345854 -108684 72672 -64581 -43327 159762 222565
12683 222565 -147051 -245864 -112832 205296 68856 131722 -68541 185870 334118 81195
12672 25372 31169 261946 165993 104302 -68068 73130 413127 45120 66380 36927 144578
12661 144578 -118380 641414 37747 160733 171681 90951 -241801 170563 153842 54455
12650 67408 -41182 161512 -21812 111170 -75738 83855 16816 -122977 146246 -50498 -109238
12639 -109238 180302 -24034 166168 90163 -79045 -155966 -23255 -1678 -21934 328703 484602
12628 484602 -44386 353884 80910 147037 157023 102051 -42235 244238 349593 -24148 32080
12616 252123 141733 121913 -213191 -14903 265819 218887 97428 325188 -104058 24438
12605 8259 137127 -292397 -71166 199439 -261239 122290 145507 510162 188465 -53978
12594 104498 77028 7577 -162538 80635 227537 -226685 -111691 -177569 35292 24511 7753
12582 204058 -59637 79371 158247 218556 -66734 -196698 180175 44265 -141900 -101241 54623
12570 172669 305924 158618 43160 258470 287198 75998 179566 162255 128014 324959
12560 324959 77818 433804 -141649 56055 317926 104515 260711 -70017 65846 -161802
12549 154724 77378 -43420 74206 203505 223322 135799 -109190 -412302 -62127 -138966 391711
12537 -242580 -151360 -57771 166291 -328489 18207 16106 7672 5319 -70984 -133353 198071
12525 -45898 -58744 -69547 36198 -114159 29796 211666 63528 -62597 25131 -8493 89491
12513 -69367 121485 220743 92145 -161092 -58478 -60656 -116793 93968 -117100 139627 104215
12502 104215 -35695 97306 75834 96748 111951 6664 160145 164989 34106 18314 -204070
12490 70434 51170 -254703 452565 -179551 95279 98670 -82896 -40183 189700 30205 23902
12479 23902 -70499 -89556 437731 -41054 198444 80707 73763 23803 312783 108348 39784
12467 -3720 -36050 164174 -171315 -83993 -9102 4588 -6042 -96600 -172178 9520 -89667 111847
12454 31795 -140091 -127895 327432 58447 11900 94061 -148748 226973 -27407 40082 -69016
12442 120290 -80955 286654 -14302 147860 37960 -6726 236193 -62269 252152 -85502 77633
12430 44626 -18682 81319 101118 41 130389 -52665 82942 -148096 86674 -149443 174516
12418 -130045 -216923 -121680 -28593 331424 -354611 -95341 84260 -372605 -132693 311225
12407 283706 -64378 25506 -22193 -26480 61087 16943 41744 -229755 172293 94657 -96671
12395 -167290 -255820 143638 -71102 -80238 29031 114678 199951 396961 78117 311457 -70305
12383 341663 -188050 -76639 135555 868 189872 -115124 -30510 153775 96135 -209055 88217
12371 46096 -109245 -320817 -220316 261662 -84826 -360617 180206 -16393 -184305 169733
12360 12537 -78709 25247 195148 -188891 -42414 -352549 -432616 -168227 116199 143612 -194163
12348 -158537 21416 -69563 57228 -11476 110354 89325 14611 -383766 102379 114741 -67827
12336 -467445 310464 -18520 -99874 94195 192397 15079 18155 133076 94308 152477 -228725
12324 12885 23782 61096 154835 -112360 20974 126050 -135314 -208263 -285859 -172943 244557
12312 253631 -174787 -70911 59512 161972 -13706 -42424 255689 129938 9699 310064 8777
12300 -54593 112501 -85518 -63838 -225283 -6772 78187 33997 92903 392666 229248 -167630
12288 270668 130722 45077 -19809 234136 -97473 -43335 93860 -82149 219688 21022 455868
12277 455868 -61704 102610 362772 133220 494244 297764 -6738 -44031 304759 -203147
12266 129118 74178 365377 275108 -37476 163034 -34063 -32909 197526 -201123 161771 77951
12254 189982 183950 131074 165261 134929 223860 40415 -964 149459 -149380 -72558 135135
12242 -28507 149805 19981 243358 130819 181824 -113226 285502 -852 -67767 321003 -74409
12230 126546 481899 211797 354691 114719 263167 235108 79024 235579 133054 162926
12220 162926 174952 -118130 308975 183303 261194 487032 33331 243976 219293 16923
12209 17326 -61867 -146260 42565 -87073 83862 351565 165999 237642 193471 108220 450813
12198 450813 277887 289788 217518 291026 263857 162841 176370 280298 93250 -110571 16139
12186 138267 458252 254 67660 175406 245765 322383 127816 118971 184225 268150 -293387
12174 59321 5245 -4374 -105110 375370 229686 22577 -114247 3026 342513 307073 -105105
12162 -242518 -62372 -74389 191751 18275 193410 85624 434541 -44492 -55702 146113 18233
12150 -87643 -193720 86436 16499 39565 254919 -195248 164609 -185406 -197410 216523
12139 63927 36439 146012 178522 -101421 -151641 33425 -41764 -98146 -59279 207996 22377
12127 43319 56256 -527880 -354624 430542 87005 -32696 250148 -81416 -209512 -120980 -212794
12116 -212794 -19022 -60639 -203103 221228 366678 143110 137711 130090 -18431 239754 -247537
12104 -99782 48000 -235910 48483 -314946 -40102 26756 -100981 -140168 178659 -175618 -21686
12092 213652 5691 291611 198268 266640 135239 62793 149259 -21170 40327 208162 62594
12080 -143496 163112 -54255 -72991 -108323 167463 174923 19358 436403 -19280 -53096 -124429
12069 -124429 -321784 61123 104920 58507 60616 231428 393092 632168 550219 1459934 1606027
12058 1606027 756325 218094 -15234 -6987 164841 44458 150729 -119480 -219631 -25284
12047 9137 -164076 -133624 -36156 -167219 -192773 184988 -97497 -21268 -66972 -269309 -160498
12036 -160498 -167355 -110723 -59454 -155990 132272 -117299 -99956 86507 -18437 207298 -120651
12024 -33467 -150677 -51572 243117 87259 -158066 16191 -306596 -77285 201228 -35355 127234
12012 107523 -46936 321973 373407 -138347 70351 113736 -298930 -76992 167025 128450 -13365
12000 343287 -88699 127830 101964 -222389 303497 -104489 165298 -178644 -111469 -80885
11990 -80885 241845 -144221 228782 -53196 -141947 88028 -363105 7464 -212300 -28544 -333836
11979 -333836 -93557 -134931 -32816 -16809 152236 77232 18751 -81182 -256067 -145388 187806
11967 98407 -16949 67176 128841 158217 63382 -110694 19856 -89408 153390 293119 117386
11955 -39459 144042 163199 -74749 -116236 186812 27489 55620 -286134 -15333 -46885 234170
11943 59693 -192780 298843 -137880 94429 152229 56999 390399 -118964 148313 81294
11933 81294 27253 -10344 189887 -56617 88546 179339 -121055 154903 -148820 -107442 64198
11921 -126337 -11909 -130710 29474 -127374 450666 36524 250111 73034 -148242 -203344
11911 -203344 77956 81572 -180659 9562 228915 -2144 -89319 106754 43143 182802 8291
11899 147702 50841 -385555 -40197 80577 -98733 -242466 -185750 -257828 244661 -85371 -289523
11888 -289523 -101315 -163956 -112437 24816 -123104 -256815 -76660 -16761 -153115 -310616
11878 -310616 -381080 88182 -23396 -123954 116394 220584 -42169 -91360 446490 -285901
11867 35137 184869 -66807 213036 -2622 87582 -82592 -35295 27370 359593 -137643 67333
11855 -219816 -312092 3595 -300433 150831 107205 253682 76700 67725 31037 -305663 66217
11843 32282 280538 -306182 209463 -356869 163268 -148304 64235 347450 398605 24164
11832 29189 117268 -113070 42735 -325410 -214650 -166339 -30358 42835 -70089 -121887 -394604
11821 -394604 -224291 -24341 -15079 -337245 -53633 -387360 20308 -148060 -87428 55397 96683
11810 96683 -116603 -204884 42040 -152535 -353158 42632 118854 -295637 -188130 202330
11799 -279444 234308 68906 -364748 -48018 -112469 -114983 -229852 -130381 76993 97633 -110241
11787 52739 -51626 431041 -251828 157284 53866 191223 20897 91007 -113105 -141517 -246944
11776 -246944 -200744 -87571 221921 -160092 -61075 121656 -174896 -87497 220780 -167562
11765 1124 -249103 50816 -51292 -189297 -22890 248719 11727 56930 14545 82149 -16577
11753 142376 40954 -536449 -15937 149479 -67707 32159 54930 127667 167798 94998 337269
11742 337269 -220 -2589 280013 40772 -249718 163870 -85972 -133464 300831 299586 -46198
11730 -225438 354516 172858 -36742 -74199 120478 -237733 -166035 150030 1994 -278346
11719 69515 169943 54745 53050 43842 -61794 160366 297040 227910 47143 131469 -24490
11707 191670 83190 -187517 47519 113472 -49541 167833 187551 290816 -44733 273661 -82602
11695 -9401 300737 34739 -25016 -45571 92555 -258735 168070 305817 148474 228445 218989
11684 218989 96070 -70169 226437 -163506 -158265 -46539 453502 -362191 66375 130728 -58245
11672 114348 -65396 178717 -70016 -159441 172462 49478 26857 -19428 146009 114401 110046
11661 110046 -2361 167947 -375310 176996 -168995 -19450 117413 29982 62552 -140071
11650 -100981 -29628 6525 379983 -39302 111823 -146465 -106142 105478 -20966 -312720 104954
11638 54688 -61688 -254825 -117984 51856 144662 198243 83348 187761 122847 169228 -1015
11626 80672 101903 317881 -32142 -2313 -84124 149856 71838 -34285 -299103 -260487 95602
11614 130587 204551 299610 352105 296878 224145 86161 77558 -45718 31729 83270 95652 -60013
11601 -247874 148503 -64559 -72493 -62561 59808 151224 75137 35415 -108317 -5862 57869 323343
11589 323343 52619 210866 106844 15640 -121282 172377 336058 139202 21686 -122122
11578 18841 118002 270696 -72898 -62210 94298 -64345 390357 140821 -1948 44458 -151039
11566 236170 -109762 -165217 70271 -118859 -290670 -225919 97129 233018 -194036 137143
11555 98851 -16342 89591 471050 127046 22832 55592 92065 -312227 -185907 -135894 34575
11543 -47204 -82053 248095 181067 70463 -134779 242438 277765 -6227 339494 201810 -119729
11531 60476 44637 158102 -36782 -61282 -85892 194006 108779 -74532 228553 -163564 -209591
11520 -209591 -134664 238573 152190 119552 149935 226658 245921 -199216 -25040 -357987 -53905
11508 -110856 5013 28774 53379 215511 337308 -216652 37123 119893 43547 -84234 383262
11496 75216 190620 409468 -132462 -79164 235606 35685 -86196 283434 -169203 -68960
11485 -31318 288296 60838 276946 -180184 65381 -107635 -13656 154711 199888 -155665
11474 -38377 211874 -170246 13575 345589 360628 343251 338902 -7045 106311 276466 70881
11462 296796 66626 238478 33256 178513 415739 148922 -195586 155527 -8050 68214
11451 258349 184001 107065 155954 196038 284828 -93719 315693 -288576 269953 339592 -63826
11439 -32663 -182131 197702 199317 360973 51741 363798 -20906 179739 100878 303486 88378
11427 -23207 -8324 -161471 -109112 -150066 97186 -315779 376531 172577 -518295 -28222 197136
11415 -206269 -290159 -133941 -139837 79443 -126767 89054 -152913 253609 -141535 280679
11404 1838 287626 82970 174400 -264715 172887 218685 -28350 159177 -3989 -149642 34237
11392 -182989 24494 120998 -151298 -30795 7482 121380 15054 -227145 248031 264953 26177
11380 526286 237818 187562 -217818 158573 -380684 -88672 -144334 222185 -139236 -160652
11370 -160652 -8703 -82053 45780 108738 165251 306095 -89024 -87445 124168 -39087 143231
11358 326171 -54554 -128157 -112470 -361865 27729 -78961 142004 99062 -76137 -304348 -111562
11346 -239855 145362 250047 194910 -370727 -210969 -373620 39326 68478 -93128 14514
11335 298128 -343810 137881 -48778 -120208 -25810 -67018 96152 -184134 -235164 111393 172179
11324 172179 15342 -136990 -236458 228567 140455 -32749 283792 34511 -46084 71862 -246418
11312 -61961 6937 -140799 -170049 -264244 204800 113913 -6287 -122802 100376 -141366 -24140
11300 -92490 472317 -22256 -153190 88103 -41264 120858 -91212 138534 -21990 80769 -101081
11288 -128895 -18630 -69137 -110120 -24216 -141219 -265602 85694 -4592 84560 473410 18974
11276 30906 -83534 147122 350698 -83736 449266 -202722 -71423 121086 174672 243938 -129673
11264 -155603 -258025 -280008 46884 -129471 -218646 -1655 -219789 34103 239449 156784 -88247
11252 82021 290958 84051 131981 115838 -157104 161380 25115 -181650 85922 -122759 -173785
11241 -173785 -32666 -18628 -170238 70468 220514 -86237 -136623 151866 122061 139659 230174
11230 230174 33875 -167064 -326930 -184544 -100906 -198444 11516 -333696 -105084 168771
11219 150662 136999 171487 175524 -195032 111853 -99851 -118618 108310 135529 -38788 -157506
11208 -157506 -120153 -60091 -283916 -52090 159636 400319 194401 -457107 -126215 351365
11197 -245811 -520780 -214954 -123437 -189342 -135919 135806 -165727 -316966 -285693 -216495
11187 -216495 -27527 17104 33524 62174 311012 -377112 122656 101625 -306246 -14709 90524
11175 -79190 -127985 196333 -33523 44471 -25837 -16084 228173 -411968 -121382 30301 -192967
11163 223362 -46810 127276 98037 -209192 -206754 39743 -73861 -135705 -47436 -376063 -60203
11151 225333 -146275 -25046 319057 -261488 163474 249618 431879 -116814 -48955 218306
11140 30857 -12601 10895 81925 106919 -55890 24304 75234 78642 176514 105506 478713 27835
11127 310916 176200 -66932 165054 -79835 56947 66233 140876 154750 -134807 277814 26927
11115 122057 -172061 -4978 41971 262519 4473 60848 157596 162917 -13341 -51541 -103871 -65638
11103 -65638 -36178 -350570 -67919 292372 69442 -52120 -5549 -48973 8091 160409 73618
11091 19904 -50839 103603 114112 82547 267760 378462 224456 75723 230768 218194 180859
11080 180859 493975 322695 204375 476580 395729 -95405 658028 160254 -24418 150931
11069 292890 550298 -26673 352805 145131 307897 85768 99491 457138 280149 510706
11059 510706 501263 502149 271838 513759 661559 456471 460054 527720 504546 609074 670467
11048 670467 871215 1078345 675527 755444 872501 568788 640643 486064 534931 768208
11038 768208 802190 699220 845698 720234 629149 757634 617776 215955 940778 649785
11028 649785 733816 618186 553649 550060 808917 588506 556321 860560 612163 674758 509045
11017 509045 521592 620137 503552 638648 744764 524921 328731 647833 483761 685601
11007 685601 792305 412357 456566 541788 581045 867387 583741 589505 381065 733804
10997 733804 497243 539621 857319 532388 672981 614160 804325 734598 843589 872727
10987 872727 749496 880250 721072 1123803 1234502 1189196 996340 1256520 1020746 1428679
10977 1428679 1532646 2086726 2141922 2655517 2582953 2431358 2681550 3012846 2501467 2540787
10967 2540787 2529564 1997073 1732051 1920181 1815596 1808286 1725053 1842364 2494125 1578377
10957 1578377 1757977 2079085 1968601 1387114 1211375 1436826 795465 516814 763112
10948 763112 391530 599900 339342 200050 327458 133300 395104 294327 314422 3613
10937 381237 131201 -173737 288944 142442 58681 226179 126612 -38286 69091 555 -212777
10925 35699 212437 302930 -18103 240191 57236 124610 137818 125683 -219915 -25026 -63568
10914 -63568 58843 -22142 -261383 -260816 -15030 137445 167421 -25741 -309763 63833 169298
10903 169298 303995 -70071 -12072 -206062 -87107 198208 -26725 146071 -289230 -5811 4474
10891 -285521 27376 122601 -82583 -10852 147386 -86536 151255 10037 -103063 -31459 -132534
10880 -132534 -342330 329937 -91359 140641 164740 154132 -240458 158496 -101651 7875
10869 -88039 -77466 26368 64561 42846 19703 57792 91054 -373502 108201 -124690 200867
10857 -140331 171356 17991 67384 -18256 -89694 51346 -137901 -5082 -263695 -27936 -176089
10846 -176089 133368 2177 184488 -138013 -79548 120245 196542 -270439 -74935 369991
10835 23326 17186 -194166 -250168 45752 87118 348829 -17323 -168815 165581 -17707 57810
10823 44144 -226661 136597 -93895 44748 86531 64426 -29508 37887 16978 -50936 -247258
10812 -247258 33718 82275 -127685 -57947 -60041 -9594 -374007 -244007 -144490 -107708 -115720
10801 -115720 -81774 267683 -118743 -406634 -71370 -97513 -151273 -232435 65113 110976 -52266
10789 -293179 -133165 35746 -68887 -4871 -26333 -45621 -28591 -401281 -268650 -201011 -229848
10778 -229848 -85215 133032 -55608 234352 230064 -218309 76278 -150824 166670 -113226
10767 169752 -28398 88259 -55889 63729 -238726 755 -8036 86315 182000 98077 204036 -22579
10754 -257357 23300 79405 10554 -149029 -112765 182673 168289 286474 79292 61325 -515458
10742 -12610 -236727 6119 -180397 -230269 15005 -266651 -356756 51983 -242654 -105378 -100259
10731 -100259 -116132 -33940 -66118 -176346 -38206 -162278 -189802 -37901 -238660 -76039 -157980
10720 -157980 1862 -273934 -153417 -237145 8368 -28475 -316344 16455 -3381 -94118 203116
10708 113410 79026 -273875 -122332 -146308 113259 -117416 -155278 -216223 87558 -50119 138423
10696 -19095 127143 -162243 34155 -48636 -287008 -263367 81908 49380 -221316 58285 -301543
10684 132926 91251 202339 222269 118279 -129459 -49249 144476 -180682 -326678 -281287
10674 -281287 -129966 83428 66776 -562079 147416 218760 98372 -959 191552 -123326 124438
10662 -209683 12875 158404 61805 -87818 -34830 -108812 -193782 17741 -91891 -56843 67064
10650 222927 -227984 53784 -182464 173068 214476 20255 -189546 116639 -19626 -340853
10640 -340853 897 176944 -33343 -57607 -20546 4671 49763 102233 194388 -16305 -157549 -308323
10628 -308323 177768 29378 -38947 124432 24623 -53528 -68457 -301139 -46992 -60691 -80572
10617 -80572 140459 189593 -207949 208703 30903 -283031 -146734 194658 -166729 162103
10606 -28164 -98879 70954 114569 95199 28199 -3037 23441 111006 -162242 263662 -199734
10594 283371 -245768 -162939 -89489 -176481 87206 -24677 52747 -86072 -333252 -196578 39955
10582 -79797 -195276 103052 88120 -103677 -44903 -129537 -214742 -221985 104574 19122 -185483
10570 11352 -45921 -352731 66682 188906 -131820 -70063 -37744 306112 21371 -2843 -35818
10559 -35818 -221466 -58029 -353582 -327650 -97736 -32562 -287570 -100994 54665 8785 -225672
10547 -114253 -62037 -181961 101721 -7596 -346967 89339 -317667 22032 162005 -177043
10536 -192744 110160 -354881 -23019 -36580 -357457 -254790 84691 -68908 7720 74545 -96561
10524 199292 -83331 173492 -406147 -184821 78901 -15993 21045 -224612 -210161 -136620 214690
10512 116443 -174473 219317 208133 -137573 -32463 167410 -23252 -55422 197307 67784
10501 66746 -53025 -183557 -107769 -113809 -4161 246554 157345 96074 -61872 445630 -81358
10489 10063 55715 -87123 -58314 -197269 42239 187293 -57053 306302 665046 445264 -18146
10477 -109579 303400 34763 49631 -23895 347963 -156433 252651 86054 -58627 -369286
10467 -369286 -282596 62642 -134526 282353 165640 7112 -77044 -194815 -51579 -152842 93152
10455 174520 40032 249863 -4908 21976 -44198 -162500 197960 245270 -9497 -114145 222607
10443 101985 -45906 -51586 -200534 -107084 242827 -142554 -235777 55286 -29485 25808 148716
10432 148716 -73229 -192643 189670 -292313 -16726 35852 1859 66287 -316120 -23584 214451
10420 -273885 -105481 57057 -127932 173416 -187878 -195259 -128726 12240 273005 -123541
10409 -60952 53731 238937 15893 136244 -516397 -167160 202238 275694 -148008 -98292
10399 -98292 -63285 177361 27219 -151276 232492 287898 -28126 199180 -33753 -49153 272833
10387 70664 47315 141098 28268 -64192 65394 -156618 -87450 -17274 284610 304865 146349
10375 359237 76268 55278 521263 226277 164812 79362 440117 304232 -161269 129250
10364 313454 483660 195481 275692 622582 43095 528903 167117 44857 39480 253016
10354 253016 412173 155999 411485 563375 505739 337217 115838 391326 379472 214248
10344 214248 433183 545325 298541 379087 547059 187946 65720 346491 182129 31629
10333 -49445 -66430 211513 -36447 226877 -113908 -29142 -92553 583985 5920 239359 84709
10321 214906 11758 297772 89998 232692 -42468 408336 278988 129933 57529 2532 128039
10310 128039 -133604 -112074 319926 284020 -94 -5039 133861 33974 121406 -215441 211884
10298 -177523 -115421 141467 -102269 -103045 122149 76749 51382 -47136 -67207 -85128 -50472
10287 -50472 42675 25233 150829 -267998 239619 92318 -306375 83656 -327463 -357767 62315
10275 62014 230435 -131015 -222418 -4726 200123 85273 -219269 12353 366631 223082 171037
10264 171037 241288 265107 144637 350910 297058 560656 311605 539569 -50277 116390
10253 286580 163179 123353 574632 93359 2476 252982 -85567 -253225 -39784 -346272 -450116
10242 -450116 336236 74457 17166 51256 -42755 -315864 -145303 -53669 188680 -137448
10231 76713 -143079 107457 -176490 -8357 35811 227170 -193827 -75070 -78972 48867 -245154
10219 -306977 106502 37602 -173000 -152309 -200441 223283 -349111 195719 78298 108169
10209 108169 -83074 -195824 -108546 -75462 -5524 -104271 -381758 47799 -138230 -273545 -170009
10198 -170009 79948 135078 187642 44391 227104 82881 -332696 236345 -331392 -55909 -60210
10187 -60210 58003 7083 -150155 -8826 -115026 83240 -209064 -132638 35100 111584 -192532
10175 -84760 175747 12391 -40833 -34021 -133673 -252091 -158918 -321396 -92222 108802 -10755
10163 -193947 28359 -54804 8295 90171 -5295 -292806 -131930 193943 -23319 -58249 291686
10151 -68089 267020 1990 107782 -30873 39389 -131626 -350815 229848 5373 -290980 73026
10139 129789 257063 46068 -33717 -214687 -299941 -192186 -63565 274952 -53307 167382
10128 -57001 190808 270208 -32012 57693 203050 -50871 -209431 -12456 51187 -143613 -118019
10117 -118019 -364459 51903 -17459 146128 -133582 89842 87012 14 -108901 -197929 -179310
10106 -179310 -110867 -10179 109196 -211440 3380 -202404 -226622 -87911 -243229 138584 -339403
10094 -261363 22538 -288070 -161456 -204104 121197 35189 -35164 83477 12033 150101 4012
10082 -204400 101995 -139347 168412 -259828 -130147 -209405 -248709 -34472 2927 -167693
10071 102319 250197 -157434 24682 -183198 -159506 282 -75200 -184263 136496 -320510 122260
10059 244348 82850 -44226 -218174 -44349 -214908 -395570 152292 -167136 -118530 -185928
10049 -185928 -75427 -243373 241786 128683 -210121 -162073 -212526 -90673 90749 232239
10039 232239 -56427 172209 165478 -145787 -10600 -206498 191698 -107658 -139742 -85712 209866
10027 -480739 -80239 -120843 -58919 53034 -55332 -130381 -107105 -77053 -80068 -191493 -40328
10015 281676 285724 -194191 15143 -149113 115111 -264001 -96740 245193 -14881 -540005
10005 -540005 36633 -556373 -435279 152086 -452344 -206278 -129893 -93322 -9874 -386839
9995 -386839 148942 -239957 -15485 -129123 -28991 -89664 -127392 -158028 -55010 2582 -410239
9983 4538 5340 208453 -209082 76254 147329 -181742 81615 27541 -373995 -209699 35902
9971 -23115 -219049 204811 -18313 -21368 -89049 -100255 -209559 -61845 -212721 -137654 -197718
9960 -197718 -169511 262869 -156339 -153466 -168757 125805 -167429 -343543 -311090 107123 227822
9949 227822 -152915 -34394 -229658 -160205 -75766 24775 31036 -434548 151060 31131 154011
9938 154011 -49689 -33788 -266781 -100361 -25123 -215908 13662 294024 -175749 -351615
9928 -351615 -407823 57352 -114262 -160803 -298461 219062 90717 -267823 126251 -239111
9917 -122340 130777 -299562 -134947 -44094 -171421 -182550 -30675 -141843 -75176 16600 -191371
9905 -149647 -96786 -347763 427269 411008 -184872 129972 -135265 -71556 -127693 2420 -277371
9893 -59197 90927 -16265 320311 206687 -107144 194312 -326985 -44182 6031 -285870 7944
9881 -53225 -375836 -114683 292833 -234207 262455 -124659 -169852 117246 163603 3239 -51460
9869 103079 -92201 -196180 50379 -82493 145087 -185699 -104792 105731 -232974 102840
9858 -139070 -51635 -333796 141513 -279269 -230991 -154046 -387772 174047 -7472 96049 -867
9846 -240147 -230010 -204539 -135754 -86964 -166181 42681 -181765 -429703 -5297 -243895 -146007
9835 -146007 5751 132444 -66723 130506 -56113 262407 232092 39699 -99580 -215799 27469
9823 -22717 -171669 -300946 -195124 -85917 79484 141480 -143778 -107559 -138166 -449401 29357
9811 190714 -136781 -287307 -66146 -349667 -178474 75176 -170866 51998 -122437 81161
9800 -101608 524523 -57904 -43930 -73337 94782 -314834 126665 48083 62433 147163 -153328
9788 -137113 -82740 -53834 29902 -117156 68325 58888 147510 -185582 -42431 -290999 153365
9776 -295989 23501 -71560 112807 -170407 -5574 -182017 -6636 -296403 142253 -138991 -38585
9764 53368 -257566 -155560 104272 -32538 59943 -282855 -20823 10628 -208323 -460429 -40132
9752 24780 -123739 -311557 -138220 -81337 -36506 -299078 -147586 245167 -54765 -31008 277910
9740 -35904 -195313 54324 -39574 -314172 -147248 -239675 333742 -22733 -21523 -140616 59239
9728 -443999 -54100 -75271 254682 -488685 -312034 -35070 121117 -9639 -458271 8555 338246
9717 338246 25793 -101436 -252887 -116920 -142647 108560 -269514 -298402 75926 185770
9707 185770 -58099 175575 -56855 277684 -198079 -78922 -28554 127563 -151806 -52967 30437
9695 -145999 5289 145533 153198 -131377 88201 -21815 50294 -48084 -334677 243446 -72470
9683 93407 94744 -187153 -26290 55880 -31366 -121968 61430 -30584 -103978 25845 -181126 -311668
9671 -311668 -352596 -125788 -84266 -98815 -109334 -65521 -91043 -911 -20846 -89386 -42711 -164630
9659 -164630 253591 -202296 -345136 5049 -254393 -102902 -239849 113724 242066 81372
9648 -210786 -238066 -326038 -72315 -16730 -108872 20110 -120674 -44632 34332 -228529 -307112
9637 -307112 -280676 -459724 -173002 20215 -263953 -84457 -54766 63148 96505 -32265 70844
9625 -14026 -29010 -410683 101589 -32574 -240737 -252329 -128997 172642 55490 54796 -324627
9613 89180 -128270 51530 -224676 -29264 -148780 14714 98682 258934 205676 56283 -92696
9601 -180830 -24624 -37761 -6035 -192681 101618 -357976 -17426 -427412 -118135 -309566 -565450
9590 -565450 54218 -67911 241253 -134244 -228078 59119 2777 -132415 -18098 -92190 188052
9578 33618 17063 20274 -163601 153096 -92700 14049 95620 -246842 66810 -128964 461645
9566 18245 -168051 141011 -18001 170844 214960 -749 -275757 -158610 -213244 104766 -216346
9554 -261797 84021 233794 -39669 -135016 -131575 -332094 64025 -110077 -130461 -108411 44960
9542 -64520 -114383 -158340 133055 -152282 -102275 -189748 -67776 71257 -12745 -182442 -233501
9531 -233501 -119475 -168644 -100311 -21899 114843 23136 -6530 -61724 280363 -75650 -102638
9520 -102638 108790 127678 -251126 172769 24849 -24173 259018 -145278 -183595 -299638
9510 -299638 -289811 70503 48352 -66740 -391880 -89831 -113923 -181598 -107160 -110097 -155164 -347586
9498 -347586 -68091 -85745 -563497 25977 124459 8145 -340556 -62695 -4924 -137948 -58467
9486 -136979 -104121 13764 -331056 -183650 -200469 68181 2022 68149 26685 -102478 -114251
9475 -114251 -203768 -210557 -126003 208381 -235249 -55215 -101281 -187948 109559 55255 -250323
9463 -67066 -36886 -65149 -68636 100916 -102638 123715 7317 -82109 -176489 37642 -142030
9451 -58731 -610119 -181494 -60299 101655 97617 -249887 -78772 39486 -93458 -208579 179682
9439 128330 417968 -103905 36402 -72730 67258 -106517 -26182 54080 355670 -136209 322690
9427 104696 -90976 -22337 135051 -143724 -62890 -19056 192942 -158188 -120843 91751 -172982
9415 84749 171062 -339754 -184283 -98798 309908 169325 -92169 -241647 50897 148451 -147559
9403 37217 -4898 -74640 -394031 -307783 -144839 -89217 -155922 17883 -133437 152816 90041
9392 90041 -203317 239560 -21422 -160555 -222554 127742 51724 -35869 -51368 -209980 424864
9380 -21959 21738 245481 -115519 88237 75746 34874 43992 42325 -72594 -194617 -102724 127300
9367 -64344 -360435 -165067 -80469 66825 -96895 -80002 -481711 -129822 290 413167 -114713
9355 -241824 150635 -32268 205744 -345703 -156693 -183012 53466 13374 119360 -63176 158552
9343 -274470 68315 82566 -118791 13044 141675 -93490 -62953 -169243 -182543 -154944 -497233
9332 -497233 -5485 285920 -186661 -117986 170092 -170250 47397 -75207 -8049 69332 -252977
9320 129049 -153044 177371 -281681 -103897 -247720 -349939 -84432 261157 -136056 -81166
9310 -81166 209935 167884 -271316 -99913 139578 73017 12970 60870 -181404 70260 -117244
9298 -15827 -133652 18117 -135125 -96789 -183870 50865 110243 -157322 155376 327770 -233178
9286 -111439 181748 231326 -236627 -335922 35018 -142095 -142183 -112102 -51493 98647 -168712
9274 -31872 95066 -38166 136078 -350176 -203864 -266074 -175774 121201 216836 -57044 178129
9262 226425 12411 -302171 76282 -90493 -68217 -27343 2975 46437 -111980 -115605 -14501 -67744
9250 -67744 142158 -92364 -84179 56187 -194765 124130 85052 28335 -95683 -69250 -189061
9239 -189061 152363 -103797 -115591 -34301 -181491 1799 -135013 -264614 -302501 -145896 -96884
9228 -96884 -113661 49372 46529 -127748 -176837 -136844 -48057 137923 -39791 -335300 -61723
9216 -8 -211478 14520 -336145 -457890 161108 -81773 45987 19947 -225168 46300 -368938
9204 -113421 -2474 -65188 57906 -191760 305599 -184510 -15264 -162669 62937 -61926 -254659
9193 -254659 -70156 -214759 -329956 -201985 151852 10824 -140547 -388493 194114 -163562
9182 3155 391195 -229250 -106496 192935 -133217 -41290 -238952 -312882 -81101 3017 72828
9171 72828 103879 18124 109756 -115253 -26047 154974 -96125 -333657 -241915 -187885 -55850
9159 -42198 -119031 -108554 212511 -72005 146370 -123763 -6088 50988 -229798 59770 -303407
9147 -88200 -285792 -89659 -25396 -237462 -441938 30424 85577 -171904 -145304 189832 237055
9136 237055 -259656 194037 -208124 -10985 -16891 -136720 -188037 -160166 64840 24270 -500
9124 1951 -163872 -57002 -33330 177633 -52377 -88172 -262048 110904 -275357 -233021 -156467
9113 -156467 69516 227066 -131463 278228 293130 -144681 122821 -89424 -38563 15945 -40467
9101 40639 -131798 36206 37243 -185448 228024 -62753 -304688 -275190 -277216 199166 -168783
9089 38569 53557 87453 -180296 -182452 -273825 -293521 -28717 -4269 345158 -186155 -145933 31308
9076 -179617 260940 78225 -103621 408930 8141 154420 -80640 159891 138202 266114 -40454
9064 3985 140965 73076 143409 -227148 -238130 -75985 78569 -3377 230263 -129067 19229
9052 -339439 -58271 -85297 -113221 -228828 -268786 -62773 -174515 -329563 -24021 -56207 81638
9040 33852 -150361 133324 33238 -62125 143666 -212131 -109165 -78949 132023 -115625
9029 -191437 -206228 -202651 -79381 87179 -126327 158563 347213 -152378 -56262 -65077 -406416
9018 -406416 -150949 -95470 -155218 -290434 -362370 -51787 197172 43348 -241102 -93726 53537
9006 -113926 87614 122778 -92356 33136 -18034 91189 -132684 -24942 -102427 163599 -76020
8994 -174742 -194113 -174565 -303807 -43855 223093 -73697 -268711 132243 -62340 143388 -14512
8982 227289 309985 24810 -88759 -1457 209928 -181577 97331 -103469 48886 -383958 307196
8970 -77219 -28478 -320551 286704 -185476 -167731 -215951 133321 -73874 -121878 -98109 273242
8958 27663 -145681 -286027 -106480 60060 -125005 -21780 -133539 -447134 -318176 -108271
8947 -13725 -32722 -65290 -109486 100576 -234672 -112121 -52054 -65523 -26289 -27451 -41686
8936 -41686 146896 1194 -45586 86149 -126762 225358 -170371 211346 62605 126236 733573
8925 733573 1586978 3730076 5864363 12640488 7072049 1535919 785175 199313 352367
8916 352367 230077 -92828 37560 -71038 73002 99786 -27959 -125398 603387 -79903 193079
8904 129645 -20153 13149 -275456 -147377 -4101 -142549 3880 2601 172108 -203328 -188947
8893 -188947 -12207 -45844 -244424 122920 -142599 -48987 147509 39672 117876 -33495 -43377
8882 -43377 179448 -84684 20651 -126508 30643 198194 -76854 188727 -150870 74263 71998
8871 71998 -331969 150233 -313451 -266247 -24008 -98006 -165942 173056 124624 -84682 79892
8859 114307 181978 -97169 -160150 89190 68369 -85083 -285607 438763 91135 -123443 -167096
8848 -167096 -121793 -27977 -76990 -5385 -275006 253770 44475 12915 417926 -75906 11659
8836 50454 224678 -353310 80744 -38955 -576841 146204 -57812 -281020 -118056 -87347 -255739
8825 -255739 -24808 -247234 192401 -200137 22274 -42008 -161215 -307360 162455 11655
8814 -73837 75048 59880 165380 78082 281570 26434 -106790 161054 -433461 -387613 212089
8802 13 -287181 -205711 -56268 -216776 -149703 202045 105981 -169358 59238 285930 118963
8790 249037 -268380 161679 133428 -175798 -287073 -249803 -158671 -235891 -101808 -241033
8780 -241033 -137927 34702 -151967 35836 -150132 -25995 -116929 -207537 -123107 -153875 -98783
8769 -98783 48415 -212819 14773 11249 -222049 -246462 385202 -237369 63038 -150756 -159766
8758 -159766 -60236 -249951 -486209 -242476 42129 -306493 56745 184881 92078 -107182
8747 30022 -72449 124164 109172 78307 133700 44456 -90034 159069 -163392 -63665 -80938
8736 -80938 -312659 -233943 58291 228162 33486 -125231 -323770 195946 8152 -547300 -5754
8724 -268886 -98284 33240 108064 308470 -149136 237240 240482 -379805 319551 -20703 -259290
8713 -259290 306074 -12274 -176376 60572 67652 -117524 217245 7915 -169260 -88096 -90497
8702 -90497 -84694 -113950 -163759 -21181 -185390 -285241 -24981 -205253 128224 -158250 -67571
8690 -187472 -100016 27594 -140607 -77798 -291209 301099 215829 70350 209064 174567 18370
8678 -43153 244372 -186167 -237376 295589 -189896 -105501 -188425 -221731 -275436 -101984 -124410
8667 -124410 31784 -81145 59853 -219712 118026 -12037 167097 152378 -329815 -69307 -85647
8656 -85647 145146 -20250 52613 350200 -404851 -131860 77990 -171316 18639 73062 242445
8645 242445 -487680 -172764 -980 97655 -166791 -315976 -216783 -126962 -320041 -118886 -231443
8634 -231443 -197712 -127699 -541 123092 -382366 5456 -155263 373379 118081 -49058 -60189
8623 -60189 -121848 47079 17859 -66073 183327 35723 186982 -78337 -416880 -94122 119581
8611 -182169 -275032 -114419 -299965 -90053 -129839 -94699 148896 -56633 -419626 9914 -193045
8599 194264 -88538 -301617 -305348 129804 -297852 -249200 -54215 7695 473947 -156175 -50628
8587 -412638 48262 -175428 188163 -168097 -178620 45113 106737 108752 -147935 127181 -69176
8575 -207333 -232924 -85727 -130370 91742 98605 -39695 109281 342539 85588 -68182 -402358
8564 -402358 255637 -47948 263332 -138636 -288150 -145384 -232964 23759 182221 -155482
8553 -275405 -31022 346861 -176390 128627 129527 323235 11413 -68874 -28995 4962 132179
8542 132179 110931 164328 260690 72597 -255564 -178571 92377 -38195 -254468 -237323 49603
8530 -100219 -48765 165224 120681 -181351 97804 137892 -10839 48416 23809 -157184 -181370
8519 -181370 419084 -37225 101077 399819 -104722 198889 -183271 -187023 -163642 77195 -28165
8507 97966 26606 36080 -117541 20495 -231407 194402 -116133 -204962 188319 -53387 5408
8495 105648 69483 -39270 190822 76792 18378 -203423 -22438 -515201 -42918 27851 235246
8484 235246 -270815 -43611 -277273 31517 138489 55701 373734 3076 -318567 -269351 166912
8472 106525 -234283 7931 118594 -252082 -87019 -206503 -187055 198117 8731 384752 -231503
8460 6629 31214 -123170 43554 194348 204855 -250069 95593 91064 89001 57704 100838 -239764
8447 -39642 -151850 2350 217028 65511 -78052 -116515 -220951 104170 -176461 59893 -72276
8435 31214 -245475 -540265 37673 -134962 -100476 314187 -354706 97991 -32149 -84016 233765
8423 -10704 -305028 298850 7575 -82124 -113275 -243280 -47900 -12729 -58089 -55633 832 -284435
8410 -139611 174231 -49273 236014 -1943 -151173 -74721 -71406 10859 8458 -228174 -352823
8399 -352823 151080 -85744 -196382 88963 58171 -62928 -182396 -89323 -21955 -159290 -265699
8388 -265699 -103501 -10185 -8213 -112807 21577 -26310 6481 -83427 -198413 83970 -204440
8376 -195919 39097 -303762 56418 -194881 137005 -216559 -178357 -161815 -380776 318280
8365 74673 -192723 -430976 29753 -264813 -217380 -161329 -47106 114464 -78792 -184089 -83936
8353 35122 99375 -17849 -77195 189240 -107693 327248 -96061 -112718 185344 -112458 -261159
8342 -261159 -48823 -96862 -1633 -75141 -202038 205776 -10046 -273897 247437 -102243 -60846
8331 -60846 30504 10802 133301 48826 -126491 -117183 -99973 -442232 -41934 -29327 80114
8319 11035 -325235 64929 -128156 -239773 -267499 29321 -88860 97961 -164220 371629 194456
8308 194456 -50979 50737 39961 121442 -345672 -152378 -364415 31129 189945 -122678 -324913
8297 -324913 -381316 -40909 -413580 -47920 -307909 -124253 219309 373139 -194176 98646
8286 -243509 148881 209563 -58473 50071 -206731 -61517 -30474 -186927 -50676 -10531 -133253
8275 -133253 -79683 -130782 -137114 -273643 -142765 -392926 28425 -218544 -103256 51496 16289
8263 -184761 96569 -29193 -378180 125081 167147 178187 97551 -173670 -119883 -178811 -96603
8252 -96603 -93818 -155078 13123 1219 -75878 231858 90976 38912 -184662 8959 -10544 -268450
8240 -268450 -144641 144078 -144507 69669 -112678 -141946 -77878 113975 -156503 31975
8229 -209108 -45258 184578 -219517 64846 -78379 -81490 131649 28581 27369 -2578 -265474
8218 -265474 37957 102947 -193065 183775 43521 -62023 262153 -63008 -26633 -102537 158244
8206 102245 73633 96595 23091 65965 -93577 -21742 -48604 -24692 22358 -136237 -380336
8195 -380336 -42814 -61154 49609 27724 -67377 24433 -430759 44336 -173940 -248148 267501
8183 124470 273753 -128022 -146894 -18346 341607 181564 -215709 -181604 77973 345254
8173 345254 -8907 -192258 -245872 106125 5863 -156503 -3499 81573 63609 -389787 -30460
8161 -106391 53042 -103744 -14699 367865 62046 267836 17328 177128 43496 -183977 389796
8149 -20282 172324 -16696 65691 144378 141542 -376672 -187702 -378436 7404 269752 -306967
8137 -138139 28371 -3865 90289 82252 61703 138821 121876 280269 -184736 250098 127307
8126 127307 128976 348634 -224773 -255618 -15758 -298255 221103 -90632 72237 -170250 -388734
8115 -388734 -135278 -50888 49573 -268151 -59660 -108836 -194599 138637 -278974 -52298 -35133
8104 -35133 135458 -113328 -3652 111501 -186408 -348386 -200897 -278678 -394913 -11819 -7873
8093 -7873 119878 -27120 -29976 159865 -149245 -178083 -27404 203869 74877 -316138 -199251
8082 -199251 217003 -269333 -228269 -83739 126977 -43259 -97451 -203919 71768 -362587 51467
8070 60750 150857 94230 33260 170061 93918 -77470 -39621 -93836 -117249 -217500 -379484
8059 -379484 -72290 170104 166827 200011 -150135 26624 15819 -23907 -308010 59572 -153907
8047 -242271 -347774 -228881 176686 1400 11344 76826 57868 -121419 -76466 -92090 -141867
8036 -141867 127206 113505 -300635 -27397 -288338 133722 -103258 175096 12196 -24827
8025 -514151 32667 101998 -290155 -391436 23713 155678 487398 -289466 56802 208846
8015 208846 -459468 -134382 196797 -38110 11830 -11036 155020 70971 -114413 -145025 85576
8003 -61479 8962 -139627 103204 -219527 -52742 -239316 -127910 235412 -97345 44536 167494
7992 167494 118396 -121332 181580 255393 106947 -3311 -294461 42001 -151177 461567 -151635
7980 102908 -4700 -134483 47678 32247 -214558 -194419 -138858 11564 -77590 -26283 -169942
7969 -169942 16837 -164523 56471 -162934 322579 -346642 100515 -199662 153626 -259759
7958 -1907 -25786 -234993 42563 -199669 -62363 14025 -304750 -250204 -188081 116917 -71495
7946 215847 -31811 -36720 -79812 191984 55133 -85207 -83825 -63506 -375512 -123466 799 118732
7934 118732 29505 -87400 293926 -222360 105154 120925 32224 141250 -263209 42411 82280
7923 82280 135064 -449399 323913 -192007 -190525 102099 165665 30772 64381 -67870 -240503
7912 -240503 225045 200671 315908 157744 -374466 -68245 -292411 -102356 72948 -203384
7901 -96389 -204520 -56016 -179974 -150797 53114 265516 -57074 -33181 44152 62116 -32170
7889 72992 249189 -82078 -50601 -367509 -73410 -199388 376705 231721 -59928 -199988 -136981
7878 -136981 -119255 -203428 10373 83955 -46818 -316148 -50661 92863 35348 105472 -79103
7866 -103190 -78457 -304149 -132573 -19408 63258 -274281 -172165 -70825 176282 -148025
7855 -128215 146928 -168600 -45580 171132 -46310 -22743 -172036 215123 -132463 -69563
7845 -69563 -125896 -306327 77667 -126179 220586 -64668 -102449 16467 -125794 54019 198321
7834 198321 21756 -48574 -426308 -5112 293350 -156575 -60666 36627 -175673 55922 185059
7823 185059 -76000 64506 -208261 28259 -98327 -113615 -145425 -77762 -50234 -218700 -185707
7812 -185707 -101537 -10673 96482 -18617 49222 43267 556409 45602 -269645 -81694 208222
7800 -365622 -210354 54919 -19760 -63425 -324456 -86480 79397 -184277 31794 -158419 107943
7788 94029 -327373 -123685 154416 176971 -5293 214372 852 -111051 -82729 -225481 -150813
7777 -150813 -111776 -27020 -162062 237941 184234 47199 277340 -352420 -151 -112786 -259587
7766 -259587 -393127 137821 -213674 -87758 -356248 -21629 -357671 127844 51878 -118068
7755 -4676 72424 30575 156347 68931 -41737 -431734 -73448 265681 -8733 -254967 8543 33644
7743 33644 -70049 -63853 -1193 -334805 44133 82094 -28118 18767 267873 -69596 -285230 61545
7730 25212 -35004 180915 -266471 70506 233701 49766 -44103 -66939 287308 -148293 -71693
7718 154992 75524 -120490 11402 26291 -8237 -223226 -104287 149334 -136004 -239538 129227
7706 -250578 -11779 -157523 -3178 -220509 -77987 -84662 208606 140842 -144221 -34791 -231193
7695 -231193 103693 -479971 162304 -14581 -89475 -150011 40935 322201 -372328 -351455 -22159
7683 -229436 193215 -283895 80045 -220379 -93193 192168 -178192 -64484 -108396 -199292 -393091
7672 -393091 41784 7062 175901 57175 70360 -111646 -301044 -154017 -185422 230950 44221
7660 -219807 -49754 175972 50968 -239192 192145 -68206 -40737 8252 -431756 -185677 -149971
7649 -149971 225317 150823 171256 -21166 -121552 -92833 -105230 -373782 -29108 107419 -127237
7637 -275117 -50319 -211335 -420862 115316 -66345 417582 266724 -183266 36287 217197
7627 217197 99882 -287408 -222346 -317856 55244 184557 -259024 -72918 -101 -186725 245050
7615 33183 -79766 -233395 265468 -42823 36354 -55961 49046 -51954 128284 -173994 -37455
7603 -273018 -10496 -141565 -39809 24243 -281386 -13863 47166 49271 156180 -190666 966
7591 -196325 -267208 -79135 -33416 -18925 -210675 -77250 -337965 -624989 -295672 -63413 64243
7579 2764 -35554 -39792 -508 -265310 -170129 -36061 -286363 117822 5506 99853 99301 -263946
7566 -45796 -139330 182594 -133562 38418 -68487 -43669 28837 -166657 -215421 -320226 -210328
7555 -210328 38291 -180981 -96084 197587 267965 200827 38444 154592 95210 -75913 -308310
7544 -308310 -100025 -291936 49658 -127424 212943 -159342 -163219 -137951 416530 12551 16753
7533 16753 8072 21843 -26395 233152 48672 -12003 136714 -54229 -232192 -25883 -240722
7522 -240722 -377457 171222 -183171 -10927 84177 -34753 -154207 -1734 42432 64032 38688
7511 38688 159007 118245 -189123 158513 -40816 -288877 -89674 449841 90068 -54077 211737
7499 99390 -121072 47997 -138962 -100420 -86715 -35581 -63966 22158 -170419 -223937 154429
7487 -408931 -88329 -17946 83023 256116 -40357 12258 -239542 -125595 -223405 -55484 -365820
7476 -365820 -4445 -464732 -312644 -7466 -115388 44319 19086 240503 -5411 214862 -110127
7464 -228867 -73461 105911 58216 8973 -62599 196452 -200521 -32734 -195117 82537 30473
7452 -71218 -314449 169754 18703 42083 -107589 -171160 -57283 -255717 210901 16397 -12516
7440 217722 186116 135503 179021 -106757 -80063 -173914 86934 -39050 95566 -10485 -187320
7429 -187320 143135 335045 -207809 368863 -39864 -71254 -71738 -189791 131760 344783 -30509
7417 -64436 271513 91583 137578 -103974 -64560 139304 127684 74196 -101015 -311494 329474
7405 20140 -162322 -29428 81937 9333 218872 -65082 -6418 -167065 18122 132753 -68900
7393 -14735 -44405 254475 178180 -287323 296569 -233534 -45087 -281948 218566 -126782
7382 -104956 -123690 36654 -191983 80520 -117386 -72661 6565 54045 -80301 -164923 -219140
7371 -219140 -26432 -279217 197769 -144974 157340 -55746 64085 75185 -18115 79750 118416
7360 118416 153472 186353 -259338 -141759 268780 -54829 -134876 -160377 60668 -203531 -270347
7349 -270347 287075 226420 -60001 70884 81347 -201904 -285898 -23037 -213247 -13214 -213904
7338 -213904 -9658 -12016 -164621 -116281 -320671 -159674 -139223 -60289 227025 1272 60627
7327 60627 -157495 -170356 101556 -157611 97584 16939 -45838 -234200 -31911 71174 215486
7316 215486 74320 -110477 -61430 130896 110628 -345730 21293 234187 -106015 55181 -55320
7304 62426 -122478 -52184 -89382 270873 -167104 63234 -165607 -49728 -251017 -175225 -250000
7293 -250000 146185 -15611 -277195 139033 -312346 -173814 -94760 21918 -1131 -9790 67351
7281 -176147 -78586 -232572 180108 111398 -13861 -150766 -85524 67626 230016 -112534 -134345
7270 -134345 102935 -1445 -84824 52286 -24919 -408513 -349916 -146370 155394 183757 139989
7259 139989 -267688 162678 -152423 -44118 226079 -216738 8585 -356176 -222552 -22488
7248 -185703 77390 245150 143323 195827 47449 13486 -134436 108248 -279369 -313615 121768
7236 -297877 43038 -369367 -370563 -95306 -27825 -181228 -18679 9239 250044 -214885 11858
7224 136352 303133 -237138 -75062 113763 -453407 152873 317301 -372432 237548 74801
7213 -304986 41487 -1146 -209457 181812 134139 -132336 -363 -183294 339364 -23142 136998
7201 215054 -11897 140882 -178444 152024 -25878 -154624 -254666 -173599 10663 -83859 -31585
7189 5426 140276 180534 -65176 266095 333790 19130 -84063 -14065 -26255 48265 -97227 212730
7176 -493981 -43213 204697 9878 -121997 -147594 4219 -149478 104866 -185364 305746 -332279
7164 -222783 -128482 -202807 -179517 33555 -123088 5058 40206 -20532 149911 154738 -99682 35916
7151 -14028 -26219 21525 37182 -95652 142225 178455 -182029 248876 -210113 38396 241452
7140 241452 -175 -150928 55641 43401 129629 -113967 -28082 -209096 -457678 -9360 -164167
7129 -164167 -179034 -177470 -80028 -24855 161983 -106927 117307 9770 -302178 -152235 27720
7117 35332 -98791 -125003 161153 107658 161568 -22625 -121345 -222280 -93939 156957 -407143
7105 -294739 -188765 -256863 -104557 -45911 -350140 50069 113966 58398 14131 -2259 -298530
7094 -298530 -55222 98609 -7427 51053 -229231 -8148 -341985 43774 21034 267495 -170963
7082 97085 -172066 204862 13840 115555 192660 -129568 175492 -153788 -292427 65241
7071 1859 -117108 354567 236287 53857 -161007 -386625 -2740 237417 45474 4022 -47387
7059 -56942 -75217 -53088 -4710 -144827 -1150 221988 165883 -76493 17047 25788 -129698 -187926
7047 -187926 -32049 65246 220728 -235681 -170380 -122993 27161 47318 -40366 31466 -300349
7035 -124171 271231 31284 102008 -222121 108625 -195367 -22064 -31537 183955 -197913 359701
7023 -218325 263709 -118710 97185 -53205 -201436 3229 -281336 -61850 -256473 -43707 41368
7011 166496 302626 -359717 -87390 213805 -289644 77635 250430 -206771 -37163 -62865
7001 -62865 451651 21234 -241371 108073 -102246 -27140 84127 40242 -120338 -161942 -206510
6990 -206510 -32268 451891 103385 83462 44599 -115034 171409 -76654 -121133 123652 -241003
6978 258855 35388 42117 315769 79588 233521 171429 -56673 154872 178123 137862 96224
6967 96224 -31543 -42260 17136 -262869 -90802 286199 -369022 12290 -244125 -110915 -225621
6956 -225621 147417 24761 81894 -178030 -91753 53064 -4776 -391308 92463 113386 151253
6945 151253 -94379 -150802 187786 -18046 -139963 -215134 -35268 95508 -290333 80217 -224167
6933 174622 220172 19908 -221893 -253938 -156981 136192 311769 18559 -97512 -37121 8980
6921 124556 145778 -12157 272708 -101590 149206 200570 -52458 8553 -56394 -113371 -50998
6909 50911 -83936 39601 -51590 380893 -98192 29079 -263222 -195236 74158 -330941 126293
6897 38029 -130199 -127586 -189653 44619 21441 -91963 -219141 -149921 241548 -177710 -34883
6885 220500 -65237 32829 250320 63068 -74321 57229 -75933 -40524 -127940 130114 54793
6873 -51614 148310 -31517 -51601 -117941 -84891 -55947 -313659 393327 -72084 126797 -15921
6861 -271622 64155 -63819 -289632 -92776 -31532 29361 -85518 -231186 -6395 -120816 45013
6849 -147622 -118308 -70718 -117066 -227049 233559 96630 181972 22171 -243133 -126964 -111779
6838 -111779 -447803 -62430 53530 -260266 201702 -162583 -182513 191484 -309397 242513
6827 228434 -138002 -21346 73780 -23687 -131835 125422 117182 124659 36886 -170055 342728
6815 131027 107512 -100929 63702 -13933 -199717 33063 -42958 13148 -174214 152180 6775
6803 298467 2792 -145071 135492 136280 152971 -288224 -41779 26714 7774 100119 -41680 -245167
6791 -245167 -201237 -82264 -97200 84322 -156199 75203 -20951 -161323 248963 -370516 417544
6779 -222969 24288 -51331 -24891 144316 252167 122326 158794 33446 -34195 -212865 146413
6767 116528 12844 103524 -30994 -102330 112017 126980 -139119 188565 235973 279311 180069
6756 180069 118219 70910 -254359 111012 -382855 19575 160026 41786 -456630 260501
6745 242968 265820 -129532 -150663 -278096 173567 8777 151150 -96360 -188724 -261115 -187853
6734 -187853 -71788 -122053 100347 -77923 -181243 -205755 154805 -128955 9218 160579 54312
6722 -122447 -240401 -53644 -115040 -255284 33274 149232 -24420 -54552 -129643 -300249 -626277
6711 -626277 68733 -109732 -221712 5879 56259 335383 -87040 28916 276508 -199382 -96409
6699 123585 102968 -23852 -153476 -139786 -109121 128537 171366 106986 -229868 21389 -206946
6687 237961 -91016 208330 -185563 186409 -142841 -149828 -408798 -11409 -200918 29405 -228132
6675 95977 -149021 -88879 190430 -365570 -86799 -239922 -21772 143897 191993 74999 -50350
6663 -20503 -18527 53713 -71424 -133341 -63625 207219 339960 20350 225192 -161955 -33786
6651 -166553 324695 25602 4851 283216 -268475 57387 -105504 -203127 -22271 -154185 59257
6639 -33664 -25519 83466 -272297 111866 -238090 237782 -6439 -128092 81499 246687 -113372
6627 5472 -235760 20086 302118 362468 78906 -16547 -229686 207312 14252 -22254 27512
6615 -65153 139942 -14078 -7598 122468 -177066 -257223 -109573 -65514 53516 76838 146733
6604 146733 -59675 -251122 -179417 -165318 -107828 81303 75524 -82271 18828 69189 -28475 73559
6591 24393 -69273 -98875 90293 -191278 -48722 -236676 145582 69944 381671 -322082 -207620
6580 -207620 282904 -332685 23225 -68242 135900 71167 -70250 -11235 -172815 -2750 53948
6568 -426488 -113410 -86995 -62062 -27343 43591 -6649 128479 491458 -250987 170526 -150377
6556 69030 61655 -86203 -37162 -292469 -111506 -180636 -215939 -37281 -444507 -18572 -1327 -55842
6544 -55842 -216007 68720 -130453 -233322 -130041 52777 41077 15492 254019 -59984 103501
6532 -139472 132942 231552 258713 -89013 -312377 -45583 -35176 -138528 -216453 234641 -229564
6520 221526 226792 119769 33961 25923 -76061 196527 -159544 341742 77986 -218389 27752
6508 147529 -93156 93900 -186310 -346369 -117931 -82325 -48108 -138048 -230460 94003 -176754
6496 -150829 -30161 186915 32606 -165319 -208275 23996 -301622 114628 58742 85412 104430
6485 104430 112114 -5403 -171281 -207094 -223526 -50943 228454 147744 326022 -33070 -223633
6474 -223633 30895 -54804 -130246 -249886 -102177 -84283 -147949 -91668 -171275 -167014 -29808
6462 -95685 -102039 -91918 -145663 190050 79964 -25826 -6054 178827 26331 -82562 13338 100722
6450 100722 52900 57572 -244317 -1253 130004 357727 134414 104697 112231 193781 -49688
6438 -234290 207945 288839 -33059 -41106 -184195 341758 150985 -212927 95285 72031 -85625
6426 -3816 34697 -11565 -303338 -125602 246131 908 -131166 -143096 -42224 -218698 51899
6414 129038 -94918 -420632 -34752 -202816 -112372 -24109 -81785 27302 -117777 230421 48742
6402 -72463 -227266 -189029 -151161 103028 -288950 76183 -276233 -7742 -157677 -28156 172824
6390 -122010 -54130 -93635 -46046 219824 17433 11090 -128160 -60063 20300 193405 -57406
6378 76400 -171282 217804 120370 -156361 212659 -9767 137853 157588 -361330 120978 310730
6367 310730 -211314 122599 -528423 -197302 -39304 146371 -391960 190688 37600 -20001
6356 -48089 -5686 -109744 22628 195426 -164327 286649 -323 221400 -116104 -400750 106388
6344 -25530 -18549 63214 10867 54852 -286679 -193467 97270 -31386 -88834 -24181 62612 247455
6332 247455 -280665 -108971 125880 335462 -50301 181256 -338330 -29371 146431 -2928
6321 -100916 29314 -80235 104188 160883 6403 -274368 -57289 -131442 -190465 -33698 125888
6309 117303 -33756 -53147 -159692 -51743 -232988 -132859 277655 170518 2612 67850 -5591
6297 228637 291195 -214070 -46512 -66247 134228 -21247 -86155 8422 50342 98351 -365371
6285 -126212 230887 -197753 -105064 -10137 42806 33077 159196 -284868 161292 143941 377772
6274 377772 54032 -41875 -122321 -297584 -12968 61431 -122950 54896 -222265 97373 21497
6262 -69596 -158530 -112110 46384 -97484 -234929 223057 -279097 -12953 -265657 270942 26951
6250 135945 246993 216160 -325386 31635 -247519 471148 80773 230159 -177229 203520
6239 136085 -172467 17379 -214209 -10279 179118 -146399 -69911 -137674 -177489 100332 -87683
6227 -250359 -252665 -201179 -126918 184390 316883 344155 158650 -197871 158184 -391412 -101360
6215 -107767 -153125 61636 30007 63153 273515 -49591 285941 -19892 130052 -250600 225737
6203 -310585 -10718 -100936 -45342 -105614 265906 6121 45754 -343368 -176250 -45748 147654
6191 -26568 64366 92493 -53591 -166930 -19203 -125371 -179251 94451 -87422 29976 -110543
6179 -271016 112091 94663 -29000 89612 89212 26905 -120404 192800 -522253 80966 -143611
6167 -28972 374844 368248 173032 -28704 -49160 -253067 -54739 -62852 -164672 -248621 103791
6155 -117712 215072 331188 -97308 -13680 -142909 -36732 -224402 89096 77794 -254285 371712
6143 267943 -108256 252574 -147552 194264 53013 -269986 -188630 -166980 -240567 -13824 30652
6131 176012 -69746 -192174 31285 -139432 -140508 -19225 23546 -160216 35335 -90217 -34920
6119 -69113 -250107 -61705 156319 -216557 -261305 114984 153985 45361 -49811 298208 1420
6107 9295 -38553 179206 25082 346862 90310 14184 -218218 -200299 -7452 83255 133818 58082
6094 -117321 -239066 135050 -405124 32594 -190201 -93084 493577 72085 39088 56434 62625
6083 62625 79272 -132641 -65155 38766 262376 -119350 -161034 -93620 80306 -188207 -57982
6071 -39541 -122058 130401 -64121 -138193 369762 152286 177486 231544 -266407 121246 91394
6060 91394 227276 -70754 80851 289317 -76183 -83256 28583 48685 195819 -137818 -91486
6049 -91486 39192 286394 98687 -339577 -136336 15874 137017 16640 -479228 -82275 117666
6037 -153675 -325029 21768 43379 -67303 23737 19015 34719 -30482 75209 -16473 -98532 146040
6024 90022 -8036 -70475 145623 -92371 184609 -48709 156549 -144824 348572 -117696 50137
6012 66188 -262509 205893 114565 249827 -151540 -440794 -51651 360120 38402 203851
6002 203851 -53875 116156 -79961 66849 -218199 11481 395076 -637147 -75357 283008 -131275
5990 1220 -219060 -65181 -418853 -273209 60664 96349 48066 89179 235914 36785 -159825
5978 -113104 -178794 -251205 -28153 20839 -66716 -31599 -32695 -154298 151852 72079 44225
5967 44225 96395 -1059 -212341 -122948 151561 -118233 -73191 192992 -229346 416972 -97595
5955 -199798 148244 -146598 -180702 89793 -400503 -156949 160587 -357339 126336 -212999
5944 -90739 -136596 2024 -238817 -137558 85775 97701 -324306 2312 -213199 34768 239316
5933 239316 -170989 101129 -18655 242435 -56581 -148376 25278 -36520 -196960 -69216 -148727
5922 -148727 -193973 312026 31442 76870 43016 497526 -34327 -28816 -166912 40760 -2029
5910 -361546 172189 -263094 -43585 105235 20627 60570 116144 30980 -116604 443058 49696
5898 420778 73437 -75245 -124098 216242 -133564 39677 -162278 124398 340253 13476 72992
5887 72992 324310 -97841 57420 -22391 22275 24786 166394 -106742 137200 35217 -98930
5875 -18971 52739 -27009 111910 -109428 36598 120224 -101931 95379 -21561 8791 -45227
5863 -84298 4099 -139254 142528 144348 -35756 82770 -223948 78932 -34119 -203637 -143096
5852 -143096 51078 110962 -93936 -12484 -124790 -14773 -156996 3919 -6349 -114361 -28312
5840 117552 69283 -201095 -87534 137205 -33674 32662 -111339 -43252 221006 122943 35829
5828 -212803 -34229 220733 -178415 -274903 -286486 287882 42718 -92110 63012 -223119 11890
5816 306290 49895 132175 -208901 92269 40215 48385 17341 -7684 -192100 -195128 329319 156072
5803 -8217 -54763 -147605 34763 -56714 218329 30344 -3542 201675 -201984 12832 380777
5792 380777 43994 -228042 16938 -79414 61673 171479 83044 -164198 73368 66037 151462
5781 151462 67886 47297 -302459 104536 241571 -18228 -13361 44455 -112128 137132 240009
5770 240009 44754 241028 -69222 96035 -16164 236876 130728 65325 143285 -39794 199707
5758 79327 -192017 -128348 12852 66153 -320779 -70220 -156319 118456 -97411 -11591 80924
5746 -30002 161580 -16008 15728 -426796 -100522 254038 -24013 164902 40168 9599 53887
5735 53887 -129636 -165545 -144647 -95760 35596 -323389 23417 157686 -103829 -32659 94567
5723 82821 308808 8839 25946 48542 -15069 29580 170918 -75150 381977 55523 39157
5712 39157 -235383 153029 250391 -5809 24357 -44272 -242758 -58423 -25175 -144738 -150532
5701 -150532 -159751 5377 -94490 -22786 -1091 -31912 -17354 -32830 275930 24617 -60623 2384
5688 -128719 -51326 85851 4509 222370 -210867 -34110 -374644 69755 81604 -55418 -167086
5677 -167086 -176952 118833 -25368 76016 237244 -116699 165373 125486 -113282 188101 -82075
5665 -6661 46773 100956 407834 22375 -52064 -213605 106728 -222430 58979 100912 -44095
5653 196510 -101791 78387 94838 84045 -184125 114604 -55266 36953 -33902 -49325 -144474
5642 -144474 -10146 18312 132869 206299 -21481 -20552 -74591 201030 41008 17362 80989 -125191
5629 -267449 28484 -327603 17441 83803 -100537 -88462 239903 -71452 -307165 -246396 145425
5617 -481197 -106919 -393101 -175156 -67534 93657 32643 45846 -351225 80588 43543 198348
5606 198348 301659 151089 -135947 345646 145738 248061 -153756 203624 -70330 94983
5595 115732 110167 -135121 29671 18422 240149 64838 -20261 136045 19169 -289870 9464
5583 25487 -144608 -120977 60079 91225 -574913 113166 48586 -71465 4940 -26016 18975
5571 -104096 -37519 206104 60754 259865 -151036 -406853 234012 81656 143012 -308230
5560 -230402 -14234 -43196 -214955 134848 -198736 -262959 -118788 -177554 65624 48489 135583
5549 135583 -7487 -74381 -219746 -254526 -113871 184187 144041 -97063 -59326 -297971 -351901
5538 -351901 -102398 -170331 -267017 45655 -36215 -81111 -282917 -371113 225783 75566 -312921
5526 90012 -323634 309986 -124464 -90841 813 39057 -230589 -296570 42325 36096 225259
5515 225259 -350279 -146238 -92286 -40499 165521 -10830 45252 248198 125747 -38514 -73701
5504 -73701 -499066 128355 -174443 -108952 145520 210675 66053 128431 119350 355234 -8868
5492 -53999 87047 99487 324 -150615 -3886 55711 26166 -182298 69099 251630 -285673 -141269
5479 -89555 218066 272586 -182889 169861 -333595 -274662 -165990 -192717 107118 -22694 35633
5467 -60273 -110001 -40828 44093 -503978 -131145 -1619 73900 -9301 -40192 63016 39684 -222805
5454 34061 245481 170889 -88288 27392 106824 6839 42692 34282 -187677 39916 -62701 27476
5441 -132445 -32168 49594 27925 -11592 216908 142833 -102308 -342974 -35083 -21824 -291500
5430 -291500 45838 128343 263920 -85896 152424 -150140 2798 -5472 64004 -1915 -108243
5419 -108243 97759 -261572 -70561 -53016 -30488 -223038 -8498 248115 -113151 229138 107878
5407 -77613 272668 103255 -46892 314250 -191807 24986 -124476 -127531 186685 -99538 71729
5395 -162160 -195225 -144929 -23741 94000 235155 127832 -27466 -244745 268898 76914 85973
5384 85973 -19879 230930 204785 193318 64329 -83567 -145868 -135977 -69589 24382 309772 -121348
5371 -335742 110369 50655 -211307 -34645 16014 -99839 -35477 -106593 194832 101147 255460
5360 255460 -26560 -71653 -209969 -84099 -21981 283917 -169068 242399 -162257 244575
5349 46864 15726 -77790 -256912 -76159 107678 -49379 -267265 -139243 -117991 -63339 202096
5337 222303 191161 6286 -38703 260701 221666 -21517 68332 -53634 -189121 183652 -296528
5325 240065 -220594 43176 13753 251992 38028 -30517 150044 38152 -123120 25103 119120
5314 119120 -264861 -522008 -75319 -160722 237644 133357 -113067 -78426 -216527 -238173
5304 -238173 -390231 -169214 -347844 -34051 326615 -109647 -19328 -39319 -176830 -127290
5294 -127290 -52955 -105717 197641 -91867 -147383 220383 -245098 -226700 188562 72694 -19050
5282 -37094 122047 135646 162871 -348726 52582 -104679 124387 -151825 12005 -73188 192767
5270 -9833 -39207 61244 -69634 108536 -149263 -59087 -189540 -255468 -20781 -267552 -64256
5258 -100288 111019 -39585 -153610 -56969 -196886 -79643 -116348 133436 140472 -295548 -68460
5246 -249223 96102 293410 130405 -102681 217064 -119190 85974 102532 183297 248706 153646
5235 153646 404974 -248415 -87366 -314469 110510 68420 105390 198795 -41970 -175082 -56112
5223 99195 257206 369620 -124174 498486 -228942 218143 -9015 -99109 258177 -155164
5212 -14141 256271 -57425 120450 278415 -215795 34551 -56152 -182217 -151641 -100237 79865
5200 -303654 62744 42849 24966 -82387 -26932 13943 110776 -266422 41772 5037 -230293
5188 -72651 -94376 -56790 -342748 286249 136551 -190502 173863 -40847 -55009 32174 -40997
5176 178229 34602 -86340 94734 10308 -24433 -387797 -42909 -204052 -46535 128202 427889
5165 427889 -53055 -113057 -34263 -215414 -32936 -69744 -47111 87744 179813 -188960 17351
5153 80462 -31127 -3886 361855 -8489 -66705 -81514 -60280 -168748 64781 -13060 135457 81910
5141 81910 46608 -29756 117226 -115849 -124573 80475 -108452 -406862 7631 46902 24148
5130 24148 -59755 8339 165776 -238979 243960 185571 -237455 -176723 -42807 -20386 -273959
5119 -273959 -565941 -165297 213177 203473 23840 -80924 12030 150375 23907 -43550 19404
5107 -56744 -105439 -38664 -476047 110599 164824 -47042 5134 110740 -232705 248184 -167881
5095 -36518 212503 -14143 25948 33591 -297768 -26869 66546 270280 -315760 -302877 -46038
5083 -123137 246815 119119 153019 -112980 91027 -113020 -17814 -54181 261184 79276 -16064
5071 -61218 -37064 166863 214227 -87631 -162317 -100713 14736 -13743 -85756 -65291 -172475
5060 -172475 -41431 338229 -136887 419863 -1810 197994 -61697 290296 130773 119967 -203954
5048 -57958 6602 -227563 123373 205465 -45095 -57899 -88723 212192 -181834 259845 162860
5037 162860 106285 190207 -113318 -21062 110117 -166528 -97477 117566 -9614 87401 -155480
5025 -71604 101423 -212185 -120345 -139917 181203 -184374 -278792 105676 119709 8963 -114521
5013 -45192 -303717 -233403 -335352 147787 -83485 -273355 173623 -12746 102049 -123011
5002 -57666 163550 -161037 38989 -114564 40658 252291 59481 253617 -53962 4580 -101187
4990 93470 -3111 -2386 -113653 158991 87687 -216391 -45352 -93122 117988 -64577 -41848 -167366
4978 -167366 98890 41513 284259 -83011 123310 -44427 8839 123552 -139544 65984 -115573
4966 212365 -78061 59504 -199715 -162081 -31963 98419 -1432 -242484 -19525 25850 114321
4955 114321 166799 -129341 130158 65738 47764 101085 -84867 -236452 3357 39500 -159560
4943 -80695 33765 13182 -135382 98429 -19003 275502 66569 134908 193631 -179397 -7170
4931 6417 -15146 167869 249887 28736 259923 202449 -168155 -105790 155610 211322 -192013
4919 -182509 -104689 -28995 -109001 -146872 25512 149020 -130519 -366086 -277409 437212 181800
4907 -237592 -87947 -96584 -30190 93458 -105932 -180712 37722 -84108 32139 -194287 -64679
4895 27246 -206842 -70407 159219 258614 -18356 -30380 -273743 -48203 -243273 100800 160775
4884 160775 -139732 -185902 122084 127528 2165 331391 32100 -142014 -94074 298926 32611
4872 179571 -78131 186518 -62543 64438 -60299 -305826 87507 14111 40275 -200066 -65103
4860 313611 -24272 335467 32340 16200 221854 92430 212806 180591 84734 16776 -491039
4848 -99660 335102 -304000 40677 115530 62262 -207443 134185 128026 265493 -58903 -9717
4836 210011 -53415 123691 175497 34450 42131 -199948 105249 57226 -266855 56968 184371
4825 184371 -82571 33220 205047 427786 62626 114152 79165 157131 168793 15999 -257625
4813 -92574 -161701 -34305 -136836 -126935 191204 142730 191240 38830 40424 44964 141481 13583
4800 352698 -22725 -434079 24176 169373 18207 -215629 189107 283677 73447 -231491 60584
4788 -117452 -113015 -31461 -73363 56298 -57995 -90369 79649 98640 34697 -83997 295199 111584
4775 121223 97112 -68529 -156263 -81312 215758 98711 -210387 76962 -322146 -202804 -145207
4764 -145207 -238132 94063 -77172 -228939 -72223 151243 91794 -13439 81258 -10186 124222
4752 73709 72946 94390 -174983 164723 430457 -207359 341390 -160173 -341698 27523 -16033
4740 173141 126985 69104 124730 -33199 -88407 234121 102174 -133876 -121080 -194062 97142
4728 -108189 -229365 -179396 -38850 -25820 71672 107160 16952 237843 -239462 -59738 43011
4716 129212 -241704 -98749 -228763 95982 229977 136782 364069 -213905 -148717 -151205 -187108
4705 -187108 122277 -221838 266264 -235311 -179869 -278999 -35039 -16145 -89934 -55098 243457
4693 476 374251 111876 232458 69011 -20967 167909 -171339 23629 -98093 370082 50316
4681 114787 -147751 -298334 253564 -230616 174170 147376 30630 -78795 152023 -222722
4670 167663 -44796 236927 156636 83292 -311571 -143012 142198 170989 66517 -135158 -292656
4659 -292656 183621 213952 253305 100240 24108 -85229 -201766 174663 -177594 115077
4648 -121245 -101641 -181140 -84483 -2454 185010 224233 -61058 93166 -69437 193513 158381
4637 158381 -198023 -54514 -129585 -103197 -272481 -63009 78133 -79927 -73432 -52220 -60691 57602
4624 -76792 -61792 -435609 -42283 121419 82448 60653 189874 336731 147553 59497 -234510
4612 53536 167573 111596 -101251 -74603 -17292 -26725 131414 282484 6609 32837 53860
4601 53860 399679 -112494 42021 -78160 -46286 91854 20007 105606 210333 20876 18570
4590 18570 85663 243998 119848 25227 300221 -473306 155072 110033 -259164 -77608 -51358
4579 -51358 -223121 -228044 15969 141697 -65277 -340386 107478 20269 -318506 -226737 -24888
4567 19472 -192438 175524 -19340 -208751 -215246 4478 -40025 306284 16481 -234321 -83736
4555 -165249 174958 -39020 -290750 -55044 -28937 -84556 -114017 -38031 -98882 156737 -173582
4543 -87533 259039 -53680 -160680 88646 -304064 86372 151722 212248 173443 -60643 124642
4531 -168473 -32540 -102491 -25483 57212 125297 44847 -70168 -255257 -76392 71301 37114
4520 37114 -280343 -230836 229948 -155639 -697 396396 -299509 -168503 -132529 63556 159596
4509 159596 -119071 186318 131301 93645 126214 83290 -33508 -63870 75633 -164679 147487
4497 22318 -206191 13709 -131692 67137 -26873 262203 -71110 -80219 -241926 102179 183568
$$ [...]
##END NTUPLES=NMR SPECTRUM
##END=
