##TITLE=AC1556_ROEFFECT0016_8268968_BvRczWPmyT
##JCAMPDX= 6.0         $$ Bruker NMR JCAMP-DX V2.0
##DATA TYPE= NMR SPECTRUM
##DATA CLASS= NTUPLES
##ORIGIN= BRUKER
##OWNER= Administrator
$$ 1.72 TOPSPIN		Version 2.1
$$ 2013-10-12 21:34:47.468 -0700  Administrator@X
$$ Compression mode = diff/dup
##.OBSERVE FREQUENCY= 400.02188249412
##.OBSERVE NUCLEUS= ^1H
##.ACQUISITION MODE= SIMULTANEOUS (DQD)
##.ACQUISITION SCHEME= undefined
##.AVERAGES= 64
##.DIGITISER RES= 22
##SPECTROMETER/DATA SYSTEM= spect
##.PULSE SEQUENCE= noesygpps1d.comp
##.SOLVENT NAME= COFFEE_meoh
##.SHIFT REFERENCE= INTERNAL, COFFEE_meoh, 1, 14.96061
##AUDIT TRAIL= $$ (NUMBER, WHEN, WHO, WHERE, PROCESS, VERSION, WHAT)
$$ ##TITLE= Audit trail, TOPSPIN		Version 2.1
$$ ##JCAMPDX= 5.01
$$ ##ORIGIN= Bruker BioSpin GmbH
$$ ##OWNER= Administrator
$$ $$ E:\/data/COFFEE/nmr/AC1556_ROEFFECT0016_8268968_BvRczWPmyT/12/pdata/1/auditp.txt
$$ ##AUDIT TRAIL=  $$ (NUMBER, WHEN, WHO, WHERE, PROCESS, VERSION, WHAT)
(   1,<2013-10-12 21:34:42.484 -0700>,<Administrator>,<X>,<go>,<TOPSPIN 2.1>,
      <created by zg
	started at 2013-10-12 21:23:12.184 -0700,
	POWCHK enabled, PULCHK disabled,
       configuration hash MD5:
       C8 4E 4E 5D D3 5C D8 9E 9F 52 82 E0 59 8A DE 15
       data hash MD5: 64K
       09 57 1C C4 A4 2B C8 EC AE 28 D2 31 80 F3 6A CA>)
(   2,<2013-10-12 21:34:45.452 -0700>,<Administrator>,<X>,<proc1d>,<TOPSPIN 2.1>,
      <Start of raw data processing
       efp LB = 0.3 FT_mod = 6 PKNL = 1 PHC0 = 0 PHC1 = 0 SI = 128K 
       data hash MD5: 128K
       C4 6A 03 77 7E 84 AF 46 8B C6 97 0A E6 32 E3 B9>)
(   3,<2013-10-12 21:34:46.405 -0700>,<Administrator>,<X>,<proc1d>,<TOPSPIN 2.1>,
      <pk PHC0 = -80.67261 PHC1 = 0 
       data hash MD5: 128K
       E4 EC C9 61 ED 00 08 EA 3C 8A F5 24 ED 36 28 1F>)
(   4,<2013-10-12 21:34:46.796 -0700>,<Administrator>,<X>,<proc1d>,<TOPSPIN 2.1>,
      <abs ABSG = 1 
       data hash MD5: 128K
       34 16 EF 43 AD 7B 93 08 D3 0F 24 28 78 0C 2F FB>)
(   5,<2013-10-12 21:34:46.937 -0700>,<Administrator>,<X>,<proc1d>,<TOPSPIN 2.1>,
      <abs ABSG = 2 
       data hash MD5: 128K
       90 1E 8E FF FE 56 33 48 E9 2B 56 14 CF 45 25 4B>)
(   6,<2013-10-12 21:34:47.030 -0700>,<Administrator>,<X>,<proc1d>,<TOPSPIN 2.1>,
      <abs ABSG = 3 
       data hash MD5: 128K
       8F 0B 4B 28 5B 24 50 83 4D 38 16 51 F4 09 48 A3>)
(   7,<2013-10-12 21:34:47.124 -0700>,<Administrator>,<X>,<proc1d>,<TOPSPIN 2.1>,
      <abs ABSG = 4 
       data hash MD5: 128K
       96 C8 DD 9F E3 FD EC 7D C5 AB A5 0A 6D 2F DC 83>)
(   8,<2013-10-12 21:34:47.312 -0700>,<Administrator>,<X>,<proc1d>,<TOPSPIN 2.1>,
      <abs ABSG = 5 
       data hash MD5: 128K
       38 F3 F6 7C 71 5A 60 80 E2 58 26 B3 2F 60 19 EE>)
$$ ##END=
$$ 
$$ $$ hash MD5
$$ $$ B9 5F 44 2D B9 5C 4F DB 14 DD 25 62 49 0C 63 9E
##$RELAX= 
##$RELAX= 
##$RELAX= 
##$RELAX= 
##$RELAX= 
##$RELAX= 
##$RELAX= 
##$RELAX= 
$$ Bruker specific parameters
$$ --------------------------
##$DU= <E:\>
##$EXPNO= 12
$$ [...]
##$TP07= 0
##$TPNAME0= <>
##$TPNAME1= <>
##$TPNAME2= <>
##$TPNAME3= <>
##$TPNAME4= <>
##$TPNAME5= <>
##$TPNAME6= <>
##$TPNAME7= <>
##$TPOAL= (0..7)
0.5 0.5 0.5 0.5 0.5 0.5 0.5 0.5
##$TPOFFS= (0..7)
0 0 0 0 0 0 0 0
##$TUNHIN= 0
##$TUNHOUT= 0
##$TUNXOUT= 0
##$USERA1= <user>
##$USERA2= <user>
##$USERA3= <user>
##$USERA4= <user>
##$USERA5= <user>
##$V9= 5
##$VALIST= <valist>
##$VCLIST= <CCCCCCCCCCCCCCC>
##$VD= 0
##$VDLIST= <DDDDDDDDDDDDDDD>
##$VPLIST= <PPPPPPPPPPPPPPP>
##$VTLIST= <TTTTTTTTTTTTTTT>
##$WBST= 1024
##$WBSW= 4
##$XGAIN= (0..3)
0 0 0 0
##$XL= 0
##$YL= 0
##$YMAX_a= 6101891
##$YMIN_a= -12709292
##$ZGOPTNS= <>
##$ZL1= 120
##$ZL2= 120
##$ZL3= 120
##$ZL4= 120
##$ABSF1= 14.96061
##$ABSF2= -5.597571
##$ABSG= 5
##$ABSL= 3
##$ALPHA= 0
##$AQORDER= 0
##$ASSFAC= 0
##$ASSFACI= 0
##$ASSFACX= 0
##$ASSWID= 0
##$AUNMP= <proc_prof1d_extract.lims>
##$AXLEFT= 0
##$AXNAME= <>
##$AXNUC= <1H>
##$AXRIGHT= 0
##$AXTYPE= 0
##$AXUNIT= <>
##$AZFE= 0.1
##$AZFW= 0.1
##$BCFW= 0
##$BC_mod= 0
##$BYTORDP= 0
##$COROFFS= 0
##$CY= 15
##$DATMOD= 1
##$DC= 0
##$DFILT= <>
##$DTYPP= 0
##$F1P= 0
##$F2P= 0
##$FCOR= 0.5
##$FTSIZE= 131072
##$FT_mod= 6
##$GAMMA= 0
##$GB= 0
##$INTBC= 1
##$INTSCL= 1
##$ISEN= 128
##$LB= 0.3
##$LEV0= 0
##$LPBIN= 0
##$MAXI= 10000
##$MC2= 0
##$MEAN= 0
##$ME_mod= 0
##$MI= 0
##$NCOEF= 0
##$NC_proc= -2
##$NLEV= 6
##$NOISF1= 0
##$NOISF2= 0
##$NSP= 0
##$NTH_PI= 0
##$NZP= 0
##$OFFSET= 14.96061
##$PC= 1
##$PHC0= -80.67261
##$PHC1= 0
##$PH_mod= 1
##$PKNL= yes
##$PPARMOD= 0
##$PPDIAG= 0
##$PPIPTYP= 0
##$PPMPNUM= 2147483647
##$PPRESOL= 1
##$PSCAL= 4
##$PSIGN= 0
##$PYNMP= <proc.py>
##$REVERSE= no
##$SF= 400.020009793588
##$SI= 131072
##$SIGF1= 0
##$SIGF2= 0
##$SINO= 400
##$SIOLD= 131072
##$SPECTYP= <>
##$SREGLST= <1H.CDCl3>
##$SSB= 0
##$STSI= 131072
##$STSR= 0
##$SW_p= 8223.68421052631
##$SYMM= 0
##$S_DEV= 0
##$TDeff= 65536
##$TDoff= 0
##$TI= <>
##$TILT= no
##$TM1= 0
##$TM2= 0
##$TOPLEV= 0
##$USERP1= <user>
##$USERP2= <user>
##$USERP3= <user>
##$USERP4= <user>
##$USERP5= <user>
##$WDW= 1
##$XDIM= 131072
##$YMAX_p= 375537393
##$YMIN_p= -11571
##$CURPLOT= <Network HP LaserJet P1505>
##$CURPRIN= <$Network HP LaserJet P1505>
##$DFORMAT= <normdp>
##$LAYOUT= <+/1D_H.xwp>
##$LFORMAT= <normlp>
##$PFORMAT= <normpl>
##$SURQMSG= 1
$$ End of Bruker specific parameters
$$ ---------------------------------
##NTUPLES= NMR SPECTRUM
##VAR_NAME=  FREQUENCY,     SPECTRUM/REAL,   SPECTRUM/IMAG
##SYMBOL=    X,             R,               I
##VAR_TYPE=  INDEPENDENT,   DEPENDENT,       DEPENDENT
##VAR_FORM=  AFFN,          ASDF,            ASDF
##VAR_DIM=   131072,        131072,          131072
##UNITS=     HZ,            ARBITRARY UNITS, ARBITRARY UNITS
##FACTOR=    0.0627417313425164, 1,          1
##FIRST=     8223.62146879497, -561,         -64118
##LAST=      0,             1725,            -64625
##MIN=       0,             -11571,          0
##MAX=       8223.62146879497, 375537393,    0
$$ Real data points
##PAGE= N=1
##DATA TABLE= (X++(R..R)), XYDATA
$$ [...]
63881F44904k128L48K528M080N686P777R871J1504J3110J5503J8781K2272K5342
$$ 644904 642776 643124 645652 649732 655418 663195 673066 684570 697680 713183 731964 754236 779578
63868G79578K7936L0369L2914L5562L8046M0021M1390M2393M3299M4006M4032
$$ 779578 807514 837883 870797 906359 944405 984426 1025816 1068209 1111508 1155514 1199546
63857A199546M2944M0750L7836L4574L1027K7015K2392J7261J1926O615J223m589
$$ 1199546 1242490 1283240 1321076 1355650 1386677 1413692 1436084 1453345 1465271 1471886 1473109 1468520
63845A468520j0784j6626k1261k4728k7930l1485l4973l7679l9592m1195m2610
$$ 1468520 1457736 1441110 1419849 1395121 1367191 1335706 1300733 1263054 1223462 1182267 1139657
63834A139657m3601m4230m4793m5129m4784m3856m3012m2437m1537l9863l7684
$$ 1139657 1096056 1051826 1007033 961904 917120 873264 830252 787815 746278 706415 668731
63823F68731l5326l2666k9662k6835k4639k2839k0991j9042j7153j5340j3715
$$ 668731 633405 600739 571077 544242 519603 496764 475773 456731 439578 424238 410523
63812D10523j2510j1514j0096q301p157p216p529o961n928n607n925n632m322
$$ 410523 398013 386499 376403 368102 360945 353729 346200 339239 333311 327704 321779 316147 311825
63799C11825l021k539k429k052j718k094l103m004m196l648k811k361k571k886
$$ 311825 308804 306265 303836 301784 300066 297972 294869 290865 286669 283021 280210 277849 275278 272392
63785B72392k546j702j243j487j778j648j539j872k165j758q78k61j29k00m22
$$ 272392 269846 268144 266901 265414 263636 261988 260449 258577 256412 254654 253776 253515 253386 253186 252764
63770B52764r50j598j964k062k202k300j930j093l63q1N3L41N34K57l16o12l88
$$ 252764 251814 250216 248252 246190 243988 241688 239758 238665 238302 238221 238274 238615 239149 239406 239090 238478 238090
63753B38090K5K11J10j05l37n97p88p18l24J76N38P32Q50Q45O57N15Q31J644K397
$$ 238090 238115 238326 238436 238331 237994 237397 236609 235891 235567 235743 236281 237013 237863 238708 239365 239880 240711 242355 244752
63734B44752K520K140J939K297K839K937K538K189K287K592K721K838L429M462
$$ 244752 247272 249412 251351 253648 256487 259424 261962 264151 266438 269030 271751 274589 278018 282480
63720B82480N254N365N121M963M725M054L204K706K432J661K11j173j785j782
$$ 282480 287734 293099 298220 303183 307908 311962 315166 317872 320304 321965 322176 321003 319218 317436
63706C17436j698j625j330r60j059j863k871l284k752j729j013r69j163q79J11
$$ 317436 315738 314113 312783 311823 310764 308901 306030 302746 299994 298265 297252 296283 295120 294241 294352
63691B94352J377K337K695K535K262K375K950L431L294K827K819L419L860L506
$$ 294352 295729 298066 300761 303296 305558 307933 310883 314314 317608 320435 323254 326673 330533 334039
63677C34039K638J912J482J064N94L10L68O93J162J707K219K521K387J670N70
$$ 334039 336677 338589 340071 341135 341729 342039 342407 343100 344262 345969 348188 350709 353096 354766 355336
63662C55336l35n88m27m58q42j296j814k748l912m474m130l709m015m665m795
$$ 355336 355001 354413 353986 353528 352686 351390 349576 346828 342916 338442 334312 330603 326588 321923 317128
63647C17128m364l918l453k502j192j93L55R80J798K230K130K276L259M541N211
$$ 317128 312764 308846 305393 302891 301699 301506 301861 302841 304639 306869 308999 311275 314534 319075 324286
63632C24286N198N111N235N295N074M732M505M554M977N680O298O557O728P260
$$ 324286 329484 334595 339830 345125 350199 354931 359436 363990 368967 374647 380945 387502 394230 401490
63618D01490Q021Q360Q124Q124R198J1049J2547J3165J3618J4845J6773J8563
$$ 401490 409511 417871 425995 434119 443317 454366 466913 480078 493696 508541 525314 543877
63606E43877J9865K1238K3256K5612K7420K8066K7489K5878K3468K0482J6966
$$ 543877 563742 584980 608236 633848 661268 689334 716823 742701 766169 786651 803617
63595H03617J2772P990L313l74k794m328n408o175o775p567q880j0751j3059j5666
$$ 803617 816389 824379 827692 827318 824524 820196 814788 808613 801838 794271 785391 774640 761581 745915
63581G45915j8289k0505k1994k2717k2756k2187k1149j9835j8324j6565j4619
$$ 745915 727626 707121 685127 662410 639654 617467 596318 576483 558159 541594 526975
63570E26975j2662j0704q578o331m331k787j454l1J343K398L303M544O201P750
$$ 526975 514313 503609 495031 488700 484369 481582 480128 480097 481440 483838 487141 491685 497886 505636
63556E05636Q682R064R386J0040J1078J2351J3700J5139J6988J9690K3316K7311
$$ 505636 514318 523382 532768 542808 553886 566237 579937 595076 612064 631754 655070 682381
63544F82381L1052L4576L8402M2412M5241M5175M1604L5254K7136J7871Q154p16
$$ 682381 713433 748009 786411 828823 874064 919239 960843 996097 1023233 1041104 1049258 1048542
63532A048542p419j1534j3529j3959j3220j1887j0743j0288j0649j1995j4614
$$ 1048542 1041123 1029589 1016060 1002101 988881 976994 966251 955963 945314 933319 918705
63521I18705j8308k2268k5862k9133l2173l4376l4935l3890l2114l0277k8296
$$ 918705 900397 878129 852267 823134 790961 756585 721650 687760 655646 625369 597073
63510E97073k5912k3305k0873j8797j7032j5517j4138j2703j1163r794q894q426
$$ 597073 571161 547856 526983 508186 491154 475637 461499 448796 437633 427839 418945 410519
63498D10519q046p464o597n576m660m094l875l765l628l536l414k856j613r8J003
$$ 410519 402473 395009 388412 382836 378176 374082 370207 366442 362814 359278 355864 353008 351395 351297 352300
63483C52300J539J880K217K355K307K481L039L532L583L473L592L673L200K374
$$ 352300 353839 355719 357936 360291 362598 365079 368118 371650 375233 378706 382298 385971 389171 391545
63469C91545J966K170K279J717P90Q2l92r90j705k147k102j777j488j399j516
$$ 391545 393511 395681 397960 399677 400467 400549 400157 399167 397462 395315 393213 391436 389948 388549 387033
63454C87033j681j568j007k51K49M19O23J119J645J755J464J385K174L930O122
$$ 387033 385352 383784 382777 382526 382775 383194 383817 384936 386581 388336 389800 391185 393359 397289 403411
63439D03411Q106R671J1098J2849J5266J8481K2387K6655L0900L4861L8297M0590
$$ 403411 411517 421188 432286 445135 460401 478882 501269 527924 558824 593685 631982 672572
63427F72572M0753L8039L2532K5051J6554P890K1n833q629q156n183q70L992R100
$$ 672572 713325 751364 783896 808947 825501 833391 833412 827579 818950 810794 805611 804741 808733 817833
63413H17833J4154J8587K1948K4346K6065K6894K6136K3401J9074J3942Q718L986
$$ 817833 831987 850574 872522 896868 922933 949827 975963 999364 1018438 1032380 1041098 1045084
63401A045084K08k574m807o912q820j0254j1328j2656j4860j8148k2229k6418
$$ 1045084 1045292 1042718 1037911 1030999 1022179 1011925 1000597 987941 973081 954933 932704 906286
63389I06286k9910l2190l3279l3573l3465l3047l2058l0152k7423k4549k2131
$$ 906286 876376 844186 810907 777334 743869 710822 678764 648612 621189 596640 574509
63378E74509j9937j7290j4166j1349r368p840o163m249k191J21K545M433N537
$$ 574509 554572 537282 523116 511767 502399 494559 488396 484147 481956 482077 484622 489055 494592
63365D94592O687Q718J1130J2808J3860J5588J8563K1816K4333K6295K8326L0273
$$ 494592 501279 509997 521127 533935 547795 563383 581946 603762 628095 654390 682716 712989
63353G12989L1592L2409L3344L4428L4873L3981L1786K8644K4644J9687J4037
$$ 712989 744581 776990 810334 844762 879635 913616 945402 974046 998690 1018377 1032414
63342A032414Q469L801K85k378m511o181p484q753j0186j1610j3045j5205j8785
$$ 1032414 1040883 1044684 1044969 1042591 1038080 1031899 1024415 1015662 1005476 993866 980821 965616 946831
63329I46831k3266k7126k9446l0705l1687l2143l1068k8052k3868j9693j5996
$$ 946831 923565 896439 866993 836288 804601 772458 741390 713338 689470 669777 653781
63318F53781j2316q043l432K86J831Q08k351p042j2623j8158k2598k5382k6517
$$ 653781 641465 633422 629990 630276 632107 632915 630564 623522 610899 592741 570143 544761 518244
63305E18244k6141k4417k1804j8941j6188j3644j1533j0045q834p309n546m302
$$ 518244 492103 467686 445882 426941 410753 397109 385576 375531 366697 359388 353842 349540
63293C49540l972m155m329m348m092l431k734k666l097l012j984q68n70q20r01
$$ 349540 345568 341413 337084 332736 328644 325213 322479 319813 316716 313704 311720 310852 310282 309462 308561
63278C08561q34r59r90m17N24J212J579J874J798R14k50n79J20Q93J032Q35Q10
$$ 308561 307727 306768 305778 305361 305885 307097 308676 310550 312348 313262 313012 312433 312553 313446 314478 315313 316123
63261C16123R80J216J619K160K570K871L529M749O016O573O156N087M005L550
$$ 316123 317103 318319 319938 322098 324668 327539 331068 335817 341833 348406 354562 359649 363654 367204
63247C67204L939M684N066M979N004N560O416P198P926Q828R884J0809J1388J1675
$$ 367204 371143 375827 380893 385872 390876 396436 402852 410050 417976 426804 436688 447497 458885 470560
63233D70560J1948J2495J3277J3914J4172J4276J4524J4769J4694J4460J4592
$$ 470560 482508 495003 508280 522194 536366 550642 565166 579935 594629 609089 623681
63222F23681J5260J6092J6717J7102J7387J7686J8026J8191J7759J6643J5319
$$ 623681 638941 655033 671750 688852 706239 723925 741951 760142 777901 794544 809863
63211H09863J4034J2129Q833M516L67l117o475j0073j3448j6001j7626j8381j8260
$$ 809863 823897 836026 844859 849375 849742 846625 840150 830077 816629 800628 783002 764621 746361
63198G46361j7518j6562j5303j3310j0759q389o308l728k68L408O738J0083J3727
$$ 746361 728843 712281 696978 683668 672909 664520 658212 654484 654216 657624 664362 674445 688172
63185F88172J7029J9392K1302K3481K5639K7102K8104K9338L0575L0989L0606
$$ 688172 705201 724593 745895 769376 795015 822117 850221 879559 910134 941123 971729
63174I71729L0290L0280K9827K8486K6736K5034K3103K0591J7629J4324J0249
$$ 971729 1002019 1032299 1062126 1090612 1117348 1142382 1165485 1186076 1203705 1218029 1228278
63163A228278M952j320p840j4037j9739k5077l0338l5649m0544m4165m5995m6242
$$ 1228278 1233230 1231910 1224070 1210033 1190294 1165217 1134879 1099230 1058686 1014521 968526 922284
63151I22284m5452m4034m2235m0147l7542l4102l0023k6165k3284k1335j9707
$$ 922284 876832 832798 790563 750416 712874 678772 648749 622584 599300 577965 558258
63140E58258j7937j6004j4089j2273j0503q735p128o020n517n178m393l118j991
$$ 558258 540321 524317 510228 497955 487452 478717 471589 465569 460052 454874 450481 447363 445372
63127D45372j561j656j651j163l00O07J316J767K097K569L350M267M856M759M107
$$ 445372 443811 442155 440504 439341 439041 439648 440964 442731 444828 447397 450747 455014 459870 464629 468736
63112D68736L418L070K976K870K751K743K669K215J563J319J654J974J807J498
$$ 468736 472154 475224 478200 481070 483821 486564 489233 491448 493011 494330 495984 497958 499765 501263
63098E01263J600K021K368K750L491M332M662M519M498M689M496L672K745K069
$$ 501263 502863 504884 507252 510002 513493 517825 522487 527006 531504 536193 540689 544361 547106 549175
63084E49175J179l71k140l278l544l339l026k650k111j233J58J927L561M719N580
$$ 549175 550354 549983 547843 544565 541021 537682 534656 532006 529895 528662 528820 530747 534308 539027 544607
63069E44607O417P146P627Q078Q703R185R164R044R706J1385J3374J5010J6407
$$ 544607 551024 558170 565797 573875 582578 591763 600927 609971 619677 631062 644436 659446 675853
63056F75853J8064K0084K2182K4164K6145K8278L0537L2738L4716L6405L7808
$$ 675853 693917 714001 736183 760347 786492 814770 845307 878045 912761 949166 986974
63045I86974L8884L9538L9808L9969M0347M0998M1676M2090M2184M2165M2345
$$ 986974 1025858 1065396 1105204 1145173 1185520 1226518 1268194 1310284 1352468 1394633 1436978
63034A436978M2803M3150M2743M1268L8955L6065L2256K6840J9690J1565L361
$$ 1436978 1479781 1522931 1565674 1606942 1645897 1681962 1714218 1741058 1760748 1772313 1775674
63023A775674m702j2906k1141k8619l4557l8908m2088m4163m4630m3192m0362
$$ 1775674 1770972 1758066 1736925 1708306 1673749 1634841 1592753 1548590 1503960 1460768 1420406
63012A420406l6985l3208k8354k1865j4133o256Q95P254J3376J9873K6833L3599
$$ 1420406 1383421 1350213 1321859 1299994 1285861 1279605 1280500 1287754 1301130 1321003 1347836 1381435
63000A381435L9198M3190M6085M8756N1427N3457N4166N3709N2984N2700N2767
$$ 1381435 1420633 1463823 1509908 1558664 1610091 1663548 1717714 1771423 1824407 1877107 1929874
62989A929874N2613N1874N0510M8351M4991M0254L4439K7751J9774R962j455j3500
$$ 1929874 1982487 2034361 2084871 2133222 2178213 2218467 2252906 2280657 2300431 2310393 2308938 2295438
62977B295438k5396l7015m8333n8885o8077p5607q1340q5052q6586q6136q4039
$$ 2295438 2270042 2233027 2184694 2125809 2057732 1982125 1900785 1815733 1729147 1643011 1558972
62966A558972q0521p5864p0603o5285o0121n5141n0495m6295m2360l8462l4682
$$ 1558972 1478451 1402587 1331984 1266699 1206578 1151437 1100942 1054647 1012287 973825 939143
62955I39143l1309k8435k5968k3925k2375k1100j9773j8405j7335j6730j6338
$$ 939143 907834 879399 853431 829506 807131 786031 766258 747853 730518 713788 697450
62944F97450j5844j5233j4687j4329j4085j3715j2961j1819j0582r508q574p709
$$ 697450 681606 666373 651686 637357 623272 609557 596596 584777 574195 564687 556113 548404
62932E48404p092o878o758o212n215m266l720l450l206k897k408j588o29r1k48
$$ 548404 541312 534434 527676 521464 516249 511983 508263 504813 501607 498710 496302 494714 494085 493994 493746
62917D93746p00q72o89m55l42k99l26m46n13l04J27M35L05l20j228k042k412k307
$$ 493746 493046 492174 491485 491030 490688 490389 490063 489617 489104 488800 488927 489362 489667 489347 488119 486077 483665 481358
62899D81358k073k012j952j498n94L41R24J201J455J783K016J923J389M06q84
$$ 481358 479285 477273 475321 473823 473229 473570 474494 475695 477150 478933 480949 482872 484261 484667 483783
62884D83783k095k690k361j382m58n7o5r1m1q6j95q3K89N03J81n41j263j838k327
$$ 483783 481688 478998 476637 475255 474797 474740 474675 474584 474543 474457 474262 474179 474468 474971 475152 474611 473348 471510 469183
62865D69183k652k642k387k177k052j761j268j003j335k039k466k218j446n52
$$ 469183 466531 463889 461502 459325 457273 455512 454244 453241 451906 449867 447401 445183 443737 443185
62851D43185J79O30P42N34J98JRm4m49j020j109k91R52J584J144K61j85j99n04
$$ 443185 443364 443994 444736 445270 445468 445469 445478 445434 444985 443965 442856 442565 443517 445101 446245 446506 446321 446122 445618
62832D45618j326j862j345j62N59L74K2M08J532K613K942K402J441P85J009K063
$$ 445618 444292 442430 441085 440923 441482 441856 441878 442286 443818 446431 449373 451775 453216 454001 455010 457073
62816D57073L249L818L557K735J741R19N46O84J186J978L087M254M914M896M769
$$ 457073 460322 464140 467697 470432 472173 473092 473638 474322 475508 477486 480573 484827 489741 494637 499406
62801D99406N037N376N299N229O015P499Q581Q813R003R916J1267J2487J3638
$$ 499406 504443 509819 515118 520347 526362 533861 542442 551255 560258 570174 581441 593928 607566
62788F07566J4947J6177J7249J8861K1663K5263K8871L2501L6626M1039M5139
$$ 607566 622513 638690 655939 674800 696463 721726 750597 783098 819724 860763 905902
62777I05902M9120N3663N8407O1977O3815O4838O5727O5617O3289N8821N3132
$$ 905902 955022 1008685 1067092 1129069 1192884 1257722 1323449 1389066 1452355 1511176 1564308
62766A564308M6430L8112K7965J6613M858o723j7541k7089l5357m2659m8950n3822
$$ 1564308 1610738 1648850 1676815 1693428 1698286 1691563 1674022 1646933 1611576 1568917 1519967 1466145
62754A466145n7169n9381o0705o0905n9822n7825n5458n2888m9981m6693m3105
$$ 1466145 1408976 1349595 1288890 1227985 1168163 1110338 1054880 1001992 952011 905318 862213
62743H62213l9300l5469l1996k9112k6568k3956k1325j9138j7535j6000j3925
$$ 862213 822913 787444 755448 726336 699768 675812 654487 635349 617814 601814 587889
62732E87889j1302q611o218m175k574j648j399j366j006j59R44K057L072M031
$$ 587889 576587 567976 561758 557583 555009 553361 551962 550596 549590 549431 550375 552432 555504 559535
62718E59535N126O550Q123R274R770J0262J1656J3999J6483J8657K1047K4316
$$ 559535 564661 571211 579334 588608 598378 608640 620296 634295 650778 669435 690482 714798
62706G14798K8335L2456L6350M0153M4049M8244N3204N9338O6359P3340P9530
$$ 714798 743133 775589 811939 852092 896141 944385 997589 1056927 1123286 1196626 1276156
62695A276156Q4872Q9623R3788R7054R9054R9506R8112R4530Q8470P9854O8810
$$ 1276156 1361028 1450651 1544439 1641493 1740547 1840053 1938165 2032695 2121165 2201019 2269829
62684B269829N5435L9717K1935L119j5287l2452m8437o3192p5808q5313r1903
$$ 2269829 2325264 2364981 2386916 2390035 2374748 2342296 2293859 2230667 2154859 2069546 1977643
62673A977643r6567r9570j00154r7949r3896q9325q4675p9655p4248o8833o3535
$$ 1977643 1881076 1781506 1681352 1583403 1489507 1400182 1315507 1235852 1161604 1092771 1029236
62662A029236n8165n2786m7880m3702l9877l5874l1685k7841k4873k2786k1040
$$ 1029236 971071 918285 870405 826703 786826 750952 719267 691426 666553 643767 622727
62651F22727j8979j6418j3851j1992j1115j0887j0810j0631j0329r889r254q445
$$ 622727 603748 587330 573479 561487 550372 539485 528675 518044 507715 497826 488572 480127
62639D80127p541o589n580m581l751l147k583j750n86N71J210J041J88q57j514
$$ 480127 472586 465997 460417 455836 452085 448938 446355 444605 444019 444590 445800 446841 447029 446172 444658
62624D44658j532j261j311j796k106j668p31%L20N92Q94Q00K61M0P85K029K826
$$ 444658 443126 441865 440554 438758 436652 434984 434253 434253 434573 435165 436059 436859 437120 437160 437945 439974 442800
62607D42800L059L436M286N118N558O073P303R160J1013J2533J3928J5473J7224
$$ 442800 445859 449295 453581 458699 464257 470330 477633 486793 497806 510339 524267 539740 556964
62594E56964J9188K1338K3457K5229K6633K7943K9217L0021K9872K8768K6997
$$ 556964 576152 597490 620947 646176 672809 700752 729969 759990 789862 818630 845627
62583H45627K4528K0941J6077J0481M968j08m986j0002j5137k0028k4115k6900
$$ 845627 870155 891096 907173 917654 922622 922514 917528 907526 892389 872361 848246 821346
62571H21346k8282k8776k9034k9093k8345k6426k3872k1553j9729j7997j6092
$$ 821346 793064 764288 735254 706161 677816 651390 627518 605965 586236 568239 552147
62560E52147j4311j3032j2222j1520j0630r410p820o007m371l268k686k349k102
$$ 552147 537836 524804 512582 501062 490432 481022 473202 467195 462824 459556 456870 454521 452419
62547D52419j977j904j615j027n12m66o75m48M91J597K256K604L235M218M987
$$ 452419 450442 448538 446923 445896 445384 444918 444243 443795 444286 445883 448139 450743 453978 458196 463183
62532D63183N121M805M376M003L957M681O164P769R104J0614J2795J5189J6929
$$ 463183 468304 473109 477485 481488 485445 490126 496290 504059 513163 523777 536572 551761 568690
62519E68690J8055J9589K2278K5940L0044L4210L8075M1407M4630M8458N2678
$$ 568690 586745 606334 628612 654552 684596 718806 756881 798288 842918 891376 944054
62508I44054N5974N7379N7277N6341N4194M9939M3633L6317K8627K0234J0816
$$ 944054 1000028 1057407 1114684 1171025 1225219 1275158 1318791 1355108 1383735 1403969 1414785
62497A414785Q91q634j7195k4547l0442l4776l7742l9474l9635l7707l3733k8514
$$ 1414785 1415676 1407042 1389847 1365300 1334858 1300082 1262340 1222866 1183231 1145524 1111791 1083277
62485A083277k2968j7534j2212p050k226K338P085J2226J7125K0681K2435K3001
$$ 1083277 1060309 1042775 1030563 1023513 1021287 1023625 1030710 1042936 1060061 1080742 1103177 1126178
62473A126178K3224K3120K1869J8740J3827P890J681m611j1215j8133k4802l0583
$$ 1126178 1149402 1172522 1194391 1213131 1226958 1234848 1236529 1231918 1220703 1202570 1177768 1147185
62461A147185l5442l9767m3545m6201m7329m7118m5961m4101m1901l9785l7576
$$ 1147185 1111743 1071976 1028431 982230 934901 887783 841822 797721 755820 716035 678459
62450F78459l4453l0157k5674k2050j9013j5554j1604q143n724l903k220q70m2
$$ 678459 644006 613849 588175 566125 547112 531558 519954 511811 506087 502184 499964 499094 499052
62437D99052O32J533K420K820K703K436K312K299K064J136o31k731m418n464o123
$$ 499052 499684 501217 503637 506457 509160 511596 513908 516207 518271 519407 518776 516045 511627 506163 500040
62422E00040o510o586o665p211p977q163p596o969o616n943m606l376l075l302
$$ 500040 493530 486944 480279 473068 465091 456928 449332 442363 435747 429804 425198 421822 418747 415445
62408D15445l058k194j450j311j628k143k638k695k023r67j77J58K53J67j16k60
$$ 415445 412387 410193 408743 407432 405804 403661 401023 398328 396305 395338 395161 395319 395572 395739 395623 395363
62392C95363J22Q29J411J916K655L370L436K921K604K866L232L265L131L139L302
$$ 395363 395485 396314 397725 399641 402296 405666 409102 412023 414627 417493 420725 423990 427121 430260 433562
62377D33562L649M344N248N911O225O560P063P400P478P825Q855J0328J1792J3112
$$ 433562 437211 441555 446803 452714 458939 465499 472562 479962 487440 495265 504120 514448 526240 539352
62363E39352J4204J4889J5469J6924J9853K3634K7139L0065L3015L6582M0770
$$ 539352 553556 568445 583914 600838 620691 644325 671464 701529 734544 771126 811896
62352H11896M5150M9054N1776N2984N2758N1023M7364M1780L5194K8542K1788
$$ 811896 857046 906100 957876 1010860 1063618 1114641 1162005 1203785 1238979 1267521 1289309
62341A289309J4404O569q95p620j3872j9637k4417k8138l1473l4830l7628l9038
$$ 1289309 1303713 1310282 1309387 1301767 1287895 1268258 1243841 1215703 1184230 1149400 1111772 1072734
62329A072734l8998l8008l6205l3317k9466k5581k2790k1464k0977k0388j9354
$$ 1072734 1033736 995728 959523 926206 896740 871159 848369 826905 805928 785540 766186
62318G66186j8302j7721j7531j7364j7268j7642j8490j9157j9023j8210j7288
$$ 766186 747884 730163 712632 695268 678000 660358 641868 622711 603688 585478 568190
62307E68190j6494j5482j3817j1530r143p250o085n417m855m211l532k959k561
$$ 568190 551696 536214 522397 510867 501724 494474 488389 482972 478117 473906 470374 467415 464854
62294D64854k240j748r53j63Q6k09k79M92J639K163J880J630K038K707K931K711
$$ 464854 462614 460866 459913 459750 459836 459627 459348 459840 461479 463642 465522 467152 469190 471897 474828 477539
62278D77539K585K816L202L510L663L638L493L444L561L542L146K795L300M908
$$ 477539 480124 482940 486142 489652 493315 496953 500446 503890 507451 510993 514139 516934 520234 525142
62264E25142P000Q896J0566J2371J4463J6815J9653K3376K7949L2813L7468M1901
$$ 525142 532142 541038 551604 563975 578438 595253 614906 638282 666231 699044 736512 778413
62252G78413M6196N0038N2949N4834N5843N5695N3687M9536M3759L6948K9114
$$ 778413 824609 874647 927596 982430 1038273 1093968 1147655 1197191 1240950 1277898 1307012
62241A307012K0266J1177K905m396j1496j8892k6274l3265l9937m6134n0937n3430
$$ 1307012 1327278 1338455 1341360 1336964 1325468 1306576 1280302 1247037 1207100 1160966 1110029 1056599
62229A056599n3700n2557n0512m7633m4132m0396l6467l2171k7849k4374k2142
$$ 1056599 1002899 950342 899830 852197 808065 767669 731202 699031 671182 646808 624666
62218F24666k0566j8838j6806j4796j2963j1214r617q408p684p293p017o613n879
$$ 624666 604100 585262 568456 553660 540697 529483 519866 511458 503774 496481 489464 482851 476972
62205D76972m890m042l616l387k957k360j978j871j617q94J47J242K359L468M286
$$ 476972 472082 468040 464424 461037 458080 455720 453742 451871 450254 449360 449507 450749 453108 456576 460862
62190D60862M662M996N850P197Q413R085R432R811J0115R990R468R027Q956Q917
$$ 460862 465524 470520 476370 483567 491980 501065 510497 520308 530423 540413 549881 558908 567864 576781
62176E76781Q319P018N528M539M374M907N915P294Q939J0624J2268J4239J7167
$$ 576781 585100 592118 597646 602185 606559 611466 617381 624675 633614 644238 656506 670745 687912
62163F87912K1303K6146L0867L4921L8141M0309M1039M0231L8362L5924L2704
$$ 687912 709215 735361 766228 801149 839290 879599 920638 960869 999231 1035155 1067859
62152A067859K8016K1799J5134R292M489p0m977r959j4376j7953k0699k2567k3573
$$ 1067859 1095875 1117674 1132808 1142100 1146589 1146519 1141542 1131583 1117207 1099254 1078555 1055988 1032415
62139A032415k3943k3742k2575k0167j7084j4240j1766r037n995l719l111l602
$$ 1032415 1008472 984730 962155 941988 924904 910664 898898 889861 883866 880147 877036 873434
62127H73434l757k996k009j604j817k203k421k184j206L45J648J987J617J397
$$ 873434 869677 866681 864672 863068 861251 859048 856627 854443 853237 853582 855230 857217 858834 860231
62113H60231J567J393J90j691l350m455n407o446p198p327p174p313p739p878
$$ 860231 861798 863191 863381 861690 858340 853885 848478 842032 834834 827507 820333 813020 805281 797403
62099G97403p348o314n148m046k947j551M59K922N077O373P223Q455J0067J1235
$$ 797403 790055 783741 778593 774547 771600 770049 770508 773430 778507 784880 792103 800558 810625 821860
62085H21860J1649J2020J2986J4250J5330J6468J8147K0196K2115K3936K5991
$$ 821860 833509 845529 858515 872765 888095 904563 922710 942906 965021 988957 1014948
62074A014948K8060K9425K9740K9154K7777K5671K3325K1296J9375J6890J3984
$$ 1014948 1043008 1072433 1102173 1131327 1159104 1184775 1208100 1229396 1248771 1265661 1279645
62063A279645J1845J1385J2308J3781J5372J6972J8321J9151J9526J9567J9130
$$ 1279645 1291490 1302875 1315183 1328964 1344336 1361308 1379629 1398780 1418306 1437873 1457003
62052A457003J8020J6248J3816J0586O631K377j968o846j2837j9849k7153l4060
$$ 1457003 1475023 1491271 1505087 1515673 1522304 1524681 1522713 1515867 1503030 1483181 1456028 1421968
62040A421968m0210m5359m9258n1811n3173n3696n3696n3170n1731m9113m5680
$$ 1421968 1381758 1336399 1287141 1235330 1182157 1128461 1074765 1021595 969864 920751 875071
62029H75071m2112l8592l4822l0874k7390k4628k1966j8843j5714j3462j2242
$$ 875071 832959 794367 759545 728671 701281 676653 654687 635844 620130 606668 594426
62018E94426j1545j1145j1290j1936j2442j2151j0971r312p750o727o264n889
$$ 594426 582881 571736 560446 548510 536068 523917 512946 503634 495884 489157 482893 477004
62006D77004n024l432j320P60K097K308J880J842K584L442L772L847M159M395
$$ 477004 471980 468548 467228 467988 470085 472393 474273 476115 478699 482141 485913 489760 493919 498314
61992D98314L908K824J797R05l11j788k881l405l832m326m559m655n316o559p265
$$ 498314 502222 505046 506843 507748 507437 505649 502768 499363 495531 491205 486646 481991 476675 470116 462851
61977D62851o653n443m829m854m634l803k874k274j804j127k87M56R44J166J147
$$ 462851 456198 450755 445926 441072 436438 432635 429761 427487 425683 424556 424269 424725 425669 426835 427982
61962D27982Q70L50k08l40K58J259J946K048J954J996K005J812J650J750J957
$$ 427982 428852 429202 428994 428654 428912 430171 432117 434165 436119 438115 440120 441932 443582 445332 447289
61947D47289K194K852M107N337N880O152P258R528J2102J4009J5055J5610J6086
$$ 447289 449483 452335 456442 461779 467659 473811 481069 490597 502699 516708 531763 547373 563459
61934E63459J6774J7710J8432J8305J7280J5978J4895J3840J2360J0396Q309O508
$$ 563459 580233 597943 616375 634680 651960 667938 682833 696673 709033 719429 727738 734246
61922G34246N169M065K573J62k926n785p749q853r272q782p254n283l624k153
$$ 734246 739415 743480 746053 746215 743289 737504 729755 720902 711630 702848 695594 690311 686687 684534
61908F84534M3L324O837R488J1195J2633J4023J4739J4276J3002J1638J0181P926
$$ 684534 684577 687901 694738 704226 715421 728054 742077 756816 771092 784094 795732 805913 813839
61895H13839M467K89l769p286j0256j2652j4284j4984j4788j4002j3195j2853
$$ 813839 818306 818595 814826 807540 797284 784632 770348 755364 740576 726574 713379 700526
61883G00526j2806j2329j1103r745r007q718q164p259o652o635o679o362n982
$$ 700526 687720 675391 664288 654543 645536 636818 628654 621395 614743 608108 601429 595067 589085
61870E89085n963o138o098n725m934l451j429J99P63R22J811L351M465M950N989
$$ 589085 583122 576984 570886 565161 560227 556776 555347 555546 556309 557231 559042 562393 566858 571808 577797
61855E77797Q308J0919J2530J3534J5500J9004K2895K5846K7669K8927K9936L0661
$$ 577797 586105 597024 609554 623088 638588 657592 680487 706333 734002 762929 792865 823526
61843H23526L1038L0873K9652K7041K3433J9561J5674J1468O850K319j587m783
$$ 823526 854564 885437 915089 942130 965563 985124 1000798 1012266 1019116 1021435 1019848 1015065
61831A015065p334r014r515q875p341m977j868J422M157O340Q646J1216J3026
$$ 1015065 1007731 998717 989202 980327 972986 968009 966141 967563 971720 978060 986706 997922 1010948
61818A010948J2951J1090Q407N336J498l290q482j3548j8556k3554k7933l0937
$$ 1010948 1023899 1034989 1043396 1048732 1050230 1046940 1038458 1024910 1006354 982800 954867 923930
61806I23930l2503l3080l2816l1505k9264k6684k4271k2139k0307j8831j7513
$$ 923930 891427 858347 825531 794026 764762 738078 713807 691668 671361 652530 635017
61795F35017j5890j3851j1952j0863j0607j0513r865q485o780n369m550m131l746
$$ 635017 619127 605276 593324 582461 571854 561341 551476 542991 536211 530842 526292 522161 518415
61782E18415l308k955k708k477k363k629l200l508l056j991r06k92k51n84r31
$$ 518415 515107 512152 509444 506967 504604 501975 498775 495267 492211 490220 489314 489022 488771 488187 487256
61767D87256j016q83q54j076j261j005k72N84J182J408J445J592J924K158K011
$$ 487256 486240 485357 484503 483427 482166 481161 480889 481473 482655 484063 485508 487100 489024 491182 493193
61752D93193J669J588J825J979J923K071K679L301L377K949K382J722R25M04P03
$$ 493193 494862 496450 498275 500254 502177 504248 506927 510228 513605 516554 518936 520658 521583 521987 522690
61737E22690J669K601L180L661M116M140L517K667K161K140K403K671K600J920
$$ 522690 524359 526960 530140 533801 537917 542057 545574 548241 550402 552542 554945 557616 560216 562136
61723E62136Q63K7l19m17l51K50J413K223J786N45j46K63Q86P27r4q42j390k218
$$ 562136 562999 563026 562707 562290 561939 562189 563602 565825 567611 568156 568010 568273 569159 569886 569792 568950 567560 565342
61705E65342l381m294m623m791n193n521n367n067n198n488n113m073l357l469
$$ 565342 561961 557667 553044 548253 543060 537539 532172 527105 521907 516419 511306 507233 503876 500407
61691E00407l720l437l039l108l214k592j561j135j457j716j507j270j269j184
$$ 500407 496687 493250 490211 487103 483889 481297 479736 478601 477144 475428 473921 472651 471382 470198
61677D70198r30r79j507k037k211k204k097j649j047r82j535j843j428j000j252
$$ 470198 469268 468289 466782 464745 462534 460330 458233 456584 455537 454555 453020 451177 449749 448749 447497
61662D47497j708j637j358j579k013j781q60m7L11M94M18l50j481j821q59N51
$$ 447497 445789 444152 442794 441215 439202 437421 436561 436514 436825 437319 437737 437387 435906 434085 433226 433777
61646D33777J286J203R82J210J945K776L106K712K074J824J895J655R25J99j93
$$ 433777 435063 436266 437248 438458 440403 443179 446285 448997 451071 452895 454790 456445 457370 457569 457376
61631D57376n52j212k042k794l398l716l504k932k611k672k432j437l97l86j348
$$ 457376 456824 455612 453570 450776 447378 443662 440158 437226 434615 431943 429511 428074 427677 427291 425943
61616D25943k083j768r50p93j681k838l279k893k458k618l100l215k880k735l212
$$ 425943 423860 422092 421142 420349 418668 415830 412551 409658 407200 404582 401482 398267 395387 392652 389440
61601C89440l992m528m721m717m450l725k652j695j251j416k004k716l344l896
$$ 389440 385448 380920 376199 371482 367032 363307 360655 358960 357709 356293 354289 351573 348229 344333
61587C44333m367m485l918k903k234k355k754k590j743q38l98m24p44j295j856
$$ 344333 339966 335481 331563 328660 326426 324071 321317 318727 316984 316146 315748 315324 314580 313285 311429
61572C11429j917j228l06k1o17j403j601j322j369k039k534j873j84J309J651
$$ 311429 309512 308284 307978 307957 307340 305937 304336 303014 301645 299606 297072 295199 295015 296324 297975
61557B97975J125O70O88P30L40k34l50J52O99P34M18L09M92N12K49K55Q95J599
$$ 297975 299100 299770 300458 301188 301528 301294 300944 301096 301795 302529 302947 303256 303748 304260 304509 304764 305659 307258
61539C07258J550Q07J49oJ21M41J249K482L372L253K309J223M18p3l51n97j007
$$ 307258 308808 309615 309764 309758 309879 310320 311569 314051 317423 320676 322985 324208 324626 324553 324202 323605 322598
61522C22598j545j912j982j918j820j545j097q16q66j002j030j118j225q55J63
$$ 322598 321053 319141 317159 315241 313421 311876 310779 309963 309097 308095 307065 305947 304722 303867 304030
61507C04030J039Q94K3n12m14n03j380k524l041k767k251j905j640j203n66J6
$$ 304030 305069 305963 305986 305474 305060 304557 303177 300653 297612 294845 292594 290689 289049 287846 287280 287296
61491B87296K33k1n44j065j435j572j295n32L51P17L34l04m29K88J521K594K982
$$ 287296 287529 287508 286964 285899 284464 282892 281597 281065 281416 282133 282467 282163 281734 282022 283543 286137 289119
61474B89119K632J917J250P63M25L10N95J262K018K496K430J721N44n52r60n74
$$ 289119 291751 293668 294918 295681 296106 296416 297011 298273 300291 302787 305217 306938 307482 306930 305970 305396
61458C05396P9L75J94j07j23K67Q74J375J557J472J319J189R69O04K51Q9K1j91
$$ 305396 305475 305850 306044 305937 305814 306081 306955 308330 309887 311359 312678 313867 314836 315440 315691 315780 315801 315610
61440C15610m95n33j00N23R57J203J485J745J749J678K078K956L456K912J861
$$ 315610 315115 314582 314482 315005 315962 317165 318650 320395 322144 323822 325900 328856 332312 335224 337085
61425C37085J387J637J773J287O26K88R9j57q1P29J856K490K483K352K413K419
$$ 337085 338472 340109 341882 343169 343795 344083 344182 344025 343944 344673 346529 349019 351502 353854 356267 358686
61409C58686K108J564J011O09M80N61M30l33j565k606l022k957k774k667k648
$$ 358686 360794 362358 363369 363978 364458 365019 365449 365116 363551 360945 357923 354966 352192 349525 346877
61394C46877k704k776k821k881k957k840k317j455m26P59K012K771K363R02o06
$$ 346877 344173 341397 338576 335695 332738 329898 327581 326126 325700 326459 328471 331242 333605 334507 333901
61379C33901j190p13K76J095J340J126J007J299J523J007Q4n0J058K345K601J998
$$ 333901 332711 331998 332274 333369 334709 335835 336842 338141 339664 340671 340755 340705 341763 344108 346709 348707
61363C48707J592J750J947J887J915K219K457K474K657L240L769L771L562L868
$$ 348707 350299 352049 353996 355883 357798 360017 362474 364948 367605 370845 374614 378385 381947 385815
61349C85815M853O061P115P973Q569Q759Q697Q795R079Q976Q051O682N690N444
$$ 385815 390668 396729 403844 411817 420386 429145 437842 446637 455716 464692 472743 479425 485115 490559
61335D90559N636N772N545M797L513J945N50l07n31k73K7k24j230k394k869k525
$$ 490559 496195 501967 507512 512309 515822 517767 518317 518010 517479 517206 517233 517009 515779 513385 510516 507991
61319E07991j992j675j315o98j84n5J34Q99J887K397K609L460N145O655P171P222
$$ 507991 505999 504324 503009 502311 502127 502072 502206 503105 504992 507389 509998 513458 518603 525258 532429 539651
61303E39651P863R151J0177J0405J0271J0288J0182R275P455N296L220J038j482
$$ 539651 547514 556665 566842 577247 587518 597806 607988 617263 624718 630014 633234 634272 632790
61290F32790l890n408o001o530p626q829r227q666p756o966o292n752n528n455
$$ 632790 628900 623492 617491 610961 603335 594506 585279 576613 568857 561891 555599 549847 544319 538864
61276E38864n031m121l166k352j229M36J991K659K671K928L795M827N537N816
$$ 538864 533833 529712 526546 524194 522965 523401 525392 528051 530722 533650 537445 542272 547809 553625
61262E53625N628M955M237M232N207O623P761Q381Q623Q719Q942R393R627Q994
$$ 553625 559253 564208 568445 572677 577884 584507 592268 600649 609272 617991 626933 636326 645953 654947
61248F54947P576O280N622N002L696K039Q31Jj251l024m446m959m953m838m373
$$ 654947 662523 668803 674425 679427 683123 685162 685993 685994 684743 681719 677273 672314 667361 662523 658150
61233F58150l488k906l161l526k884j331j7N13Q47J520K204K476K637L240M223
$$ 658150 654662 651756 648595 645069 642185 640854 640837 641350 642197 643717 645921 648397 651034 654274 658497
61218F58497N040N397N481N614N967O442O668O321N585N032M875M701M195L672
$$ 658497 663537 668934 674415 680029 685996 692438 699106 705427 711012 716044 720919 725620 729815 733487
61204G33487L558L668L533L167K954L035L268L746M731O098P406Q626J0275J2620
$$ 733487 737045 740713 744246 747413 750367 753402 756670 760416 765147 771245 778651 787277 797552 810172
61190H10172J5129J7024J8033J8376J8307J7951J7410J6626J5275J3035J0124
$$ 810172 825301 842325 860358 878734 897041 914992 932402 949028 964303 977338 987462
61179I87462P412N822N574N987O036N173L635K021P15k63j076j994l282m984o783
$$ 987462 994874 1000696 1006270 1012257 1018293 1023466 1027101 1029122 1029837 1029574 1028498 1026504 1023222 1018238 1011455
61164A011455q330r641j0982j2438j3831j5066j6257j7448j8396j8834j8809j8666
$$ 1011455 1003125 993484 982502 970064 956233 941167 924910 907462 889066 870232 851423 832757
61152H32757j8628j8451j7595j5866j3812j2177j0954r415p237n162m136m107
$$ 832757 814129 795678 778083 762217 748405 736228 725274 715859 708622 703460 699324 695217
61140F95217m243m076l891m030m409m817n195n514n747n915n850n005l021m24
$$ 695217 690974 686898 683007 678977 674568 669751 664556 659042 653295 647380 641530 636525 633504 633080
61126F33080J826L558N510Q036J0438J1990J3014J4436J6639J9319K2109K4830
$$ 633080 634906 638464 643974 652010 662448 674438 687452 701888 718527 737846 759955 784785
61114G84785K7312K9496L1584L3641L5161L5501L4735L3749L3314L3356L3196
$$ 784785 812097 841593 873177 906818 941979 977480 1012215 1045964 1079278 1112634 1145830
61103A145830L2341L0973K9595K8254K6238K2839J8322J3741R619N345K19n377
$$ 1145830 1178171 1209144 1238739 1266993 1293231 1316070 1334392 1348133 1357752 1363097 1363316 1357939
61091A357939j0380j4417j8123k2075k5991k9146l1242l2592l3568l4158l4083
$$ 1357939 1347559 1333142 1315019 1292944 1266953 1237807 1206565 1173973 1140405 1106247 1072164
61080A072164l3347l2409l1723l1121k9986k8135k6122k4510k3176k1670j9967
$$ 1072164 1038817 1006408 974685 943564 913578 885443 859321 834811 811635 789965 769998
61069G69998j8381j6900j5191j3206j1285r568p761n668l630k130j208m99L26
$$ 769998 751617 734717 719526 706320 695035 685467 677706 672038 668408 666278 665070 664571 664897
61056F64897J352K524L722M760N509O090O848Q061R675J1314J2622J3650J4844
$$ 664897 666249 668773 672495 677255 682764 688854 695702 703763 713438 724752 737374 751024 765868
61043G65868J6604J8837K1075K2976K4599K6191K7862K9557L1233L2924L4665
$$ 765868 782472 801309 822384 845360 869959 896150 924012 953569 984802 1017726 1052391
61032A052391L6524L8677M1219M3875M6087M7622M8887N0330N1673N2189N1884
$$ 1052391 1088915 1127592 1168811 1212686 1258773 1306395 1355282 1405612 1457285 1509474 1561358
61021A561358N1846N3130N5719N9012O3024O8420P5475Q3680R2590J02618J14889
$$ 1561358 1613204 1666334 1722053 1781065 1844089 1912509 1987984 2071664 2164254 2266872 2381761
61010B381761J30783J51929J80252K17535K64947L23197L93424M77999N80214
$$ 2381761 2512544 2664473 2844725 3062260 3327207 3650404 4043828 4521827 5102041
61001E102041P02368Q43855J001839J173837J356467J537255J686694J762863
$$ 5102041 5804409 6648264 7650103 8823940 10180407 11717662 13404356 15167219
60993A5167219J729837J575586J315850R86808O38281L28482J10156O843l442
$$ 15167219 16897056 18472642 19788492 20775300 21413581 21742063 21852219 21859062 21855620
60984B1855620K0324J0701q1357k75195n60223q98722j233656j506159j676447
$$ 21855620 21875944 21886645 21805288 21530093 20969870 20071148 18837492 17331333 15654886
60975A5654886j734215j693307j579204j419798j240851j062591q97315p50386
$$ 15654886 13920671 12227364 10648160 9228362 7987511 6924920 6027605 5277219
60967E277219o23653n17527m30796l60628l03929k58259k21437j91310j66369
$$ 5277219 4653566 4136039 3705243 3344615 3040686 2782427 2560990 2369680 2203311
60958B203311j45946j29405j15641j03624r2828q2839p3227o4053n5920m9163
$$ 2203311 2057365 1927960 1812319 1708695 1615867 1533028 1459801 1395748 1339828 1290665
60948A290665m3558l9045l5962l4144l2628l0844k9347k8692k8230k6925k4846
$$ 1290665 1247107 1208062 1172100 1137956 1105328 1074484 1045137 1016445 988215 961290 936444
60937I36444k3030k2094k1753k1459k0843j9724j8413j7725j8061j8632j8263
$$ 936444 913414 891320 869567 848108 827265 807541 789128 771403 753342 734710 716447
60926G16447j6765j4904j3242j1802j0706j0288j0378j0242r451q350p465o829
$$ 716447 699682 684778 671536 659734 649028 638740 628362 618120 608669 600319 592854 586025
60914E86025o069m905l520k554k530l071l078j997o09k0l01o31m35K67J315K398
$$ 586025 579956 575051 571531 568977 566447 563376 560298 558301 557692 557672 557371 556740 556305 556572 557887 560285
60898E60285K861K283J188M63K30l1n11r65j410k023k477k361k157k859m512o080
$$ 560285 563146 565429 566617 567080 567310 567279 566768 565803 564393 562370 559893 557532 555375 552516 548004 541924
60882E41924o795o763o174n050l952l821m637n154m462k990j619o72k21m74j211
$$ 541924 535129 528366 522192 517142 513190 509369 504732 499578 495116 492126 490507 489835 489614 489140 487929
60867D87929j604j186l64M83J608L037L978L933L661M137N115N606N428N293N575
$$ 487929 486325 485139 484775 485258 486866 489903 493881 497814 501475 505612 510727 516333 521761 527054 532629
60852E32629N809N466M645L923L799M230M543M071L016K248K133K137J827J486
$$ 532629 538438 543904 548549 552472 556271 560501 565044 569115 572131 574379 576512 578649 580476 581962
60838E81962J358J015J17r23j664k363l231l654l065k078j668j693j292m82j73
$$ 581962 583320 584335 584452 583529 581865 579502 576271 572617 569552 567474 565806 564113 562821 562339 562166
60823E62166o57j224j371j402j534j396p70j06J80L22P06J264J714K071K502K917
$$ 562166 561509 560285 558914 557512 555978 554582 553812 553706 553886 554208 554914 556178 557892 559963 562465 565382
60807E65382L048K869K712K958L622M289M519M419M549N163N873O325O805P719
$$ 565382 568430 571299 574011 576969 580591 584880 589399 593818 598367 603530 609403 615728 622533 630252
60793F30252Q802R408R383R154R044R056R216R551R774R518R018R007R791J0810
$$ 630252 639054 648462 657845 666999 676043 685099 694315 703866 713640 723158 732176 741183 750974 761784
60779G61784J1285J0968J0192R499R278R534R898R947R509Q631P534O711O665
$$ 761784 773069 784037 794229 803728 813006 822540 832438 842385 851894 860525 868059 874770 881435
60766H81435P174P269O312M776L428K244Q15n88j325j583k296l811n505o857q033
$$ 881435 888609 895878 902190 906966 910394 912638 913453 912865 911540 909957 907661 903850 898345 891488 883455
60751H83455r133r702r458q874q609q767r060r298r456r574r860j0433j0902j0698
$$ 883455 874322 864620 855162 846288 837679 828912 819852 810554 801098 791524 781664 771231 760329 749631
60737G49631j0010r824j0686j1968j2731j2830j2709j2516j2023j1210j0390r783
$$ 749631 739621 729797 719111 707143 694412 681582 668873 656357 644334 633124 622734 612951
60725F12951r281q669p888p150o819o981p147o649n475m349l782l453k831k073
$$ 612951 603670 595001 587113 579963 573144 566163 559016 552367 546892 542543 538761 535308 532477 530404
60711E30404j896k557l438l734l378l045l224l498l123k227j879k614l521l435
$$ 530404 528508 525951 522513 518779 515401 512356 509132 505634 502511 500284 498405 495791 492270 488835
60697D88835k593k255k850l565l809l993m509m935m807m417m143l752k988k316
$$ 488835 486242 483987 481137 477572 473763 469770 465261 460326 455519 451102 446959 443207 440219 437903
60683D37903k234k321j812q57l41n81q85n09N05J489J734J039K3k50N83J572J474
$$ 437903 435669 433348 431536 430679 430338 429757 428872 428363 428868 430357 432091 433130 433153 432903 433486 435058 436532
60666D36532K19j109j635j431j001o88o59q94r89n17L20Q75J034J395K199K714
$$ 436532 436751 435642 434007 432576 431575 430887 430228 429334 428345 427828 428148 429023 430057 431452 433651 436365
60650D36365K232J266J070K121L640M623M780M297L317K015R01L92J58n21j576
$$ 436365 438597 439863 440933 443054 446694 451317 456097 460394 463711 465726 466627 467019 467177 466656 465080
60635D65080j969j069K27M71m77j372j300o68k62k02k78o60j438k021j793j133
$$ 465080 463111 462042 462269 462740 462263 460891 459591 458923 458661 458459 458181 457521 456083 454062 452269 451136
60619D51136r35j326j644j634j749k112k144j583j074j183j459j121k79K04j66
$$ 451136 450201 448875 447231 445597 443848 441736 439592 438009 436935 435752 434293 433172 432893 433097 432931
60604D32931j113k112k706k492j443l51k16j004j523q76M49J262J076L81j99m62
$$ 432931 431818 429706 427000 424508 423065 422714 422498 421494 419971 419095 419544 420806 421882 422263 422064 421602
60588D21602m31j97r0n12j375k023j999j576j278j089n54M41J435J971K061K012
$$ 421602 421171 420974 420884 420372 418997 416974 414975 413399 412121 411032 410478 410919 412354 414325 416386 418398
60572D18398K101K570L608N070O426P202P524P955Q832R823J0192R473P917O237
$$ 418398 420499 423069 426677 431747 438173 445375 452899 460854 469686 479509 489701 499174 507091 513328
60558E13328M885L599J854l91k615m376n674o507o459n154k987j016k4K08N57
$$ 513328 518213 521812 523666 523275 520660 516284 510610 504103 497644 492490 489503 488487 488463 488671 489228
60543D89228J674L406N032O029O600P337Q386R124Q811P430N655M141L038K183
$$ 489228 490902 494308 499340 505369 511969 519306 527692 536816 545627 553057 558712 562853 565891 568074
60529E68074J403N65m32j564k701l737m530m739m033k673j624j638k329k523j620
$$ 568074 569477 570042 569610 568046 565345 561608 557078 552339 548306 545633 544009 542371 540042 537519 535899
60514E35899k14P73J222J678K346K775K590K066J764J959K626L688M982O271P671
$$ 535899 535685 536458 537680 539358 541704 544479 547069 549135 550899 552858 555484 559172 564154 570425 578096
60499E78096R839J3309J7694K2030K5846K9377L2655L4977L5615L4644L2576K9426
$$ 578096 587935 601244 618938 640968 666814 696191 728846 763823 799438 834082 866658 896084
60487H96084K4641J7942R797R51q146j7134k5296l1741l6107l8750l9977l9489
$$ 896084 920725 938667 948464 949415 941269 924135 898839 867098 830991 792241 752264 712775
60475G12775l6936l2905k8783k5484k2791k0147j7562j5348j3421j1540r948r122
$$ 712775 675839 642934 614151 588667 565876 545729 528167 512819 499398 487858 477910 468788
60463D68788q884q432p335n972m839m001l354k914k607k240j887j891k225k332
$$ 468788 459904 451472 444137 438165 433326 429325 425971 423057 420450 418210 416323 414432 412207 409875
60449D09875j899j316j060j010p91m32k35l03n57j002j548j856j794j732j986
$$ 409875 407976 406660 405600 404590 403799 403367 403132 402829 402272 401270 399722 397866 396072 394340 392354
60434C92354k228j934j182n16j51P6J41j39m81k44N96J134N76p22j628j508p89
$$ 392354 390126 388192 387010 386494 386343 386419 386560 386421 385940 385696 386292 387426 388002 387280 385652 384144 383355
60417C83355k75j48J37R85J940K187J650J181J392J829J678R69N06P13J148J179
$$ 383355 383080 382932 383069 384054 385994 388181 389831 391012 392404 394233 395911 396880 397386 398099 399247 400426
60401D00426P00J04j41K29J080J892K168J852J280P71N19P07J312J884J926J533
$$ 400426 401126 401230 401089 401318 402398 404290 406458 408310 409590 410361 410880 411587 412899 414783 416709 418242
60385D18242J297J550K003K208K051J731J501J454J428J170Q00Q68J554K122J768
$$ 418242 419539 421089 423092 425300 427351 429082 430583 432037 433465 434635 435435 436303 437857 439979 441747
60370D41747Q59N42J088J487R75J78J48Q78J438J279P08K91L09P62J427J868J832
$$ 441747 442606 443148 444236 445723 446698 446876 447024 447902 449340 450619 451327 451618 451927 452689 454116 455984 457816
60353D57816J541J418J554J795K198K967L990M928N740O697P720Q188P646O408
$$ 457816 459357 460775 462329 464124 466322 469289 473279 478207 483947 490644 498364 506552 514198 520606
60339E20606N119L943K574Q34j089k991m793o193o691o214n458n183n294n081
$$ 520606 525725 529668 532242 533076 531987 528996 524203 518010 511319 505105 499647 494464 489170 484089
60325D84089m312l533l211l081k721k276k117k114j809j173o00k15L07J135K060
$$ 484089 479777 476244 473033 469952 467231 464955 462838 460724 458915 457742 457142 456927 457234 458369 460429
60310D60429K968M006N060N729O112P080R230J1951J4105J5353J6154J6606J6085
$$ 460429 463397 467403 472463 478192 484304 491384 500614 512565 526670 542023 558177 574783 590868
60297E90868J4219J1522Q681N685K176j624m857o893p827q084p924p469o893o327
$$ 590868 605087 616609 625290 630975 633151 631527 626670 619777 611950 603866 595942 588473 581580 575253
60283E75253n748n197m950n220n821o332o579o629o455n987n494n381n533n328
$$ 575253 569505 564308 559358 554138 548317 541985 535406 528777 522322 516335 510841 505460 499927 494599
60269D94599m604m090m404n086n191m573l929l662l400k767j983j486j350j359
$$ 494599 489995 485905 481501 476415 471224 466651 462722 459060 455660 452893 450910 449424 448074 446715
60255D46715j277q91j36O35Q98O71O22J239K138K551K214J462O96J86K09R27K019
$$ 446715 445438 444547 444411 445046 445944 446615 447237 448476 450614 453165 455379 456841 457537 457723 457932 458859 460878
60238D60878K774K678J852Q61K46K15N92R68R90O09J45M8M95J180J583J529J338
$$ 460878 463652 466330 468182 469043 469289 469504 470096 471064 472054 472663 472808 472856 473351 474531 476114 477643 478981
60221D78981J354J486J453J368J678K536L532M158M299M238M360M885N685O333
$$ 478981 480335 481821 483274 484642 486320 488856 492388 496546 500845 505083 509443 514328 520013 526346
60207E26346O582O729P169P680P591O791O068O141O755P050O586N687M975M806
$$ 526346 532928 539657 546826 554506 562097 568888 574956 581097 587852 594902 601488 607175 612150 616956
60193F16956N032N092M531L539K715K267J767Q88j11q82j534k229k718k824l065
$$ 616956 621988 627080 631611 635150 637865 640132 641899 642787 642676 641794 640260 638031 635313 632489 629424
60178F29424m141n865p200p420o722n719m819m241m090m162l984l315k404j644
$$ 629424 625283 619418 612218 604798 598076 592357 587538 583297 579207 575045 571061 567746 565342 563698
60164E63698j187r98j058j262j318r57k32N06R46J034R52R58J233J765K325K540
$$ 563698 562511 561513 560455 559193 557875 556918 556686 557192 558138 559172 560124 561082 562315 564080 566405 568945
60148E68945K170J417Q43Q14J100J220J168J461K444L848N180O220O988P466P604
$$ 568945 571115 572532 573375 574189 575289 576509 577677 579138 581582 585430 590610 596830 603818 611284 618888
60133F18888P404O946O432O206O308O087M788K685R69K09l06j229j957j552k79
$$ 618888 626292 633238 639670 645876 652184 658271 663059 665744 666713 666922 666616 665387 663430 661878 661599
60118F61599P13R44Q59P72O41P36J511K604L057K702K373K467K282J321K82l5
$$ 661599 662312 663256 664115 664887 665528 666264 667775 670379 673436 676138 678511 680978 683260 684581 684863 684828
60102F84828j7n88j806k953l677m198m534m350l657l014k854k996k965k527j836
$$ 684828 684811 684223 682417 679464 675787 671589 667055 662705 659048 656034 653180 650184 647219 644692 642856
60087F42856j231q53m64K57J180J805J973K065K297K295J784J186J036J132R29
$$ 642856 641625 640772 640308 640565 641745 643550 645523 647588 649885 652180 653964 655150 656186 657318 658247
60072F58247M08j52j017k739n025o677o989o591o568p251q127q609q475p887p189
$$ 658247 658655 658503 657486 654747 649722 643045 636056 629465 622897 615646 607519 598910 590435 582548 575359
60057E75359o632o180n705n368n417n608n281m173k817j912j615j542j213k68
$$ 575359 568727 562547 556842 551474 546057 540449 535168 530995 528178 526266 524651 523109 521896 521628
60043E21628J344L154M430M917N080N421N939O431O913P389P550P163O433N606
$$ 521628 522972 526126 530556 535473 540553 545974 551913 558344 565257 572646 580196 587359 593792 599398
60029E99398M494K960J505O95Q9j426m050o551p633p402p040p426q434r387r789
$$ 599398 603892 606852 608357 609052 609141 607715 603665 597114 589481 582079 575039 567613 559179 549792 540003
60014E40003r705r546r491r128p952o211m812m205l846l102k197j737j587r86
$$ 540003 530298 520752 511261 502133 494181 487970 483158 478953 475107 472005 469808 468071 466484 465498
60000D65498K76J531K169K344K525K820L098L326L484L427L170L068L305L488
$$ 465498 465774 467305 469474 471818 474343 477163 480261 483587 487071 490498 493668 496736 500041 503529
59986E03529L170K612K477K840L067K766K314K191K207J804Q53l21j459k499l268
$$ 503529 506699 509311 511788 514628 517695 520461 522775 524966 527173 528977 529830 529509 528050 525551 522283
59971E22283l551l552l868m709n522n564m747l609k653j930j258n44J10N25N75
$$ 522283 518732 515180 511312 506603 501081 495517 490770 487161 484508 482578 481320 480776 480886 481411 481986
59956D81986L63K12L82P75J045R64N77P9l14l47J51J043J948K603L042L347L372
$$ 481986 482349 482561 482943 483718 484763 485727 486304 486383 486069 485722 485873 486916 488864 491467 494509 497856 501228
59939E01228K880J859N97n07j206j570j963k702l665m309m199l426k455j729j420
$$ 501228 504108 505967 506564 506057 504851 503281 501318 498616 494951 490642 486443 483017 480562 478833 477413
59924D77413j427j469j352j208j289j454j191l67M10N69M25P45J552K034J666
$$ 477413 475986 474517 473165 471957 470668 469214 468023 467656 468066 468635 469060 469805 471357 473391 475057
59909D75057Q75M06N11J020J813K760L505L704L445L196L323L857M537M955M869
$$ 475057 475932 476338 476849 477869 479682 482442 485947 489651 493096 496292 499615 503472 508009 512964 517833
59894E17833M494M339M547M646M231L601L340L510L665L663L890M632N577O154
$$ 517833 522327 526666 531213 535859 540090 543691 547031 550541 554206 557869 561759 566391 571968 578122
59880E78122O127N729N349N153M855L987K590J475J347J762J466q1k124l756n074
$$ 578122 584249 589978 595327 600480 605335 609322 611912 613387 614734 616496 617962 617881 615757 612001 606927
59865F06927o662q343r180q682p446o453o071n913n379m216k628j031L21J422
$$ 606927 600265 591922 582742 574060 566614 560161 554090 548177 542798 538582 535954 534923 535244 536666
59851E36666K274K834L359M438O310Q309R467R552R069Q293O948M961K905J392
$$ 536666 538940 541774 545133 549571 555881 564190 573657 583209 592278 600571 607519 612480 615385 616777
59837F16777M55j19l29k53l33q60j419j462j188j325k118l085l726l968l948l893
$$ 616777 617232 617113 616784 616531 616198 615338 613919 612457 611269 609944 607826 604741 601015 597047 593099 589206
59821E89206m281n486p155q343q493p893p096o372n855n699n751n525m751l690
$$ 589206 584925 579439 572284 563941 555448 547555 540459 534087 528232 522533 516782 511257 506506 502816
59807E02816k674j799j196j150j546j749j359p51m85n56o84q51j160j461j649
$$ 502816 500142 498343 497147 495997 494451 492702 491343 490592 490107 489551 488867 488016 486856 485395 483746
59792D83746j926k333k384j822j247j396k098k652k914l140l114k381j226m57
$$ 483746 481820 479487 477103 475281 474034 472638 470540 467888 464974 461834 458720 456339 455113 454656
59778D54656j98J03M72K60n39r26l09O02Q89O47N64Q85J400J936K313K292J964
$$ 454656 454458 454561 455033 455293 454754 453828 453519 454121 455010 455657 456221 457106 458506 460442 462755 465047 467011
59761D67011J766J816J754J567J839K699L302L015K435K479L036L370L370L486
$$ 467011 468777 470593 472347 473914 475753 478452 481754 484769 487204 489683 492719 496089 499459 502945
59747E02945L793M079M513N279N755N114L679K704K750L170L297L179K934K339
$$ 502945 506738 510817 515330 520609 526364 531478 535157 537861 540611 543781 547078 550257 553191 555530
59733E55530J478R85J132J303R11K47m4Q2K61M49Q63J387J597J383J101J104J364
$$ 555530 557008 557993 559125 560428 561339 561586 561542 561624 561885 562334 563197 564584 566181 567564 568665 569769 571133
59716E71133J627J705J555J264J047J098J322J258M62q16j560r34N91J541J075
$$ 571133 572760 574465 576020 577284 578331 579429 580751 582009 582471 581655 580095 579161 579752 581293 582368
59701E82368r1p51p31p72j230j698j813j611j015K11J711K498K103J199N81J13
$$ 582368 582277 581526 580795 580023 578793 577095 575282 573671 572656 572867 574578 577076 579179 580378 580959 581072
59685E81072p05j555j593p86j04k12n91l88L80R09O55k58j504k912m152m649m225
$$ 581072 580367 578812 577219 576433 576329 576117 575526 575138 575518 576427 577082 576824 575320 572408 568256 563607 559382
59668E59382l557l496m047m477m417m267m421m626m420l728k757j708q95o28o08
$$ 559382 555825 552329 548282 543805 539388 535121 530700 526074 521654 517926 515169 513461 512566 511938 511330
59653E11330L6J517K735K587J623J441K568L898M289L815L141K379J172n24k226
$$ 511330 511366 512883 515618 518205 519828 521269 523837 527735 532024 535839 538980 541359 542531 542007 539781
59638E39781l327l484k827j887j145o15n9M48N68K71p8k51l31l72k56K6L22N67
$$ 539781 536454 532970 530143 528256 527111 526496 526437 526885 527453 527724 527646 527395 527064 526692 526436 526462 526784 527351
59620E27351O98M60k34q41p82m06o31j550k196j916j145n23NO84J296J586J809
$$ 527351 528049 528509 528275 527434 526652 526246 525615 524065 521869 519953 518808 518285 518290 518974 520270 521856 523665
59603E23665K242K628K613K346K156J963J521R17L30l37j153j764j855j695j763
$$ 523665 525907 528535 531148 533494 535650 537613 539134 540051 540381 540044 538891 537127 535272 533577 531814
59588E31814k003j971j539j031p69q51j248j850k469k971l241l003k160j317j374
$$ 531814 529811 527840 526301 525270 524501 523650 522402 520552 518083 515112 511871 508868 506708 505391 504017
59573E04017k265k785k147j078p01r39q08P0J094J692J892J918J827J622J280
$$ 504017 501752 498967 496820 495742 495041 494102 493294 493364 494458 496150 498042 499960 501787 503409 504689
59558E04689P30J58J27R77K201K916K769K045J145M72M66J134J771J757J452J693
$$ 504689 505419 505577 505704 506681 508882 511798 514567 516612 517757 518229 518695 519829 521600 523357 524809 526502
59542E26502K600L574M390N485P198R279J1319J3082J4387J5085J5087J4089J1485
$$ 526502 529102 532676 537066 542551 549749 559028 570347 583429 597816 612901 627988 642077 653562
59529F53562P204K449j172l168m139m385l423j071J878M423O163P080P130O430
$$ 653562 660766 663215 662043 658875 654736 650351 646928 645857 647735 652158 658321 665401 672531 678961
59515F78961N384M258K910J164r17l185n447p294q397r050r895j1002j1733j1648
$$ 678961 684345 688603 691513 692677 691760 688575 683128 675834 667437 658387 648492 637490 625757 614109
59501F14109j0966j0022q915p883p334p147o575n252l768k827k320j688q30j08
$$ 614109 603143 593121 584206 576323 568989 561842 555267 550015 546247 543420 541100 539412 538582 538474
59487E38474K69M44O55J054J638K223K746L620N317P482R035R499R664J0472J1727
$$ 538474 538743 539187 539842 540896 542534 544757 547503 551123 556440 563922 572957 582456 592120 602592 614319
59472F14319J2422J1974J0584Q723O804N156L779K250L24j501k402k121j058L43
$$ 614319 626741 638715 649299 658022 664826 669982 673761 676011 676335 674834 672432 670311 669253 669596
59458F69596J868L390M865O498Q533J0849J3108J5248J7475J9686K1270K1657
$$ 669596 671464 674854 679719 686217 694750 705599 718707 733955 751430 771116 792386 814043
59446H14043K0949J9819J8709J7220J4382R688L677k610q572j4022j8466k1108
$$ 814043 834992 854811 873520 890740 905122 914810 918487 915877 907305 893283 874817 853709
59434H53709k1798k1376k0711j9858j8535j6919j5444j4158j2773j1121r120o502
$$ 853709 831911 810535 789824 769966 751431 734512 719068 704910 692137 681016 671896 665394
59422F65394l149M34L529O040Q517J1439J4799J8294K1488K3854K5156K5766K6195
$$ 665394 662245 662679 666208 672248 680765 692204 707003 725297 746785 770639 795795 821561 847756
59409H47756K6274K5118K1950J6572R230O09p895j4541j8318j9470j8770j6629
$$ 847756 874030 899148 921098 937670 946900 947509 939614 925073 906755 887285 868515 851886
59397H51886j3265r409o352n139n965q450j2144j6568k0840k3778k4709k4073
$$ 851886 838621 829212 822860 817721 811756 803306 791162 774594 753754 729976 705267 681194
59385F81194k2898k1642j9879j7184j3925j0908q495o498m778l456k505j584n49
$$ 681194 658296 636654 616775 599591 585666 574758 566263 559765 554987 551531 549026 547442 546893
59372E46893K33L24p6k15L53J220J645J505J419J922K889L974N143O352P072O869
$$ 546893 547126 547450 547374 547159 547512 548732 550377 551882 553301 555223 558112 562086 567229 573581 580653 587522
59356E87522O324O555P769R055R910J1016J2966J5049J6194J6619J7541J9389
$$ 587522 593846 600401 608170 617225 627135 638151 651117 666166 682360 698979 716520 735909
59344G35909K1340K2606K3285K3697K3602K2575K0662J8236J5478J2344Q851N100
$$ 735909 757249 779855 803140 826837 850439 873014 893676 911912 927390 939734 948585 953685
59332I53685J198k703o370r620j2500j5210j7873k0338k2146k2865k2574k1889
$$ 953685 954883 952180 945810 936190 923690 908480 890607 870269 848123 825258 802684 780795
59320G80795k1265k0498j9206j7598j6246j5169j3626j1117q166n846m659m089
$$ 780795 759530 739032 719826 702228 685982 670813 657187 646070 637904 632058 627399 623310
59308F23310l224j703n1J007J512K371M266O781Q949J0392J1451J2321J2699J2270
$$ 623310 620086 618383 618332 619339 620851 623222 627488 634269 643218 653610 665061 677382 690081 702351
59294G02351J0947Q472M464p37n745r152j0711j1181j1239j0920r968q369o469
$$ 702351 713298 721770 726234 725497 719752 710600 699889 688708 677469 666549 656581 648212 641743
59281F41743m802l662k785j486O16L130N332O973Q413R968J1481J2651J3608J4848
$$ 641743 636941 633279 630494 629008 629624 632754 638086 645059 653472 663440 674921 687572 701180 716028
59267G16028J6475J7758J7733J6247J4132J2146J0114P387L872J16l498p030j0337
$$ 716028 732503 750261 767994 784241 798373 810519 820633 828020 831892 832008 828510 821480 811143
59254H11143j2803j4019j4402j4732j5252j5540j5157j4098j2723j1402j0219
$$ 811143 798340 784321 769919 755187 739935 724395 709238 695140 682417 671015 660796
59243F60796q909p200n194l248j437N60K880N055O475P026P086P066P183P462
$$ 660796 651887 644687 639493 636245 634808 635368 638248 643303 649778 656804 663890 670956 678139 685601
59229F85601P674P399O398M880L156J228j034l494n841p973r908j1485j2433j2749
$$ 685601 693275 700674 707072 711952 715108 716336 715302 711808 705967 697994 688086 676601 664168 651419
59215F51419j2606j1973j0729r155p886p198o762o224n682n329n036m567l974
$$ 651419 638813 626840 616111 606956 599070 591872 585110 578886 573204 567875 562839 558272 554298
59202E54298l439k887k155j350o84l1R35K161L127L522L600L755L984M099M094
$$ 554298 550859 547972 545817 544467 543783 543752 544687 546848 549975 553497 557097 560852 564836 568935 573029
59187E73029M095M047L799L391L001K661K298J968J752J497J080Q85J480K735
$$ 573029 577124 581171 584970 588361 591362 594023 596321 598289 600041 601538 602618 603503 604983 607718
59173F07718L752M017M027M484N336O171P103Q465R850J0482J0546J1199J2892
$$ 607718 611470 615487 619514 623998 629334 635505 642608 651073 660923 671405 681951 693150 706042
59160G06042J4494J4614J3194J1143Q948O455L664R03j786m640p507r807j1279
$$ 706042 720536 735150 748344 759487 768435 774890 778554 779457 777671 773031 765524 755717 744438
59147G44438j2185j2640j2434j1759j1449j1926j2406j1795j0116q439p562p295
$$ 744438 732253 719613 707179 695420 683971 672045 659639 647844 637728 629289 621727 614432
59135F14432p002o322n231l876k526j412n96j35k49q98j330o51J031K689L749
$$ 614432 607430 601108 595877 592001 589475 588063 587467 587332 587083 586185 584855 584204 585235 587924 591673
59120E91673M675N865O757O741O361O700P815Q749Q978Q851Q588P899O923O531
$$ 591673 596348 602213 608970 615711 622072 628772 636587 645336 654314 663165 671753 679652 686575 693106
59106F93106P074P649P296O325N629N246M544L493K725K385J886R36m1p21j322
$$ 693106 700180 707829 715125 721450 727079 732325 736869 740362 743087 745472 747358 748294 748253 747532 746210
59091G46210j906k028j567j202j457j788j377n08l36j351k831l950m794n911p345
$$ 746210 744304 742276 740709 739507 738050 736262 734885 734377 734041 732690 729859 725909 721115 715204 707859
59076G07859q533r121r359r647r899r670q869q028p715p772p530o657n557m776
$$ 707859 699326 690205 680846 671199 661300 651630 642761 634733 627018 619246 611716 605059 599502 594726
59062E94726m318l761k867j893j302j343j725j785j148l11k24j148k236k496j856
$$ 594726 590408 586647 583780 581887 580585 579242 577517 575732 574584 574273 574049 572901 570665 568169 566313
59047E66313r65k96N4l6o50j401j628j231q11q22j004q89m62k0L36O60Q78Q84
$$ 566313 565348 565052 565106 565070 564420 563019 561391 560160 559349 558527 557523 556634 556172 556152 556488 557148 558026 558910
59029E58910R04J382K433L674M686N480O352P401Q321Q769Q823Q875R122R361
$$ 558910 559814 561196 563629 567303 571989 577469 583821 591222 599543 608312 617135 626010 635132 644493
59015F44493R384R312R203Q624P082M823K751J422N91j47p33r00n91J97J593L489
$$ 644493 653877 663189 672392 681016 688098 692921 695672 697094 697685 697538 696805 695905 695314 695511 697104 700593
58999G00593N289O510P364Q303R237R760R902J0140J0610J0937J0830J0311R318
$$ 700593 705882 712392 719756 728059 737296 747056 756958 767098 777708 788645 799475 809786 819104
58986H19104P654N443L193J162q61k977m831o133p012p600p614o782n300l561
$$ 819104 826758 832201 835394 836556 835695 832718 827887 821754 814742 807142 799528 792746 787446 783885
58972G83885j661M84K768M966O976Q801J0484J2265J4332J6295J7358J7409J7263
$$ 783885 782224 782708 785476 790442 797418 806219 816703 828968 843300 859595 876953 894362 911625
58959I11625J7410J7126J5527J2987J0474P894M246o65n773j0147j3853j7096
$$ 911625 929035 946161 961688 974675 985149 993043 997289 996624 990851 980704 966851 949755
58947I49755j9570k1150k2317k3237k3152k1471j8926j6836j5527j4265j2487
$$ 949755 930185 909035 886718 863481 840329 818858 799932 783096 767569 753304 740817
58936G40817j0445q641p316o447n853n249m548l980l626l107k179j352j297j787
$$ 740817 730372 721731 714415 707968 702115 696866 692318 688338 684712 681605 679426 678074 676777 674990
58922F74990j910j326p12p18j121j177n28N70J530J838J424Q73R72J921L225M444
$$ 674990 673080 671754 671042 670324 669203 668026 667498 668068 669598 671436 672860 673733 674705 676626 679851 684295
58906F84295N673P048Q209Q665Q601Q874J0140J2189J4256J5822J6900J7622J7844
$$ 684295 689968 697016 705225 713890 722491 731365 741505 753694 767950 783772 800672 818294 836138
58893H36138J7474J7076J7610J9381K1566K3213K4449K6201K8844L1652L3603
$$ 836138 853612 870688 888298 907679 929245 952458 976907 1003108 1031952 1063604 1097207
58882A097207L4262L3701L2078K9542K6235K2077J6805J0450L544l354j0065j6473
$$ 1097207 1131469 1165170 1197248 1226790 1253025 1275102 1291907 1302357 1305901 1302547 1292482 1276009
58870A276009k2129k6512k9572l1672l3025l3510l2933l1335k8994k6336k3707
$$ 1276009 1253880 1227368 1197796 1166124 1133099 1099589 1066656 1035321 1006327 979991 956284
58859I56284k1150j8556j6225j4943j5116j5962j6121j5152j3989j3708j4184
$$ 956284 935134 916578 900353 885410 870294 854332 838211 823059 809070 795362 781178
58848G81178j4234j2969j0684q523p423p425p839p979p684p160o560n896n293
$$ 781178 766944 753975 743291 734768 727345 719920 712081 704102 696418 689258 682698 676802 671509
58835F71509m912m667m352m117m412n174n549m876l660l016l241l466k760j122
$$ 671509 666597 661930 657578 653461 649049 643875 638326 633450 629790 626774 623533 620067 617307 616185
58821F16185P65K212K876K900K997L893N416O530O654O426O653O992O488N162
$$ 616185 616950 619162 622038 624938 627935 631828 637244 643774 650428 656854 663507 670499 676987 682149
58807F82149M087L819L661K841J674R55P53M55k23r44j471k109l227m657n818
$$ 682149 686236 690055 693716 696557 698231 699186 699939 700394 700171 699227 697756 695647 692420 687763 681945
58792F81945o389o611o854p062o820n944m707l367j849j70J209J945K470L421
$$ 681945 675556 668945 662091 655029 648209 642265 637558 634191 632342 632172 633381 635326 637796 641217
58778F41217M565M979M413L664L345L015J934J33j752l264m281m762m854m908
$$ 641217 645782 650761 655174 658838 662183 665198 667132 667265 665513 662249 657968 653206 648352 643444
58764F43444n088n167n041m935m875m409l358k282j690j310o31K64J102K094L477
$$ 643444 638356 633189 628148 623213 618338 613929 610571 608289 606599 605289 604658 604922 606024 608118 611595
58749F11595M798N534N939O476O737O152N363N629O830P468O932O425P064Q193
$$ 611595 616393 621927 627866 634342 641079 647231 652594 658223 665053 672521 679453 685878 692942 701135
58735G01135Q470P764P059O914O976O737O130N453N120N400O064O443O094N248
$$ 701135 709605 717369 724428 731342 738318 745055 751185 756638 761758 767158 773222 779665 785759 791007
58721G91007M505M329M859N725O003M937L066K017K755M521N975O808P542Q202
$$ 791007 795512 799841 804700 810425 816428 821365 824431 826448 829203 833724 839699 846507 854049 862251
58707H62251Q108O979N428M034K499R6l244o682r361j1346j3480j6257j9115k0982
$$ 862251 870359 877338 882766 886800 889299 889395 886151 879469 870108 858762 845282 829025 809910 788928
58693G88928k1370k0593j9128j7318j5615j4480j3805j2902j1333r451p896o910
$$ 788928 767558 746965 727837 710519 694904 680424 666619 653717 642384 632933 625037 618127
58681F18127o378o135o003n810n607n533n432m929m007l034k100q47Q08K381L580
$$ 618127 611749 605614 599611 593801 588194 582661 577229 572300 568293 565259 563159 562312 563120 565501 569081
58666E69081M759O230P628Q549R260J0256J1329J1729J1020R363P178M932K978
$$ 569081 573840 580070 587698 596247 605507 615763 627092 638821 649841 659204 666382 671314 674292
58653F74292J284m63k161l166l184k797k708k911l135l535m236m751m675m503
$$ 674292 675576 675113 672952 669786 666602 663805 661097 658186 655051 651516 647280 642529 637854 633351
58639F33351m829n066m077j970j57N33P49J411K531L642M557N145N074M305L410
$$ 633351 628522 623456 619379 617409 617252 617785 618534 619945 622476 626118 630675 635820 640894 645199 648609
58624F48609K923K748K622K650K905K976K522K039K421L872N769P602R409J1219
$$ 648609 651532 654280 656902 659552 662457 665433 667955 669994 672415 676287 682056 689658 699067 710286
58610G10286J2536J2806J2039J0679Q997O949M612K336L65j405l096m506n429
$$ 710286 722822 735628 747667 758346 767343 774292 778904 781240 781605 780200 777104 772598 767169
58597G67169o046o694p293p504p343p161o927o149m765l499k869k313q24J783
$$ 767169 761123 754429 747136 739632 732289 725128 718201 712052 707287 703788 700919 698606 697782 699565
58583F99565M774P425R506J0965J1736J1977J2065J2169J2047J1374J0110Q623
$$ 699565 704339 711764 721270 732235 743971 755948 768013 780182 792229 803603 813713 822336
58571H22336P536P311P801Q414Q901R739J1397J3529J5382J6816J8377K0395K2548
$$ 822336 829872 837183 844984 853398 862299 872038 883435 896964 912346 929162 947539 967934 990482
58558I90482K4347K5578K6084K5491K3395J9763J5083J0219N953K439q07m141
$$ 990482 1014829 1040407 1066491 1091982 1115377 1135140 1150223 1160442 1166395 1168834 1168027 1163886
58546A163886p144r058r740r777r735r694r608r684j0226j1408j3267j5715j8363
$$ 1163886 1156742 1147684 1137944 1128167 1118432 1108738 1099130 1089446 1079220 1067812 1054545 1038830 1020467
58533A020467k0536k1633k1481k0370j8824j7178j5272j2685r440o240l723j686
$$ 1020467 999931 978298 956817 936447 917623 900445 885173 872488 863048 856808 853085 851399
58521H51399N21K939M739N154M371L322K730K462J818M91r06j499j286j142j619
$$ 851399 851920 854859 859598 864752 869123 872445 875175 877637 879455 879946 879040 877541 876255 875113 873494
58506H73494k212k196j679j350j477j741j850j876k019k505l462m563n071m707
$$ 873494 871282 869086 867407 866057 864580 862839 860989 859113 857094 854589 851127 846564 841493 836786
58492H36786m188m295m734m592l695k736k052j231k8J178K165L348M987O595P651
$$ 836786 832598 828303 823569 818977 815282 812546 810494 809263 809235 810413 812578 815926 820913 827508 835159
58477H35159Q510R914J1892J3671J4611J4702J4078J2542R890O441K922k05l026
$$ 835159 843669 853583 865475 879146 893757 908459 922537 935079 944969 951410 954332 954127 951101
58464I51101n656p776q960r272r043q184o278l456p10J079K026K907M304O265
$$ 951101 945445 937669 928709 919437 910394 902210 895932 892476 891766 892845 894871 897778 902082 908347
58450I08347Q335R587R177P302N142L471J791o61l642o256q089r296r863r638
$$ 908347 916682 926269 935446 942748 947890 951361 953152 952491 948849 942593 934504 925208 915345 905707
58436I05707q778p564n947l926k042p68K89J796L594N019O060P256Q623R652J0424
$$ 905707 896929 889365 883418 879492 877450 876682 876971 878767 882361 887380 893440 900696 909319 918971 929395
58421I29395J1643J3345J4459J3972J1946R174O407M049K058K0k298m512o163
$$ 929395 941038 954383 968842 982814 994760 1003934 1010341 1014390 1016448 1016468 1014170 1009658 1003495
58408A003495p458q817r953j0266j0004j0108j0784j1151j0517r202p879o750
$$ 1003495 996037 987220 977267 967001 956997 946889 936105 924954 914437 905235 897356 890606
58396H90606n713m739l818k878j912r26J13R81J209P36J91m1m25j306j944j484
$$ 890606 884893 880154 876336 873458 871546 870620 870733 871714 872923 873659 873850 873809 873384 872078 870134 868650
58380H68650k64R62K452M771P204Q464Q682R078R783R787R023Q633Q954R082Q907
$$ 868650 868386 869348 871800 876571 883775 892239 900921 909999 919782 929569 938592 947225 956179 965261 974168
58365I74168R545J1135J2095J1637J1236J2413J4462J5745J6024J6101J6140J5700
$$ 974168 983713 994848 1006943 1018580 1029816 1042229 1056691 1072436 1088460 1104561 1120701 1136401
58353A136401J4786J3660J2119R910P341M759K063n47k096j959p56N46J781L110
$$ 1136401 1151187 1164847 1176966 1186876 1194217 1198976 1201039 1200492 1198396 1196437 1195681 1196227 1198008 1201118
58339A201118M242M996N956P728R986J1991J3483J4482J4956J5259J6132J7551
$$ 1201118 1205360 1210356 1216312 1224040 1234026 1246017 1259500 1273982 1288938 1304197 1320329 1337880
58327A337880J8353J7728J6331J5172J4174J2718J0885R218P790O349N071M331
$$ 1337880 1356233 1373961 1390292 1405464 1419638 1432356 1443241 1452459 1460249 1466598 1471669 1476000
58315A476000M088M011M004M199M806O058P775R030R137Q883R733J1720J3459
$$ 1476000 1480088 1484099 1488103 1492302 1497108 1503166 1510941 1519971 1529108 1537991 1547724 1559444 1572903
58302A572903J4424J5611J7527J9157J9737J9942K0389K0472J9751J9118J9437
$$ 1572903 1587327 1602938 1620465 1639622 1659359 1679301 1699690 1720162 1739913 1759031 1778468
58291A778468K0178K0498K0631K1129K1840K2559K3583K4812K5503K5728K6712
$$ 1778468 1798646 1819144 1839775 1860904 1882744 1905303 1928886 1953698 1979201 2004929 2031641
58280B031641K8785L0565L1190L1679L2983L4361L5024L5750L7285L8830L9670
$$ 2031641 2060426 2090991 2122181 2153860 2186843 2221204 2256228 2291978 2329263 2368093 2407763
58269B407763M0741M2994M5658M7799M9964N2671N4971N6332N8242O1862O5750
$$ 2407763 2448504 2491498 2537156 2584955 2634919 2687590 2742561 2798893 2857135 2918997 2984747
58258B984747O8139O9813P2376P5214P6751P7394P8651Q0446Q1839Q3349Q6035
$$ 2984747 3052886 3122699 3195075 3270289 3347040 3424434 3503085 3583531 3665370 3748719 3834754
58247C834754Q9283R2013R5109J00103J06495J12780J19164J26726J34898J42409
$$ 3834754 3924037 4016050 4111159 4211262 4317757 4430537 4549701 4676427 4811325 4953734
58237D953734J49838J58667J68762J79186J90478K03545K17508K31132K45285
$$ 4953734 5103572 5262239 5431001 5610187 5800665 6004210 6221718 6452850 6698135
58228F698135K61523K79662K99229L21509L47374L75105M03378M34271M70134
$$ 6698135 6959658 7239320 7538549 7860058 8207432 8582537 8985915 9420186 9890320
58219I890320N09904N52195N99339O54221P15813P82589Q57790R46231J048568
$$ 9890320 10400224 10952419 11551758 12205979 12921792 13704381 14562171 15508402 16556970
58210A6556970J164274J297719J455553J640973J857361K115033K428009K808061
$$ 16556970 17721244 19018963 20474516 22115489 23972850 26087883 28515892 31323953
58202C1323953L270419L841717M551954N420523O460447P695604R165713J0917936
$$ 31323953 34594372 38436089 42988043 48408566 54869013 62564617 71730330 82648266
58194H2648266J2999136J5438775J8212461K1223044K4330123K7363053L0027097
$$ 82648266 95647402 111086177 129298638 150521682 174851805 202214858 232241955
58187B32241955L1770550L1825888K9507847K4559735J7273318Q358100j248221
$$ 232241955 264012505 295838393 325346240 349905975 367179293 375537393 374289172
58180C74289172j0517018j8482818k4459092k8198110k9862589k9846162k8594854
$$ 374289172 363772154 345289336 320830244 292632134 262769545 232923383 204328529
58173B04328529k6516767k3955791k1185384j8412154j5785852j3404349j1315011
$$ 204328529 177811762 153855971 132670587 114258433 98472581 85068232 73753221
58166G3753221r524985q018415o767097n734215m881069m175139l590306l102440
$$ 73753221 64228236 56209821 49442724 43708509 38827440 34652301 31061995 27959555
58158B7959555k690640k341517k046954j798041j585207j402624j247503j115589
$$ 27959555 25268915 22927398 20880444 19082403 17497196 16094572 14847069 13731480
58150A3731480j001428r02096q16490p41591o73399o10875n55129n05270m58835
$$ 13731480 12730052 11827956 11011466 10269875 9596476 8985601 8430472 7925202 7466367
58141G466367m15815l78455l47032l19310k94197k72751k55352k40736k28012
$$ 7466367 7050552 6672097 6325065 6005755 5711558 5438807 5183455 4942719 4714707
58132D714707k17013k06605j95082j82497j70394j59244j48271j37541j28007
$$ 4714707 4497694 4291089 4096007 3913510 3743116 3583872 3435601 3298060 3170053
58123C170053j19581j11281j03324r6996r2460q8530q4627q1106p7742p3717o9113
$$ 3170053 3050472 2939191 2835867 2738871 2646411 2557881 2473254 2392148 2314406 2240689 2171576
58112B171576o4862o1300n8133n5536n3777n2162m9895m7516m5961m4769m2903
$$ 2171576 2106714 2045414 1987281 1931745 1877968 1825806 1775911 1728395 1682434 1637665 1594762
58101A594762m0741l9375l8457l6750l4461l3014l2621l2084l0878k9586k8301
$$ 1594762 1554021 1514646 1476189 1439439 1404978 1371964 1339343 1307259 1276381 1246795 1218494
58090A218494k6486k4470k3260k2717k1641j9814j8322j7745j7605j7697j8303
$$ 1218494 1192008 1167538 1144278 1121561 1099920 1080106 1061784 1044039 1026434 1008737 990434
58079I90434j8949j8617j7443j6699j6777j6722j6019j5322j5024j4594j3775
$$ 990434 971485 952868 935425 918726 901949 885227 869208 853886 838862 824268 810493
58068H10493j3167j3140j3246j3070j2627j1808j0530r454r323r627r221q292
$$ 810493 797326 784186 770940 757870 745243 733435 722905 713451 704128 694501 685280 676988
58056F76988q146q966r396q723p819p444p183o748o810p650q285p798o577n393
$$ 676988 668842 659876 650480 641757 633938 626494 619311 612563 605753 598103 589818 582020 575443 570050
58042E70050m299l195k541k649l090l454l971m750n228n087m936n394o173o720
$$ 570050 565751 562556 560015 557366 554276 550822 546851 542101 536873 531786 526850 521456 515283 508563
58028E08563p192p981q833r099q577p632o793o475o677o783o157n063m333m049
$$ 508563 501371 493390 484557 475458 466881 459249 452456 445981 439304 432521 426364 421301 416968 412919
58014D12919l469k415j727j894k226k041j745j976k372k115j129j4Q16J332J511
$$ 412919 409450 407035 405308 403414 401188 399147 397402 395426 393054 390939 389810 389796 390612 391944 393455
57999C93455J489J670K219K759K959K984K919K266O92j084j902j466n18P5n6q40
$$ 393455 394944 396614 398833 401592 404551 407535 410454 412720 413412 412328 410426 408960 408442 408517 408461 407621
57983D07621j837k399k174j501r77q00q10r23j133j278j140p46k78K26Q18J411
$$ 407621 405784 403385 401211 399710 398733 397933 397123 396200 395067 393789 392649 391903 391625 391851 392669 394080
57967C94080J790J785J388Q68P66J435K505L146L033K656K498K340J765R09K87
$$ 394080 395870 397655 399043 399911 400677 402112 404617 407763 410796 413452 415950 418290 420055 420964 421251
57952D21251Q5K6j29l40n18p33j150j793k328k174j069M56J478J674J549J638
$$ 421251 421336 421362 421233 420893 420375 419642 418492 416699 414371 412197 411128 411584 413062 414736 416285 417923
57936D17923J903K118K402K997L816M579N155N494N382M628L460K348J525Q14
$$ 417923 419826 421944 424346 427343 431159 435738 440893 446387 451769 456397 459857 462205 463730 464544
57922D64544n6j122k181k988l486l855m334n040n961o904p343o632m812l006k428
$$ 464544 464488 463366 461185 458197 454711 450856 446522 441482 435521 428617 421274 414642 409830 406824 404396
57907D04396k975l368k794j870j637k215k863l062k977k979l164l407l608l812
$$ 404396 401421 398053 395259 393389 391752 389537 386674 383612 380635 377656 374492 371085 367477 363665
57893C63665m086m296m079l314k533k515l339m163m173l419k546j949j564j233
$$ 363665 359579 355283 351204 347890 345357 342842 339503 335340 331167 327748 325202 323253 321689 320456
57879C20456r13o77p28j296k214k748k314j364j121k211l845m706m435l852l719
$$ 320456 319543 318866 318138 316842 314628 311880 309566 308202 307081 304870 301025 296319 291884 288032 284313
57864B84313l755l204k013q65j82L19R17J397J636K189L619N500O766O965O678
$$ 284313 280558 277354 275341 274476 274294 274613 275530 276927 278563 280752 284371 289871 296637 303602 310280
57849C10280O607O825P036P035O634N585L983K531J995K325K637K148J066L15
$$ 310280 316887 323712 330748 337783 344417 350002 353985 356516 358511 360836 363473 365621 366687 367002
57835C67002M31R69J134P23J01m99j056j273p96j3J35m50p22o1O31K29q98j438
$$ 367002 367433 368402 369536 370259 370360 369861 368805 367532 366736 366723 366858 366408 365686 365625 366256 366485 365587 364149
57817C64149r16L4Q57J419J393M62q48j623j917k704m295n916p035q066r247r750
$$ 364149 363233 363267 364124 365543 366936 367398 366550 364927 363010 360306 356011 350095 343060 334994 325747 315997
57801C15997q696o438m277l201l245l679l595k671j523r09o55l3Q97J262Q67O70
$$ 315997 307301 300863 296586 293385 290140 286461 282866 280195 278672 277763 277108 277075 277972 279234 280101 280771
57785B80771J398K557L294L477L324K841K200K023K563L203L372L421L901M552
$$ 280771 282169 284726 288020 291497 294821 297662 299862 301885 304448 307651 311023 314444 318345 322897
57771C22897M693M188L327K217Q82l53j201j815k418k951l502m407n427n548m411
$$ 322897 327590 331778 335105 337322 338204 337851 336650 334835 332417 329466 325964 321557 316130 310582 306171
57756C06171l244l411m532n102m578l718l143k666k096j543q40L49J644K035J226
$$ 306171 302927 299516 294984 289882 285304 281586 278443 275777 273681 272138 271298 271647 273291 275326 276552
57741B76552Q3n55q12j157j501j503j309j387j758j889j352l88L41M81L62N58
$$ 276552 276635 276080 275268 274111 272610 271107 269798 268411 266653 264764 263412 263024 263365 263846 264208 264766
57725B64766J123J548J528J363J428J554J352Q25K26l72r84j433j617j820k279
$$ 264766 265889 267437 268965 270328 271756 273310 274662 275487 275713 275341 274357 272924 271307 269487 267208
57710B67208k740k927l122l666m085l589k359j521j730k411k630k114j201l32
$$ 267208 264468 261541 258419 254753 250668 247079 244720 243199 241469 239058 236428 234314 233113 232781
57696B32781J58J72O8L94J169J736J506N86m43j068j061m33N85J715K787L715
$$ 232781 232939 233111 233179 233573 234742 236478 237984 238570 238127 237059 235998 235565 236150 237865 240652 244367
57680B44367M444N177O482Q775J1809J4999J8209K1734K5695L0008L4876M0643
$$ 244367 248811 253988 260470 269245 281054 296053 314262 335996 361691 391699 426575 467218
57668D67218M6853N2044N4695N3932M9138L9525K4875O486j2966l0508m3829n1757
$$ 467218 514071 566115 620810 674742 723880 763405 788280 794766 781800 751292 707463 655706
57656F55706n4400n2939m8894m3450l7410l1441k6104k1665j8103j5235j2756
$$ 655706 601306 548367 499473 456023 418613 387172 361068 339403 321300 306065 293309
57645B93309j0333p862n620l941k843k077j458r40m33J74P37R14O96O06J060J678
$$ 293309 282976 275114 269494 265553 262710 260633 259175 258235 257802 257976 258713 259627 260323 260929 261989 263667
57629B63667J676R52K11j19n15j421k283k202j314o21n80p55q56j188j789k078
$$ 263667 265343 266295 266506 266387 265872 264451 262168 259966 258652 258031 257451 256696 255840 254652 252863 250785
57613B50785j837j721k170k571k246j599j454j689j483o33K28N84M95J48l58q64
$$ 250785 248948 247227 245057 242486 240240 238641 237187 235498 234015 233382 233610 234194 234689 234837 234479 233615
57597B33615j287j836k575l055k950k693k869l263l281l032l064l295l102k436
$$ 233615 232328 230492 227917 224862 221912 219219 216350 213087 209806 206774 203710 200415 197313 194877
57583A94877j878j631j359j136j440k117k352j967j770k203k578k197j404r15
$$ 194877 192999 191368 190009 188873 187433 185316 182964 180997 179227 177024 174446 172249 170845 169930
57569A69930p70o09m28m78p19q89q03l28N63J433J544P71j39m29q0N52J264J838
$$ 169930 169160 168551 168123 167645 166926 166037 165234 164906 165469 166902 168446 169217 169078 168649 168569 169121 170385 172223
57551A72223J937J584J249J130Q57L30J38O53J220J022K73j52K9L58N17O81R86
$$ 172223 174160 175744 176993 178123 178980 179310 179448 180101 181321 182343 182616 182464 182493 182851 183368 184049 185035
57534A85035J248J286J174J073J032R84P85M01M5p3p4j94k17K89J131J537J232
$$ 185035 186283 187569 188743 189816 190848 191832 192617 193018 193063 192990 192916 192722 192505 192794 193925 195462 196694
57517A96694Q15O93M96rj64O52J880K406J928J045K79k19l30m5K62K97L35O17
$$ 196694 197509 198202 198698 198689 198525 199177 201057 203463 205391 206436 206715 206496 206166 206121 206383 206680 207015 207632
57499B07632O16l05j728k583k635k662l084l333k863j974j304j039j005j102j246
$$ 207632 208248 207943 206215 203632 200997 198335 195251 191918 189055 187081 185777 184738 183733 182631 181385
57484A81385j252j043p90o55n54l08J90R10J539J491M50r96j714j212k14R3p27
$$ 181385 180133 179090 178300 177645 177091 176783 176973 177883 179422 180913 181363 180367 178653 177441 177227 177320 176593
57467A76593k022k771k578j973j679j683j313k95P53J206J276J478J627J183L46
$$ 176593 174571 171800 169222 167249 165570 163887 162574 162279 163032 164238 165514 166992 168619 169802 170148
57452A70148OM89J072R69K39n17q83q15m76j69j30k26q6L56P32P12L77K2j68j09
$$ 170148 170154 170643 171715 172684 172923 172406 171523 170708 170232 170063 169933 169707 169621 169977 170709 171421 171798 171820 171652 171543
57432A71543K60R11J662K208K169J368K18m98m66j70J9N08J627K557K127N65o07
$$ 171543 171803 172714 174376 176584 178753 180121 180339 179841 179375 179205 179224 179732 181359 183916 186043 186608 186001
57415A86001n77r5k7r4K92Q55R57P25P51J020R17K56m23o19l34J80P02R61P60
$$ 186001 185424 185329 185302 185208 185500 186355 187312 188037 188788 189808 190725 190981 190558 189939 189605 189785 190487 191448 192208
57396A92208L32K43P28J308J279N43k55l66L18J252J873K121K265K460K610K559
$$ 192208 192540 192783 193511 194819 196098 196641 196386 196020 196338 197590 199463 201584 203849 206309 208919 211478
57380B11478K166J411O07K97N41O21l9q61p92J26P44N00J53M60R53Q19K48Q9N24
$$ 211478 213644 215055 215662 215959 216500 217121 217082 216221 215429 215555 216299 216799 216952 217412 218365 219184 219432 219521 220045
57361B20045R45R76Q10O38L94J82L15Q35J397J739J874J818J547J231J170J395
$$ 220045 220990 221966 222776 223414 223808 223990 224305 225140 226537 228276 230150 231968 233515 234746 235916 237311
57345B37311J615J607J372R86O12N64R87J455J330N68k00m37j85K90Q45J296J373
$$ 237311 238926 240533 241905 242891 243503 244067 245054 246509 247839 248407 248207 247770 247585 247875 248720 250016 251389
57328B51389J105R17J044J160Q78L99K09L58M46L10L39R05J800K414K397J941
$$ 251389 252494 253411 254455 255615 256493 256892 257101 257459 257905 258215 258554 259459 261259 263673 266070 268011
57312B68011J479J212J016P41M78M59P52J167J507J781K094K390K423K051J452
$$ 268011 269490 270702 271718 272459 272937 273396 274148 275315 276822 278603 280697 283087 285510 287561 289013
57297B89013R79Q02Q01Q17Q88J149J534J808J843J766J750J795J752J485R88M58
$$ 289013 289992 290794 291595 292412 293300 294449 295983 297791 299634 301400 303150 304945 306697 308182 309170 309628
57281C09628L01Q34J874K775L066K996L250M184N467O438O728O552O483O934P730
$$ 309628 309929 310763 312637 315412 318478 321474 324724 328908 334375 340813 347541 354093 360576 367510 375240
57266C75240Q286Q262P951P884Q181Q456Q334P857P370P151P167P119O799O418
$$ 375240 383526 391788 399739 407623 415804 424260 432594 440451 447821 454972 462139 469258 476057 482475
57252D82475O490P233Q154Q506Q094P445P128P117P000O658O543P084P993Q381
$$ 482475 488965 496198 504352 512858 520952 528397 535525 542642 549642 556300 562843 569927 577920 586301
57238E86301P805O971P035Q220R582J0301J0644J1256J1963J2047J1499J1225
$$ 586301 594106 601077 608112 616332 625914 636215 646859 658115 670078 682125 693624 704849
57226G04849J1798J2699J3070J2760J2278J2068J2317J3157J4565J6092J7157
$$ 704849 716647 729346 742416 755176 767454 779522 791839 804996 819561 835653 852810
57215H52810J7684J8203J9207K0567K1694K2223K2455K3062K4249K5344K5391
$$ 852810 870494 888697 907904 928471 950165 972388 994843 1017905 1042154 1067498 1092889
57204A092889K4171K2396K0878J9810J9019J8505J8305J8078J7356J6232J5420
$$ 1092889 1117060 1139456 1160334 1180144 1199163 1217668 1235973 1254051 1271407 1287639 1303059
57193A303059J5417J5981J6592J7192J8194J9838K1845K3680K5003K5774K6079
$$ 1303059 1318476 1334457 1351049 1368241 1386435 1406273 1428118 1451798 1476801 1502575 1528654
57182A528654K6029K5751K5273K4477K3333K2256K1884K2363K3129K3700K4376
$$ 1528654 1554683 1580434 1605707 1630184 1653517 1675773 1697657 1720020 1743149 1766849 1791225
57171A791225K5684K7399K8792K9825L1266L3408L5443L6601L7185L7786L8150
$$ 1791225 1816909 1844308 1873100 1902925 1934191 1967599 2003042 2039643 2076828 2114614 2152764
57160B152764L7803L7400L8295M0714M3468M5646M7618M9925N2142N3679N5002
$$ 2152764 2190567 2227967 2266262 2306976 2350444 2396090 2443708 2493633 2545775 2599454 2654456
57149B654456N6979N9089N9233N5771M9507M3439M0433M0949M2830M3278M1239
$$ 2654456 2711435 2770524 2829757 2885528 2935035 2978474 3018907 3059856 3102686 3145964 3187203
57138C187203L7899L5099L3570L2725L1709L0427K9733L0699L3466L6867L9537
$$ 3187203 3225102 3260201 3293771 3326496 3358205 3388632 3418365 3449064 3482530 3519397 3558934
57127C558934M1352M3276M5785M8213M9877N1125N2847N5737O0490O7786P7096
$$ 3558934 3600286 3643562 3689347 3737560 3787437 3838562 3891409 3947146 4007636 4075422 4152518
57116D152518Q6146R2744R7112J01439J07208J13597J18690J21790J24767J31648
$$ 4152518 4238664 4331408 4428520 4529959 4637167 4750764 4869454 4991244 5116011 5247659
57106E247659J46408J70386K01893K38808K81242L31546L92894M69169N65534
$$ 5247659 5394067 5564453 5766346 6005154 6286396 6617942 7010836 7480005 8045539
57097H045539O87889Q42048J034046J269438J549541J868176K213473K571912
$$ 8045539 8733428 9575476 10609522 11878960 13428501 15296677 17510150 20082062
57089B0082062K929001L268406L574559L834391M029512M126013M081861L873811
$$ 20082062 23011063 26279469 29854028 33688419 37717931 41843944 45925805 49799616
57081D9799616L515450L042671K482490J841978J126550L60571m13819j153151
$$ 49799616 53315066 56357737 58840227 60682205 61808755 62169326 61755507 60602356
57073F0602356j824685k408311k894816l283078l574260l766148l853577l834506
$$ 60602356 58777671 56369360 53474544 50191466 46617206 42851058 38997481 35162975
57065C5162975l715259l511442l245741k943948k629671k320461k027879j759774
$$ 35162975 31447716 27936274 24690533 21746585 19116914 16796453 14768574 13008800
57057A3008800j521105j313283j134694r82511q53543p43961o49907n68770m99143
$$ 13008800 11487695 10174412 9039718 8057207 7203664 6459703 5809796 5241026 4741883
57048D741883m39529l87941l42764l03085k68059k36796k08989j84840j64115
$$ 4741883 4302354 3914413 3571649 3268564 3000505 2763709 2554720 2369880 2205765
57039B205765j45948j29711j15339j02622r0879p9562o8619n7930m6968l5422
$$ 2205765 2059817 1930106 1814767 1712145 1621266 1541704 1473085 1415155 1368187 1332765
57029A332765k3786j2838k777O826J6114K4038K8356K6656J7730K200j7867l9561
$$ 1332765 1308979 1296141 1293364 1300190 1316304 1340342 1368698 1395354 1413084 1415284 1397417 1357856
57017A357856n9453p4346q2592q4672q2234p6748o9380o1396n3841m7018m0828
$$ 1357856 1298403 1224057 1141465 1056793 974559 897811 828431 767035 713194 666176 625348
57006F25348l5458l1079k7338k3916k1199j9547j8169j5939j3169j1367j1042
$$ 625348 589890 558811 531473 507557 486358 466811 448642 432703 419534 408167 397125
56995C97125j0968j0040q656p695p046o005m400k512l82K066M503O394P469P572
$$ 397125 386157 376117 367461 359766 352720 346715 342315 339803 339421 341487 345990 352384 359853 367425
56981C67425O432M035R26k345n724r185j2159j3958j4487j4009j2608j0383p884
$$ 367425 373857 377892 378818 376473 370749 361564 349405 335447 320960 306951 294343 283960 276076
56968B76076n734l927k052%K070M297O984R938J2542J4511J6031J7062J6981J5177
$$ 276076 270342 266415 264363 264363 266433 270730 277714 287652 300194 314705 330736 347798 364779 379956
56954C79956J1662O975J780l368q144j2478j6227j8811j9482j8118j5504j2640
$$ 379956 391618 398593 400373 397005 388861 376383 360156 341345 321863 303745 288241 275601
56942B75601r948p220m183q57K597O127R739J3205J6085J8208J9982K1784K3028
$$ 275601 265653 258433 254250 253393 255990 262117 271856 285061 301146 319354 339336 361120 384148
56929C84148K2295J8625J2409M785l342j1326j8263k3158k5673k6269k5614k4145
$$ 384148 406443 425068 437477 442262 438920 427594 409331 386173 360500 334231 308617 284472
56917B84472k2104j9584j6586j3390j0750r246q520p686o512n529m979m332l143
$$ 284472 262368 242784 226198 212808 202058 192812 184292 176606 170094 164565 159586 155254 152111
56904A52111j688l79R40K476L815M412M498M841N743O883Q081R517J1102J2270
$$ 152111 150423 150044 150984 153460 157275 161687 166185 171026 176769 183652 191733 201250 212352 224622
56890B24622J2713J2870J3372J4323J5361J6033J5812J4059J0497N635M00m584
$$ 224622 237335 250205 263577 277900 293261 309294 325106 339165 349662 355297 355697 351113
56878C51113q979j2260j3789j3497j2040j0062p667m768j588J672N372J0050J5527
$$ 351113 342134 329874 316085 302588 290548 280486 272819 268051 266463 268135 273507 283557 299084
56865B99084K0847K5341K9396L3844L8726M2927M4952M3794L9140L1088K0040
$$ 299084 319931 345272 374668 408512 447238 490165 535117 578911 618051 649139 669179
56854F69179O963o398j7910k6008l0454l2069l1604k9071k4252j7634j0358l216
$$ 669179 676142 669744 651834 625826 595372 563303 531699 502628 478376 460742 450384 447168
56842D47168L936J1629K0002K8780L7738M6759N5540O3528O9964P3588P2491O4982
$$ 447168 451104 462733 482735 511515 549253 596012 651552 715080 785044 858632 931123 996105
56830I96105N0965L2125J0666j1607l2803n0413o2236o7738o7920o4024n7028
$$ 996105 1047070 1079195 1089861 1078254 1045451 995038 932802 865064 797144 733120 676092
56819F76092m8190l9002l0202k1386j1986k212P349J6429K4936L2569L9075M4493
$$ 676092 627902 588900 558698 537312 525326 523114 530463 546892 571828 604397 643472 687965
56807F87965M8427M9317M5241L5632K1829N865j0688k6665m0700n1276n7351n8837
$$ 687965 736392 785709 830950 866582 888411 894276 883588 856923 816223 764947 707596 648759
56795F48759n6483n1400m4597l6891k9085k1897j5548r686l941J583O626J1318
$$ 648759 592276 540876 496279 459388 430303 408406 392858 383172 379231 380814 387440 398758
56783C98758J6011K0612K4334K6043K4704J9805J1865K355p248j6302k4527l1171
$$ 398758 414769 435381 459715 485758 510462 530267 542132 544487 537239 520937 496410 465239
56771D65239l5278l6763l6419l4807l1909k7988k3997k0639j7665j4646j1949
$$ 465239 429961 393198 356779 321972 290063 262075 238078 217439 199774 185128 173179
56760A73179j0324r746r310q265o703n226m247l737l464l243k934k326j299k57
$$ 173179 162855 153109 143799 135534 128831 123605 119358 115621 112157 108914 105980 103654 102355 102098
56746A02098L3n92j201q57K9K14n62j228j068p03q56j080o09K00L55k12n45j40
$$ 102098 102131 101539 100338 99481 99510 99724 99162 97934 96866 96163 95307 94227 93618 93818 94173 93961 93416 93276
56728I3276M85P91R37J206J367J115O80N67Q35J063R49P09P74J212J570J353O49
$$ 93276 93761 94552 95489 96695 98062 99177 99857 100424 101259 102322 103271 103980 104754 105966 107536 108889 109538
56711A09538J15L03J063J753J872J455R27O63O28M96K02J88P39J273R37j40q69
$$ 109538 109653 109956 111019 112772 114644 116099 117026 117689 118317 118813 119015 119203 119942 121215 122152 122012 121143
56694A21143p36m45o89j035p52j20k0n56j006r32n36M0Q88J743K011J565Q92L19
$$ 121143 120407 119962 119273 118238 117486 117366 117346 116790 115784 114852 114316 114356 115244 116987 118998 120563 121455 121774
56676A21774l28j076j503j339q83m56P4Q80J626J739J059l7r78j335j009l24J71
$$ 121774 121446 120370 118867 117528 116645 116189 116263 117143 118769 120508 121567 121530 120552 119217 118208 117884 118055
56659A18055J70j38l28j50K98P12Q99R98J262J556J395P21K08L99Q52P60J61j56
$$ 118055 118225 118087 117759 117609 117907 118619 119518 120516 121778 123334 124729 125450 125658 126057 126909 127669 127830 127674
56641A27674J58O79J092J625K368K882K832K456K054J515P49J19qK37N41Q42J181
$$ 127674 127832 128511 129603 131228 133596 136478 139310 141766 143820 145335 146084 146203 146195 146432 146973 147815 148996
56624A48996J408J434J433J471J248O10k6k10q9r6k53k86k23l80p57j010j013
$$ 148996 150404 151838 153271 154742 155990 156600 156574 156364 156275 156179 155926 155640 155417 155037 154280 153270 152257
56607A52257j028j211j374j344j296j484j852k001j613q20k18l15r63j465j362
$$ 152257 151229 150018 148644 147300 146004 144520 142668 140667 139054 138234 138016 137701 136738 135273 133911
56592A33911r06n64l14J90Q78J222R87O48P99J414J882J730J041K45k89l96m5
$$ 133911 133005 132441 132127 132317 133195 134417 135404 136052 136851 138265 140147 141877 142918 143163 142874 142478 142433
56575A42433P07J623K305K430K056J624J598K047K636K994L070L103L318L843
$$ 142433 143140 144763 147068 149498 151554 153178 154776 156823 159459 162453 165523 168626 171944 175787
56561A75787M879O605Q662R990R729Q310P053O526N884M194J857O5p09r65j119
$$ 175787 180666 187271 195933 205923 215652 223962 231015 237541 243425 247619 249476 249541 248832 247867 246748
56546B46748j080r37j176j899k520k685k944l889n022n166m011k677k423l165
$$ 246748 245668 244731 243555 241656 239136 236451 233507 229618 224596 219430 215419 212742 210319 207154
56532B07154l629k954j740j223j648k072j782j211j089j303j298j176j406j718
$$ 207154 203525 200571 198831 197608 195960 193888 192106 190895 189806 188503 187205 186029 184623 182905
56518A82905j320l17J59m42j256j295p67m50m07j51L16M86K60Q8K29M24M12L07
$$ 182905 181585 181268 181427 180985 179729 178434 177667 177217 176810 176659 176975 177461 177721 177809 178038 178462 178874 179181
56500A79181L03K63j21q44j461j494j033o78p32p18p8Q14R97K64m92n26j48p7
$$ 179181 179484 179747 179626 178782 177321 175827 174794 174116 173384 172666 172588 173402 174399 174663 174171 173645 173497 173420
56482A73420m64j004j481j672j226j46Q77J205J025R43J090J168J076R42Q00O83
$$ 173420 172956 171952 170471 168799 167573 167427 168304 169509 170534 171477 172567 173735 174811 175753 176553 177236
56466A77236Q27J258J470J032L52J71N33Q59Q94R09J011R13N21J38k1n3n3L0J16
$$ 177236 178063 179321 180791 181823 182175 182346 182879 183738 184632 185541 186552 187465 187986 188124 188103 188050 187997 188027 188143
56447A88143J9k19l38k78j97j22R0L98O17P17P39N89K75K11P27J366J392Q79N82
$$ 188143 188162 187943 187605 187327 187130 187008 187098 187496 188113 188830 189569 190158 190433 190644 191371 192737 194129 195008 195590
56428A95590O90N48j18n22L0R98J254M97n31j041q25j01P62J351J473J324J173
$$ 195590 196280 196828 196710 196188 196218 197216 198470 198967 198436 197395 196570 196469 197231 198582 200055 201379 202552
56411B02552R64N07l1j82J97O87P92M62Q7O8M59R33J058P92O08R47J507J416L80
$$ 202552 203516 204023 203992 203810 204007 204694 205486 205948 206035 206103 206562 207495 208553 209345 209953 210900 212407 213823 214203
56392B14203o85o09N34J434J168K33l22k56j4K87R52J870K430K421K294K274J945
$$ 214203 213518 212909 213443 214877 216045 216278 215956 215700 215686 215973 216925 218795 221225 223646 225940 228214 230159
56375B30159J085K62Q0L48N26N58O99Q39P20N28O44R28Q60L33j55j85J48M36L10
$$ 230159 231244 231506 231586 231934 232460 233018 233717 234556 235276 235804 236448 237376 238236 238569 238414 238229 238377 238813 239123
56356B39123k50p32m64M86J220J193J061J627K480K532J723J058R83Q05L4o93
$$ 239123 238873 238141 237677 238163 239383 240576 241637 243264 245744 248276 249999 251057 252040 252845 252879 252186
56340B52186n88R1N36O48J127K394L892M630M260L522L476M229M785M346L343
$$ 252186 251598 251689 252225 252873 254000 256394 260286 264916 269176 272698 276174 280403 285188 289534 292877
56325B92877K672K303J526M12m0O15J499J552P66j73q01r88o34J50R05J330J643
$$ 292877 295549 297852 299378 299790 299750 300365 301864 303416 304182 304009 303208 302220 301586 301736 302641 303971 305614
56308C05614K113K518K512K154J749J437J328J692K514L212L281L059L310M128
$$ 305614 307727 310245 312757 314911 316660 318097 319425 321117 323631 326843 330124 333183 336493 340621
56294C40621M752M567L833L291L307L586L612L267K981L228L955M646N002N221
$$ 340621 345373 349940 353773 357064 360371 363957 367569 370836 373817 377045 381000 385646 390648 395869
56280C95869N539N797N812N888O580P937R381J0330J0743J0902J0996J1071J1322
$$ 395869 401408 407205 413017 418905 425485 433422 442803 453133 463876 474778 485774 496845 508167
56267E08167J2069J3434J5178J6955J8707K0531K2364K4018K5638K7818L1052
$$ 508167 520236 533670 548848 565803 584510 605041 627405 651423 677061 704879 735931
56256G35931L5251L9931M4798M9885N5364O1424O8258P5885Q4073R2570J01317
$$ 735931 771182 811113 855911 905796 961160 1022584 1090842 1166727 1250800 1343370 1444687
56245A444687J10203J18759J26394J32760J37656J40713J41434J39451J34481
$$ 1444687 1554890 1673649 1800043 1932803 2070459 2211172 2352606 2492057 2626538
56236B626538J26227J14663J00216Q3318O3934M2062J8551n116k7829m9196o8843
$$ 2626538 2752765 2867428 2967644 3050962 3114896 3156958 3175509 3170393 3142564 3093368 3024525
56225C024525q5976r9888j10590j18655j24571j28305j29378j27441j22960j17229
$$ 3024525 2938549 2838661 2728071 2609416 2484845 2356540 2227162 2099721 1976761 1859532
56215A859532j11426j05689r9383r2164q4481p7091p0506o4879o0093n5813n1607
$$ 1859532 1748106 1642417 1543034 1450870 1366389 1289298 1218792 1153913 1093820 1038007 986400
56204I86400m7126m2258l7283l2907k9732k7522k5383k2815k0169j7819j5558
$$ 986400 939274 897016 859733 826826 797094 769572 744189 721374 701205 683386 667828
56193F67828j3241j1370j0338r667q713p665p084o857o411n637m771l730k459
$$ 667828 654587 643217 632879 623212 614499 606834 599750 592893 586482 580845 576074 572344 569885
56180E69885j566j627k122k112j658j523j674j274j37J024J814K449K848K634
$$ 569885 568319 566692 564570 562458 560800 559277 557603 556329 556192 557216 559030 561479 564327 566961
56166E66961K204K480L390L869L668L835M972O242O786O947P428Q172Q827R463
$$ 566961 569165 571645 575035 578904 582572 586407 591379 597621 604407 611354 618782 626954 635781 645244
56152F45244J0169J0699J1165J2282J4422J7026J9549K2233K5451K9031L2773
$$ 645244 655413 666112 677277 689559 703981 721007 740556 762789 788240 817271 850044
56141H50044L7037M2303M8631N5855O3703P1453P8214Q3667Q7754Q9583Q7767
$$ 850044 887081 929384 978015 1033870 1097573 1169026 1247240 1330907 1418661 1508244 1596011
56130A596011Q2259P4779O6965N9112N1157M3751L7558L2395K7627K2741J7093
$$ 1596011 1678270 1753049 1820014 1879126 1930283 1974034 2011592 2043987 2071614 2094355 2111448
56119B111448J0148K438m659j0652j6419k2637k8911l5135m2244n0742n9511o7068
$$ 2111448 2121596 2124034 2119375 2108723 2092304 2069667 2040756 2005621 1963377 1912635 1853124 1786056
56107A786056p2980p7171p8849p7313p3024o6992n9715n1573m3408l5894k9018
$$ 1786056 1713076 1635905 1557056 1479743 1406719 1339727 1280012 1228439 1185031 1149137 1120119
56096A120119k2804j7752j3956j0767p906n847m517k909q20M37O8o65j55J386
$$ 1120119 1097315 1079563 1065607 1054840 1046934 1041087 1036570 1033661 1032841 1033278 1033346 1032681 1032526 1033912
56082A033912K690L331L712M072M586N555O658O997O731P315R210J0856J1129
$$ 1033912 1036602 1039933 1043645 1047717 1052303 1057858 1064516 1071513 1078244 1085559 1094769 1105625 1116754
56069A116754J1141J2143J3241J3057J2349J2842J4476J5791J6332J6845J7632
$$ 1116754 1127895 1140038 1153279 1166336 1178685 1191527 1206003 1221794 1238126 1254971 1272603
56058A272603J8397J9179K0031K0445K0326K0676K1932K2793K2127K0867K0364
$$ 1272603 1291000 1310179 1330210 1350655 1370981 1391657 1413589 1436382 1458509 1479376 1499740
56047A499740K0159J9223J8200J8343J9255J9786K0239K1597K3473K4884K6202
$$ 1499740 1519899 1539122 1557322 1575665 1594920 1614706 1634945 1656542 1680015 1704899 1731101
56036A731101K8238L0222L0993L1314L2745L4914L6250L6767L7852L9796M1734
$$ 1731101 1759339 1789561 1820554 1851868 1884613 1919527 1955777 1992544 2030396 2070192 2111926
56025B111926M3508M5490M7196M8166M9433N1981N4689N6086N7126N9710O3399
$$ 2111926 2155434 2200924 2248120 2296286 2345719 2397700 2452389 2508475 2565601 2625311 2688710
56014B688710O6364O8731P2103P6385Q0049Q3045Q6731R1269R5778J00517J06361
$$ 2688710 2755074 2823805 2895908 2972293 3052342 3135387 3222118 3313387 3409165 3509682 3616043
56003C616043J12620J18013J23068J29048J35447J41280J47638J56023J65398
$$ 3616043 3728663 3846676 3969744 4098792 4234239 4375519 4523157 4679180 4844578
55994D844578J74021J82839J93750K06073K18383K32148K49493K68963K87918
$$ 4844578 5018599 5201438 5395188 5601261 5819644 6051792 6301285 6570248 6858166
55985F858166L07562L30896L57269L84047M12228M45076M82525N22529N66601
$$ 6858166 7165728 7496624 7853893 8237940 8650168 9095244 9577769 10100298 10666899
55976A0666899O18105O76471P39491Q09885Q92848R88767J095937J218971J366377
$$ 10666899 11285004 11961475 12700966 13510851 14403699 15392466 16488403 17707374 19073751
55967A9073751J541484J745166J986671K282283K645228L088556L636859M321379
$$ 19073751 20615235 22360401 24347072 26629355 29274583 32363139 35999998 40321377
55959D0321377N162207O169081P362675Q783714J0480699J2498693J4868345J7574499
$$ 40321377 45483584 51652665 59015340 67799054 78279753 90778446 105646791 123221290
55951A23221290K0528882K3591210K6594282K9268700L1098383L1317999K9181196
$$ 123221290 143750172 167341382 193935664 223204364 254302747 285620746 314801942
55944C14801942K4328361J6963623P773145k249054j1956942k0248204k6325575
$$ 314801942 339130303 356093926 363867071 361618017 349661075 329412871 303087296
55937C03087296k9884011l1087250l0387278k8343894k5511880k2363596j9235474
$$ 303087296 273203285 242116035 211728757 183384863 157872983 135509387 116273913
55930A16273913j6326479j3739525j1516689r651886q106497o834678n795374
$$ 116273913 99947434 86207909 74691220 65039334 56932837 50098159 44302785
55923D4302785m946949m246992l662792l173956k763324k413559k113202j857093
$$ 44302785 39355836 35108844 31446052 28272096 25508772 23095213 20982011 19124918
55915A9124918j638643j448517j281672j138249j016093r08916q13013p29366
$$ 19124918 17486275 16037758 14756086 13617837 12601744 11692828 10879815 10150449
55907A0150449o57720n94544n38115m89955m49680m13629l80033l50673l26053
$$ 10150449 9492729 8898185 8360070 7870115 7420435 7006806 6626773 6276100 5950047
55898E950047l03581k81885k62504k45872k29786k13258j98040j84994j72541
$$ 5950047 5646466 5364581 5102077 4856205 4626419 4413161 4215121 4030127 3857586
55889C857586j59928j48498j38625j28718j18372j09206j01633r4051q6290q0615
$$ 3857586 3697658 3549160 3410535 3281817 3163445 3054239 2952606 2858555 2772265 2691650
55879B691650p8126p7093p6029p5544p6082p6457p5778p4411p2245o8455o3740
$$ 2691650 2613524 2536431 2460402 2384858 2308776 2232319 2156541 2082130 2009885 1941430 1877690
55868A877690o0204n8250n6092n2951n0124m8212m6022m3046m0392l8400l5964
$$ 1877690 1817486 1759236 1703144 1650193 1600069 1551857 1505835 1462789 1422397 1383997 1348033
55857A348033l3085l1369l1057l0222k8065k6204k5565k4716k2849k1740k2859
$$ 1348033 1314948 1283579 1252522 1222300 1194235 1168031 1142466 1117750 1094901 1073161 1050302
55846A050302k4823k5594k5302k4987k4441k3090k1576k0622j9646j8040j6541
$$ 1050302 1025479 999885 974583 949596 925155 902065 880489 859867 840221 822181 805640
55835H05640j5921j5514j4487j3334j2778j2301j1136r677q684q009p278o923
$$ 805640 789719 774205 759718 746384 733606 721305 710169 700492 691808 683799 676521 669598
55823F69598p447q525r704j0994j2043j1875j0472r355r607j0376j0318r441q438
$$ 669598 662151 653626 643922 632928 620885 609010 598538 589183 579576 569200 558882 549441 541003
55810E41003p342o031n093n008n137m634l618k613j583l51Q17J853L170M603N101
$$ 541003 533661 527630 522537 517529 512392 507758 504140 501527 499944 499593 500410 502263 505433 510036 515137
55795E15137M352L631L950M459L838K334J094L14n93j598k204k571l308m437n593
$$ 515137 519489 523120 527070 531529 535367 537701 538795 539109 538516 536918 534714 532143 528835 524398 518805
55780E18805o925q730j0497j1422j1615j1815j2089j1759j0577r053p553n763
$$ 518805 511880 503150 492653 481231 469616 457801 445712 433953 423376 414323 406770 401007
55768D01007l297m09J980K853J845l87k715m504n642n874m980l672l240l863m277
$$ 401007 397710 397301 399281 402134 403979 403592 400877 396373 390731 384857 379877 376205 372965 369102 364825
55753C64825l697l001l326m416n341n879o216o078n335m800n207n857n552m460
$$ 364825 361128 358127 354801 350385 345044 339165 332949 326871 321536 316736 311529 305672 300120 295660
55739B95660l740l626l230k273j627j799k089j796j310j372j969k555k931l294
$$ 295660 291920 288294 285064 282791 281164 279365 277276 275480 274170 272798 270829 268274 265343 262049
55725B62049l684l969m218m654n181n320m719l579k438j625j125p79m18K24J311
$$ 262049 258365 254396 250178 245524 240343 235023 230304 226725 224287 222662 221537 220758 220340 220564 221875
55710B21875K514L247L514M042N136N906N333L661J942N00j106k802l878m288
$$ 221875 224389 227636 231150 235192 240328 246234 251567 255228 257170 257670 256564 253762 249884 245596
55696B45596m931o155p125p120o520n862m868l214j572q85j046j099n10M31J288
$$ 245596 240665 234510 227385 220265 213745 207883 203015 199801 198229 197344 196298 195199 194689 195120 196408
55681A96408J877K175K280K397K566K584K361K048J649R52O2n49q20j299k176
$$ 196408 198285 200460 202740 205137 207703 210287 212648 214696 216345 217297 217359 216810 215990 214691 212515
55666B12515k747k374j461q85q56q19j99J173K992M365M285K751J061M48P94J141
$$ 212515 209768 207394 205933 205048 204192 203373 203174 204347 207339 211704 215989 218740 219801 220249 221043 222184
55650B22184J034P94P60Q85R31O73Q7m16l62K2j02r25j619j674j859l025m624
$$ 222184 223218 224012 224772 225657 226588 227261 227348 226932 226570 226592 226490 225565 223946 222272 220413 217388 212764
55633B12764n433n373n493o262o901o626n639m655m013l590l143k534j783j078
$$ 212764 207331 201958 196465 190203 183302 176676 171037 166382 162369 158779 155636 153102 151319 150241
55619A50241o11m57o36j118j612j749j640j894k655l111k454j052n0Jm32o92o20
$$ 150241 149630 149173 148537 147419 145807 144058 142418 140524 137869 134758 132304 131252 131202 131203 130771 130079 129459
55602A29459m39l93o03r88j296j405j471j601j631j394j031p58n75m38m69p31
$$ 129459 129020 128627 128024 127036 125740 124335 122864 121263 119632 118238 117207 116449 115874 115436 114967 114236
55586A14236j014j107j018p61k31M36Q26P94P08Q22Q51N30J60J87N76J037J412
$$ 114236 113222 112115 111097 110336 110105 110541 111367 112161 112869 113691 114542 115072 115232 115419 115995 117032 118444
55569A18444J524J109L67J00P30J606J851J451Q82J14j128k416k813k086r88l23
$$ 118444 119968 121077 121444 121544 122274 123880 125731 127182 128064 128178 127050 124634 121821 119735 118747 118424
55553A18424k10l58n32o06n80n65o17o04m72l76l90k84Q3M95P25Q23Q09N43J95
$$ 118424 118214 117856 117324 116718 116138 115573 114956 114352 113880 113504 113114 112830 112913 113408 114133 114956 115765 116308 116503
55534A16503K81Q50J261J278J643K778L613K818P95o71o46R0M60L46J26k14r72
$$ 116503 116784 117634 118895 120173 121816 124594 128207 131025 131820 131149 130503 130593 131053 131399 131525 131311 130339
55517A30339k106l087l336k815k172k128k589k799k464k138k112j771o92L40L51
$$ 130339 128233 125146 121810 118995 116823 114695 112106 109307 106843 104705 102593 100822 100130 100470 100821
55502A00821l81q79r80j210j511j319o74j47K68R49J469R17m41j165o75l6j97
$$ 100821 100440 99561 98581 97371 95860 94541 93867 93720 93988 94937 96406 97323 96882 95717 95042 95006 94809
55485I4809o43n06LJ70O9K74P55R04N03j8k68l24m63p90j122j183q66l11L60J198
$$ 94809 94166 93660 93663 93833 93902 94176 94931 95835 96338 96320 96052 95728 95265 94475 93353 92170 91304 90993 91353 92551
55465I2551K045K299J539K65n22m77j11O5l5m19j071j530j187j87N41M49m8l18
$$ 92551 94596 96895 98434 98699 98177 97700 97589 97654 97619 97200 96129 94599 93412 93225 93766 94215 94167 93849
55447I3849l08k61k29j64r2P2M69Q87Q19J74m93o44k72L08P30N62l44j309j265
$$ 93849 93541 93280 93051 92887 92795 92867 93336 94223 95042 95216 94723 94079 93807 94115 94845 95407 95063 93754 92489
55428I2489n8J220J540J014L67r9n21q69q83m75K02R33J469J596J324R07N40K78
$$ 92489 92431 93651 95191 96205 96572 96473 95952 95083 94200 93725 93927 94860 96329 97925 99249 100156 100696 100974
55410A00974K04L49M48J76l19o33q22j320j989j976q85M44Q39J77n74m92L80J202
$$ 100974 101178 101527 101975 102151 101832 101199 100377 99057 97068 95092 94207 94651 95490 95667 95093 94601 94981 96183
55392I6183J212N09j07j64q4m02q89j024r68j178j301n74P08J294Q23L63P07J257
$$ 96183 97395 97904 97797 97633 97549 97147 96258 95234 94266 93088 91787 91213 91921 93215 94038 94401 95108 96365
55374I6365J271J112J411J836J686J040L80l92j547k577k666j858r66l97N0M40
$$ 96365 97636 98748 100159 101995 103681 104721 105101 104709 103162 100585 97919 96061 95095 94698 94748 95188
55358I5188M57l6q19j611k064j714m91Q63J455J219P30K99j71o04p47o46n91n84
$$ 95188 95645 95609 94790 93179 91115 89401 88910 89773 91228 92447 93177 93476 93305 92701 91954 91308 90717 90133
55340I0133l69K1L11M34N43O22N64N22O01M62j84q46p24Q8O34L90j78n35p51r88
$$ 90133 89764 89785 90096 90530 91073 91695 92259 92781 93382 93844 93660 92814 92090 92178 92812 93202 93024 92489 91738 90750
55320I0750r82n64j38j44l22p5O10J094Q90J65n59r21q53m94j56j51m84o94l01
$$ 90750 89768 89204 89066 88922 88600 88525 89135 90229 91119 91284 90725 89804 88951 88457 88301 88150 87666 86972 86671
55301H6671N12R45N38j22o9P61J424J264P11N12O46N58Q7l34l82j41K25O71J070
$$ 86671 87183 88128 88666 88544 88475 89236 90660 91924 92635 93147 93793 94351 94438 94104 93722 93581 93806 94477 95547
55282I5547J155Q21K92o1J5M74R01P38j16j069j348q26n1L97L81Q7k49m47l91
$$ 95547 96702 97523 97815 97754 97769 98243 99144 99882 99766 98697 97349 96523 96472 96869 97250 97337 97088 96641 96250
55263I6250n3N21J224J832K063J760R97N1o18n66J07N38l6j167j595r19j13Kn2
$$ 96250 96197 96718 97942 99774 101837 103597 104594 104645 104027 103461 103568 104106 104070 102903 101308 100389 100276 100278 100226
55244A00226N31J317J256L83k37k26l99j280k153k078j157j88M03P36R24Q81N91
$$ 100226 100757 102074 103330 103713 103476 103250 102851 101571 99418 97340 96183 95995 96398 97134 98058 98939 99530
55227I9530J77j98l51k13m5k58p82r69m44K47K99k39n40j45M85P07N50M66N53
$$ 99530 99707 99509 99158 98945 98900 98642 97860 96891 96447 96694 96993 96754 96214 96069 96554 97261 97811 98277 98830
55208I8830M88J55q6R4N45Q97R96Q57M60j10n04m81l12l69m64j57L89N38K66K66
$$ 98830 99318 99473 99387 99481 100026 100923 101919 102776 103236 103126 102622 102141 101829 101460 100996 100839 101228 101766 102032 102298
55188A02298O99O83l44j499j520n01L87N84N50O31M64j76q64j137j047p66k87
$$ 102298 102997 103680 103336 101837 100317 99816 100203 100787 101337 101968 102432 102256 101392 100255 99208 98442 98155
55171I8155J96K17k46m68Q0R54J301R23K89j96l72p5P24J582J931J779J610J567
$$ 98155 98351 98568 98322 97854 97934 98888 100189 101112 101401 101205 100833 100758 101482 103064 104995 106774 108384 109951
55153A09951J226L04q04j443j378q57l27j94o33j315j536r20J52J005J365J393
$$ 109951 111177 111481 110677 109234 107856 106999 106672 106478 105845 104530 102994 102074 102226 103231 104596 105989
55137A05989J202Q04L73Q8j97o75r66m42O80J272P05k54m61J38P07P47M71J26
$$ 105989 107191 107995 108368 108456 108259 107584 106618 106176 106856 108128 108833 108579 108118 108256 108963 109710 110181 110307
55119A10307j88k04L18J013J202P65J32n61j463k229k113j136k47qM0L48N58L17
$$ 110307 110119 109915 110233 111246 112448 113213 113345 112784 111321 109092 106979 105843 105596 105588 105628 105976 106534 106851
55101A06851R6M45J067J369J348J264R42J96n17o98n96o47n43J31P88M86m66p35
$$ 106851 106947 107392 108459 109828 111176 112440 113382 113578 113061 112363 111767 111120 110577 110708 111496 111982 111516 110781
55083A10781J10J053J209R56R94J194R92L77j78m25n00n72o35n92l71p7j9l66
$$ 110781 110891 111944 113153 114109 115103 116297 117289 117666 117488 117063 116563 115991 115356 114764 114393 114316 114297 113931
55065A13931q03q12k81M24R69J272J333J203J028Q25L64l51p64m72Jj19o55p93
$$ 113931 113128 112316 112035 112459 113428 114700 116033 117236 118264 119089 119453 119102 118338 117866 117867 117748 117093 116300
55047A16300n26p06j462j674o37P20R82P4q64j045p09l62r0L34R76J594J768J263
$$ 116300 115774 115068 113606 111932 111295 112015 112997 113071 112207 111162 110453 110091 110001 110335 111311 112905 114673 115936
55029A15936L37m35p84r33j193j553j822j847j526q15P4P72J100J100P43K0o86
$$ 115936 116273 115838 115054 114121 112928 111375 109553 107706 106180 105365 105439 106211 107311 108411 109154 109174 108488
55012A08488p98k89K70N34P30J005J009N79K29M62R60J049P05M87N86N98L14J76
$$ 108488 107690 107401 107671 108205 108935 109940 110949 111528 111757 112219 113179 114228 114933 115420 116006 116604 116918 117094
54994A17094O52J444J711J108L42L71J134J508P81k78l67N76J293R05j14q49j034
$$ 117094 117746 119190 120901 122009 122351 122722 123856 125364 126145 125867 125500 126076 127369 128274 128160 127311 126277
54977A26277q83m63J22M56K69q2r6J95M08M49M57M33L39L54O30Q76P16K83Jo2
$$ 126277 125394 124931 125053 125509 125778 125696 125600 125795 126203 126652 127109 127542 127881 128235 128865 129741 130457 130740 130741 130679
54957A30679j91m05l21K33Q79J055O13r5n87o52n12n17p29q68o87k74P2R3k26
$$ 130679 130488 130083 129762 129995 130874 131929 132542 132447 131860 131208 130696 130179 129450 128582 127895 127621 127693 127786 127560
54938A27560n73m47K81J057J210P51K03k19o40q76n05K33N58L77N66J589K744
$$ 127560 126987 126540 126821 127878 129088 129839 130042 129823 129183 128307 127802 128035 128593 128970 129536 131125 133869
54921A33869L309L564L977M267M159M280N219O288O415N817N564N738N341L955
$$ 133869 137178 140742 144719 148986 153145 157425 162644 168932 175347 181164 186728 192466 197807 201762
54907B01762K211N49j296l265m605m969m987n287n712n896n849n518m572l109
$$ 201762 203973 204522 203226 199961 195356 190387 185400 180113 174401 168505 162656 157138 152566 149457
54893A49457j928j580j698j659j401j145q64n29l30k44J50R46J600J781K000K736
$$ 149457 147529 145949 144251 142592 141191 140046 139182 138653 138323 138079 138229 139175 140775 142556 144556 147292
54877A47292L518L579L090K926L448M216M842N356N725N653M987L921K634J142
$$ 147292 150810 154389 157479 160405 163853 168069 172911 178267 183992 189645 194632 198553 201187 202329
54863B02329m62j931l119m032m621m784m585m300m179m326m737n196n284m702
$$ 202329 201867 199936 196817 192785 188164 183380 178795 174495 170316 165990 161253 156057 150773 146071
54849A46071l603k466j683j413j579j851j833j524j386j668j930j610q62l67m24
$$ 146071 142468 140002 138319 136906 135327 133476 131643 130119 128733 127065 125135 123525 122663 122296 121872
54834A21872o53n80j16N13R35P95J65l15p5O06R46P01M08M99P79Q81P28L90p1
$$ 121872 121219 120639 120523 121036 121971 122766 122931 122616 122541 123147 124093 124794 125202 125701 126480 127361 128089 128479 128408
54815A28408l87k69J03K07P0L18J050J365N77o78j248r37l98R0P42J377J360O94
$$ 128408 128021 127752 127855 128062 128132 128450 129500 130865 131442 130764 129516 128579 128181 128271 129013 130390 131750 132444
54797A32444K03L65O93O72N64P39Q51L91k97m10O9L07j54p83r45p27n70m96l15
$$ 132444 132647 133012 133705 134377 134941 135680 136531 136922 136625 136215 136284 136591 136437 135654 134709 133982 133412 132916 132601
54778A32601k56p67j657k013j221L07J739K755L499L915L751L236L063L486M020
$$ 132601 132345 131578 129921 127908 126687 126994 128733 131488 134987 138902 142653 145889 148952 152438 156458
54763A56458M384N054O344P457P325O174N266N077M703L333J400k18j434k685
$$ 156458 160842 165896 172240 179697 187022 193196 198462 203539 208242 211575 212975 212757 211323 208638
54749B08638m009n126n960o438o123m920l773l781m635m932m046k809k113j801
$$ 208638 204629 199503 193543 187105 180982 176062 172289 168508 163873 158941 154895 152086 149973 148172
54735A48172j394j012q91o69L0P00N15l52p90j44J069K014K464K699K944L269
$$ 148172 146778 145766 144875 144206 144236 144936 145451 145099 144309 144165 145234 147248 149712 152411 155355 158624
54719A58624L740M352M927N303N510N539N210M463L662L168K679J435p33l018
$$ 158624 162364 166716 171643 176946 182456 187995 193205 197668 201330 204498 207177 208612 207879 204861
54705B04861m584n548o583p621p750o493m658l410k923k453j569o85l22l82l89
$$ 204861 200277 194729 188146 180525 172775 166282 161624 158214 155291 152838 151269 150584 150262 149880 149491
54690A49491j45R1q9q38j811k344k023j167n06m01n63n35k34P5R0k88p94r42n13
$$ 149491 149346 149437 149348 148510 146699 144355 142332 141165 140659 140258 139695 139160 138926 139001 139091 138803 138009 137067 136554
54671A36554O0J49k66n75m20j03J2K7J54K34K4l29m84m63n93j022j467j466p23
$$ 136554 136614 136763 136497 135922 135502 135399 135411 135438 135592 135826 135850 135521 135037 134574 133981 132959 131492 130026 129303
54652A29303O32J934K432K027J402J171J156P66j24j044j453j096J5J492K550
$$ 129303 129935 131869 134301 136328 137730 138901 140057 140823 140699 139655 138202 137106 137121 138613 141163
54637A41163K453J140p14k160k482j591k14N57K79m58r19j125j450j711j335l14
$$ 141163 143616 144756 144042 141882 139400 137809 137595 138152 138431 137973 137054 135929 134479 132768 131433 131119
54621A31119P23J335J589J575J274R35Q68P79N8j058j449o41L91N26Nj35L45P23
$$ 131119 131842 133177 134766 136341 137615 138550 139418 140197 140255 139197 137748 137107 137498 138024 138029 137894 138239 138962
54603A38962N39J81J96O06J046J085M68n88j336j192m74N0J98M76J078J496J352
$$ 138962 139501 139682 139878 140484 141530 142615 143083 142495 141159 139967 139493 139543 139741 140217 141295 142791 144143
54586A44143R51O98M52p1p15j086j044o19J97J123J433P15l88q60n59k29l39n88
$$ 144143 145094 145792 146244 146173 145458 144372 143328 142709 142906 144029 145462 146177 145789 144929 144370 144141 143802 143214
54568A43214o39o19p00p55o78n96n13k31J22J9p20j544j839j564r07R8J116J303
$$ 143214 142575 141956 141256 140501 139823 139227 138714 138483 138605 138624 137904 136360 134521 132957 132050 132148 133264 134567
54550A34567K76j054j425q03k60l63m87J03J194J965K011J748J871K501K869K152
$$ 134567 134843 133789 132364 131561 131301 130938 130451 130554 131748 133713 135724 137472 139343 141844 144713 146865
54534A46865P01j22K84Q01K20q47p62O83J942J882J056L94j25r03j739k145j998
$$ 146865 147566 147444 147728 148529 148749 147902 147140 147823 149765 151647 152703 153097 152972 152069 150330 148185 146187
54517A46187j342j51J151J670J133L65J07j1o14j414j663j344r95p87n64m67o84
$$ 146187 144845 144694 145845 147515 148648 149013 149120 149109 148495 147081 145418 144074 143079 142292 141728 141261 140577
54500A40577q42m11N00J337J882K119J693M42q19r93j52N08J97p17j470j643j160
$$ 140577 139735 139324 139824 141161 143043 145162 146855 147297 146478 145485 145333 145841 146038 145321 143851 142208 141048
54483A41048k74L70L40J04M18J113J307Q49N91J041J614J638J294J050Q37L41
$$ 141048 140774 141144 141484 141588 142006 143119 144426 145275 145866 146907 148521 150159 151453 152503 153340 153681
54467A53681l46q59j002p43q0P33J206J134Q58P37P09N72L52J49r7m39p90j051
$$ 153681 153335 152476 151474 150731 150651 151384 152590 153724 154582 155319 156028 156600 156952 157101 157004 156565 155775 154724
54449A54724j187j085o73k14r2k35k24j8l8m02n93k04M39O75K75m60r96r03j99
$$ 154724 153537 152452 151779 151565 151473 151238 151014 150996 150958 150556 149963 149759 150198 150873 151148 150688 149692 148789 148590
54430A48590M97N42L8l56m16m86n96k07Q79J990K412K177J638Q89P2l41j83Qk22
$$ 148590 149087 149629 149667 149311 148895 148409 147813 147606 148485 150475 152887 155064 156702 157591 157663 157322 157139 157147 156925
54411A56925m82j71M98Q28O37K65j62p32j165r71k31L83M68K59J28J75L86P73
$$ 156925 156443 156272 156770 157598 158235 158500 158338 157606 156441 155470 155239 155622 156090 156349 156477 156652 157038 157811
54393A57811J185J366J295J178J065P72K99qJ29M67M97Q3l00j22M58O75J67m24
$$ 157811 158996 160362 161657 162835 163900 164672 164971 164963 165092 165559 166056 166139 165839 165717 166175 166850 167017 166593
54375A66593k97K57K27n10q43m9J032J165M33p2O5J49m17j247j504q08N02J641
$$ 166593 166296 166553 166780 166270 165427 165378 166410 167575 168008 167936 168001 168150 167733 166486 164982 164174 164676 166317
54357A66317J943J445Q54N93K32o97j663j728j009n89q88j123o95j57j60k47L84
$$ 166317 168260 169705 170559 171152 171384 170687 169024 167296 166287 165698 164810 163687 162992 162835 162675 162428 162812
54340A62812J434J806J283Q55J176J519Q56n01j099j48J456K168J570O86O51J452
$$ 162812 164246 166052 167335 168190 169366 170885 171741 171240 170141 169993 171449 173617 175187 175873 176524 177976
54324A77976K198K363K337K744L577M269M421M132L672L122K516K042J788J421
$$ 177976 180174 182537 184874 187618 191195 195464 199885 204017 207689 210811 213327 215369 217157 218578
54310B18578N16q00j846k255k496l281m583n610n657m740l433k334j746j621j715
$$ 218578 219094 218294 216448 214193 211697 208416 203833 198223 192566 187826 184393 182059 180313 178692 176977
54295A76977j821j870j774j400q08k82J0J60J57k05p70q37j30N29K33o31r18m26
$$ 176977 175156 173286 171512 170112 169304 169022 169032 169192 169349 169144 168374 167537 167407 167936 168169 167538 166620 166194
54277A66194n8k79m95k04K60M94O40P26L90k16j99O40J117L39p81q01J11N99K11
$$ 166194 166136 165857 165362 165158 165418 165912 166552 167278 167668 167452 167253 167893 169010 169349 168568 167767 167878 168477 168688
54258A68688k48k87k49j95M19J568K293K036J494J507J795J466L35r07j607j694
$$ 168688 168440 168153 167904 167709 168128 169696 171989 174025 175519 177026 178821 180287 180622 179715 178108 176414
54242A76414j432j011m60K09Q26J114J001P58O28M62j5o67j055r99o86k69J94
$$ 176414 174982 173971 173511 173720 174546 175660 176661 177419 178047 178509 178494 177827 176772 175773 175087 174818 175012
54225A75012M70K52l71r01j002p57m26k03k15m32n83m85l33l92n16m46l27m19
$$ 175012 175482 175734 175363 174462 173460 172703 172277 172074 171859 171427 170844 170359 170026 169634 169118 168672 168345 167926
54207A67926m44N5P99R95N34K10M77P34L10n42j041r09m41L8M02N92O86Q68J110
$$ 167926 167482 167537 168336 169331 169865 170075 170552 171286 171596 171054 170013 169104 168663 168701 169103 169695 170381 171249 172359
54188A72359J076O00l9m79o42n31p1N82R60Q25M92L09K07M4KK84O70Q82J006J132
$$ 172359 173435 174035 173996 173517 172875 172344 172273 172855 173815 174640 175132 175441 175648 175692 175694 175978 176648 177530 178536 179668
54168A79668Q92k9j124j537j181q20r47j265j357j258j099p36j30L02K30O2M95
$$ 179668 180560 180531 179407 177870 176689 175869 174922 173657 172300 171042 169943 169207 169077 169379 169609 169671 170166
54151A70166J464K009J390K2r29q27j48J88j29n79n72j50K20L10L17M15N19N83
$$ 170166 171630 173639 175029 175051 174122 173295 173147 173335 173206 172627 172055 171905 172125 172435 172752 173167 173686 174269
54133A74269Q11J245J422Q67j67q98r83q26p94o86k76N3j88p88j040o26J83J082
$$ 174269 175080 176325 177747 178614 178447 177549 176566 175740 174946 174260 173984 174037 173849 173061 172021 171395 171578 172660
54115A72660J861K120J537N54J21N31J081J086P08N02O48R97J330J303O26l48
$$ 172660 174521 176641 178178 178732 178853 179384 180465 181551 182259 182761 183409 184406 185736 187039 187665 187317
54099A87317p70m36j35m48q73p84n27p45j146r74l09J16J46K85O43Q30P93Q42
$$ 187317 186547 186111 185976 185528 184655 183871 183344 182599 181453 180479 180170 180286 180432 180717 181360 182190 182983 183825
54081A83825Q18L13l05j57O49R23K15l91J04J145J586J303J053J163J307J250
$$ 183825 184643 184956 184651 184494 185143 186066 186281 185890 185994 187139 188725 190028 191081 192244 193551 194801
54065A94801J076Q47N88N34Q68J285J280Q15L99M73R60J399J399J026P46Q96J229
$$ 194801 195877 196724 197312 197846 198714 199999 201279 202094 202493 202966 203926 205325 206724 207750 208496 209392 210621
54048B10621J307J249J611K464L180L306L166L285L659M041M496N194N946O384
$$ 210621 211928 213177 214788 217252 220432 223738 226904 230189 233848 237889 242385 247579 253525 259909
54034B59909O444O317O103N869N875O394P284P949P795O703N196M151M076M608
$$ 259909 266353 272670 278773 284642 290517 296911 304195 312144 319939 326642 331838 335989 340065 344673
54020C44673M891M402L152J291q89k643l123k384j489j373k021k899l662m171
$$ 344673 349564 353966 357118 358409 357520 354877 351754 349370 347881 346508 344487 341588 337926 333755
54006C33755m379m512m873n173m614l022j246l1R90K562M676O801Q804J0892J2843
$$ 333755 329376 324864 319991 314818 310204 307182 305936 305905 306895 309457 314133 320934 329738 340630 353473
53991C53473J4061J4207J3266J1111P593L008j990o867j1217j4465j6146j6403
$$ 353473 367534 381741 395007 406118 413711 416719 414729 407862 396645 382180 366034 349631
53979C49631j5815j4753j3261j1469r716q255p141o291n521m657l833l437l496
$$ 349631 333816 319063 305802 294333 284617 276362 269221 262930 257409 252752 248919 245482 241986
53966B41986l465k874j918j019k32M94Q56N46j48o42p91p89o13p2P08J384J914
$$ 241986 238521 235647 233729 232710 232478 232972 233828 234374 234226 233584 232793 232004 231391 231319 232027 233411 235325
53949B35325K463K891K833K299J796J822K472L433M193M415M339M460M696M449
$$ 235325 237788 240679 243512 245811 247607 249429 251901 255334 259527 263942 268281 272741 277437 281886
53935B81886L803L854N189O670O705N307L872L209K969K901L430M675N872O279
$$ 281886 285689 289543 294732 301402 308107 313414 317286 320495 323464 326365 329795 334470 340342 346621
53921C46621O011N662N617O037O936P998Q750R067R123Q932Q471Q195Q653R392
$$ 346621 352632 358294 363911 369948 376884 384882 393632 402699 411822 420754 429225 437420 446073 455465
53907D55465R171P497N210L234J523k54j789k580k855l244l886m422m742n107
$$ 455465 464636 472133 477343 480577 482100 481846 480057 477477 474622 471378 467492 463070 458328 453221
53893D53221n673o332p017p775q556r216r668r855r723r357q978q622q016p023
$$ 453221 447548 441216 434199 426424 417868 408652 398984 389129 379406 370049 361071 352449 344433 337410
53879C37410o000n433n352n342n033m383l610l076l091l555l875l517k630j882
$$ 337410 331410 325977 320625 315283 310250 305867 302257 299181 296090 292535 288660 285143 282513 280631
53865B80631j676j810j988k291k860l318l068k174j466j508j890j973j873k020
$$ 280631 278955 277145 275157 272866 270006 266688 263620 261446 259980 258472 256582 254609 252736 250716
53851B50716k061j186L58J147M06r03j341o25N92J795K625K532J475N52R38K338
$$ 250716 248655 247469 247827 248974 249380 248477 247136 246511 247103 248898 251523 254055 255530 256082 257020 259358
53835B59358L485L887M101M470M805N324O770R284J2096J4613J6949J9200K1018
$$ 259358 262843 266730 270831 275301 280106 285430 292200 301484 313580 328193 345142 364342 385360
53822C85360K2209K2826K2399J9951J5163Q763J542o013j2860j7422j9176j9318
$$ 385360 407569 430395 452794 472745 487908 496671 498213 492200 479340 461918 442742 423424
53810D23424j9022j7974j5466j2055r021o709m505k098J93K128L742M950N765
$$ 423424 404402 386428 370962 358907 349886 343177 338672 336574 336767 338895 342637 347587 353352
53797C53352O632P902R050R269Q625Q007P904P945P523O302M188J502r67k645
$$ 353352 359984 367886 376936 386205 394830 402837 410741 418686 426209 432511 436699 438201 437234 434589
53783D34589l895n440p182q365q790r035r381r424q998q686q943r375r393r062
$$ 434589 430694 425254 418072 409707 400917 391882 382501 373077 364079 355393 346450 337075 327682 318620
53769C18620q718q203p126n731m795m609m603m188l547l255l353l221k421j327
$$ 318620 309902 301699 294573 288842 284047 279438 274835 270647 267100 263845 260492 257271 254850 253523
53755B53523p37r33j450j658j355p66k00O3j90r15j661j836j233k28N89R75J167
$$ 253523 252786 251853 250403 248745 247390 246624 246424 246487 246297 245382 243721 241885 240652 240424 241013 241988 243155
53738B43155J386J384Q00n4l25K20O66J94o17n47M72J270J191Q34P74N93j12p23
$$ 243155 244541 245925 246725 246671 246346 246566 247232 247426 246809 246262 246734 248004 249195 250029 250803 251396 251284 250561
53720B50561m25N07J141J227J212J264J156J024J329K038K528K489K288K285K297
$$ 250561 250136 250643 251784 253011 254223 255487 256643 257667 258996 261034 263562 266051 268339 270624 272921
53705B72921J994J447J085J278K061L031L553L310K641K141K017K110K367K841
$$ 272921 274915 276362 277447 278725 280786 283817 287370 290680 293321 295462 297479 299589 301956 304797
53691C04797L329L360K671J483L16l40l12L6P9l89q97j001q45p36n58j71%n18
$$ 304797 308126 311486 314157 315640 315956 315616 315304 315340 315419 315030 314133 313132 312287 311551 310993 310822 310822 310304
53673C10304j319j542j131q76j121j260q27l26m55j066j414j195q42q93j396j845
$$ 310304 308985 307443 306312 305436 304315 303055 302228 301902 301447 300381 298967 297772 296930 296037 294641 292796
53657B92796j568l56J173J973J541L27p75j167p65J53J134J785J988J828J335
$$ 292796 291228 290872 292045 294018 295559 295886 295111 293944 293179 293332 294466 296251 298239 300067 301402
53642C01402N98O7L11J289K225K416J962J473J311J319J162P46L64N07J374K461
$$ 301402 302000 302067 302378 303667 305892 308308 310270 311743 313054 314373 315535 316281 316645 317152 318526 320987
53626C20987K977K719K337K513L085L316K852K085J613J657K073K684L380M018
$$ 320987 323964 326683 329020 331533 334618 337934 340786 342871 344484 346141 348214 350898 354278 358296
53612C58296M406M423M045L357K618K310K773L663M078L552K703K444K709K526
$$ 358296 362702 367125 371170 374527 377145 379455 382228 385891 389969 393521 396224 398668 401377 403903
53598D03903J488L54k6J96M21O29J109J491R76m48j770k156j901j861k331k805
$$ 403903 405391 405745 405719 405915 406336 406965 408074 409565 410541 410093 408323 406167 404266 402405 400074 397269
53582C97269k635j823j061r97j433j571j141q61j406k379k899k857k770k595j759
$$ 397269 394634 392811 391750 390753 389320 387749 386608 385747 384341 381962 379063 376206 373436 370841 369082
53567C69082l94M13N6o76o95%O70J044J428J877K006J688J397J571J949J833R72
$$ 369082 368688 369101 369157 368481 367786 367786 368456 369500 370928 372805 374811 376499 377896 379467 381416 383249 384221
53550C84221L0J1J195K859M163N066O058P147P718P490P066P265Q196R290R972
$$ 384221 384251 384262 385457 388316 392479 397545 403603 410750 418468 425958 433024 440289 448485 457775 467747
53535D67747J0042R577Q754P735O604N462M563M204M461N211O362P807R124R833
$$ 467747 477789 487366 496120 503855 510459 515921 520484 524688 529149 534360 540722 548529 557653 567486
53521E67486R969J0207J1149J2774J4598J6168J7312J8215J9265K0635K1953K2721
$$ 567486 577455 587662 598811 611585 626183 642351 659663 677878 697143 717778 739731 762452
53509G62452K3003K3375K4166K5130K5859K6079K5586K4434K3243K2742K2816
$$ 762452 785455 808830 832996 858126 883985 910064 935650 960084 983327 1006069 1028885
53498A028885K2612K1715K0685K0124J9899J9654J9458J9427J9239J8566J7661
$$ 1028885 1051497 1073212 1093897 1114021 1133920 1153574 1173032 1192459 1211698 1230264 1247925
53487A247925J7009J6747J6771J7043J7328J7152J6428J5726J5363J4737J3249
$$ 1247925 1264934 1281681 1298452 1315495 1332823 1349975 1366403 1382129 1397492 1412229 1425478
53476A425478J1346R859Q650O813M103J231j254l518n797p965r906j1691j3160
$$ 1425478 1436824 1446683 1455333 1462146 1466249 1467480 1466226 1462708 1456911 1448946 1439040 1427349 1414189
53463A414189j3939j4121j4415j5325j6591j7650j8237j8420j8431j8619j9210
$$ 1414189 1400250 1386129 1371714 1356389 1339798 1322148 1303911 1285491 1267060 1248441 1229231
53452A229231j9875j9993j9486j8969j8972j9383j9876k0311k0338j9217j6672
$$ 1229231 1209356 1189363 1169877 1150908 1131936 1112553 1092677 1072366 1052028 1032811 1016139
53441A016139j3601j1307j0019q797o911m794l301k531j790o23O93J755K743M081
$$ 1016139 1002538 991231 981212 972415 965504 960710 957409 954878 953088 952465 953158 954913 957656 961737
53427I61737N612O614O766O719P376Q894J0709J2372J3935J5556J7159J8613J9989
$$ 961737 967349 973963 980729 987448 994824 1003718 1014427 1026799 1040734 1056290 1073449 1092062 1112051
53414A112051K1482K3194K5079K6986K8768L0456L2334L4652L7251L9595M1267
$$ 1112051 1133533 1156727 1181806 1208792 1237560 1268016 1300350 1335002 1372253 1411848 1453115
53403A453115M2381M3478M5049M7050M8905N0128N0945N2025N3505N4658N4850
$$ 1453115 1495496 1538974 1584023 1631073 1679978 1730106 1781051 1833076 1886581 1941239 1996089
53392A996089N4466N4374N4701N4670N3748N2314N1058N0099M9039M7536M5493
$$ 1996089 2050555 2104929 2159630 2214300 2268048 2320362 2371420 2421519 2470558 2518094 2563587
53381B563587M2809L9304L5078L0679K6671K2916J8562J3149P474K808q37m931
$$ 2563587 2606396 2645700 2680778 2711457 2738128 2761044 2779606 2792755 2800229 2803037 2802200 2797269
53369B797269j0586j7177k3431k9099l4710m0140m4619m8024n0914n3269n4373
$$ 2797269 2786683 2769506 2746075 2716976 2682266 2642126 2597507 2549483 2498569 2445300 2390927
53358B390927n4282n4165n4558n4385n2603n0002m8286m7842m7512m6307m4448
$$ 2390927 2336645 2282480 2227922 2173537 2120934 2070932 2022646 1974804 1927292 1880985 1836537
53347A836537m2783m1924m1965m2406m2370m1422m0044l8799l7306l4837l1747
$$ 1836537 1793754 1751830 1709865 1667459 1625089 1583667 1543623 1504824 1467518 1432681 1400934
53336A400934k9309k7972k6786k4878k2692k1147k0269j9384j8204j7038j6089
$$ 1400934 1371625 1343653 1316867 1291989 1269297 1248150 1227881 1208497 1190293 1173255 1157166
53325A157166j5279j4662j4383j4165j3368j1776r917q417p360o466n588m703
$$ 1157166 1141887 1127225 1112842 1098677 1085309 1073533 1063616 1055199 1047839 1041373 1035785 1031082
53313A031082l559j750P35L268N072N969O514P354Q569R769J0777J2005J3969
$$ 1031082 1027523 1025773 1026508 1029776 1034848 1040817 1047331 1054685 1063254 1073023 1083800 1095805 1109774
53300A109774J6555J9015K0762K1917K2989K4180K5233K5904K6294K6656K7097
$$ 1109774 1126329 1145344 1166106 1188023 1211012 1235192 1260425 1286329 1312623 1339279 1366376
53289A366376K7488K7520K6805K5183K3071K1236J9993J8841J7122J4801J2281
$$ 1366376 1393864 1421384 1448189 1473372 1496443 1517679 1537672 1556513 1573635 1588436 1600717
53278A600717R607O423K699r87m061o519q673j0743j2883j5267j7838k0207k2117
$$ 1600717 1610324 1616747 1619446 1618459 1614398 1607879 1599206 1588463 1575580 1560313 1542475 1522268 1500151
53265A500151k3689k4973k5607k5418k5093k5622k7044k8254k8262k7261k6261
$$ 1500151 1476462 1451489 1425882 1400464 1375371 1349749 1322705 1294451 1266189 1238928 1212667
53254A212667k5961k6124k6001k5255k4411k4319k5121k6052k6490k6741k7304
$$ 1212667 1186706 1160582 1134581 1109326 1084915 1060596 1035475 1009423 982933 956192 928888
53243I28888k7701k6945k5104k3496k3000k2975k2345k0988j9424j7708j5594
$$ 928888 901187 874242 849138 825642 802642 779667 757322 736334 716910 699202 683608
53232F83608j3462j2133j1654j1183j0174r096q659q923r465r969j0311j0440
$$ 683608 670146 658013 646359 635176 625002 615906 607247 598324 588859 578890 568579 558139
53220E58139j0491j0719j1052j1065j0681j0507j0972j1505j1099r627p996p008
$$ 558139 547648 536929 525877 514812 504131 493624 482652 471147 460048 450421 442425 435417
53208D35417o644o514o561o861p176p067o457n791n565n840o166n951m976l637
$$ 435417 428773 422259 415698 408837 401661 394594 388137 382346 376781 370941 364775 358824 353848 350211
53194C50211k665k510k973l440l454l060k637k502k616k706k573k250j893j674
$$ 350211 347546 345036 342063 338623 335169 332109 329472 326970 324354 321648 319075 316825 314932 313258
53180C13258j756k160k504k210j218k77j19m80n44j88j49p11j106o89m4j33p59
$$ 313258 311502 309342 306838 304628 303410 303133 303014 302534 301990 301802 301653 300942 299836 299147 299103 298970 298211
53163B98211q32r7M69J85l30k44J98K45O3N47J820K812K609J521M44l09r63j514
$$ 298211 297379 297282 297751 297936 297606 297362 297560 297805 297868 298415 300235 303047 305656 307177 307621 307312 306349 304835
53145C04835j693j604j734k134k142j276p1M70J09l98l26K08N89N24J67l18q66
$$ 304835 303142 301538 299804 297670 295528 294252 294181 294651 294760 294362 294036 294244 294833 295357 295524 295206 294340
53128B94340j239j070m32N5o8m58m43m8j6p24j516j537q61k77p3K70J023J553
$$ 294340 293101 292031 291599 291654 291586 291128 290685 290637 290621 289897 288381 286844 285983 285706 285633 285903 286926 288479
53110B88479J182K92j26J42L42j1m22l09J9j86r64j619j734j639j776k093k246
$$ 288479 289661 289953 289827 289969 290311 290300 289878 289569 289588 289402 288438 286819 285085 283446 281670 279577 277331
53093B77331k071j641j110p23p29j028j114o52J1J99k84r76j358j349j102o48
$$ 277331 275260 273619 272509 271786 271057 270029 268915 268263 268274 268473 268189 267213 265855 264506 263404 262756
53077B62756KO63J076J207J222J215J144J008Q28M80j84r32j183o53J80O01M80
$$ 262756 262758 263421 264497 265704 266926 268141 269285 270293 271121 271601 271417 270485 269302 268649 268829 269430 269910
53060B69910K85L41N08N74N49M85L31K28N84J484K320K454K065J913K326K836
$$ 269910 270195 270536 271044 271618 272167 272652 272983 273211 273795 275279 277599 280053 282118 284031 286357 289193
53044B89193K883K443J885J446J055M09p10k018k711k303j447j355k219k857k269
$$ 289193 292076 294519 296404 297850 298905 299314 298604 296586 293875 291572 290125 288770 286551 283694 281425
53029B81425j020m70r94j717j860j589j361j100l99P59J869K346J947R16j80q71
$$ 281425 280405 279935 278941 277224 275364 273775 272414 271314 270915 271674 273543 275889 277836 278752 278572 277701
53013B77701j128j197j117o85P2P44R55O75L8q30j621j832j238k26O16J036J050
$$ 277701 276573 275376 274259 273574 273646 274390 275345 276020 276058 275228 273607 271775 270537 270311 270927 271963 273013
52996B73013O94J27k37j53O5Jk23j70K02N47P91J145J463J272N81M5j6n9l54k67
$$ 273013 273707 273834 273597 273444 273509 273510 273287 273117 273319 273866 274657 275802 277265 278537 279118 279163 279147 279088 278734 278467
52976B78467P88K130K453J614R11J422K720L511L087J782L70n17n95P6J150K212
$$ 278467 279255 281385 283838 285452 286363 287785 290505 294016 297103 298885 299255 298738 298143 298219 299369 301581
52960C01581K904L022K615K026J545J081L40o05j337j708k084k705l254l333l098
$$ 301581 304485 307507 310122 312148 313693 314774 315114 314509 313172 311464 309380 306675 303421 300088 296990
52945B96990k915k696k033r71j10J39m2l67q89j678k371k401j645n56K82N60K56
$$ 296990 294075 291379 289346 288375 288265 288404 288362 287995 287106 285428 283057 280656 279011 278455 278737 279297 279553
52928B79553m70j288j768j645j051m33j80k81m03k62N0J87l4l86n34m08k82l82
$$ 279553 279083 277795 276027 274382 273331 272898 272718 272437 272034 271772 271822 272009 271975 271589 271055 270647 270365 269983
52910B69983n76n21m5O98J462K114K520K417J653N19m03p71p19m54J9O28R79P61
$$ 269983 269407 268886 268841 269539 271001 273115 275635 278052 279705 280224 279821 279050 278331 277877 277896 278524 279503 280264
52892B80264K67O8J97J23l94q60p90m23m10r24j583k030k162j840r65O0M94J74
$$ 280264 280531 280599 280796 280919 280525 279665 278875 278452 278042 277118 275535 273505 271343 269503 268538 268598 269092 269266
52874B69266j30L24J208J509Q06k59q02o02r5K02J31m7J01P46J515J858J632J158
$$ 269266 269136 269460 270668 272177 272983 272724 271922 271320 271225 271427 271558 271511 271612 272358 273873 275731 277363 278521
52856B78521O93J99k51k75K63Q05O09l48j368j936k266k806l470l616k812j382
$$ 278521 279214 279413 279162 278887 279150 279955 280564 280216 278848 276912 274646 271840 268370 264754 261942 260560
52840B60560j98J17l38j015j553j955k216k130j560o75K12Q94J254J236J026R77
$$ 260560 260362 260479 260141 259126 257573 255618 253402 251272 249712 249037 249249 250143 251397 252633 253659 254636
52824B54636J159J138N19n23j459j947j912j358n15J02K05J59M79J046J331J208
$$ 254636 255795 256933 257452 256929 255470 253523 251611 250253 249738 249840 250045 250204 250683 251729 253060 254268
52808B54268J027R79J017J343K237L333L770L269K415J708J004J51n43q90j243
$$ 254268 255295 256274 257291 258634 260871 264204 267974 271243 273658 275366 276370 276521 275978 275088 273845
52793B73845j822k255k254k208k490k704k278j445r36q86p72k45N32J188J361
$$ 273845 272023 269768 267514 265306 262816 260112 257834 256389 255453 254567 253795 253550 254082 255270 256631
52778B56631P95j85o61j52N43K97p83j511j203k79O32J337J640J259M56O3M28
$$ 256631 257426 257241 256580 256428 256971 257268 256485 254974 253771 253492 254124 255461 257101 258360 258816 258879 259307
52761B59307Q81O42k03r70j195q49j56M32M64M8j47K82R32J200J054Q35N96J13
$$ 259307 260188 260830 260627 259657 258462 257613 257457 257889 258353 258401 258254 258536 259468 260668 261722 262557 263153 263266
52743B63266n59r10m83O18J717K117J740J175R17P09R3n89m25O68J577J399O29
$$ 263266 262707 261797 261314 261932 263649 265766 267506 268681 269598 270307 270400 269811 269386 270054 271631 273030 273659
52726B73659L66Q20J276J192P06J29l51n04j41M45O30J76m90q40q04o51n69n06
$$ 273659 274025 274845 276121 277313 278019 278148 277797 277293 277152 277597 278227 278403 277913 277073 276269 275618 275049 274543
52708B74543l47r8O0p3m74q79j019q38m13J17M82M11M0o4M03R66R24K83k79l69
$$ 274543 274196 274098 274158 274085 273611 272732 271713 270875 270462 270579 271061 271472 271512 271448 271851 272817 273741 274024 273745 273376
52688B73376l29n82r13p15K52J560K573K982K938K799K827K975K924K381J451
$$ 273376 273047 272465 271552 270837 271089 272649 275222 278204 281142 283941 286768 289743 292667 295048 296499
52673B96499P08O91J272J686J394P25M31O83R07N71k15r91j439j464j068m41N4
$$ 296499 297207 297898 299170 300856 302250 302975 303406 304089 304996 305567 305352 304361 302922 301458 300390 299949 300003
52656C00003J36k22r08j686k059j530k76P76Q86K46m76r73j350j609j657j620
$$ 300003 300139 299917 299009 297323 295264 293734 293458 294234 295120 295366 294890 293917 292567 290958 289301 287681
52640B87681j729j865j672j125n78k73o1K76P14J097J319J417J627K211K993L280
$$ 287681 285952 284087 282415 281290 280712 280439 280378 280654 281368 282465 283784 285201 286828 289039 292032 295312
52624B95312K607J469Q80J127J449J024q2j174j723j706j352q93n05l27m42q11
$$ 295312 297919 299388 300268 301395 302844 303868 303786 302612 300889 299183 297831 296938 296433 296106 295664 294853
52608B94853j161j076m27L46O56M31Q6j11k63m52n07l57j87L4O89J858K799K654
$$ 294853 293692 292616 292189 292535 293191 293622 293708 293597 293334 292882 292375 292018 291831 291865 292554 294412 297211 299865
52590B99865J586P49R57J811K304K015J402J069J124J298J405J432J283P69p9
$$ 299865 301451 302200 303157 304968 307272 309287 310689 311758 312882 314180 315585 317017 318300 319069 318990
52575C18990q62j161r69o67n75o65p50q13r93j286j374r55k27K00j9n12o43k94
$$ 318990 318128 316967 315998 315331 314756 314091 313341 312528 311535 310249 308875 307920 307693 307893 307874 307362 306719 306425
52557C06425R8K01P7j83o68j268j552j349j085j129j149n92L84J039J094J034
$$ 306425 306523 306724 306801 306618 305950 304682 303130 301781 300696 299567 298418 297826 298210 299249 300343 301377
52541C01377J296J649J579R47K0q39j268r64rR86J256N62n85j336j189m14J77
$$ 301377 302673 304322 305901 306848 306868 306029 304761 303797 303788 304774 306030 306592 306007 304671 303482 303068 303245
52524C03245K6n56p57k08O03R44O62J98mJ31N06J141K027K846L155K945K835L353
$$ 303245 303271 302715 301958 301750 302353 303297 303959 304157 304153 304284 304790 305931 307958 310804 313959 316904 319739 323092
52506C23092M193M471L796K670J762J133M37m89j524k555l465m060m257m220m030
$$ 323092 327285 331756 335552 338222 339984 341117 341554 341065 339541 336986 333521 329461 325204 320984 316954
52491C16954l491k563j671j168p57lQ61J212R92P01M72j7o75q11j91M10K00n40
$$ 316954 313463 310900 309229 308061 307304 307301 308162 309374 310366 311067 311539 311522 310847 310036 309845 310255 310455 309915
52473C09915q55k83P83J704K168K278K349K555K692K485K119K124K670L319L584
$$ 309915 309060 308777 309560 311264 313432 315710 318059 320614 323306 325791 327910 330034 332704 336023 339607
52458C39607L329K525J136m32j372j347j004j153j823k489k874l020k915k625
$$ 339607 342936 345461 346597 346165 344793 343446 342442 341289 339466 336977 334103 331083 328168 325543
52444C25543k514k814l139k968k410j952j650j173n78k99m25o28q55j354j851
$$ 325543 323029 320215 317076 314108 311698 309746 308096 306923 306345 306046 305621 304993 304138 302784 300933
52429C00933j502j30J168J197J11q70r05k07N36R07R33R82J505K526L409L446
$$ 300933 299431 299301 300469 301666 301777 300907 300002 299795 300331 301238 302171 303153 304658 307184 310593 314039
52413C14039K745K185K365K970L394L718M599O315Q267R624J0152J0236J0271
$$ 314039 316784 318969 321334 324304 327698 331416 336015 342330 350597 360221 370373 380609 390880
52400C90880J0196R612Q109N513K038j791n387q291j0106j0491r550q014o675
$$ 390880 401076 410688 418797 424310 426348 424557 419170 410879 400773 390282 380732 372718 366043
52387C66043n583m203k450j066p01j023j157p39j2Q02J669K293K215J576J284
$$ 366043 360460 356257 353807 352741 352040 351017 349860 349121 349109 349911 351580 353873 356088 357664 358948
52372C58948K024L428M528M785M412L904L656L866M346M425L465J634j49j148
$$ 358948 360972 364400 368928 373713 378125 382029 385685 389551 393897 398322 401787 403421 403272 402124
52358D02124j485j702j962j985j559q34j56J41m7l43l0J160K464K831K245J824
$$ 402124 400639 398937 396975 394990 393431 392597 392441 392582 392535 392192 392162 393322 395786 398617 400862 402686
52342D02686K418L680M759N366N673N699N431N334O037P526R116J0228J0791J1030
$$ 402686 405104 408784 413543 418909 424582 430281 435712 441046 447083 454609 463725 473953 484744 495774
52328D95774J1293J2009J3316J4843J6239J7664J9203K0172J9924J9131J9133
$$ 495774 507067 519076 532392 547235 563474 581138 600341 620513 640437 659568 678701
52317F78701J9916J9953J8413J6419J5447J5453J5413J4929J4350J3925J3680
$$ 678701 698617 718570 736983 753402 768849 784302 799715 814644 828994 842919 856599
52306H56599J3724J3925J3608J2410J0935R920R229Q490Q019Q112P993O767M972
$$ 856599 870323 884248 897856 910266 921201 931121 940350 948840 956859 964971 972964 979731 984703
52293I84703L715K614K36l401o462p894q589r373r476q130o294n372n191m579
$$ 984703 988418 991032 991268 987867 981405 973511 964922 955549 946073 937943 931649 926277 921086 916507
52279I16507l324k080q69R41L272N237O433P273Q046Q630R202J0246J1649J2722
$$ 916507 913183 911103 910234 911175 914447 919684 926117 933390 941436 950066 959268 969514 981163 993885
52265I93885J3270J3788J4424J4633J4225J3818J3730J3288J1908J0270R604J0168
$$ 993885 1007155 1020943 1035367 1050000 1064225 1078043 1091773 1105061 1116969 1127239 1136843 1147011
52253A147011J1089J1435J0916R767Q509P630P011N891L831J442m15j788l262
$$ 1147011 1158100 1169535 1180451 1190218 1198727 1206357 1213368 1219259 1223090 1224532 1224117 1222329 1219067
52240A219067m670n138m553l957m104m435m091l261k721k494j933r67k94k10o6
$$ 1219067 1214397 1209259 1204706 1200749 1196645 1192210 1188119 1184858 1182137 1179643 1177710 1176743 1176449 1176239 1176173
52225A176173P25J749K235K167K191K614L110L411L730M376N248O005O495O817
$$ 1176173 1176898 1178647 1180882 1183049 1185240 1187854 1190964 1194375 1198105 1202481 1207729 1213734 1220229 1227046
52211A227046P089P337P540P706P896Q210Q637Q908Q679P968P247O937O902O674
$$ 1227046 1234135 1241472 1249012 1256718 1264614 1272824 1281461 1290369 1299048 1307016 1314263 1321200 1328102 1334776
52197A334776O134N711N788O154O305O143O046O167O024N116L788K951K917K882
$$ 1334776 1340910 1346621 1352409 1358563 1364868 1371011 1377057 1383224 1389248 1394364 1398152 1401103 1404020 1406902
52183A406902J943L50q28j176j571l117n809q602j0537j1445j1638j1405j0898
$$ 1406902 1408845 1409195 1408367 1407191 1405620 1402503 1396694 1388092 1377555 1366110 1354472 1343067 1332169
52170A332169j0153r051p505n874m854m648m451l209q83J430K730L047L024L024
$$ 1332169 1322016 1312965 1305460 1299586 1294732 1290084 1285633 1282424 1281541 1282971 1285701 1288748 1291772 1294796
52156A294796L045L153L425L569L071J921P01j20p14j468k354k902k703j817r00
$$ 1294796 1297841 1300994 1304419 1307988 1311059 1312980 1313681 1313561 1312847 1311379 1309025 1306123 1303420 1301603 1300703
52141A300703r15k270m088m779l685j897j034j513k391k632j956o19J035K740
$$ 1300703 1299788 1297518 1293430 1288651 1284966 1283069 1282035 1280522 1278131 1275499 1273543 1272924 1273959 1276699
52127A276699M505O693R524J2504J4884J6743J8938K1856K4791K6900K8182K9026
$$ 1276699 1281204 1287897 1297421 1309925 1324809 1341552 1360490 1382346 1407137 1434037 1462219 1491245
52115A491245K9412K9215K8849K8748K8293K6191K2195J7818J4786J3169J1498
$$ 1491245 1520657 1549872 1578721 1607469 1635762 1661953 1684148 1701966 1716752 1729921 1741419
52104A741419Q675N201K453J100O07K08j44k0N99J230J607J956K355K287J270
$$ 1741419 1750094 1755295 1757748 1758848 1759455 1759663 1759519 1759499 1760098 1761328 1762935 1764891 1767246 1769533 1770803
52089A770803m32k166l790n616p574r032r649r816r898r507p967n302k254N87
$$ 1770803 1770371 1768205 1764415 1758799 1751225 1742193 1732544 1722728 1712830 1703323 1695356 1690054 1687800 1688387
52075A688387L177N473P068P735Q098R218J1427J3847J5276J5313J4535J3727
$$ 1688387 1691564 1697037 1704105 1711840 1719938 1729156 1740583 1754430 1769706 1785019 1799554 1813281
52063A813281J3250J3018J2689J1850J0290Q277O288M394K258j34k198l565m715
$$ 1813281 1826531 1839549 1852238 1864088 1874378 1882655 1888943 1893337 1895595 1895461 1893263 1889698 1884983
52050A884983o224p733q419q454r091j1014j3394j5066j6003j6953j8090j8842
$$ 1884983 1878759 1871026 1862607 1854153 1845062 1834048 1820654 1805588 1789585 1772632 1754542 1735700
$$ [...]
##END NTUPLES=NMR SPECTRUM
##END=
