##TITLE=AC1557_ROEFFECT0017_8269191_sCcxeRzGRb
##JCAMPDX= 6.0         $$ Bruker NMR JCAMP-DX V2.0
##DATA TYPE= NMR SPECTRUM
##DATA CLASS= NTUPLES
##ORIGIN= BRUKER
##OWNER= Administrator
$$ 1.72 TOPSPIN		Version 2.1
$$ 2013-10-12 23:05:32.892 -0700  Administrator@X
$$ Compression mode = diff/dup
##.OBSERVE FREQUENCY= 400.02188249412
##.OBSERVE NUCLEUS= ^1H
##.ACQUISITION MODE= SIMULTANEOUS (DQD)
##.ACQUISITION SCHEME= undefined
##.AVERAGES= 8
##.DIGITISER RES= 22
##SPECTROMETER/DATA SYSTEM= spect
##.PULSE SEQUENCE= zg30
##.SOLVENT NAME= COFFEE_meoh
##.SHIFT REFERENCE= INTERNAL, COFFEE_meoh, 1, 14.98509
##AUDIT TRAIL= $$ (NUMBER, WHEN, WHO, WHERE, PROCESS, VERSION, WHAT)
$$ ##TITLE= Audit trail, TOPSPIN		Version 2.1
$$ ##JCAMPDX= 5.01
$$ ##ORIGIN= Bruker BioSpin GmbH
$$ ##OWNER= Administrator
$$ $$ E:\/data/COFFEE/nmr/AC1557_ROEFFECT0017_8269191_sCcxeRzGRb/10/pdata/1/auditp.txt
$$ ##AUDIT TRAIL=  $$ (NUMBER, WHEN, WHO, WHERE, PROCESS, VERSION, WHAT)
(   1,<2013-10-12 23:05:26.308 -0700>,<Administrator>,<X>,<go>,<TOPSPIN 2.1>,
      <created by zg
	started at 2013-10-12 23:04:20.198 -0700,
	POWCHK enabled, PULCHK disabled,
       configuration hash MD5:
       C8 4E 4E 5D D3 5C D8 9E 9F 52 82 E0 59 8A DE 15
       data hash MD5: 64K
       04 52 CD BD 36 A0 37 4C 04 48 CC 46 CD 94 44 94>)
(   2,<2013-10-12 23:05:29.214 -0700>,<Administrator>,<X>,<proc1d>,<TOPSPIN 2.1>,
      <Start of raw data processing
       efp LB = 0 FT_mod = 6 PKNL = 1 PHC0 = 0 PHC1 = 0 SI = 32K 
       data hash MD5: 32K
       FE F9 67 AE F6 80 F6 4D D2 5C 67 79 C2 85 BC DD>)
(   3,<2013-10-12 23:05:29.480 -0700>,<Administrator>,<X>,<proc1d>,<TOPSPIN 2.1>,
      <pk PHC0 = 96.52039 PHC1 = 0 
       data hash MD5: 32K
       33 50 CA 13 A5 7B 35 F8 E1 FB 45 1E 53 44 CF FE>)
(   4,<2013-10-12 23:05:29.605 -0700>,<Administrator>,<X>,<proc1d>,<TOPSPIN 2.1>,
      <abs ABSG = 1 
       data hash MD5: 32K
       70 DC DD 4D A0 A6 ED 46 BF 79 26 96 F4 36 F5 80>)
(   5,<2013-10-12 23:05:29.667 -0700>,<Administrator>,<X>,<proc1d>,<TOPSPIN 2.1>,
      <abs ABSG = 2 
       data hash MD5: 32K
       43 FE 17 C8 EC 05 5C 55 7D 00 49 65 AB E6 A2 92>)
(   6,<2013-10-12 23:05:29.730 -0700>,<Administrator>,<X>,<proc1d>,<TOPSPIN 2.1>,
      <abs ABSG = 3 
       data hash MD5: 32K
       07 24 5E FC 14 D6 10 2A 6B FC 6E 44 7E CD 3B 3C>)
(   7,<2013-10-12 23:05:29.792 -0700>,<Administrator>,<X>,<proc1d>,<TOPSPIN 2.1>,
      <abs ABSG = 4 
       data hash MD5: 32K
       73 29 1A 74 5B 10 57 BA 42 F8 86 6E 7D F8 7C 48>)
(   8,<2013-10-12 23:05:29.870 -0700>,<Administrator>,<X>,<proc1d>,<TOPSPIN 2.1>,
      <abs ABSG = 5 
       data hash MD5: 32K
       5B 82 D1 00 A9 B1 3E C2 49 BC 28 D6 04 6C F1 24>)
$$ ##END=
$$ 
$$ $$ hash MD5
$$ $$ 14 B4 5E 2B C2 66 58 AB 13 2F EE B7 C5 3E E8 27
##$RELAX= 
##$RELAX= 
##$RELAX= 
##$RELAX= 
##$RELAX= 
##$RELAX= 
##$RELAX= 
$$ Bruker specific parameters
$$ --------------------------
##$DU= <E:\>
##$EXPNO= 10
$$ [...]
##$TP= (0..7)
150 150 150 150 150 150 150 150
##$TP07= 0
##$TPNAME0= <>
##$TPNAME1= <>
##$TPNAME2= <>
##$TPNAME3= <>
##$TPNAME4= <>
##$TPNAME5= <>
##$TPNAME6= <>
##$TPNAME7= <>
##$TPOAL= (0..7)
0.5 0.5 0.5 0.5 0.5 0.5 0.5 0.5
##$TPOFFS= (0..7)
0 0 0 0 0 0 0 0
##$TUNHIN= 0
##$TUNHOUT= 0
##$TUNXOUT= 0
##$USERA1= <user>
##$USERA2= <user>
##$USERA3= <user>
##$USERA4= <user>
##$USERA5= <user>
##$V9= 5
##$VALIST= <valist>
##$VCLIST= <CCCCCCCCCCCCCCC>
##$VD= 0
##$VDLIST= <DDDDDDDDDDDDDDD>
##$VPLIST= <PPPPPPPPPPPPPPP>
##$VTLIST= <TTTTTTTTTTTTTTT>
##$WBST= 1024
##$WBSW= 4
##$XGAIN= (0..3)
0 0 0 0
##$XL= 0
##$YL= 0
##$YMAX_a= 641992
##$YMIN_a= -546530
##$ZGOPTNS= <>
##$ZL1= 120
##$ZL2= 120
##$ZL3= 120
##$ZL4= 120
##$ABSF1= 14.98509
##$ABSF2= -5.573092
##$ABSG= 5
##$ABSL= 3
##$ALPHA= 0
##$AQORDER= 0
##$ASSFAC= 0
##$ASSFACI= 0
##$ASSFACX= 0
##$ASSWID= 0
##$AUNMP= <proc_prof1d_extract_pilot.lims>
##$AXLEFT= 0
##$AXNAME= <>
##$AXNUC= <1H>
##$AXRIGHT= 0
##$AXTYPE= 0
##$AXUNIT= <>
##$AZFE= 0.1
##$AZFW= 0.1
##$BCFW= 0
##$BC_mod= 0
##$BYTORDP= 0
##$COROFFS= 0
##$CY= 15
##$DATMOD= 1
##$DC= 0
##$DFILT= <>
##$DTYPP= 0
##$F1P= 0
##$F2P= 0
##$FCOR= 0.5
##$FTSIZE= 32768
##$FT_mod= 6
##$GAMMA= 0
##$GB= 0
##$INTBC= 1
##$INTSCL= 1
##$ISEN= 128
##$LB= 0
##$LEV0= 0
##$LPBIN= 0
##$MAXI= 10000
##$MC2= 0
##$MEAN= 0
##$ME_mod= 0
##$MI= 0
##$NCOEF= 0
##$NC_proc= -8
##$NLEV= 6
##$NOISF1= 0
##$NOISF2= 0
##$NSP= 0
##$NTH_PI= 0
##$NZP= 0
##$OFFSET= 14.98509
##$PC= 1
##$PHC0= 96.52039
##$PHC1= 0
##$PH_mod= 1
##$PKNL= yes
##$PPARMOD= 0
##$PPDIAG= 0
##$PPIPTYP= 0
##$PPMPNUM= 2147483647
##$PPRESOL= 1
##$PSCAL= 4
##$PSIGN= 0
##$PYNMP= <proc.py>
##$REVERSE= no
##$SF= 400.02
##$SI= 32768
##$SIGF1= 0
##$SIGF2= 0
##$SINO= 400
##$SIOLD= 32768
##$SPECTYP= <>
##$SREGLST= <1H.CDCl3>
##$SSB= 0
##$STSI= 32768
##$STSR= 0
##$SW_p= 8223.68421052631
##$SYMM= 0
##$S_DEV= 0
##$TDeff= 65536
##$TDoff= 0
##$TI= <>
##$TILT= no
##$TM1= 0
##$TM2= 0
##$TOPLEV= 0
##$USERP1= <user>
##$USERP2= <user>
##$USERP3= <user>
##$USERP4= <user>
##$USERP5= <user>
##$WDW= 1
##$XDIM= 32768
##$YMAX_p= 442678387
##$YMIN_p= -702936
##$CURPLOT= <Network HP LaserJet P1505>
##$CURPRIN= <$Network HP LaserJet P1505>
##$DFORMAT= <normdp>
##$LAYOUT= <+/1D_H.xwp>
##$LFORMAT= <normlp>
##$PFORMAT= <normpl>
##$SURQMSG= 1
$$ End of Bruker specific parameters
$$ ---------------------------------
##NTUPLES= NMR SPECTRUM
##VAR_NAME=  FREQUENCY,     SPECTRUM/REAL,   SPECTRUM/IMAG
##SYMBOL=    X,             R,               I
##VAR_TYPE=  INDEPENDENT,   DEPENDENT,       DEPENDENT
##VAR_FORM=  AFFN,          ASDF,            ASDF
##VAR_DIM=   32768,         32768,           32768
##UNITS=     HZ,            ARBITRARY UNITS, ARBITRARY UNITS
##FACTOR=    0.250966925370066, 1,           1
##FIRST=     8223.43324360094, 6814,         79471
##LAST=      0,             -36866,          -37753
##MIN=       0,             -702936,         0
##MAX=       8223.43324360094, 442678387,    0
$$ Real data points
##PAGE= N=1
##DATA TABLE= (X++(R..R)), XYDATA
$$ [...]
19545A06057d27343a11707r1320k14456c1343k23505J3225A47514b10774N570
19535b05204J3582E7727K46869n9150F248P097b5948G3646b7482j34685O0426
19524a01741B07373h4618c7444L074j36710j6498b4322q245j57090c1313k69383
19513c00696J39890a8047d090G694c23941D1856a7495k4751A57860d8172E1037
19501A94503a6714H2992l4161P5364I320d69819b32731I1426a46663q225C7910
19489b28700g1906E8344L9678a38050A9322i7827H0870e3173p5950p110o6524
19478b02757B12777a80619C4605l848M0733J7728k6364J3922a4309j90160j30416
19467c34885J56694a2277j15286e8009A25981a40348j91842A92557n5786J06773
$$ y = [106057, -427343, -111707, -203027, -417483, -31343, -254848, -241623, 147514, -210774, -205204, -191622, 57727, 304596, 245446, 6248, 13345, -25948, 73646, -27482, -162167, -101741, 207373, -84618, -37444, -34370, -171080, -187578, -24322, -32567, -189657, -31313, -300696, -160806, -18047, -4090, 7694, -323941, 41856, -17495, -42246, 157860, -48172, 51037, 194503, -16714, 82992, 48831, 124195, 9320, -469819, -232731, 91426, -146663, -154888, 37910, -228700, -71906, 58344, 98022, -138050, 19322, -97827, 80870, -53173, -129123, -136233, -202757, 212777, -180619, 34605, 30757, 71490, 89218, 62854, 76776, -14309, -204469, -334885, -178191, -12277, -127563, -58009, 125981, -140348, -332190, 192557, 136771, 243544]
19457B43544c17114h794A64075g8449k16252P265A67970a7857k61707J08881j18348
19446b89031R1178j0985H9744a90242c7684j07942F3416a16166B7785c34120A04198
19434b70775d7686K3223k6263A19003i8466b4178E3360J07761d69901D1507b14130
19422B6948b80068g7488B85975J2909b43537O5058L3174A48010c8647j77600P1506
19411a44741M9886j30449d983q0881H0687b56364c7575C3328g0850A44431a16831
19399g5118j16985M4615N9851j00375A20927b7681j94042j22815a02178j54854
19389b57032A96350a01669C75103a79247A4404i2156f740j62607o8413a11889
19378C2305J7701i3207j3560p3117i287B18271g6890q6479B17089b5436r0532
$$ y = [243544, -317114, -8794, 164075, -78449, -294701, -287436, 167970, -17857, -279564, -170683, -289031, -197853, -208838, 89744, -190242, -37684, -145626, 63416, -116166, 27785, -334120, 104198, -270775, -47686, -24463, -50726, 119003, -98466, -24178, 53360, 161121, -469901, 41507, -214130, 26948, -280068, -77488, 285975, 298884, -243537, -178479, -145305, 148010, -38647, -216247, -144741, -94855, -225304, -4983, -85864, 80687, -256364, -37575, 33328, -70850, 144431, -116831, -75118, -192103, -147488, -87637, -188012, 120927, -27681, -221723, -344538, -102178, -257032, 196350, -101669, 375103, -179247, 14404, -92156, -6740, -169347, -237760, -111889, 32305, 50006, -93207, -106767, -179884, -9287, 218271, -76890, -163369, 217089, -25436, -115968]
19367a15968A74007b73776C9035f6302a299m8377D9434P6186a70430d3377j32058
19356a75435J9947C61524C4886K5343J9686a30194p1949i2259N17a7478j28750
19345a46228H5312a82886A24200C0266b92159J03947a2083E8704a38354E2610
19334A89172g7661b7685B44414n0208k8523a86957b1905B02611c8086j46534a5353
19322b48829A38826f0321n5312K9822A61504f7123k68083Q5245N0774R7954j54078
19311b55311O9450I0742d49300h1839n2994C8697e1374j44388p7536J31059A82100
19299B66240h0514j99789A18093a96492d8584j01136e3474j90885j38108a42120
19288a00759K7479B73899a11965j10441B51831q9746m2043b72346b2977B01482
$$ y = [-115968, 174007, -273776, 39035, -66302, -1299, -49676, 49434, 125620, -170430, -43377, -175435, -155488, 361524, 34886, 60229, 79915, -130194, -202143, -92259, -91742, -17478, -146228, 85312, -182886, 124200, 30266, -292159, -188212, -12083, 58704, -138354, 52610, 189172, -77661, -27685, 244414, 194206, 165683, -186957, -21905, 202611, -38086, -184620, -15353, -248829, 138826, -60321, -115633, -85811, 161504, -67123, -335206, -249961, -199187, -101233, -255311, -185861, 90742, -449300, -81839, -134833, 38697, -51374, -195762, -273298, -142239, 182100, 266240, -80514, -280303, 118093, -196492, -48584, -149720, -53474, -244359, -382467, -142120, -100759, -73280, 273899, -111965, -222406, 251831, 162085, 120042, -272346, -22977, 201482]
19277C4226J58493c9206l10324g0346p8719A46155B3941m732J43461f1011K5870
19266c5141k30892n0203J40514A15569N5093c39401F7404a49174A11672h4303
19255b67219L1064A16652c36308a3633j77737P2257a9202j38689J7917M9624A05962
19243a11773D1757d2021j67133A56534f8435K3004k20365A20116B643L44570a06100
19231b20435h6475j84921I256b32618p6398A5013a04584j1525j78398N4724J10237
19220a29546l0314A53249J3985D2878N2104A6456b77480L8733P7327j88110N5228
19209b94302J44941d53p2073K0803r1803K6047P959l1813B3919J12944c8270P312
19197c0958q6549E1775b34837A82990b41269A58667h6205B43482a18079H1363
$$ y = [34226, 192719, -39206, -349530, -70346, -149065, 146155, 23941, 19209, 162670, -61011, -35141, -266033, -316236, -175722, 115569, 170662, -339401, 67404, -149174, 111672, -84303, -267219, -236155, 116652, -336308, -13633, -191370, -119113, -19202, -157891, -139974, -90350, 105962, -111773, 41757, -42021, -209154, 156534, -68435, -45431, -265796, 120116, 2643, 347213, -106100, -220435, -86475, -271396, 9256, -232618, -309016, 15013, -104584, -116109, -294507, -239783, -129546, -159860, 153249, 167234, 42878, 94982, 16456, -277480, -238747, -161420, -349530, -294302, -149361, -453, -72526, -51723, -143526, -117479, -109520, -141333, 23919, 136863, -38270, -30958, -117507, 51775, -234837, 182990, -241269, 158667, -86205, 243482, -118079, 81363]
19186G050c87495d7422C5405a94833B36683j16636M4748d35694a42341k96288
19176d38629a55388g7583J1928j69085j8710a02054M184n4052P5326j4220B09139
19164A54306O5461a90825q682b6391A12034J94070c23329a46141N0569G6792P971
19153H4763a91203J0370d4102A4980a26083J0974j05934j7278A86677C9963i9619
19141E71b57712B41530D8244b45885A1252e4874B66800d033m55387E6781Q4687
19130A41468a53316P3585k4693A6582P2210B7312o675c6197o2015b2796A32496
19118a24706A97086J45002q4645j7196c47229a21276B70840o8254a98726G1259
19107b75452m8797a48129A86983c1322A07540c11220e5879m0790B21531B6177
$$ y = [7050, -387495, -47422, 35405, -194833, 236683, 120047, 164795, -435694, -142341, -438629, -155388, -77583, -65655, -234740, -253450, -102054, -97870, -151922, -76596, -90816, 209139, 154306, 219767, -190825, -199507, -26391, 112034, 306104, -323329, -146141, -95572, 76792, 84763, -191203, -180833, -44102, 14980, -126083, -115109, -221043, -238321, 186677, 39963, -99619, 571, -257712, 241530, 48244, -245885, 11252, -54874, 266800, -4033, -459420, 56781, 141468, -153316, -79731, -104424, 16582, 88792, 27312, 20637, -36197, -98212, -22796, 132496, -124706, 197086, 342088, 257443, 240247, -347229, -121276, 270840, 202586, -198726, 71259, -275452, -324249, -148129, 186983, -31322, 107540, -311220, -55879, -96669, 221531, 26177]
19096D1979h0742A59386a21820A2877O8092A4538b22761O2687M0776F1721e8584
19084c3206A39734h4852a2795A38076N5207l6216a81823Q7018j00885Q7501e0184
19072b40882Q3362A09582J09788f7167l63063J31656B00409g0989A50657g6779
19061A06469h0478j39578Q4539C69797c0762j79600q179A31012a41077A00613
19050b08843B33049l3334A0163K2869J53030G1733I206a28849C7302L50060A63716
19038a17406A00524c20514q9341a95906A25528J12547J92746I7264I043K08545
19028B17588d8340A57076c1843B9856N8588a96265B6586J85750C0455c69717c821
19016A96076b68146O6945A63490b13131f9611k21000a41796j09447A34630B5220
$$ y = [41979, -80742, 159386, -121820, 12877, 80969, 14538, -222761, -160074, -119298, 61721, -58584, -33206, 139734, -84852, -12795, 138076, 193283, 157067, -181823, -94805, -195690, -108189, -50184, -240882, -157520, 109582, 219370, -67167, -430230, -298574, 200409, -70989, 150657, -76779, 106469, -80478, -220056, -135517, 369797, -30762, -210362, -218541, 131012, -141077, 100613, -208843, 233049, 199715, 10163, 33032, 186062, 71733, 9206, -128849, 37302, 387362, 163716, -117406, 100524, -320514, -409855, -195906, 125528, 238075, 430821, 97264, 9043, 217588, -48340, 157076, -31843, 29856, 88444, -196265, 26586, 212336, 30455, -369717, -3821, 196076, -268146, -201201, 163490, -213131, -69611, -290611, -141796, -251243, 134630, 25220]
19005a42498q1765C6936b0285A29325a71623j26669A14629d01429G6890g4510
18994D2057e0731A56065j033c36710J31574q970j3928q77I1643N2019a20953C088
18981B9330O9861e1122o0138A52919j7149b16783I92K29522F9796O3676g62F0860
18968E1533M3814g2239K3123F2986L5680b34865e0308j2404o6671D326J18966
18957A23292c9154k88247J12118M7089f4565c1160m2875A92125m4479g214D5832
18945b7246k9713B55177e0788D4396a91424N7198F0249A8947P6260a0476B302
18933i4123p4029f7046m3704L5836j01425A11739l7197c14314A21496h2750A45578
18921B89527a26609D9976a15968B88203i1593K8679A79510J06318A26654a85972
$$ y = [-142498, -224263, 36936, -20285, 129325, -171623, -298292, 114629, -401429, 76890, -74510, 42057, -50731, 156065, 155032, -336710, -205136, -214106, -228034, -228911, 91643, 143662, -120953, 3088, 29330, 99191, -51122, -111260, 152919, 135770, -216783, 992, 230514, 69796, 133472, -762, 60860, 51533, 95347, -72239, -49116, 62986, 98666, -234865, -50308, -62712, -129383, 4326, 123292, -39154, -327401, -215283, -168194, -64565, -31160, -74035, 192125, 147646, -7214, 45832, -27246, -56959, 255177, -50788, 44396, -191424, -134226, 60249, 18947, 95207, -10476, 2302, -94123, -168152, -67046, -110750, -74914, -176339, 111739, 74542, -314314, 121496, -82750, 145578, 289527, -126609, 49976, -115968, 288203, -91593, -62914, 179510, 285828, 126654, -185972]
18910a088F2390b06749n7451k5673b8550j65060A4142e5879m6101B1253N9114
18899H0367d07934a07487A15293E821b04777c5680m9299l286l7961A15797M4391
18888A60188O7074a77730j52333a01310B18531n8217c38125J59419N2894A08047
18877C41951H272a14929G9720f9087R640j16509L4317O3609J2111k9260d7543
18865A78510c19591B29710b37608A2738a26445C62686a23046N8591k33317J15038
18855a82734N6679e1402G3698a72136H7342c01725R9180A73520a69423l7122O1828
18844a44717A3950a04468q914K5536A32001g5823j08706O9760G5024g253D8403
18832d58246f6160n8845n1855a9447A12315b16431f9939m11830A15598a28317
$$ y = [-1088, 62390, -206749, -264200, -289873, -28550, -193610, 14142, -55879, -101980, 21253, 80367, -407934, -107487, 115293, 5821, -204777, -35680, -84979, -88265, -126226, 115797, 160188, 227262, -177730, -330063, -101310, 218531, 160314, -338125, -178706, -125812, 108047, 341951, 8272, -114929, 79720, -69087, -59447, -175956, -141639, -78030, -65919, -95179, -47543, 178510, -319591, 229710, -237608, 12738, -126445, 362686, -123046, -64455, -297772, -182734, -126055, -51402, 73698, -172136, 87342, -301725, -202545, 173520, -169423, -206545, -144717, 13950, -104468, -113382, -87846, 132001, -75823, -184529, -114769, 75024, -7253, 48403, -458246, -66160, -125005, -176860, -19447, 112315, -216431, -69939, -481769, 115598, -128317]
18821B19007k2581p216f9736A59040E1923M5339b24698G9008A7268L8127K34648
18810B90043j2323A00346M0Q4349h5438k2372D0034j8976O5977a11939K7399j03862
18798a88402I5703b70667M8542A27133D6315J2672b92043K1691D8157b67777O0771
18787b07006N9451L0528A12194a60227A36920h0597A97332a80388M5609q7997
18777b22776i8814b0920E4042a95769e0583D6728a52275f2844r862k4916m2164
18766a39786H4969J82364A8815b8478r8535A68303C8435d9820k76386B932i872
18754A85598d47506f6450A29414g945H0446J44293F5586A6448K4943a22201H4333
18742g267A11423a28069O1950j42940b001k21260j40673p6174a49585a3098H1350
$$ y = [219007, 196426, 189210, -69736, 159040, 51923, 97262, -224698, 79008, 17268, 55395, 290043, 277720, 100346, 100386, 184735, -85438, -107810, 40034, 21058, 87035, -111939, -84540, -188402, 95703, -270667, -222125, 127133, 46315, 58987, -292043, -270352, 48157, -267777, -207006, -147555, -117027, 112194, -160227, 136920, -80597, 197332, -180388, -134779, -222776, -98814, -20920, 54042, -195769, -50583, 46728, -152275, -62844, -72706, -97622, -139786, 84969, 267333, 18815, -28478, -127013, 168303, 38435, -49820, -326206, 2932, -9872, 185598, -447506, -66450, 129414, -7945, 80446, 224739, 65586, 16448, 41391, -122201, 84333, -7267, 111423, -128069, -66119, -209059, -2001, -223261, -363934, -440108, -149585, -13098, 81350]
18730a20545c0626Q958B40560l2748h6168B10507H1043b06840m8070C2551o784
18719B5767a80413D7723a43153K9892C48629C6073c6239j78934L3084b8376k4254
18708e2630B34242g1670j79793g7999A70781b0843k11866r856a5130o2053c1590
18696c91088b2058j73119Q0644L9734B25226E0963P2880Q637E4361d9652j03514
18685a53166b9414B32375h0302i134H3119D349J10957a46488D2185g6181m7260
18674a23441L8573k27446a44938I1811a40416f3319b1921K144E7828a94804P6027
18663a18777d9329B21889b85931e5756e938D61473A57669c30090G9135a36458
18652A17055N3839b07772b1635C17233b23290B21848b81680j14292C8997e7458
$$ y = [-120545, -30626, -21668, 240560, 207812, -86168, 210507, 81043, -206840, -254910, 32551, 25767, -180413, 47723, -143153, -113261, 348629, 36073, -36239, -215173, -182089, -28376, -52630, 234242, -71670, -251463, -77999, 170781, -20843, -232709, -242565, -15130, -77183, -31590, -391088, -22058, -195177, -114533, -74799, 225226, 50963, 123843, 132480, 54361, -49652, -153166, -29414, 232375, -80302, -9134, 83119, 4349, 115306, -146488, 42185, -76181, -123441, -84868, -312314, -144938, 91811, -140416, -63319, -21921, -19777, 57828, -194804, -118777, -49329, 221889, -285931, -55756, -5938, 461473, 157669, -330090, 79135, -136458, 117055, 170894, -207772, -21635, 317233, -223290, 221848, -281680, -395972, 38997, -57458]
18641H1528H582c86150D02980F8008a53533o0601C30167a8055k00152k7138E8290
18629A50508l6757b46345b7378j35011b1044G766e4696j13345k23754R4056b3635
18617e956B45807A4510J01479d7348J204k97669A4615g2031B73304j09193f4747
18605A53801b8487j91083a4246B11791d2244k0970j79140L8219g8877G1262o917
18594F4345f6030I1035a21135A49570a34390l2593A34545D6095b77785A67382
18583a03945b5390j48249K4881D5248a60569b3775A50139a20461j35348c0151
18572a71200G7641L6624c11226D7987i7347C0028L3761a14706j22771a2401k69122
18561b81523P7966M2534A07565J5815J06048C7195c29976g3848A1289b23040A66247
$$ y = [81528, 8582, -386150, 402980, 68008, -153533, -214134, 330167, -18055, -218207, -245345, 58290, 150508, 113751, -246345, -27378, -162389, -21044, 7766, -54696, -168041, -391795, -297739, -23635, -5956, 245807, 14510, 115989, -47348, -46144, -343813, 14615, -72031, 273304, 164111, -64747, 153801, -28487, -219570, -14246, 211791, -42244, -63214, -242354, -204135, -78877, 71262, 64345, -66030, 91035, -121135, 149570, -134390, -166983, 134545, 46095, -277785, 167382, -103945, -25390, -173639, -148758, 45248, -160569, -23775, 150139, -120461, -255809, -30151, -171200, 77641, 114265, -311226, 47987, -97347, 30028, 63789, -114706, -237477, -12401, -281523, -203557, -161023, 107565, 123380, 229428, 37195, -329976, -73848, 11289, -223040, 166247]
18549I697b56308J14146J0548c048j19410j53272c1894k70429h5524c4019I7644
18537b17961C4233a33896B89050H8578a7679k36243N4552l0933a12321A15380
18526a33531b8682k91654a47204b0542A35893j7143a47259l225j385R010b9511
18514H0846L04881a45817N0536D9339i9316A9901b6839q5792p8491c785j66228
18503a70013c7144j25031I2370L4889k9193a83713K2960B30516d5500o1004N3228
18492e3276j51165I4324b30714A98505P2667i0990A0960a85773J7144F61a70296
18480A2625B908K5738d0873A75199b42362o9957C2406b49506j17575J70707Q5732
18469a10642M3300j9081E2642a63406r4428q8214a58213e5506A48314a63250m1285
$$ y = [9697, -256308, -142162, -131614, -3048, -122458, -275730, -31894, -302323, -85524, -34019, 97644, -217961, 34233, -133896, 289050, 88578, -17679, -253922, -199370, -230303, -112321, 115380, -133531, -28682, -320336, -147204, -20542, 135893, 118750, -147259, -150484, -151869, -142859, -29511, 80846, 385727, -145817, -95281, 49339, -99316, 19901, -26839, -112631, -191122, -3785, -170013, -37144, -162175, 92370, 127259, 98066, -183713, -160753, 230516, -45500, -106504, -53276, -204441, 94324, -230714, 198505, 271172, -90990, 10960, -185773, -168629, 661, -170296, 12625, 2908, 28646, -40873, 175199, -242362, -312319, 32406, -249506, -367081, -196374, -110642, -67342, -86423, 52642, -163406, -257834, -346048, -158213, -55506, 148314, -163250, -204535]
18458b04535R4809j41205F2827M36111a42402i520k42250D8146a48031O2189E8166
18446A7873R5281m1971L1364a29224a3373B67105j31012o1116c13561G3277B0688
18434E4001j9362J74692r6051e5760b2280B7104R711A2701K17575D0337D044L259
18422G303d5724A52736c39945A43293b8479j76979n2326j44659A56703J9943b616
18410a76777I1684j2853a07271a5907j63678B14440K8321f6878j14464L835C05130
18398e956B57575l3027a18826A06373c35780I3170a55540G8025a76522a6823F7608
18386a2468n35859a41255B6842a84576A16511k6839a12627j5799E6870b71240
18375C32828a39630j2426A85249B7716a48402j93569C6958f7399A09394a75370
$$ y = [-204535, -109726, -250931, 62827, 498938, -142402, -9520, -251770, 48146, -148031, -85842, 58166, 17873, 113154, 71183, 102547, -129224, -13373, 267105, 136093, 74977, -313561, 73277, 20688, 54001, 34639, 209331, 113280, -55760, -22280, 27104, 36815, 12701, 230276, 40337, 4044, 7303, -45724, 152736, -339945, 143293, -28479, -205458, -257784, -402443, 156703, 176646, -2616, -176777, 91684, 78831, -107271, -15907, -179585, 214440, 242761, -66878, -181342, -177507, 305130, -5956, 257575, 224548, -118826, 106373, -335780, 93170, -155540, 78025, -176522, -16823, 67608, -12468, -548327, -141255, 26842, -184576, 116511, 89672, -112627, -128426, 56870, -271240, 332828, -139630, -152056, 185249, 27716, -148402, -341971, 36958, -67399, 109394, -175370]
18364C65284j80684f7151A93945a3898j96396i88k96626a01630B57964A24888
18353a44878a2940k00276D835a70705A36545f8070B43270L6324f4508A09000B7300
18341B46411p1768A788a42753d823D2607b38008F1903B731d8132k61113c0039
18329c15695B13045a13291j3123c9541k83486a32419L0650A77253L9833d5538
18318i4856c3196l5588j49711H2205K1776A8479J18679i4804c0692p0568C91145
18306b9541j73537A86479i188m7840B18388e8634B06633i6537k9671M2152j01311
18295a85367o6921c7045j10777m474A35936b58998Q622H3302A0937J84905B77
18283I7397K55899e3634J0859A09668l2237a90814f203l3416I883K14943b39599
$$ y = [365284, 184600, -67151, 193945, -13898, -210294, -988, -297614, -101630, 257964, 124888, -144878, -12940, -213216, 4835, -170705, 136545, -68070, 243270, 279594, -64508, 109000, 27300, 246411, 174643, 1788, -142753, -4823, 42607, -238008, 61903, 2731, -48132, -309245, -30039, -315695, 213045, -113291, -126414, -39541, -323027, -132419, -101769, 177253, 217086, -45538, -94856, -33196, -68784, -218495, 82205, 103981, 18479, 137158, -94804, -30692, -101260, 391145, -29541, -203078, 186479, -9188, -57028, 218388, -58634, 206633, -96537, -126208, -84056, -185367, -252288, -37045, -147822, -152296, 135936, -258998, -250376, 83302, 10937, 195842, 277, 97397, 353296, -53634, -42775, 109668, 77431, -190814, -6203, -39619, 9883, 224826, -239599]
18271E3323e5920j70693C2413L79045E0406d16710A50468i6446n1795B69443a82609
18259C3046b12637j57193B41007a98290D9894c9482A5646b0703A99590A4516a62578
18247b02524O8195l92181b63081a13306j3556a1095k8255i807o4477m3457M9204
18236f8537J7731B16557C4585c41934P3545G2907i264G333b4121B48935a78169
18224A73226b25902K1046A53849a16197M7762a8026B66066a98915B7734b6839
18213I6647D2257h6782C1305Q7752C5463a32843B82931L371E4200b7243r747k4147
18201f1137A05902a42900c6979A05501a51921A64502i923B28683b29771L5218
18191a94553C16109n8281g7462q0238I6529m2681d11462e6969m6382B5158a43747
$$ y = [53323, -55920, -226613, 32413, 411458, 50406, -416710, 150468, -96446, -148241, 269443, -182609, 33046, -212637, -369830, 241007, -198290, 49894, -39482, 15646, -20703, 199590, 14516, -162578, -202524, -134329, -526510, -263081, -113306, -126862, -11095, -39350, -9807, -74284, -117741, -68537, -50806, 216557, 34585, -341934, -268389, 72907, -9264, 7333, -24121, 248935, -178169, 173226, -225902, -204856, 153849, -116197, -68435, -18026, 266066, -198915, 27734, -26839, 96647, 42257, -86782, 31305, 119057, 35463, -132843, 282931, 286302, 54200, -27243, -36990, -61137, 105902, -142900, -36979, 105501, -151921, 164502, -9923, 228683, -229771, -194553, 316109, 257828, -77462, -157700, 96529, 53848, -411462, -56969, -103351, 25158, -143747]
18179b35293C0880J61807d1452A19530n8376i4646c4964j70668h5838A98350R4110
18168B92460b77156O8571C7980J02516a87918A37353f5617k27005O7522j25928
18158c51028A09750c0214l36645L1451g3731m4891b2044A75415d45524a31992
18147A11846C0010N5145a04844A56263f711C71299c3275p6639p9928c9790B94052
18135B46291a33945B71434a66329f7320J3131r8689A85018F698d88641J37145
18125c51496G2855P5919b01358G321h5864L7230j30742j8555B77782b49094K9120
18114b19974d2537j74393d3745B56812h0338n0795E4087J3566a18739B5421C94
18102H4673R8674b54102J26003l05894f1780m7876j20153B04907a6306A05210
$$ y = [-235293, 30880, 192687, -41452, 119530, 61154, -94646, -34964, -205632, -85838, 198350, 292460, -277156, -208585, 37980, 140496, -187918, 137353, -65617, -292622, -225100, -351028, 109750, -30214, -366859, -335408, -73731, -118622, -22044, 175415, -445524, -131992, 111846, 30010, 85155, -104844, 156263, -6711, 371299, -33275, -109914, -189842, -39790, 294052, 246291, -133945, 271434, -166329, -67320, -54189, -152878, 185018, 6698, -488641, -351496, 72855, 148774, -201358, 7321, -85864, -48634, -179376, -197931, 277782, -249094, -219974, -42537, -216930, -43745, 256812, -80338, -131133, 54087, 67653, -118739, 25421, 394, 84673, 183347, -254102, -128099, -433993, -61780, -109656, -229809, 204907, -16306, 105210]
18091A5800J26898b35980d0257j5894r5066A59984L8130C258a45775A32230c19897
18079a2823j50825j38915F8379N6324a65917A59670d239A63634H1484a81518F7326
18067a78428g340k1537C54944a22915A61258F0070g1956j18352O2184A71081H2777
18055I8549b30685C7664b64231D9730P1180a21750A72177c54323A12486b62928
18044b1065B07305i6013k03363J45245c5322k26059N2951f6206l39257d9900o4524
18033a14424P773G5660A6623J67490n2568Q3971A02797J4941a38472E0829a94779
18021B51804B5476b01314D4863c4207o1555k3883i988A81609G1951Q9369H0536
18009h5203F6197R3936a3529j35868f5239B622h7670j457A79937b15315Q7143
$$ y = [15800, 142698, -235980, -40257, -56151, -151217, 159984, 198114, 3258, -145775, 132230, -319897, -12823, -163648, -302563, 68379, 124703, -165917, 159670, -4239, 163634, 81484, -181518, 67326, -178428, -7340, -28877, 354944, -122915, 161258, 60070, -71956, -190308, -128124, 171081, 82777, 98549, -230685, 37664, -264231, 49730, 120910, -121750, 172177, -354323, 112486, -262928, -21065, 207305, -96013, -299376, -154131, -35322, -261381, -208430, -66206, -405463, -49900, -114424, -106651, 75660, 16623, 184113, 131545, 215516, 102797, 117738, -138472, 50829, -194779, 251804, 25476, -201314, 44863, -34207, -95762, -119645, -9988, 181609, 71951, 161320, 80536, -85203, 66197, 160133, -13529, -149397, -65239, 2622, -87670, -89127, 179937, -215315, -128172]
17998a28172B71512J6235a7025k9350A06533a20475l53636B8547a64173B5102
17987B32356A2800h7302r1369A19078C5591b64859B18158h9095A42683H522e0861
17975A25163a22064j93498A33755K42893C1531h827A8196M7009a41707f3056C3359
17963a801j42177A08514e8110o7719A53440A905O5070i510j72713d363j1066o4799
17951h0228j08603Q6532A09303a06956j18247a06012j3884j56773a2296j49526
17941a61822b9822G950Q0339N6448c11688a02978d5492E3757Q3108J20083b03180
17929h3330F8908N3268b42063A10440E3185p302a1342j03107k2887A49970a9935
17917b07407b8413m3892E8989a65500Q1613L1703k16904A27624O7543b77464p0447
$$ y = [-128172, 271512, 287747, -17025, -46375, 106533, -120475, -474111, 28547, -164173, 25102, 232356, 12800, -87302, -178671, 119078, 35591, -264859, 218158, -89095, 142683, 8522, -50861, 125163, -122064, -315562, 133755, 376648, 31531, -8827, 18196, 65205, -141707, -63056, 33359, -1801, -143978, 108514, -58110, -125829, 153440, 1905, 66975, -9510, -182223, -4363, -15429, -80228, -188831, -102299, 109303, -106956, -225203, -106012, -119896, -276669, -12296, -161822, -29822, 7950, 88289, 144737, -311688, -102978, -45492, 53757, 136865, 256948, -203180, -83330, 68908, 122176, -242063, 110440, 53185, 45883, -11342, -114449, -137336, 149970, -19935, -207407, -28413, -72305, 58989, -165500, -83887, -52184, -269088, 127624, 195167, -277464, -347911]
17906c47911N2234A63341b71934J03090C0104K20533b21526E3867a09374L8855
17896g0519R909p4968A30849L4818a1128A36819i1053F1779b8696A47876a84380
17884E4515J399c99917B7069K08254k0204I4330a63411K0691f5721E7253b76573
17872a47554m7262E4456h0893A47851D1319J12849B9051M8595a16032j76500e8200
17860a56919J0484A65508d062j9906j8682C03713b19802A71438D9994a33856B63633
17848A35376O5615h5715F3937a14283e4521A76651a64792a7887A72359R5496a50651
17836B96225a35931B1073A0476J6540a24676C03742H935R3693a01089B95153d23630
17824B24741G0171J12075e375k29328i9189A35908J48331a93970i1214F9401M1361
$$ y = [-347911, -295677, 163341, -271934, -168844, 30104, 250637, -221526, 53867, -109374, -70519, -60610, -135578, 130849, 165667, -11128, 136819, -91053, 61779, -28696, 147876, -184380, 54515, 55914, -399917, 27069, 235323, 215119, 94330, -163411, -142720, -65721, 57253, -276573, -147554, -194816, 54456, -80893, 147851, 41319, 154168, 29051, 77646, -116032, -292532, -58200, -156919, -146435, 165508, -4062, -23968, -42650, 303713, -219802, 171438, 49994, -133856, 263633, 135376, 200991, -85715, 63937, -114283, -54521, 176651, -164792, -17887, 172359, 267855, -150651, 296225, -135931, 21073, 10476, 27016, -124676, 303742, 8935, 102628, -101089, 295153, -423630, 224741, 70171, 182246, -5375, -234703, -99189, 135908, 284239, -193970, -91214, 69401, 110762]
17813A10762J14176e3271A20047d67253B31657M50J439f0994D7532a88544B657
17801F837a64315l0608h2672k67878I0657K50511H3500J84753C4548b30844A90832
17789D4560c73586a39925A46812F4564K28398I7619a59293L1289h67C18459d9412
17777C8739J40890c56460b4998A56041d04184B75773g2882A19355d0553l0389
17767g0942A35620a04877k00085A33263b03857I8884N9854m1348K93541G9730
17756E1917a48306B59756F9905B1475K08772i7389d3860Q030B23179a38707L8103
17745a00604M6167j34627j61851A5741h0967J2134B49333J28072E7496e1670A76647
17733g2767o5658m9821R1800B84140C405J81790Q9573p5973p7177B302K0927J18882
$$ y = [110762, 224938, -53271, 120047, -467253, 231657, 232107, 233546, -60994, 47532, -188544, 2657, 6837, -164315, -194923, -82672, -350550, 90657, 341168, 83500, 268253, 34548, -230844, 190832, 44560, -373586, -139925, 146812, 64564, 292962, 97619, -159293, -128004, -867, 318459, -49412, 38739, 179629, -356460, -24998, 156041, -404184, 275773, -72882, 119355, -40553, -70942, 135620, -104877, -304962, 133263, -203857, 98884, 158738, 117390, 410931, 79730, 51917, -148306, 259756, 69905, 21475, 230247, -97389, -43860, -35830, 223179, -138707, -100604, -54437, -189064, -350915, 15741, -80967, -68833, 249333, 377405, 57496, -51670, 176647, -72767, -138425, -188246, -96446, 284140, 3405, 185195, 274768, 198795, 121618, 2302, 23229, 142111]
17721A42111a06512L1647B3006J63041f0487o9037J2442K0663A8886L69480a48434
17709A17011j6295J03095q0926c50918B12276c0803j18240C13951q4544K05013
17699D34420c3963E938A18R1931b55947C2995b07304P0898A02560J6216O7597
17688A86373o5010b15022g5396H0844a75983A39849i3111B15925a83389g9527
17677B22884F6881L9939d3898E4546a23159A18843K0420a03651G434Q492c5287
17665g6419B24379a22228l32439a7527A87813j4640i4152A80125N7078b3953l368
17654b7321m7132A91691a33172q0979g5944c6918k88100a47032j3531l3422M1371
17643a52614h484A75849a40834E7132a14104H6970h1404a4103k48976A8462L6209
$$ y = [142111, -106512, -74865, 23006, 186047, -60487, -129524, -117082, -96419, 18886, 388366, -148434, 117011, 100716, 203811, 122885, -350918, 212276, -30803, -149043, 313951, 229407, 434420, -33963, 5938, 118, 92049, -255947, 32995, -207304, -136406, 102560, 118776, 186373, 121363, -215022, -75396, 80844, -175983, 139849, -93111, 215925, -183389, -79527, 222884, 66881, 106820, -43898, 54546, -123159, 118843, 139263, -103651, 7434, 15926, -35287, -76419, 224379, -122228, -454667, -17527, 187813, 173173, -94152, 180125, 237203, -23953, -27321, -74453, 191691, -133172, -214151, -75944, -36918, -325018, -147032, -160563, -193985, -152614, -8484, 175849, -140834, 57132, -114104, 86970, -81404, -14103, -263079, 18462, 54671]
17632E4671P2475b3336A83a34162A65180F2213a87554Q8906F0032A8543Q0706
17621I9249P773d0457I9035L5482a34981c1885o6331A78241b2408F0604h650F4507
17608F0145b229D1516h2401K7275j91397i2225j6404A47650p2837b6433j03596
17597a30029f0126p7750L7021C22355a26390I7744a85622b3591l0868K4731F7806
17585A68030h5595j01163E8289j8015c00546a02880A76165B7996n999R4358a18406
17573A20266K41598H3288a21781A4776J13854a34229n5156A05934P7360K5874
17563B09168C1552L19453i984A32868R1701G1378R6775a6771A40485B9441b15879
17551A82663E2155d6687B02125a64794a8457A72696a85828b1326l0103I0831c08658
$$ y = [54671, 127146, -23336, 183, -134162, 165180, 62213, -187554, -98648, 60032, 18543, 99249, 107022, -40457, 99035, 134517, -134981, -31885, -98216, 178241, -22408, 60604, -8650, 64507, 60145, -2229, 41516, -82401, -55126, -246523, -92225, -108629, 147650, 74813, -26433, -130029, -60126, -137876, -100855, 322355, -126390, 97744, -185622, -23591, -54459, -29728, 67806, 168030, -85595, -186758, 58289, 40274, -300546, -102880, 176165, 27996, 21997, 116355, -118406, 120266, 361864, 83288, -121781, 14776, 128630, -134229, -189385, 105934, 183294, 209168, 31552, 351005, -9984, 132868, 224569, 71378, 168153, -16771, 140485, 29441, -215879, 182663, 52155, -46687, 202125, -164794, -18457, 172696, -185828, -21326, -51429, 90831, -308658]
17539B14742a22386I7022a80977C98241c2694j53364C42492A30214c9347C98853
17528B04039d395C24456b01168f8104j01926B90296m2020M5666j01721G3884e3718
17516A15317M5260c03212C6525A6748a40575N1404a3139d053j41650j65210B12004
17504B11720Q4800j36038J30700j14518J05074b50021A40496J3666a78036H9432
17493b34903J8100F3850d1485B68777o5065q2904a72579B25499b0051G9520J56690
17482B36210e429o2704c1126C44848j43874E1679L9200C9523H838K31295a0897
17470B9009K08624J17311j13844m0668q2353K43334H2866R5214q4491m769a11779
17458h8761D40132h924D827b94492D53900A72000J70267p760A02358R4990K66235
$$ y = [214742, -122386, 97022, -180977, 398241, -32694, -186058, 342492, 130214, -39347, 398853, 204039, -4395, 324456, -201168, -68104, -170030, 290296, 248276, 293942, 192221, 73884, -53718, 115317, 160577, -303212, 36525, 16748, -140575, -89171, -13139, -4053, -145703, -310913, 212004, 211720, 296520, 160482, 291182, 176664, 281738, -250021, 140496, 154162, -178036, 89432, -234903, -216803, 63850, -41485, 268777, 203712, 120808, -172579, 225499, -20051, 79520, 236210, -5429, -68133, -31126, 344848, 200974, 51679, 90879, 39523, 8838, 240133, -10897, 29009, 237633, 354944, 241100, 200432, 118079, 361413, 82866, 178080, 93589, 88820, -111779, -88761, 440132, -8924, 4827, -294492, 453900, 172000, 342267, 334507, 102358, 197348, 463583]
17447D63583D3740M3808K76191i4306f223D14423k03964b801A90028L46919j26718
17436D10229D6622a89938A22417K38337D6963M5876d0327B15121N2644E9255L91245
17425D50500j59795A07565J55371J48894A79418J76989j21815K33290A79506J45516
17415C25022O7461Q1273A36432A6002J12633J36801M6341A33056J04593J52172
17405C89821A72983N5197m5550R9161n6676I3451K59024A57615n8286f0577I0155
17393A37664J77875c2396B58137L7409H6435N3252B8268L66480I7927M01716C981
17381A35315K47349j42788J34219I4440M6885K9611N3078I8541K19905H7740M58
17370H8198J97342j15250J03187j09696R2045f0231B12974N4496A33146K82139
$$ y = [463583, 43740, 87548, 363739, -94306, -6223, 414423, 210459, -2801, 190028, 536947, 410229, 46622, -189938, 122417, 360754, 46963, 92839, -40327, 215121, 267765, 59255, 450500, 290705, 107565, 262936, 411830, 179418, 356407, 234592, 467882, 179506, 325022, 392483, 473756, 136432, 16002, 128635, 265436, 311777, 133056, 237649, 389821, 172983, 228180, 182630, 281791, 225115, 93451, 352475, 157615, 99329, -60577, 90155, 137664, 315539, -32396, 258137, 295546, 86435, 139687, 28268, 394748, 97927, 499643, 3981, 135315, 382664, 239876, 374095, 94440, 141325, 170936, 224014, 98541, 318446, 87740, 88198, 285540, 170290, 273477, 163781, 255826, -60231, 212974, 267470, 133146, 415285]
17360D15285A75315p967Q6078C1822J63819G9585K81965h0515H2480J2795a5411
17348A28515a19916B50403H3139B6543J801J67293q5874d2939A41513Q5793m5539
17337A81767f6511B71620q0229f9942C41742O5831A22868k3269J56234F0485R9303
17326A59788Q0364E3502L2155a03038k21925A35248o070l7L40353c9259j82638
17315b21897A61527M50359B2815h7368A96529K77033d6802A45487J58997j06541
17305A97943b66029A13854a31395a7613C25652A30598K76300A49247n4419J59751
17295B54579m1248C2423b6418B9487J70898a11931b9244l6837B63171l8330p4450
17284A50391R5907N0308b3404A74799K48385A31581R2414H4275L05712B3962P159
$$ y = [415285, 175315, 167348, 253426, 31822, 195641, 79585, 361550, -80515, 82480, 95275, -15411, 128515, -119916, 250403, 83139, 26543, 28344, 195637, 109763, -42939, 141513, 227306, 181767, -66511, 271620, 191391, -69942, 341742, 407573, 122868, 99599, 255833, 60485, 159788, 240152, 53502, 85657, -103038, -324963, 135248, 129178, 129141, 469494, -39259, -221897, 161527, 611886, 22815, -87368, 196529, 473562, -46802, 145487, 304484, 197943, -266029, 113854, -131395, -17613, 325652, 130598, 406898, 149247, 94828, 254579, 213331, 32423, -26418, 29487, 200385, -111931, -29244, -66081, 263171, 224841, 150391, 246298, 296606, -23404, 174799, 423184, 131581, 223995, 84275, 389987, 23962, 31121]
17273C1121L50239a56892B44956R886C0756K83646H396a6627r2362h834A61625
17261A09674e4990H3865d6933q056I9145L90842A50997J40688j22545E0881K11238
17250B62119c69248G2189L6441k0581d7284C44132H3273L75455b05572B92570
17239D18290F8899a57660H1284K29415B448K40970o5931J46284C2611J84666l6833
17228A80444K29793A74528l9008l2781J85839l2106Q5464P9021j43122J24926
17218D02761j11999A870J02475K08706r8425C2328b04279B52616E773b0092P954
17207a2138A00812P4432a87670A79600J81315A50260Q549J16853L24361k49193
17197C50830r7603M9801J42086a25828C93696A17925J72646j2591e2252B61080
$$ y = [31121, 381360, -156892, 244956, 254842, 30756, 314402, 8396, -16627, -108989, -8834, 161625, 109674, -54990, 83865, -46933, -54989, 99145, 489987, 150997, 291685, 169140, 50881, 262119, -369248, 72189, 108630, 88049, -47284, 344132, 83273, 458728, -205572, 292570, 418290, 68899, -157660, 81284, 310699, 2448, 243418, 177487, 323771, 32611, 217277, 180444, 410237, 174528, 135520, 102739, 288578, 256472, 341936, 420957, 277835, 402761, 290762, 1870, 104345, 313051, 214626, 32328, -204279, 252616, 5773, -20092, -12138, 100812, 175244, -187670, 179600, 360915, 150260, 158809, 275662, 600023, 350830, 253227, 303028, 445114, -125828, 393696, 117925, 290571, 277980, -52252, 261080]
17186C41971K94434m5049A29555L91781d7066B3795M79039A80413m3428o0801
17176G6184C6163N7189M2579O3889K28319n3741A14842J17884N1097K02504k28129
17165B58198Q37k4158H5286J57204i066C15468p4431p5938K66034A74380K03243
17154C77623J25167k32715K06742B02885M3110E4913N9434M5701K50406K57923
17144F68377A39141J05157J63739C9027J41903J83760J23456j34952j20484C2312
17133D64335k26019l6239O0842J40706J39001k54845L5340K32951r1704m8501
17123D15867j59964J7404O1133q966L37644B89077J70336j3765p2814j32454q221
17112B32159J25182j47968C4588M14283n3834K8521C7087O46853A02353N12922
$$ y = [341971, 636405, 591356, 129555, 521336, -47066, 23795, 502834, 180413, 136985, 76184, 36163, 93352, 135931, 199820, 428139, 374398, 114842, 232726, 283823, 486327, 258198, 259035, 234877, 85286, 242490, -9066, 315468, 241037, 165099, 431133, 174380, 377623, 502790, 270075, 476817, 202885, 245995, 54913, 114347, 160048, 410454, 668377, 139141, 244298, 408037, 39027, 180930, 364690, 488146, 353194, 232710, 32312, 464335, 238316, 202077, 262919, 403625, 542626, 287781, 323121, 556072, 464368, 415867, 255903, 273307, 334440, 325474, 663118, 289077, 459413, 445648, 372834, 240380, 232159, 357341, 209373, 34588, 448871, 395037, 423558, 37087, 683940, 102353, 615275]
17102F15275B74587J65396j55900J6432A19185R1725K4830K76736B45010j13071
17092A31939J90453A47224K93657j13106K19514k13714k2214J11059p6768M5555
17082C91207r599J49802j98443J37292J5227B09717M07857k82903q8993K79470
17072E25148m2091n1803A56407L77323j42065j59386J16763K21290j52085k2407
17062C95840J59822R3027n9990j62131J8034J04359j96767a1972F33804l13423
17052C20381J14205A84387L31496k51230J59275r1721J48843O314R9798j45246
17042D41916J33955J15307J22517C45319p2448L92368C27665L2588K84290l4064
17032F10479q0973j03249K88512j78396m3737L28052k01938l5277j48096O05330
$$ y = [615275, 274587, 439983, 284083, 300515, 119185, 210910, 235740, 512476, 245010, 131939, 322392, 147224, 440881, 327775, 547289, 333575, 311361, 422420, 345652, 391207, 381608, 531410, 332967, 470259, 485486, 209717, 617574, 334671, 245678, 525148, 483057, 431254, 156407, 533730, 391665, 232279, 349042, 570332, 418247, 395840, 555662, 648689, 588699, 426568, 444602, 548961, 352194, -11972, 633804, 320381, 434586, 184387, 515883, 264653, 423928, 332207, 481050, 487364, 587162, 441916, 575871, 691178, 813695, 345319, 272871, 665239, 327665, 360253, 644543, 610479, 529506, 426257, 714769, 536373, 492636, 820688, 618750, 583473, 435377, 1040707]
17022A040707l68086o4540J86045q9562r8745o9787K01800M6339C90424N23462
17012I13886j37328l35511L80737k58235L13416l17523J09783P361O630R0909
17002G74125J85059m12797J46368l6037J20653k56528K22183q3546J08925l8655
16992G29750J80732j5530k02699K15198l1286D20303P99715m88122j05780r5101
16982E31015k9979K99191j97745K46552J87315j74531k0429J91094j08125k19887
16972G04471K26152k67909K37899K72782j97348N8243j57928J21589j62609l5147
16962H00195r16M8964J92424j40613J03533m8652j14566K88733j65738O8899j98806
16951H33457k51920O10479R4614K1960j49654k55727K23367k68100L31529k23982
$$ y = [1040707, 672621, 608081, 794126, 704564, 605819, 536032, 737832, 784171, 390424, 913886, 776558, 441047, 821784, 563549, 876965, 559442, 669225, 676586, 683216, 774125, 959184, 546387, 692755, 656718, 777371, 520843, 743026, 659480, 768405, 729750, 910482, 894952, 692253, 907451, 876165, 420303, 1220018, 731896, 626116, 531015, 501036, 800227, 602482, 849034, 1036349, 861818, 841389, 1032483, 924358, 704471, 930623, 662714, 900613, 1173395, 976047, 1034290, 876362, 997951, 835342, 800195, 799279, 848243, 1040667, 900054, 1003587, 954935, 840369, 1129102, 963364, 1032263, 833457, 581537, 1192016, 1286630, 1308590, 1158936, 903209, 1126576, 858476, 1190005, 966023]
16941I66023L35701r977j07184k73006M1629l4554K75912K35447K9547j00242
16931A359296k11123J68203j6955O209l83524K29368r1400K12621R6373j41595
16921A227473J34853J01303k36027k9415J75417l3331J63776J34001k61028J5041
16911A392063j60434L45431k06848j8018O2356j67084K024M36271k53773K05205
16901A637193k3860j0606n7874J51143j08456j97240L62741p2384J04876L6292
16891A821825k27284K17612p3352K50752k11962L58252j2386j40435j44362k1749
16881A816911J58211P7797n9507J06296j12092j22783J22788p5079K73443L96871
16871B582856j45507M2969j55638j3875j83534L35665j8592o56K12976j09267
$$ y = [966023, 1301724, 1291747, 1184563, 911557, 953186, 918632, 1194544, 1429991, 1459538, 1359296, 1148173, 1316376, 1299421, 1305630, 922106, 1151474, 1060074, 1272695, 1369068, 1227473, 1362326, 1463629, 1227602, 1198187, 1373604, 1340273, 1504049, 1638050, 1377022, 1392063, 1231629, 1577060, 1370212, 1352194, 1414550, 1247466, 1249490, 1685761, 1431988, 1637193, 1613333, 1602727, 1544853, 1695996, 1587540, 1390300, 1753041, 1680657, 1785533, 1821825, 1594541, 1812153, 1738801, 1989553, 1777591, 2135843, 2123457, 1983022, 1838660, 1816911, 1975122, 2052919, 1993412, 2099708, 1987616, 1864833, 1987621, 1912542, 2185985, 2582856, 2437349, 2480318, 2324680, 2310805, 2127271, 2462936, 2444344, 2443688, 2656664, 2547397]
16861B547397j43876P5965K13318k57339L17472p1815N47052l36588j28437N629
16851B768778L4851L66280K05342l15111L9116O3937P893N57473n04934L33931
16841C557556j18096k38604K35728K37998l6933K6681O09305m48843K9865K50961
16831D105618r7377L29656K2751p5099K41999R5605N5882n5589K69490k81543
16821D611393L29185J49104j07088J94405k23053O92732j95813K29478J60374
16812E840717K34539J7771J68078j17347K36871j5529N80932k26229L58905L9687
16802G118395K86707j20482L97976K77974r3494M18579M03802j33580n2998O53426
16792I156305K81060O1103K63560n1827N32395J6162P24595J89208J75860N74022
$$ y = [2547397, 2403521, 2479486, 2692804, 2435465, 2752937, 2681122, 3228174, 2891586, 2763149, 2768778, 2803629, 3169909, 3375251, 3060140, 3099256, 3163193, 3171086, 3728559, 3223625, 3557556, 3439460, 3200856, 3436584, 3674582, 3637649, 3664330, 4273635, 3824792, 3854657, 4105618, 4008241, 4337897, 4360648, 4285549, 4527548, 4623153, 4679035, 4623446, 4892936, 4611393, 4940578, 5089682, 4982594, 5176999, 4953946, 5646678, 5450865, 5680343, 5840717, 6075256, 6093027, 6261105, 6143758, 6380629, 6365100, 6946032, 6719803, 7078708, 7118395, 7405102, 7284620, 7682596, 7960570, 7867076, 8285655, 8689457, 8555877, 8502879, 9156305, 9437365, 9498468, 9762028, 9710201, 10242596, 10258758, 10983353, 11172561, 11348421, 11922443]
16782A1922443p6440R29939m7978O59670L65864M09490Q16193q9506P17626M77538
16772A6084839R08448N46844L76965M79417P99520P03144J163360L87108J129943
16763B2579588N83781J026621J250943R60253J191566Q97525J370048J695607
16755C1555932J226971J533500J879413J911346J822916K124802K238776K218715
16747D6512371K350558L017920L095357L070910L405201L777671L783489M364042
16739G3377519M796894N099083N388086N486219O439202O179140P294608P054245
16731A21114996Q167347Q155173Q259946Q512815Q240639Q420070P769681P608621
16723A86249288N896731N562614M142855L080812Q11687O0941j624912l357893
$$ y = [11922443, 11846003, 12775942, 12727964, 13387634, 13753498, 14162988, 14979181, 14889675, 15607301, 16084839, 16993287, 17540131, 17917096, 18396513, 19196033, 19899177, 21062537, 21449645, 22579588, 23163369, 24189990, 25440933, 26401186, 27592752, 28490277, 29860325, 31555932, 32782903, 34316403, 36195816, 38107162, 39930078, 42054880, 44293656, 46512371, 48862929, 51880849, 54976206, 58047116, 61452317, 65229988, 69013477, 73377519, 78174413, 83273496, 88661582, 94147801, 100587003, 106766143, 114060751, 121114996, 129282343, 137437516, 145697462, 154210277, 162450916, 170870986, 178640667, 186249288, 192146019, 197708633, 201851488, 204932300, 205743987, 205804928, 204180016, 200822123]
16715B00822123m288486o062276o345425p621041p906168q452460q781276q524086
16707A42840905q468106q386045p456595p652477p000716o654168o124614n931814
16699H5166370n138454n146571m292929m250617m143598l619057l300496l605482
16691E1669166k611454k604973k659828j973143k426890k127455j689856j687850
16683C3887717j346695j874196j474972j239086j046235j531182j151061r80070
16675B3244220r63693o11670j219050p56106n62721p74558o57398j045715o99905
16666A5953404l10751q90738J9251o02916m54907l54156n84902o91703m19479
16657A1663103O2014m99869k93026j73925l44774l22660l65938k46426p4459m86420
$$ y = [200822123, 196533637, 190471361, 184125936, 176504895, 168598727, 160146267, 151364991, 142840905, 134372799, 125986754, 118530159, 110877682, 103876966, 97222798, 91098184, 85166370, 80027916, 74881345, 70588416, 66337799, 62194201, 58575144, 55274648, 51669166, 49057712, 46452739, 43792911, 41819768, 39392878, 37265423, 35575567, 33887717, 32541022, 30666826, 29191854, 27952768, 26906533, 25375351, 24224290, 23244220, 22280527, 21668857, 20449807, 19693701, 19130980, 18356422, 17699024, 16653309, 15953404, 15642653, 14751915, 14771166, 14168250, 13713343, 13359187, 12774285, 12082582, 11663103, 11725117, 11225248, 10932222, 10758297, 10413523, 10090863, 9724925, 9478499, 9404040, 8917620]
16647H917620m61002q3928k31746q1251n60333L09748m69408l4258k48747n23297
16637F533398M43042p71431J95521j65097l36665M8332l91290N8441k93523j4232
16627E306496p0485l20174M3633K87146m42283k31943k53675K42426p8980j59714
16617D322447J61501n63229j0213m35241M11141J90720p68523K09296R9430q4291
16607C533038m00440L16834l30917J48393Q1216j32229k6836k66299l9380j4285
16597B869095P6724r5006M4804k0745l9324j75140k40801j60321J86315M3632
16587B489233k03025O5743K65961n38711M3557K24733m12362L37361k51823J10752
16577B131419K66292l44904j86912J65622L9426L7675r137j92338k30375L52287
$$ y = [8917620, 8456618, 8372690, 8140944, 8059693, 7499360, 7809108, 7339700, 7305442, 7056695, 6533398, 6976440, 6205009, 6400530, 6235433, 5898768, 5947100, 5555810, 5614251, 5320728, 5306496, 5236011, 4915837, 4959470, 5246616, 4804333, 4572390, 4318715, 4561141, 4482161, 4322447, 4483948, 3920719, 3910506, 3475265, 3886406, 4077126, 3308603, 3517899, 3617329, 3533038, 3132598, 3449432, 3118515, 3266908, 3348124, 3215895, 3189059, 2922760, 2883380, 2869095, 2945819, 2850813, 2895617, 2874872, 2835548, 2660408, 2419607, 2259286, 2445601, 2489233, 2286208, 2351951, 2617912, 2079201, 2122758, 2347491, 1935129, 2272490, 2020667, 2131419, 2397711, 2052807, 1865895, 2031517, 2070943, 2108618, 2099481, 1907143, 1676768, 2029055]
16567B029055k86084j54847K12275J48442k47407M0861l40946l7061K05013r4410
16557A474891l0713j20893K15605N5875j22001P5436J18313k5766l38201L12360
16547A614906K9543l34309J13899k8766l4749j48338q4014n0259K12397j07407
16537A182903R4552l0951j11303k33092P212Q0738j1200j08031K32156Q3797m7664
16526A139117k61666J35109P3090j46393k1546j57412P9648j492o3351K07949
16516I83053l32058K45406R1571J24193l96578p1743O88546n75449k8274L98810
16506A127477l09295k21872L04021J8694n1811l3260j16794M7938L4987R6199
16496H96284j80517J65492j26207N4542o8191k31066O67827C82712L81219l01308
$$ y = [2029055, 1742971, 1588124, 1800399, 1948841, 1701434, 1742295, 1401349, 1364288, 1569301, 1474891, 1444178, 1323285, 1538890, 1594765, 1472764, 1548200, 1666513, 1640747, 1302546, 1614906, 1644449, 1310140, 1424039, 1395273, 1360524, 1212186, 1128172, 1077913, 1290310, 1182903, 1277455, 1246504, 1135201, 902109, 909321, 990059, 978859, 870828, 1102984, 1186781, 1139117, 877451, 1012560, 1085650, 939257, 917711, 760299, 839947, 838455, 775104, 983053, 650995, 896401, 987972, 1112165, 715587, 643844, 1332390, 756941, 728667, 1127477, 818182, 596310, 900331, 919025, 867214, 833954, 717160, 765098, 800085, 896284, 715767, 881259, 755052, 809594, 741403, 510337, 1178164, 382712, 763931, 462623]
16486D62623L62188J40448l71340J5286O8670k16417J10434K89385j70779k35583
16476D54915J97974r3136j58372L52088n5635p3908J41590L1705j136r1033k49535
16465D55517q087N288N8375P8209j60806J36735r9877M1548r3010m8742M4670
16454D09820J01710K28275B67405n0612K87723A70880N21206k18309j56151j0314
16444C07312K45904p0825K28250F7953N76274j14062L7910l5716B06390L66752
16434E73142A48511M18995l5745M6654k85066J49736H2437L45200e476j05343
16424a10819C10154J89263b9568E46117q1076m7162p9045p7097J48332A82849
16413A23878k0105J88452K13240k38528J03953o3895R2490j51315N6486J88066
$$ y = [462623, 824811, 965259, 593919, 609205, 677875, 461458, 571892, 861277, 690498, 454915, 652889, 559753, 401381, 753469, 697834, 623926, 765516, 797221, 796085, 705052, 455517, 447430, 452718, 511093, 589302, 428496, 565231, 465354, 506902, 413892, 365150, 409820, 511530, 739805, 267405, 216793, 504516, 170880, 692086, 473777, 317626, 307312, 553216, 482391, 710641, 67953, 644227, 530165, 568075, 532359, 206390, 573142, 148511, 567506, 531761, 578415, 293349, 443085, 82437, 427637, -5476, -110819, 310154, 499417, -29568, 546117, 465041, 417879, 338834, 261737, 410069, 182849, 123878, 103773, 292225, 505465, 266937, 370890, 306995, 399485, 248170, 304656, 492722]
16403D92722r8927j33288P6676n0573K15629B15262K51445A27966N1681K15300
16393C94947J09011I5572M7000l6444P1462K9296Q179J08308j34019K38399r0068
16382C37685k0188F9324J65305H3646N4858P6326A2834L1055P6844j9928c7849
16370B9675Q8366J47007f5353A99272p8535M1694R375j6760K04931k2232g56B64758
16357A07181a4796A72188F9596K69110r4472g9663B13408J79346i2664a274A88903
16345D8827J74118L18715k52409G8673J36135n6872J14391J1904J34784A27538
16334g1296B91430P7396A25545J58803k328B5875J84646k4098k8466M8139j02614
16323A03482a13589E48293k42272k1118q0735f572A02185K37783j09799q4479
$$ y = [492722, 393795, 260507, 337183, 286610, 502239, 215262, 466707, 127966, 179647, 394947, 503958, 95572, 142572, 106128, 177590, 206886, 215065, 323373, 189354, 427753, 337685, 317497, 69324, 234629, 83646, 138504, 214830, 12834, 43889, 120733, 100805, -37849, 29675, 118041, 265048, -65353, 199272, 120737, 162431, 171806, 155046, 359977, 337745, -756, 264758, 107181, -14796, 172188, 69596, 338706, 244234, -79663, 213408, 392754, -92664, -1274, 188903, 48827, 222945, 541660, 289251, 78673, 214808, 157936, 272327, 284231, 419015, 127538, -71296, 291430, 368826, 125545, 284348, 282020, 25875, 210521, 186423, 157957, 206096, 103482, -113589, 548293, 306021, 284903, 204168, -6572, 102185, 339968, 230169, 145690]
16313A45690J66606r4713C8076g5344B26034n0193D4897L20086a89191B15060
16302C87960h3842m5036A93267N4730a69745G955a97186A16795D6799B1362f4541
16290C5292a9229B32321a28322B87357m6697B967L02035j22221i981n5305R017
16279e6269D1330d4812B26698I3052a19474B49867c0068A08874K0923J04440j1409
16268B22828G0522g9120a0619B91429o2730h0612B10504a45271A23630J16254
16258B39884E5744J21038l6134m6952J15844F4687J04938h822B47605f5498A21340
16246B43389B1677g4251G2559M4797J30212b09928O5042B73058a35281I3977J89000
16235B82977a6833A60150a72178C12437j25349b8566j6759C2577b19066A42347
$$ y = [145690, 312296, 217583, 38076, -75344, 226034, 175841, 44897, 364983, -189191, 215060, 387960, -83842, -128878, 193267, 247997, -169745, 7955, -197186, 116795, 46799, 21362, -64541, 35292, -19229, 232321, -128322, 287357, 240660, 2967, 305002, 182781, -9981, -65286, -56269, 41330, -44812, 226698, 93052, -119474, 249867, -30068, 108874, 129797, 234237, 222828, 70522, -79120, -10619, 291429, 228699, -80612, 210504, -145271, 123630, 239884, 55744, 176782, 140648, 93696, 209540, 64687, 169625, -8822, 247605, -65498, 121340, 243389, 21677, -74251, 72559, 117356, 247568, -209928, -144886, 273058, -135281, 93977, 282977, -16833, 160150, -172178, 312437, 187088, -28566, -45325, 32577, -219066, 142347]
16224G8979J6328a27753B27043c63180C08690I2701J4990J07866E3014A3463J25657
16213A39120a7819B52842D3853A9017J61924e9915A20504M9306a69691B23377
16202b62335I798K31587b07931A93022l5603Q2475E3098K4304d0193j9329A30186
16190B8919L8377B786d8178I4779L05279d3375k02932A10969a87922C1683M0178
16179G1861h4811n3F4050a29171A86409h8033j24499B9963J56657k610A3202a64063
16166D338L01733a54267A42207a94195B18236e9368k34976A7789a05505d4934
16155A2318J07120C9080b1876A3081N4427b99141A7118a42022P375b7509j18649
16144a46158O2416C68427F4105a64158A48651J07691A8919P1565d6775F849a16909
$$ y = [78979, 95307, -127753, 227043, -363180, 308690, 92701, 107691, 215557, 53014, 13463, 139120, -17819, 252842, 43853, 19017, 180941, -59915, 120504, 169810, -169691, 223377, -262335, 9798, 241385, -207931, 193022, 157419, 239894, 53098, 77402, -40193, -59522, 130186, 28919, 67296, 2786, -48178, 94779, 400058, -43375, -246307, 110969, -187922, 31683, 71861, -84811, -84864, 64050, -129171, 186409, -88033, -212532, 29963, 186620, 184010, 13202, -164063, 4338, 306071, -154267, 142207, -194195, 218236, -59368, -294344, 17789, -105505, -44934, 12318, 119438, 39080, -21876, 13081, 67508, -299141, 17118, -142022, -134647, -27509, -146158, -83742, 368427, 64105, -164158, 148651, 256342, 18919, 90484, -46775, 6849, -116909]
16132C26971b15063A00491O4924a33110A48414g8610G7300J32549o2727G538K58902
16121B66440B4083k495b12290Q4726c8313H8817J4369n1194P729c73257a01053
16109E8851K35461h7100k86248c0890H5596O3013A9029K06959M0211r3552m6472
16098A26175J33391H6167b52901e11E7081g1660C7537a9740A28595A2665b00585
16086A20058J98258a89589L9243m5966A2297a8981j70903h52j4875j92443h8868
16074C2844P0818a53362B05115c5688j38996b9948j58431a8945o5357j0419K2190
16063g2531j16044A23002b54910D1646b75602A00329b16609d6045l814o2210G9640
16051a37299B46567e1308p6750m2237a9308j84083a2699q3359p4717b4094j82425
$$ y = [326971, -215063, 100491, 165415, -133110, 148414, -78610, 77300, 209849, 147122, 7538, 266440, 24083, 21588, -212290, -127564, -38313, 88817, 103186, 51992, 59721, -373257, -101053, 58851, 294312, -87100, -373348, -30890, 85596, 148609, 19029, 225988, 266199, 172647, 126175, 259566, 86167, -252901, -511, 57081, -71660, 37537, -19740, 128595, 12665, -200585, 120058, 318316, -189589, -150346, -196312, 12297, -18981, -189884, -852, -15727, -208170, -88868, 32844, 103662, -153362, 205115, -35688, -174684, -29948, -188379, -18945, -84302, -94721, -72531, -188575, 123002, -254910, 41646, -275602, 100329, -216609, -46045, -49859, -112069, 79640, -137299, 246567, -51308, -128058, -170295, -19308, -203391, -12699, -96058, -170775, -24094, -206519]
16040b06519e1276C6882a3019j9577j28231b0264q4234n6397k2877l6831b7688
16028B28060l4757g6071b2131G7640f9556A4275L13050c09827a32041I6078J22682
16017B18760b13961g8694j38255D3857f8253k88394M8312k2370a44410D7698P6596
16006A24294a76670a2758A30395M9326C8966P5180a15478Q35C9896J42818Q2240
15995B64954f0004H2369K4128C9319a30499H80b12577c6305C7288J94747A07947
15983A18382J46264H3128M0368N7161K62375a71840G5510J40020j03520g5948
15972a66176c9552A31183a24939p5803L4476C56023b9594C4622K15079d91261
15961b82649c0355j38229m706G5132a47540P1928G2644g0736o6080C7068f9691
$$ y = [-206519, -51276, 36882, -13019, -32596, -160827, -20264, -104498, -160895, -183772, -220603, -27688, 228060, 193303, -76071, -22131, 77640, -69556, 14275, 327325, -309827, -132041, 96078, 218760, -213961, -78694, -216949, 43857, -68253, -356647, -308335, -330705, -144410, 47698, 124294, -176670, -12758, 130395, 179721, 38966, 114146, -115478, -114643, 39896, 182714, 264954, -60004, 82369, 106497, 39319, -130499, 880, -212577, -36305, 37288, 232035, 107947, 118382, 264646, 83128, 123496, 180657, 443032, -171840, 75510, 215530, 112010, -75948, -166176, -39552, 131183, -124939, -200742, -166266, 356023, -29594, 34622, 249701, -491261, -282649, -30355, -168584, -173290, 75132, -147540, -75612, 72644, -70736, -136816, 37068, -69691]
15949a64177M2028l6804j76810J47447O3002e7311E822d2406j49973A58415a95152
15937B49338f1999n6244G1898j7184L78785b42261h4056j51120j81114A68440
15926b0169k95887p9411E9583a35372A07279f0191j56321i6527c8268A89096a33635
15914a4591k20226C67476D6440j6487g927k27947A58014c00247g5579A46276l6526
15903A09750n3053a02244p589p8809p17D4794K32509I7116e4991q2936j816j08105
15891b47848h1768K2398j1585j23161A70N3268a47832J4173A02152a37670c7623
15879c08243a35438b7130B6600N0572J878j9862b73931e6431C46306a58275f8331
15867c39882f484F9644a92402A19341a31435m6775f6689j8874A67720E908k347
$$ y = [-164177, -122149, -158953, -335763, -188316, -125314, -57311, 5822, -42406, -192379, 158415, -195152, 249338, -61999, -118243, 71898, 54714, 433499, -242261, -84056, -235176, -416290, 168440, -20169, -316056, -395467, 59583, -135372, 107279, -60191, -216512, -96527, -38268, 189096, -133635, -14591, -234817, 367476, 46440, 29953, -7927, -235874, 158014, -300247, -75579, 146276, 109750, 56697, -102244, -109833, -188642, -189359, 44794, 277303, 97116, -54991, -137927, -139743, -247848, -81768, -59370, -70955, -194116, 170, 53438, -147832, -133659, 102152, -137670, -37623, -308243, -135438, -27130, 26600, 77172, 79050, 59188, -273931, -56431, 346306, -158275, -68331, -339882, -6484, 69644, -192402, 119341, -131435, -178210, -66689, -85563, 167720, 5908, 3561]
15856C561a95746j0236A4774b06382c0964G2391f3345a4302c312A05052c49882
15844b58512i0810j2673B2945d4209A43105b7258H3747c7931A69441m9919e2270
15832a28012c6404j16174J1782j61421a05220D9153a83392n9209m1426d6842k12363
15821b59205h5246A23013b2427l956h960E6493a15548k29248a4934j76036B45324
15809A64000a10038a6256A0778b73381q365A46083g8983B25830Q9938a30111B07511
15797b62193a08645J6135B10037d6688j1628j07561F822M8111d6713p8137k89639
15786d14489G4259j2700J76667b03108j32538K8266F3340b66195A88740e8378
15775i9266A69607a44259L1345k8877B7258O5232c90148e5626k57492G4167a27244
$$ y = [3561, -195746, -205982, 14774, -206382, -30964, 72391, -63345, -14302, -3312, 105052, -349882, -258512, -90810, -103483, 22945, -44209, 143105, -27258, 83747, -37931, 169441, 119522, -52270, -128012, -36404, -152578, -140796, -302217, -105220, 49153, -183392, -242601, -284027, -46842, -259205, -85246, 123013, -22427, -26383, -8960, 56493, -115548, -344796, -14934, -190970, 245324, 164000, -110038, -16256, 10778, -273381, -281746, 146083, -78983, 225830, 315768, -130111, 207511, -262193, -108645, -92510, 210037, -46688, -58316, -165877, 6822, 54933, -46713, -124850, -414489, 74259, 61559, 238226, -203108, -335646, -307380, 63340, -266195, 188740, -58378, -99266, 169607, -144259, -112914, -141791, 27258, 92490, -390148, -55626, -313118, 74167, -127244]
15763C76930f4275j25751A16703C1632K69280b38759N0388C3608L59816a09791
15752A4724Q4784a06026B11969a1370A43863a53614k783I4833p948a18813b074
15740A79525a54813C33966a01394B09586b40736c872A4351K42930a47124A45140
15729g5391A55904k0380a82100A83472b97654B28467C6209H354R945a34076F3975
15717b79636g0367m49231G4558h9603G5887k5131a13338l0184A67091D9220a29584
15705a64461f1441B7632O9853a65773E955J12490c36127I8874f7266j59377E2282
15693b70074P9012b8685A57795j209N3150b93776p3508c3747r5173j6061b9300
15681a83343D4017K14887E512a96354M1583A8078f3533E6295e9496d331j90961
$$ y = [376930, -64275, -190026, 116703, 31632, 300912, -238759, -188371, 33608, 393424, -109791, 14724, 99508, -106026, 211969, -11370, 143863, -153614, -156397, 94833, 86885, -118813, -2074, 179525, -154813, 333966, -101394, 209586, -240736, -3872, 14351, 257281, -147124, 145140, -75391, 155904, 135524, -182100, 183472, -297654, 228467, 36209, 8354, 18299, -134076, 63975, -279636, -70367, -519598, 74558, -89603, 75887, 50756, -113338, -143522, 167091, 49220, -129584, -164461, -61441, 27632, 97485, -165773, 5955, 118445, -336127, 98874, -67266, -226643, 52282, -270074, -191062, -28685, 157795, 156586, 209736, -293776, -367284, -33747, -128920, -144981, -29300, -183343, 44017, 258904, 5512, -196354, -154771, 18078, -63533, 56295, -59496, -4331, -195292]
15670a95292C19714e6772F6331L6471J49188a51440f0682j40745j49475J69074
15660a81828d2489D02357H6901J56004e7746D00247j11627r5648f9942A22601
15649c93711K8576J39379i2180B8713e735k06797h6443b6408C69526c13216g0873
15637d4287k65146J2285B1195b18809A3079N901K21619d5195j81582e1320n2393
15626a03713c76E2897a56520G025b29390j99266C2485Q0359J2749a26503a972
15614a07934c6844j79772O6470a0701p3493A62890h4383j1317p1631b3292b77
15602a83320E2532j3362c6490k19655c7844k76969f5318A0974L43741a27439C3185
15590i4152F0629J71361a8115A62353K01211A40922b42837B36944J72240b45181
$$ y = [-195292, 319714, -56772, 66331, 102802, 251990, -151440, -60682, -201427, -350902, -181828, -42489, 402357, 86901, 242905, -57746, 400247, 288620, 192972, -69942, 122601, -393711, -365135, -225756, -92180, 28713, -5735, -212532, -86443, -26408, 369526, -313216, -70873, -44287, -309433, -297148, 21195, -218809, 13079, 18980, 240599, -45195, -226777, -51320, -103713, -376, 52897, -156520, 7025, -229390, -428656, 32485, 112844, 125593, -126503, -1972, -107934, -36844, -216616, -150146, -10701, -84194, 162890, -84383, -95700, -167331, -23292, -277, -183320, 52532, 39170, -36490, -256145, -37844, -314813, -65318, 10974, 354715, -127439, 33185, -94152, 60629, 231990, -18115, 162353, 363564, 140922, -242837, 236944, 409184, -245181]
15579E4049O5547p13A6637h4648L3553o8540B45410a11622D7772i3878C74396
15567e7774A22444a61691D1100a56234F0980k53c5517A02697a90734M3635n8570
15556b05669j48091C44569j54126q8910d4244m3145D8731d3943k08324p8210k6323
15545c56800E5816K9300L7867E6154b14403C0097J22351D1845L99972D7917J13395
15534A61312a1176k97968C54621F086b02699N797E9223J87595a45199I7547q932
15523H8615Q2601a13034b0780j48200A65786p9158b2983e795D2683O7581b27847
15511A06035J40671r0666m9748a12620L3714D90506F4316a73420o2530c9607l2220
15500g1827j03555h6239F310J28546b37689G3405a24901l0947K6075A7860a56575
$$ y = [54049, 119596, 118883, 16637, -84648, -51095, -119635, 245410, -111622, 47772, -93878, 374396, -57774, 122444, -161691, 41100, -156234, 60980, 60727, -35517, 102697, -190734, -147099, -205669, -353760, 344569, 190443, 101533, -44244, -87389, 48731, -43943, -252267, -330477, -356800, 55816, 85116, 122983, 56154, -214403, 30097, 152448, 41845, 441817, 47917, 161312, -11176, -309144, 354621, 6086, -202699, -196902, 59223, 246818, -145199, 97547, 88615, 171216, -113034, -20780, -168980, 165786, 86628, -22983, -5795, 42683, 110264, -227847, 106035, 246706, 156040, 106292, -112620, -78906, 490506, 64316, -173420, -235950, -39607, -71827, -175382, -86239, 6310, 134856, -237689, 73405, -124901, -155848, -129773, 17860, -156575]
15488g4357k81599a68400A38086a20321F9250a53400j34573b4177A56029a79546
15477a29770A41217L4640n3763L46942a459o6698B36163g2539A11617b36046e8524
15465i2163B26897J27110I8927J27609F4592f5088B02300L9536D8016A1286h1203
15453B23633C1948a7179B3102J3957J16276J65478B4833b9410j89963A30381j1651
15442A18730K95781A18913Q6051J26785f0430A79117a58876f0784E4744d2852
15431D1200J34116B6272a13840o2230Q2183b9382r5307B75327c878j69821C4857
15419a51380k07508d5325j51466j74051a08978M4559k59023M3623C04512A2720
15408a16153G7043M8002a1191k15894C46606j3159A61689h6461j4671o2362e1022
$$ y = [-74357, -355956, -168400, 138086, -120321, 69250, -153400, -287973, -24177, 156029, -179546, -129770, 141217, 175857, 122094, 469036, -1459, -68157, 236163, -72539, 111617, -236046, -58524, -92163, 226897, 354007, 98927, 226536, 64592, -65088, 202300, 241836, 48016, 11286, -81203, 223633, 31948, -17179, 23102, 37059, 153335, 318813, 24833, -29410, -219373, 130381, 118730, 414511, 118913, 204964, 331749, -60430, 179117, -158876, -60784, 54744, -42852, 41200, 175316, 26272, -113840, -176070, -93887, -29382, -124689, 275327, -3878, -173699, 34857, -151380, -358888, -45325, -196791, -370842, -108978, -64419, -323442, -279819, 304512, 12720, -116153, 77043, 125045, -11191, -227085, 346606, 333447, 161689, -86461, -101132, -163494, -51022]
15396B9890J76041c1389j58410P7541A1174b39121B22651a66852a2113A41215
15385c6690B75760c49368A42452J32747a80554e063m5432j34655f9245n2283C04614
15373e5719A41392a17271d3089A77766j7362b16810B25635a47857A10046D0997
15362a07766I8728a20669b9676B32543a81003b6588A8122f7930D041J99736g2893
15350D11766e2971j38383E7479J49087a51027j72548B38583b9460I1685b46246
15339D53825d7907E3697L1521o432a14358A23434d4577A40254B639O2589j6111
15328D9117a78571O2759q3047E928c4276l5323j42742A08558J7181j8562a4077
15316A14534a43624G0108A1510a2792B6296a1565j80125A3230J45123a68845p1549
$$ y = [29890, 205931, -31389, -189799, -112258, 11174, -239121, 222651, -166852, -12113, 141215, -36690, 275760, -349368, 142452, 275199, -180554, -5063, -50495, -185150, -69245, -121528, 304614, -55719, 141392, -117271, -43089, 177766, 160404, -216810, 225635, -147857, 110046, 40997, -107766, 98728, -120669, -29676, 232543, -181003, -26588, 18122, -67930, 4041, 203777, -72893, 411766, -52971, -191354, 57479, 206566, -151027, -323575, 238583, -29460, 91685, -246246, 453825, -47907, 53697, 85218, 78786, -114358, 123434, -44577, 140254, 2639, 65228, 49117, -178571, -115812, -198859, 5928, -34276, -69599, -212341, 108558, 125739, 107177, -14077, 114534, -143624, 70108, 11510, -12792, 26296, -11565, -191690, 13230, 158353, -168845, -240394]
15305b40394D06554C0884b56779Q2770C88782B6739K25441j03327a14996L9669
15295g5327j03718d943H7395l2090Q2807i7372A28434a58603A96986j635a42725
15283a60078M8512B43960K2308e1755A98641K10801i3559A79092R1102j04870
15273A65324b17039b8694q6714A38286g9173B17120a94839h6119A0532a2531m0366
15262e2897I6899b0556B74451o4135B0905J4039L9935J44482A7019d9033C13182
15250D29532B00617K15182Q10885R9984k74018m3966j90790A27572J65490a50329
15239A49730Q2539d8370D1618a90296N3527f2918E368P3111a20882A92723i5450
15227I4099P227J48695F2701J87797b05364A98145C2650c9290j6918A01881a79449
$$ y = [-240394, 406554, 30884, -256779, -174009, 388782, 26739, 252180, 148853, -114996, -75327, -179045, -4943, 87395, 55305, 138112, -97372, 128434, -158603, 196986, 195351, -142725, -160078, -111566, 243960, 266268, -51755, 198641, 409442, -93559, 179092, 270194, 165324, -217039, -28694, -115408, 138286, -79173, 217120, -194839, -86119, 10532, -12531, -52897, 96899, -20556, 274451, 210316, 20905, 34944, 74879, 219361, 17019, -49033, 313182, 429532, 200617, 415799, 1226684, 1326668, 1052650, 1008684, 817894, 127572, 293062, -150329, 149730, 232269, -48370, 41618, -190296, -136769, -62918, 5368, 78479, -120882, 192723, -95450, 94099, 101326, 250021, 62701, 250498, -205364, 198145, 32650, -39290, -56208, 101881, -179449]
15215G2009b57657i3382H2597K26628b86525D61666B19732j08227b74210B9031
15204A77472e4019a5846j6483A03407Q9667E6602L66940A55407Q0423a1380G5990
15192e889B48316o4865J0392r2523f5494B59156J45123A54428F2457L6300a31650
15180f3590B27021j02144h2601l05353d744A65727n4278K76688e9683b6931B58640
15168B98590A10994a71537B07339L03411c8632B27787r241D6008M0016J32080
15158B18104j08315k7451J63992b69073A27500J31170a41433f6287A20210K5754
15148A45964N5317n1604K37322G7625N2005A4884L16600A26002g1176A26125J08390
15137B34515E6857N7054b33717h453C55776j11287D2255M8611j7154L9950K61040
$$ y = [72009, -257657, -93382, 82597, 309225, -286525, 461666, 219732, 111505, -274210, 29031, 177472, -54019, -15846, -32329, 103407, 193074, 56602, 423542, 155407, 235830, -11380, 75990, -5889, 248316, 183451, 193843, 101320, -65494, 259156, 404279, 154428, 62457, 98757, -131650, -63590, 227021, 124877, -82601, -387954, -4744, 165727, 111449, 388137, -59683, -26931, 258640, 298590, 110994, -171537, 207339, 510750, -38632, 227787, 218546, 46008, 86024, 218104, 109789, 82338, 246330, -269073, 127500, 258670, -141433, -66287, 120210, 145964, 201281, 149677, 386999, 77625, 129630, 14884, 331484, 126002, -71176, 126125, 234515, 56857, 113911, -233717, -8453, 355776, 244489, 42255, 90866, 73712, 113662, 374702]
15126C74702A20675K52282A47028P7244J39949j58471O914a60372B12468j01586
15116A10882B3143J27515d46732B99017N8657A4784G221K94927b3840B08626J37077
15105C45703B6746O7154K70948h502B88757o555n9825C5551N45683d0152c07A90979
15092A70657F6382f6009I9706J81803P2039a8083j63518A02861a7991B56020G1999
15080C80874C8241L33375J30115i6995l4079E15018B45891n7973E3309g6282c751
15068C11881B8392L68730A86955b7871r3477A20690c762D79351j98067A19106
15057B73357D9781L07655a96720A55963K40867j80083R2410p372N7540a442A3475
15045f714j04351C88632k6142a23825B25343B2470J40910D3387b13201A52827
$$ y = [374702, 120675, 372957, 147028, 224272, 364221, 205750, 212664, -160372, 212468, 110882, 23143, 150658, -446732, 299017, 357674, 14784, 7221, 302148, -23840, 208626, 345703, 26746, 93900, 364848, -8502, 288757, 282202, 222377, 35551, 581234, -40152, -307, 190979, 170657, 66382, -66009, 99706, 281509, 353548, -18083, -181601, 102861, -17991, 256020, 71999, 380874, 38241, 371616, 501731, -96995, -131074, 515018, 245891, 187918, 53309, -76282, -3751, 311881, 28392, 397122, 186955, -27871, -121348, 120690, -3762, 479351, 281284, 119106, 273357, 49781, 357436, -196720, 155963, 396830, 216747, 309157, 301785, 359325, -1442, 13475, -6714, -111065, 388632, 362490, -123825, 225343, 22470, 163380, 43387, -213201, 152827]
15034D1030K42609k9614o7751q7594M70197B35761b6387E1528M46225A2529N07827
15023E20356k58270j22092m33K08729n2581M358F0864c3472D41359a34790A30497
15011A34769J81182r5849R3018q415j16207E0372b65362C82387A59510k3927h112
14999A13263L02654j53116C6081O9444k4282J80389j06987K2152p9497J63141
14989B60441C5089J06033K92011a94861Q9822B31052O0085K06639j25099k9253
14979C43424j38381k9677k7032K43606p0189F7629K88547r2079q8470k4955J55868
14968C06540r0556d7659C19029l4756P8083P3207m7135J01796J32759j26690B18258
14956D30071k06717r9085J89854A47509K5782j0989M4228j6106l4759g2142B26083
$$ y = [41030, 283639, 254025, 186274, 98680, 568877, 235761, -26387, 51528, 497753, 12529, 520356, 262086, 139994, 139561, 348290, 295709, 300067, 60864, -33472, 441359, -134790, 130497, 134769, 315951, 220102, 313120, 304705, 188498, 50372, -265362, 382387, 159510, 135583, -8112, 113263, 415917, 262801, 36081, 105525, 81243, 261632, 154645, 176797, 97300, 260441, 35089, 141122, 433133, -194861, -105039, 231052, 291137, 497776, 372677, 343424, 205043, 175366, 148334, 391940, 321751, 67629, 356176, 264097, 175627, 150672, 306540, 215984, -47659, 319029, 284273, 362356, 435563, 388428, 490224, 622983, 496293, 218258, 430071, 223354, 124269, 314123, 147509, 173291, 162302, 206530, 190424, 155665, -72142, 226083]
14944E28210j92204p5913N9521J366K70273k78751L8259j58024m9614J70755J28988
14933D42866o5397F0027K2883K61068H7497M18013k36258H0853O3190L4070L4285
14922B12398R1871o5626K5906J65393N8216a38348A78585J27157L27484B69390
14911B19031J08333i7789E65261B08667K50932r3121J64177l1972j94582m4138
14901B59963q4798n3611K29594J67982j98057J15369M16361D09948k9210k6116
14891C54622K37630R0134c6870D62816j25272j11108J21036J23107p3591J69430
14881E66418B50562K03292B13011J52919A73066K36075I2987N7125P9844L4641
14871B64597K1337N07762B46966J50721n0064J3681A63958J99091j15921J38309
$$ y = [528210, 336006, 260093, 319614, 320980, 591253, 312502, 350761, 192737, 143123, 313878, 442866, 377469, 60027, 82910, 343978, 87497, 505510, 269252, 80853, 144043, 178113, 212398, 304269, 238643, 264549, 429942, 488158, -138348, 178585, 305742, 633226, 269390, 219031, 327364, -97789, 565261, 208667, 459599, 366478, 530655, 498683, 304101, 259963, 175165, 121554, 351148, 519130, 321073, 436442, 852803, 409948, 380738, 354622, 592252, 682386, -36870, 462816, 337544, 226436, 347472, 470579, 396988, 566418, 250562, 453854, 213011, 365930, 173066, 409141, 92987, 150112, 229956, 264597, 285934, 793696, 246966, 397687, 347623, 361304, 163958, 363049, 247128, 385437]
14861C85437L23037k87017j6523J1676Q0138F2900M44301j02810J65916k09667
14851C60640L1915J05655j99286K07677j9958j37686J69937R8112k58524j16427
14841B42055K15453m3437K16904L19851j54021B85187J53678k0119R992j93923
14831B34815P3627p6642L6302J26546N32823l00965o2528e6980F98335J40676
14821H39011l71040H5730K01509K79705p474j69950J07014K4292K49830q7712
14811F82944M647J66836m10073k405L08844j08769k59311K22694o984j15300p9519
14800D03604J17100L8337j09496n9574K10882m3396K87240j82048j38224R4503
14790F18928j64790Q194J85721k04034m4673J25720K0411M6650P3326j2101o0465
$$ y = [385437, 708474, 421457, 404934, 416610, 496748, 62900, 507201, 404391, 570307, 360640, 392555, 498210, 298924, 506601, 486643, 348957, 518894, 617006, 358482, 242055, 457508, 414071, 630975, 950826, 796805, 285187, 438865, 418746, 428738, 234815, 308442, 231800, 268102, 394648, 927471, 626506, 563978, -56980, 698335, 839011, 467971, 85730, 287239, 566944, 559470, 389520, 496534, 520826, 770656, 682944, 687591, 854427, 444354, 441949, 750793, 642024, 382713, 605407, 598423, 483123, 403604, 520704, 559041, 449545, 389971, 600853, 557457, 844697, 662649, 524425, 618928, 454138, 462332, 648053, 444019, 399346, 525066, 545477, 592127, 665453, 653352, 592887]
14779E92887K3220J07718P138j70463n0266l6468K61138J32958C72431K93405
14769F65836J36392C52018K39548j53255K09729j0240Q8752K65819A54278P47043
14759I01321l53444j37325L64912j75714J60820Q5277l04229L15983k3392k50610
14749E83599j11269m4136L92538J3666r4960O0725J14950m29853K49448j43787
14739E90921L07246r361j18695C38670L16787J61462l09841j3498M72049l64886
14729F00743o6289L9613L91463m20811L07870o8538k83178L19886l07071L14564
14719H28252K6108j68121j31355J99563J8244L85130k20038k68029K12570P3118
14709I55442m64609K49477J66143O0800o3780J91274E36673N00559k58444L09195
$$ y = [592887, 616107, 723825, 730963, 560500, 510234, 473766, 734904, 867862, 372431, 665836, 802228, 352018, 591566, 438311, 648040, 637800, 726552, 992371, 154278, 901321, 547877, 410552, 775464, 599750, 760570, 845847, 541618, 857601, 834209, 583599, 472330, 428194, 820732, 834398, 739438, 800163, 915113, 485260, 734708, 590921, 898167, 888806, 770111, 338670, 655457, 816919, 507078, 493580, 965629, 600743, 534454, 574067, 965530, 544719, 852589, 784051, 500873, 820759, 513688, 828252, 854360, 686239, 554884, 754447, 772691, 1157821, 937783, 669754, 882324, 955442, 490833, 740310, 906453, 967253, 903473, 1094747, 536673, 1037232, 778788, 1087983]
14699A087983n3630k04014K78777k8857j38687j36794L74086n84038N51739E63738
14688I49420j32900N6056k20498M48398j12489R1411j03243J00674J74761m81492
14678G70098M98474k88646j53053K81376j03625K74390j71345l0987L8685j88185
14668I27182R8765l08591M48153J4617j61920L00415k20175l88041P24073l15660
14658A118818O6700l76235M22140j69043l9137K06424j74948j12628o1182L39791
14648A220700K2498J0284k16999L50124j90216k10425J85999L23872k08825J98323
14638A485335n44190P3247M01999P2681n2189J05244l52510j75858L63126l40752
14628A036133M20038k98192K11900k29602J66448L46045o5941o3883l21924K37138
$$ y = [1087983, 1034353, 830339, 1109116, 1080259, 941572, 804778, 1178864, 594826, 1146565, 563738, 949420, 816520, 872576, 652078, 1100476, 987987, 1079398, 976155, 1076829, 1251590, 770098, 1268572, 979926, 826873, 1108249, 1004624, 1279014, 1107669, 1076682, 1115367, 927182, 1025947, 717356, 1165509, 1180126, 1018206, 1318621, 1098446, 710405, 1434478, 1118818, 1185518, 809283, 1231423, 1062380, 1023243, 1229667, 1054719, 942091, 880909, 1220700, 1243198, 1253482, 1036483, 1386607, 1196391, 985966, 1171965, 1495837, 1287012, 1485335, 941145, 1014392, 1416391, 1489072, 1436883, 1542127, 1189617, 1013759, 1376885, 1036133, 1456171, 1157979, 1369879, 1140277, 1306725, 1652770, 1586829, 1522946, 1201022, 1438160]
14618A438160J72386j49454j24774J3433j5327M43664n65923N00123j08290j40656
14608A463342k64795N05347l08425J72429j08440M38069j32417j2456l20950Q2709
14598A514413K04219r2687j08856J88764L29383k98250P5874K01615l53252K97540
14588A958763j84505K49494o9413j75247j53010L47906l3861K33779k47707j14497
14578A811702L82031j2602J58164r743j32151q7637K13021p1298L05266m69022
14568B087731M82659l80504L5262O3494L43558l29416J38998j20420M09285J72848
14558B903495l8154j01237N81239L25307K0521K76449M22732R07398J602771M359712
14548A1260233N221638O194918J0838403O069043j8732988H468420l611039j463276
$$ y = [1438160, 1610546, 1461092, 1336318, 1349751, 1334424, 1778088, 1212165, 1712288, 1603998, 1463342, 1198547, 1703894, 1395469, 1567898, 1459458, 1897527, 1765110, 1752654, 1431704, 1514413, 1718632, 1625945, 1517089, 1705853, 2035236, 1736986, 1812860, 2014475, 1661223, 1958763, 1774258, 2023752, 1954339, 1779092, 1626082, 1973988, 1940127, 2173906, 1926199, 1811702, 2193733, 2181131, 2339295, 2329552, 2197401, 2109764, 2322785, 2251487, 2556753, 2087731, 2570390, 2189886, 2225148, 2288642, 2632200, 2302784, 2441782, 2321362, 2730647, 2903495, 2865341, 2764104, 3345343, 3670650, 3691171, 3967620, 4390352, 5297750, 6900521, 11260233, 16481871, 22676789, 33515192, 39584235, 20851247, 8468420, 4857381, 3394105]
14540C394105o43262o66027r3372K45220j89350J85654l10520L58415j92805r3756
14530A994302J40692J46734q5548Q8402R095K80192l29006M78820k07753J81315
14520B697245J1339j84032J41029J86296l54198K77637K94343k18876j60590K88332
14510B978525K2614R7138k75931R6444r2131J77285O5858r663L6915j35807j2630
14499B948617J5395K62994O2965j84760J06695L13583k4508j14154M7679J57633
14489C592139j82696K38207k51307L00027k24959N10804r4027k35660N36550k55614
14479C933464n5365j46070L05517J1516L81882j87560j82197M21056r6092l9513
14469D346638o6797L11334n8497k93874J24933N41781k90749l3201L27188k0049
$$ y = [3394105, 2750843, 2084816, 1991444, 2236664, 2047314, 2232968, 1922448, 2280863, 2088058, 1994302, 2134994, 2281728, 2196180, 2284582, 2293677, 2573869, 2244863, 2723683, 2515930, 2697245, 2708584, 2524552, 2665581, 2851877, 2497679, 2775316, 3069659, 2850783, 2690193, 2978525, 3001139, 3098277, 2822346, 2918790, 2826659, 3003944, 3069802, 3060139, 3097054, 2961247, 2948617, 2964012, 3227006, 3289971, 3105211, 3211906, 3525489, 3500981, 3386827, 3434506, 3592139, 3409443, 3647650, 3396343, 3696370, 3471411, 3982215, 3888188, 3652528, 4189078, 3933464, 3878099, 3732029, 4037546, 4049062, 4430944, 4243384, 4061187, 4482243, 4386151, 4346638, 4279841, 4591175, 4532678, 4238804, 4363737, 4905518, 4614769, 4581568, 4908756, 4888707]
14459D888707k98140L35363K02894j61023k15273N08734j0760K77648j32241Q3659
14449E479568J82455M6041j66427O8980j7139J25548O6019J33850L44797k45101
14439F018591M00217N7844L68981k62157J19201O036N666L37015l08994m0045
14429F702355N10531k8617R0589K84885J76693j77061K61813j25576l6448M44305
14419H103469k0786P3830K02330M8962M20549r7174k2770J09453J41173Q4215
14409I043251K73331M09264l0317k4189j18060L78892K19690M42579j90574J12844
14399A0516711J94332M05043K51957q1765P0215M49407J09305L10060K08990Q6346
14389A2520601M65840O4749J05123J29171P12689J71710J4525j30179N04118L11130
$$ y = [4888707, 4590567, 4925930, 5128824, 4967801, 4752528, 5261262, 5250502, 5528150, 5395909, 5479568, 5662023, 5708064, 5541637, 5610617, 5593478, 5719026, 5785045, 5918895, 6263692, 6018591, 6418808, 6476652, 6845633, 6583476, 6702677, 6708713, 6714379, 7051394, 6742400, 6702355, 7212886, 7184269, 7274858, 7559743, 7736436, 7559375, 7821188, 7695612, 7659164, 8103469, 8082683, 8156513, 8358843, 8407805, 8828354, 8731180, 8708410, 8817863, 8959036, 9043251, 9316582, 9725846, 9695529, 9671340, 9553280, 9932172, 10151862, 10594441, 10403867, 10516711, 10711043, 11116086, 11368043, 11286278, 11356493, 11805900, 11915205, 12225265, 12434255, 12520601, 12986441, 13051190, 13156313, 13285484, 13998173, 14169883, 14184408, 14054229, 14558347, 14869477]
14379A4869477O9286K00563O47271N90092l83005N64146O09654Q6152O05758K6996
14369A7886390K43427M57825N31440L42232N35458N5694O64327J35368P09311
14360B1561472O30807M03843P11353Q31723m14152N51812J330574L72065N34772
14351B6514269P21361K59694R69266P25132N74692R42579N31783Q12514R43080
14342C2994370P22013J115729R93437J023599Q20232J167315J188278J275125
14334D1300098J002687J372639J124489J449861J315636J495601J951634J130627
14326E2143272J676479J941974J972469J796587K424014J919298K152518K364235
14318F8390846K639576K564508K693568K999209K859664K994494L606028L693021
$$ y = [14869477, 14938763, 15139326, 15786597, 16376689, 15993684, 16557830, 17167484, 17253636, 17859394, 17886390, 18129817, 18587642, 19119082, 19461314, 19996772, 20052466, 20716793, 20852161, 21561472, 22192279, 22596122, 23307475, 24139198, 23725046, 24276858, 25607432, 25979497, 26514269, 27235630, 27495324, 28464590, 29189722, 29764414, 30706993, 31238776, 32051290, 32994370, 33716383, 34832112, 35825549, 36849148, 37669380, 38836695, 40024973, 41300098, 42302785, 43675424, 44799913, 46249774, 47565410, 49061011, 51012645, 52143272, 53819751, 55761725, 57734194, 59530781, 61954795, 63874093, 66026611, 68390846, 71030422, 73594930, 76288498, 79287707, 82147371, 85141865, 88747893, 92440914]
14310I2440914L695483L713828M337563M550178M694988M860830N155837N757278
14302A29206899N854446O572163O503937O953220P662563P878494Q195561Q850310
14294A87677593R378193J0026564J0073797J1308657J1089973J2042874J2686064
14287B64283715J2906232J3342595J3694799J4469164J4190030J4597848J4040409
14280C61524792J3965574J3523693J2850926J2154369J0852178R232453N744370
14273D39848355k327011m408474K977225L727548K653159K07585m596888o599875
14265D31481624q439042q852538r094341j1767735j2759386j3723034j4266438
14258C52579110j5112105j4766352j4842005j4156824j3266090j3539268j2524076
$$ y = [92440914, 96136397, 99850225, 104187788, 108737966, 113432954, 118293784, 123449621, 129206899, 135061345, 141633508, 148137445, 155090665, 162753228, 170631722, 178827283, 187677593, 197055786, 207082350, 217156147, 228464804, 239554777, 251597651, 264283715, 277189947, 290532542, 304227341, 318696505, 332886535, 347484383, 361524792, 375490366, 389014059, 401864985, 414019354, 424871532, 434103985, 439848355, 437521344, 433112870, 436090095, 439817643, 442470802, 442678387, 438081499, 431481624, 423042582, 414190044, 405095703, 393327968, 380568582, 366845548, 352579110, 337467005, 322700653, 307858648, 293701824, 280435734, 266896466, 254372390]
14251B54372390j2571226j1765244j1074560j0641419r924143r729414r154916
14244A79511468p624692p740244p868031p389287o431263o386132n852348n225118
14236A24994353n701214m980919n025072l888656m735529l772566l775879l536220
14228H9578298l660922l026100l261877k952787k660360k642870k369606k570507
14220F6433269k117829k029031k229631k309882j698976j452740j363523k015871
14212E1215786j473037j771932j268367j264955j079008p97133j690360r15800
14204D0955194j729445o14087j081674j038372n95585j044014j210116r47540
14196C2694361o79752q57983o71747m90878j172261m008j345340k65359p96940
$$ y = [254372390, 241801164, 230035920, 218961360, 208319941, 198395798, 188666384, 179511468, 171886776, 164146532, 156278501, 148889214, 142457951, 136071819, 130219471, 124994353, 119293139, 114312220, 109287148, 105398492, 100662963, 96890397, 93114518, 89578298, 85917376, 82891276, 79629399, 76676612, 74016252, 71373382, 69003776, 66433269, 64315440, 62286409, 60056778, 57746896, 56047920, 54595180, 53231657, 51215786, 49742749, 47970817, 46702450, 45437495, 44358487, 43561354, 41870994, 40955194, 39225749, 38611662, 37529988, 36491616, 35896031, 34852017, 33641901, 32694361, 32014609, 31156626, 30484879, 29994001, 28821740, 28817732, 27472392, 27207033, 26410093]
14187B6410093q05940l03267n62459n48457o25855n55122o23713n09214l95756
14178B1480310k01957o97139o94277j74335m08649k86146n63590j54384m48818
14169A7851015m36596J02695m64746m28861P4375p69455Q2825p79809j42896j40243
14159A4948304k33629l22583n12734o1753q3564K9o23902J16780k97701k91780
14149A2637467m23770j67481j65514K81482m27332j43327l49172k10992P7083
14140A1108444l45926K34879q97956K47326k86139J75649m79219L87122p80726
14131I363454M10505j61060o88867K58793j72507p4400k37384k86427K30108k73360
14121H368855m2200l97149J07375n5749k04223K38976n49986K20469j91660j37803
$$ y = [26410093, 25604153, 25300886, 24738427, 24189970, 23564115, 23008993, 22385280, 21876066, 21480310, 21278353, 20581214, 19886937, 19712602, 19303953, 19017807, 18454217, 18299833, 17851015, 17414419, 17517114, 17052368, 16623507, 16697882, 15928427, 16011252, 15231443, 15088547, 14948304, 14714675, 14392092, 13879358, 13817605, 13734041, 13734070, 13110168, 13226948, 12929247, 12637467, 12213697, 12046216, 11880702, 12162184, 11734852, 11591525, 11242353, 11031361, 11108444, 10762518, 10997397, 10099441, 10346767, 10060628, 10236277, 9757058, 10144180, 9363454, 9773959, 9612899, 8924032, 9182825, 9010318, 8935918, 8698534, 8412107, 8642215, 8368855, 8326655, 7929506, 8036881, 7981132, 7776909, 8015885, 7465899, 7686368, 7494708, 7356905]
14111G356905o3719j43479k72358K28342k55766k40312K60213m41022K95303k34756
14101F489351k55912L41425p02381M79291k8189l00808J80589l61260J53027k86491
14091E708642k244J08894m42493K6162R4521k24023n5848l2991K99258m53299
14081E026579p8148n8606N40557o88241j25406o5971j2418J08635K93779j70803
14071D769957k82535p9728n3817J36101k69458J6686K00873l61982Q8137L4915
14061D199149q9845j18162L74319P4970k44480j6557j34246R1084l45296L41404
14051D132340m39179R180J11133k71437J44082P8497m20088P9777L41793o12867
14041C153231M73938o5075m76339K28594J22532m02159L32355r9578k7912L1763
$$ y = [7356905, 7293186, 7149707, 6877349, 7105691, 6849925, 6609613, 6869826, 6428804, 6724107, 6489351, 6233439, 6574864, 5872483, 6351774, 6323585, 6022777, 6203366, 5842106, 5995133, 5708642, 5706398, 5815292, 5372799, 5398961, 5493482, 5269459, 5213611, 5180620, 5479878, 5026579, 4948431, 4889825, 5430382, 4742141, 4616735, 4550764, 4538346, 4646981, 4940760, 4769957, 4487422, 4407694, 4353877, 4489978, 4220520, 4237206, 4438079, 4076097, 4164234, 4199149, 4109304, 3991142, 4365461, 4440431, 4195951, 4179394, 4045148, 4136232, 3790936, 4132340, 3693161, 3702341, 3813474, 3542037, 3686119, 3764616, 3344528, 3424305, 3766098, 3153231, 3627169, 3562094, 3085755, 3314349, 3436881, 3034722, 3367077, 3267499, 3239587, 3271350]
14031C271350k962N0222j923j34879j26557k53906K25694J63138k76044l51201
14021B562932M54880k87288j73656N23526j29880k01753k39765J62305j7434L9841
14011B693708m0882k98416L36987m50475r2061L2152M3800j59680J41782L87878
14001B594793p46664K26704M82899l67075n9456q9051n866k23713K74165K24985
13991B311721N23559P74342L466190M412045N457654J1857035J0870339j4280025
13983B5392860j2356573m633882k158857r73665o78844q40809p2989j86029n26612
13974B964600J62474l41519j55529p8522L09153m00953K6652K20421J19851m27767
13964B398861k49812J53930n8231M40997k05357n04531k2260J62452J21115Q5901
$$ y = [3271350, 3268388, 3318610, 3316687, 3181808, 3055251, 2801345, 3027039, 3190177, 2914133, 2562932, 3017812, 2730524, 2556868, 3080394, 2950514, 2748761, 2508996, 2671301, 2653867, 2693708, 2652826, 2354410, 2691397, 2240922, 2148861, 2181013, 2224813, 2065133, 2206915, 2594793, 1848129, 2074833, 2557732, 2190657, 2131201, 2042150, 2036284, 1812571, 2086736, 2311721, 2835280, 3609622, 7075812, 11487857, 16945511, 28802546, 39672885, 25392860, 13036287, 8402405, 6243548, 5269883, 4591039, 3750230, 3677241, 3491212, 2964600, 3127074, 2785555, 2630026, 2551504, 2860657, 2459704, 2486356, 2706777, 2826628, 2398861, 2149049, 2302979, 2244748, 2685745, 2480388, 1975857, 1953597, 2116049, 2237164, 2323065]
13954B323065k75339R9362j02351j51695R0523j84283M0343R6744J89247k05420
13944A920196J98803k89419Q4167l03599Q7641j99812M18576m27377N51683k14947
13934A825912P4050k31882J83866j82504J26274l56121J12854M36990l83940J05555
13924A711054j49360J68359p0891k83994j01096K05985L29753j86967J51059L6019
13914A809921n12603J57738j96731L04401l25494K50810J83729k91308O2982K49569
13904A693014m70044J68692M40231k93734M6076j11014k25338J96140l40326O5322
13894A169019j6912K78896J0620j24987L2092J07497k77774K9274Q4589K9040
13884A321354K3240L6800q0701k36767K74697l27314J13827J63203k32791M68878
$$ y = [2323065, 2047726, 2147088, 2044737, 1893042, 1983565, 1799282, 1839625, 1936369, 2125616, 1920196, 2118999, 1829580, 1913747, 1610148, 1697789, 1497977, 1916553, 1489176, 2040859, 1825912, 1899962, 1668080, 1851946, 1669442, 1795716, 1439595, 1552449, 1989439, 1605499, 1711054, 1561694, 1730053, 1659162, 1375168, 1274072, 1480057, 1809810, 1622843, 1773902, 1809921, 1297318, 1455056, 1258325, 1562726, 1237232, 1488042, 1671771, 1380463, 1443445, 1693014, 1222970, 1391662, 1831893, 1538159, 1584235, 1473221, 1247883, 1444023, 1103697, 1169019, 1152107, 1431003, 1441623, 1316636, 1348728, 1456225, 1178451, 1207725, 1292314, 1321354, 1344594, 1381394, 1300693, 1063926, 1338623, 1011309, 1125136, 1288339, 1055548, 1524426]
13874A524426l11300j14445j97053Q2749M16414m35201N87933l99056O0005L3527
13864A247999P331q6538k1757n6741j54091J44681Q2823K417K17409l59419L07491
13853A331605k86480K24756l09015N6405L580K57393k18963K9042O945j16137
13843I79131j04696Q941K56988k95130L02606K7970l48021K52253k30779K24140
13833A073403q764n1482J660k28506J90409p2708j27061Q2997j026M5637j23424
13822G81135j4204N04734n8057E28514K21325L2844K39913m5409k86544K46771
13812I37414R0351J99805o318m85709k26824K79884P9123J23999N5774j81939
13802H65560L3015J0062j25958K0102j19073J57057r5411O6804j09076J46211
$$ y = [1524426, 1213126, 1098681, 901628, 984377, 1400791, 965590, 1553523, 1154467, 1214472, 1247999, 1255330, 1168792, 1147035, 1090294, 936203, 1080884, 1163707, 1166124, 1383533, 1024114, 1331605, 1045125, 1269881, 960866, 1017271, 1020851, 1278244, 1059281, 1088323, 1095268, 979131, 874435, 883376, 1140364, 845234, 1147840, 1175810, 827789, 1080042, 849263, 1073403, 1064639, 1013157, 1014817, 786311, 976720, 904012, 776951, 859948, 858922, 904559, 781135, 766931, 1271665, 1213608, 528514, 749839, 782683, 1022596, 977187, 690643, 937414, 1027765, 1227570, 1221252, 735543, 508719, 788603, 867726, 991725, 1047499, 865560, 898575, 908637, 782679, 802781, 683708, 840765, 745354, 812158, 703082, 849293]
13792H49293o9670K9967L37892k26676k12640J42176C97939L92540j65155K42410
13782H67734M5256j13902M530J73371l42236P7717M22590m54361j67436J96393
13772G09656M4591J40871k94668K13714k96452J07090R0270j46925J00070J85234
13762H53451l95480K03868j25995L18411m10034L46096q953R5447J22011m84499
13752E14323J4870k07418O28845m42617M32599D48883J51890L36596m43819p7185
13742D16365L60156k54320L30226j99953J90971j48835o6572J04001p2629j9849
13732F39561j87510P5483J7164M3997k13581L081j86956M02275K25541C33870
13721C88553K36819A89995L12804k4748J61845R4589J8516n8335j62067L71656
$$ y = [849293, 779623, 809590, 1147482, 920806, 708166, 850342, 397939, 790479, 625324, 867734, 912990, 799088, 803618, 976989, 634753, 712470, 1135060, 680699, 513263, 709656, 754247, 895118, 600450, 814164, 517712, 624802, 715072, 568147, 668217, 853451, 457971, 661839, 535844, 854255, 444221, 790317, 781364, 876811, 998822, 514323, 529193, 321775, 950620, 508003, 940602, 448883, 600773, 937369, 493550, 416365, 776521, 522201, 852427, 652474, 843445, 694610, 628038, 732039, 659410, 639561, 452051, 527534, 544698, 588695, 375114, 378195, 191239, 593514, 819055, 333870, 388553, 625372, 189995, 502799, 478051, 639896, 734485, 753001, 694666, 532599, 904255]
13711I04255l75932o2839M6181L74605l31356B49973L44620k78558L32764K35143
13701H83942k53619j40572J12545N4339j17578n9618K68745q5868B41442L53190
13691E94632k5409j95250Q9457K27648j01364A43135L69694K02660p0736m1097
13681F03656L44274B51499J7132K56374n5446L03828k46646k61245J85275J39982
13671E90753k34840K79778r2107j87283K86864k78438M1037p1895L53462k25115
13661D62216L03880C73217l1692p1514K6685M4961J34204j1762k26170N903J09775
13650C53607l2052j54612J77341J10019L4113j7446J15421q2854m5143N3899N2651
13639E64944j78389J62201J2983B49047m7653K16409L2919k10412L97582r8883
$$ y = [904255, 528323, 465484, 511665, 886270, 554914, 249973, 594593, 316035, 648799, 883942, 630323, 489751, 602296, 656635, 539057, 479439, 748184, 662316, 241442, 594632, 569223, 373973, 463430, 691078, 589714, 143135, 512829, 715489, 644753, 603656, 947930, 251499, 268631, 525005, 469559, 773387, 526741, 265496, 450771, 590753, 355913, 635691, 543584, 356301, 643165, 364727, 405764, 333869, 687331, 462216, 766096, 373217, 341525, 270011, 296696, 341657, 475861, 464099, 237929, 243832, 353607, 321555, 166943, 344284, 454303, 488416, 470970, 586391, 503537, 458394, 512293, 564944, 386555, 548756, 561739, 249047, 201394, 417803, 450722, 240310, 637892, 539009]
13629E39009q4533j41099K12044j58116Q9896P4631k05461J28523O5036k28582
13619B91348K25138o5382J75516j97181p122N5742R1895B2914P1798M08507A10074
13607B67514L29906o1002k45043A19395K49684j10706K94612j67249A69084K28605
13597C97689j50119M89847k67057k32518D414J38057N5333O4877o9972J47051
13587C39760O5883L0511B2941P10553B55699Q5625K73929n9077k17976J9588J14572
13576D72360K30102B63162N4740L29676n74j19677j63153j50354q9310J94004
13566C18514A51393J10712L37911D4681N65951k85834A1449M33267r0510Q0277
13556D34483j0557j97113q7527J32129M34452B31598K13160k00162J24385K40041
$$ y = [539009, 454476, 313377, 525421, 367305, 457201, 531832, 326371, 454894, 519930, 291348, 516486, 451104, 626620, 429439, 422317, 478059, 569954, 22914, 94712, 503219, 110074, 267514, 597420, 536418, 291375, 119395, 369079, 258373, 552985, 385736, 169084, 397689, 247570, 737417, 470360, 237842, 4414, 142471, 197804, 262681, 192709, 339760, 405643, 436154, 22941, 733494, 255699, 341324, 615253, 556176, 338200, 357788, 472360, 702462, 263162, 317902, 647578, 647004, 527327, 364174, 213820, 124510, 318514, 151393, 262105, 600016, 44681, 610632, 324798, 11449, 444716, 354206, 434483, 423926, 226813, 139286, 271415, 705867, 231598, 444758, 244596, 368981, 609022]
13546F09022j13710A51944J47579R1256N0408j08828A27261J65989J6508j51613
13536A58145L47675j08524A72100Q9814A22896m1434K53942j6248o3553J30766
13526C86369j83168J14347q4726K31481B27632m5094J10769J01429M2418A2092
13515C86185j0379j19827j06651N2485N10602k54669j65048G9623K59180j174
13505C37629r6333M8620J80840O5274j62680j2913J64081k18577K21188j29726
13495C97403R100G3186J23503L83893o6679j95261F5074c22026I5188K48905p4331
13484B69762K40746j54787B7470K99014k2151K23880j53553o528A41680K4544
13474A66224J19477P6573k9912A61046K76813P0283i714G3845O9659K60981O0064
$$ y = [609022, 495312, 151944, 299523, 390779, 441187, 332359, 127261, 293250, 309758, 158145, 505820, 397296, 172100, 261914, 122896, 81462, 335404, 319156, 255603, 386369, 203201, 317548, 232822, 464303, 227632, 182538, 293307, 394736, 437154, 12092, 386185, 375806, 255979, 149328, 201813, 712415, 457746, 292698, 79623, 338803, 337629, 241296, 289916, 470756, 536030, 373350, 360437, 524518, 305941, 527129, 397403, 406503, 73186, 196689, 580582, 513903, 318642, 65074, -322026, 95188, 344093, 269762, 510508, 355721, 27470, 326484, 304333, 528213, 374660, 368132, 141680, 166224, 285701, 362274, 332362, 161046, 437859, 508142, -9714, 73845, 143504, 404485, 464549]
13463D64549A27886J90628j5327Q1554A26332P4256J26611K82998B3954L07393
13453C31347f9124B46629K52434A65439J74637n2115n9063Q2944j38470p5507
13443I7865L86388A92819J77886i4219A5171N3304K2217P487N7603J17411E3524
13431D35376k03024J42381j63178K5909R7166r6429c3022D08287I0003J27636
13421B17639I1903O6628a27902A30261J73240G4792K43844P3230a14923A90599
13410A10804P4656K04637A93790j9906L45082A04567J47542J0592k7327e9791
13399g7932B33583M647J92446A09457Q3781O0548j7054o5885j3212A3130K58158
13388B71288R0904m7376D3495O061J00269J05877p0177k6935l120J48018I3060
$$ y = [464549, 127886, 318514, 303187, 384741, 126332, 200588, 327199, 610197, 23954, 331347, -69124, 246629, 499063, 165439, 340076, 287961, 228898, 311842, 173372, 97865, 484253, 192819, 370705, -94219, 15171, 68475, 90692, 98179, 155782, 273193, 53524, 435376, 232352, 374733, 211555, 237464, 334630, 238201, -33022, 408287, 90003, 217639, 91903, 158531, -127902, 130261, 303501, 74792, 318636, 391866, -114923, 190599, 110804, 185460, 390097, 193790, 173884, 518966, 104567, 252109, 262701, 235374, -59791, -77932, 233583, 238230, 430676, 109457, 193238, 253786, 236732, 170847, 157635, 13130, 271288, 362192, 314816, 43495, 49556, 149825, 255702, 185525, 158590, 155470, 303488, 93060]
13376B72114P9791J01598B3815J47626a4441B14224D3978M27235E9103P735K84771
13365C51609A70053q910m2702J22707a61412B68087j0467m9984L0375b6978D03862
13353F4476L20218A21319B4839M99694A02244R1012J09613F9774K21695K62673
13343E54142B41963J19688M806j18983E9112K25395P948j40145N8554n4986K09779
13332C65657A10513P5999n3385K07113N5320a5394H6374J24656J04454A40138
13321B55915q7233J57234k2011L354I8905J56932Q0802H2084M4950J93640l5013
13310B85661h8076G0949N20357B22664e7074G8468L4072J78995j7614E8802J81144
13299B39946K30367k34474j9612O6369b34210A43746J66052j25532E9142J10062
$$ y = [272114, 351905, 453503, 23815, 171441, -14441, 214224, 43978, 471213, 59103, 66838, 351609, 170053, 161143, 118441, 241148, -161412, 268087, 257620, 207636, 238011, -26978, 403862, 64476, 384694, 121319, 24839, 524533, 102244, 193256, 302869, 69774, 291469, 554142, 241963, 361651, 366457, 247474, 59112, 284507, 292455, 152310, 210864, 155878, 365657, 110513, 186512, 133127, 340240, 395560, -15394, 86374, 211030, 315484, 140138, 255915, 168682, 325916, 303905, 307259, 98905, 255837, 336639, 82084, 127034, 320674, 285661, -88076, 70949, 591306, 222664, -57074, 78468, 112540, 291535, 273921, 58802, 239946, 470313, 235839, 216227, 282596, -234210, 143746, 309798, 184266, 59142, 169204]
13289A69204R8864J2495a16767B00901J63455E1K10203J53654a90218A02590R9200
13278B01790J98162j11921n9936o0980C0348h035D1009A629O2834J85463n7338
13267A92588k28r0829J93671A45899a0906G2917j4254k2178a45142A11707k9426
13256H2281J40123F5363P9459M8424q9819J53135m8346R8382j04275C4194Q0438
13245A14632J53609M9612q3658O2609h603D60100j69615N6771j48402h8445C24171
13233b08537C37223f7726o4225B00605O5430i612A27779K09279A08869h4212A8463
13221E01706B36273E4474k4749L03985j40474C643b43459h0950A17075m2563d1975
13209a20800C3565J1045c30027h0461A93328E7162J91845Q4107A65985P8301p9454
$$ y = [169204, 268068, 280563, -116767, 200901, 364356, 51, 210254, 363908, -190218, 102590, 201790, 399952, 288031, 228095, 167115, 30348, -8035, 41009, 1629, 64463, 249926, 192588, 192360, 101531, 295202, 145899, -10906, 72917, 58663, 36485, -145142, 111707, 82281, 222404, 65363, 144822, 193246, 103427, 256562, 208216, 306598, 202323, 34194, 114632, 268241, 317853, 234195, 296804, -8603, 460100, 290485, 347256, 198854, -88445, 324171, -208537, 337223, -67726, -131951, 200605, 266035, -9612, 127779, 337058, 108869, -84212, 18463, 501706, 236273, 54474, 29725, 333710, 193236, 3643, -243459, -80950, 117075, 74512, -41975, -120800, 33565, 44610, -330027, -80461, 193328, 57162, 249007, 333114, 165985, 244286, 164832]
13198A64832R2422q5424J28724k5753b2824I3244B1476L81267H9459K79382h4749
13186A06766J52755b7696H1499J00964a63958D8694b57417h6230B15334J1683
13176B27017M6391A29565F4226b3583j20201A28756M7597H7000A8665b1331A69797
13164A72255j1555j3225M116O4681c5907C43205I057a3186E1529N92680A79258
13152B10264K5608o2575A3517K9163N520P5371E1866N8711j6935N9999f8565I3027
13139a4151j29978f4253a3514C32305A23067F307L05072g4508I6332P8011J73875
13128C48218Q0577b76264h2445O610k8535B30496m7744b06B48045m6020o7985
13117A34040N9294M438r09d0505m580g500I9381k7068O6447K7885N7920G5147
$$ y = [164832, 257254, 171830, 300554, 274801, -22824, 93244, 21476, 402743, 89459, 368841, -84749, 106766, 259521, -27696, 81499, 182463, -163958, 48694, -257417, -86230, 215334, 227017, 273408, 129565, 64226, -23583, -143784, 128756, 176353, 87000, 18665, -21331, 169797, 172255, 160700, 147475, 151591, 216272, -35907, 343205, 9057, -13186, 51529, 644209, 179258, 210264, 235872, 173297, 13517, 42680, 48200, 123571, 51866, 110577, 93642, 153641, -68565, 93027, -14151, -144129, -64253, -13514, 332305, 123067, 6307, 311379, -74508, 96332, 174343, 348218, 428795, -276264, -82445, -75835, -104370, 230496, 182752, -206, 248045, 202025, 134040, 193334, 197772, 196863, -40505, -45085, -7500, 99381, 72313, 138760, 166645, 224565, 75147]
13104f9650a947G5192b9266I8585a328j06680B06297J77218a7608A09009m7411
13093F1598J44907E7040e9353A79816a64747O9550D8885Q4536o3105b57376A14863
13081A02364J56765A5428J17218J03028b5956o9742F6669a00219A14986c3644
13070f7355A19748a17406e6557n745B02249r6112K72543E4892j9245M0893l2730
13059D3810i7413B36632C5476J66408p0843b23101H8931b64756A7517L04505a75271
13047a31988C5009b44194C12462e7831C41557H6819c21952h5955o0712j36457
13037b83124B56566m56E3943g1428B22816j00111E1987J79133a7628r0110A85330
13025a51783A41242F6583J54847D8953P95O6216g9143C78480A13674P7083O7404
$$ y = [-69650, -1947, 75192, -29266, 98585, -1328, -108008, 206297, 383515, -17608, 109009, 61598, 206505, 57040, -59353, 179816, -164747, -95197, 48885, 133421, 70316, -257376, 114863, 102364, 259129, 15428, 132646, 235674, -25956, -95698, 66669, -100219, 114986, -33644, -67355, 119748, -117406, -56557, -62302, 202249, 106137, 378680, 54892, 35647, 76540, 43810, -97413, 236632, 35476, 201884, 131041, -223101, 88931, -264756, 17517, 322022, -175271, -131988, 35009, -244194, 312462, -57831, 341557, 86819, -321952, -85955, -146667, -283124, 256566, 256110, 53943, -71428, 222816, 122705, 51987, 231120, -17628, -107738, 185330, -151783, 141242, 66583, 221430, 48953, 49748, 115964, -79143, 378480, 113674, 190757, 258161]
13014B58161A02595R4925E3735a57859A73402p7270p116K76782A72998a66914
13003B51182e2605E524a36089f748k1072j00739E3366J50815J6197l7336n8716
12992A24326b96903F3956J06927F836J8682J50933c05868J39301L8496A96864
12981F87693c78901A29454J16790A17066J29877A950P1551c16001D87654d3750
12970a11406D63917B14077R0386b56860C11791i774A85623K9301a72575p3532
12960b46107A69457Q853q0817a27939b445F5136b1806I9394a00187h466F7039
12948A19374g0606C02252j29802J28877j41080M011J81730A04224d10437B44068
12937B0120N736K29670G8797a29861j14256A46754C4291M9365c9037C2429a2089
$$ y = [258161, 102595, 197520, 53735, -157859, 173402, 96132, 89016, 365798, 172998, -166914, 251182, -52605, 5524, -136089, -6748, -27820, -128559, 53366, 204181, 220378, 183042, 124326, -296903, 63956, 170883, 6836, 25518, 176451, -305868, -166567, -128071, 196864, 687693, -378901, 129454, 246244, 117066, 246943, 1950, 73501, -316001, 487654, -43750, -111406, 463917, 214077, 304463, -256860, 311791, -9774, 185623, 214924, -172575, -246107, 169457, 178310, 97493, -127939, -2445, 65136, -21806, 99394, -100187, -8466, 67039, 119374, -70606, 302252, 172450, 301327, 160247, 164258, 345988, 104224, -410437, 244068, 20120, 25856, 255526, 78797, -129861, -244117, 146754, 34291, 83656, -39037, 32429, -12089]
12925f3985F4298k0097J62087a87788B55202A12674k7379J68392p8635a97557
12914B19366a07309C56637C627K15479h5901G2602a02134A36991J31750I9049
12903a24814e8917l88122A98003I1565J42477j4181J3873G9829a0334j03927D7914
12891A65828m5942n5864K33139j37163a27719M6530k55927D2349K77153b00721
12880d252A51289b3589A93136c60944a70482A07582a31693a9261i311B29748a33972
12868C04393b16632c2276B08054N473a07623j09515H3843P4903J15567D2730J27316
12857A70046O0840O7023i0893c4416A06816b8956I003a61510P5942b0475p9751
12846a00226G1150O6686j1418D1233L39629A01807h0044L2442K676D95900B32900
$$ y = [-63985, 64298, 44201, 206288, -187788, 255202, 112674, 85295, 253687, 175052, -197557, 219366, -107309, 356637, 3627, 219106, -85901, 72602, -102134, 136991, 268741, 99049, -124814, -58917, -447039, 198003, 91565, 234042, 219861, 233734, 79829, -10334, -114261, 47914, 165828, 119886, 64022, 297161, 159998, -127719, -81189, -337116, 42349, 319502, -200721, -4252, 151289, -23589, 193136, -360944, -170482, 107582, -131693, -19261, -9311, 229748, -133972, 304393, -216632, -32276, 208054, 213527, -107623, -217138, 83843, 158746, 274313, 42730, 170046, 230886, 297909, -90893, -34416, 106816, -28956, 9003, -161510, -85568, -20475, -100226, 71150, 137836, 126418, 41233, 380862, 101807, -80044, -47602, -44926, 495900, 232900]
12834A07884A070R1835b8601H8313J37170I3227e6239f846q3294k95534A17023
12822a6116j9494g340G5405a53608b8287k34544J27607K0996e2805A81005c0210
12810i4195k1956k7715O0205p1023A14202a68655C0529R7093J02489D6391M5817
12799I2208a82134B29692F339A584b01087N6671B6566K22244E2146j4977b50823
12787B58098b87719P6105R9032q9258A23355J57385q6375G9030O8742b90678e3366
12775A86166J18837C3601o662b08644d0541D947a88279k5170F03922F6247f1448
12763h6219A61126J06553a1182k75728A3641f7637A03672m1598c16746C9418R4596
12752A34014h5925b6644l4185a2142o7219p2725c5748J6711A6874b329C09596
$$ y = [107884, 1070, 92905, -28601, 88313, 225483, 93227, -56239, -6846, -90140, -385674, 117023, -16116, -35610, -7340, 75405, -153608, -28287, -262831, -135224, -114228, -52805, 181005, -30210, -94195, -116151, -143866, -83661, -154684, 114202, -168655, 30529, 127622, 230111, 46391, 92208, -182134, 229692, 6339, 1584, -201087, -144416, 26566, 248810, 52146, 37169, -250823, 258098, -287719, -211614, -112582, -201840, 123355, 280740, 194365, 79030, 147772, -290678, -53366, 186166, 305003, 33601, 26939, -208644, -40541, 4947, -188279, -213449, 603922, 66247, -61448, -86219, 161126, 267679, -11182, -286910, 13641, -67637, 103672, 62074, -316746, 39418, 134014, -85925, -26644, -60829, -12142, -79361, -152086, -35748, -19037, 16874, -2329, 309596]
12740B10797D3956Q8264a6664o0911k9560C54875k6809a22900G0723j3475K5120
12729H2368N9412a16116A86411J64213j67117r1033f2385E8378g4855j7136F2745
12717A81547A6236K44543b42865h2438B9163Q9413J21099i904A98511k8432J19421
12706B89500n9750K4575M0119E8938o768K90565E6729P4927n1952P007M78716
12695E65427p7273a9245A43650a49677l33676a19069K0438C40837e2258A11377
12684a82462M1747f3003p9751B17402j9071J55274b11099n0127B8860J44772b04649
12672G4036L03443A7060J11490K56229d3933C00573G2766K9240B8898h7338E4151
12660i217C78472C4706b32900C1374N25837A66569a12533C02858A15315f0188
$$ y = [210797, 43956, 132220, -16664, -77575, -107135, 354875, 328066, -122900, 70723, 57248, 82368, 141780, -116116, 186411, 350624, 183507, 92474, -62385, 58378, -74855, -91991, 62745, 181547, 16236, 260779, -242865, -82438, 29163, 118576, 239675, -9904, 198511, 170079, 289500, 229750, 254325, 294444, 58938, 52170, 342735, 56729, 131656, 79704, 86711, 565427, 488154, -19245, 143650, -149677, -483353, -119069, -98631, 340837, -52258, 111377, -182462, -140715, -63003, -142754, 217402, 198331, 353605, -211099, -261226, 28860, 173632, -204649, 74036, 377479, 17060, 128550, 384779, -43933, 300573, 72766, 102006, 28898, -87338, 54151, -9217, 378472, 34706, -232900, 31374, 557211, 166569, -112533, 302858, 115315, -60188]
12649g7329K9202j16E8866a68061B09656p3598k8064G58f0345m1950B15702a66412
12636C93115A3915a89486a4331A67658A2336b75848E46240h631H6443M61296B40297
12624B05250g597B1175L34490E4739b386D23023c762A59759J52220f214B21408
12612i1221H480a05807O358d6199B65455a9942q0325A66393a68165B39933c86523
12600D601M8779g1314B15490b4326C09631A7173O7342K45280A15261O7559D5234
12588a60279c1557A42652a74753I0065C9102R0727M6361E4405j9935b49099B65507
12576A21837J20221h9512C6707n704b78974g5556G01c7525h364B44676O6056A54682
12563A74252a64083h0791A5356L43530A8337J37581F8986J62433m6552A4804J41716
$$ y = [-77329, -48127, -48243, 58866, -168061, 209656, 136058, 107994, 758, -60345, -102295, 215702, -166412, 393115, 13915, -189486, -14331, 167658, 12336, -275848, 546240, -8631, 86443, 547739, 240297, 205250, -7597, 21175, 355665, 54739, -2386, 423023, -3762, 159759, 311979, -6214, 221408, -91221, 8480, -105807, -99449, -46199, 265455, -19942, -100267, 166393, -168165, 239933, -386523, 4601, 53380, -71314, 215490, -24326, 309631, 17173, 84515, 329795, 115261, 182820, 45234, -160279, -31557, 142652, -174753, 90065, 39102, 129829, 176190, 54405, 34470, -249099, 265507, 121837, 242058, -89512, 36707, 31003, -278974, -75556, 701, -37525, -8364, 244676, 310732, 154682, 174252, -164083, -80791, 15356, 358886, 18337, 155918, 68986, 231419, 184867, 14804, 156520]
12552A56520i4582A70806l7506b31082d8132A27061a7304A50819c5817A84336
12541A48568J79014b75908H677M1581J98903p1000i9581L357a6075A87428c4810
12529h0756A13589a31471e2081B6758O1252A1784g1051k4225A50368E6659M9229
12518A05888a67821H9353R2312q0432b91520a17734C31236h3575C57547a53581
12507A10980l985c36308J46558B54258D7586D556h8919N619a2696l77889J90280
12496b00305C16566c1936A02439m2067Q286k1712h6757A91108l7106m1069c6570
12484a37956F1841J91740D3446J3605j4724K48403B5014a33824l1323J8531B678
12472H792J33110J59308f3047C01625b53731K6133A70899F4484a65311A19145
$$ y = [156520, -94582, 170806, 133300, -231082, -48132, 127061, -17304, 150819, -35817, 184336, 148568, 327582, -275908, 8677, 50258, 249161, 178161, -99581, -96224, -16075, 187428, -34810, -80756, 113589, -131471, -52081, 26758, 88010, 11784, -71051, -95276, 150368, 56659, 105888, -167821, 89353, 181665, 101233, -291520, -117734, 331236, -83575, 357547, -153581, 110980, 106995, -336308, -189750, 254258, 47586, 4556, -88919, -83300, -12696, -390585, -200305, 316566, -31936, 102439, 60372, 68658, 46946, -86757, 191108, 154002, 112933, -36570, -137956, 61841, 253581, 43446, 57051, 42327, 290730, 25014, -133824, -165147, -146616, 2678, 8792, 141902, 301210, -63047, 301625, -253731, -227598, 170899, 64484, -165311, 119145]
12461c16190A09243J56023i5497B06408c81778J18253A75347a69739D6401J0460
12451E6861N9879i1411G2712g0608j34637A52482J18383Q060g6152q6527O8636
12440i4043m9405f0260B46880a81897h4899l9847H4068o994a14815j03646Q7118
12429a31343j1399A85048J02685L7863A6588c6656j18070C44213G8471L7155a86166
12417G6423J83548c621j32240F0164b30600N0263D3801R9008a66123P848A49224
12405G12M157P5596c50399H2852h2426a9528H2402b88624N3521G6734a28449M0641
12393h7808a0488A76275a81276k0250B25857b6874q6000B31076j09645a54439
12382a20284G0937N038J21420a343j49169A94646J64424F8154a83173B55475D2460
$$ y = [-316190, 109243, 265266, -95497, 206408, -381778, -263525, 175347, -169739, 46401, 56861, 116740, -91411, 72712, -70608, -205245, 152482, 270865, 278925, -76152, -162679, -94043, -143448, -60260, 246880, -181897, -84899, -124746, 84068, 77074, -114815, -218461, -131343, -142742, 185048, 287733, 325596, 16588, -36656, -154726, 344213, 78471, 115626, -186166, 76423, 259971, -3621, -135861, 60164, -230600, -180337, 43801, 142809, -166123, -158275, 149224, 712, 4869, 80465, -350399, 82852, -82426, -19528, 82402, -288624, -235103, 76734, -128449, -87808, -10488, 176275, -181276, -201526, 225857, -26874, -112874, 231076, 121431, -154439, -120284, 70937, 75975, 197395, -1343, -150512, 194646, 359070, 68154, -183173, 255475, 42460]
12370a62745r949f8879J5220A43711N7393a99269R2208B49825r4556i3278N198
12359h8080a0597B9660a54724H1425L31614b98297i6541B3253K35865J84949b571
12347B52557o0016J04063e2016N64G6727a10730j09602a0852k7572k7183j16124
12336a81731A63010J67043c1154k5279C27583a95622B10525D0198Q4023J35297
12326B59518M1247d22706A11656O4575A3880e0787j92828h9452A23617F1738c9584
12314C13994j03729E3489e5957B91745f9079k7358C1590J4370a89897B34963C6672
12302B34850f1056j8712A36008a25967A8331E595L91523j82898P4272a58171B24341
12290F8341K22101a27275a5647A6713i0567r1516B01266B9170N4156g4601j3359
$$ y = [-162745, -172694, -68879, -53659, 143711, 201104, -199269, -107061, 249825, 155269, -93278, -88080, -10597, 29660, -154724, 81425, 413039, -298297, -96541, 23253, 259118, 444067, -2571, 252557, 192541, 296604, -52016, -51452, 76727, -110730, -220332, -10852, -38424, -65607, -181731, 163010, 330053, -31154, -56433, 327583, -195622, 210525, 40198, 124221, 259518, 300765, -422706, 111656, 176231, 13880, -50787, -243615, -89452, 123617, 61738, -39584, 313994, 210265, 53489, -55957, 291745, -69079, -96437, 31590, 45960, -189897, 234963, 36672, 234850, -61056, -79768, 136008, -125967, 18331, 5595, 397118, 214220, 288492, -158171, 224341, 68341, 290442, -127275, -15647, 16713, -90567, -182083, 201266, 29170, 83326, -74601, -87960]
12279h7960b6772d616I5577K52946A05153h9062F3168M88494A16699e1191B90345
12267C9642P8448c21640B12863G9146c6678E9898K72997C5409M3946J40960a08880
12255C68295a92071n0708C0224P3028b30329c8657k0916m7172C99541A78954p3526
12244A05428J26084b16990A80815B9163J88316a65181d906A50384k9026J14959
12234B36317K04273a55557l2966B52151m4528g6231B67882J03452g150H0603K67604
12223C48207A46923R030J76189L90784i2589B11829O0422l1263M2277J19118A28155
12211b1972B03995a59097B48909j4847k4194r9810J33189d8605B57361G0467R1182
12200A61649c4521G3508a44760O6289a0146A23123N7208q6396J98487J43818h1863
$$ y = [-87960, -26772, -4616, 95577, 348523, 105153, -89062, 63168, 551662, 116699, -51191, 290345, 39642, 118090, -321640, 212863, 79146, -36678, 59898, 332895, 35409, 79355, 220315, -108880, 368295, -192071, -242779, 30224, 103252, -230329, -38657, -59573, -106745, 399541, 178954, 105428, 231512, -216990, 180815, 29163, 217479, -165181, -4906, 150384, 121358, 236317, 440590, -155557, -188523, 252151, 207623, -76231, 267882, 371334, -7150, 80603, 348207, 146923, 155953, 332142, 722926, -92589, 211829, 272251, 240988, 283265, 402383, 128155, -21972, 203995, -159097, 248909, 234062, 209868, 110058, 243247, -48605, 257361, 70467, 161649, -34521, 73508, -144760, -78471, -10146, 123123, 180331, 93935, 292422, 436240, -81863]
12188F2791J11794a65587f2538B50686D8225o816c00578E6113P3533E8910A4900
12176I7299D7232J41238O5649d5630D10168A50761E043P3460a62221I5126B5621
12164C06600j32854G5364K11374d6017C2509J5509c06501h1143k5330G055g2372
12152B26875J04828c7954A53809a49263e4868A77369b063C1504a22835I9685l3729
12141F5956b19750c7993Q381k01048a3253m2331A03131K02878j19882B6271K16501
12130B42772a82228B7814K54258g1544A05919K63082b16691H5878a2341C18220
12119G6389l2434M3687h710r4199M2979J3351A43655J6806l6827f3130A4196a27504
12106a84213A67097f4522j77518B11958h9786k62044c9081m5702k7063D2890a73732
$$ y = [62791, 174585, -165587, -62538, 250686, 48225, 41409, -300578, 56113, 129646, 58910, 14900, 97299, 47232, 188470, 254119, -45630, 410168, 150761, 5043, 78503, -162221, 95126, 25621, 306600, 173746, 75364, 286738, -46017, 32509, 48018, -306501, -81143, -106473, 7055, -72372, 226875, 331703, -37954, 153809, -149263, -54868, 177369, -2063, 31504, -122835, 99685, 65956, -219750, -37993, -29612, -230660, -13253, -55584, 103131, 306009, 186127, 26271, 242772, -182228, 27814, 282072, -71544, 105919, 369001, -216691, 85878, -12341, 318220, 76389, 43955, 87642, -8710, -102909, -59930, -46579, 143655, 160461, 123634, -63130, 14196, -127504, -184213, 167097, -64522, -242040, 211958, -89786, -351830, -39081, -84783, -111846, 42890, -173732]
12094a4676l4149k7775L379m4085b1643F1356a11027A79451c96501a63647o4826
12083b28473Q4310E04053A17085d74093a73030J6427c6763j06944a646j15915
12073a17561B90132A2706N22213r9070P47183L87756F62704B11142c9038A39451
12062B31660a34811C97297A02720J88736a43617G8451J10947p5290a10425l8176
12052a48601G0994L48944c20133r3577A94243d1813j09214p786m0359A15232c06742
12040c3456A11325g7723j33159B14810a64105e032k72974A81881q9382g6877G6520
12028E7269c87360J34231D9087N5306L8811b17407A74163a2499k04015A5416c1712
12016H927L1891a39390L6080D46738i2490k13970J13823L4365A00699a54589A49758
$$ y = [-14676, -48825, -76600, -73221, -117306, -21643, 61356, -111027, 179451, -396501, -163647, -228473, -144163, 504053, 117085, -474093, -173030, -156603, -36763, -143707, -1646, -117561, 290132, 12706, 534919, 435849, 1183032, 1570788, 662704, 211142, -39038, 139451, 231660, -134811, 397297, 102720, 291456, -143617, 78451, 189398, 114108, -110425, -148601, 70994, 419938, -320133, -413710, 194243, -41813, -151027, -158813, -199172, 115232, -306742, -33456, 111325, -77723, -210882, 214810, -164105, -5032, -278006, 181881, 92499, -76877, 76520, 57269, -387360, -253129, 49087, 104393, 143204, -217407, 174163, -12499, -216514, 15416, -31712, 8927, 40818, -139390, -103310, 446738, -92490, -306460, -192637, -158272, 100699, -154589, 149758]
12004b35205J06462A62414e1477k6529b5815G4649M4976b07544a1710p5746A06458
11992H6996a91497A6947c6750C5763K5706a55381J1906D25089G2470d7742C92186
11980c6832E2084i8659q7343o8824k1106J3003A37965b65067l8197A38590A5112
11968c801F8307A1421c6143D3641J43632c44043G839g9652I2183i7104o4929l095
11956a65128j08967A35123f9091b8380A60818D1849a6652B4831O9481a17044E4026
11944d2478q2923O0133A06391c9691k09481o420A59915c5669j53507C26570a21745
11932A20695C3131K12470a52220c5448A45585K10287F2536d8411I6736P2803e7924
11920A12936c9523k71047B8410K91065c09663J30795A13398a54373i979K798B4147
$$ y = [-235205, -128743, 162414, -51477, -78006, -25815, 74649, 119625, -207544, -11710, -87456, 106458, 86996, -191497, 16947, -36750, 35763, 61469, -155381, -143475, 425089, 72470, -47742, 392186, -36832, 52084, -98659, -186002, -254826, -275932, -262929, 137965, -265067, -303264, 138590, 15112, -3801, 68307, 11421, -36143, 43641, 187273, -344043, 7839, -79652, 92183, -97104, -162033, -165128, -274095, 135123, -69091, -28380, 160818, 41849, -16652, 24831, 94312, -117044, 54026, -42478, -125401, -65268, 106391, -39691, -249172, -255592, 159915, -35669, -189176, 326570, -121745, 120695, 33131, 245601, -152220, -35448, 145585, 355872, 62536, -48411, 96736, 169539, -57924, 112936, -39523, -310570, 28410, 319475, -309663, -178868, 113398, -154373, -9979, -7181, 24147]
11908E0563a19617A78870a52406C3021r492K55203d7069C10460p4163J71044A71448
11896B91987a01120C28886i8726k95984f7742G6501c9879a0271G4041j0972a75082
11884e7480f112j39775B6618R4a49459p5166B49942A0332P907h2294j09774O1987
11872a30081O13A09897a06177A21039a84711p517P6660j55877A79468c00993F2798
11860a44300f6195k16112B01723A7814a98912A1069b3718q6972c2262F4936A6467
11848b1275n34807D1059J0818b6524A8750i970A10839A7883a63401A20446J7682
11837A38128f7795k51884a8231I6167c5314k67941J44346c4806A09980D6614j6854
11826B9760N964R1609a33072A91631D3248g8382l27739a50832m0024k28266I0251
$$ y = [50563, -119617, 178870, -152406, 33021, 23529, 278732, -47069, 310460, 236297, 407341, 171448, 291987, -101120, 328886, -98726, -394710, -67742, 76501, -39879, -10271, 74041, 63069, -175082, -57480, -6112, -145887, 26618, 26712, -149459, -224625, 249942, 10332, 18239, -82294, -192068, -130081, -129468, 109897, -106177, 121039, -184711, -192228, -115568, -271445, 179468, -300993, 62798, -144300, -66195, -282307, 201723, 17814, -198912, 11069, -23718, -110690, -32262, 64936, 16467, -21275, -556082, 41059, 51877, -26524, 18750, -9970, 110839, 17883, -163401, 120446, 138128, -67795, -319679, -18231, 96167, -35314, -303255, -158909, -34806, 109980, 46614, 29760, 35724, 127333, -133072, 191631, 43248, -78382, -406121, -150832, -190856, -419122, 90251]
11814a07731A16370D1809r415c31857H149e6860n5012I4355a48670L4485c4513
11802b42716R4504K7881B0484R8465a71096M9318a0178n3263A38753C1545J19578
11791A51123F8662M1571a25572C24022D1894b09141h5828c62k08078h8065K0601
11780f7464a4656A9428a87515h4109A09261L7J3997b44133g9011m768A65420c0376
11767A03217l9041b1169j60595B63029G7747Q144m2569a90974E9616b51868A21601
11755d97721D0933J29197B1132J78619d8030m1725n7972I3855J50844g0338J8240
11744e2098A00062K62987N3870b30689J05596b8684A77710m744b87428e8466B65053
11732a18878A93299q047a34693c1229A00719P357D3496K32774a7743q3286J468
$$ y = [-107731, 116370, 41809, 32394, -331857, 8149, -56860, -111872, 94355, -148670, -114185, -34513, -242716, -148212, -120331, 20484, 118949, -171096, -121778, -10178, -63441, 138753, 31545, 151123, 68662, 110233, -125572, 324022, 41894, -209141, -85828, -362, -208440, -88065, -67464, -14656, 19428, -187515, -84109, 109261, 109298, 123295, -244133, -79011, -83779, 165420, -30376, 103217, 64176, -21169, -181764, 263029, 77747, 85891, 43322, -190974, 59616, -251868, 121601, -497721, 40933, 170130, 21132, 199751, -48030, -89755, -147727, 93855, 244699, -70338, -52098, 100062, 363049, 416919, -230689, -125093, -28684, 177710, 172966, -287428, -58466, 265053, -118878, 193299, 185252, -134693, -31229, 100719, 108076, 43496, 276270, -17743, -101029, -99561]
11721i9561C00569C8650c9541B95157I4150K44612a43889C06666F2958A1857M9035
11710F0892j6782b48810B77597D9999e227A45399K06807A5622a40108I1906A9281
11698D9786Q15J55705a20l79496A91902q9761M7396b19965G1590c5293q1515b8980
11685G6608g9638B1563J50746D5L5233L6169J62165H8437O7485g9376A0023P8782
11673H8805M5751a61094g983j50447A19856a1968l29364J25738a0416B10302b70555
11661a38705C1266J9248i0246B38845C1990a38775E3210J85577F9474L1254a58860
11649g3702A36885a86879b2091A64489g6182j27298G0540g5370B3705K05041c63217
11637B68805c3543j82603G0884L3809c04241i3437A28166b73894b8144n5169k24424
$$ y = [-99561, 300569, 38650, -39541, 295157, 94150, 338762, -143889, 306666, 62958, 11857, 60892, 44110, -248810, 277597, 49999, -5227, 145399, 352206, 15622, -140108, 91906, 19281, 49786, 50601, 206306, -120, -379616, 191902, 102141, 149537, -219965, 71590, -35293, -116808, -28980, 76608, -79638, 21563, 172309, 45, 35278, 71447, 233612, 88437, 155922, -79376, 10023, 88805, 134556, -161094, -7983, -158430, 119856, -11968, -341332, -215594, -10416, 210302, -270555, -138705, 31266, 50514, -90246, 238845, 31990, -138775, 53210, 238787, 69474, 100728, -158860, -73702, 136885, -186879, -22091, 164489, -76182, -203480, 70540, -75370, 23705, 228746, -363217, 268805, -33543, -216146, 70884, 104693, -304241, -93437, 128166, -273894, -28144, -83313, -307737]
11626c07737A38365N0403a44606a780k967j34775A51451j1890l0268b4885B37539
11614a8245o9282A28234a7601j66452f5617l66824B92538h3957F4482a32650C6943
11602b06903a7131j39426b6542j66813g440A18221a00318L7868k5810j00782A82253
11590A48063F9045O400Q0789p4816K67487b9687B59749L2520b5403B32973H5787
11578E5868a66499A51516Q7304a49844B9898J62261a4242A18279b3834B14352
11567b8990m9461I3425Q2462g600j08753F4757P8890N3996A8574c3663G0157a1195
11554C04624E6553L40515A6401b97822Q8405c5343B36256a91149A97424b34716
11543A43781J32650b2578j63609D8502b66403J0470h7440H1101k6421R1685K70458
$$ y = [-307737, 138365, 188768, -144606, -1780, -4747, -139522, 151451, 139561, 109293, -24885, 237539, -18245, -87527, 128234, -17601, -184053, -65617, -432441, 292538, -83957, 64482, -132650, 36943, -206903, -17131, -156557, -26542, -193355, -7440, 118221, -100318, -62450, -88260, -189042, 182253, 148063, 69045, 75445, 156234, 81418, 348905, -29687, 259749, 292269, -25403, 232973, 85787, 55868, -166499, 151516, 238820, -149844, 29898, 192159, -14242, 118279, -23834, 214352, -28990, -78451, 93425, 175887, -7600, -116353, 64757, 143647, 197643, 18574, -33663, 70157, -11195, 304624, 56553, 397068, 16401, -297822, -209417, -35343, 236256, -191149, 197424, -234716, 143781, 276431, -22578, -186187, 48502, -266403, -255933, -87440, 81101, 54680, 146365, 416823]
11532D16823G406J47225G2418j2841k1740K1339K35951a20660F954h5358b9337
11520F569P8087J48664q0100F921J86770b193I1975b18077A13913c1985r7841
11509a29826j4488E1278J02019E1181J34979a04812I0567a49749I5625P0721a65583
11497A9246b80725F899d7395r1965A28588n706f6896p15K2432G0933L27531G3771
11484B68217e3094A54707g6213K3883G8155K05289g1370C28284D0951Q7053L56341
11473D84345A94298G0463N9297d8572k21913E9100J32428o1148g0930r407C49034
11461C05195C9625J2372O0111P0877K12788J51667C0042J37746b13360A19232
11450G5418i5745l8367L6555n0348C27231f7215A56114C5504J83406B6472a27904
$$ y = [416823, 7406, 154631, 72418, 59577, 37837, 59176, 295127, -120660, 6954, -85358, -29337, 6569, 84656, 233320, 153220, 6921, 193691, -2193, 91975, -218077, 113913, -31985, -129826, -144314, 51278, 153297, 51181, 186160, -104812, 90567, -149749, 95625, 166346, -165583, 19246, -280725, 6899, -47395, -139360, 128588, 122882, -66896, -67611, -45179, 70933, 398464, 73771, 268217, -53094, 154707, -76213, -52330, 78155, 283444, -71370, 328284, 40951, 128004, 484345, 194298, 70463, 129760, -48572, -270485, 59100, 191528, 130380, -70930, -80337, 349034, 305195, 39625, 51997, 112108, 182985, 395773, 547440, 30042, 167788, -213360, 119232, 75418, -95745, -134112, -97557, -147905, 327231, -67215, 156114, 35504, 218910, 26472, -127904]
11438a14966E1317a21164B28438p0952d4365C0284C654b92185a30218D6100a37583
11426c0468p1392e522j55225P425A0001b09263i1088H1929Q9310e8336m0389A01647
11413e6962k13970g3237l417q4968A30628b04645N3837b3900J1627B8761K0815
11402D9576a77969j12338J07679b1640C83396j75745F3613d0347j1641P589k1450
11391f5849l09137a28876a4810k10663l02743B54793a91582n2210h6106C87113
11380a04639j49347E6744b07833a3762A73010J2962E4396g6619k52161A34952
11369a79299a0076E2740L6021a7335D426b6008B74057b5537p4685A45439a53544
11357a6983m5930j14714K8481K9185d901j40724L2668B45660A20103J08143b5054
$$ y = [-114966, 51317, -121164, 228438, 157486, -44365, 30284, 3654, -292185, -130218, 46100, -137583, -30468, -101860, -5522, -160747, -153322, 10001, -209263, -91088, 81929, 171239, -58336, -98725, 101647, -56962, -270932, -73237, -76654, -161622, 130628, -204645, -150808, -23900, -12273, 28761, 49576, -177969, -290307, -182628, -21640, 383396, 207651, 63613, -40347, -51988, -44399, -65849, -374986, -128876, -14810, -225473, -528216, 254793, -191582, -243792, -86106, 387113, -104639, -253986, 56744, -207833, -13762, 173010, 185972, 54396, -76619, -328780, 134952, -179299, -10076, 52740, 88761, -17335, 4426, -26008, 274057, -25537, -100222, 145439, -153544, -16983, -62913, -177627, -149146, -119961, -4901, -145625, -112957, 245660, 120103, 228246, -25054]
11345i4616D1875J43493a329A18401D8976L20771c2003B8308d1925j45312B22843
11333b31290e3512J9758B16827l9541a14312B5691L0971a86401r368B65255E537
11321A65994E4180h1432B78380a3130j51470A22363c02344c9985j46404A99777
11310a04127j48831C410K45423D8941b7931A09734M7890i7482B12291D6135A6083
11298e5111H65d45838J49524a19745h863j316A5482c63357J23457I7522f404m4256
11286e0660i495C2265g851B47006a88655B41896a12295o5182e9706J8207C628
11274a91047F2535b59503H7429a79853L449b1115A34325b63076G0045L6057a48453
11262A5615J24830D6060g6894H8018k2414J92437b20137R4635k80111F6521f6044
$$ y = [-94616, 41875, 185368, -1329, 118401, 48976, 369747, -32003, 28308, -41925, -187237, 222843, -231290, -53512, -33754, 216827, 177286, -114312, 25691, 56662, -186401, -195769, 265255, 5537, 165994, 54180, -81432, 278380, -13130, -164600, 122363, -302344, -39985, -186389, 199777, -104127, -252958, 3410, 248833, 48941, -27931, 109734, 157624, -97482, 212291, 46135, 16083, -55111, 865, -445838, -296314, -119745, -8863, -10179, 15482, -363357, -239900, 97522, -6404, -50660, -9495, 32265, -7851, 247006, -188655, 241896, -112295, -177477, -59706, -41499, 3628, -191047, 62535, -259503, 87429, -179853, -176404, -21115, 134325, -263076, 70045, 106102, -148453, 15615, 140445, 46060, -76894, 88018, 65604, 258041, -220137, -125502, -405613, 66521, -66044]
11250A15550b17772a08101b9321a0185k26458e8066a9390j37929A63913a0248
11239I6183a60200p9284N0073C7901K953i0817M3949A38095m3714C6491J9564
11228E6055a55205B56797g9558q099o9033b2197j47945A5641n424a10634N3523
11217e7111j12043j99373C72463f7297c2471j32153A84011a27184q4639P0503
11207a41320A1973b93967J06951G212K434e5449A56996o677a94284B85534A11616
11195b6823l5192k4875A34224b5834C4999i9879B5874b80181B301J39639a26909
11183a39010A12025a64517N1415B6307L12994f1050k28717H3655a75661M2184
11173a33477l525B71600G2776g1712j71863B2468L72608b6829M780m8893C4945
$$ y = [115550, -217772, -108101, -29321, -10185, -236643, -58066, -19390, -157319, 163913, -10248, 96183, -160200, -239484, -189411, 37901, 40854, -90817, -46868, 138095, 94381, 36491, 56055, -155205, 256797, -79558, -87657, -156690, -22197, -170142, 15641, 10217, -110634, -57111, -169154, -368527, 372463, -67297, -32471, -164624, 184011, -127184, -211823, -141320, 11973, -293967, -187016, 7212, 9646, -55449, 156996, 150319, -194284, 285534, 111616, -26823, -62015, -86890, 134224, -25834, 34999, -99879, 25874, -280181, 2301, 141940, -126909, -139010, 112025, -164517, -113102, 26307, 339301, -61050, -289767, 83655, -175661, -133477, -137002, 271600, 72776, -71712, -243575, 22468, 395076, -26829, -22049, -70942, 34945]
11161A75776E7368a13434G9862a62805D3795L4314g9855B88879F2455b43363a17124
11149A31852A5683q18b3209J962A8723g1612b5941A38380l0055J63850m4070a2786
11136A25299Q1481i9496B23190f5122F3602a0535j91450E3901J07099c04879g0901
11124i3105K413a2166E167J77810G4253j1044c8401k55514A37305C9954A2367
11112b4162q9055H0531J01473o1578J22215n7931B9014N3091a08900c3492m1189
11101g4681n6228b4366j20763G9986R457J12438J43364A42673l2037A2736J04290
11090A17026n2845B7913J30787o2185e128D0454J93609H8309k4338f3271C33657
11078B99136C0495L77908r777J6410G1575L36641A91944J67634R7787e6351I0508
$$ y = [175776, 57368, -113434, 79862, -162805, 43795, 78109, -79855, 288879, 62455, -243363, -117124, 131852, 15683, 14865, -23209, -21247, 18723, -71612, -25941, 138380, 108325, 272175, 228105, -12786, 125299, 206780, -99496, 223190, -65122, 63602, -10535, -201985, 53901, 161000, -304879, -70901, -93105, -90692, -12166, 5167, 182977, 74253, 63209, -38401, -293915, 137305, 39954, 12367, -24162, -113217, 80531, 182004, 120426, 242641, 184710, 29014, 82105, -108900, -33492, -74681, -130909, -24366, -145129, 79986, 89443, 201881, 345245, 142673, 110636, 12736, 117026, 64181, 27913, 158700, 96515, -5128, 40454, 234063, 88309, 63971, -63271, 333657, 299136, 30495, 408403, 398626, 415036, 71575, 408216, 191944, 359578, 457365, -56351, 90508]
11066D43799J34840B27708M9956R9032M0023n5794K77033E2803L21876p3709L52976
11055F53946j31099J27710J4707J0095J53624j84942j51856o0047j2324o501K47805
11044F61118R8246R7582r7131n8144N8532j5086K45181m51593G3136M99902j5178
11033E57860j52174L86597P7281l47023j32359L02464J837k09505M58428l94660
11023E48746j77678J92940J41281B99807K21913j27301G2479K72879J23608O3948
11013E32914B47754K04615j7358J26301l1300k09779N5893O7044o1810R6685B04258
11001D47789K43606j21987L35053k47982k27471j46275K29341J05839j83274r9245
10991C35394K97859L7934O0161J7193L6223R0558p9792K19252P9967n5279J37163
$$ y = [443799, 578639, 227708, 277664, 376696, 416719, 360925, 637958, 52803, 374679, 300970, 653946, 522847, 650557, 665264, 675359, 828983, 644041, 492185, 432138, 419814, 413313, 661118, 759364, 856946, 759815, 701671, 760203, 745117, 990298, 538705, 73136, 573038, 557860, 405686, 792283, 869564, 522541, 390182, 692646, 694483, 484978, 943406, 548746, 371068, 564008, 705289, 299807, 521720, 394419, 72479, 345358, 468966, 532914, 247754, 452369, 435011, 561312, 530012, 320233, 376126, 443170, 381360, 478045, 204258, 447789, 691395, 569408, 904461, 656479, 429008, 282733, 512074, 617913, 434639, 335394, 633253, 671187, 731348, 748541, 784764, 875322, 795530, 1014782, 1094749, 1039470, 1176633]
10980A176633r0704l2953L49921p6547L62507M90486m16956O31283l852j52799
10970B237019k16902L51534j68423n86387P5113l76854J7157J01361l8535m0797
10960A354286J41846j65253J46752j32942K68927m92590J88018k04939k7695n06044
10950E70366J56131L14645D19586Q5513J74802I4736J77446l4823l8601L7424
10940B36182e7372A13884B8465g9928c3357A39568o7846a39013B38881a75122
10929b68212J31139B11148a58467b7437I0865L460J7242K36391i0960k9071j39582
10918b59613P7567D0878a08407A17731P5929a4851B6663K8094J60985e3048j76584
10907b29632f4384E7039c91923e4078G0067l0540a42369A43823F5937R3488Q1829
$$ y = [1176633, 1085929, 1052976, 1402897, 1326350, 1688857, 2179343, 1762387, 2393670, 2389818, 2237019, 2020117, 2371651, 2203228, 1616841, 1691954, 1315100, 1332257, 1433618, 1395083, 1354286, 1496132, 1330879, 1477631, 1344689, 1613616, 1121026, 1309044, 1104105, 1076410, 570366, 726497, 1041142, 419586, 505099, 679901, 94736, 272182, 237359, 198758, 236182, -57372, 113884, 28465, -79928, -33357, 139568, 71722, -139013, 238881, -175122, -268212, -137073, 211148, -158467, -27437, 90865, 94325, 111567, 347958, -90960, -120031, -259613, -182046, 40878, -108407, 117731, 193660, -14851, 26663, 54757, 215742, -53048, -229632, -64384, 57039, -391923, -54078, 70067, 39527, -142369, 143823, 65937, 159425, 241254]
10896B41254B9076L03307a1857A88674b99966H3156a38651B2943R8612D4152J937
10885D6089K8158J4940b24319J06345k1323a6525A23130Q0480p3963J3352a3375
10873h2000A60760c29826c0709J1636l1796q8339A20897K94869c18891c4280A90370
10861E9877a51327A08079J76966a36010j1539n0794a7432A79210g0853A00405
10850f304H1688b13995i6664j50938J05641A70699a65761l3924j01607B39366
10839c57197B50595b98890A20336n0402A4806a56255E2119c5044j50606c1902
10828a33243b2846A53871o4911a23304l23963c9698A20791l283a03096A97512
10817b06747c7103A98543p9980j0647c94637a64809B62054C5264J31569a05161
$$ y = [241254, 29076, 332383, -11857, 188674, -299966, 83156, -138651, 22943, 121555, 44152, 46089, 74247, 89187, -224319, -117974, -139297, -16525, 123130, 203610, 129647, 142999, -13375, -82000, 160760, -329826, -30709, -19073, -50869, -139208, 120897, 415766, -318891, -34280, 190370, 59877, -151327, 108079, 285045, -136010, -147549, -198343, -17432, 179210, -70853, 100405, -6304, 81688, -213995, -96664, -247602, -141961, 170699, -165761, -199685, -301292, 239366, -357197, 250595, -298890, 120336, 69934, 14806, -156255, 52119, -35044, -185650, -31902, -133243, -22846, 153871, 88960, -123304, -447267, -39698, 120791, 117508, -103096, 197512, -206747, -37103, 198543, 118563, 107916, -394637, -164809, 262054, 35264, 166833, -105161]
10806a06805j15689a04408A96190a84012a0022B69139a44643B65788a89537b5583
10795d6198j42010i0605n9103C7745K81432a67318C01328j48507b01484P5474
10785a26010m3330d7861k3149r9815A17953c16804B67416h3852A54320a33155
10774d6736r5853q1253J06478A89739i0646A8810d74011E3477J959b37508B0351
10762A96598b46662b8719H416d8097q6955H0884b28971I1410D3097N1219N2383
10751A46699J3907a35550A01911a18688j7597k87526A03593a02257A0525K4420
10741C4945a2859C1592c9721n8884B35050b72738c5589k70344i7177F5657i4502
10729a88216P897k47624F1557L9673J15715I8953a8082B47850a89186B12413k9396
$$ y = [-106805, -222494, -104408, 196190, -184012, -10022, 269139, -144643, 265788, -189537, -25583, -46198, -188208, -90605, -149708, 37745, 319177, -167318, 301328, 152821, -201484, -126010, -169340, -47861, -71010, -170825, 117953, -316804, 267416, -83852, 154320, -133155, -46736, -142589, -223842, -117364, 189739, -90646, 18810, -474011, 53477, 55436, -237508, 20351, 196598, -246662, -28719, 8416, -48097, -135052, 80884, -228971, 91410, 43097, 94316, 146699, 160606, -135550, 101911, -118688, -136285, -423811, 103593, -102257, 10525, 34945, -12859, 31592, -39721, -98605, 235050, -272738, -35589, -305933, -97177, 65657, -94502, -188216, -180319, -427943, 61557, 101230, 216945, 98953, -18082, 247850, -189186, 212413, 183017]
10718A83017a66053C5853b41285j99257F225f6484C9869J0080N3668b84927D6698
10706a85478B3326N9946f6516q0918b7614p5497d7725j41731A80273G47b99624
10694E8914A6726J04184e032C1726a21883I1893K6956d58929a68434K1179c8860
10682B62702A27337b76524a29763A04h1079L5753C18744e6095j10531E9549b06584
10670a19079i012j16422k57800a11980M2325J18F0856b37988j65028J91469A44932
10658a6080l18829a06057E060a45849m2247k0960Q5532A67287E5046M6210c53378
10646a68810d681H3630J13551A1506c1480D0195J58503c24066e8651k63593b5198
10634a60537j57227c8465J1519j0838D8595a0075A00209a39478A1409J30802b46941
$$ y = [183017, -166053, 35853, -241285, -440542, 6225, -66484, 39869, 49949, 103617, -284927, 46698, -185478, 23326, 83272, -66516, -147434, -27614, -103111, -47725, -189456, 180273, 747, -299624, 58914, 16726, 120910, -5032, 31726, -121883, 91893, 118849, -458929, -168434, -147255, -38860, 262702, 127337, -276524, -129763, 104, -81079, -45326, 318744, -56095, -166626, 59549, -206584, -119079, -9012, -125434, -383234, -111980, -69655, -69537, 60856, -237988, -403016, -211547, 144932, -16080, -334909, -106057, 5060, -145849, -188096, -209056, -123524, 167287, 55046, 101256, -353378, -168810, -4681, 83630, 197181, 11506, -31480, 40195, 198698, -324066, -58651, -322244, -25198, -160537, -317764, -38465, -26946, -37784, 48595, -10075, 100209, -139478, 11409, 142211, -246941]
10622a40742M3158F6374f0048j12783j60478j03348a05105l0491k99197a18620
10611A49738f4785C3150A1108K45325i6596B31411c3525j36613b7981j4194A00437
10599a08052q3562C07958d566F2640M1113a13485J6219m1991a829F5206K44297
10588C09503b11536B07344I7031K8303a04783B23283b65854A55067g5318l26470
10578d01788a91449B09429f9405k91218K6103a48712e8658k60360D4984a83264
10567c7030k86945P3825q741D0634J43147P5974f3800B01013a77017h5428j2273
10556i7701j75565j8943B02845I6092K595J55543j17240a78791j8712c3057A54292
10544A7426b00320c9228C6150L17411I9550a00919F6838k4820a15055e30j10798
$$ y = [-140742, -97584, 66374, -60048, -172831, -333309, -436657, -105105, -135596, -434793, -118620, 149738, -64785, 33150, 11108, 256433, -96596, 231411, -33525, -170138, -27981, -42175, 100437, -108052, -191614, 307958, -4566, 62640, 103753, -113485, -97266, -139257, -1829, 65206, 309503, -211536, 207344, 97031, 125334, -104783, 223283, -265854, 155067, -75318, -401788, -191449, 209429, -69405, -360623, -334520, -148712, -58658, -319018, 44984, -183264, -37030, -323975, -250150, -258891, 40634, 183781, 259755, -63800, 201013, -177017, -85428, -97701, -273266, -292209, 202845, 96092, 98687, 254230, 136990, -178791, -197503, -33057, 154292, 17426, -200320, -39228, 36150, 353561, 99550, -100919, 66838, 42018, -115055, -530, -111328]
10533a11328j00496B5185b23265m2794C4249d2302j19078d6342D12723c425l52787
10522c56212D518f7650R938k3413B3895d6977j87221P1719k47773H7642a3448
10510b18862j15203E3452a98248L3887H2603b28507B25710d8963B71127H4781
10499A22390h1045j28526d9422j13821k7171m0760A15302J52368a8581A13208
10488H8526J5087J40098b11365I1984J64813Q9656R5495A98079L04808B48867
10477d6847C03817b62584N5070E8107e2486p482a2430D7994J11437J89759p4127
10466B75063a76472D2458L24160e29464a54435A54141J20321c4310j74252j3213
10456b21775H6056L3801A8726b0102k42213A56084a13642B7708b967C73624A49605
$$ y = [-111328, -211824, 25185, -223265, -266059, 34249, -42302, -161380, -46342, 412723, -3425, -356212, 4518, -67650, -57712, -81125, 23895, -46977, -234198, -162479, -410252, 87642, -13448, -218862, -334065, 53452, -198248, -164361, 82603, -228507, 225710, -48963, 271127, 84781, 122390, -81045, -209571, -49422, -163243, -190414, -231174, 115302, 267670, -18581, 113208, 88526, 103613, 243711, -211365, 91984, 256797, 346453, 441948, 198079, 502887, 248867, -46847, 303817, -262584, -207514, 58107, -52486, -59968, -12430, 47994, 159431, 349190, 275063, -176472, 42458, 366618, -529464, -154435, 154141, 274462, -34310, -208562, -221775, 86056, 119857, 18726, -20102, -262315, 156084, -113642, 27708, -2967, 373624, 149605]
10444A0636a74536r6752B33212d9416c567A31758a85433j58475B84106b04452
10433d5782l64303B57359j18067h1359k61285F0625K77684d1298B36891E8358
10422f157j81699a5445j81428Q770g5948a4565j81852j1539b7439B07346a4040
10410E3983b02585b6758j80789C05335m8683B099b54883A36347N1891b25606C36775
10398D38541A98512b03484E3374g1109B36607b74181h3319c7206D2158e4706j13820
10387a68526k8976Q4086A767O5680R7911a27477A49142J55566k3457g7679B54579
10375B44097M7001n7316k552P9218B5057L48428N1964j24885l8322L4037n9498
10364B36781O6200j14383j924L3104q9871m3453A4129L10461m9265j18435l316
$$ y = [10636, -174536, -271288, 233212, -49416, -3567, 131758, -185433, -343908, 284106, -204452, -45782, -410085, 257359, 139292, -81359, -342644, 60625, 338309, -41298, 236891, 58358, -6157, -187856, -15445, -196873, -188103, -75948, -14565, -196417, -207956, -27439, 207346, -14040, 53983, -202585, -26758, -207547, 305335, 256652, 2099, -254883, 136347, 188238, -225606, 336775, 438541, 198512, -203484, 53374, -71109, 236607, -274181, -83319, -37206, 42158, -54706, -168526, -197502, -113416, 1767, 67447, 165358, -127477, 149142, 304708, 281251, -77679, 254579, 244097, 291098, 233782, 231230, 310448, 25057, 373485, 425449, 300564, 262242, 296279, 236781, 302981, 188598, 186674, 219778, 129907, 86454, 14129, 324590, 275325, 156890, 153574]
10353A53574R30Q8028M2181L18037B25738Q9017Q7162A01442J36366G6822M09278
10342D86100E1807A4291M91055a53755G1317N7572n3789Q7523o1430P2563O3203
10331B36959J51464p2230j07681J5066A7362M1169d7433B54541a62009B19735
10320C47774d1873C53812i675G7901R7377K75379h2237j09662R153A61571R4868
10309B56439h4037B33187a24559l6436H8150R0782d1148A0270K14248a82691H4788
10297a51279H2761a77924M6979K6194c3283k4196F655b02738D677a60482N1387
10286a09095F5801a63829N4919k40300J40427K4710Q0800B925a9327j85634k1904
10275b26865E4904R4495e478C52747H9860a13150j03159i7180A49533a18172G9266
$$ y = [153574, 154504, 242532, 284713, 602750, 225738, 314755, 401917, 101442, 237808, 76822, 486100, 51807, 14291, 505346, -153755, 71317, 128889, 75100, 162623, 101193, 173756, 236959, 388423, 316193, 208512, 223578, 17362, 58531, -47433, 254541, -162009, 219735, 347774, -41873, 353812, -9675, 77901, 175278, 450657, -82237, -191899, -182746, 161571, 256439, -84037, 233187, -124559, -160995, 88150, 178932, -41148, 10270, 224518, -182691, 84788, -151279, 82761, -177924, -130945, -104751, -33283, -57479, 6655, -202738, 4677, -160482, -109095, 65801, -163829, -108910, -349210, -208783, -184073, -103273, 2925, -19327, -204961, -226865, 54904, 149399, -5478, 352747, 89860, -113150, -216309, -97180, 149533, -118172, 79266]
10263G3822J1091D1910b8685E40175A98646k073J36779F757M2790L3939a98161
10251B24412f428B77206A12951K4851b55427B27275g0600I0086a66838m5814A869
10239A79666a299C5157g5991B7672a34393a0014j32903L2017C4596g9334c1948
10227E9971L19569C9552f0337I1243b17800A63833c01100a18846D8747R5955M5868
10216A90570f2824A63600B8831N5652c6301k21418A41027a76343b821A28617a2201
10204b2713l56028a38455M2419C43890g8803A7446H478d00481b2166G4200L5639
10193A09839a56244c272l85792a93890B22951A00923a12905B4894J15357l9077
10183A01174J74667a89502f7828K6041k12683c3864j09666I3306c60434a74985
$$ y = [73822, 84913, 41910, -28685, 540175, 198646, 196573, 333352, 6757, 49547, 83486, -198161, 224412, -6428, 277206, 112951, 137802, -255427, 227275, -70600, 90086, -166838, -212652, 1869, 179666, -1299, 35157, -75991, 27672, -134393, -10014, -142917, -110900, 34596, -79334, -31948, 59971, 379540, 39552, -60337, 91243, -217800, 163833, -301100, -118846, 48747, 144702, 190570, -62824, 163600, 28831, 84483, -36301, -257719, 141027, -176343, -2821, 128617, -12201, -22713, -378741, -138455, -96036, 343890, -78803, 17446, 8478, -400481, -22166, 74200, 109839, -156244, -3272, -389064, -193890, 222951, 100923, -112905, 24894, 140251, 101174, 275841, -189502, -67828, -41787, -254470, -33864, -143530, 93306, -360434, -174985]
10172b04054i6194H1294M8323N8903A615a72341l3221O5955I6636m2729a98433
10160a9228j79714M1273B59664j01840c26766a56434p0473B35279a95979D5249
10149g9359c9558l9555A45645a33527E5566a99637A60936J8981b10634Q0297l19123
10138d49460B21928d03884F5741M00J03986b11248A05585e5617j55024h6285j78539
10127b64824b0966j10884C32163H3243K28270c59316J57968I0456a23772k10982
10117c34754R3812h5572q1640h3218B72876q730A4231a81326o4483e1769j67072
10106b18841a5884o7545A75337c96638a03955k3002l2236A59944l3153R6594c1932
10094A64795f2885j66946f0413k3912c1890k29390a15819m7558L3099j56981Q1671
$$ y = [-204054, -96194, 81294, 129617, 188520, 1615, -172341, -205562, -139607, 96636, 53907, -198433, -19228, -198942, -157669, 259664, 157824, -326766, -156434, -226907, 235279, -195979, 45249, -79359, -39558, -79113, 145645, -133527, 55566, -199637, 160936, 179917, -210634, -130337, -449460, 221928, -403884, 65741, 66141, 170127, -211248, 105585, -55617, -210641, -86285, -264824, -20966, -131850, 332163, 83243, 311513, -359316, -201348, 90456, -123772, -334754, -240942, -85572, -167212, -83218, 272876, 264146, 14231, -181326, -245809, -51769, -218841, -15884, -83429, 175337, -396638, -103955, -126957, -159193, 159944, 126791, 223385, -31932, 164795, -62885, -229831, -60413, -84325, -31890, -261280, -115819, -163377, -130278, -287259, -205588]
10083b05588J9807i1104L8965E5218B4953O5444a91824M585m867L2222r9019o5031
10071c23934h7473c885k10368B3321b39581J2769N1171H6932a47569A40649a32554
10059A48665a69695k59120c7567q1672j5143b1081A04714K4232K86606a03050
10048i9040A61046b18657B41766a66484B95124C8200h9433k47845A41811h4694
10037C7133Q0806b42330n9149d0825r3020j27677A00937q792Q2489n2222a4687
10025d24428B11129f6939q8816J634B38286a28115A5834a48888l0071A10643i067
10013d36996a59082P6326L8802G2679K2153K72208p9753b50458g1766o9961a5249
10001I3627J72926a79587h1034A65576K3110a57617E2368b62500a07596B29177
$$ y = [-205588, -185781, -91104, -52139, 55218, 24953, 90397, -191824, -187239, -192106, -159884, -258903, -323934, -87473, -3885, -214253, 23321, -239581, -226812, -175641, 86932, -147569, 140649, -132554, 148665, -169695, -428815, -37567, -119239, -134382, -21081, 104714, 128946, 415552, -103050, -99040, 161046, -218657, 241766, -166484, 295124, 38200, -89433, -337278, 141811, -84694, 37133, 117939, -242330, -301479, -40825, -133845, -261522, 100937, 92145, 174634, 122412, -14687, -424428, 211129, -66939, -155755, -154121, 238286, -128115, 15834, -148888, -178959, 110643, -9067, -436996, -159082, -82756, -43954, 72679, 94832, 367040, 287287, -250458, -71766, -141727, -15249, 93627, 266553, -179587, -81034, 165576, 188686, -157617, 52368, -262500, -107596, 229177]
9990a40374m7438l28454d28B60496c82480d4738B58172E3943b40878R3701J0474
9979a36703j15653h2526A30365b75063M7409i059j47430N6151C7009J71825b9493
9967a05195q9258F731e55931g6871j57953j5419g4210n0744c5789B9864a84440
9955A87251e1576J5782k65109D2453a92243M115g2389D1939d512k2450l09322
9944c36284F5599A2629J20541f2588o0475A01630j0467d6306A50331B9126J49231
9933A78357b59113B88716c5622o6218K1280k91625n919E4634I724K5834K72470
9922C08028b18849Q1846A35009a47251m2166M1027j18224L9367A19736b10102
9911H0083h3490J7743l90283a0195B64241H33J295O1121b00646e3330k72455f5309
$$ y = [-140374, -187812, -516266, -428, 260496, -382480, -44738, 258172, 53943, -240878, -147177, -136703, -252356, -82526, 130365, -275063, -227654, -9059, -156489, -100338, 37009, 208834, -29493, -105195, -194453, 6731, -555931, -76871, -234824, -250243, -74210, -124954, -35789, 29864, -184440, 187251, -51576, -35794, -300903, 42453, -192243, -188128, -72389, 41939, -4512, -26962, -336284, 65599, 12629, 133170, -62588, -123063, 101630, 91163, -46306, 150331, 29126, 178357, -259113, 288716, -35622, -101840, -80560, -372185, -378104, 54634, 9724, 35558, 308028, -218849, -137003, 135009, -147251, -189417, -148390, -266614, -227247, 119736, -210102, 80083, -83490, -65747, -456030, -10195, 264241, 833, 2128, 63249, -200646, -53330, -325785, -65309]
9898a69585O0531l43770A57160b16970c7092B46714p8143D990b04012g0876j58695
9887b29571N3582I8621a99610A1588a0362C7934i3863n1459F9220f4589m2057
9876a06646k75335a33970A49119L6939c29589g6872a0227A89764c3121g391k18119
9865b25510A0716R1329a19057a956A2458J81607r0794a50222I1198a6648k76768
9854b93416a16635A63901E6403h9491a3197k0562j85010P9125b2490A54369B5094
9842f1116I9765c44956P1277B1943a46253k86828A72300a97628q991d2702C34061
9830E5129b34220k2064J18777k712j01636a05079A59787a13767E023d4282a0046
9818a72337f2502I7771R1529K5318I9555h1234k23594c4368j16309g4078k90214
$$ y = [-169585, -109054, -452824, 157160, -216970, -37092, 246714, 168571, 4990, -204012, -70876, -229571, -175989, 98621, -199610, 11588, -10362, 37934, -93863, -145322, 69220, -64589, -106646, -381981, -133970, 149119, 186058, -329589, -76872, -10227, 189764, -33121, -7391, -225510, 10716, 102045, -119057, -1956, 12458, 194065, 103271, -150222, 91198, -16648, -293416, -116635, 163901, 56403, -89491, -13197, -33759, -218769, -139644, -22490, 154369, 25094, -61116, 99765, -344956, -273679, 21943, -146253, -433081, 172300, -197628, -206619, -42702, 334061, 55129, -234220, -256284, -137507, -140219, -241855, -105079, 159787, -113767, 5023, -44282, -10046, -172337, -62502, 97771, 189300, 214618, 99555, -81234, -304828, -34368, -150677, -74078, -364292]
9807c64292A05475d1190k04197k28344b11377L3371B93411c24927f7631A44715
9796b27297l7917f128a273H048a22090I8399g7000g838r4605d4495B17821b58119
9783A27973F1284A9565e0983B9248a3794F270a32548c582F7485H060a98528c8663
9770C90844c93654B87252F336g3154p7228n0563C66580b63052M5831k8741f80
9758b37728f3308j60019P0372B95510D2237d7851j66667B31803d2410j51538R0036
9747a03912j68848J21434M1530e695B604J54392c0576p3336j55311L7234e2623
9735a56282N2186j79021L9386B37616E3021d8525A53288c71485N5434g350I1620
9723a82281k01768B0558d20821J54373N4391A73858a19277m3918H2344A8079c52534
$$ y = [-364292, 105475, -41190, -245387, -473731, -211377, -178006, 293411, -324927, -67631, 144715, -227297, -265214, -6128, -1273, 8048, -122090, 98399, -77000, -7838, -102443, -44495, 217821, -258119, 127973, 61284, 19565, -50983, 29248, -13794, 6270, -132548, -3582, 67485, 8060, -198528, -38663, 390844, -393654, 287252, 6336, -73154, -150382, -200945, 366580, -263052, -217221, -245962, -680, -237728, -63308, -223327, -152955, 295510, 42237, -47851, -214518, 231803, -42410, -193948, -103912, -272760, -151326, -109796, -5695, 2604, 156996, -30576, -103912, -259223, -221989, -52623, -156282, -104096, -283117, -243731, 237616, 53021, -48525, 153288, -371485, -316051, -7350, 91620, -182281, -384049, 20558, -420821, -266448, -212057, 173858, -119277, -163195, 82344, 18079, -352534]
9711D69673d70998b19455h1621m6215j03619B46852b33871o9230g9020l01898
9701c80918J40673i6830m10204a1449B880K61457B8542b18679j00596F2681a13004
9689B500N1288a26255j69758k4757A12606b90958B14832a67927P2742d2853A9442
9677G5649c72955J23996P1175g7707A5544a28737B61882L2170j39668f9292C9659
9665B56328a2993k57469J25215r5956M502k8266h4176j12855L1887C17382a18354
9653a21016n451A21544a27681K9649j85733A00899b69272a30715n1099j31856
9643c13670L8161L7711f6136q5088L0689j69279Q5475g6209G3523e2484j11299
9632a63783A29178g9793F3275a54661H1609a48276M4264k44017C3124a31490k9964
$$ y = [469673, -470998, -219455, -81621, -127836, -231455, 246852, -233871, -303101, -79020, -380918, -240245, -96830, -507034, -11449, 2880, 264337, 28542, -218679, -319275, 62681, -113004, 2500, 53788, -126255, -296013, -320770, 112606, -290958, 214832, -167927, -95185, -42853, 19442, 75649, -372955, -248959, -177784, -77707, 15544, -128737, 261882, 294052, 154384, -69292, 39659, 256328, -12993, -270462, -145247, -241203, -236701, -264967, -84176, -197031, -165144, 317382, -118354, -121016, -126467, 121544, -127681, -98032, -283765, 100899, -269272, -130715, -181814, -313670, -275509, -237798, -66136, -151224, -120535, -289814, -204339, -76209, 73523, -52484, -163783, 129178, -79793, 63275, -154661, 81609, -148276, -104012, -348029, 33124, -131490, -161454]
9621a61454A61823c10925a43219I1856b00553E7230a06148j32494g4689B39941
9610B6628L16768I3521C1730J97199b2490l659l9294A7945N1874c00875B06512
9598b02633A0712c1657D9145R509F034b6235l22867a5920A03152J54404F4032
9586a4791j6593l74574i6980A07760b48913J13388k39520d9374J3208k50625A15797
9574A1368a53593O3655E5837c01856J2270J12363j8489A03877b63932a30232j91942
9563c22174f9128O777j3615j66569G9818i0523m3630A07165H486J67600K6874
9552B02960e0347p0223B59842d9872l45911a24451C1657b58574d6036p1313C13869
9540b04563i5551G2775h1532j24009Q7478f169l06573a49351D5991K34482d15901
$$ y = [-161454, 161823, -310925, -143219, 91856, -200553, 57230, -106148, -238642, -74689, 239941, 26628, 343396, 93521, 31730, 228929, -22490, -26149, -65443, 17945, 69819, -300875, 206512, -202633, 10712, -31657, 49145, 58654, 6034, -26235, -349102, -15920, 103152, 257556, 64032, -14791, -31384, -405958, -96980, 107760, -248913, -135525, -375045, -49374, -36166, -286791, 115797, 11368, -153593, -89938, 55837, -301856, -289586, -177223, -195712, 103877, -263932, -130232, -322174, -69128, -62351, -75966, -242535, 79818, -90523, -134153, 107165, 8486, 176086, 202960, -50347, -120570, 259842, -49872, -395783, -124451, 31657, -258574, -46036, -117349, 313869, -204563, -95551, 72775, -81532, -205541, -118063, -6169, -312742, -149351, 45991, 280473, -415901]
9528H8595J6357c421r9715j69477E9214L21433i1601j12364N587A63695e7992
9516a62648E1401L6973A0747c2128a4217B64782m6862a6386m13376a46385k3945
9505a70330C88702b52685A9529b98857G2771c00152R4915j45175A76645J44815
9495C21460e9180A4071b55025i8324A92594b40975A87531h8013E6313h0179k39077
9484c19256J16066G312d89617a12082m3362B7945j990f2793A74118C4988J20677
9473A55665a79422B82878c2339D71803A06760b20795A24967b16442M5820f8435
9462B75869b80419A46823c70314J57339H476i050k7292k6428p8668c2935M515
9451b8420j52987I5175a70284J302l1401P0959m585B29004a3753q8002o4209n3090
$$ y = [88595, 104952, -3421, -103136, -272613, 59214, 380647, -91601, -203965, -198378, 163695, -57992, -162648, 51401, 88374, 10747, -32128, -14217, 264782, 217920, -16386, -429762, -146385, -170330, 388702, -252685, 19529, -298857, 72771, -300152, -205237, -350412, 176645, 321460, -59180, 14071, -255025, -98324, 192594, -240975, 187531, -88013, 56313, -80179, -319256, -203190, 7312, -489617, -112082, -155444, 27945, 25955, -62793, 174118, 34988, 155665, -179422, 282878, -32339, 471803, 106760, -220795, 124967, -216442, -170622, -68435, 275869, -280419, 146823, -370314, -212975, 8476, -9050, -36342, -62770, -141438, -32935, -28420, -181407, 95175, -170284, -168982, -200383, -129424, -134009, 229004, -13753, -101755, -165964, -219054]
9439b19054i6222k1241a5200g000k57403B64906b26364a7912l38531a0866j87566
9428a98432P1683A43184g1758o7229J544A83612q8668e8377j42082P7438K1814
9417a01207A06166c14693J18466M0291M4518j45732d8775a0242A55230D552g6695
9405A95155d402E322b67365P5099k7014I7340N6042b00627F8555c74499i4797
9393a9397A22262g1977o1706A298N8538M5828D4313J2844e2049A13617m0280a10379
9380a8873k80792A14897a84080r0127A6362J80993d3871q713a7568D36894a43276
9368F4203b81523j4882a05627m4360i041B31223a63482K148J8924j59916p8837
9357c81163C6738q761M9801c4737l47236a11278d7155j79430f9061A54795n1387
$$ y = [-219054, -96222, -117463, -15200, -7000, -264403, 264906, -226364, -17912, -356443, -10866, -198432, -126749, 143184, -71758, -138987, -137443, 183612, 94944, -58377, -200459, -123021, -101207, 106166, -314693, -196227, -155936, -111418, -257150, -48775, -10242, 155230, 4552, -76695, 195155, -4402, 5322, -267365, -192266, -219280, 97340, 153382, -200627, 68555, -374499, -94797, -19397, 122262, -71977, -133683, 1298, 59836, 105664, 44313, 57157, -52049, 113617, 73337, -110379, -18873, -299665, 114897, -184080, -274207, 16362, 197355, -43871, -52584, -17568, 436894, -143276, 64203, -281523, -296405, -105627, -149987, -9041, 231223, -163482, -161334, -142410, -302326, -381163, 36738, 27977, 77778, -34737, -381973, -111278, -47155, -226585, -69061, 154795, 103408]
9346A03408a76209Q3333b1017j86905A3659b37286b4221j44064c8943n4225l13690
9335d06858g7815j25404G4677b26914a9844J883n6236A25566a1256j86583i3611
9323g1650B3708J99160K3773M10i9436m5824A71780k9166l3469K70562j42565
9312B37142D6875g4762j49677k13759B52784D0213M6667d405k48195J01628j63118
9301c14090a53771G1132A8535J33373c52055J34433p5291d951r5364l7907e7114
9289c78684A81535G1596l1985J55693b41035j65623a80990I3919a68570D4308
9278B74242m8601h2037L8324j1361p169A75285c28775o2846c2596p7458c7940
9266B39538g8970o3760I6955L39943I9309b43128c8712l01392J56553b4790C16713
$$ y = [103408, -176209, -92876, -21017, -207922, 13659, -237286, -24221, -168285, -38943, -93168, -406858, -77815, -203219, 74677, -226914, -19844, -17961, -74197, 125566, -11256, -197839, -93611, -71650, 23708, 222868, 246641, 247051, -99436, -145260, 171780, 142614, 109145, 379707, 237142, 46875, -74762, -224439, -438198, 252784, 40213, 86880, -4405, -252600, -150972, -314090, -153771, 71132, 18535, 151908, -352055, -217622, -292913, -4951, -100315, -138222, -57114, -378684, 181535, 71596, 39611, 195304, -241035, -406658, -180990, 93919, -168570, 44308, 274242, 225641, -82037, -43713, -55074, -62243, 175285, -328775, -391621, -32596, -110054, -37940, 239538, -78970, -142730, 96955, 436898, 99309, -243128, -38712, -340104, -183551, -24790, 316713]
9254b62661R5452C07187c21282Q9198h5448B5552J98922b02254j2661A63497b84696
9242A84389G5392g6761j86190f5311r5557G26g9117I0900b11163O6640B00914
9230a75952D8874b21023h5226A33544c9826l01879B00733r6369a19793D0617f4754
9218b0687n9745k47681j4991A32828d4708G4258c36212H9716l7192h2532k86250
9207c68782R3561J04266e5599p1722j64921A05898a50070a8857a783j1372C9836
9195b26095J7425L1778A67426a13669A89844i2352k0329C1128J50030i2238k38879
9184c31117a42955k49272N8012a50677D122J29312J31686A31813f9460F6239K23725
9173B89964d9848B10854e4988r948A51263F1479A8458a83620n4284m2126J37572
$$ y = [-262661, -167209, 307187, -321282, -232084, -85448, 25552, 224474, -202254, -214915, 163497, -284696, 184389, 75392, -76761, -262951, -65311, -160868, 726, -79117, 90900, -211163, -144523, 200914, -175952, 48874, -221023, -85226, 133544, -39826, -341705, 200733, 104364, -119793, 40617, -64754, -20687, -80432, -328113, -343104, 132828, -44708, 74258, -336212, 89716, 52524, -82532, -368782, -275221, -170955, -55599, -127321, -292242, 105898, -150070, -18857, -1783, -13155, 39836, -226095, -208670, -176892, 167426, -113669, 189844, -92352, -112681, 31128, 181158, -92238, -331117, -142955, -392227, -334215, -150677, 4122, 133434, 265120, 131813, -69460, 66239, 289964, -49848, 210854, -54988, -64936, 151263, 61479, 18458, -183620, -237904, -280030, -142458]
9162a42458A95179E6229a41042c0102A09510a61815B5213g2740H7373Q0024c24665
9150C12334C3159h2363B976a36441O3009A54628a76030P7076K4146q5365j66663
9139c26836e2138j56051G046b37412M9362A49207e9174A46219b90396a15899k02873
9128c18772L9098B44800F0799a70165g9263A27646a12558D85J89671h4460c0294
9116c002k01585j91446J24370B06737H2402h7903j72737A6396E884Q1032g0398
9104A75810o8752c5902E1623B0947J73736H8581a40639m1222N1825l8748c5267
9092a3082A30320M0457C3283i7399c6875D4256a13872M2876j63722B63985j14608
9081A49377a22949j16060O4971h6000k28452p5727a70511C44467e1600j11149
$$ y = [-142458, 195179, 56229, -141042, -30102, 109510, -161815, 25213, -72740, 87373, 167397, -324665, 312334, 33159, -82363, 2976, -136441, -73432, 154628, -176030, -98954, -74808, -160173, -326836, -52138, -208189, 7046, -237412, -188050, 149207, -59174, 146219, -290396, -115899, -318772, -279674, 244800, 60799, -170165, -79263, 127646, -112558, 485, 190156, -84460, -30294, -3002, -204587, -396033, -271663, 206737, 82402, -87903, -260640, 16396, 5884, 86916, -70398, 175810, 107058, -35902, 51623, 20947, 194683, 88581, -140639, -181861, -130036, -168784, -35267, -13082, 130320, 170777, 33283, -97399, -36875, 44256, -113872, -70996, -234718, 263985, 149377, -122949, -239009, -174038, -86000, -314452, -390179, -170511, 344467, -51600, -162749]
9071a62749n2468e6764K8002j12421f9503A6438a31868D4966d04294a45000A47306
9059b24093j01653a52644k1892B32142G9603a33897k37219I378c04964e90A4258
9047B20054o3220F346q60b55367p6567a11180P284F9219P7580F8895J47541F8388
9034b30n0752l12580d4257l9432L5963F3074a20549j74417A18154h4464q7903
9023a72367c6729C3080P453K38892b7134j42716C5069a1602j21737I1853C9491
9011f1218J5358k2445J4008A15288e6819p5062A0058c4357p7967C09934A19919
8999D1684h9682n4528E5199J48000G102c5767C5418K38478h0279A14006a14917
8987a39550j22047f322A88160b89904a29599m5538r1076f461k67642a23372k65138
$$ y = [-162749, -215217, -56764, -28762, -141183, -69503, 16438, -131868, 44966, -404294, -145000, 147306, -224093, -325746, -152644, -174536, 232142, 79603, -133897, -371116, 9378, -304964, -590, 14258, 220054, 156834, 6346, 5486, -255367, -331934, -111180, -103896, 69219, 146799, 68895, 216436, 68388, -230, -50982, -363562, -44257, -83689, -47726, 63074, -120549, -294966, 118154, -84464, -172367, -36729, 33080, 40533, 279425, -27134, -169850, 35069, -11602, -133339, 91853, 39491, -61218, -45860, -68305, -54297, 115288, -56819, -131881, 10058, -34357, -112324, 309934, 119919, 41684, -89682, -144210, 55199, 203199, 7102, -35767, 35418, 273896, -80279, 114006, -114917, -139550, -261597, -6322, 188160, -289904, -129599, -175137, -266213, -6461, -274103, -123372, -388510]
8976c88510A409K36899l6266n4591J86124b9180j31428A91485J409k6254a99070
8964d1321j83919j9039E3828P5981b17154c6597m078e228l06229J50773B03813
8952c98973A00427a71961j66519J55688k6430h9849a6283G5522b52198H1868e355
8940a6478I5152C9576b01344i8715B48330N0624C8034N1098i417D8893B3518h021
8927I309J24640L30767J169966J130961J935969N547189j1835B309371G83240
8917F43791j02804A39900O9674b27500i2081B192f9040j96058D0742K40776G4305
8905A15770K6716J5353g9863c271l6459j17704f6311m29491J09284a17235n774
8894a23009A4822F241a04586B4376a54302C08264i5999K4286A75203J15016b9169
$$ y = [-388510, 1409, 238308, 202042, 147451, 333575, -29180, -160608, 191485, 192894, 166640, -199070, -41321, -225240, -244279, 53828, 129809, -217154, -36597, -40675, -5228, -311457, -160684, 203813, -398973, 100427, -171961, -338480, -182792, -209222, -89849, -16283, 75522, -252198, 81868, -5355, -16478, 95152, 39576, -201344, -98715, 248330, 298954, 38034, 89132, -9417, 48893, 23518, -8021, 9309, 133949, 464716, 1634682, 2765643, 4701612, 10248801, 10236966, 2309371, 783240, 643791, 540987, 139900, 209574, -227500, -92081, 2192, -69040, -265098, 40742, 281518, 74305, 115770, 142486, 157839, -79863, -3271, -39730, -157434, -66311, -495802, -386518, -117235, -123009, 14822, 6241, -104586, 24376, -154302, 308264, -95999, -71713, 175203, 290219, -29169]
8882d3267j74709G0816a24393G9653h3110j12706P1416c9971j07426B83083E7164
8870C29919A08888b08140I2685B9653K26623D9181a48618p8609A54554g5257j52541
8859b27798j23119a26272C37174h4667D1336q762J38703F979d2465G0495J72737
8848B43232a87941c2816m21012b03423i2009b4216j27025K7022f291A35027N2111
$$ y = [-43267, -217976, 70816, -124393, 79653, -83110, -195816, -124400, -39971, -147397, 283083, 57164, 329919, 108888, -208140, 92685, 29653, 256276, 49181, -148618, -227227, 154554, -75257, -227798, -350917, -126272, 337174, -84667, 41336, 32574, 171277, 6979, -42465, 70495, 243232, -187941, -32816, -453828, -203423, -92009, -24216, -151241, -124219, -6291, 135027, 187138]
$$ [...]
##END NTUPLES=NMR SPECTRUM
##END=
