##TITLE=AC1558_ROEFFECT0017_8269283_Op8BnQrHJG
##JCAMPDX= 6.0         $$ Bruker NMR JCAMP-DX V2.0
##DATA TYPE= NMR SPECTRUM
##DATA CLASS= NTUPLES
##ORIGIN= BRUKER
##OWNER= Administrator
$$ 1.72 TOPSPIN		Version 2.1
$$ 2013-10-12 21:56:38.642 -0700  Administrator@X
$$ Compression mode = diff/dup
##.OBSERVE FREQUENCY= 400.02188249412
##.OBSERVE NUCLEUS= ^1H
##.ACQUISITION MODE= SIMULTANEOUS (DQD)
##.ACQUISITION SCHEME= undefined
##.AVERAGES= 8
##.DIGITISER RES= 22
##SPECTROMETER/DATA SYSTEM= spect
##.PULSE SEQUENCE= zg30
##.SOLVENT NAME= COFFEE_meoh
##.SHIFT REFERENCE= INTERNAL, COFFEE_meoh, 1, 14.98509
##AUDIT TRAIL= $$ (NUMBER, WHEN, WHO, WHERE, PROCESS, VERSION, WHAT)
$$ ##TITLE= Audit trail, TOPSPIN		Version 2.1
$$ ##JCAMPDX= 5.01
$$ ##ORIGIN= Bruker BioSpin GmbH
$$ ##OWNER= Administrator
$$ $$ E:\/data/COFFEE/nmr/AC1558_ROEFFECT0017_8269283_Op8BnQrHJG/10/pdata/1/auditp.txt
$$ ##AUDIT TRAIL=  $$ (NUMBER, WHEN, WHO, WHERE, PROCESS, VERSION, WHAT)
(   1,<2013-10-12 21:56:31.797 -0700>,<Administrator>,<X>,<go>,<TOPSPIN 2.1>,
      <created by zg
	started at 2013-10-12 21:55:25.303 -0700,
	POWCHK enabled, PULCHK disabled,
       configuration hash MD5:
       C8 4E 4E 5D D3 5C D8 9E 9F 52 82 E0 59 8A DE 15
       data hash MD5: 64K
       B0 13 68 C9 49 E8 D6 73 AF 23 E3 B1 B8 CB 29 CD>)
(   2,<2013-10-12 21:56:34.844 -0700>,<Administrator>,<X>,<proc1d>,<TOPSPIN 2.1>,
      <Start of raw data processing
       efp LB = 0 FT_mod = 6 PKNL = 1 PHC0 = 0 PHC1 = 0 SI = 32K 
       data hash MD5: 32K
       8F C6 16 E8 4B 17 31 A3 BF 6B D5 11 4E 4B 52 7C>)
(   3,<2013-10-12 21:56:35.135 -0700>,<Administrator>,<X>,<proc1d>,<TOPSPIN 2.1>,
      <pk PHC0 = 95.38879 PHC1 = 0 
       data hash MD5: 32K
       5E 33 96 2E 39 3F 41 85 E0 1C 69 EB 12 33 77 7E>)
(   4,<2013-10-12 21:56:35.503 -0700>,<Administrator>,<X>,<proc1d>,<TOPSPIN 2.1>,
      <abs ABSG = 1 
       data hash MD5: 32K
       DF 83 08 98 E8 DA 27 9F 4F AA 91 3F 7F 22 9E 98>)
(   5,<2013-10-12 21:56:35.564 -0700>,<Administrator>,<X>,<proc1d>,<TOPSPIN 2.1>,
      <abs ABSG = 2 
       data hash MD5: 32K
       01 A7 25 F9 DC 04 D0 24 9A 45 A0 DA 25 03 7C CA>)
(   6,<2013-10-12 21:56:35.625 -0700>,<Administrator>,<X>,<proc1d>,<TOPSPIN 2.1>,
      <abs ABSG = 3 
       data hash MD5: 32K
       E3 F0 6F 68 03 29 92 85 8E 60 24 79 96 FC 5E 1B>)
(   7,<2013-10-12 21:56:35.671 -0700>,<Administrator>,<X>,<proc1d>,<TOPSPIN 2.1>,
      <abs ABSG = 4 
       data hash MD5: 32K
       77 B9 1F 6D E4 E3 86 99 26 09 33 4D 91 41 59 69>)
(   8,<2013-10-12 21:56:35.732 -0700>,<Administrator>,<X>,<proc1d>,<TOPSPIN 2.1>,
      <abs ABSG = 5 
       data hash MD5: 32K
       04 49 25 3C 7A FF 6E B4 1E 38 D1 25 A8 AC 40 E7>)
$$ ##END=
$$ 
$$ $$ hash MD5
$$ $$ A7 E3 9F D1 5C C1 D3 F2 41 A2 81 D9 CF 28 70 7F
##$RELAX= 
##$RELAX= 
##$RELAX= 
##$RELAX= 
##$RELAX= 
##$RELAX= 
##$RELAX= 
$$ Bruker specific parameters
$$ --------------------------
##$DU= <E:\>
##$EXPNO= 10
$$ [...]
150 150 150 150 150 150 150 150
##$TP07= 0
##$TPNAME0= <>
##$TPNAME1= <>
##$TPNAME2= <>
##$TPNAME3= <>
##$TPNAME4= <>
##$TPNAME5= <>
##$TPNAME6= <>
##$TPNAME7= <>
##$TPOAL= (0..7)
0.5 0.5 0.5 0.5 0.5 0.5 0.5 0.5
##$TPOFFS= (0..7)
0 0 0 0 0 0 0 0
##$TUNHIN= 0
##$TUNHOUT= 0
##$TUNXOUT= 0
##$USERA1= <user>
##$USERA2= <user>
##$USERA3= <user>
##$USERA4= <user>
##$USERA5= <user>
##$V9= 5
##$VALIST= <valist>
##$VCLIST= <CCCCCCCCCCCCCCC>
##$VD= 0
##$VDLIST= <DDDDDDDDDDDDDDD>
##$VPLIST= <PPPPPPPPPPPPPPP>
##$VTLIST= <TTTTTTTTTTTTTTT>
##$WBST= 1024
##$WBSW= 4
##$XGAIN= (0..3)
0 0 0 0
##$XL= 0
##$YL= 0
##$YMAX_a= 590187
##$YMIN_a= -502798
##$ZGOPTNS= <>
##$ZL1= 120
##$ZL2= 120
##$ZL3= 120
##$ZL4= 120
##$ABSF1= 14.98509
##$ABSF2= -5.573092
##$ABSG= 5
##$ABSL= 3
##$ALPHA= 0
##$AQORDER= 0
##$ASSFAC= 0
##$ASSFACI= 0
##$ASSFACX= 0
##$ASSWID= 0
##$AUNMP= <proc_prof1d_extract_pilot.lims>
##$AXLEFT= 0
##$AXNAME= <>
##$AXNUC= <1H>
##$AXRIGHT= 0
##$AXTYPE= 0
##$AXUNIT= <>
##$AZFE= 0.1
##$AZFW= 0.1
##$BCFW= 0
##$BC_mod= 0
##$BYTORDP= 0
##$COROFFS= 0
##$CY= 15
##$DATMOD= 1
##$DC= 0
##$DFILT= <>
##$DTYPP= 0
##$F1P= 0
##$F2P= 0
##$FCOR= 0.5
##$FTSIZE= 32768
##$FT_mod= 6
##$GAMMA= 0
##$GB= 0
##$INTBC= 1
##$INTSCL= 1
##$ISEN= 128
##$LB= 0
##$LEV0= 0
##$LPBIN= 0
##$MAXI= 10000
##$MC2= 0
##$MEAN= 0
##$ME_mod= 0
##$MI= 0
##$NCOEF= 0
##$NC_proc= -8
##$NLEV= 6
##$NOISF1= 0
##$NOISF2= 0
##$NSP= 0
##$NTH_PI= 0
##$NZP= 0
##$OFFSET= 14.98509
##$PC= 1
##$PHC0= 95.38879
##$PHC1= 0
##$PH_mod= 1
##$PKNL= yes
##$PPARMOD= 0
##$PPDIAG= 0
##$PPIPTYP= 0
##$PPMPNUM= 2147483647
##$PPRESOL= 1
##$PSCAL= 4
##$PSIGN= 0
##$PYNMP= <proc.py>
##$REVERSE= no
##$SF= 400.02
##$SI= 32768
##$SIGF1= 0
##$SIGF2= 0
##$SINO= 400
##$SIOLD= 32768
##$SPECTYP= <>
##$SREGLST= <1H.CDCl3>
##$SSB= 0
##$STSI= 32768
##$STSR= 0
##$SW_p= 8223.68421052631
##$SYMM= 0
##$S_DEV= 0
##$TDeff= 65536
##$TDoff= 0
##$TI= <>
##$TILT= no
##$TM1= 0
##$TM2= 0
##$TOPLEV= 0
##$USERP1= <user>
##$USERP2= <user>
##$USERP3= <user>
##$USERP4= <user>
##$USERP5= <user>
##$WDW= 1
##$XDIM= 32768
##$YMAX_p= 445629969
##$YMIN_p= -693245
##$CURPLOT= <Network HP LaserJet P1505>
##$CURPRIN= <$Network HP LaserJet P1505>
##$DFORMAT= <normdp>
##$LAYOUT= <+/1D_H.xwp>
##$LFORMAT= <normlp>
##$PFORMAT= <normpl>
##$SURQMSG= 1
$$ End of Bruker specific parameters
$$ ---------------------------------
##NTUPLES= NMR SPECTRUM
##VAR_NAME=  FREQUENCY,     SPECTRUM/REAL,   SPECTRUM/IMAG
##SYMBOL=    X,             R,               I
##VAR_TYPE=  INDEPENDENT,   DEPENDENT,       DEPENDENT
##VAR_FORM=  AFFN,          ASDF,            ASDF
##VAR_DIM=   32768,         32768,           32768
##UNITS=     HZ,            ARBITRARY UNITS, ARBITRARY UNITS
##FACTOR=    0.250966925370066, 1,           1
##FIRST=     8223.43324360094, -78691,       -42971
##LAST=      0,             -51686,          -105550
##MIN=       0,             -693245,         0
##MAX=       8223.43324360094, 445629969,    0
$$ Real data points
##PAGE= N=1
##DATA TABLE= (X++(R..R)), XYDATA
$$ [...]
19586C5682a88685g9393l4300d6609j10087j70762B76788b16646c1454A96338
19575a38085H0515l9903e682j69588h2964k10783a22968c6836F8656a17998B99781
19563A62365c166A125J69852b1880k10692a04199e0834q1187a4460D4333K697
19552D7030b09414A30732l0006b31951j15056A0695R9013P7246q2879c02154A61413
19540b41181a00968c9352A02094m8483J2566a16876r576p5422g171l3927A12847
19528c07013J01070G1140d01168A25147a47646C8614a40891c0832m2323A24191
19517C77128i243p8653G4816e2474j20507O5092j92491D8615J07669j6277b27428
19505g2579A87255L2090a07708H9823f0367E3441a6624A89168n0494b44336n6125
$$ plain form
19586 35682 -188685 -79393 -113693 -46609 -156696 -327458 276788 -216646 -31454 196338
19575 -138085 80515 40612 -5682 -175270 -82964 -293747 -122968 -36836 68656 -117998 299781
19563 162365 -3166 1125 170977 -21880 -232572 -104199 -50834 -132021 -14460 44333 47030
19552 47030 -209414 130732 100726 -231951 -347007 10695 109708 186954 104075 -302154 161413
19540 -241181 -100968 -39352 102094 53611 66177 -116876 -126452 -201874 -7171 -41098 112847
19528 -307013 -205943 71140 -401168 125147 -147646 38614 -140891 -30832 -73155 124191
19517 377128 -9243 -87896 74816 -52474 -172981 -107889 -300380 48615 156284 140007 -227428
19505 -72579 187255 219345 -107708 89823 -60367 53441 -16624 189168 138674 -244336 -300461
19494c00461R0389A38505e6357A34411g1767H6993a77923n5202D8708j2385L9190
19483G5513j9927g1640G9150a44188H5261N7162B3772b01768F2786a74128a1779
19471A93734a9551r863k69103A26741b89149B19670e4765k19420N3470M9635B0950
19459a90243I051f8995j06214H5326b31611A4084h6929j05799e8311j10402a4258
19447a25445q9890l0606c4317r6309e265k44579I8631c24787A62577d7752l82306
19436d30058J78749I239a61009L4059l8681c2757k78029D1157a26402I9928a0219
19424A10992K3098b5357Q667r6983B35924f5867A64447C6430c41350a04091B69844
19412a96754B56443g8947m479N522J8665B8570a29712I1032b08713b1293j33774
$$ plain form
19494 -300461 -210072 138505 -56357 134411 -71767 86993 -177923 -233125 48708 36323 75513
19483 75513 55586 -71640 79150 -144188 85261 142423 23772 -201768 62786 -174128 -11779
19471 193734 -19551 -29414 -298517 126741 -289149 219670 -54765 -274185 -220715 -171080 20950
19459 -190243 9051 -68995 -175209 85326 -231611 14084 -86929 -192728 -58311 -168713 -14258
19447 -125445 -215335 -245941 -34317 -130626 -5265 -249844 98631 -324787 162577 -47752 -430058
19436 -430058 -251309 9239 -161009 -126950 -165631 -32757 -310786 41157 -126402 99928 -10219
19424 110992 134090 -25357 -16690 -113673 235924 -65867 164447 36430 -341350 -104091 269844
19412 -196754 256443 -78947 -83426 -77904 -59239 28570 -129712 91032 -208713 -21293 -155067
19401a55067A48890o6243i3342j40631j70838E8789L9736a76433A77267b82058
19390D6181b40931j25278c2217k33189A37030j4968q310c02321l5986e6760n8194
19379a14954l1133A36015b63622p9353e808o1055B68138g672m5670H5055c00908
19367g3971D4354J21440d62948h9694B37053A03256k7211a6646B97336H3217a97725
19355C13789a63175B60896a17422j65307A5010N2796Q2066n3954m0407A8696J3310
19344C2006c28170E9254d8193l074r0698o814l00873b03731j13766n3063d2082
19332a85084f8751k16883J06560j56851B12595a22077M6950b1326l32776A27458
19321c54614A0301K07971h2018d929C2617h4691E2365J74161c86254I2956k5589
$$ plain form
19401 -155067 148890 82647 -93342 -233973 -404811 58789 98525 -176433 177267 -282058
19390 46181 -240931 -366209 -32217 -265406 137030 122062 113752 -302321 -338307 -56760 -114954
19379 -114954 -146087 136015 -263622 -342975 -5808 -66863 268138 -7672 -53342 85055 -300908
19367 -73971 44354 165794 -462948 -89694 237053 103256 76045 -16646 297336 83217 -197725
19355 313789 -163175 260896 -117422 -282729 15010 67806 149872 95918 55511 18696 32006
19344 32006 -328170 59254 -48193 -51267 -141965 -148779 -449652 -203731 -317497 -370560 -42082
19332 -185084 -68751 -285634 -179074 -335925 212595 -122077 -75127 -21326 -354102 127458
19321 -354614 10301 218272 -82018 -4929 32617 -84691 52365 226526 -386254 92956 67367
19310F7367a06109j41318a5333B11141e21685c7609A66931l0684A6250b03493
19299f2473k69340B27275G3712b34453C43015i5906C7619e1817A9834K00130K448
19288B22412r4001d59118J47764A09650g3045B26712b95486J10543A28217a10407
19277B20165j0219H505b32005a0255B48255D9366e2081k9188A12317i3514K769
19266i0745c5757j42344D1008a14107j68313A21211b0160q313j74402A0093b56878
19254B03377a99553J1346P4745H7565l210a84895j68626a60326F9335a18983c4855
19242d69970b14130R8938a3338G4265R9811k5561b62037h276j67410r4140a5572
19230a89220j8034n9269F4917j9048Q100J16400F4537A1483Q8550b72592g9765
$$ plain form
19310 67367 -106109 -247427 -15333 211141 -521685 -37609 166931 136247 16250 -203493
19299 -62473 -331813 227275 73712 -234453 343015 -95906 37619 -51817 19834 219964 222412
19288 222412 128411 -459118 -311354 109650 -73045 226712 -295486 -184943 128217 -110407
19277 220165 209946 8505 -232005 -10255 248255 49366 -52081 -81269 112317 -93514 -90745
19266 -90745 -35757 -178101 41008 -114107 -282420 121211 -20160 -28473 -202875 10093 -256878
19254 203377 -199553 -188207 -113462 87565 84355 -184895 -353521 -160326 69335 -118983 -34855
19242 -469970 -214130 -115192 -13338 74265 174076 148515 -262037 -8276 -175686 -269826 -15572
19230 -189220 -207254 -266523 64917 45869 53969 170369 64537 11483 100033 -272592 -79765
19218h3018G8887k1676J45316e79436a98173j21294A3804K88382a72748B9468
19207c01893a11013A47979c63249E2416a71387j95730c3839B39252a53814d0490
19196f7901I4071b30123C88268a93733A6038L6205a94468A28366i5414j9607E8598
19184b07549B94422b46376G7526g0427A46281E496a4133k91144e2172d354k12024
19173b16378C29015A56648b4592q1126o5733Q1068C1732a55537m1791G9683A5611
19161a22372n5980A43267c64225d1968j92659E3727a22601l08727J12619f5490
19150g5937q307j15498c262F7537n153J06492c1218j59241A12281O2684b73325
19138E6327J25124D5868A4922a67437k6924j8453A38156Q049a7339D9449c02595
$$ plain form
19218 -83018 78887 57211 202527 -579436 -198173 -319467 13804 302186 -172748 29468
19207 -301893 -111013 147979 -363249 52416 -171387 -367117 -33839 239252 -153814 -40490
19196 -67901 94071 -230123 388268 -193733 16038 52243 -194468 128366 -95414 -115021 58598
19184 -207549 294422 -246376 77526 -70427 146281 5496 -14133 -305277 -52172 -4354 -216378
19173 -216378 329015 156648 -24592 -105718 -171451 -90383 31732 -155537 -197328 79683 15611
19161 -122372 -178352 143267 -364225 -41968 -234627 53727 -122601 -431328 -318709 -65490
19150 -75937 -84244 -199742 -3262 67537 62384 168876 -31218 -190459 112281 174965 -273325
19138 56327 181451 45868 14922 -167437 -194361 -212814 138156 146205 -17339 49449 -302595
19126b16354a00255F5383J58251G9262K2912K06241a16257G0668P076J82762I8279
19114A03068n0194e2033c415j70531i401E195a14184N4661J8627E1842b72376
19102C1373N9548c52539A8223O2599e1864b4029D737b34072h0912j41884i7191
19090a17296L7133B5885J56283c68405J82203A84265J3009D8228e8655k0533n3777
19079a32965d312C8412Q6409g6372G431i4286k0577o4814Q8029c9036D0654a97806
19066c02168A4594a13596B00223c6177A48222P1231d2668k972B12348c8424j11407
19055a49831j12394J29166j41348h9790G1078c3072q0579A2772b19944K4072f537
19043F743J17884c5124A61268b08782b4640B12544b08624J2639O4366A45512l3746
$$ plain form
19126 -216354 -100255 65383 223634 79262 102174 308415 -116257 70668 77744 260506 98279
19114 103068 52874 -52033 -3415 -173946 -9401 5195 -114184 -59523 -40896 51842 -272376
19102 31373 90921 -352539 18223 80822 -51864 -24029 4737 -234072 -80912 -222796 -97191
19090 -117296 -80163 25885 182168 -368405 -186202 184265 197274 48228 -58655 -79188 -132965
19079 -132965 -4312 38412 124821 -76372 7431 -94286 -114863 -179677 -91648 -39036 40654 -197806
19066 -302168 14594 -113596 200223 -36177 148222 219453 -42668 -45640 212348 -38424 -149831
19055 -149831 -262225 -133059 -274407 -89790 71078 -33072 -113651 12772 -219944 -195872 -6537
19043 6743 124627 -35124 161268 -208782 -24640 212544 -208624 -195985 -131619 145512 111766
19032A11766b70713C3757J25819h8165H1260d4851A42506k3822C1266R927K604
19021D3797k816i0047M701C7256E800J64163a50523A53625a60191A47340a8351
19009A11000D1142J4465b12871j54276h60j27905p7813d6697k53983I5789d9106
18997D9260a21109p5890O4537o0747Q0176b1291G9460e9584b7174j27130j47372
18986c01676A18801k2115l3008e6366j32061A55024d11887A46262F0939b1586
18975A45601B7035P8706a07431B97493a18396G5752g5129K4543j6278j24208j18924
18964c09996B6182h0180k15664B60185M8627A39519a36422e3610l59058a6657
18953a29885A2353e6511r8828k0523G2506c332j05827b8009j90059C08223c55477
$$ plain form
19032 111766 -270713 33757 159576 -88165 81260 -44851 142506 118684 31266 41193 43797
19021 43797 40981 -90047 -85346 37256 5800 169963 -150523 153625 -160191 147340 -18351
19009 111000 41142 55607 -212871 -367147 -860 -128765 -206578 -46697 -300680 95789 -49106
18997 49260 -121109 -196999 -132462 -193209 -113033 -21291 79460 -59584 -27174 -154304 -301676
18986 -301676 118801 96686 63678 -56366 -188427 155024 -411887 146262 60939 -21586
18975 145601 27035 105741 -107431 297493 -118396 75752 -75129 -50586 -66864 -191072 -309996
18964 -309996 26182 -80180 -295844 260185 308812 139519 -136422 -53610 -412668 -16657
18953 -129885 12353 -56511 -155339 -175862 72506 -3332 -109159 -28009 -218068 308223 -355477
18941b68357j68628B03116B3728d06658A02170a94513F7493B1518J51482A5344
18930f5472o590r3636A962h70k5753B3465J34949o9223K0202f0010B25253a5717
18917F688g1912B480a54345m4592N363N1257B16419g3955r4429j00762f1951a0750
18904d4079B32296c99735B26238A07840J87182j20175l5738c15797g1255A34913
18893b14939E2934K54448d5024j32569C2880r907O8371K04929E9713a2394H1021
18881A2845a77151b4310j44707G6158b27l14527g9892B03379A8591b21626B92033
18869f6968n5673L2209G0969J70901a71421K4628p0943j46863J31030A84405b19007
18857e4554A47048a13583H9879J15115b34724B2922b25727c0621C52860A52665
$$ plain form
18941 -268357 -436985 203116 23728 -406658 102170 -194513 67493 21518 173000 15344
18930 -65472 -72062 -165698 1962 -870 -26623 23465 158414 89191 109393 -60010 225253 -15717
18917 6688 -71912 2480 -154345 -198937 -193574 -142317 216419 -73955 -168384 -269146 -61951 -10750
18904 -44079 232296 -399735 226238 107840 295022 174847 139109 -315797 -71255 134913
18893 -214939 52934 307382 -45024 -177593 32880 22973 91344 296273 59713 -12394 81021
18881 12845 -177151 -24310 -169017 76158 -227 -314754 -79892 203379 18591 -221626 292033
18869 -66968 -122641 -90432 70969 241870 -171421 -146793 -217736 -364599 -233569 184405 -219007
18857 -54554 147048 -113583 89879 204994 -234724 22922 -225727 -30621 352860 152665
18846a35578D9835d31447K01800C00019n3143c7329r0975N7040m9843D4244b28594
18834B36101C9489N4888f650j45630j35665J03971k83721E1368a16564j44182
18824b60746B7176c60626B35078h4812j97905A72736J11612r3928B7283i8194
18813A49994C47b5495A98142M1957A9474b06569A11794l3313i549A77141a0529
18801d3886H6231a57738I6235e7397E2401a18953A8699J40831b2303A96372a4231
18789i7275B55602c77621b4049j21025a0439k42313E5140b11970g4934l6258K2262
18778h8930m2905f5462D4158b0272j12843O4282A98726a10450L9594e787r5665
18767a01452o1599h690k09776H0104c66388C9316a5863j22808A10055B3615i763
$$ plain form
18846 -135578 49835 -431447 -229647 300019 246876 -37329 -128304 -71264 -121107 44244 -228594
18834 236101 39489 94377 -6650 -152280 -287945 -183974 -467695 51368 -116564 -260746
18824 -260746 27176 -360626 235078 -84812 -282717 172736 284348 190420 27283 -98194
18813 149994 347 -25495 198142 240099 19474 -206569 111794 78481 -9549 177141 -10529
18801 -43886 86231 -157738 96235 -57397 52401 -118953 18699 159530 -22303 196372 -14231
18789 -97275 255602 -377621 -24049 -145074 -10439 -252752 55140 -211970 -74934 -111192 -88930
18778 -88930 -131835 -65462 44158 -20272 -133115 -68833 198726 -110450 -70856 -5787 -101452
18767 -101452 -163051 -8690 -218466 80104 -366388 39316 -15863 -138671 110055 23615 -9763
18755A58294l8172a21281M1657l28876C1385b07139J0730G9292f5015b4920A30548
18743A42484i2816A38569d8402r4985A76433b06102O8380P900A8813K7288A941
18731a44198b7178A4376K3996M7941b64953J08879P2187L6385l6242L0828i085
18719H4036a3548B35136I5997J01385c55497A5706a40896b3281k924B13802o0632
18708A53170b73225a17767A88746b64190F3147a66239A51506A2416a82348O6455
18698a15893D28405j38718G9654R0619n3782d1672B58784e3344m44819C12909
18687e8250k15303L9172J16524E2394b90452A40763m6817b9724j99493A80831
18676A19468B3089a56733A7977J4452P3357a37859A28836m9637b31694G0181a30540
$$ plain form
18755 158294 120122 -121281 -79624 -408500 31385 -207139 -196409 79292 -65015 -24920 130548
18743 142484 -92816 138569 -48402 -143387 176433 -206102 -137722 -129822 18813 46101 1941
18731 -144198 -27178 14376 38372 86313 -264953 -156074 -83887 -47502 -83744 -52916 -9085
18719 84036 -13548 235136 95997 197382 -355497 15706 -140896 -23281 -26205 213802 153170
18708 153170 -273225 -117767 188746 -264190 63147 -166239 151506 12416 -182348 -115893
18698 -115893 428405 289687 79654 170273 116491 -41672 258784 -53344 -498163 312909
18687 -58250 -273553 -234381 -117857 52394 -290452 140763 93946 -29724 -229217 180831
18676 119468 23089 -156733 17977 32429 105786 -137859 128836 79199 -231694 70181 -130540
18664e23667D48J2018K17630h7378G64K07385b38074j25697i1214B84505j06243
18653A78262a67004C508a48139j66061B18251d8686B72612M0772g4724O100C13780
18641b85771q6601D0367K17603c04105g5008A975Q993a35141A34469b56415C3594
18629E4509a26294l83773K05934D2457a0364l1647D507f7370j90696A38666A9117
18617E3225a36185N5909B35234d5113j6660c0339E9349c72271E4937c65778i2554
18605H153d1362A69745g777q5436B00725b9929o7438G0898b40581K5721k7602
18594b42462c6286C44184G1545f2758k60144d5301G2702D727b58032k4859J512
18583b81379c9016A69935i9593m0587k4830d1534j50955A6408c05567G9310g627
$$ plain form
18664 -523667 448 12466 230096 -87378 764 208149 -238074 -363771 -91214 284505 178262
18653 178262 -167004 3508 -148139 -314200 218251 -48686 272612 313384 -74724 -68624 313780
18641 -285771 -372372 40367 257970 -304105 -75008 1975 10968 -135141 134469 -256415 33594
18629 54509 -126294 -510067 -304133 42457 -10364 -42011 4507 -67370 -258066 138666 19117
18617 53225 -136185 -80276 235234 -45113 -61773 -30339 59349 -372271 54937 -365778 -92554
18605 8153 -41362 169745 -7777 -93213 200725 -29929 -97367 70898 -240581 -214860 -242462
18594 -242462 -36286 344184 71545 -62758 -322902 -45301 72702 4727 -258032 -282891 -281379
18583 -281379 -39016 169935 -99593 -140180 -165010 -41534 -192489 16408 -305567 79310 -7627
18571f0620p4388G5168h008j59292O5494B95789n512a33455H8335c3899m27716
18560d61615A90535b24299o3882H1869J99516e3599b6176k54568E02846b47940
18549a12962M310N744J3332A38141B7997a93045f7835C38783d9766F6610b9735
18537E1600J30382a96313M9511J031E0878J31599a13013G6060e6008k6489B14238
18525F8851a27032B84198c24413R2631L7302K5137D5729d07194B0156e3323C91985
18513i7920k02330P0488b5622k63910o248a33163e6874H1817c27137A23182K1277
18502A44459C5572b79345b4047m9359j05j8843A91133E0280R9372n0672a42381
18490c68240e69A58567f04725G947c15796g8665A77666b0246C53704c23218O7870
$$ plain form
18571 -60620 -135008 75168 -8008 -167300 -101806 295789 290277 -133455 88335 -33899 -461615
18560 -461615 190535 -224299 -288181 81869 281385 -53599 -26176 -280744 502846 -247940
18549 -112962 -108652 -102908 -89576 138141 27997 -193045 -67835 338783 -49766 66610 -29735
18537 51600 181982 -196313 -146802 -145771 50878 182477 -113013 76060 -56008 -82497 214238
18525 68851 -127032 284198 -324413 -231782 -194480 -169343 45729 -407194 20156 -53323 391985
18513 -97920 -300250 -229762 -25622 -289532 -295780 -133163 -56874 81817 -327137 123182 144459
18502 144459 35572 -279345 -24047 -73406 -73511 -92354 191133 50280 149652 98980 -142381
18490 -368240 -569 158567 -604725 7947 -315796 -78665 177666 -20246 353704 -323218 -255348
18479b55348R5087O551H1238b48258b3698k05647b1537R468k56074b0222k50803
18468b71025B19701a45859C1630Q937q032a47880K6548E0845e6663D6711b45616
18456A14673a7472j13807B8978P7497r819C9088K51577G4860C5784f4919m07417
18445d72336H6902a88888p2314F2845b98667J06472n6390D7724c56458A06108
18434a01253A02018b44263j4846E1047L6040O3602e11466C8637a87588D7803c02936
18422d5048A06208a76029G0679f077E4615B203a84450e6117B81147d8183B14521
18410b58755B23804g6373B78976P9045g5173D4281g3436I8073b46471a9311r0371
18399a09682C5082b61039m838j19936J69222B04345o8286J44646A25038c8099
$$ plain form
18479 -255348 -160261 -153710 81238 -248258 -23698 -229345 -21537 -12069 -268143 -20222 -271025
18468 -271025 219701 -145859 31630 40567 32535 -147880 -121332 50845 -56663 46711 -245616
18456 114673 -17472 -131279 28978 106475 96656 39088 290665 74860 35784 -64919 -472336
18445 -472336 86902 -188888 -261202 62845 -298667 -192195 -248585 47724 -356458 106108
18434 -101253 102018 -244263 -259109 51047 87087 150689 -511466 38637 -187588 47803 -302936
18422 -45048 106208 -176029 70679 -6077 54615 2203 -184450 -56117 281147 -48183 214521
18410 -258755 223804 -76373 278976 358021 -75173 44281 -73436 98073 -246471 -19311 -109682
18399 -109682 35082 -261039 -265877 -385813 -216591 204345 136059 280705 125038 -38099
18388B21931J31673f550H3560l8708c06363R7182B99611b84735e8628P655C05546
18376d7497k39850A03604b11804C2365b25475A20781k045L6503G7274d50506A81942
18364a25343L7267C31664a5072j63198g9165j20719g1638q9590A7194N8770J81717
18353B57681A6388e0588j56175N5845G1735J71199C9859A7538g1620a1134j33610
18342a44744K1088j12987A89403J03002b77936H4374B6290M4327i8351B5356c66539
18330A07501a65886C9214P9613g7513J1849k0453L502B48619D8432J20447l0546
18319A38333i649k58602I6056B4026j0374B094J78689l4001c15182F511e5279
18307A1008b21339e3792F9788a9811o0322l8418N3539j32363d4676j16434A14155
$$ plain form
18388 221931 353604 -6550 83560 44852 -306363 -209181 299611 -284735 -58628 -50973 305546
18376 -47497 -287347 103604 -211804 32365 -225475 120781 118736 155239 77274 -450506 181942
18364 -125343 -88076 331664 -15072 -178270 -79165 -199884 -71638 -161228 17194 75964 257681
18353 257681 16388 -50588 -206763 -150918 71735 242934 39859 17538 -71620 -11134 -144744
18342 -144744 -123656 -236643 189403 292405 -277936 84374 26290 70617 -98351 25356 -366539
18330 107501 -165886 39214 118827 -77513 -65664 -86117 -82615 248619 48432 168879 138333
18319 138333 -9649 -268251 96056 24026 13652 2094 180783 146782 -315182 6511 -55279
18307 11008 -221339 -53792 69788 -19811 -80133 -118551 -65012 -197375 -44676 -161110 114155
18295A8750J12372K1321j4770a48470A34668a42382B24491D6112b94794B12268
18284a55396j38824C11657a17315j693B09170a58770j0744k12397i0020G7302
18273G0858i0360j24735F851J63296d54994a52640C27185f1025j86571a15186
18262A09358c44911B15392h1362a4327j73222Q8895j31518a7114F3797b8095b867
18250A75166b84103R2773A18530b82984B77532d2849Q122H7498J06829q9941a27874
18238B56942b05867C1388K31555n3895a25171k35387A52202g5249A52295a59904
18227d1975j80513B05422q8102a84832H7377A8065b39779b9112j6495m5256F8889
18215b12468b5032n87510a53474b2227j80195a4526j32419C0813a53340f2063
$$ plain form
18295 18750 131122 152443 137673 -148470 134668 -142382 224491 46112 -294794 212268
18284 -155396 -294220 311657 -117315 -119008 209170 -158770 -169514 -381911 -90020 77302
18273 70858 -90360 -215095 6851 170147 -454994 -152640 327185 -61025 -247596 -115186
18262 109358 -344911 215392 -81362 -14327 -187549 -98654 -230172 -17114 63797 -28095 -2867
18250 175166 -284103 -191330 118530 -282984 277532 -42849 -34727 87498 194327 104386 -127874
18238 256942 -205867 31388 262943 209048 -125171 -360558 152202 -75249 152295 -159904
18227 -41975 -222488 205422 117320 -184832 87377 18065 -239779 -29112 -45607 -90863 68889
18215 -212468 -25032 -612542 -153474 -22227 -202422 -14526 -146945 30813 -153340 -62063
18204b54332A36643C5762K6970j0130b08902d3349m35067b09012I9083b39984
18193b99059C9742b9644k27545A0804J37216L6695a60468L8459N5008p0094D9463
18181A47741a89k44631A62450c8250g622k93542b2471j54773B0664e1158j08076
18170a59234g4944H3293b04259A1422d7495D3683K77857g153k65750B16203a46774
18158C74848b4092A02819a1225l41208A46293B004a16177A99272a38346A87188
18147I400a4013j28913j55447a19287k05907L6704A44536b38802C32035A05216
18136A05803c43332f6757A78408G4647a80054A32048l8855a06986M1338k75635
18126c41283e0118A64218k48a5229f709B25692a20826d3343G2627N6587p017B4451
$$ plain form
18204 -254332 136643 35762 62732 52602 -208902 -43349 -478416 -209012 99083 -239984
18193 -299059 39742 -29644 -257189 10804 148020 184715 -160468 -122009 -67001 -137095 49463
18181 147741 -189 -244820 162450 -38250 -7622 -301164 -22471 -177244 20664 -51158 -159234
18170 -159234 -74944 83293 -204259 11422 -47495 43683 321540 -7153 -272903 216203 -146774
18158 374848 -24092 102819 -11225 -352433 146293 2004 -116177 199272 -138346 187188
18147 9400 -14013 -142926 -298373 -119287 -325194 -288490 144536 -238802 332035 105216
18136 105803 -343332 -66757 178408 74647 -180054 132048 93193 -106986 -65648 -341283
18126 -341283 -50118 164218 163970 -15229 -6709 225692 -120826 -43343 72627 129214 122197 24451
18113a67631L6645b2132O813G2420a89374B747P6209b3083B7176b02543h1927
18101D855h5187j60504a5961j22099J7784d8713K2134B03627F5412i5110c7092
18089E856b23087J6198d0051A06131b64913J06684B28678g2688H5151d2628A30937
18077C36762a85874q2465O6444j22097K7107P3315a3789j46270c0652D3996i0932
18065b01214g8176A38659D6183c04184B242e4094B85421j26176a55796k76756
18055d32552h872C2030J23399n8037C8586J3522a96218F3809b031j39851A0085
18043I2840J14010A2106a25583M6085o5782A23155a86390d2423k16610B5972R8043
18032A24015a64401n1160B38472i3674k28932A0763b85285F6753i4431E10163
$$ plain form
18113 -167631 -130986 -22132 -15319 72420 -189374 2747 78956 -23083 27176 -202543 -81927
18101 4855 -85187 -245691 -15961 -138060 -120276 -48713 -26579 203627 65412 -95110 -37092
18089 5856 -223087 -206889 -40051 106131 -264913 -158229 228678 -72688 85151 -42628 130937
18077 336762 -185874 -268339 -201895 -323992 -296885 -223570 -13789 -160059 -30652 43996 -90932
18065 -201214 -78176 138659 46183 -304184 2242 -54094 285421 159245 -155796 -432552
18055 -432552 -8872 32030 155429 97392 38586 52108 -196218 63809 -2031 -141882 10085
18043 92840 206850 12106 -125583 -79498 -145280 123155 -186390 -42423 -259033 25972 124015
18032 124015 -164401 -215561 238472 -93674 -322606 10763 -285285 66753 -94431 510163
18021B17798I2597A7229K43438c80335B45468H6544i1192q5528B2559i8567B3242
18009a32396p5801f7421l8898B099f865k95738G9744B5799K06410a59021j933
17998a60954j08599j4290A82590f9653k33339B238J08701J01703k4760a589q1439
17987h3028b5307m0563B35311c4205A23553l2941J43224P4210d7901o3926L3100
17976g8727K3290K4742A38029o5854a32303A65146b42374A33263a85643B02816
17965a18853L3747a4346k17373d3413a4096l79105b6033k33051A1483a11334k45376
17954c56710j24183B36857b58987a3174I7209a47879j15617g3331n5525A02691
17943F7022a42540f1097m3095C8301b22262j46816C9748J71420j1505a89115j11994
$$ plain form
18021 217798 92597 17229 260667 -380335 245468 86544 -91192 -176720 22559 -98567 23242
18009 -132396 -208197 -67421 -106319 2099 -6865 -302603 79744 25799 232209 -159021 -160954
17998 -160954 -269553 -283843 182590 -69653 -302992 2238 110939 212642 187882 -1589 -83028
17987 -83028 -25307 -65870 235311 -34205 123553 90612 233836 308046 -47901 -111827 -78727
17976 -78727 -55437 -30695 138029 72175 -132303 165146 -242374 133263 -185643 202816
17965 -118853 -85106 -14346 -231719 -43413 -14096 -393201 -26033 -259084 11483 -111334 -356710
17954 -356710 -480893 236857 -258987 -13174 97209 -147879 -263496 -73331 -128856 102691
17943 67022 -142540 -61097 -104192 38301 -222262 -369078 39748 211168 199663 -189115 -301109
17932c01109a47891L4740j39331F6814a7641j00823A15857K11006b3583p1038
17922i4621J2117j57658a9258j54833A1004e0742A28238D508i5794k9767a0886
17910C16575A44964P4538a47874A19717a62190J9471f9862L2915D4241e976o804
17899a2780q798p3882l1579a875A13444a0037C08180i5705G0262J8018B8855f8982
17886a29596j5684A16506b03000P8213r9064B64066i959B6796K66003F2971i8268
17874b60556B15991n9213D9979e4301Q716H1392k7683J91560a64347Q2048B05479
17862d3311p7420d411A93294L5190J4549l1242i0791I8276a12157A02464a25534
17850b8889r7971a5304B6712A1277e5320B51973a97061G4655k0658a07097b1265
$$ plain form
17932 -301109 -147891 -113151 -252482 66814 -17641 -118464 115857 326863 -23583 -94621
17922 -94621 -82504 -240162 -19258 -174091 11004 -50742 128238 4508 -95794 -125561 -10886
17910 316575 144964 219502 -147874 119717 -162190 -142719 -69862 -36947 44241 -5976 -12780
17899 -12780 -21578 -95460 -127039 -1875 113444 -10037 308180 -95705 70262 88280 28855 -68982
17886 -129596 -145280 116506 -203000 -124787 -223851 264066 -9959 26796 292799 62971 -98268
17874 -260556 215991 156778 49979 -54301 -45585 81392 53709 245269 -164347 -82299 205479
17862 -43311 -120731 -4411 193294 228484 243033 211791 -90791 98276 -112157 102464 -125534
17850 -28889 -126860 -15304 26712 11277 -55320 251973 -197061 74655 53997 -107097 -21265
17838b25525C5367G716h010C8718j1990e5105j92437H4088L21792G1274J70012
17827B41286a5054A73707D0649a17260j9873K423o9545H6707a10427E5975c88278
17815b20045K6876A37221A0724h8427j46395A65857a47535r1193F38109c22567
17804G4422a5250m8163A83355a82981A81550d5490D0963a82436A11015b60248
17793h2194B5035K82883e34j78977e3926K5928k28753F1730N8720R199h3799d0579
17780D79673a75309D8695l643a28524J5605A42853K1825a50339B1503d9310A82249
17768A02269k1058f2103j4337H2629f7197j67178A29513M9129c0967A96725H4190
17756H5315J8817a34548O1166E1610a49247k4422m5623B02032n250O3531Q144
$$ plain form
17838 -225525 35367 7716 -8010 38718 26728 -55105 -247542 84088 405880 71274 241286
17827 241286 -15054 173707 40649 -117260 -137133 -134710 -204255 86707 -110427 55975 -388278
17815 -220045 -193169 137221 10724 -88427 -234822 165857 -147535 -238728 638109 -322567
17804 74422 -15250 -63413 183355 -182981 181550 -45490 40963 -182436 111015 -260248
17793 -82194 25035 307918 -534 -179511 -53926 -27998 -256751 61730 120450 129649 -83799 -40579
17780 479673 -175309 48695 45052 -128524 -112919 142853 164678 -150339 21503 -49310 182249
17768 102269 81211 -62103 -76440 82629 -67197 -234375 129513 178642 -30967 196725 84190
17756 85315 104132 -134548 -73382 51610 -149247 -173669 -219292 202032 196782 260313 268457
17745B68457a09534r0224k5511B43435d606C7710O2992h541k11967A36702O1073
17734A97775R13b76042a01098n209r9556f3174j66258R8897A11832b70637m2680
17723c13317A684K2459J47281B9799b0835H2037a40371A00502A2984e2321j41597
17712a93918r4894a12159l3841I4526K56409b48492c415m49527d460k19588B91100
17700c2201C2167h0432r3540J9305H935J18342K20138a84565B31767E8627L323
17689F1950L1415e3881A95495l3736b5356A45835h929j18801C61002j60075b53296
17677e6426E5875B3305N1179g6293J7107k28250A86421k2927C2813b34355j793
17666b36148c8183G0091J45677J07267D4436J47977a90836A12176B4053b44288
$$ plain form
17745 268457 -109534 -199758 -225269 243435 -4606 37710 100702 -8541 -220508 136702 197775
17734 197775 198688 -276042 -101098 -106307 -205863 -63174 -229432 -130535 111832 -270637 -313317
17723 -313317 1684 24143 171424 29799 -20835 82037 -140371 100502 12984 -52321 -193918
17712 -193918 -288812 -112159 -146000 94526 350935 -248492 -3415 -452942 -4460 -224048 291100
17700 -32201 32167 -80432 -173972 -154667 8935 127277 347415 -184565 231767 58627 61950
17689 61950 93365 -53881 195495 161759 -25356 145835 -8929 -127730 361002 200927 -253296
17677 -56426 55875 23305 74484 -76293 -59186 -287436 186421 163494 32813 -234355 -236148
17666 -236148 -38183 70091 215768 323035 44436 192413 -190836 112176 24053 -244288
17655b29313A95068a92777O3886K1759b0112A45404c4442l3546F5820K5115b20326
17643B18129C1579O3586a38496D6338d16223B9307a00097B1494J74864N4405b2644
17631B33900f7980C2409I533J88841r6522i060j6667o2054r285j06767E1525n470
17619D6055a9820F37J36002E0828d4245a1340k24048d893j26466A14467b58209
17607E9380F37J82192f8024A3072g8591b0003D7647K1444K54643j19444a71802
17595A99911a97126A5493i291B4192c31261A33328b25876M6920C31477C3687J21459
17584A55146d57993A36680b56326E6866a878G3755i3822B64445I5718l4831k382
17573E8505b7764A97547l9983a64573H3746R8491g9324A11887J84764D8169N8485
$$ plain form
17655 -229313 195068 -192777 -128891 -107132 -20112 145404 -34442 -67988 65820 90935 -220326
17643 218129 31579 95165 -138496 46338 -416223 29307 -100097 21494 196358 250763 -22644
17631 233900 -67980 32409 9533 198374 101852 -9060 -25727 -87781 -97066 -203833 51525 46055
17619 46055 -19820 637 136639 50828 -44245 -11340 -235388 -4893 -131359 114467 -258209
17607 59380 637 182829 -68024 13072 -78591 -20003 47647 69091 323734 204290 -171802
17595 199911 -197126 15493 -9291 24192 -331261 133328 -225876 -178956 331477 33687 155146
17584 155146 -457993 136680 -256326 56866 -1878 73755 -93822 264445 95718 60887 58505
17573 58505 -27764 197547 157564 -164573 83746 182237 -79324 111887 296651 48169 106654
17562A06654a07807A6586J16785d293A7373b902m8120j44247I7774i7948A72360
17550g025D0254A1231b59092C4061C745a98903c1588k97574A60927a24928B32148
17538a83304j93899C2350J27866c27182g5416F5016a44325m7230B26615a46621
17527C56635A67532J25622c3190k60729c5163C43759H660i0359k98791B66257
17516A36205m0606F202O0650a4417o4762A8675a12783D18077C979i4575B91090
17504C47304c96159B11283a387k69764C68415a34199k604A60921K2367G1737N2242
17493A23979a37090O7941A79395a02906E96133a67592D01161r6531A4982M667
17483A9649J85549B2086g7201k73010a43537A00621J23545D5731a18792C3185
$$ plain form
17562 106654 -107807 16586 133371 -4293 17373 -2902 -51022 -195269 97774 -97948 172360
17550 -7025 40254 11231 -259092 34061 3745 -198903 -31588 -329162 160927 -124928 232148
17538 -183304 -377203 32350 160216 -327182 -75416 65016 -144325 -191555 226615 -146621
17527 356635 167532 293154 -33190 -293919 -35163 343759 8660 -90359 -389150 266257
17516 136205 95599 6202 66852 -14417 -79179 18675 -112783 418077 3979 -94575 291090
17504 347304 -396159 211283 -1387 -271151 368415 -134199 -136803 160921 183288 71737 123979
17493 123979 -137090 -69149 179395 -102906 596133 -167592 401161 304630 14982 19649
17483 19649 205198 22086 -77201 -350211 -143537 100621 224166 45731 -118792 33185
17472C02817J61469A95577n2155E9138J79237B2898K88645j51331F9685b18335
17461c0837A68936p3249J37308c646C2985K53145j34222J30114G5702L49594M2371
17450D67667G5822M33801m6646A33122N8949g1756I1962d7995A22530K28147l7418
17439C13259A16490L841P2941F4378J66448A07254L9314K10759j19626c6423I7021
17427b0139F9758O4152K78694a33991A91402K45990d9861A26240N5911j0821K35275
17416D06605A42824J10108A8132K45019L7163o2429a7307I8311I390J47955E4800
17404c21653a9974B99236a32109B83525j14604h2775E2942K06489A19840a6595
17393c033j9188B12287i2359H8685g3317i267A82112p0200h3209b6400E10518
$$ plain form
17472 302817 464286 195577 143422 59138 238375 22898 311543 160212 69685 -218335
17461 -30837 168936 95687 232995 -3646 32985 286130 151908 282022 75702 425296 467667
17450 467667 75822 509623 462977 133122 192071 -71756 91962 -47995 122530 350677 313259
17439 313259 116490 120331 193272 64378 230826 107254 146568 357327 237701 -36423 97021
17427 -20139 69758 133910 412604 -133991 191402 437392 -49861 126240 182151 171330 406605
17416 406605 142824 252932 18132 263151 300314 237885 -17307 98311 9390 157345 54800
17404 -321653 -19974 299236 -132109 283525 168921 -82775 52942 259431 119840 -16595
17393 -3033 -22221 212287 -92359 88685 -73317 -9267 182112 111912 -83209 -26400 510518
17381C11166D3637i9973c028j06987A39568Q3284m3914g0174A03307J62756m6320
17370B19743o6847J62769Q0618F0480q233j3983C271J48103H395J8710L7891b3
17357e0693c132j94510F5423P3265J50545A37394K32473j47228K23865A43384
17346B89149H2539a13918K8291H0042K82657j27584a19683B20623q3089h723A80788
17334B94653L8058q9066r4051m4929L33931a7324B2588L20947a45439L3047B0334
17322A42566J3182n142Q0715b8025A66307L5512a17761C6846a26541D7205K67494
17311C14699I5857O9107J89245A4656K75318J3267h8022C7392A0114J93540O5664
17300B69318A22262b4887B82905I0090l4435l594b65925E0740J85994a64498A3861
$$ plain form
17381 311166 43637 -99973 -3028 -110015 139568 222852 178938 -70174 103307 266063 219743
17370 219743 152896 315665 396283 60480 52247 38264 3271 151374 8395 27105 64996 -23
17357 -50693 -3132 -197642 65423 138688 289233 137394 369867 222639 446504 143384
17346 289149 82539 -113918 -85627 80042 362699 235115 -119683 220623 137534 -8723 180788
17334 294653 332711 243645 149594 104665 438596 -17324 22588 343535 -145439 -112392 20334
17322 142566 155748 150606 231321 -28025 166307 201819 -117761 36846 -126541 47205 314699
17311 314699 95857 164964 354209 14656 289974 303241 -88022 37392 10114 203654 269318
17300 269318 122262 -24887 282905 90090 55655 52061 -265925 50740 236734 -164498 13861
17288i3121D8022J43714Q069E8111i9806C26871j14231g5538n0913E8938a8011
17276a08933A35987p957L03847A95924g9939n874B4856K44412L9299J7277A56412
17264C76535a43378B20617q9054d71418C79742H4568J40448k685p0549E7084h347
17252A83877D3668K39409J33371A92315b3013A61826P8520F4147Q0251K5883a03661
17240B37759d1573C04495f7151j36420c935D15714A96566H3749K50276B469J13241
17229A15710h5049B15961q3290J00072K76671j31131a2566A80845m637o0165J84801
17218C00844A34096l1274J46222J43517j93619J12544B6492R9472K54312o7954
17208C12322a27141A58910O0881A01424E224N4309K64021B9804L8805a3126B94100
$$ plain form
17288 -93121 48022 191736 199805 58111 -99806 326871 212640 -75538 -126451 58938 -18011
17276 -108933 135987 128030 431877 195924 -79939 -85813 24856 269268 308567 325844 156412
17264 376535 -143378 220617 131563 -471418 379742 84568 225016 222331 151782 57084 -8347
17252 183877 43668 283077 416448 192315 -23013 161826 240346 64147 144398 170281 -103661
17240 237759 -41573 304495 -67151 -203571 -3935 415714 196566 83749 334025 2469 115710
17229 115710 -85049 215961 132671 232743 509414 378283 -12566 180845 176208 116043 300844
17218 300844 134096 102822 249044 392561 198942 311486 26492 125964 380276 312322
17208 312322 -127141 158910 219791 101424 5224 59533 323554 29804 68609 -13126 294100
17196D06380j90181Q7654J1565j9575j37151b25943F4877L09271O47A84455J706
17185A86161K3397M85231l00526G6510J45290H2356a69800B34636q9991D9380
17174I9769J04237R6002M7008F3994j7471J77729j0083K90282A17648L68738A35216
17162A93576J21808b5721D87323e1838j94981D39184E4883J47868j5149K49957
17152D37559A79279p6492K30222D9981K29622A08688J50092R0782A72098k5325
17142A46773J6168M8478L17036B34257n2904J99225j22015J65675A86650K05386
17132C92036A59030J83811j02715M4328A25328K83621o9959L5719A76747J61481
17122C38228A43783K32038M893J75606I2647M84321B15772J81477a75889C38632
$$ plain form
17196 406380 216199 303853 315418 295843 158692 -225943 64877 374148 374795 184455 186161
17185 186161 209558 694789 394263 76510 221800 82356 -169800 234636 144645 49380
17174 99769 204006 300008 347016 63994 46523 224252 214169 504451 117648 486386 135216
17162 193576 315384 -25721 487323 -51838 -246819 439184 54883 202751 187602 437559
17152 437559 179279 102787 333009 49981 279603 108688 258780 349562 172098 146773
17142 146773 162941 211419 528455 234257 181353 380578 258563 424238 186650 392036
17132 392036 159030 342841 240126 284454 125328 408949 338990 374709 176747 338228
17122 338228 143783 375821 380714 556320 92647 576968 215772 397249 -175889 338632
17111B18747R7073K0573K86493B35092l0700J84625j24921O9310P6410E4322N16675
17100E70997B03650O6577J39035r6815j2986L42314B03047K11271O2472J9040
17090D95830n8084L5067j91940J6994K06570j42388n619o2802J37970J29657l6678
17079E24577j70745O7386j04450L13866A90140b6883D07555m338F0424N13996
17069E74420j43098N3773B13238J82738k7061K43090j20407j25268p9962m7202
17059B39166K14967j47435J5513o5710j07442L47222o2340K26975A53882M59059
17049F12941j51587m1396J98223B77765J28497r3080L83819k02200L9159j74716
17039C59244J20044j56776N8767M04967k62029j34809L57648j47902p0990K63611
$$ plain form
17111 218747 315820 336393 622886 235092 204392 389017 264096 333406 409816 54322 570997
17100 570997 203650 270227 409262 312447 299461 641775 203047 414318 476790 495830
17090 495830 437746 472813 280873 297867 504437 362049 356430 293628 431598 561255 524577
17079 524577 353832 421218 316768 630634 190140 -26883 407555 403217 60424 574420
17069 574420 431322 485095 213238 395976 368915 612005 491598 366330 286368 239166
17059 239166 454133 306698 322211 256501 149059 496281 433941 660916 153882 612941
17049 612941 461354 419958 618181 277765 406262 313182 697001 494801 533960 359244
17039 359244 479288 322512 381279 786246 524217 389408 747056 599154 528164 791775
17029G91775B98448K15532k00104L90582k96089p4900M23911J80689D44003r1514
17019C52489M71982A60979J65012K22453j36150J70234J15165j96630K73569r0382
17009F84250j85299k1497L44960l91553K73273l17402R7382K33662j47756p0166
16999D99854m0306L48203j63901l3989J57364l34248N86402l55234M3114j1844
16989F95415k48841O8055L73078p1695l34742N4316R4622L83670m03024J18306
16979G29160n065C17157M77400J65095k57954J67228k38717K52422j70901k9594
16969F82136j75726Q1477K71740k95837K66007o3009k64149N29564k62634M3349
16959H12918O4305j04112L39121l48684j52783K20287l7422L08821l36914j89303
$$ plain form
17029 791775 298448 513980 313876 704458 408369 333469 757380 938069 444003 352489
17019 352489 824471 160979 325991 548444 412294 582528 697693 501063 774632 684250
17009 684250 498951 477454 822414 430861 704134 386732 484114 717776 570020 499854
16999 499854 459548 807751 643850 609861 767225 432977 1019379 664145 707259 695415
16989 695415 446574 514629 887707 816012 481270 535586 630208 1013878 610854 729160
16979 729160 724095 317157 794557 959652 701698 868926 630209 882631 711730 682136
16969 682136 506410 587887 859627 563790 829797 766788 502639 1032203 769569 812918
16959 812918 877223 773111 1112232 763548 610765 831052 793630 1102451 765537 576234
16949E76234N35132l58899M7760r3654P6519K61033k9466n7387J24584j82876
16939H98980n9497N5411M7104j24589M37236L3492k04206k90226K80113o8097
16929A005721j59221K76162J49265j28386m03913O60258k27160K39374J00443
16920A512543l93091Q5651j0853m61388L46966L43533j4650l30148j28090L25390
16910A275863Q6882m1206n273p1286K16310O7673l5116k15772K82147O7165j20413
16899A506974J44349J4582j67783J12184k82322L03479j37039k5267o3879L54502
16889A759780p4108L22661k22811J10293j21637J03225J94679l85660j58610J66462
16879A694274j95299L05957J57046J77961L4791j89952J6678j09600j45732J07208
$$ plain form
16949 576234 1111366 752467 800227 706573 783092 1044125 1014659 957272 1081856 898980
16939 898980 839483 894894 941998 817409 1254645 1288137 1083931 793705 1073818 1005721
16929 1005721 846500 1122662 1271927 1143541 739628 1399886 1172726 1412100 1512543
16920 1512543 1119452 1205103 1194250 732862 1079828 1423361 1408711 1078563 950473 1275863
16910 1275863 1362745 1321539 1316266 1244980 1461290 1528963 1493847 1278075 1560222 1627387 1506974
16899 1506974 1651323 1665905 1498122 1610306 1327984 1631463 1494424 1469157 1405278 1759780
16889 1759780 1685672 2008333 1785522 1895815 1774178 1877403 2072082 1686422 1527812 1694274
16879 1694274 1498975 1804932 1961978 2139939 2174730 1984778 2001456 1891856 1746124 1853332
16869A853332J98481M4610K4513J88236k39140J25117o1067J97256j94978K51843
16859B388203J28299J39k23147L38028K72507l62500M08910j81469k78276L6846
16849B527540M3668L26730N7661m50930M03000o1150K56226p9454K04469j72194
16839C055566K79254r2726M25442n15670K06175N9529P7789j9543J59030K13129
16829C847975J23751m84136M46785j581K10776o0198N7108Q3394J34072j50254
16819D207692J53159M16412j10343j09245L98184p3038O6914K73622o2477M568
16809E165448L34816J54164P730J49661K73864J29238k1780j37116N50766Q3396
16799F690187Q4601J09325J51194P8853K75770K70168J60310N00331l4829Q031
$$ plain form
16869 1853332 2051813 2096423 2120936 2309172 2070032 2195149 2134082 2331338 2136360 2388203
16859 2388203 2516502 2516641 2293494 2631522 2904029 2541529 2950439 2768970 2490694 2527540
16849 2527540 2571208 2897938 2955599 2504669 2907669 2846519 3102745 3023291 3227760 3055566
16839 3055566 3334820 3242094 3667536 3151866 3358041 3417570 3495359 3475816 3634846 3847975
16829 3847975 3971726 3487590 3934375 3932794 4143570 4083372 4140480 4223874 4357946 4207692
16819 4207692 4360851 4777263 4666920 4557675 4955859 4882821 4949735 5223357 5160880 5165448
16809 5165448 5500264 5654428 5662158 5811819 6085683 6214921 6193141 6056025 6606791 6690187
16799 6690187 6774788 6884113 7035307 7114160 7389930 7660098 7820408 8320739 8285910 8293941
16789H293941N26399J79979J1585P29588k62048L97220L08710N38939O62059o8732
16779A1317640L17880N7389Q21279r1172O14682L13631N56351L75526P87392J82436
16769A5253034P39206M56650O60441O57375Q80917M48659P90632J006989N98930
16760B1492833Q15282P59875J260162P73662J174961J459135J112702J285773
16752C0134385J767032J149846J781571K085967J997520J958718J774850K772945
16744D5422834K256895K778547L155208L007565L543261L744551M121155M317798
16736G2347814M832139N314997N304362O197645O465379O598110P042854P748014
16728A21851314P800923Q305021Q396719Q379579Q110881Q196107P175036O640537
$$ plain form
16789 8293941 8820340 9000319 9011904 9741492 9479444 9876664 10185374 10724313 11386372 11317640
16779 11317640 11635520 11692909 12514188 12423016 13037698 13351329 13907680 14283206 15070598 15253034
16769 15253034 15992240 16448890 17109331 17766706 18647623 19096282 19886914 20893903 21492833
16760 21492833 22308115 23067990 24328152 25101814 26276775 27735910 28848612 30134385
16752 30134385 31901417 33051263 34832834 36918801 38916321 40875039 42649889 45422834
16744 45422834 47679729 50458276 53613484 56621049 60164310 63908861 68030016 72347814
16736 72347814 77179953 82494950 87799312 93996957 100462336 107060446 114103300 121851314
16728 121851314 129652237 137957258 146353977 154733556 162844437 171040544 178215580 184856117
16720A84856117N022604M364006K353369J116726j040580k271957l582903n319434
16712A85497948o278242p460336p770495q397699q565284q409461q297379q366507
16704A21952545p610949p383244p155811o547758o393736n364250n176351m808083
16696G1512363m823819m060239l922979l350727l424343l065838k937939k358742
16688D3567737k669739k104286j728832j983838j908542j565123j766047j201368
16680B8639962j487025j177362r51656j383176j111268q94909j055217r76192
16672A9603157m61296j237280k80043o85676p98467r04568j95653o50589o06114
16663A3783471m94500n83871l76513q3695m07025o50026j18629n62355m98597
$$ plain form
16720 184856117 189878721 194242727 196596096 197712822 196672242 194400285 190817382 185497948
16712 185497948 179219706 171759370 163988875 155591176 147025892 138616431 130319052 121952545
16704 121952545 114341596 106958352 99802541 93254783 86861047 81496797 76320446 71512363
16696 71512363 66688544 62628305 58705326 55354599 51930256 48864418 45926479 43567737
16688 43567737 40897998 38793712 37064880 35081042 33172500 31607377 29841330 28639962
16680 28639962 27152937 25975575 25023919 23640743 22529475 21634566 20579349 19603157
16672 19603157 19141861 17904581 17624538 16938862 16140395 15235827 15040174 14389585 13783471
16663 13783471 13288971 12705100 12328587 12244892 11837867 11187841 11069212 10506857 10008260
16654A0008260p6050k58485n86868P4971n50848l08094j88683m51020J56607l001
16644G816789p13352j10890j02353j31659k87792j79429p9708R8385j59861m26802
16634E723328j92847m35180J39614K69496O6057p31654R935N742p0696k65510
16624D518285k11200J84708k46318j11732M7370m88455l439J86719J847j26502
16614C751283j06892q0466J21159k17034r7398M3253q9230k78392J24278k4693
16604C145868R9833j85852k56233J6086R3384N0110k62038O0366m76437K46670
16594B531757l169p4472k31340K77791l39226j31909J99253l88506J90875l1206
16584A999848Q8146p6062k13369M11621O529j76713j84967M1854j37560O2384
$$ plain form
16654 10008260 9932210 9673725 9086857 9161828 8610980 8302886 8114203 7663183 7819790 7816789
16644 7816789 7103437 6992547 6890194 6758535 6470743 6291314 6211606 6309991 6150130 5723328
16634 5723328 5530481 5095301 5234915 5504411 5570468 4838814 4848749 4854491 4783795 4518285
16624 4518285 4307085 4491793 4245475 4133743 4181113 3692658 3689219 3875938 3877785 3751283
16614 3751283 3644391 3563925 3685084 3468050 3370652 3413905 3324675 3046283 3170561 3145868
16604 3145868 3245701 3059849 2803616 2819702 2913086 2963196 2701158 2761524 2285087 2531757
16594 2531757 2528588 2454116 2222776 2500567 2161341 2029432 2228685 1840179 2031054 1999848
16584 1999848 2087994 2011932 1798563 2210184 2216713 2040000 1855033 1896887 1759327 1821711
16574A821711P6488l58972M84320k66832l01727J17302K12243l65740M66599n43672
16564A341720N04665k87532J26936k4249l32967J37172m9086J3745k58509N03839
16554A675734l48888l4069j62059J98885j34978P201M866J07168j19438j31005
16544A063417J25895j61533K15282n1738Q6304k76622J26991j02529k58469K03936
16534I70934N5074L2233K2217M2563N6832r7833k09537n0895k12709K91581M424
16523I04884K45440m47778o7289n7867J84609L4665j24002L90146k11791m19731
16513D31286L26309L4252M6509l14097M2347J31744r4879j18400M73095D21530
16502F12696K31572m09707K29105J66928k88391L85709D12798L06190o8287r9532
$$ plain form
16574 1821711 1898199 1539227 2023547 1756715 1454988 1572290 1784533 1418793 1885392 1341720
16564 1341720 1846385 1558853 1685789 1661540 1328573 1465745 1416659 1430404 1171895 1675734
16554 1675734 1326846 1292777 1130718 1329603 1194625 1201826 1206692 1313860 1194422 1063417
16544 1063417 1189312 1027779 1243061 1191323 1277627 1001005 1127996 1025467 766998 970934
16534 970934 1026008 1058241 1080458 1123021 1179853 1082020 872483 821588 608879 900460 904884
16523 904884 1150324 702546 635257 577390 761999 796664 672662 1062808 851017 431286
16513 431286 757595 791847 838356 524259 566606 698350 603471 485071 958166 421530
16502 612696 844268 434561 663666 830594 542203 927912 412798 718988 650701 551169
16492E51169J03807m3614J72704A10530M36532j41530m8195K51445q5822m1823
16482D81137N2111j58253K9977J36713N0134m0094A80030M62394j65140O9057
16472E46341Q2181M1350B52710L05804J80759K8413k78505M3653k07854K41511
16462E66491k67659N02976j86429C06961j37693L62295k14781k6996J47242o680
16452D30348P9796j21209o1189J57459k39652j3978L490J60625Q6077J4495n9917
16441D36345L0641k30759L90488d829B04799K65977B27554K49553B17234m8662
16431A68572m6522R6980I9651L67630L21960C82590j15376p6707J8520K9646P178
16420B45851J86229J1509q3184r5881K71803k09241M6950J27115A70901N56990
$$ plain form
16492 551169 654976 611362 784066 110530 547062 405532 357337 608782 522960 481137
16482 481137 533248 374995 404972 541685 591819 551725 180030 642424 477284 546341
16472 546341 628522 669872 252710 558514 739273 767686 489181 532834 324980 566491
16462 566491 298832 801808 615379 306961 169268 531563 316782 289786 437028 430348
16452 430348 510144 388935 327746 485205 245553 231575 235065 395690 481767 496262 436345
16441 436345 466986 236227 626715 -4829 204799 470776 227554 477107 217234 168572
16431 168572 122050 219030 99651 467281 789241 382590 267214 190507 209027 238673 245851
16420 245851 432080 443589 360405 264524 536327 327086 374036 501151 170901 727891
16410G27891C00415M7198o4385M0293K08398k51587F2869a7849E44192k25854
16400C18338K22057a970C06762p9160K53080k04684p9635A3086O0231j7472M94595
16389E50440B58455o9595K37587M2652r8846r2623k8103A16083D0154Q4720a7140
16377D71437O111k15083D3976L64921D2197L68861j28651m5831a89709B07931
16366e4785l1869B83198J7631q3657R7273c6229D54873m2275j78432q2403J60227
16355C11990l6817L436H8081N2406J99602a77560A96027L572J56825D5455j0698
16344C4757f7795B37151m7297K61107F6360R6615J14290o6544m71f2463D19776
16332A71482K014J2542L7142i4185L0607J1751B89392B8398g2328B41722A13641
$$ plain form
16410 727891 300415 347613 283228 323521 531919 280332 62869 -17849 544192 318338
16400 318338 540395 -1970 306762 227602 480682 275998 196363 13086 73317 55845 550440
16389 550440 258455 188860 426447 469099 370253 277630 249527 116083 40154 124874 -17140
16377 471437 477548 262465 43976 408897 42197 411058 282407 236576 -189709 207931
16366 -54785 -86654 283198 300829 217172 314445 -36229 454873 412598 234166 151763 311990
16355 311990 275173 278609 88081 140487 340089 -177560 196027 199599 356424 45455 34757
16344 34757 -67795 237151 189854 450961 66360 162975 277265 210721 210250 -62463 419776
16332 171482 173496 186038 223180 -94185 -63578 -51827 289392 28398 -72328 241722 113641
16320A23314J74704j41982N1034N5847b927A23489k444a1552n9370D04995H1959
16308a05275h714b531A11737a50484j1611B24134d6717B04746f9154L961A57019
16296B0719K4984A3510K26315D4658J3176L0745b46068A77999h2940A46476K06275
16285C52751i5355B08266j00233a21653C3475a6352B48351j10167b11838D0010
16274B4559R5959i6732k39744A1826O797J30951R3981D9419L40481G4428K32248
16263C06676b12210A71187m8823m0621B8787a43207A56799M9538i4319A39628
16252b3521B71542a05094I0203Q9069a39994D57694f7239m54529B88415m0790
16242B47625a03200A66512B2030C450e3963l40177L7247A25378L88832a10479
$$ plain form
16320 123314 298018 156036 207070 262917 -2927 123489 121045 -11552 -70922 404995 81959
16308 -105275 -8714 -2531 111737 -150484 -162095 224134 -46717 204746 -69154 -65193 157019
16296 20719 45703 13510 239825 44658 57834 88579 -246068 177999 -82940 146476 352751
16285 352751 -95355 208266 108033 -121653 33475 -16352 248351 138184 -211838 40010
16274 24559 120518 -96732 -336476 11826 18623 149574 243555 49419 389900 74428 306676
16263 306676 -212210 171187 122364 81743 28787 -143207 156799 206337 -94319 139628
16252 -23521 271542 -105094 90203 179272 -139994 457694 -67239 -521768 288415 247625
16242 247625 -103200 166512 22030 3450 -53963 -394140 -356893 125378 514210 -110479
16231d3930m22620a45235I6248C8722N9750K36070d3044j57171D0385P812A0846
16219I9725b29565A24846M5562q1470g4368G7864C0547a40017j54093a26250i808
16207G2531A0914b23915M6180B13798a76928L6403B50472D6811L02065j30780
16197B18096b5509G1454f8368o172K0781D22354e6946B47283g4162A5532a29435
16185A70192b35675a13197c3284D0088K52320l5081B6219g9488B97829H5635e959
16173h6045A14385J20801a06083q6249q3241C12072d9305q0539q923A82715H5302
16161A65171c2101A15847l7979J5977J71101A7005L12604b6711C49491G0104K2230
16150I2334b98125A02376i3618L7555A06932b55506i7674A78023G2180a47440
$$ plain form
16231 -43930 -466550 -145235 96248 38722 98472 334542 -43044 -200215 40385 48197 10846
16219 99725 -229565 124846 170408 88938 -74368 77864 30547 -140017 -294110 -126250 -9808
16207 72531 10914 -223915 -177735 213798 -176928 -140525 250472 46811 348876 218096
16197 218096 -25509 71454 -68368 -74540 -53759 422354 -56946 247283 -74162 15532 -129435
16185 170192 -235675 -113197 -33284 40088 292408 257327 26219 -79488 297829 85635 -5959
16173 -86045 114385 235186 -106083 -192332 -275573 312072 -49305 -129844 -138767 182715 85302
16161 165171 -32101 115847 77868 93845 264946 17005 329609 -26711 349491 70104 92334
16150 92334 -298125 102376 -93618 -56063 106932 -255506 -97674 178023 72180 -147440
16139D3825b31999f8626j84607R7253M0281k23983a64083B05212c64021a74620
16128B73816A0426a43163r7135q4326J16051A18093N5705L31366H9510N4550n1923
16117I2137R8952a2780q152J0093A64606C7564M2606a86846Q4135E8956b8717
16105g7974L6271F0676J96472j17938n9104J60045L2597b18407e9299j47722c638
16093a86940b4601q0342C59436G4523d677j18473r0533A21702b82464G1725c32764
16081I4790C7607R0148J66588b54175N8492d5490m2694m2084K9507j1268A73890
16069b37960A1702d6138Q57E2824p82G815a67248L1615C869a19743A5717E287
16056G2364O850G335h7516H4699a86204G2857a27929q3933C409b50987h4810D35145
$$ plain form
16139 43825 -231999 -68626 -253233 -155980 -115699 -339682 -164083 205212 -364021 -174620
16128 273816 10426 -143163 -240298 -324624 -208573 118093 173798 505164 89510 144060 92137
16117 92137 191089 -12780 -20932 -10839 164606 37564 80170 -186846 -102711 58956 -28717
16105 -77974 -41703 60676 257148 139210 80106 240151 272748 -218407 -59299 -207021 -3638
16093 -186940 -24601 -104943 359436 74523 -4677 -123150 -213683 121702 -282464 71725 -332764
16081 94790 37607 127755 294343 -254175 -195683 -45490 -88184 -130268 -100761 -112029 173890
16069 -237960 11702 -46138 -45281 52824 52042 7815 -167248 -135633 3869 -119743 15717 5287
16056 72364 79214 7335 -87516 84699 -186204 72857 -127929 -211862 3409 -250987 -84810 435145
16043h856m2727j6489A79727a3251k21104o7791L7824A1519d6539j60434A5901
16031a18121j10294c6649p1912j76363C7952a12144A20852e5270j04804b2992
16020B51594k7839c3629E5695f3761K1385j04268B32308a67000G2667a09701A61542
16008A10823R8790b02588K3997K1536I1558a51010B3933a60911A60551d63384
15997b91538h1254H7959c90552B31879a6370l6950j55346i2107F2266a91789l7201
15986b28990C4172M76805a04829P554B50616L8553J9644A3659N22979c8456B25447
15974a23695L0039H863a64780B1079o912e0770p9130k8608m4436A90112r1772
15963I8340M6686C9092a35390k4319A90601a36188b217k50055b7599k43052P5122
$$ plain form
16043 -8856 -51583 -68072 179727 -13251 -234355 -302146 -264322 11519 -46539 -206973 15901
16031 -118121 -228415 -36649 -108561 -284924 37952 -112144 120852 -55270 -160074 -22992
16020 251594 223755 -33629 55695 -63761 -42376 -146644 232308 -167000 72667 -109701 161542
16008 110823 209613 -202588 -178591 -157055 91558 -151010 23933 -160911 160551 -463384
15997 -291538 -81254 87959 -390552 231879 -16370 -53320 -208666 -92107 62266 -191789 -228990
15986 -228990 34172 510977 -104829 -97275 250616 289169 308813 13659 536638 -38456 225447
15974 -123695 -93656 8863 -164780 21079 14167 -50770 -129900 -158508 -202944 190112 98340
15963 98340 145026 39092 -135390 -159709 190601 -136188 -2217 -252272 -27599 -270651 -195529
15952a95529G1244h4386k93937G0659a18369C08503e7410B39844G7784g5064A0322
15940c1628j20913g6156A70432l0209n0479f9559q0337L2058j221a841A35056
15928B57858c28743E0004K12751g4525k8746q327o9742a631H0677Q4235a47146
15916a80005J0419b6848A56909A5567c7814O645j72837B4214L0081b37115g0983
15904I010N3916e1503n0904A6312b70573Q0631n2682A07650b926l62774a36264
15892A00734a45713a0233j15159j41636A1671e8452J9683A09123e4498A78089
15881I7203D1420c0315j04012A62842B6081R6682M7303J02715j8474a38788C27478
15869C61246A80418a725I9003a19097L8744j92377A76903k095D6546i6161k13272
$$ plain form
15952 -195529 71244 -84386 -378323 70659 -118369 308503 -57410 239844 77784 -75064 10322
15940 -31628 -152541 -76156 170432 140223 89744 -69559 -149896 -117838 -119059 -1841 135056
15928 257858 -328743 50004 262755 -74525 -103271 -111598 -181340 -1631 80677 164912 -147146
15916 -180005 -169586 -26848 156909 15567 -37814 -31169 -204006 24214 54295 -237115 -70983
15904 9010 62926 -51503 -102407 16312 -270573 -189942 -242624 107650 -2926 -365700 -136264
15892 100734 -145713 -10233 -125392 -267028 11671 -58452 -38769 109123 -54498 178089
15881 97203 41420 -30315 -134327 162842 26081 122763 170066 272781 254307 -138788 327478
15869 361246 180418 -1725 99003 -119097 -80353 -272730 176903 174808 46546 -96161 -309433
15858c09433e3625A92655e8523k70818G58a69992C42537g332B4876a49305o1841
15847b11146l9459a03940G5369a12922k2904C39195a5595e465l2481j14007L8996
15836a12957M6770k25522A57379b7086I0726b98248a6373E5403Q3848b86215B31190
15824a35620n9825j6135k4183B36620K00695b7020B63665K0854a35981j12771
15814b48752E9205c05887A61997F6107A8845a55983A05154B6389O1408a36864
15803G1144b9655A14612h5697o0575a7736l4578j00378A37243a56118n5149p9577
15792b90844a35809F3616f5830A59740a27836j40932A65845i3398b3586E7302
15781b7647j53242P8822C9744c61679C46189b182j0297j63169a961r0051j22231
$$ plain form
15858 -309433 -53625 192655 -58523 -329341 758 -169992 342537 -7332 24876 -149305 -211146
15847 -211146 -250605 -103940 75369 -112922 -135826 339195 -15595 -5465 -37946 -151953 -112957
15836 -112957 -66187 -291709 157379 -27086 90726 -298248 -16373 55403 139251 -286215 231190
15824 -135620 -195445 -211580 -235763 236620 437315 -27020 263665 284519 -135981 -248752
15814 -248752 59205 -305887 161997 66107 18845 -155983 105154 26389 87797 -136864
15803 71144 -29655 114612 -85697 -146272 -17736 -52314 -152692 137243 -156118 -211267 -290844
15792 -290844 -135809 63616 -65830 159740 -127836 -268768 165845 -93398 -23586 57302
15781 -27647 -180889 -102067 39744 -361679 346189 -2182 -12479 -175648 -1961 -92012 -214243
15770b14243a05313M1003H9022r854c30433J17973D6012N4060B2718h066r1395
15759i9461d7616B33758b10025C06862C8205L9276c64817J80705H9696b82475
15748C14398A57155a2743C01759A8712b58159A95753N1324a01986l8408k9374
15738a69768K9355f8281c1834l0919E6801d94702a5373l260r3942k9130d9048
15726b48701c3804k40244l67110B2636a9263B2517b8576B95619f0943D4475J89590
15715B34065j14430g7799E8548g3988L1282a8684A40712p0272b01100O1365k32384
15704c72119l8711A41504C8331g6769A1031c47611Q2529o3577a03270E0028r630
15693D0398N0281a27924j5660E0214J2564k0030N0064a57442F4453d6442J4986
$$ plain form
15770 -214243 -105313 -64310 89022 79168 -330433 -212460 46012 100072 22718 -8066 -99461
15759 -99461 -47616 233758 -210025 306862 38205 77481 -364817 -184112 89696 -282475
15748 314398 157155 -12743 301759 18712 -258159 195753 247077 -101986 -140394 -169768
15738 -169768 -140413 -68281 -31834 -62753 56801 -494702 -15373 -18633 -112575 -141705 -49048
15726 -248701 -33804 -274048 -641158 22636 -19263 22517 -28576 295619 -60943 44475 234065
15715 234065 119635 -77799 58548 -73988 -42706 -18684 140712 70440 -201100 -139735 -372119
15704 -372119 -410830 141504 38331 -76769 11031 -347611 -265082 -328659 -103270 50028 40398
15693 40398 90679 -127924 -143584 50214 62778 42748 92812 -157442 64453 -46442 -31456
15682c1456j4047k4708J8844A05269J62957b94581A24017c0748k02955B53159
15671G1852L20646G9567Q0923D9590N750L84834f101k22933P4080N1673H7986
15659G6878a83503I7627a69533j12551l7105O4020e079B24159A08609M8289e9271
15647b12362h7857H3592a38952A08049j1114a70049F9413b64936K6845B13283
15636b34602A66965a01533l3345k5387B78350d23046F9693L61238d5231D18649
15625A9021h7407B4977J12177L4021a70467B85086A24898b31219e56j00826A79781
15613B7055a868A17853d08313A19464c4760A20132a20521N3948A99658a36425
15602b65223a16774E34516a81767B31942a6956k59252P5545B56789a84949P3582
$$ plain form
15682 -31456 -45503 -70211 -51367 105269 268226 -294581 124017 -30748 -233703 253159
15671 71852 392498 79567 160490 49590 55340 440174 -6101 -229034 -154954 -103281 87986
15659 76878 -183503 97627 -169533 -282084 -319189 -255169 -5079 224159 108609 156898 -59271
15647 -212362 -87857 83592 -138952 108049 96935 -170049 69413 -264936 -238091 213283
15636 -234602 166965 -101533 -134878 -160265 278350 -423046 69693 430931 -45231 418649
15625 19021 -87407 24977 137154 171175 -170467 285086 124898 -231219 -556 -101382 179781
15613 27055 -1868 117853 -408313 119464 -34760 120132 -120521 -66573 199658 -136425
15602 -265223 -116774 534516 -181767 231942 -16956 -276208 -200663 256789 -184949 -111367
15592a11367A5471a77450b4363p9807A20847c06616e8645j815j6958E8528K03700
15581B62228a54531I474K468a24711j61315H8190a78961A94614b27681I8679a52989
15569c32651a11633B00797P4506i8439C3003J16737A2552a05436A47889E2624
15558B45463o4560d76252a71833c0826A18153k8257a33292M0331A07862a56888
15547a90402A98080a32458A14289b33716E8425i0695m719A94853g0018A4341P2083
15536H6424a97829B60216j22680R2290M1696b52211A21063a38731A14245A054
15525F8468j0366J69417A4247b25216J10330j33865F8410d6212k2291A32759N8630
15514A91389l6527E556K5512J20085L3248a00310d0860B9364a53257j3752r023
$$ plain form
15592 -111367 15471 -177450 -24363 -104170 120847 -306616 -58645 -60460 -77418 58528 262228
15581 262228 -154531 9474 11942 -124711 -286026 88190 -178961 194614 -227681 98679 -152989
15569 -332651 -111633 200797 275303 -98439 33003 149740 12552 -105436 147889 52624
15558 245463 180903 -476252 -171833 -30826 118153 89896 -133292 -92961 107862 -156888
15547 -190402 198080 -132458 114289 -233716 58425 -90695 -95414 194853 -70018 14341 86424
15536 86424 -197829 260216 137536 229826 271522 -252211 121063 -138731 114245 1054
15525 68468 58102 227519 14247 -225216 -114886 -248751 68410 -46212 -68503 132759 191389
15514 191389 154862 5556 31068 151153 184401 -100310 -40860 29364 -153257 -167009 -176032
15503a76032L0659r9948i7255j11001L7312M431f7010K673k0201B1552a65596
15491a86883C9381M3758e2934A7123M93090A81123n3667a1643j56177N0867C14372
15479A6888o714P6079a38986d7220I0263a13089J0680r5485N0420j881B19313
15467A70404a39908j52993q1593I1535b0111n8180k4660C1344a34638N1769j98771
15456b81640K9797E7475Q562G758a43826K9638I9941i2981r4195B4502b21393
15444d0293A68784d2666A67893b34293b4032k65702B5071a15937j50206B30174
15433g2085A09586d0898j00745A76619C4431L1254P0027a55648A20758c28977
15422E032a04125j32100C32183G1249j1332a4121k2083A66299P6597b961r5537
$$ plain form
15503 -176032 -145373 -245321 -97255 -208256 -170944 -166513 -67010 -64337 -84538 21552 -165596
15491 -186883 39381 83139 -52934 17123 510213 181123 127456 -11643 -167820 -116953 314372
15479 16888 10174 86253 -138986 -47220 90263 -113089 -102409 -197894 -147474 -149355 219313
15467 170404 -139908 -292901 -374494 91535 -20111 -78291 -102951 31344 -134638 -82869 -281640
15456 -281640 -251843 57475 66037 7758 -143826 -114188 99941 -92981 -187176 24502 -221393
15444 -40293 168784 -42666 167893 -234293 -24032 -289734 25071 -115937 -266143 230174
15433 -72085 109586 -40898 -141643 176619 34431 65685 135712 -155648 120758 -328977
15422 5032 -104125 -236225 332183 71249 59917 -14121 -36204 166299 242896 -2961 -98498
15411i8498k18585B5515c3599B8702R9211a59848G6886a70789o658p9520A81042
15399c48516b8666k533l86839a07260A17920d49007a26715A36311l3196a82557
15388d3426O699j08383j6054O0766O427A538h1505A05140a1816j4408k92093E53229
15375I9361K93778n6662A2892B085M9943K24156A37588Q267e11910a99149R1998
15364a07151D470i2025a6002F1666p418N7337k8342a21570A83504a64174B21614
15352A52812l0429k374a40163B42256D8375J91049Q3821g4921m0827d9072F048
15340I1354h2927q4164o3975B18457E9435a19973r9183d3354D4894J7153J25537
15329A87584J79161K3793d9341p2733B06571m8817F916L64486a69851B44784i1289
$$ plain form
15411 -98498 -317083 25515 -33599 28702 127913 -159848 76886 -170789 -177447 -256967 181042
15399 -348516 -28666 -31199 -418038 -107260 117920 -449007 -126715 136311 103115 -182557
15388 -43426 -36727 -145110 -161164 -100398 -93971 1538 -81505 105140 -11816 -26224 -318317 553229
15375 99361 393139 336477 12892 2085 52028 276184 137588 145855 -511910 -199149 -107151
15364 -107151 4470 -92025 -16002 61666 54248 111585 83243 -121570 183504 -164174 221614
15352 152812 122383 120009 -140163 242256 48375 239424 323245 -74921 -115748 -49072 6048
15340 91354 -82927 -167091 -231066 218457 59435 -119973 -219156 -43354 44894 62047 187584
15329 187584 366745 390538 -49341 -122074 206571 157754 6916 371402 -169851 244784 -91289
15317G7603J9887b23733d4726j83372Q3776g1121J2318r8160A55782Q9725a78353
15305b15634B10420D2387b6332l77819d88j39615A83758a98875O5752D3158J90323
15294B33481F7918J725b8674B74287B5400a52837A00270L7442J12482q3470D3165
15282B27018a2958A05032k6064C6623K03579a0369B11059l6863H3052P0044p0678
15271H2418l974J81126d1958A22983e0012A44504j315B907K55622j06927R2319
15260B43921D4199J43997c1004l41305C2268K84603A36934A650J57154D9222K07940
15249B57162Q0973L44847Q39070m58147L34234j88422D75367A81843P4839a93321
15238A69007L4092b48197d17A92999d96651a35719A1175J38303m7544a9524C690
$$ plain form
15317 77603 97490 -223733 -44726 -228098 -144322 -71121 -58803 -156963 155782 245507 -178353
15305 -215634 210420 42387 -26332 -404151 -488 -140103 183758 -198875 -133123 43158 233481
15294 233481 67918 69643 -28674 274287 25400 -152837 100270 137712 250194 166724 43165
15282 227018 -12958 105032 78968 36623 240202 -10369 211059 174196 83052 153096 82418
15271 82418 78444 259570 -41958 122983 -50012 144504 143189 2907 258529 151602 243921
15260 243921 44199 188196 -31004 -372309 32268 316871 136934 1650 158804 49222 257162
15249 257162 338135 682982 1522052 1063905 1398139 1209717 475367 181843 256682 -193321
15238 169007 203099 -248197 -417 192999 -496651 -135719 11175 149478 101934 -19524 3690
15226e068E8554J07721p0901J24445p0339a67569B27271C8427a02922j25397A79003
15214C23801c4352p672B55287G9724k7746J77645F05M086M3393a45541k9731A95044
15201F8820a11642A39981o5542j8854a81590D5419J53954d4328H2135n064c06022
15189b47914Q5067f1980B37633J19232A54900e3649n2820A04331d545j01519A43191
15177B55138I1543a39826B28278O8149j25972Q5149a34700j22112B6918c5011
15166E4248J47390J69130M4611B3345K9232a8098k7284D6788a83107C46041F1859
15154e1333I9234K39595j33227I00J52154K29609A00788J30755A342O9687b6373
15142b02039A17465l7592J41839K26092A92192a20542B18188b05409f4543a8335
$$ plain form
15226 -5068 58554 166275 95374 219819 149480 -167569 227271 38427 -102922 -228319 179003
15214 323801 -34352 -42024 255287 79724 51978 229623 605 4691 48084 -145541 -175272 195044
15201 68820 -111642 139981 74439 55585 -181590 45419 199373 -44328 82135 77071 -306022
15189 -247914 -162847 -61980 237633 356865 154900 -53649 -106469 104331 -4545 -106064 143191
15177 255138 91543 -139826 228278 296427 170455 255604 -134700 -256812 26918 -35011
15166 54248 201638 370768 415379 23345 52577 -18098 -45382 46788 -183107 346041 61859
15154 -51333 99234 338829 205602 900 153054 382663 100788 231543 1342 71029 -26373
15142 -202039 117465 79873 221712 447804 192192 -120542 218188 -205409 -64543 -18335
15131A25519R3578c1759k17234B60260o1206o4389l4777a4102C57502I6454l6734
15120E9720k3787J13794G6M71036a65906G2781N9299L15099H1287C1135g3329
15108A00590J79598A29046J78713E1264f3286a4865F9153l3004N3426K40124b11309
15096G5785J47988J25708c79449D46226b2150p4234A63221l0084j9153D0591n027
15085C5564J3503e8804D3459L17189E2690J46323c4344J6689B74748G2319J08507
15074A80826c068I2876J04541a63375B05335f6828A38952D4634A3143e2233D78518
15062I244L22153M0189a1248A75367K2006a9784G119d7882m7501A00637D6361
15050A73859G0009O104L62491A82079d2623J1820C07039a97057g2997A24543D6868
$$ plain form
15131 125519 219097 -31759 -248993 260260 199054 134665 99888 -14102 357502 96454 59720
15120 59720 35933 149727 76 471112 -165906 72781 132080 447179 81287 31135 -73329
15108 100590 280188 129046 307759 51264 -63286 -14865 69153 36149 89575 329699 -211309
15096 75785 223773 349481 -379449 446226 -22150 -96384 163221 133137 113984 40591 35564
15085 35564 49067 -58804 43459 360648 52690 199013 -34344 -17655 274748 72319 180826
15074 180826 -3068 92876 197417 -163375 205335 -66828 138952 44634 13143 -52233 478518
15062 9244 331397 371586 -11248 175367 197373 -19784 7119 -47882 -95383 100637 46361
15050 173859 70009 76113 438604 182079 -42623 -30803 307039 -197057 -72997 124543 46868
15038A5172f504j50999F3357O5729a15959C48175I2564k9336J35892L33034B01526
15026e4217D19434J5921c6749C72800j11177c352C58175j72611J95718F4075L61173
15015D25248A52124g3885B74423A09070Q0236p4144k6655Q6981o695C3410N21908
15004E55318I0859J04371G7106J31908K01089I955L07396C6786K12695b4290D46125
14992B87274L7926E8451L37224A23112O6109J87828K9155G6584K09175A37994
14981C53263A10633K73503g0739B12197n6633m558J00511H9996L90894A07873
14970C89894i0097F9256h7055D88643j88753j7089L99353A15865J46115M0181
14960C02161j7506g3715Q390C46248J39431A45276K95114r0391J1919o2371j342
$$ plain form
15038 15172 -6504 -157503 63357 129086 -115959 348175 92564 63228 199120 532154 201526
15026 -54217 419434 435355 -36749 372800 261623 -3352 358175 185564 381282 64075 425248
15015 425248 152124 -73885 274423 109070 189306 115162 88507 175488 168793 33410 555318
15004 555318 90859 195230 77106 209014 410103 9955 317351 36786 249481 -24290 446125
14992 287274 325200 58451 395675 123112 189221 377049 406204 76584 285759 137994
14981 353263 110633 384136 -70739 212197 155564 151006 251517 89996 480890 107873
14970 389894 -90097 69256 -87055 488643 299890 282801 682154 115865 261980 302161
14960 302161 284655 -73715 -65325 346248 485679 145276 440390 349999 361918 299547 298205
14949B98205c2511A0080M47662A6892L42702K13945B66464j20295J4644B603M71152
14938D73755A4739K25337o8785j7829J50097m0198m2733J9174R0272b17494A20312
14926B19421H0343N8609a6954E37689j48858A28173K47894m132j31801Q1357j11208
14915B10283q5298L09768g1077B90632F0408L1374M00264k13593Q4152j16734
14905B45871J1380J32613o1885A00988L25941E3695N4073K8785J69900a12524
14894A0895M84358k1212b4965F8174K1836M81515j71827b7410B13713K60065G0698
14882B72206M91309B42853R2768J2629J05665o924j95284p2126F5633P7912K11089
14871C54634F9732N15760j76249P7360j28221K40337j64500r1528L82303B57836
$$ plain form
14949 298205 -32511 10080 457742 16892 359594 573539 266464 146169 160813 2603 473755
14938 473755 14739 240076 171291 153462 303559 263361 220628 239802 330074 -217494 120312
14926 219421 80343 138952 -16954 537689 388831 128173 376067 371935 240134 321491 210283
14915 210283 124985 434753 -71077 290632 60408 91782 492046 278453 362605 245871
14905 245871 257251 389864 327979 100988 426929 53695 107768 136553 306453 -112524
14894 10895 495253 474041 -24965 68174 90010 571525 399698 -27410 213713 473778 70698
14882 272206 763515 242853 335621 348250 453915 446991 251707 179581 65633 143545 354634
14871 354634 69732 585492 409243 486603 358382 598719 434219 342691 724994 257836
14860G61497k41906k03671J89897k14476K63979j07212j69800N5155H8390J76118
14850B64508K95033B55100K42805r3499A66254J5598L83184H0555L87661j56028
14840C12188J08999L73927A91226J64863K88336B18616J83363A58730J45943R0484
14830C95157L8026C360M09744R2972p1252K3935j21340P5093p5494J08847K13205
14819F59070p0207j75996k3398J47939A96022L61676J25924k13653K24589j37325
14809E57233A01699M63547J7666j50151Q8355k46702o37K13584B36238K0650K79692
14798E36580l7374k17702J26695n0221j67437J11548A21704K14617J81424j00314
14788D17431J18925A72759L98999j25754l2439O0153r7838M04132C87341J74934
$$ plain form
14860 761497 519591 315920 505817 291341 555320 448108 278308 333463 88390 264508
14850 264508 559541 255100 497905 404406 166254 181852 565036 80555 468216 312188
14840 312188 421187 795114 191226 356089 644425 218616 401979 158730 304673 395157
14830 395157 433183 3360 413104 506076 434824 458759 337419 412512 337018 445865 659070
14819 659070 588863 412867 389469 537408 196022 557698 683622 469969 694558 557233
14809 557233 101699 565246 582912 432761 521116 274414 273777 487361 236238 256888 536580
14798 536580 499206 281504 408199 357978 190541 302089 121704 336321 517745 417431
14788 417431 536356 172759 571758 446004 413565 473718 375880 780012 387341 562275
14778E62275n8933K34775C20215j58209L95504j50585n4139J53435L46412l07351
14768E45282j65640J65627j74875K73651B34576M85622j47150m8672M457L3054
14758E61887j16903L45664l13221O2383J2081B39294J61117K53739C23424K67378
14748E90802k59117L62601l37374M35092l6618j14249l0720j9163j11426J53627
14738F33455K27800j11637R362M60427F01940J67766J18505N4412m14210L72546
14728I00959l2306j26113j48942K9033j72175J30540K62582m01945M74332j94345
14718G21620k06151K16992j78032R7370J82916J16488D44083L67795k0566k16596
14708E74716m9048L76540l6612r7665P605k2975L7815J51000l13743N9337l111
$$ plain form
14778 562275 503342 738117 320215 162006 557510 406925 352786 506221 852633 545282
14768 545282 379642 545269 370394 644045 234576 720198 573048 524376 528833 561887
14758 561887 444984 790648 477427 539810 551891 239294 400411 654150 323424 590802
14748 590802 331685 694286 356912 792004 755386 641137 610417 591254 479828 633455
14738 633455 861255 749618 758980 1219407 601940 769706 888211 942623 528413 900959
14728 900959 868653 742540 593598 622631 450456 580996 843578 441633 915965 721620
14718 721620 515469 732461 554429 651799 834715 951203 444083 811878 791312 574716
14708 574716 525668 902208 865596 767931 775536 752561 790376 941376 627633 686970 683859
14697F83859K22352j21507k69032J93015R0184n5434K67875k04153Q8905l02154
14687E93910N1867O6912J41483l44920j36119N82051N5513k37575j13287L42645
14677A002480j74016j79444o945L76435k74832P63004F93346L10710j29577k34887
14667F39592K53130M3957k88314k7030L62427m53123L54883J68053k14180N02884
14657A342279k40443p2888J25085j68138j84257M46234j78157J35998l46185J05903
14647I65431q0418K9636k12765N96799k78749j84919r1110J2674J62982J30663
14637A050224j3419k6931j0235K68465j01091j59891p5714K94032L6431k12791
14627A049080K49092n6299l2853R6067j56433L40696l15178l523l01528L65066
$$ plain form
14697 683859 906211 784704 515672 708687 798871 743437 1011312 807159 896064 593910
14687 593910 645777 712689 854172 509252 373133 955184 1010697 773122 659835 1002480
14677 1002480 828464 649020 642075 1018510 743678 1506682 693346 1004056 874479 639592
14667 639592 892722 936679 648365 621335 983762 530639 885522 1053575 839395 1342279
14657 1342279 1101836 1028948 1154033 985895 801638 1247872 1069715 1205713 859528 965431
14647 965431 885013 914649 701884 1298683 1019934 835015 743905 756579 919561 1050224
14637 1050224 1036805 1009874 999639 1268104 1167013 1007122 931408 1225440 1261871 1049080
14627 1049080 1298172 1241873 1209020 1305087 1148654 1489350 1174172 1170649 869121 1234187
14617A234187R6048J8456o5165J98853N8082l13289j76498L68932J29169k00623
14607A348152r9983L17737j74375n1207j75021N23640q2281j48499N4878J15544
14597A628585j91570r7119J74K30338k58908J52725n9911J10055R4115j35857
14587A472627L11127Q7960j38589r5518j26315j03267J5598R0685J3267J19412
14577A646987R6385M04430k61991J12894k04662P0247k6922K6918Q5921q4382
14567A865825J57427j46819K04000k2824M09492l76510J79685k35543r6881K17890
14557B155742K64359K84151K64415k17997L23345K18052O51582Q01185J913871
14548F658705M005880R574519J7742472J976371j9629631H999996D486795j516110
$$ plain form
14617 1234187 1330235 1348691 1283526 1482379 1540461 1227172 1050674 1419606 1548775 1348152
14607 1348152 1248169 1565906 1391531 1340324 1165303 1688943 1606662 1458163 1513041 1628585
14597 1628585 1437015 1339896 1340070 1570408 1311500 1464225 1404314 1514369 1608484 1472627
14587 1472627 1783754 1871714 1733125 1637607 1511292 1408025 1423623 1514308 1527575 1646987
14577 1646987 1743372 2147802 1885811 1998705 1794043 1864290 1837368 1864286 1950207 1865825
14567 1865825 2023252 1876433 2080433 2057609 2467101 2090591 2270276 2034733 1937852 2155742
14557 2155742 2420101 2704252 2968667 2750670 3074015 3292067 3943649 4744834 6658705
14548 6658705 10664585 20239104 37981576 39957947 20328316 8999996 4486795 2970685
14540B970685o01090l76225k15122J88614j92842j36832M17679k91345j05425
14531A658097K08179k30394L53950j70715L15944J06326l38778K85291l00683
14522A887217M35272l69493L40429k5777j64777J76611j02971L80439l40011Q7610
14512B304549M8019o487j20277J40217K9008J76657l59008J20287P1337L89221
14502B793523m65629M63997q1659k77256J76528K45896j270l4041J15265R7060
14492C032414l68253J41217L04650j99933L2697L1940J08692l2656K50644k06056
14482C095356K52455k34350J30570j78079K25303J17546J55044K85211j87855
14473C661201L24559k12692k15672J75516J14929o5618K44697j05214l8525L62417
$$ plain form
14540 2970685 2369595 1993370 1778248 1966862 1774020 1637188 2054867 1763522 1658097
14531 1658097 1866276 1635882 1989832 1819117 2135061 2241387 1902609 2187900 1887217
14522 1887217 2322489 1952996 2293425 2267648 2102871 2279482 2176511 2556950 2216939 2304549
14512 2304549 2352568 2346081 2225804 2366021 2395029 2571686 2212678 2332965 2404302 2793523
14502 2793523 2327894 2791891 2710232 2432976 2609504 2855400 2854130 2820089 2935354 3032414
14492 3032414 2664161 2805378 3110028 2910095 2942792 2974732 3083424 3050768 3301412 3095356
14482 3095356 3347811 3113461 3244031 3065952 3291255 3408801 3563845 3849056 3661201
14473 3661201 3985760 3773068 3557396 3732912 3847841 3782223 4026920 3921706 3883181 4245598
14463D245598k60081j82513J71123L07700L33533j25896k11401R3819K82518j41568
14453D512832J1358K711M03983j22541L0986m5797K71356k25852N14505k7023
14443E326518k51507K00973q9919o8282L84843l52869K14012K51857j38274K23906
14433E701258j32931K77561R564L37011k24457K33565j07322J16559Q0151j18950
14423F172009L07628J41256o2557J34168M90308k0234j38597K81488N2447N0081
14413G407997M36814K03097n9840n5866L43193k02877Q9608J61942r4063K40440
14403H470445r0077N16153J45199o4907N0247M50141k61496N84952L91638k86188
14393I906107J45080M25182J61159k38254O98294J12367K44302j59952M84115
$$ plain form
14463 4245598 3985517 3803004 3974127 4281827 4615360 4489464 4278063 4371882 4654400 4512832
14453 4512832 4524190 4526901 4930884 4808343 4839329 4793532 5064888 4839036 5353541 5326518
14443 5326518 5075011 5275984 5186065 5117783 5502626 5149757 5363769 5615626 5477352 5701258
14433 5701258 5568327 5845888 5855452 6192463 5968006 6201571 6094249 6210808 6290959 6172009
14423 6172009 6479637 6620893 6558336 6692504 7182812 7162578 7023981 7305469 7357916 7407997
14413 7407997 7844811 8047908 7988068 7932202 8275395 8072518 8162126 8324068 8230005 8470445
14403 8470445 8380368 8896521 9041720 8976813 9027060 9477201 9215705 9800657 10192295 9906107
14393 9906107 10051187 10476369 10637528 10399274 11097568 11209935 11454237 11294285 11778400
14384A1778400J26117J23907L48828L53966J01389L57825j46130L76620J36110
14375A3557032M74310L86363j29558P73608K43353K2934M98641M85573j24004
14366A6188252P31214r7314O91312L33546L61698N36066q100O50358L96945O31242
14356B0415219O11511L78652M07468J56357R87099L4513R48304O16720L17703
14347B4873546J014109M45941N12496J041128P43239Q60500P55442O04580Q04771
14338C1655752J046223P05001R33560J348326O16156R49272J528390J228397J031127
14329D1042204J537589J105643J586560J572780J325948J581259J784949J710519
14321E3247451J690289K335950J669532K419757K310813K404323K657915K645499
$$ plain form
14384 11778400 11904517 12028424 12377252 12731218 12832607 13190432 13044302 13420922 13557032
14375 13557032 14031342 14417705 14288147 15061755 15305108 15328042 15826683 16312256 16188252
14366 16188252 16919466 16822152 17513464 17847010 18208708 18744774 18736674 19387032 19783977 20415219
14356 20415219 21026730 21405382 21812850 21969207 22956306 22990819 23939123 24555843 24873546
14347 24873546 25887655 26333596 26846092 27887220 28630459 29490959 30246401 30850981 31655752
14338 31655752 32701975 33406976 34340536 35688862 36305018 37254290 38782680 40011077 41042204
14329 41042204 42579793 43685436 45271996 46844776 48170724 49751983 51536932 53247451
14321 53247451 54937740 57273690 58943222 61362979 63673792 66078115 68736030 71381529
14313G1381529K871467K720975L282341L347974L445360M043465L445610M900087
14305I9438808M185369M842183M823253N645473N754917O010098O459516O852107
14297A44011724P467444P812966Q013249R133063R426029J0146691J0654177J1045825
14289B17711168J2051381J2440858J3344943J3830505J4622683J4695894J5313571
14282C14011003J5922449J5721886J5452838J5399354J4750616J3995279J2924340
14275D18177765J1208238R387852N708422J147692o53192j99905k832980L26871
14267D42270763l755048q228655q483818r672456j2200309j3427667j5052162
14260C71450648j6113489j6161591j5786066j6065655j5444715j4598534j3773770
$$ plain form
14313 71381529 74252996 76973971 80256312 83604286 87049646 91093111 94538721 99438808
14305 99438808 103624177 108466360 113289613 118935086 124690003 130700101 137159617 144011724
14297 144011724 151479168 159292134 167305383 176438446 185864475 196011166 206665343 217711168
14289 217711168 229762549 242203407 255548350 269378855 284001538 298697432 314011003
14282 314011003 329933452 345655338 361108176 376507530 391258146 405253425 418177765
14275 418177765 429386003 438773855 444482277 445629969 444976777 444776872 441943892 442270763
14267 442270763 438515715 430287060 421803242 412130786 399930477 386502810 371450648
14260 371450648 355337159 339175568 323389502 307323847 291879132 277280598 263506828
14253B63506828j3392506j3570097j2408598j1638189j1068523j0431045r505333
14246A81492537r754176q680352p649153p912921p078746o801341o521787o077285
14238A21016776m758848n723790m757442m776683m307460m154322l971773l090619
14230H5475839l838767l278893l127208l104174k693185k646721k435464k526353
14222F1825074k070983k016422j946478j678683k336808j986616j138795j540198
14214D7110091j635482r71184j686661j156206j810617r78008m97862j118733
14206C7255338r05912j416513q47090j234005j088227m12737m36768j008455q67340
14197B9038291r47804r04973m28422o91685l44354j136098m23686m93601n25492
$$ plain form
14253 263506828 250114322 236544225 224135627 212497438 201428915 190997870 181492537
14246 181492537 171738361 163058009 155408856 147495935 140417189 133615848 127094061 121016776
14238 121016776 116257928 110534138 105776696 101000013 96692553 92538231 88566458 85475839
14230 85475839 81637072 78358179 75230971 72126797 69433612 66786891 64351427 61825074
14222 61825074 59754091 57737669 55791191 54112508 51775700 49789084 48650289 47110091
14214 47110091 45474609 44503425 42816764 41660558 39849941 38871933 38374071 37255338
14206 37255338 36349426 34932913 34085823 32851818 31763591 31350854 30914086 29905631 29038291
14197 29038291 28090487 27185514 26757092 26065407 25721053 24584955 24161269 23667668 23142176
14188B3142176q99239j59282p75901n41985l45462l61348n54276k94776m05787
14179A8804120l99114l50378n32067k1535o08858k33577k77637l31048j82264
14170A5867642p51563R2101n97924k55704o4583n50858q2004k19880k65810l74449
14160A2796968r1520m8547l54599j58632j49592k13218j93030n93023J0945l75380
14150A0630372M8058j89225j25874k08928j63984l08301j3020Q2125o90889K84055
14140I344389k46096J8183m0054n49670K333j2316m04624L34829k35236j83785
14130H027953j16481r4679j31776k0847m36165J47041m12998K93249j49632k38988
14120F866677n5881j32334j79977n466M1217l7658l99712J04080L5564L44021
$$ plain form
14188 23142176 22242937 22083655 21307754 20765769 20420307 20058959 19504683 19209907 18804120
14179 18804120 18405006 18054628 17522561 17501026 16892168 16658591 16380954 16049906 15867642
14170 15867642 15116079 15208180 14610256 14354552 14289969 13739111 13657107 13437227 13171417 12796968
14160 12796968 12705448 12656901 12302302 12143670 11994078 11780860 11587830 10994807 11005752 10630372
14150 10630372 10678430 10489205 10363331 10154403 9990419 9682118 9669098 9751223 9060334 9344389
14140 9344389 9098293 9116476 9076422 8526752 8529085 8516769 8112145 8446974 8211738 8027953
14130 8027953 7911472 7816793 7685017 7664170 7228005 7375046 6962048 7255297 7105665 6866677
14120 6866677 6810796 6678462 6498485 6493019 6534236 6496578 6096866 6200946 6236510 6580531
14110F580531o24317K43872k14695k62034j2785l10730J37443j96160k2073L2214
14100E351266m33916K11727K5649K6454K803j59172o2792j77398K6046p7527J37040
14089D870180k65043P3047m5348l1037j48432R6591j43022j95826Q8142r0734
14079D208518P5658j50283j86156j759J87323q1550l03051J24704m7738N7506
14069C883172j61065j66612K28858k14974P1442L61654m16520j23297J63588K8769
14059C655015j78856K78278j20514Q2977j34318L3984l96381N22817l95287j61968
14049C185747j74664J63465k64409K69815j74113j49667K01441j517k15998r8738
14039B741362o3936J61622k59409K77279j66721K88842j84283j10158k42070L90314
$$ plain form
14110 6580531 5956214 6200086 5985391 5723357 5710572 5399842 5537285 5341125 5319052 5351266
14100 5351266 4917350 5129077 5154726 5181180 5183983 5024811 4962019 4784621 4810667 4733140 4870180
14089 4870180 4605137 4678184 4632836 4601799 4453367 4549958 4406936 4211110 4299252 4208518
14079 4208518 4284176 4133893 3947737 3945978 4133301 4051751 3748700 3873404 3825666 3883172
14069 3883172 3722107 3555495 3784353 3569379 3640821 4002475 3585955 3462658 3626246 3655015
14059 3655015 3476159 3754437 3633923 3716900 3582582 3616566 3220185 3743002 3347715 3185747
14049 3185747 3011083 3174548 2910139 3179954 3005841 2856174 3057615 3056098 2840100 2741362
14039 2741362 2677426 2839048 2579639 2856918 2690197 2979039 2794756 2684598 2442528 2832842
14029B832842J1763Q8224r4970p8130k67466j74440r1570j69873J83228r4336
14019B145272K36053n399j8586J21121k58790K50513j21999j85359j60414M210
14009B006622o8091R6077k07102P1941J73808l90716L42915j02572P1155k48194
13999A745843J32205j30305N4935j31183j0273K38559j89186P4493l09331P44789
13989B220546Q77563K904880P723218J8715937Q830237j6500447A1664456m422567
13981G241889k068967q32569n76798n10257j12802l47849k67069L7890O1823k08150
13971B417141J31723m83377k5707q749J15392K94345o21067O9400J13681k21653
13961A781129J08832j94363J44621L60406m88428J40712J32558l09902K18647
$$ plain form
14029 2832842 2844605 2932829 2837859 2759729 2492263 2317823 2226253 2056380 2239608 2145272
14019 2145272 2381325 2375926 2357340 2478461 2219671 2470184 2348185 2162826 2002412 2006622
14009 2006622 1938531 2034608 1827506 1899447 2073255 1682539 2025454 1922882 1994037 1745843
13999 1745843 1878048 1747743 1802678 1671495 1661222 1899781 1710595 1785088 1475757 2220546
13989 2220546 3098109 6002989 13726207 32442144 41272381 24771934 11664456 7241889
13981 7241889 5172922 4340353 3763555 3253298 3140496 2792647 2525578 2563468 2625291 2417141
13971 2417141 2548864 2065487 2039780 2031031 2146423 2440768 1819701 1889101 2002782 1781129
13961 1781129 1889961 1695598 1840219 2200625 1712197 1852909 1985467 1675565 1894212
13952A894212l51591K77682k56938k55648N12879k51845Q3310Q8675j96691j84795
13942A359250q8670M76853L659k02432k03441P8774m4927K73724j90805L5381
13932A497366N8368m58762P55439l43985R2068n2115k41465j65907n0670M09122
13922A499459k8895p6493j48486J51250K92768l82839p5283J93142J39173l65761
13912A198035K77014j43713k31986m5229q4451M19266j47594J6528n55496M82550
13902A184924J27364j80540J17731n9839N2170M9907k8627j63298j02588K7091
13892A024295J34752Q9823k3786j06712J10203P0308l73764L64581l26269m5833
13882I17598K52423J10176m38396L29459m45624K4801J60641J74581R8102j47495
$$ plain form
13952 1894212 1542621 1820303 1563365 1307717 1820596 1568751 1652061 1740736 1544045 1359250
13942 1359250 1270580 1747433 1751092 1548660 1345219 1423993 1379066 1652790 1461985 1497366
13932 1497366 1555734 1096972 1852411 1508426 1600494 1548379 1306914 1141007 1090337 1499459
13922 1499459 1470564 1394071 1245585 1396835 1689603 1306764 1231481 1424623 1563796 1198035
13912 1198035 1475049 1331336 1099350 1054121 969670 1388936 1241342 1257870 702374 1184924
13902 1184924 1312288 1131748 1249479 1189640 1241810 1291717 1263090 1099792 997204 1024295
13892 1024295 1159047 1248870 1225084 1118372 1228575 1298883 925119 1289700 963431 917598
13882 917598 1170021 1280197 841801 1171260 725636 750437 911078 1085659 1183761 1036266
13872A036266j06845J26793k37871P3096O6996o2543j10422O36996F88508j04771
13862E83737L40775O1457p0592j45001Q1855K3799j72601N0378J8509J93456j7310
13851I48462k09267K10601j76176J24460J64275j79491K05654j8983l28111J70232
13841I11656k53675M35424j74164j53296P0743l0327M61169o29456L73592j26230
13831H85436N2939j58250j9766R1571j15579q7151J89165j72490K04279L6463
13821I06617k67207K73305r9252j59887P7581O6727j91207Q1101j92967J28108
13811F22919k05485L93725m3027k08245j29303K16722j2542K23007K24582m33574
13801F48779J79534l12417N25590l84648M37002l50664j70773J81979j2339J3425
$$ plain form
13872 1036266 929421 1056214 818343 891439 958435 895892 785470 1422466 688508 583737
13862 583737 924512 985969 915377 770376 852231 876030 703429 753807 772316 965772 948462
13851 948462 739195 949796 773620 898080 1062355 882864 1088518 1069535 741424 911656
13841 911656 657981 1093405 919241 765945 836688 806361 1267530 638074 1011666 885436
13831 885436 938375 780125 760359 851930 736351 649200 838365 665875 870154 906617
13821 906617 639410 912715 813463 653576 731157 797884 606677 687778 494811 622919
13811 622919 417434 811159 768132 559887 430584 647306 634764 857771 1082353 648779
13801 648779 828313 515896 1041486 656838 1093840 743176 572403 754382 742043 755468
13791G55468q8247r0876r4580K17682C49329M83975B54220K41984m2442r9112
13781C54650G2959M37006J64422r570l2647j70042M83888k24823M1775j34895
13771F28073p5987K76923k72863M25377m53706K36363B76263O80483l45319j9760
13761E91667K9800J48012J39404l74915o6664J64467k8101j81423k7285J60839
13751E55801J7531k30095K4259K32951P105j61281O9915j27420o4939J47950J82664
13740F54441j53170K99176l91524J89535j10001P3308k7903L6460k28624J62972
13730E04670J44651N1308j88571k37576L03553j4895K3279p0841K37081j08627
13720F44032C10963e9075D16970j60790J97821r5801J79150R7701k76531m8803
$$ plain form
13791 755468 667221 576345 481765 699447 349329 833304 254220 496204 453762 354650
13781 354650 72959 509965 674387 664817 632170 462128 946016 721193 762968 628073
13771 628073 552086 829009 556146 981523 527817 764180 276263 956746 611427 591667
13761 591667 621467 769479 908883 533968 467304 631771 603670 422247 394962 555801
13751 555801 573332 343237 367496 600447 607552 446271 516186 388766 323827 471777 654441
13740 654441 501271 800447 408923 598458 488457 561765 533862 570322 341698 504670
13730 504670 649321 700629 512058 274482 578035 563140 586419 515578 752659 644032
13720 644032 310963 -59075 416970 256180 454001 358200 537350 635051 358520 309717
13710C09717N01611j30012B01304L27323L14753D02898K41276J27056B28007l4817
13700A93190J04838R0537J02435J929j51816L380K65835R4474B38949M2858J90587
13689D72394k29048L20715j30534R8504k11398j33600N7645K69266k56482m0503
13679B16959K4998K28822A79244K74431P7592n9740j86912J67451A1666N63801
13669E75467k03043j58849A4746N30068J07245P9760j76053k47253O0609J96341
13659E65463k71293j04365K49145k888n0813I1507L72766n3123j40069k9663r5869
13648A45549K62923K09816J09846a00749C28978n8610M21705k94767q0820O2293
13638C78779j26086M22476k91908A12807J28653M3926L31060k05171q3042j31032
$$ plain form
13710 309717 811328 681316 201304 528627 843380 402898 644174 771230 228007 193190
13700 193190 298028 388565 491000 492929 341113 344493 610328 704802 238949 281807 472394
13689 472394 243346 564061 433527 532031 320633 187033 244678 513944 257462 216959
13679 216959 241957 470779 179244 453675 531267 471527 284615 452066 11666 575467
13669 575467 372424 213575 14746 544814 652059 731819 555766 308513 369122 565463
13659 565463 294170 189805 438950 436062 385249 91507 464273 411150 271081 241418 145549
13648 145549 408472 618288 728134 -100749 328978 270368 692073 397306 316486 378779
13638 378779 252693 675169 383261 112807 241460 285386 616446 411275 328233 197201
13628A97201J44499q2478m1303n2199m1342J10917J67827A69367K73008k2615
13618D19760j47180K16712j40218J50833j04276j68286J15868A64013M22908A08102
13607A70349O3031o9727L24566j64999J52121J74437A37078J56793n4690K3529
13597B62710J55582k05592l2045k2940A5950L08127R144L05095m4893J43532A51390
13585A83253G0168O04513B33146J069P6224L8086j20049C796K87944A20563K37368
13574C57931k5701J31177k12609J68184A87633M4906Q83C9526L31230a0855m7157
13563e8012D78869R0708B83127I1060M82979B9820M61193A02196a38927I3631
13552D09593j9702j40795N2854b3321B77787n1146j2561k4863L4678J29279p8617
$$ plain form
13628 197201 341700 259222 217919 165720 124378 235295 403122 169367 442375 419760
13618 419760 272580 489292 349074 499907 395631 227345 343213 164013 586921 108102
13607 170349 233380 163653 488219 323220 475341 649778 137078 293871 239181 262710
13597 262710 418292 212700 180655 157715 15950 324077 333221 638316 593423 736955 151390
13585 183253 70168 674681 233146 234215 310439 348525 228476 3796 291740 120563 357931
13574 357931 332230 463407 250798 418982 187633 232539 233422 39526 370756 -10855 -58012
13563 -58012 478869 569577 283127 91060 574039 29820 491013 102196 -138927 93631
13552 409593 389891 249096 301950 -23321 277787 226641 214080 189217 223895 353174 274557
13541B74557E9470J50296K51269A90905I4918l9237K17059D1930b0384D58481
13530B95079J06765A4681O3483J31259q2624O6096J95814j34358J69467q0011
13520C43807f4985B72983L7533M09976A34419k9142M64364r0826o1270j62815
13510B54730P8933M9017j76550r199K41093n4098A41491o9944L2928a2157A49355
13498B82522j33480F9244c2563E28541k209j58149o6486p2158I9281a38141e5523
13486A30190N1432p2517J7601d8523r7960C99148A80481J67474j08911K81422
13476E20466A79479Q0900j25173L92966j84544A2666L42690N1260j82903I7817
13465A84870L89755B07340J85502H1093k8995J08795b9500A22198J33019J17623
$$ plain form
13541 274557 59470 209766 461035 190905 94918 55681 272740 41930 -20384 458481
13530 295079 401844 14681 78164 209423 126799 192895 388709 254351 423818 343807
13520 343807 -64985 272983 310516 720492 134419 105277 569641 478815 417545 254730
13510 254730 333663 382680 206130 196931 438024 383926 141491 71547 104475 -12157 149355
13498 282522 149042 69244 -32563 528541 526332 368183 301697 229539 99281 -138141 -55523
13486 130190 181622 109105 126706 -48523 -146483 399148 180481 347955 239044 520466
13476 520466 179479 260379 135206 528172 343628 12666 355356 406616 223713 97817
13465 184870 574625 207340 392842 81093 52098 160893 -29500 122198 255217 372840
13455C72840j24101A06766b1397o416E28109B42209o251k7991R0715j12925J20496
13444C06253J0186O1204C6094J67489b0202A53661J60751E7726J13241p0145D7588
13432B64511G2221J0348a28666C08145I7897K50128g9196B59840Q7856A08224
13421h3814C09096B726K88769N5280B1404K53893n7293J28020j3329a62257B91996
13409A51181K00445c1581A41265p0005a0206m1035E3664J11687b0491B69988j01247
13398A68741L36341A97729q3551J47895P0187q4346k1753q3825j5769P2618p1051
13387A28134K88937j58381a71830C4320c4892A14120d8684A50326J40045H3182
13376C34201I9399J26410J60292G744e8955G214K94456J33303j79032J57511j22958
$$ plain form
13455 372840 248739 106766 -21397 -27813 528109 242209 235958 207967 298682 185757 306253
13444 306253 316439 377643 36094 203583 -20202 153661 314412 57726 170967 100822 47588
13432 264511 72221 82569 -128666 308145 97897 348025 -79196 259840 347696 108224
13421 -83814 309096 2726 291495 346775 21404 275297 218004 346024 332695 -162257 291996
13409 151181 351626 -31581 141265 71260 -10206 -51241 53664 165351 -20491 269988 168741
13398 168741 505082 197729 114178 262073 332260 247914 226161 142336 126567 199185 128134
13387 128134 417071 258690 -171830 34320 -34892 114120 -48684 150326 290371 83182
13376 334201 99399 225809 386101 7744 -58955 7214 301670 434973 255941 413452 290494
13365B90494J19834a0427C3341M23376k02556i5379c2094A03760O986K14862a27069
13353B54176m3255A03990O8513c75985C79845P6638B09328M9670r4127M0812L7571
13342B43254K3090G0697a17795C50967A16237k070d881D15785r3773a2789A40909
13330C61403j19573j11495K48690j09200a4603I4110J37137a63110C13269A42729
13319E0957b3001A99633a44418B87772q1209J54277G5630J19218J07789J63118
13309D65755G7059P6091j1245J84028a6763A75043a4301j0607A81924A341K79119
13298B80460L8823d5634C2652a04564A18286j7120m2292J33384a28336A70680
13287A68789C8801K49260n2116J69325O3193j95265i4487B23555f4017q6680C79840
$$ plain form
13365 290494 410328 -10427 33341 456717 254161 -95379 -32094 103760 110746 325608 -127069
13353 254176 210921 103990 172503 -375985 379845 456483 209328 258998 164871 205683 243254
13342 243254 266344 70697 -117795 350967 116237 114167 -4881 415785 322012 -12789 140909
13330 361403 241830 130335 379025 269825 -14603 94110 231247 -163110 313269 142729
13319 50957 -23001 199633 -144418 287772 206563 360840 75630 194848 302637 465755
13309 465755 77059 153150 141905 325933 -16763 175043 -14301 -24908 181924 1341 280460
13298 280460 319283 -45634 32652 -104564 118286 101166 58874 192258 -128336 170680
13287 168789 38801 288061 235945 405270 468463 273198 -94487 223555 -64017 -150697 379840
13275E1051K85942j21529A05258P485J82428A14323D8361b15267A17838k2122
13265I5716R3426q9777J85955e6668C81589j76658n6037a49740b5116B89105a21386
13253B59167A19590J67322l308A03042K5216O580m5003J05689a41804A66764K49436
13242D16200c08308c7103j10700B27769A8110b1267A73373O2855B8918L01451
13232C30369E1807L2374J98414a6392o1511j68945A04761J17970a20548E16086
13221B16769b31223A49025Q2119C052a00541C75742d6614A46302P1228I2742a1499
13209b13465b6378B27913I7510A1979L6601N0496J83404D5108J51073f793A17783
13197i4533A40583E6888K42333H9858a11791B56967Q5095j37095G6496e08969
$$ plain form
13275 51051 336993 215464 105258 112743 295171 114323 48361 -215267 117838 95716
13265 95716 189142 99365 285320 -56668 381589 204931 148894 -149740 -25116 289105 -121386
13253 259167 119590 286912 283604 103042 128258 134838 89835 195524 -141804 166764 416200
13242 416200 -308308 -37103 -147803 227769 18110 -21267 173373 236228 28918 330369
13232 330369 51807 84181 282595 -16392 -77903 -246848 104761 222731 -120548 516086
13221 216769 -231223 149025 231144 3052 -100541 375742 -46614 146302 217530 92742 -11499
13209 -213465 -26378 227913 97510 11979 48580 99076 282480 45108 196181 -6793 117783
13197 -94533 140583 56888 299221 89858 -111791 256967 342062 204967 76496 -508969
13186g9027B0018J43262K37100A90684o6329L53024j94006j39228g1835n6985
13176a28820E7617g4879A48006g3286C29255l6762b74227B73941G9642a61885
13165a25043a6627B60415G0420K70466D8484B2805a29109G1844J01418m4540N9261
13154A87983d22044a14679A28527E4242B1126a6468I1613J14092B3785b47673
13143C11994c46090J47481B05813A8204N00209G9573E261a44858E25113E6238
13132A40260K0610N8856P3148a7373o0607b4019l46914G8592a73378O5516B74409
13120G4402Q7086E2453N035J5394L6880c432B23334d4482A61764F9970o70b5051
13107B60916i3903A718a60487K3880C10566j12958o4896o095J45909r3976l1242
$$ plain form
13186 -79027 20018 163280 400380 190684 124355 477379 283373 144145 -71835 -128820
13176 -128820 57617 -74879 148006 -73286 329255 292493 -274227 273941 79642 -161885
13165 -125043 -16627 260415 70420 340886 48484 22805 -129109 71844 173262 128722 187983
13154 187983 -422044 -114679 128527 54242 21126 -16468 91613 205705 23785 -247673
13143 311994 -346090 -198609 205813 18204 518413 79573 5261 -144858 525113 56238
13132 140260 160870 219726 292874 -17373 -77980 -24019 -370933 78592 -173378 -107862 274409
13120 74402 161488 52453 57488 72882 109762 -3432 223334 -44482 161764 69970 69300 -25051
13107 260916 -93903 1718 -160487 -136607 310566 197608 132712 126617 272526 178550 147308
13096A47308b7401A86858A4211L39779H1345C4156K98944j30416p0981f4936c571
13084b57939I3816a25267A83411B6352e7679B60925g2714A85123K5987H1367K01706
13073B83073j20587a53050o7758D2689J84832A4382K09813H4663a86773A36471
13062A58509K44676m9634j11624D4781J53857F1926P8896c057C08125d2663A94976
13050E09530H6426i9453C01578J3392k9134P5250H5291l4208J34500b50214L0143
13039b20071F0345b03449B56731b07938n3749d3536k5703G2209O239J5204a9706
13027b6749l08801A58904J3859a41404e6960L626A14625A4405L55010B0785K7824
13016D8609J85854q1650L03417A88343L0855N6288O8119G5777a23014A84059b657
$$ plain form
13096 147308 -27401 186858 14211 353990 81345 34156 333100 202684 131703 -64936 -3571
13084 -257939 93816 -125267 183411 26352 -57679 260925 -72714 185123 211110 81367 283073
13073 283073 162486 -153050 -220808 42689 227521 14382 224195 84663 -186773 136471
13062 158509 403185 353551 241927 44781 198638 61926 140822 -3057 308125 -42663 194976
13050 509530 86426 -99453 301578 314970 285836 361086 85291 51083 185583 -250214 -220071
13039 -220071 60345 -203449 256731 -207938 -261687 -43536 -69239 72209 78448 93652 -19706
13027 -26749 -335550 158904 172763 -141404 -56960 -53334 114625 14405 369415 20785 48609
13016 48609 234463 152813 456230 188343 219198 275486 343605 75777 -123014 184059 -2657
13004B2820f9758I1331N2941g5244C2932O0221L5487B3380J13470J41730a10532
12992E3621L1425J9572b3491D3840b65223B0145Q6544J9671b26985B25380o9262
12981A56118M5336a62748g511j84995A61975n8617a44311j62244A78329p3845
12971A04484c22285A40312b24377G6456N4470L95340E9922a04290k99059a48099
12960g2640j54341A13313j3838J46597h4328K7791I2489b37003A44620J74315
12950C18935Q5807a05167A2339a83535A91137J26268a8743j32152A28255a4863
12939H9955L57271g7626A82102M9101a29380A30104o3096e7044A0978a53913B18463
12927b61447C9730b26862A15971M99912B75647a47973K1813F0146J63043b00304
$$ plain form
13004 22820 -69758 91331 144272 -75244 32932 93153 128640 23380 136850 278580 -110532
12992 53621 85046 104618 -23491 43840 -265223 20145 106689 126360 -226985 225380 156118
12981 156118 201454 -162748 -7511 -192506 161975 103358 -144311 -306555 178329 104484
12971 104484 -322285 140312 -224377 76456 130926 526266 59922 -104290 -403349 -148099
12960 -72640 -226981 113313 99475 246072 -84328 -56537 92489 -237003 144620 318935
12950 318935 404742 -105167 12339 -183535 191137 317405 -18743 -150895 128255 -14863
12939 89955 447226 -77626 182102 231203 -129380 130104 67008 -57044 10978 -153913 218463
12927 -261447 39730 -226862 115971 615883 275647 -147973 -126160 60146 223189 -200304
12916a32405f2511j15332B17403i1176F7083C2949D048h23j04891K9262B04185
12904b25231C01160c64149g0660A07970n0430c71405B97324r9763j6989H2168
12893G8258Q6293b69756a11413r3280b963J134A90561J01539B0880g396j9724
12882b7120j80453B25321Q1468a31109a6445p9318A48165n7280J86382a59411
12871A94901F6142E113c64666A49752m6735J23313n1013A5231a3647j13897d046
12859C08564b39256B09914d4213j73023I6465P896k4895l315R6539C5173J45456
12848A80629p2567c73437a6489l5564A17292J72263a2365B07017J4360o1066Q404
12837A68715a38863j03781M0386a278j98442C55914g7282A10497f0117A70204
$$ plain form
12916 -132405 -62511 -177843 217403 -91176 67083 32949 4048 -823 -105714 -76452 204185
12904 -225231 301160 -364149 -70660 107970 57540 -371405 297324 197561 180572 82168
12893 78258 164551 -269756 -111413 -204693 -2963 -1829 190561 292100 20880 -7396 -27120
12882 -27120 -207573 225321 306789 -131109 -16445 -95763 148165 90885 277267 -159411
12871 194901 66142 5113 -364666 149752 103017 226330 175317 15231 -13647 -127544 -4046
12859 308564 -239256 209914 -44213 -217236 96465 104361 79466 76151 172690 35173 180629
12848 180629 108062 -373437 -16489 -52053 117292 289555 -12365 207017 221377 160311 168715
12837 168715 -138863 -242644 -202258 -1278 -199720 355914 -77282 110497 -60117 170204
12826B24902b2969j6017I3175b66782A56446D6709L25320B3021g8645l5420N6431
12815e7634n0080R528A65167b669G7767a8103j4468B0988Q8986J6324e7463C00853
12802A40750a78438A8057e0919j78664G027L82994F0110J46484a9236A07264N1955
12791A59219J19792I1166A2356J60404i4031B24548a24482A81084k1413a38833
12780h2927b3329A57908J05117A26770k3506J91179H1361J68287r9716B0893h7995
12768c3884j39126A6783P4106f1990l10258f1757k1435A76976b06314B3866a84748
12756a52390f7603r434A909J14999O8731e0618C5090K44752a36165B45492o1870
12745A83622D6479a04296A46831J37860c9050m2148e587A03555J23709m947B7150
$$ plain form
12826 224902 -22969 -38986 93175 -266782 156446 46709 372029 23021 -78645 -114065 -57634
12815 -57634 -107714 -98186 165167 -2669 77767 -18103 -32571 20988 109974 126298 -57463 300853
12802 140750 -178438 18057 -50919 -229583 7027 390021 60110 206594 -19236 107264 159219
12791 159219 279011 91166 12356 172760 -94031 224548 -124482 181084 159671 -138833
12780 -82927 -23329 157908 263025 126770 103264 294443 81361 249648 149932 20893 -87995
12768 -33884 -173010 16783 90889 -61990 -372248 -61757 -83192 176976 -206314 23866 -184748
12756 -152390 -67603 -77037 1909 116908 185639 -50618 35090 279842 -136165 245492 183622
12745 183622 46479 -104296 146831 284691 -39050 -81198 -5587 103555 227264 222317 27150
12733a03015j9241d176H5264a85223F6506b1115k2027O805B69729a64275j7741
12722a82016C47291d3605j7033k6598J694B2411J39188p3092f6151G9759L8767
12711A18526k3045A8643P2859M0869b8921A04464J97588B5671a8290D41548i1140
12699B6409d4587A49612a33629n9361e0483B27939H4794e9755A19330E2242K55901
12688C08143A0706a57876A07154n318a49360A14666C5310f4261A61727d8982j34430
12677a83412A27273i0538a7947F7976k1908d995A99994r9545B6180h1503B911
12665C8114a54225e9609A61036h0691K6998A28234a0489n5055B30145J26322j41637
12654B14830l72I1820d4182A27660J38547a56459j15407A24186c1400d538l2604
$$ plain form
12733 -103015 -122256 -4176 85264 -185223 66506 -21115 -43142 -36337 269729 -164275 -182016
12722 -182016 347291 -43605 -60638 -87236 -85542 22411 161599 88507 -66151 79759 118526
12711 118526 95481 18643 91502 132371 -28921 104464 302052 25671 -18290 441548 -91140
12699 26409 -44587 149612 -133629 -192990 -50483 227939 84794 -59755 119330 52242 308143
12688 308143 10706 -157876 107154 101836 -149360 114666 35310 -64261 161727 -48982 -183412
12677 -183412 127273 -90538 -17947 67976 46068 -4995 199994 100449 26180 -81503 2911
12665 38114 -154225 -59609 161036 -80691 -53693 128234 -10489 -65544 230145 356467 214830
12654 214830 214458 91820 -44182 127660 266207 -156459 -271866 124186 -31400 -4538 -37142
12643c7142k14593C20236j52311a28250H8001J76275r4321L8009b17081K8927
12633a88154b6842A48775R4002k8367B8167N9021K89069e1711D02948A53612R0910
12622B44522Q403A08426O1854h827j29695N3770l4170g752E4191f1911j7969H6916
12609A05927c8018B00118d17623a11671A1014L29066e5115J5029B15103l0546
12599A84557A9690M5889a77561A58317f3295j2384B35900E1246a43068C95288
12588b9759j31668a983B11843c11102g4794j47586K8990O2313F072f0423B79922
12576I7821J70663q7331a7546A84982o5200h083j13487C1123K06700Q8377a8027
12564G908h3955B1650o717b70380B30144e1617B17660a00882A88062E7842J86053
$$ plain form
12643 -37142 -251735 320236 167925 -128250 88001 264276 169955 207964 -217081 -188154
12633 -188154 -26842 148775 242777 214410 28167 87188 376257 -51711 402948 153612 244522
12622 244522 252925 108426 170280 -8827 -138522 -84752 -118922 -7752 54191 -61911 -79880 86916
12609 105927 -38018 200118 -417623 -111671 11014 340080 -55115 -40086 215103 184557
12599 184557 19690 65579 -177561 158317 -63295 -75679 235900 51246 -143068 395288
12588 -29759 -161427 -1983 211843 -311102 -74794 -222380 -193390 -131077 6072 -60423 279922
12576 97821 268484 181153 -17546 184982 119782 -8083 -121570 31123 237823 326200 -18027
12564 7908 -83955 21650 14933 -270380 230144 -51617 217660 -100882 188062 57842 243895
12553B43895I3665J84882h8471C79998A89899A7714d688n0710k33662g7205c3356
12541A96335c84801C6288b09078L7797C8635b11452A97432F3559L74053f4334
12530f0823j56434c7312k06355I7727a1424G854K40889c5645B35584L9547F7640
12518C3028L76793B1089b06938B5110h3431k06438J40297m7784R1495D0376a54008
12506A10983J40872C6988a94746N8131B06819k0113e927A75835A3575K4788Q4295
12495A22658a75355b5432m8395C21737d00086A14581a99637C59800I2089b06436
12484a09238o2917J2123r1785I5437a31325j5421B11125a03425F3948i1190j5525
12473a06715A09727d9702E055b6527G4617d0120A40129n9898K381a55564B85670
$$ plain form
12553 243895 93665 278547 -88471 379998 189899 17714 -4688 -55398 -289060 -77205 -33356
12541 196335 -384801 36288 -209078 -171281 38635 -211452 197432 63559 437612 -64334
12530 -60823 -217257 -37312 -243667 97727 -11424 7854 248743 -35645 235584 275131 67640
12518 33028 409821 21089 -206938 25110 -83431 -289869 -149572 -197356 -105861 40376 -154008
12506 110983 251855 36988 -194746 -136615 206819 186706 -5927 175835 13575 38363 122658
12495 122658 -175355 -25432 -73827 321737 -400086 114581 -199637 359800 92089 -206436
12484 -109238 -172155 -160032 -251817 95437 -131325 -146746 211125 -103425 63948 -91190 -106715
12473 -106715 109727 -49702 5055 -26527 74617 -40120 140129 80231 82612 -155564 285670
12461A49627n509G0125j4888a49279k7089g8769j45483a05067j15343a9319A34076
12449H6363b60412A47L15219B1313L0276K558b9139A56712c70960B09076f787
12437B85307a18369p8824G4731O3178n2843a10293A64521d2913E7945a56218j49512
12426c05730Q4982E0216a89476A25447L97541I5572c4610k9149A76208C3518g3679
12414g2660A46910d064F6360K4451A5387b2457A62697K07715b32937o4568a41958
12402h2300k7155j06765A02941a84624B47726C7287J9059b34574f9093I6092K12490
12391C08582a30634d1906R434a1595N207G6399a41556N1591B2353J49275A2922
12379B75951f8199I4660J23869A7979b72976d7430D05072A08124m3440J23901
$$ plain form
12461 149627 144118 70125 55237 -149279 -176368 -78769 -224252 -105067 -220410 -19319 134076
12449 86363 -260412 147 315366 21313 51589 54147 -29139 156712 -370960 209076 -6787
12437 285307 -118369 -197193 74731 137909 85066 -110293 164521 -42913 57945 -156218 -305730
12426 -305730 -220748 50216 -189476 125447 522988 95572 -34610 -63759 176208 33518 -73679
12414 -72660 146910 -4064 66360 90811 15387 -22457 162697 370412 -232937 -297505 -141958
12402 -82300 -109455 -216220 102941 -184624 247726 37287 56346 -234574 -69093 96092 308582
12391 308582 -130634 -41906 -32472 -11595 -6388 76399 -141556 -89965 22353 171628 12922
12379 275951 -68199 94660 218529 17979 -272976 -47430 405072 108124 64684 188585
12369A88585b20317G504K2946N3703a97594B59057b84967a28342C33770j60309
12359A73461b98042A0491N9686a11022b5650p1636m9143B34217a93475l9607h0912
12347H1663e1737C20811A05352b19344B52505b6564H9898P724k768J34022q2826
12336A46050o1611K04831D5607a83838K6538O4206j88212I45b88361B87787d5609
12324a69261e6346B1632d1623n1254E4858J14966A8088c25109A23651l999b07344
12312a49456A55033A125a07806A72681d9147m5278m0448A76027j5378E8696J85469
12301B44165C3743c640j4561B79184j61A3316a20440A54316a10560a269C5186
12289H1276a29266c3880G2880b80848a9192q6032B65210b618B98691j13938G3665
$$ plain form
12369 188585 -220317 7504 30450 84153 -197594 259057 -284967 -128342 333770 173461
12359 173461 -298042 10491 70177 -111022 -25650 -97286 -146429 234217 -193475 -233082 -80912
12347 81663 -51737 320811 105352 -219344 252505 -26564 89898 97622 94854 228876 146050
12336 146050 84439 289270 45607 -183838 -157300 -93094 -281306 945 -288361 287787 -45609
12324 -169261 -56346 21632 -41623 -92877 54858 169824 18088 -325109 123651 119652 -207344
12312 -149456 155033 1125 -107806 172681 -49147 -94425 -134873 176027 160649 58696 244165
12301 244165 33743 -3640 -18201 279184 279023 13316 -120440 154316 -110560 -1269 35186
12289 81276 -129266 -33880 72880 -280848 -19192 -105224 265210 -2618 298691 184753 73665
12277b0842E43370B46249o0294m4283m0648L56337A17833P960j1885J4117k0738
12266A07287P2529J73960j56341i780F49377B28931a60431c2867G5704C1738h8376
12254A90259a3505j05453B503f5271r5397M0948C51585A20472K01970F8262h4782
12242A13550b12591i3178k2227a6759k6726A75736M1721D0545i9906A80158G8699
12230A14313k7805J02865i6825A21369K19543F0685L99927p1366f6530E5715J23747
12219A79462D127K53630K42202I0793b42006g2293B48495C0529K07593i5951A97753
12207B07523G0211f7138D42804j59707A09735R4823i4043E4785N2418d1984C31563
12195A17583L62718A891J22355J51546M1551H092O0008J10319B1627L38719b61217
$$ plain form
12277 -20842 543370 246249 185955 141672 101024 457361 117833 125793 113908 128025 107287
12266 107287 179816 353776 197435 -9780 649377 228931 -160431 -32867 75704 31738 -88376
12254 190259 -13505 -118958 2503 -65271 -160668 -119720 351585 120472 322442 68262 -84782
12242 113550 -212591 -93178 -115405 -16759 -43485 175736 217457 40545 -99906 180158 78699
12230 114313 86508 189373 -96825 121369 340912 60685 460612 389246 -66530 55715 179462
12219 179462 4127 257757 499959 90793 -242006 -72293 248495 30529 238122 -95951 197753
12207 207523 70211 -67138 442804 283097 109735 204558 -94043 54785 107203 -41984 331563
12195 117583 480301 1891 124246 275792 317343 8092 68100 178419 21627 360346 -261217
12183a77559A21653A113a3628E0309J60208F9356J85686m312o5952m1049G88Q6100
12171H6888B3467R6744g6025B2844r004e4851B11071o8133n4274J36299a78307
12159a98683b4370H6884a19276C8021a43587A03097m7792K91051b51199A63990
12148A53763a22446a4667A28773N3878a94612m8102d6098B40849B3873b01994
12137c8041j15891G3853J56408h3397E250K36645b52672j16342D39248a02257
12126F1880N3945K08494j48744a92597Q3474N0464l7338A00194R7899a00486a0649
12114c0070j26894O4106A98869G2193M9163N750J4384g9775B23800c22072A26776
12102b6940B12783h2835r8831A10301J80586b11797a02673D3754L2619K05742
$$ plain form
12183 -177559 121653 1113 -13628 50309 210517 69356 255042 250730 184778 143729 788 86888
12171 86888 23467 120211 -76025 22844 13840 -54851 211071 142938 88664 224963 -178307
12159 -198683 -24370 86884 -119276 38021 -143587 103097 55305 346356 -251199 163990
12148 153763 -122446 -14667 128773 182651 -194612 -242714 -46098 240849 23873 -201994
12137 -38041 -153932 73853 230261 -83397 5250 241895 -252672 -369014 439248 -102257
12126 61880 115825 324319 175575 -192597 -109123 -58659 -95997 100194 198093 -100486 -10649
12114 -30070 -156964 -92858 198869 72193 121356 127106 141490 -79775 223800 -322072 126776
12102 -26940 212783 -82835 -181666 110301 290887 -211797 -102673 43754 76373 282115
12092B82115a18874e3971k8516L4537o238j36458A38559O5795g9209B02969i5918
12080C73430E6314H529J11319c93564a35148B8618A0892J69636O4600l2779R10155
12069A122504O00859E59836B50770b77480B86942h2813a1971A54863c43389J31111
12059b12278n0638A93664a58584b2134A54908E6221H508a79491B06810D1414a36929
12047I0013f6147B1530P1866i7847C70110E9759Q7106d7581o8615F5078K1072
12036H6150b35779B05391D0936A0424J64872H3386N379K23300j13790b89599b0087
12024b53773A52438F3011B5168a55763p5549j71426A47767O8651f1096o2836B19552
12012c320m1895D0590J65394G1989L14116C6917a68531e7595j4084o1667R068
$$ plain form
12092 282115 -118874 -53971 -82487 -47950 -54188 -190646 138559 204354 -79209 202969 -95918
12080 373430 56314 8529 119848 -393564 -135148 28618 10892 180528 245128 212349 1122504
12069 1122504 1723363 559836 250770 -277480 286942 -82813 -11971 154863 -343389 -212278
12059 -212278 -262916 193664 -158584 -22134 154908 56221 8508 -179491 206810 41414 -136929
12047 90013 -66147 21530 93396 -97847 370110 59759 146865 -47581 -116196 65078 86150
12036 86150 -235779 205391 40936 10424 175296 83386 88765 312065 198275 -289599 -20087
12024 -253773 152438 63011 25168 -155763 -231312 -402738 147767 216418 -61096 -123932 219552
12012 -3320 -45215 40590 205984 71989 386105 36917 -168531 -57595 -71679 -133346 -124278
12001a24278d639j67614k8371l8906O2583A96753a05372C82073a88529A58670
11990A74887R8922E993b59877d0420D2942a07982k62484A64805h6896A95413q260
11979A87153b03988k4847q978N1697B28454j7681a05815D2952a32308j9278C5504
11967B91161f9588A77102P4583H8782K07954B1685q813R6609f2129E2560b8663
11955I4457b6208m8212k95821a503A51787i7015F2511d0175D6233N7006J43795
11944B47034E1653O3297P1231l1981o8438b61067B061a14380r7686A92722p4434
11933A18288J03073a01819d3657a7212A50623m5493b70326A68660E6287e06415
11922b09803B84107A28126e3795j12690e8134E9190J59684a84678P2625a2153
$$ plain form
12001 -124278 -4639 -172253 -200624 -239530 -176947 196753 -105372 382073 -188529 158670
11990 174887 273809 5993 -259877 -40420 42942 -107982 -370466 164805 -86896 195413 187153
11979 187153 -203988 -228835 -237813 -186116 228454 210773 -105815 42952 -132308 -151586 35504
11967 291161 -69588 177102 251685 88782 296736 21685 12872 109481 -62129 52560 -28663
11955 94457 -26208 -74420 -370241 -1503 151787 -97015 62511 -40175 46233 103239 247034
11944 247034 51653 114950 186181 154200 85762 -261067 2061 -114380 -212066 192722 118288
11933 118288 221361 -101819 -43657 -17212 150623 105130 -270326 168660 56287 -506415
11922 -209803 284107 128126 -53795 -166485 -58134 59190 218874 -184678 -112053 -12153
11911c08782a08781j96684a1405k12022a2582A03352K64001H8942C7333J59541
11901A96874J45606C1407c1006j04446d1314j14862A31210a35172e5243F9868
11890F5934c15032A1242K94325a24441j53413O1622b5574B23146p4647a28827
11879A1244J13849J02473a9726l21848F2398b58749a27140l70082A99550a11826
11868b09882m0626f1310D7139M4056K60066f7206j79768A18723b17647R5156B2566
11856C32867a78424p05A20836a34198d4839B185J54160B6118a49080j85443F2663
11844h5986H4223O2826G2260N5130n9685c0376j29188A6590a8888j23360A1135
11832e0950p1263C527K34356a81926H4501b48275i7599J960F9112b60469c0690
$$ plain form
11911 -308782 -108781 -305465 -11405 -223427 -12582 103352 367353 88942 37333 196874
11901 196874 342480 31407 -31006 -135452 -41314 -156176 131210 -135172 -55243 69868
11890 65934 -315032 11242 305567 -124441 -277854 -216232 -25574 223146 148499 -128827
11879 11244 125093 227566 -19726 -341574 62398 -258749 -127140 -497222 199550 -111826
11868 -209882 -250508 -61310 47139 91195 351261 -67206 -246974 118723 -217647 -122491 22566
11856 332867 -178424 -179129 120836 -134198 -44839 2185 156345 26118 -149080 -334523 62663
11844 -85986 84223 147049 72260 127390 67705 -30376 -159564 16590 -18888 -142248 11135
11832 -50950 -122213 3527 237883 -181926 84501 -248275 -97599 -95639 69112 -260469 -30690
11820C9785a15632o5152G5570b67053A82305a01423P369o3469C50d0559E5134
11808F1277K36331A37254a70595A05203J49304a08699K9695L7610o6116j18212
11798b25722j60648b6719F8356h4574l97752K02379O9567G2879M3341c41861B64148
11786E4778f9527H3622b44562D50412C6711k511b6888o0953A70734g4030A950
11774A09453b27258b5219C75815b3059a295l93p8468o846C9244h5858l15172b8310
11761A65001J54742A8869a74251c3725j26258e5829C8405J52913G5898d07587
11750A96552g1183j66954a14480n6948c3243A30541a1122k44973Q9494A45048
11739a67124A39247a00181j73721J08901c5468e430A47398J00526H0999a76700
$$ plain form
11820 39785 -115632 -180784 75570 -267053 182305 -101423 -94054 -157523 350 -40559 55134
11808 61277 297608 137254 -170595 105203 254507 -108699 -79004 -41394 -107510 -225722
11798 -225722 -386370 -26719 68356 -84574 -482326 -279947 -210380 72879 116220 -341861 264148
11786 54778 -69527 83622 -244562 450412 36711 34200 -26888 -87841 170734 -74030 1950
11774 109453 -227258 -25219 375815 -23059 -1295 -1688 -80156 -87002 39244 -85858 -401030 -28310
11761 165001 319743 18869 -174251 -33725 -159983 -55829 38405 191318 75898 -407587
11750 196552 -71183 -238137 -114480 -171428 -33243 130541 -11122 -256095 -166601 145048
11739 -167124 139247 -100181 -273902 -165001 -35468 -5430 147398 247924 80999 -176700
11728c02648G4150c03053e3822B47866H7796J98683p5797a3009k46141A35266
11717c7513o8933C16886A04164J54191c1337g740A06558f6273m9354J5845A46338
11705a09714k2896j27090J23270B24677Q4240G510J76423A6975a27000n6349a1632
11693B57725j03269j2217l1918R9581H8122J06757E3689j8011d1683J7360B14625
11681B1578N3872i7547b6821Q907F366a45677k3148p8581b4010C77552A76366
11669A36274m055i3050C3251K4995b58154B74199d0514a7987D9575R8385D6051
11657f9598j64160a09872r861B1677b3273B0288d6268C36347c5349A63897h0353
11645C8538O7654J64270N6098D9618A0399J91570A0809a53840p4383J04435j91542
$$ plain form
11728 -302648 74150 -303053 -53822 247866 87796 286479 210682 -13009 -259150 135266
11717 -37513 -106446 316886 104164 258355 -31337 -7740 106558 -66273 -115627 -99782 146338
11705 -109714 -132610 -259700 -136430 224677 308917 7510 183933 16975 -127000 -183349 -11632
11693 257725 154456 142239 110321 209902 88122 194879 53689 35678 -41683 -24323 214625
11681 21578 75450 -97547 -26821 -17914 6366 -145677 -168825 -247406 -24010 377552 176366
11669 136274 132219 -93050 33251 58246 -258154 274199 -40514 -17987 49575 147960 46051
11657 -69598 -233758 -109872 -119733 21677 -23273 20288 -46268 336347 -35349 163897 -80353
11645 38538 106192 270462 326560 49618 10399 201969 10809 -153840 -228223 -123788 -315330
11634c15330f2360B43722p4771b20880M0310g5039C9789P78f2783j08754C17584
11622B1195J73435k0653P9770a26587B7107a13144d1807K0123k90549a11523F9148
11610A10568P9672e5147E3633J91019E1627Q8824J11461A4375J76925a34868d1137
11598C6433c5621E6021B0326b72397H0797B039K30435b8518I356J2240J30221
11587A51817f3063B6855a29194C8081R4321J23844J36624c2989A78901J76223
11577C55124A30373K95533g0650A33833a37954C24123h7420c4610E4968a99650
11566a35718B72348a6939A05499O0227Q0121Q7551E7915a33317A40708A5746P0907
11555H6653Q6730J69878p1178E2063c367H7601P6537d2498D03825a24392k61751
$$ plain form
11634 -315330 -62360 243722 168951 -220880 -180570 -75039 39789 40567 -62783 -171537 317584
11622 21195 194630 173977 253747 -126587 27107 -113144 -41807 -21684 -312233 -111523 69148
11610 110568 190240 -55147 53633 244652 51627 140451 251912 14375 191300 -134868 -41137
11598 36433 -35621 56021 20326 -272397 80797 2039 232474 -28518 9356 21596 151817
11587 151817 -63063 26855 -129194 38081 132402 256246 392870 -32989 178901 355124
11577 355124 130373 425906 -70650 133833 -137954 324123 -87420 -34610 54968 -199650
11566 -135718 272348 -16939 105499 165726 245847 333398 57915 -133317 140708 15746 86653
11555 86653 173383 343261 272083 52063 -3367 87601 164138 -42498 403825 -124392 -386143
11544c86143C24413a25643J7807A01996J27820J16339f5664A82458a55185B02346
11533i1164k7760e1920r9497A26423o2644f5536A36577C1282a04210C06777e7187
11521A10423K57768A01998b43602B74445a8844A99034G9359J21721H093K20173
11511B28266p6747Q652L4284Q8872J3289l4880k2893c3127A26117K156n1422b055
11498a69769D22558e5608k69448d3870C32154L2949a9333A82494i7927A53118
11487C52282F4323a02084B18867K2108c8439k27687A97286P2922J38425b04785
11476C02294r0753N480D8253J2703R8800J11151C51J96313a4069m6661a9399B66873
11463b81591E8955J34369l8138J74997P166A56432K4493l9073J48438j38966a40041
$$ plain form
11544 -386143 324413 -125643 -107836 101996 229816 346155 -65664 182458 -155185 202346
11533 -91164 -118924 -51920 -151417 126423 63779 -65536 136577 31282 -104210 306777 -57187
11521 110423 368191 101998 -243602 274445 -18844 199034 79359 201080 8093 228266
11511 228266 151519 160171 194455 283327 296616 261736 238843 -33127 126117 128273 76851 -2055
11498 -169769 422558 -55608 -325056 -43870 332154 365103 -19333 182494 -97927 153118
11487 352282 64323 -102084 218867 240975 -38439 -266126 197286 270208 408633 -204785
11476 302294 211541 217021 48253 60956 159756 270907 351 196664 -14069 -60730 -19399 266873
11463 -281591 58955 193324 155186 330183 337349 156432 180925 141852 290290 151324 -140041
11451a9779k85899A17473a02114M6962E5282J77589i513F9671j8272L75466j09302
11440C17563i9486d0164D08706B0045B235a07190A22856l8057h9941D8691M7394
11429I6085b16283A72408B2404b99119B696K37409I2156Q1329a6131D33434c9171
11417A2076i1678j34548j5578D5849i7354A01431m0809a31777K7831m8271B02196
11405E5026L0879A4849b50158B00782M066D4759L2954R1778D0747j4314a82020
11393e5k3962k73572A22336J08503f458j41534r4153c2834j87140H1774a48607
11381C8949M4367h6872j58505A7405K94282F3496g2840p9553B16242j02825b191
11369A09681K09086i6871F8640a2158j06790e0177G3261b26908k7676A9550d2452
$$ plain form
11451 -19779 -305678 117473 -102114 -55152 55282 232871 -9513 69671 51399 426865 317563
11440 317563 -99486 -40164 408706 20045 2235 -107190 122856 84799 -89941 48691 96085
11429 96085 -216283 172408 22404 -299119 2696 240105 92156 173485 -16131 433434 -39171
11417 12076 -91678 -226226 -241804 45849 -97354 101431 60622 -131777 -103946 -152217 202196
11405 55026 85905 14849 -250158 200782 204848 44759 77713 169491 40747 26433 -182020
11393 -55 -24017 -297589 122336 230839 -6458 -147992 -242145 -32834 -219974 81774 -148607
11381 38949 83316 -86872 -245377 17405 311687 63496 -72840 -152393 216242 113417 -2191
11369 109681 318767 -96871 68640 -12158 -118948 -50177 73261 -226908 -254584 19550 -42452
11357A16124i2235C14895A19445C8433d45545B4989J62980J08226a29472D4421
11346A43557l3218a91593P1258B3208K5124J9637a12526j3555A0002L64505q1686
11335B92821B7826d3366k3711F0945c03830e8564H1615l5768b57716c4935A12328
11323b98665G7639M1687K38696j64146g9102j21096A04352a20290a6676m8649
11313f5325F7577e5911A653b36665k9875c0295k21741m7571f4038m9458j67336
11302b80832M0885A31588b2837j01673D41096a32387C07365F6815a33798B3742
11291a60406I2297c7877l38163h6299d1915j24088B00753c904k70901R6543L2859
11280a45403A60035b25938M1496c7149A85330b34492A61902a43946A04128P1670
$$ plain form
11357 116124 -92235 314895 119445 38433 -445545 24989 187969 296195 -129472 44421
11346 143557 110339 -191593 -120335 23208 48332 67969 -112526 -126081 10002 374507 292821
11335 292821 27826 -43366 -67077 60945 -303830 -58564 81615 45847 -257716 -34935 112328
11323 -298665 77639 119326 358022 193876 -79102 -200198 104352 -120290 -16676 -65325
11313 -65325 67577 -55911 1653 -236665 -266540 -30295 -252036 -299607 -64038 -113496 -280832
11302 -280832 -239947 131588 -22837 -124510 441096 -132387 307365 66815 -133798 23742
11291 -160406 92297 -37877 -376040 -86299 -41915 -166003 200753 -3904 -274805 -178262 -145403
11280 -145403 160035 -225938 -184442 -37149 185330 -234492 161902 -143946 104128 175798
11270A75798b12831A19768J44Q332h1824j75763f0791r9630m8880A46701g2982
11258b0694B29745a89755o8253J8098E1682k0738a08921k3915e1865A03437a15637
11246b01032g2902r0923A34003b27699j69581a43067N5908c9213l6508q0279d3997
11234A66268b26651B32390b14282f6357j18322e1176n2094A39290a99738D2745
11223a50734L7258B7098J67081a16237A75840a16364A54859c45746A28b93618
11212i499H3681J11144o7458C8101e3281A86732a07181j11455A47267d96B7911
11200A78707c93315E0677a91401q0741J03948f7519K525b3170E9921c04841B26110
11188C4191B69J30877N0889c51158C1489O8306g99I3741b4327r5258C0506a78468
$$ plain form
11270 175798 -212831 119768 119912 128244 -81824 -257587 -60791 -160421 -209301 146701 -72982
11258 -20694 229745 -189755 -258008 -239910 51682 30944 -108921 -132836 -51865 103437 -115637
11246 -201032 -72902 -163825 134003 -227699 -397280 -143067 -87159 -39213 -75721 -156000 -43997
11234 166268 -226651 232390 -214282 -66357 -184679 -51176 -103270 139290 -199738 42745
11223 -150734 -113476 27098 194179 -116237 175840 -116364 154859 -345746 128 -293618
11212 -9499 83681 194825 127367 38101 -53281 186732 -107181 -218636 147267 -496 27911
11200 178707 -393315 50677 -191401 -272142 -168194 -67519 -64994 -23170 59921 -304841 226110
11188 34191 269 131146 182035 -351158 31489 99795 -799 93741 -24327 -119585 30506 -178468
11175e7837B84438I600R7831m7962P170b4208E3959c04957a7594D6368f6647b2654
11162D1396Q9008q712L9210D4189e9428B78569c8064A13188b53841J13226A26427
11150a47754A16813N5954L2708b2297C899P491h9303k03302C4340I453M35914
11139D45367E9357k6289m115R9639b57238A55759B3664b61908D5770J81913l6968
11128A90715a79140B50241F9877M6396l1558i6742B10317J10504G1266b34734
11117f5411B93335g6457l20591J30520J27867j20195A32463j2623b27509K0618
11107b06891a446G6271b0471A57652H586Q558M2105K41468K3162a81954F77980
11095A37295f917B99356j10938J21279c9789C05934H7878M7725J29413a63377
$$ plain form
11175 -57837 284438 9600 107431 59469 66639 -24208 53959 -304957 -17594 46368 -66647 -22654
11162 41396 130404 121692 160902 44189 -59428 278569 -38064 113188 -253841 -140615 126427
11150 -147754 116813 172767 205475 -22297 3899 11390 -89303 -292605 34340 9453 445367
11139 445367 59357 33068 28953 128592 -257238 155759 23664 -261908 45770 227683 190715
11128 190715 -179140 250241 69877 116273 84715 -96742 210317 320821 71266 -234734
11117 -65411 293335 -76457 -397048 -266528 -138661 -258856 132463 119840 -227509 -206891
11107 -206891 -1446 76271 -20471 157652 8586 17144 59249 300717 323879 -181954 677980
11095 137295 -6917 299356 188418 309697 -39789 305934 87878 135603 265016 -163377
11084B27447g6324J9154C97125c77253A55389f2210j6565B90721a36458C11800
11073C26783q2793K34065D8481L60138o4321j26250i6368B17187f990D53897k07523
11062B46374D1826K49123J99581O7899j28897K30422k64542J37161J55221k50186
11052D37608K11388j22433J35753j2203j27516N4019j70646K51985L9732O621
11042G04308j58060j21040J29601K04906p7750l34099o2033L51709R7303n2915
11032F81930j85134l2939L8008J66944j01601J12814p8115j27544q4139K16960
11022F07184P4665k16401l0683J17492Q8447J61464j38930j90224j42369O29898
11012I60543m26254k55988J7653O5712J06949J17553k87589L04246l2313j07279
$$ plain form
11084 227447 -76324 -57170 397125 -377253 155389 -62210 -78775 290721 -136458 311800
11073 326783 243990 478055 48481 408619 344298 218048 -96368 217187 -6990 453897 246374
11062 246374 41826 290949 490530 558429 429532 659954 395412 532573 687794 437608
11052 437608 648996 526563 662316 650113 522597 576616 405970 657955 697687 704308
11042 704308 546248 425208 554809 759715 681965 347866 285833 637542 734845 681930
11032 681930 496796 463857 501865 668809 567208 680022 601907 474363 390224 607184
11022 607184 681849 465448 434765 552257 640704 802168 663238 473014 330645 960543
11012 960543 534289 278301 295954 361666 468615 586168 298579 602825 570512 463233
11002D63233J6104p9791M46827j32602C40561J11838j28637O30478C74018J18002
10992D92020K93303k30295K0411K04899p3903k12553J40358J51875K4411k1992
10982G88534Q0828o7450K81298K20327m9767j87353L44933L09852K87012K82043
10972B290257P6387L5109J0183j30768j67426r3098r5551m4332m00411k07826
10962A272524J42069j36737K072L26773j80030J72700j38425r6347j06121j52125
10952A106353K1648k15878K0298l68700l7333J0583k04817L5520K4657J8657E428
10940C09218N6465G4436J34280h6501A13640l8034g1831q2170N4556m5410A8326
10928A85042J09208j25656L90099H0789a07335B03310P4357r5903h6524C24957
$$ plain form
11002 463233 479337 399546 846373 713771 340561 452399 323762 954240 374018 492020
10992 492020 785323 555028 575439 780338 706435 493882 634240 786115 810526 788534
10982 788534 869362 801912 1083210 1303537 1253770 1066417 1411350 1721202 2008214 2290257
10972 2290257 2366644 2401753 2411936 2281168 2113742 2020644 1925093 1880761 1480350 1272524
10962 1272524 1414593 1277856 1279928 1606701 1426671 1599371 1460946 1364599 1258478 1106353
10952 1106353 1128001 912123 932421 563721 526388 536971 332154 367674 392331 410988 5428
10940 309218 365683 74436 208716 -86501 113640 75606 -71831 -154001 -99445 -144855 18326
10928 185042 294250 168594 558693 80789 -107335 203310 277667 181764 -86524 324957
10917b68590i4703I6981a71062A42628f996p0937A38963a47280L3608N1027I0502
10905b49967C0516a7274B10786d1094n9201A65856a42469M5577L1907F3621J13104
10894A76725i2062J9148D3995A0065O5511J32325q9170p333J57812a44789K4107
10883a20682C5054a95659O0967B3098a40784A36327J1460E4645c05859c898E9727
10871A58055Q4908c29372j72057i5483D33302a13296p0031B9214Q5515i0104j01968
10860a92072o4080D4895d4709A38161a72494a6987C21918b04278c9708C741a413
10848A00905b42567J07948M8910C8888g8358A50495A1091l388a26859k71118C23553
10836a80354N2520e3318k75475i0662B12243j1341f53523a13277A84207C313J76969
$$ plain form
10917 -268590 -94703 96981 -171062 142628 -6996 -77933 138963 -147280 -113672 -62645 90502
10905 -249967 30516 -17274 210786 -41094 -100295 165856 -142469 -96892 -64985 63621 176725
10894 176725 -92062 -72914 43995 10065 75576 207901 118731 111398 269210 -144789 -120682
10883 -120682 35054 -195659 -134692 23098 -140784 136327 147787 54645 -305859 -3898 59727
10871 158055 242963 -329372 -501429 -95483 433302 -113296 -183327 29214 114729 -90104 -192072
10860 -192072 -256152 44895 -44709 138161 -172494 -16987 321918 -204278 -39708 3741 -1413
10848 100905 -242567 -134619 -85709 38888 -78358 150495 11091 7703 -126859 -397977 323553
10836 -180354 -127834 -53318 -328793 -90662 212243 200902 -653523 -113277 184207 3313 180282
10825A80282a41797j03136k11797B63951e0714m8649A929M7356c46943A10185
10814b24361g7824j9545d6553R143F1788a56798B4919d7417G5605b21369A86489
10802A16440c31153A92646e6061a0642H5830g1632C1607O2684b57011A02223a11055
10790h5464M2262A54807a5251r6447D5870a82501o8892C44715A57872c11123A59995
10778b11388B61030o3110b27802n2596J01779B57532M7216I0193l3746L5652b63605
10766h8190J579b3739j86580B6233N1785a99391B3609g911k15593i0699j6426
10755a07125A97796b76692g1659E2359a2105l2535E0649b18165R9773m8538g4214
10743a73383A89707b59034A23185b47321I6000F62f7770I3215J15862n8062a63063
$$ plain form
10825 180282 -141797 -244933 -456730 263951 -50714 -99363 1929 49285 -346943 110185
10814 -224361 -77824 -97369 -46553 -37410 61788 -156798 24919 -47417 75605 -221369 186489
10802 116440 -331153 192646 -56061 -10642 85830 -71632 31607 94291 -257011 102223 -111055
10790 -85464 -43202 154807 -15251 -111698 45870 -182501 -251393 344715 157872 -311123 159995
10778 -211388 261030 197920 -227802 -280398 -178619 257532 304748 90193 56447 92099 -263605
10766 -88190 -86611 -23739 -210319 26233 78018 -199391 23609 -7911 -223504 -90699 -107125
10755 -107125 197796 -276692 -71659 52359 -12105 -44640 50649 -218165 -118392 -166930 -74214
10743 -173383 189707 -259034 123185 -247321 96000 662 -67770 93215 209077 151015 -163063
10731g9264A1914a82536G2914f5316k143l04573f7797B2149Q6974K27137b80077
10719c96305a21377j34046f0234A1295b62875M5933d1011r1057I8607a98841O9555
10708a29286c3534k18741A4240c56871D2238b7673A14575c2670f203B12714p3105
10697A39609d06021C49052A2427f10275f9018I1685d45441a44429D54186b2127
10686c4227j91233b4761A42726K32876A37014a07479D4974b06981O1773j14402
10676b59610a22971j84838c6898B6798i2301B34262h9138m0929A70920a59132
10665E2240B5645i7084B1013a23427k23667A63224b69644O0937j55130h6282k27345
10654c13627a24826M9403J7184l0375M3856G3330b0135B14607K03611j12147a98053
$$ plain form
10731 -79264 11914 -182536 72914 -65316 -67459 -372032 -67797 22149 109123 336260 -280077
10719 -396305 -121377 -255423 -60234 11295 -262875 -216942 -41011 -132068 98607 -198841 -129286
10708 -129286 -33534 -252275 14240 -356871 42238 -27673 114575 -32670 -6203 212714 139609
10697 139609 -406021 349052 12427 -610275 -69018 91685 -445441 -144429 454186 -22127
10686 -34227 -225460 -24761 142726 375602 137014 -107479 44974 -206981 -145208 -259610
10676 -259610 -122971 -307809 -36898 26798 -92301 234262 -89138 -130067 170920 -159132
10665 52240 25645 -97084 21013 -123427 -347094 163224 -269644 -208707 -363837 -86282 -313627
10654 -313627 -124826 -75423 -58239 -88614 -44758 73330 -20135 214607 418218 306071 -198053
10642C4222c7037o9341j20389A27134g3285Q675F9482a53514A15338J44835A7343
10630A16109a20259A55612a995j3077j35157A77974e0083E0119g9160k19611A01988
10618a22465A90463a90946M2145G5877a73314l874B59628c0924j23739P4098j9602
10607a00167L4940l4123j69433F4023O672e4534r7031A58220o4820a39206R544
10596a29662a1827k58846A52987a87457G8274g0695j67603e9757I8911c76837
10585a11848a4115j89459l2888c2730B23869b41572m737G1289b72946j27167B3449
10573a58273E9330O2944b71113J01401L9290L4499K2746B3710L892g5641A13608
10561A36092d5959j6839G9444C9530a2740C63149a01635j44835e5689o1930o3382
$$ plain form
10642 34222 -37037 -106378 -226767 127134 -73285 -64610 69482 -153514 115338 260173 17343
10630 116109 -120259 155612 -1995 -15072 -150229 177974 -50083 50119 -79160 -298771 101988
10618 -122465 190463 -190946 -148801 75877 -173314 -177188 259628 -30924 -154663 -80565 -100167
10607 -100167 -65227 -99350 -268783 64023 70695 -54534 -151565 158220 93400 -139206 -129662
10596 -129662 -11827 -270673 152987 -187457 78274 -70695 -238298 -59757 98911 -376837
10585 -111848 -14115 -203574 -236462 -32730 223869 -241572 -246309 71289 -272946 -400113 23449
10573 -158273 59330 122274 -271113 -169712 -130422 -95923 -73177 23710 27602 -75641 113608
10561 136092 -45959 -62798 79444 39530 -12740 363149 -101635 -246470 -55689 -117619 -181001
10550a81001A23572a9606k66006i9361F7534c49188a46746a8508A32776m4668
10540H8108b44974a0889k11305A1134a07050G0168J30832a03865C08582b33900
10529A6450J73152c88595D293a95056C19296j42505e2246j39221D951i3629F2359
10517a81991Q1980c4262A84405j7681b35634C5718a1478B85629b49984j31417
10507c81401c907j92807c7829m9440I4760J89876H1751f2390H8066A5975J17381
10496A33356J7277B385a3785n2365H6170a63374H4168b85906Q9241f8151A3372
10484B37733a09546A92269K24573F0686J9301J22205K78265j63853j2445j8549
10474B85610m4739F0439i8135A38220d8583B02786G3587J25811c25758G9779a82448
$$ plain form
10550 -181001 123572 -19606 -285612 -99361 67534 -349188 -146746 -18508 132776 88108
10540 88108 -244974 -10889 -222194 11134 -107050 70168 201000 -103865 308582 -233900
10529 16450 189602 -388595 4293 -195056 319296 176791 -52246 -191467 4951 -93629 62359
10517 -181991 -100011 -34262 184405 166724 -235634 35718 -11478 285629 -249984 -381401
10507 -381401 -3907 -196714 -37829 -87269 94760 284636 81751 -62390 88066 15975 133356
10496 133356 150633 2385 -13785 -66150 86170 -163374 84168 -285906 -196665 -68151 13372
10484 237733 -109546 192269 416842 60686 79987 202192 480457 316604 304159 285610
10474 285610 240871 60439 -98135 138220 -48583 202786 73587 199398 -325758 79779 -182448
10462A46243D7693c3604o4870j01341j32799D80333B12290C734K0287R8079N7874
10451A79974D7525b32007n3145j33646h206k21110R7834n2556f8173C15508d7959
10439D65067b1897k78549a09554j41926h6209A20032M9195c7332B53267a30255
10428A27618c8853e337j1012A08619C4962a93929k7202b9727a218j20843E1481
10416a36262b0012j45939A97774A2302K42888l6519a56474r1365b1048A4140J09720
10405A23860a5401A77286j4931a39991H1452a07550c5364C5722J29903M113l0442
10394A39296K29772K34G7258J83883I8891J24415J15057b46321J18271G2338J45874
10383B18212b4926j25047a0730r3356c4657E105h9665B37039o8914k1550m4800
$$ plain form
10462 146243 47693 -33604 -98474 -199815 -332614 480333 212290 3734 24021 122100 179974
10451 179974 47525 -232007 -285152 -418798 -8206 -229316 -131482 -184038 -68173 315508 -47959
10439 465067 -21897 -300446 -109554 -251480 -86209 120032 169227 -37332 253267 -130255
10428 127618 -38853 -5337 -16349 108619 34962 -193929 -221131 -29727 -1218 -122061 51481
10416 -136262 -20012 -165951 197774 12302 255190 218671 -156474 -247839 -21048 14140 123860
10405 123860 -15401 177286 162355 -139991 81452 -107550 -35364 35722 165625 169738 139296
10394 139296 369068 369302 77258 261141 98891 223306 338363 -246321 -128050 72338 218212
10383 218212 -24926 -149973 -10730 -104086 -34657 5105 -89665 237039 168125 146575 101775
10372A01775N74235a63080C97346K3006A10348K46259J60209p1157a25465B61948
10361B70353F262O06348k15411A65465k058K68253J7062q0211j73923a29791D32384
10349C39921l1874L22863b6303A85314j7806J24155J22270A66654J07582H6339
10338a03969L1756A30274R7192J20027d8887j76542C48730j806A54415P6615j15096
10327A15934B4995M60216A64781e397A38991E7439g8645H9529C6682d3414A39754
10315b96466C86966j67480N3464A9598L6447i5820p6418H727J94150b34239F4617
10303f0131A98876b6724C88402A65267E95J64536a1424r5030j43316b5915m134
10292c0049j35722d0382j24720C5153a81321A8189Q2503a14582H1586a12834o2344
$$ plain form
10372 101775 676010 -163080 397346 420352 110348 356607 516816 445659 -125465 261948
10361 270353 6262 612610 397199 165465 163407 431660 448722 368511 194588 -129791 432384
10349 339921 308047 630910 -26303 185314 167508 291663 413933 166654 274236 86339
10338 -103969 -72213 130274 227466 347493 -48887 -225429 348730 346924 154415 231030 115934
10327 115934 24995 485211 164781 -5397 138991 57439 -78645 89529 36682 -43414 139754
10315 -296466 386966 219486 272950 19598 56045 -95820 -172238 8727 202877 -234239 64617
10303 -60131 198876 -26724 388402 165267 595 165131 -11424 -106454 -249770 -25915 -30049
10292 -30049 -165771 -40382 -165102 35153 -181321 18189 100692 -114582 81586 -112834 -175178
10281a75178A63100E0671g4143A6991J60621f9375J1597A39572E3069a59675j29831
10270b89506d7736k3166P2B64263i5357A95350G7931C1679K42190A9913L62827
10259C82740B4554J54619n4195K89774b29350A43646d5937j68785k4775G8257
10248F6875e596I0267b44543i0816F2601o570a38078j49664N1437j01377B0951
10236i4180k29235G7032B853b09131A81960b52952J00191l8487k35718J73789
10226b53177A54780A0383i9925m2127d0709F9164J13263A5414J08254m9192i861
10214C38151A03203J3765b51805p6739a20552A37796b45776C6387L6066R8934
10204A71387G2263a78409A44178a4461j9737l2471q9015j78628e2870A20959f2588
$$ plain form
10281 -175178 163100 50671 -74143 16991 177612 -69375 -57778 139572 53069 -159675 -289506
10270 -289506 -47736 -70902 -70830 264263 -95357 195350 77931 31679 273869 19913 382740
10259 382740 24554 179173 124978 414752 -229350 143646 -45937 -214722 -239497 78257
10248 66875 -5596 90267 -244543 -90816 62601 56031 -138078 -287742 -236305 -337682 20951
10236 -94180 -323415 77032 2853 -209131 181960 -252952 -152761 -191248 -426966 -253177
10226 -253177 154780 10383 -99925 -142052 -40709 69164 182427 15414 123668 74476 -9861
10214 338151 103203 116968 -251805 -328544 -120552 137796 -245776 36387 72453 171387
10204 171387 72263 -178409 144178 -14461 -34198 -66669 -155684 -334312 -52870 120959 -62588
10192b90495J24954H7825R9039b35955B84108a05423A21324O4256p1014n2097
10182F2469b14647k65648C20356a10711o2939e1274C32572H113K78712C3134a06401
10170E2969c7412B07596c49411B82725i1734A22273n5780Q0422B8498J50507A42
10158c0855k37770H3399b01252h1515E2576b14597J4934C19686a78402D630c60124
10146B4588a45007C58958i4698p2970G9684h192C6670b45901J13223G0737M985
10135G5722L2326c27851J54782A80777b07391A35866a75183J8243j09718A77050
10124a56534H3676b0538q4184A9164Q3319b00222g3969C1983a70050j30894B00716
10112a78412A13214Q3186a74194a3855H0694K7340e3036j41734d4724D25678b8285
$$ plain form
10192 -290495 -165541 87825 186864 -235955 284108 -105423 121324 185580 114566 62469
10182 62469 -214647 -480295 320356 -110711 -173650 -51274 332572 8113 286825 33134 -106401
10170 52969 -37412 207596 -349411 282725 -91734 122273 66493 146915 28498 179005 142
10158 -30855 -268625 83399 -201252 -81515 52576 -214597 -199663 319686 -178402 4630 -360124
10146 24588 -145007 358958 -94698 -167668 79684 -8192 36670 -245901 -132678 70737 75722
10135 75722 108048 -327851 -173069 180777 -207391 135866 -175183 -156940 -266658 177050
10124 -156534 83676 -20538 -104722 19164 102483 -200222 -73969 31983 -170050 -300944 200716
10112 -178412 113214 196400 -174194 -13855 80694 108034 -53036 -194770 -44724 425678 -28285
10100a23701B02903a09673q8073P121A70329a96910B5064K49107c22606A65657
10089C00748A47235h8709j202D9860b3111r0409n3422P5601J1727p264M878g396
10076C81008i8003k44778B4278d571j37307j04111h2133B5866b08199K3396c7716
10064b31733k04488a51402B7907h621A37969F3021B6166I513b57552A792a66758
10052A2617a9132A77736H4489a16509k49510R5327A65982D6744b8683j11604A10770
10040h5483A39999b19542C287d05122h376r2438K3131A5381M21583f5700m9512
10029a15212F985K3664J47439h7196j96794l5706a28803L0078B7877J00648d7612
10017a44061j36907G4223J3736a73061A24270J22041c700k27069M2995A02638
$$ plain form
10100 -123701 202903 -109673 -197746 -190625 170329 -196910 25064 274171 -322606 165657
10089 300748 147235 -88709 -89911 49860 -23111 -113520 -166942 -91341 -79614 -86878 -82000 -7396
10076 381008 -98003 -342781 24278 -4571 -141878 -245989 -82133 25866 -208199 -184803 -37716
10064 -231733 -436221 -151402 27907 -8621 137969 63021 26166 9513 -257552 1792 -166758
10052 12617 -19132 177736 84489 -116509 -366019 -270692 165982 46744 -28683 -140287 110770
10040 -85483 139999 -219542 3287 -405122 -8376 -100814 -77683 15381 436964 -65700 -115212
10029 -115212 6985 30649 178088 -87196 -283990 -319696 -128803 -98725 27877 128525 -47612
10017 -144061 -280968 74223 87959 -173061 124270 246311 -3700 -230769 -187774 102638
10006g3306A78999E231c9556c955j05964I810i415A03054b02113D4470c36057
9994a40699e366j35922M8253A1359a79996b5516k40687A0586J01026E1205a71646
9982d03258e2617k24579F3962c6701n5861C0840a44472c9024j79591C4655P7332
9971A11987f7013p7240b2360j930G7257l1305q209d6806A58503f8356r7513j56906
9959c22775J31516k10204a09918L284a2957F4776a31195N4874n1185E4575a20041
9947I959N4259K9595b68419a22919l3031m2552A36431d0184D5320a44982F9939
9935c13934f0884G3048L4617J62280p33d7083j80625c3127I2430b75687a8207
9923a37618b0047D47795G1727J22138K06362A84772E9657a98655A15888J7591
$$ plain form
10006 -73306 178999 5231 -39556 -3955 -109919 9810 -9415 103054 -202113 44470 -336057
9994 -140699 -5366 -141288 -93035 11359 -179996 -25516 -266203 10586 111612 51205 -171646
9982 -403258 -52617 -277196 63962 -36701 -92562 30840 -144472 -39024 -218615 34655 111987
9971 111987 -67013 -144253 -22360 -24290 77257 45952 37743 -46806 158503 -68356 -165869 -322775
9959 -322775 -191259 -401463 -109918 -106634 -12957 64776 -131195 -76321 -127506 54575 -120041
9947 9959 64218 93813 -268419 -122919 -155950 -198502 136431 -40184 45320 -144982 69939
9935 -313934 -60884 73048 107665 269945 269212 -47083 -227708 -33127 92430 -275687 -18207
9923 -137618 -20047 447795 71727 193865 400227 184772 59657 -198655 115888 133479
9913A33479a36023e5517k31481C31503G8290a8713j96889L9123P1506M8778j5688
9902g1883L5834p7095J4013k1061A39115b75744j24781a29598b5321k15168Q2730
9891a57759F7886b0511o981l1997k84767i0116j12827E7828i3753A47736c25152
9879H5852a51179K8140A20670a25442k6894d4340o055D8821a85042g5983B19596
9867G4551a52874k39967h6840k5118C13500d43716g262n5534l53625J45288J16648
9856a54485f9128G5068d46j32324m7003A54966a12076l4988A06607d7137j93297
9845b40434G6896e0427f948q5097l6834j04341i816k63962a11170q7409j31943
9834c30522g4665A61420C5715K16590p9617c3373o3501C9553j7074a11925q7514
$$ plain form
9913 133479 -136023 -55517 -286998 331503 78290 -18713 -215602 -176479 -104973 -56195 -71883
9902 -71883 -36049 -113144 -99131 -120192 139115 -275744 -400525 -129598 -25321 -240489 -157759
9891 -157759 67886 -20511 -27492 -59489 -344256 -90116 -202943 57828 -93753 147736 -325152
9879 85852 -151179 -123039 120670 -125442 -152336 -44340 -50395 48821 -185042 -75983 219596
9867 74551 -152874 -392841 -86840 -111958 313500 -443716 -7262 -62796 -416421 -271133 -154485
9856 -154485 -69128 75068 -446 -132770 -179773 154966 -112076 -147064 106607 -47137 -240434
9845 -240434 76896 -50427 -6948 -92045 -128879 -233220 -9816 -273778 -111170 -198579 -330522
9834 -330522 -74665 161420 35715 252305 172688 -33373 -96874 39553 22479 -111925 -199439
9823a99439A43411F99b77592a22044j03100Q7517l34678a44890b953o4511r1929
9812a59393I8958C8066b33152P1554L6319b4277k30974J8749A29509K04039m6561
9801B86987a4510k7453A37518c40777g9276j67569d0577p618n5722n3909b1984
9789b0566n7136F0720A6607K00260d1246G9023A9105M5965c2670A38638f9198
9777b12365E693b68662c9933l5692C046M2249H902a250D6659J23622a0524I453
9764A43713A5004a0826B41468Q9884d15885d5735C7214f6700A98118p0470J74553
9753C02201b43659O28a00992d4090A8102J26616P8863b7798C322a1466j10809
9742a22275A44985a85530j00309J25595j9832k0006a0538e166B4157P3860L1763
$$ plain form
9823 -199439 143411 699 -277592 -122044 -225144 -137627 -472305 -144890 -2953 -67464 -159393
9812 -159393 98958 38066 -233152 -161598 -125279 -24277 -255251 -236502 129509 333548 286987
9801 286987 -14510 -41963 137518 -340777 -79276 -246845 -40577 -48195 -103917 -157826 -21984
9789 -20566 -77702 60720 16607 216867 -41246 79023 19105 65070 -32670 138638 -69198
9777 -212365 5693 -268662 -39933 -75625 3046 45295 8902 -1250 46659 170281 -10524 9453
9764 143713 15004 -10826 241468 331352 -415885 -45735 37214 -66700 198118 127648 302201
9753 302201 -243659 -243031 -100992 -44090 18102 144718 223581 -27798 3322 -11466 -122275
9742 -122275 144985 -185530 -285839 -160244 -180076 -200082 -10538 -5166 24157 98017 129780
9731A29780b36716p028A29043m6603h5975p502E1030a85472m489L8344q4021F8955
9718g0895j47890g0014m12081A21502e869p5606A30125D3762a72501k32967B46515
9706b57358C46355i6456d7934j88021B7140J62836h7502b6711j96122n2844N8005
9695b17672h7018B15362a46435A18202b38544a0469l3700F390a40473F1903i8416
9683b12257R1810F0916b12814A19376c34241B99744j35419a25603H7336c39765
9672H3138b4503k09718J07770o1621C8425b12345F9878d6787q6168B73740b05966
9660G4775L9451h2722k02999R3911C7968c89734A2247a64333M2529r3230j72430
9649c87464i9086b7688A18778B3691J95249l2857a12428n1094F5409a21079j29953
$$ plain form
9731 129780 -236716 -243744 129043 82440 -85975 -93477 51030 -185472 -189961 -151617 -235638 68955
9718 -70895 -218785 -70014 -482095 121502 -5869 -81475 130125 43762 -172501 -405468 246515
9706 -257358 346355 -96456 -47934 -235955 27140 189976 -87502 -26711 -222833 -275677 -217672
9695 -217672 -87018 215362 -146435 118202 -238544 -10469 -44169 6390 -140473 61903 -98416
9683 -212257 -120447 60916 -212814 119376 -334241 299744 164325 -125603 87336 -339765
9672 83138 -24503 -234221 -126451 -188072 38425 -212345 69878 -46787 -132955 273740 -205966
9660 74775 114226 -82722 -285721 -191810 37968 -389734 12247 -164333 -121804 -215034 -387464
9649 -387464 -99086 -27688 118778 23691 218940 186083 -112428 -163522 65409 -121079 -251032
9638b51032P5821c446n6629A92652C8344K8653I767L63536H6887b1749k56439
9627b78188h6336A3913a02109D7568e3539I9371b17060K2261F1721A3228c94542
9615g7235k1402g168l954J517j42020j193b2266B39951d017l25102J08914A80241
9602A7305Q9361a31921B41014J3579b1384C9862e3264j42361A2762a67974m1947
9591b09921J4916Q8002J0970j29016P9348G5091G331b9113A0733p62f3376B919
9578a23741e1675l86097a24036e7910c535k9320o4828g618j56173b0469l46804
9567c67273a0328j23999n1110N2943d3155o1045j53738Q7839j48750a51829A25822
9555b15730g0438n9681E8464c00855e9866m19139b35169e9047m1965j12636j2375
$$ plain form
9638 -251032 -175211 -3446 -60075 192652 38344 66997 9767 373303 86887 -21749 -278188
9627 -278188 -86336 13913 -102109 47568 -53539 99371 -217060 -194799 61721 13228 -394542
9615 -77235 -98637 -7168 -11122 -9605 -151625 -152818 -22266 239951 -4017 -329119 -220205 180241
9602 17305 106666 -131921 241014 254593 -21384 39862 -53264 -195625 12762 -167974 -209921
9591 -209921 -195005 -107003 -96033 -225049 -145701 75091 7331 -29113 10733 9971 -63376 2919
9578 -123741 -51675 -437772 -124036 -57910 -3535 -32855 -97683 -7618 -163791 -20469 -367273
9567 -367273 -10328 -134327 -185437 -132494 -43155 -104200 -257938 -170099 -318849 -151829 125822
9555 -215730 -70438 -130119 58464 -300855 -59866 -479005 -235169 -59047 -101012 -213648 -226023
9544b26023A21744K5190b200k29134Q8768j22448g808q0464M4072H6432A7019
9532A42572c29141a43785o2571G7946c5927l6412K8191j19203C32477c26228I0892
9520a74160g2535n596D3129b80297G1115L16003i7770p1887B96599G720c01639
9508A51091j9123P2822h5882k9272a0066C65657a11070c0965A78264g1462l49776
9497d21238a61048d7959j4511j41933G2960B1710b44281N0470M5392j53059a31952
9485a09639l8253B89322b55141g4845I285a38508j63887C0811K14606b18762R0334
9474a28428k22703a20493k727N2635n8930G4362K43137c16838J08196O8087O0219
9463h0336C24666a29664k0954m9528C0243b55556g9681G7702a48967B2425e1737
$$ plain form
9544 -226023 121744 146934 -2200 -231334 -142566 -265014 -7808 -88272 -44200 86432 17019
9532 142572 -329141 -143785 -206356 77946 -35927 -72339 -44148 -163351 332477 -326228 90892
9520 -174160 -72535 -78131 43129 -280297 71115 387118 -97770 -169657 296599 7720 -301639
9508 151091 131968 204790 -85882 -115154 -10066 365657 -111070 -30965 178264 -71462 -421238
9497 -421238 -161048 -47959 -62470 -204403 72960 21710 -244281 -193811 -148419 -301478 -131952
9485 -109639 -147892 289322 -255141 -74845 9285 -138508 -302395 30811 245417 -218762 -128428
9474 -128428 -351131 -120493 -123220 -70585 -129515 74362 317499 -316838 -208642 -140555 -80336
9463 -80336 324666 -129664 -150618 -200146 30243 -255556 -79681 77702 -148967 22425 -51737
9451c13103H3891A1582J9129a99422k28326a31976e6189p9455A76651d4699j44286
9440a88985k5589a3002A56721G8210C7434K3315d7569j19598k14103A40725a3533
9428c46768D5888Q15a28827L8890j25258A27124C926K25411c9890j58920i4673
9416C7639b22695B7571a56374A96957J78870j69421I6252a13742p1139p0579B01079
9404c18030A77648d64945H2476C0431L95491j81378b7374j69071M3143P6225k9256
9393a06333j4036A49537R5189a57239o73P8309j13767I3836B0326J87478G7645
9381A07718K696D1207J4161J3526R1972p8980h9104A1591a08021o4203a4566D9441
9368e0748E2206g3155j23074e7802A24747c0641I3202g3685A82165b0098J792
$$ plain form
9451 -313103 83891 11582 30711 -199422 -427748 -131976 -56189 -135644 176651 -44699 -188985
9440 -188985 -214574 -13002 156721 78210 37434 60749 -47569 -167167 -381270 140725 -13533
9428 -346768 45888 46703 -128827 -89937 -215195 127124 3926 229337 -39890 -198810 -94673
9416 37639 -222695 27571 -156374 196957 375827 206406 96252 -113742 -184881 -255460 201079
9404 -318030 177648 -464945 82476 30431 425922 244544 -27374 -196445 -153302 -77077 -106333
9393 -106333 -120369 149537 244726 -157239 -157912 -79603 -193370 93836 20326 207804 77645
9381 107718 110414 41207 55368 68894 160866 81886 -89104 11591 -108021 -172224 -14566 49441
9368 -50748 52206 -73155 -196229 -57802 124747 -30641 93202 -73685 182165 -20098 -18306
9357a8306j2662A82290C6047e25971I0293h6460l55717a19868O331A42832o9248
9346G3584a20202A18054j9586C4025b40558B08662c9762k3790L161I9256J6849
9335A16105f341D792J99081b18259C3573a56807C0044a07994q0970g5345B31256
9323a38132J0086e6554A39174D9777a34089C820d7483r9838B645J02445K08260
9312C13350C6672i2123e244l36353a13903b1336j10230I1655B3029J12832b41830
9300c51292a44306C3584P4537b46755J22114o5294L6491c4192A68919P6821A17562
9288E002a68952H6044f7029k5481F9726a4617j58074H1145a71309d2713H4657
9276A10381a39786k4474d0444l2935F7052a22681N2229o3450A5540N6638L7579
$$ plain form
9357 -18306 -30968 182290 36047 -525971 90293 -86460 -442177 -119868 -113537 142832 73584
9346 73584 -120202 118054 98468 34025 -240558 208662 -39762 -63552 -60391 99256 116105
9335 116105 -6341 4792 203873 -218259 33573 -156807 30044 -107994 -188964 -75345 231256
9323 -138132 -128046 -56554 139174 49777 -134089 3820 -47483 -147321 2645 105090 313350
9312 313350 36672 -92123 -5244 -341597 -113903 -21336 -131566 91655 23029 135861 -241830
9300 -351292 -144306 33584 108121 -246755 -124641 -189935 -153444 -34192 168919 245740 117562
9288 5002 -168952 86044 -67029 -92510 69726 -14617 -172691 81145 -171309 -42713 84657
9276 110381 -139786 -164260 -40444 -73379 67052 -122681 -70452 -133902 15540 72178 109757
9265A09757a22257D5763a01446k11452f3234R5B3071L1385j5422f8333C20633
9253b32115j48171A19733a47232A52144o6190a06485C0125L0360a56685e6559
9242a55571I6656J99774e0438p2950o6572h083A30032a78763B87019b85038h2118
9230a99985A07706m7402B7702d6635A24796a23678B39276b06370F0237J17500
9220A77737b96580O3881Q0533M3795D6892a434j31571n2503C5062b61115f2820
9208f0420l5262j66772C6062m049J39342b65223b2004j32801d1308l81124a13467
9196a64215M5203N6987P009k64488e2242q4107b4536j42218g6006L2473r4673
9185a38206M3455k79737B33422a02869Q516j60895K179A45092C1341g5456I819
$$ plain form
9265 109757 -122257 45763 -101446 -312898 -63234 -63139 23071 54456 39034 -68333 320633
9253 -232115 -380286 119733 -147232 152144 85954 -106485 30125 60485 -156685 -56559
9242 -155571 96656 296430 -50438 -123388 -189960 -8083 130032 -178763 287019 -285038 -82118
9230 -199985 107706 60304 27702 -46635 124796 -123678 239276 -206370 60237 177737
9220 177737 -296580 -232699 -152166 -108371 46892 -1434 -133005 -185508 35062 -261115 -62820
9208 -60420 -95682 -262454 36062 32013 171355 -265223 -22004 -154805 -41308 -422432 -113467
9196 -164215 -119012 -62025 -55016 -319504 -52242 -136349 -24536 -166754 -76006 -43533 -138206
9185 -138206 -94751 -374488 233422 -102869 -94353 -255248 -253069 145092 31341 -75456 9819
9173A96931a51286H2825b91005a5481B78404A36295N2375d5993a431D4147a57872
9161g1486j23138B15808n012N185a81650B6855f0372A55251p1645g6868r7450
9150a74318I2652a56707e4171r8418l08381A91558c19062h9348A99682a7725o913
9139b4638k74869P6197b6103k18433a0075n418r8357E1479b84057C2252b7825
9127C10809g9014I1728a57524n0665h2387k05081A6918a34292l0730B9679J44963
9116A74642b5405A64483e9119A15341d0573G1591b51674C5698b62474H8407a7851
9104B06210J8935b13534B46282c92653a88530g3775G5822b74377D729K08059d874
9092a26012N5702a4842c213j15515A1197d8201H5589b18932e3760k31350A40021
$$ plain form
9173 196931 -151286 82825 -291005 -15481 278404 136295 188670 -45993 -1431 44147 -157872
9161 -71486 -194624 215808 210796 215981 -181650 26855 -60372 155251 83606 -76868 -174318
9150 -174318 92652 -156707 -54171 -152589 -460970 191558 -319062 -89348 199682 -17725 -24638
9139 -24638 -299507 -223310 -26103 -244536 -10075 -15493 -113850 51479 -284057 32252 -27825
9127 310809 -79014 91728 -157524 -208189 -82387 -287468 16918 -134292 -165022 29679 174642
9116 174642 -25405 164483 -59119 115341 -40573 71591 -251674 35698 -262474 88407 -17851
9104 206210 225145 -213534 246282 -392653 -188530 -73775 75822 -274377 4729 212788 -4874
9092 -126012 -70310 -14842 -3213 -118728 11197 -48201 85589 -218932 -53760 -285110 140021
9080c8175m2355k14149G841a8443r0545C1827c1857A52593n8581d22557I823i1144
9067I5780O3366b40330a04063r1855f9070k4410k09702c9731k1125A67797C4227
9055B19647a13438L8530j14526m9210A31996a19829j12139B2530N3432a45451
9044c2285A08535a05073M0725c0928j30933C4966K07746a00115A51223D5077N496
9033E0573R0806D799g4764K5736C64797E0194a76441l56450A36005J15814A8680
9021b079l96598B04964D3871b63603Q65B64696b60093L6594N3365A30328d2542
9009a02139A33790a35421k99584I3517D771J05537a00597j42562A78637D4539
8998i6525j29954P4481j53899a16139c9539p7984D6203J45306a0123k8076E6336
$$ plain form
9080 -38175 -80530 -294679 7841 -18443 -108988 31827 -31857 152593 94012 -422557 9823 -91144
9067 95780 159146 -240330 -104063 -195918 -69070 -93480 -303182 -39731 -60856 167797 34227
9055 219647 -113438 -74908 -189434 -238644 131996 -119829 -231968 22530 75962 -145451
9044 -32285 108535 -105073 -64348 -30928 -161861 34966 242712 -100115 151223 45077 50573
9033 50573 141379 4799 -74764 -49028 364797 50194 -176441 -532891 136005 251819 18680
9021 -2079 -398677 204964 43871 -263603 -262738 264696 -260093 -223499 -170134 130328 -42542
9009 -102139 133790 -135421 -435005 93517 4771 110308 -100597 -243159 178637 44539
8998 -96525 -226479 -151998 -305897 -116139 -39539 -117523 46203 191509 -10123 -38199 56336
8986E6439c32804H2098g0997i064k97072B14698f7653j6827o2207D24739F8956
8974b12524N4548A2137M8606J07973a29552q7359e724j65454p031A72711D9065
8962C11646C0486e54252b70515E7243b4932k71069a0842l2807j14428q219P8447
8951h7849o7176E2867a3087l97812K01591G434b01806j27745B6976a22570D2382
8939d09095J12153M715h9502j14176A59039a15644b8152I0097J17218C1988P5008
8928A06996Q1151F3459K88788j27557J463730L547883Q349839l069196B631375
8918A022254k47558l72623k5943b6539D3073L2796d2469j0496k4791G0115M37716
8907E07831B28465a60549H2735a88175E4182i3242A07415b6037B6566J1136M7534
$$ plain form
8986 56439 -332804 82098 -70997 -9064 -306136 214698 -67653 -84480 -146687 424739 68956
8974 -212524 -157976 12137 60743 168716 -129552 -216911 -5724 -171178 -178209 172711 49065
8962 311646 30486 -554252 -270515 57243 -24932 -296001 -10842 -43649 -158077 -166296 -87849
8951 -87849 -155025 52867 -13087 -410899 -209308 7434 -201806 -329551 26976 -122570 42382
8939 -409095 -296942 -292227 -89502 -203678 159039 -115644 -28152 90097 207315 31988 106996
8928 106996 188147 63459 352247 224690 1688420 5236303 13586142 10516946 2631375
8918 1022254 774696 402073 376130 -26539 43073 75869 -42469 -52965 -77756 70115 507831
8907 507831 228465 -160549 82735 -188175 54182 -93242 107415 -26037 26566 37702 85236
8896H5236J02463b09751G3923d40002i0731K0811m5834k91882B18031j07649e5699
8884C14949a34588G626Q4831f3146R971J0659J665m8475l0406A57975a04236q9608
8872a93844F2811d6254j58806B05714h8487m13094G2362d5239j35142r2008C27227
8860a9162j50950Q1887c8021o5467B2417g5599j35162m345k6376a01817d2047
8848A88896E3324J40370b26798J8284J01177E7202f3680j13086n7960l7975D0269
8836a94373D1703b81500d8211A20315a76253B7022l79i7291A8362K67754A18489
$$ plain form
8896 85236 187699 -209751 73923 -440002 -90731 -69920 -115754 -407636 218031 110382 -55699
8884 314949 -134588 7626 92457 -63146 -53175 -42516 -40851 -89326 -119732 157975 -104236 -193844
8872 -193844 62811 -46254 -205060 205714 -88487 -501581 72362 -45239 -180381 -272389 327227
8860 -19162 -170112 -88225 -38021 -103488 22417 -75599 -210761 -215106 -241482 -101817 -42047
8848 188896 53324 193694 -226798 -208514 -107337 57202 -63680 -176766 -234726 -272701 40269
8836 -194373 41703 -281500 -48211 120315 -176253 27022 26643 -97291 18362 286116 118489
$$ [...]
##END NTUPLES=NMR SPECTRUM
##END=
