##TITLE=AC1558_ROEFFECT0017_8269283_Op8BnQrHJG
##JCAMPDX= 6.0         $$ Bruker NMR JCAMP-DX V2.0
##DATA TYPE= NMR SPECTRUM
##DATA CLASS= NTUPLES
##ORIGIN= BRUKER
##OWNER= Administrator
$$ 1.72 TOPSPIN		Version 2.1
$$ 2013-10-12 22:09:38.681 -0700  Administrator@X
$$ Compression mode = diff/dup
##.OBSERVE FREQUENCY= 400.02188249412
##.OBSERVE NUCLEUS= ^1H
##.ACQUISITION MODE= SIMULTANEOUS (DQD)
##.ACQUISITION SCHEME= undefined
##.AVERAGES= 64
##.DIGITISER RES= 22
##SPECTROMETER/DATA SYSTEM= spect
##.PULSE SEQUENCE= noesygpps1d.comp
##.SOLVENT NAME= COFFEE_meoh
##.SHIFT REFERENCE= INTERNAL, COFFEE_meoh, 1, 14.96076
##AUDIT TRAIL= $$ (NUMBER, WHEN, WHO, WHERE, PROCESS, VERSION, WHAT)
$$ ##TITLE= Audit trail, TOPSPIN		Version 2.1
$$ ##JCAMPDX= 5.01
$$ ##ORIGIN= Bruker BioSpin GmbH
$$ ##OWNER= Administrator
$$ $$ E:\/data/COFFEE/nmr/AC1558_ROEFFECT0017_8269283_Op8BnQrHJG/12/pdata/1/auditp.txt
$$ ##AUDIT TRAIL=  $$ (NUMBER, WHEN, WHO, WHERE, PROCESS, VERSION, WHAT)
(   1,<2013-10-12 22:09:33.806 -0700>,<Administrator>,<X>,<go>,<TOPSPIN 2.1>,
      <created by zg
	started at 2013-10-12 21:58:04.272 -0700,
	POWCHK enabled, PULCHK disabled,
       configuration hash MD5:
       C8 4E 4E 5D D3 5C D8 9E 9F 52 82 E0 59 8A DE 15
       data hash MD5: 64K
       87 27 1F 75 DE 70 2D B7 6E 31 E0 44 3B 52 C7 4A>)
(   2,<2013-10-12 22:09:36.744 -0700>,<Administrator>,<X>,<proc1d>,<TOPSPIN 2.1>,
      <Start of raw data processing
       efp LB = 0.3 FT_mod = 6 PKNL = 1 PHC0 = 0 PHC1 = 0 SI = 128K 
       data hash MD5: 128K
       16 97 9C 04 E5 09 1A B6 80 14 05 B9 AC 36 5C 54>)
(   3,<2013-10-12 22:09:37.681 -0700>,<Administrator>,<X>,<proc1d>,<TOPSPIN 2.1>,
      <pk PHC0 = -81.65588 PHC1 = 0 
       data hash MD5: 128K
       69 DB 89 B0 BB 78 7F 2A 6A A7 49 31 33 9E 73 05>)
(   4,<2013-10-12 22:09:38.114 -0700>,<Administrator>,<X>,<proc1d>,<TOPSPIN 2.1>,
      <abs ABSG = 1 
       data hash MD5: 128K
       C2 49 BF 16 FB 47 20 D5 FA 2C 54 E8 3C 7B 67 2C>)
(   5,<2013-10-12 22:09:38.200 -0700>,<Administrator>,<X>,<proc1d>,<TOPSPIN 2.1>,
      <abs ABSG = 2 
       data hash MD5: 128K
       FA BD FF 5F 34 31 A9 F4 35 66 09 D4 FB 7E FD 7E>)
(   6,<2013-10-12 22:09:38.286 -0700>,<Administrator>,<X>,<proc1d>,<TOPSPIN 2.1>,
      <abs ABSG = 3 
       data hash MD5: 128K
       2F B1 EC 04 AC 24 71 90 FF EF FA A5 F4 16 87 93>)
(   7,<2013-10-12 22:09:38.389 -0700>,<Administrator>,<X>,<proc1d>,<TOPSPIN 2.1>,
      <abs ABSG = 4 
       data hash MD5: 128K
       85 7C 3B 50 E4 0C 4E 74 F9 4E 7A 0D DB DF 79 AC>)
(   8,<2013-10-12 22:09:38.475 -0700>,<Administrator>,<X>,<proc1d>,<TOPSPIN 2.1>,
      <abs ABSG = 5 
       data hash MD5: 128K
       9F 0E C3 F1 ED 4F F8 91 A1 88 CA 42 FE B4 0C 83>)
$$ ##END=
$$ 
$$ $$ hash MD5
$$ $$ 23 B0 93 74 83 81 14 D0 DA 01 79 11 17 23 E6 14
##$RELAX= 
##$RELAX= 
##$RELAX= 
##$RELAX= 
##$RELAX= 
##$RELAX= 
##$RELAX= 
##$RELAX= 
$$ Bruker specific parameters
$$ --------------------------
##$DU= <E:\>
##$EXPNO= 12
$$ [...]
##$TP07= 0
##$TPNAME0= <>
##$TPNAME1= <>
##$TPNAME2= <>
##$TPNAME3= <>
##$TPNAME4= <>
##$TPNAME5= <>
##$TPNAME6= <>
##$TPNAME7= <>
##$TPOAL= (0..7)
0.5 0.5 0.5 0.5 0.5 0.5 0.5 0.5
##$TPOFFS= (0..7)
0 0 0 0 0 0 0 0
##$TUNHIN= 0
##$TUNHOUT= 0
##$TUNXOUT= 0
##$USERA1= <user>
##$USERA2= <user>
##$USERA3= <user>
##$USERA4= <user>
##$USERA5= <user>
##$V9= 5
##$VALIST= <valist>
##$VCLIST= <CCCCCCCCCCCCCCC>
##$VD= 0
##$VDLIST= <DDDDDDDDDDDDDDD>
##$VPLIST= <PPPPPPPPPPPPPPP>
##$VTLIST= <TTTTTTTTTTTTTTT>
##$WBST= 1024
##$WBSW= 4
##$XGAIN= (0..3)
0 0 0 0
##$XL= 0
##$YL= 0
##$YMAX_a= 5813713
##$YMIN_a= -11496139
##$ZGOPTNS= <>
##$ZL1= 120
##$ZL2= 120
##$ZL3= 120
##$ZL4= 120
##$ABSF1= 14.96076
##$ABSF2= -5.597422
##$ABSG= 5
##$ABSL= 3
##$ALPHA= 0
##$AQORDER= 0
##$ASSFAC= 0
##$ASSFACI= 0
##$ASSFACX= 0
##$ASSWID= 0
##$AUNMP= <proc_prof1d_extract.lims>
##$AXLEFT= 0
##$AXNAME= <>
##$AXNUC= <1H>
##$AXRIGHT= 0
##$AXTYPE= 0
##$AXUNIT= <>
##$AZFE= 0.1
##$AZFW= 0.1
##$BCFW= 0
##$BC_mod= 0
##$BYTORDP= 0
##$COROFFS= 0
##$CY= 15
##$DATMOD= 1
##$DC= 0
##$DFILT= <>
##$DTYPP= 0
##$F1P= 0
##$F2P= 0
##$FCOR= 0.5
##$FTSIZE= 131072
##$FT_mod= 6
##$GAMMA= 0
##$GB= 0
##$INTBC= 1
##$INTSCL= 1
##$ISEN= 128
##$LB= 0.3
##$LEV0= 0
##$LPBIN= 0
##$MAXI= 10000
##$MC2= 0
##$MEAN= 0
##$ME_mod= 0
##$MI= 0
##$NCOEF= 0
##$NC_proc= -2
##$NLEV= 6
##$NOISF1= 0
##$NOISF2= 0
##$NSP= 0
##$NTH_PI= 0
##$NZP= 0
##$OFFSET= 14.96076
##$PC= 1
##$PHC0= -81.65588
##$PHC1= 0
##$PH_mod= 1
##$PKNL= yes
##$PPARMOD= 0
##$PPDIAG= 0
##$PPIPTYP= 0
##$PPMPNUM= 2147483647
##$PPRESOL= 1
##$PSCAL= 4
##$PSIGN= 0
##$PYNMP= <proc.py>
##$REVERSE= no
##$SF= 400.020009734768
##$SI= 131072
##$SIGF1= 0
##$SIGF2= 0
##$SINO= 400
##$SIOLD= 131072
##$SPECTYP= <>
##$SREGLST= <1H.CDCl3>
##$SSB= 0
##$STSI= 131072
##$STSR= 0
##$SW_p= 8223.68421052631
##$SYMM= 0
##$S_DEV= 0
##$TDeff= 65536
##$TDoff= 0
##$TI= <>
##$TILT= no
##$TM1= 0
##$TM2= 0
##$TOPLEV= 0
##$USERP1= <user>
##$USERP2= <user>
##$USERP3= <user>
##$USERP4= <user>
##$USERP5= <user>
##$WDW= 1
##$XDIM= 131072
##$YMAX_p= 348197923
##$YMIN_p= -11374
##$CURPLOT= <Network HP LaserJet P1505>
##$CURPRIN= <$Network HP LaserJet P1505>
##$DFORMAT= <normdp>
##$LAYOUT= <+/1D_H.xwp>
##$LFORMAT= <normlp>
##$PFORMAT= <normpl>
##$SURQMSG= 1
$$ End of Bruker specific parameters
$$ ---------------------------------
##NTUPLES= NMR SPECTRUM
##VAR_NAME=  FREQUENCY,     SPECTRUM/REAL,   SPECTRUM/IMAG
##SYMBOL=    X,             R,               I
##VAR_TYPE=  INDEPENDENT,   DEPENDENT,       DEPENDENT
##VAR_FORM=  AFFN,          ASDF,            ASDF
##VAR_DIM=   131072,        131072,          131072
##UNITS=     HZ,            ARBITRARY UNITS, ARBITRARY UNITS
##FACTOR=    0.0627417313425164, 1,          1
##FIRST=     8223.62146879497, 1019,         -56032
##LAST=      0,             2597,            -56163
##MIN=       0,             -11374,          0
##MAX=       8223.62146879497, 348197923,    0
$$ Real data points
##PAGE= N=1
##DATA TABLE= (X++(R..R)), XYDATA
$$ [...]
$$ plain form
63907 1876470 1733153 1600930 1479577 1369869 1272954 1188993 1116763 1054682 1001920 958139
63897 958139 922324 892530 867053 845433 827878 813870 801798 789873 777022 763022 748294
63886 748294 733625 719534 705663 691218 676166 661522 648256 636533 626438 618817 614575 613547
63874 613547 614923 618693 625796 636719 650789 667170 685882 707437 732011 759463 789695 822432
63862 822432 856880 892097 927587 963174 998530 1033257 1067297 1100712 1133000 1163042 1189827
63851 1189827 1212921 1232145 1247114 1257302 1262362 1262219 1256978 1246862 1232153 1213066 1189715 1162190
63839 1162190 1130608 1095171 1056394 1015285 973078 930655 888383 846562 805753 766490 728898
63828 728898 692899 658601 626203 595608 566585 539340 514475 492150 471701 452373 434137
$$ packed form
63907A876470j43317j32223j21353j09708r6915q3961p2230o2081n2762m3781
63897I58139l5815k9794k5477k1620j7555j4008j2072j1925j2851j4000j4728
63886G48294j4669j4091j3871j4445j5052j4644j3266j1723j0095p621m242j028
63874F13547J376L770P103J0923J4070J6381J8712K1555K4574K7452L0232L2737
63862H22432L4448L5217L5490L5587L5356L4727L4040L3415L2288L0042K6785
63851A189827K3094J9224J4969J0188N060j43n241j0116j4709j9087k3351k7525
63839A162190l1582l5437l8777m1109m2207m2423m2272m1821m0809l9263l7592
63828G28898l5999l4298l2398l0595k9023k7245k4865k2325k0449j9328j8236
$$ plain form
63817 434137 417415 402320 388674 376563 366171 357030 348161 339304 331433 325558 321440 318012 314678
63804 314678 311548 308612 305535 302333 299539 297372 295287 292714 289786 286925 284053 280715 276788 272642
63790 272642 268669 265051 261938 259488 257661 256285 255306 254691 254020 252532 249822 246364 243186 241075 240122
63775 240122 239875 239796 239642 239523 239606 239775 239686 239144 238277 237287 236191 234928 233579 232348 231388 230762 230463 230323
63757 230323 230001 229326 228622 228431 228825 229264 229313 229253 229666 230496 230921 230322 229102 228335 228699 230003 231743 233754
63739 233754 236136 238758 241221 243474 246102 249676 253877 257676 260531 263046 266218 270260 274557 278556
63725 278556 282200 285489 288217 290469 292955 296410 300762 305198 308886 311365 312481 312414 311844 311628 312050
63710 312050 312497 312021 310194 307441 304652 302428 300604 298531 295933 293345 291507 290497 289810 289239 289260 290440
$$ packed form
63817D34137j6722j5095j3646j2111j0392r141q869q857p871n875m118l428l334
63804C14678l130k936l077l202k794k167k085k573k928k861k872l338l927m146
63790B72642l973l618l113k450j827j376r79o15o71j488k710l458l178k111r53
63775B40122k47p9j54j19Q3J69q9n42q67r90j096j263j349j231r60o26k99j40
63757B30323l22o75p04j91L94M39M9o0M13Q30M25n99j220p67L64J304J740K011
63739B33754K382K622K463K253K628L574M201L799K855K515L172M042M297L999
63725B78556L644L289K728K252K486L455M352M436L688K479J116o7n70k16M22
63710C12050M47m76j827k753k789k224j824k073k598k588j838j010o87n71K1J180
$$ plain form
63694 290440 292743 295585 298334 300628 302487 304343 306751 309833 313123 316097 318679 321025 323012 324250
63680 324250 324568 324229 323643 323102 322849 323211 324465 326573 329105 331484 333323 334556 335271 335571 335699 336096 337025
63663 337025 338096 338492 337753 336129 334028 331443 328161 324286 320158 315916 311467 306905 302595 298747 295214
63648 295214 291817 288670 286082 284264 283271 283106 283735 284980 286463 287756 288709 289708 291466 294343 297905
63633 297905 301355 304443 307721 311771 316379 320693 324217 327439 331386 336639 342897 349477 356081 362942
63619 362942 370426 378738 388054 398651 410748 424397 439599 456354 474440 493445 513359 534878
63607 534878 558673 584391 610853 637255 663633 689859 714690 736288 753512 766322 775148 780371
63595 780371 782416 781856 779150 774521 768164 760339 751086 740137 727342 713028 697695 681448 664020
$$ packed form
63694B90440K303K842K749K294J859J856K408L082L290K974K582K346J987J238
63680C24250L18l39n86n41k53L62J254K108K532K379J839J233P15L00J28L97R29
63663C37025J071L96p39j624k101k585l282l875m128m242m449m562m310l848l533
63648B95214l397l147k588j818r93j65O29J245J483J293R53R99J758K877L562
63633B97905L450L088L278M050M608M314L524L222L947N253O258O580O604O861
63619C62942P484Q312R316J0597J2097J3649J5202J6755J8086J9005J9914K1519
63607E34878K3795K5718K6462K6402K6378K6226K4831K1598J7224J2810Q826N223
63595G80371K045n60k706m629o357p825r253j0949j2795j4314j5333j6247j7428
$$ plain form
63582 664020 645284 625484 604983 584129 563499 544037 526643 511639 498773 487685 478236 470494
63570 470494 464533 460298 457546 455943 455339 455926 457987 461463 465870 470685 475713 481052 486829 493049 499655
63555 499655 506681 514415 523451 534528 548225 564801 584361 607112 633433 663624 697491 734066
63543 734066 771756 808901 844256 876965 906181 930854 949896 962432 968026 966943 960274 949594
63531 949594 936353 921599 906145 890587 875006 858939 841909 823758 804272 782819 758861
63520 758861 732752 705582 678176 650601 622799 595323 569155 544947 522686 502086 483079
63509 483079 465851 450504 436786 424225 412555 401901 392454 384083 376464 369580 363836 359493 356124
63496 356124 352829 349024 344901 341141 338209 336049 334393 333225 332765 333027 333612 334088 334485 335265 336844 339279
$$ packed form
63582F64020j8736j9800k0501k0854k0630j9462j7394j5004j2866j1088r449p742
63570D70494n961m235k752j603o04N87K061L476M407M815N028N339N777O220O606
63555D99655P026P734R036J1077J3697J6576J9560K2751K6321L0191L3867L6575
63543G34066L7690L7145L5355L2709K9216K4673J9042J2536N594j083o669j0680
63531I49594j3241j4754j5454j5558j5581j6067j7030j8151j9486k1453k3958
63520G58861k6109k7170k7406k7575k7802k7476k6168k4208k2261k0600j9007
63509D83079j7228j5347j3718j2561j1670j0654r447q371p619o884n744m343l369
63496C56124l295l805m123l760k932k160j656j168m60K62N85M76L97P80J579K435
$$ plain form
63480 339279 342312 345528 348500 351025 353308 355808 358804 362140 365393 368164 370237 371541 372004 371355 369231
63465 369231 365701 361642 358221 355883 354041 351946 349634 347775 346748 346238 345767 345381 345607 346780 348557
63450 348557 350167 351151 351787 352783 354718 357873 362436 368497 375813 383898 392613 402553 414739 430042
63436 430042 448960 471613 497598 525921 555357 584944 614056 642146 668678 693184 715093
63425 715093 733501 747462 756682 761853 764357 765858 768074 772456 779787 790256 804048 821571 842789
63412 842789 866511 890741 913818 934965 953725 969250 980493 987051 989521 988820 985275 978547 968427
63399 968427 955428 940422 923920 905981 886687 866254 844621 821369 796311 769813 742283
63388 742283 713723 684304 655152 627887 603259 580726 559509 539602 521506 505442 491370
$$ packed form
63480C39279L033L216K972K525K283K500K996L336L253K771K073J304M63o49k124
63465C69231l530m059l421k338j842k095k312j859j027n10m71l86K26J173J777
63450C48557J610R84O36R96J935L155M563O061P316Q085Q715R940J2186J5303
63436D30042J8918K2653K5985K8323K9436K9587K9112K8090K6532K4506K1909
63425G15093J8408J3961R220N171K504J501K216M382P331J0469J3792J7523K1218
63412H42789K3722K4230K3077K1147J8760J5525J1243O558K470p01l545o728j0120
63399I68427j2999j5006j6502j7939j9294k0433k1633k3252k5058k6498k7530
63388G42283k8560k9419k9152k7265k4628k2533k1217j9907j8096j6064j4072
$$ plain form
63377 491370 479533 470439 464199 460225 457742 456485 456796 459130 463459 469171 475583 482635 491008 501516
63363 501516 514528 530022 547973 568391 591034 615384 641045 668098 696998 728128 761304
63352 761304 795544 829328 861213 890233 915798 937457 954889 967893 976146 979207 977128 970979
63340 970979 962373 952395 941186 928494 914233 898457 881190 862512 842631 821700 799727 776697
63328 776697 752662 727768 702530 678099 655869 636684 620710 608083 599160 593863 591166 589609
63316 589609 588125 586118 583076 578440 571599 561742 548040 530485 510370 489506 469050 449419 431025
63303 431025 414422 399765 386749 375262 365640 358137 352553 348530 345801 343945 342256 340164 337659
63290 337659 335081 332656 330285 327638 324404 320710 317288 314887 313398 311933 309966 308044 307038 307032 307347
$$ packed form
63377D91370j1837r094o240l974k483j257L11K334M329N712O412P052Q373J0508
63363E01516J3012J5494J7951K0418K2643K4350K5661K7053K8900L1130L3176
63352G61304L4240L3784L1885K9020K5565K1659J7432J3004Q253L061k079o149
63340I70979q606r978j1209j2692j4261j5776j7267j8678j9881k0931k1973k3030
63328G76697k4035k4894k5238k4431k2230j9185j5974j2627q923n297k697j557
63316E89609j484k007l042m636o841r857j3702j7555k0115k0864k0456j9631j8394
63303D31025j6603j4657j3016j1487r622p503n584m023k729j856j689k092k505
63290C37659k578k425k371k647l234l694l422k401j489j465j967j922j006oL15
$$ plain form
63275 307347 307506 307691 308258 309165 310077 310815 311555 312646 314290 316349 318443 320288 321908 323539 325368 327417
63259 327417 329583 331777 334073 336767 340142 344060 347934 351276 354225 357404 361347 366185 371831 378203
63245 378203 385191 392577 400173 408006 416348 425523 435732 447110 459883 474348 490582 508252 526852
63232 526852 546137 566182 586986 608253 629694 651356 673342 695273 716416 736523 756279
63221 756279 776555 797292 817559 836831 855820 875611 896174 916227 934524 950738 964864
63210 964864 976326 984130 987597 986483 980550 969595 953945 934484 912139 887650 861822 835525
63198 835525 809316 783416 758230 734597 713397 695207 680405 669218 661462 656584 654195 654265 656609
63185 656609 660595 665751 672365 681067 691972 704631 718654 733972 750499 767909 785760 803586
$$ packed form
63275C07347J59J85N67R07R12P38P40J091J644K059K094J845J620J631J829K049
63259C27417K166K194K296K694L375L918L874L342K949L179L943M838N646O372
63245C78203O988P386P596P833Q342R175J0209J1378J2773J4465J6234J7670J8600
63232E26852J9285K0045K0804K1267K1441K1662K1986K1931K1143K0107J9756
63221G56279K0276K0737K0267J9272J8989J9791K0563K0053J8297J6214J4126
63210I64864J1462P804L467j114n933j0955j5650j9461k2345k4489k5828k6297
63198H35525k6209k5900k5186k3633k1200j8190j4802j1187p756m878k389P0K344
63185F56609L986N156O614Q702J0905J2659J4023J5318J6527J7410J7851J7826
$$ plain form
63173 803586 820887 837327 852902 867693 881420 893545 903771 912133 918551 922566 923617 921312
63161 921312 915320 905228 890831 872514 851174 827685 802462 775645 747741 719912 693345 668271
63149 668271 643934 619777 596429 575210 556774 540620 525905 512364 500317 490101 481706 474842
63137 474842 469192 464619 461081 458348 455930 453499 451252 449577 448457 447567 446977 447282 448843 451264 453924
63122 453924 456748 460096 464066 468317 472593 477083 482105 487597 493086 498071 502373 506138 509604 512895
63108 512895 515998 518812 521149 522783 523671 524208 525084 526793 529252 531847 533777 534466 533929 532904 532387 532861
63092 532861 534024 535298 536366 537061 537139 536670 536530 537786 540341 542646 543239 542335 541497 541898 543416 545400
63076 545400 547698 550664 554593 559602 565804 573103 580899 588478 595777 603446 612059 621583 631825 643103
$$ packed form
63173H03586J7301J6440J5575J4791J3727J2125J0226Q362O418M015J051k305
63161I21312n992j0092j4397j8317k1340k3489k5223k6817k7904k7829k6567k5074
63149F68271k4337k4157k3348k1219j8436j6154j4715j3541j2047j0216q395o864
63137D74842n650m573l538k733k418k431k247j675j120q90n90L05J561K421K660
63122D53924K824L348L970M251M276M490N022N492N489M985M302L765L466L291
63108E12895L103K814K337J634Q88N37Q76J709K459K595J930O89n37j025n17M74
63092E32861J163J274J068O95P8m69j40J256K555K305N93r04q38M01J518J984
63076E45400K298K966L929N009O202P299P796P579P299P669Q613R524J0242J1278
$$ plain form
63062 643103 656192 671699 689680 709855 732004 756183 782640 811603 843213 877703 915478
63051 915478 956729 1000997 1047411 1095476 1145275 1196784 1249349 1302153 1354890 1407568 1459887
63040 1459887 1511383 1562150 1612877 1663906 1714668 1764320 1812655 1860014 1906376 1950876 1992220
63029 1992220 2029208 2060657 2085015 2100493 2105788 2100574 2085101 2059518 2023961 1979300 1927354 1870064
63017 1870064 1808664 1743979 1677348 1610894 1546905 1487170 1432847 1384583 1342629 1307053 1277975
63006 1277975 1255539 1239726 1230329 1227108 1229757 1237732 1250272 1266598 1285994 1307800 1331560 1357038
62994 1357038 1383809 1410931 1437459 1463356 1489450 1516319 1543553 1570248 1595800 1619776 1641272
62983 1641272 1658907 1671461 1678209 1678623 1672166 1658618 1638439 1612531 1581606 1545897 1505533 1461090
$$ packed form
63062F43103J3089J5507J7981K0175K2149K4179K6457K8963L1610L4490L7775
63051I15478M1251M4268M6414M8065M9799N1509N2565N2804N2737N2678N2319
63040A459887N1496N0767N0727N1029N0762M9652M8335M7359M6362M4500M1344
63029A992220L6988L1449K4358J5478N295n214j5473k5583l5557m4661n1946n7290
63017A870064o1400o4685o6631o6454o3989n9735n4323m8264m1954l5576k9078
63006A277975k2436j5813r397l221K649P975J2540J6326J9396K1806K3760K5478
62994A357038K6771K7122K6528K5897K6094K6869K7234K6695K5552K3976K1496
62983A641272J7635J2554O748M14o457j3548k0179k5908l0925l5709m0364m4443
$$ plain form
62971 1461090 1413670 1364459 1314377 1264136 1214462 1166109 1119839 1076530 1037080 1001871 970379
62960 970379 941595 914807 889737 866071 843359 821519 801003 782217 764958 748628 732794
62949 732794 717401 702599 688519 675120 662179 649523 637181 625106 612954 600628 588976
62938 588976 579234 571554 564746 557862 551375 546204 542132 538067 533615 529513 526536 524716 523694 523105
62924 523105 522411 521046 519094 517317 516130 514976 513062 510363 507503 504969 502869 501249 500189 499616 499321
62909 499321 499147 498922 498312 496997 494947 492377 489528 486686 484295 482727 481962 481745 482032 483018 484764 487025
62893 487025 489470 491789 493549 494290 493987 493240 492733 492548 492180 491206 489792 488501 487725 487422 487337 487376 487654 488262
62875 488262 489101 489949 490564 490648 489893 488225 485975 483668 481600 479720 477867 476016 474306 472900 471865 471094
$$ packed form
62971A461090m7420m9211n0082n0241m9674m8353m6270m3309l9450l5209l1492
62960I70379k8784k6788k5070k3666k2712k1840k0516j8786j7259j6330j5834
62949G32794j5393j4802j4080j3399j2941j2656j2342j2075j2152j2326j1652
62938E88976r742p680o808o884o487n171m072m065m452m102k977j820j022n89
62924E23105o94j365j952j777j187j154j914k699k860k534k100j620j060n73k95
62909D99321j74k25o10j315k050k570k849k842k391j568p65k17K87R86J746K261
62893D87025K445K319J760P41l03p47n07j85l68r74j414j291p76l03q5L9K78O08
62875D88262Q39Q48O15Q4p55j668k250k307k068j880j853j851j710j406j035p71
$$ plain form
62859 471094 470352 469433 468261 466809 465113 463531 462763 463254 464545 465592 465782 465349 464708 463814 462483 460981
62843 460981 459872 459433 459550 460074 460877 461595 461748 461224 460364 459525 458841 458396 458294 458380 458246 457693 456983 456468 456215
62824 456215 456210 456706 458076 460377 463264 466342 469474 472782 476395 480184 483754 486821 489557 492364 495379
62809 495379 498503 501880 505892 510572 515455 520258 525258 530725 536507 542589 549555 557837 566881 575879
62795 575879 585186 596109 609213 623694 638720 654646 672401 692301 714233 738749 767273 801027
62783 801027 840109 883766 931452 983556 1041136 1104935 1174644 1249108 1327124 1407871 1490703
62772 1490703 1574843 1659205 1742091 1821008 1893191 1956521 2009719 2051690 2081198 2097374 2100030
62761 2100030 2089141 2064596 2026987 1978301 1921121 1857228 1787431 1712594 1634191 1553826 1472822
$$ packed form
62859D71094p42r19j172j452j696j582p68M91J291J047J90m33o41q94j331j502
62843D60981j109m39J17N24Q03P18J53n24q60q39o84m45j02Q6j34n53p10n15k53
62824D56215nM96J370K301K887L078L132L308L613L789L570L067K736K807L015
62809D95379L124L377M012M680M883M803N000N467N782O082O966Q282R044Q998
62795E75879R307J0923J3104J4481J5026J5926J7755J9900K1932K4516K8524L3754
62783H01027L9082M3657M7686N2104N7580O3799O9709P4464P8016Q0747Q2832
62772A490703Q4140Q4362Q2886P8917P2183O3330N3198M1971K9508J6176K656
62761B100030j0889k4545l7609m8686n7180o3893o9797p4837p8403q0365q1004
$$ plain form
62750 1472822 1392474 1314249 1239377 1168509 1101980 1040161 983280 931077 882961 838547 797901
62739 797901 761259 728664 699919 674757 652916 633993 617327 602247 588495 576356 566217
62728 566217 558064 551456 545947 541381 537796 535197 533473 532519 532278 532613 533259 534100 535576 538561 543637
62713 543637 550571 558757 568013 578640 590813 604409 619537 636798 656830 679943 706341 736289
62701 736289 769771 806353 845821 888714 935877 987527 1043054 1101499 1161893 1223247 1284625
62690 1284625 1345262 1404371 1460853 1513236 1559800 1598659 1628093 1647111 1655584 1653664 1641345 1618828
62678 1618828 1586942 1546824 1499447 1445859 1387564 1326208 1263127 1199668 1137578 1078363 1022357
62667 1022357 969065 918357 870737 826567 785823 748620 715239 685441 658447 633769 611463
$$ packed form
62750A472822q0348p8225p4872p0868o6529o1819n6881n2203m8116m4414m0646
62739G97901l6642l2595k8745k5162k1841j8923j6666j5080j3752j2139j0139
62728E66217q153o608n509m566l585k599j724r54k41L35O46Q41J476K985N076
62713E43637O934Q186R256J0627J2173J3596J5128J7261K0032K3113K6398K9948
62701G36289L3482L6582L9468M2893M7163N1650N5527N8445O0394O1354O1378
62690A284625O0637N9109N6482N2383M6564L8859K9434J9018Q473j920j2319k2517
62678A618828l1886m0118m7377n3588n8295o1356o3081o3459o2090n9215n6006
62667A022357n3292n0708m7620m4170m0744l7203l3381k9798k6994k4678k2306
$$ plain form
62656 611463 591421 573149 556496 541834 529204 517976 507758 498901 491547 484866 477965 471027
62644 471027 464746 459044 453187 447025 441353 437055 434454 433452 433669 434391 434872 434788 434180 433137 431949 431359
62628 431359 431963 433288 434055 433452 431749 429626 427447 425351 423552 422236 421486 421459 422332 423957 425973 428428
62612 428428 431831 436307 441206 446009 451189 457529 464807 471972 478784 486532 496711 509406 523554
62599 523554 538504 554710 572979 593758 617417 644590 675623 709902 746262 783959 822792
62588 822792 862397 901922 940454 977206 1011164 1041012 1065619 1084231 1096102 1100496 1097412 1087818
62576 1087818 1072761 1052598 1027455 997973 965100 929573 892200 854376 817515 782093 747830
62565 747830 714754 683461 654432 627772 603678 582467 563977 547532 532686 519500 507975
$$ packed form
62656F11463k0042j8272j6653j4662j2630j1228j0218q857p354o681o901o938
62644D71027o281n702n857o162n672m298k601j002K17P22M81q4o08j043j188n90
62628D31359O04J325P67o03j703k123k179k096j799j316p50k7Q73J625K016K455
62612D28428L403M476M899M803N180O340P278P165O812P748J0179J2695J4148
62599E23554J4950J6206J8269K0779K3659K7173L1033L4279L6360L7697L8833
62588H22792L9605L9525L8532L6752L3958K9848K4607J8612J1871M394l084r594
62576A087818j5057k0163k5143k9482l2873l5527l7373l7824l6861l5422l4263
62565G47830l3076l1293k9029k6660k4094k1211j8490j6445j4846j3186j1525
$$ plain form
62554 507975 497808 488951 481724 475983 470767 465241 459636 454783 451024 448018 445331 442786 440430 438556
62540 438556 437602 437699 438442 439368 440452 441852 443412 444791 445926 447030 448280 449844 452057 455183 459125
62525 459125 463678 468966 475332 482915 491694 501867 513824 527850 544113 562867 584332 608437
62513 608437 635018 664143 695878 729858 765466 802348 840277 878512 915783 950952 983368
62502 983368 1012633 1038465 1060719 1078981 1092118 1098911 1099388 1095040 1087517 1077713 1066388 1055008 1045278
62489 1045278 1038191 1034077 1033388 1036921 1045420 1059349 1078910 1103902 1133653 1167396 1204499 1244014
62477 1244014 1284342 1323892 1361833 1397585 1429631 1455518 1473090 1481184 1479187 1466788 1444558 1414025
62465 1414025 1376512 1332291 1281459 1225329 1166221 1105932 1045062 984025 924122 867230 814728
$$ packed form
62554E07975j0167q857p227n741n216n526n605m853l759l006k687k545k356j874
62540D38556r54R7P43R26J084J400J560J379J135J104J250J564K213L126L942
62525D59125M553N288O366P583Q779J0173J1957J4026J6263J8754K1465K4105
62513F08437K6581K9125L1735L3980L5608L6882L7929L8235L7271L5169L2416
62502I83368K9265K5832K2254J8262J3137O793M77m348p523r804j1325j1380r730
62489A045278p087m114o89L533Q499J3929J9561K4992K9751L3743L7103L9515
62477A244014M0328L9550L7941L5752L2046K5887J7572Q094j997j2399k2230l0533
62465A414025l7513m4221n0832n6130n9108o0289o0870o1037n9903n6892n2502
$$ plain form
62454 814728 767106 724461 686922 654498 626802 603156 582975 565982 552114 541286 533247 527577
62442 527577 523850 521858 521614 523023 525595 528617 531684 534900 538491 542353 546073 549216 551350 551908 550332
62427 550332 546475 540772 533950 526661 519324 512117 504952 497559 489755 481676 473740 466322 459414 452670
62413 452670 445835 439126 433006 427579 422431 417204 412075 407477 403531 400076 397086 394702 392904 391523
62399 391523 390568 390145 390013 389738 389480 390140 392338 395518 398471 400613 402307 404038 405761 407229 408602 410406
62383 410406 413002 416364 420405 425223 430811 436671 442162 447368 453268 460673 469181 477563 485125 492300
62369 492300 499936 508466 517907 528250 539623 552313 566788 583431 602217 623087 646725 674407
62357 674407 706734 742972 781997 823465 867516 913700 960795 1007489 1052654 1095072 1133447
$$ packed form
62454H14728m7622m2645l7539l2424k7696k3646k0181j6993j3868j0828q039n670
62442E27577l727j992k44J409K572L022L067L216L591L862L720L143K134N58j576
62427E50332l857n703o822p289p337p207p165p393p804q079p936p418o908o744
62413D52670o835o709o120n427n148n227n129m598l946l455k990k384j798j381
62399C91523r55m23j32k75k58O60K198L180K953K142J694J731J723J468J373J804
62383D10406K596L362M041M818N588N860N491N206N900P405Q508Q382P562P175
62369D92300P636Q530R441J0343J1373J2690J4475J6643J8786K0870K3638K7682
62357F74407L2327L6238L9025M1468M4051M6184M7095M6694M5165M2418L8375
$$ plain form
62346 1133447 1166731 1194066 1214557 1227597 1233343 1232441 1225395 1212644 1194984 1173230 1147581 1118162
62334 1118162 1086313 1054431 1024119 995060 966146 937190 909087 882770 858638 836727 816887
62323 816887 798747 781798 765484 749166 732300 714876 697410 680250 663109 645549 627691
62312 627691 610191 593713 578617 564912 552247 540230 528961 518998 510524 502953 495727 489146
62300 489146 483952 480345 477941 476473 475950 476148 476534 476745 476740 476507 476115 476072 477088 479292 482078 484859 487569
62283 487569 490255 492654 494546 496246 498326 500943 503676 505997 507675 508793 509597 510447 511826 514277 518167
62268 518167 523417 529620 536588 544743 554720 566733 580611 596542 615393 638105 665018 695937
62256 695937 730686 769306 811806 857936 907106 958323 1010190 1061098 1109523 1154200 1194164
$$ packed form
62346A133447L3284K7335K0491J3040N746r02p046j2751j7660k1754k5649k9419
62334A118162l1849l1882l0312k9059k8914k8956k8103k6317k4132k1911j9840
62323H16887j8140j6949j6314j6318j6866j7424j7466j7160j7141j7560j7858
62312F27691j7500j6478j5096j3705j2665j2017j1269r963q474p571p226o581
62300D89146n194l607k404j468n23J98L86K11nk33l92m3J016K204K786K781K710
62283D87569K686K399J892J700K080K617K733K321J678J118Q04Q50J379K451L890
62268E18167N250O203O968Q155R977J2013J3878J5931J8851K2712K6913L0919
62256F95937L4749L8620M2500M6130M9170N1217N1867N0908M8425M4677L9964
$$ plain form
62245 1194164 1228743 1257422 1279623 1294638 1301847 1300952 1291979 1275197 1251142 1220676 1184909 1145045
62233 1145045 1102323 1057921 1012761 967474 922820 880103 840836 805805 774573 746177 720253
62222 720253 697325 678092 662742 650935 642042 635186 629449 624522 620982 619464 619640 620457 621361 622676
62208 622676 624593 626444 627483 627919 628529 629395 629695 628757 626820 624525 622080 619205 615752 612121 608983
62193 608983 606641 604690 602503 600155 598661 599089 601583 605491 610239 615680 621674 627792 633547 638676
62179 638676 643153 647196 651161 655135 658690 661523 664272 668151 673670 680323 687861 697286 710152 727176
62165 727176 748034 772203 799415 829378 861504 895078 929394 963651 996820 1027641 1054693
62154 1054693 1076678 1092895 1103355 1108289 1107639 1101217 1089264 1072578 1052127 1028685 1002818 975045
$$ packed form
62245A194164L4579K8679K2201J5015P209q95q973j6782k4055l0466l5767l9864
62233A145045m2722m4402m5160m5287m4654m2717l9267l5031l1232k8396k5924
62222G20253k2928j9233j5350j1807q893o856n737m927l540j518J76Q17R04J315
62208F22676J917J851J039M36O10Q66L00r38j937k295k445k875l453l631l138
62193F08983k342j951k187k348j494M28K494L908M748N441N994O118N755N129
62179F38676M477M043L965L974L555K833K749L879N519O653P538R425J2866J7024
62165G27176K0858K4169K7212K9963L2126L3574L4316L4257L3169L0821K7052
62154A054693K1985J6217J0460M934o50o422j1953j6686k0451k3442k5867k7773
$$ plain form
62142 975045 946073 916931 888726 862139 837311 814379 793867 776349 761964 750571 742138 736512
62130 736512 732958 730452 728532 727436 727430 728449 730514 733967 738958 745056 751720 758910 766862 775472 784290
62115 784290 793012 801588 809816 817116 822823 826534 828176 828001 826551 824327 821251 816662 810149 802361
62101 802361 794767 788517 783737 779946 776862 774566 773106 772369 772384 773445 775797 779415 784148 789808 795995
62086 795995 802146 808011 813911 820331 827471 835410 844315 854088 864110 874000 884556 897273 912780
62073 912780 930322 948882 968148 987999 1007727 1026536 1044520 1062549 1081266 1100717 1120844
62062 1120844 1141697 1163039 1184215 1204648 1224184 1242851 1260437 1276374 1289815 1299889 1306198
62051 1306198 1309048 1308838 1305226 1297281 1284543 1267448 1246567 1221934 1193407 1161260 1126005 1087985
$$ packed form
62142I75045k8972k9142k8205k6587k4828k2932k0512j7518j4385j1393q433n626
62130G36512l554k506j920j096oJ019K065L453M991O098O664P190P952Q610Q818
62115G84290Q722Q576Q228P300N707L711J642j75j450k224l076m589o513p788
62101H02361p594o250m780l791l084k296j460p37J5J061K352L618M733N660O187
62086G95995O151N865N900O420P140P939Q905R773J0022R890J0556J2717J5507
62073I12780J7542J8560J9266J9851J9728J8809J7984J8029J8717J9451K0127
62062A120844K0853K1342K1176K0433J9536J8667J7586J5937J3441J0074O309
62051A306198K850k10l612p945j2738j7095k0881k4633k8527l2147l5255l8020
$$ plain form
62039 1087985 1047646 1005947 964056 922710 882335 843637 807551 774525 744209 715938 689266
62028 689266 664136 640891 620090 601926 585767 570680 556386 543294 531583 520844 510753
62017 510753 501467 492958 484581 475866 467376 460116 454325 449447 445194 441923 439885 438790 438377 438934 440792
62002 440792 443676 446984 450599 454965 460276 465913 470899 474812 478122 481591 485435 489124 491912 493448
61988 493448 493950 493952 493953 494092 493974 492923 490535 486988 482745 478154 473549 469529 466681 464899 463271 460869
61972 460869 457626 454375 452152 451508 452300 453899 455548 456686 457159 457187 457063 456737 455773 453920 451662 449878
61956 449878 448846 447914 446378 444387 442630 441414 440583 440283 441279 444238 448952 454464 459910 465222 471169
61941 471169 478654 487809 497825 507843 517923 528841 541071 554277 567773 581100 594120 606917
$$ packed form
62039A087985m0339m1699m1891m1346m0375l8698l6086l3026l0316k8271k6672
62028F89266k5130k3245k0801j8164j6159j5087j4294j3092j1711j0739j0091
62017E10753r286q509q377q715q490p260n791m878m253l271k038j095m13N57J858
62002D40792K884L308L615M366N311N637M986L913L310L469L844L689K788J536
61988D93448N02KJJ39j18j051k388l547m243m591m605m020k848j782j628k402
61972D60869l243l251k223o44P92J599J649J138M73K8j24l26r64j853k258j784
61956D49878j032r32j536j991j757j216q31l00R96K959M714N512N446N312N947
61941D71169P485R155J0016J0018J0080J0918J2230J3206J3496J3327J3020J2797
$$ plain form
61929 606917 619599 631878 642881 651884 659260 666088 672631 677777 680324 680317 678651 675867 671942 667061
61915 667061 661954 657442 654040 651992 651395 652313 654896 659251 665024 671482 678299 685917 694650 703715 711723
61900 711723 717992 722750 726078 727397 726184 722647 717353 710626 702600 693516 683605 672897 661539 650139
61886 650139 639427 629531 619873 609930 599986 590991 583604 577423 571296 564419 556977 549684 542996 537015
61872 537015 531873 527711 524358 521490 519166 517786 517430 517695 518411 520103 523358 528015 533382 539192 545980
61857 545980 554547 565253 577883 591953 607078 623159 640339 658789 678551 699508 721443 744094
61845 744094 767244 790642 813725 835550 855332 872996 888779 902192 911889 916916 917758 915745
61833 915745 911714 905783 898298 890325 883104 877465 873940 872937 874480 878103 883311 889848 897214 904288
$$ packed form
61929F06917J2682J2279J1003R003P376O828O543N146K547pj666k784l925m881
61915F67061n107m512l402k048n97R18K583M355N773O458O817P618Q733R065Q008
61900G11723O269M758L328J319j213l537n294o727q026r084r911j0708j1358j1400
61886F50139j0712r896r658r943r944q995p387o181o127o877p442p293o688n981
61872E37015n142m162l353k868k324j380l56K65P16J692L255M657N367N810O788
61857E45980Q567J0706J2630J4070J5125J6081J7180J8450J9762K0957K1935K2651
61845G44094K3150K3398K3083K1825J9782J7664J5783J3413R697N027Q42k013
61833I15745m031n931p485p973p221n639l525j003J543L623N208O537P366P074
$$ plain form
61819 904288 909960 913964 916475 916977 914197 907399 897086 884075 868425 849890 829049 807201 785186
61806 785186 763045 740948 719741 700236 682502 666350 652030 639847 629323 619417 609564 599966
61794 599966 590854 582084 573680 566243 560324 555638 551324 546927 542778 539394 536787 534474 531984 529183
61780 529183 526198 523222 520443 517980 515800 513714 511578 509479 507615 505983 504375 502683 501002 499345
61766 499345 497487 495296 493109 491511 490781 490748 491121 491738 492489 493230 493897 494626 495648 497027 498429 499249 499183
61749 499183 498684 498522 498771 498628 497495 495830 494433 493244 491579 489398 487510 486423 485755 485057 484517 484354
61733 484354 484124 483249 481894 480726 480051 479782 480045 481197 483202 485553 487904 490387 493172 496095 498849
61718 498849 501265 503273 504854 506185 507556 508945 509825 509647 508482 506996 505787 504801 503450 501256 498309
$$ packed form
61819I04288N672M004K511N02k780o798j0313j3011j5650j8535k0841k1848k2015
61806G85186k2141k2097k1207j9505j7734j6152j4320j2183j0524r906r853r598
61794E99966r112q770q404p437n919m686m314m397m149l384k607k313k490k801
61780E29183k985k976k779k463k180k086k136k099j864j632j608j692j681j657
61766D99345j858k191k187j598p30l3L73O17P51P41O67P29J022J379J402Q20o6
61749D99183m99j62K49j43j133j665j397j189j665k181j888j087o68o98n40j63
61733D84354k30q75j355j168o75k69K63J152K005K351K351K483K785K923K754
61718D98849K416K008J581J331J371J389Q80j78j165j486j209r86j351k194k947
$$ plain form
61703 498309 495031 491550 487622 483251 479137 476124 474205 472375 469580 465612 461021 456387 451894 447471
61689 447471 443079 438803 434768 431052 427662 424506 421436 418400 415601 413353 411688 410217 408613 407119
61675 407119 406237 405879 405254 403793 401852 400183 398999 397888 396476 394773 393006 391523 390728 390646 390613 389898
61659 389898 388691 387986 388333 389234 389983 390599 391519 392755 393882 394701 395485 396587 398088 399776 401299 402441
61643 402441 403408 404638 406114 407203 407496 407523 408041 408807 408764 407477 405741 404501 403781 403071 402245 401486 400609
61626 400609 399074 396647 393595 390271 386964 384114 382153 380925 379687 377940 375923 374108 372497 370758
61612 370758 368755 366554 364058 361069 357770 354704 352161 349832 347237 344256 341090 337888 334673 331558
61598 331558 328754 326332 324114 321882 319559 317163 314707 312303 310262 308937 308354 308101 307618 306576 304951
$$ packed form
61703D98309l278l481l928m371m114l013j919j830k795l968m591m634m493m423
61689D47471m392m276m035l716l390l156l070l036k799k248j665j471j604j494
61675D07119q82l58o25j461j941j669j184j111j412j703j767j483p95q2l3p15
61659C89898j207p05L47R01P49O16R20J236J127Q19P84J102J501J688J523J142
61643D02441R67J230J476J089K93K7N18P66m3j287j736j240p20p10q26p59q77
61626D00609j535k427l052l324l307k850j961j228j238j747k017j815j611j739
61612C70758k003k201k496k989l299l066k543k329k595k981l166l202l215l115
61598C31558k804k422k218k232k323k396k456k404k041j325n83k53m83j042j625
$$ plain form
61583 304951 302884 300600 298438 296691 295381 294268 293197 292263 291598 291106 290584 290045 289754 289980 290731 291651
61567 291651 292127 291707 290614 289702 289617 290037 290035 289164 287867 286824 286298 286296 286965 288416 290275 291815 292620 292970
61549 292970 293518 294643 296118 297325 297814 297725 297675 298252 299669 301800 304333 306859 309053 310901 312634 314355
61533 314355 315953 317463 319244 321523 323933 325700 326265 325646 324424 323442 323195 323197 322233 319643 316146 313054
61517 313054 310915 309408 308324 307866 307959 308063 307991 308319 309503 310998 311766 311373 310191 308750 307375 306284
61501 306284 305522 304764 303580 302022 300699 300153 300384 300973 301486 301721 301754 301868 302343 303221 304294 305286 306048 306665
61483 306665 307405 308416 309478 310227 310744 311619 313228 315216 316969 318310 319404 320247 320757 321201 321972 323023
61467 323023 324086 325408 327579 330445 332852 333860 333660 332983 332152 331220 330571 330631 331225 331838 332362 332987 333504
$$ packed form
61583C04951k067k284k162j747j310j113j071r34o65m92n22n39k91K26P51R20
61567B91651M76m20j093r12q5M20kq71j297j043n26kO69J451J859J540Q05L50
61549B92970N48J125J475J207M89q9n0N77J417K131K533K526K194J848J733J721
61533C14355J598J510J781K279K410J767N65o19j222r82k47Kr64k590l497l092
61517C13054k139j507j084m58R3J04p2L28J184J495P68l93j182j441j375j091
61501C06284p62p58j184j558j323n46K31N89N13K35L3J14M75Q78J073R92P62O17
61483C06665P40J011J062P49N17Q75J609J988J753J341J094Q43N10M44P71J051
61467C23023J063J322K171K866K407J008k00o77q31r32o49O0N94O13N24O25N17
$$ plain form
61450 333504 333451 332995 332986 333824 334852 335240 335064 335066 335611 336292 336558 336409 336413 337176 338834 341061 343560 346413 349779
61431 349779 353386 356708 359645 362597 365691 368326 369816 370265 370444 370989 371983 373261 374769 376567 378687
61416 378687 381009 383253 385166 386791 388400 390012 391211 391633 391447 391070 390522 389407 387541 385292 383257
61401 383257 381773 380701 379557 377900 375803 373830 372380 371189 369790 368239 366948 365901 364643 363170
61387 363170 362276 362659 364039 365515 366526 367127 367558 367980 368573 369456 370437 371137 371479 371883 372862 374527 376561
61370 376561 378538 380169 381224 381474 380890 379928 379319 379364 379553 379223 378575 378702 380440 383431 386534 388972 390913
61353 390913 393096 396156 400280 405291 410941 417130 423763 430501 436950 443238 450097 458024 466475 474173
61339 474173 480218 484726 488507 492339 496460 500462 503645 505706 507109 508556 510114 511142 511069 509970 508270
$$ packed form
61450C33504n3m56rQ38J028L88j76KN45O81K66j49MP63J658K227K499K853L366
61431C49779L607L322K937K952L094K635J490M49J79N45R94J278J508J798K120
61416C78687K322K244J913J625J609J612J199M22j86l77n48j115j866k249k035
61401C83257j484j072j144j657k097j973j450j191j399j551j291j047j258j473
61387C63170q94L83J380J476J011O01M31M22N93Q83R81P00L42M04R79J665K034
61370C76561J977J631J055K50n84r62o09M5J89l30o48J27J738K991L103K438J941
61353C90913K183L060M124N011N650O189O633O738O449O288O859P927Q451P698
61339D74173O045M508L781L832M121M002L183K061J403J447J558J028p3j099j700
$$ plain form
61324 508270 506249 504081 502091 500624 499695 499059 498655 498791 499808 501748 504453 507887 512224 517579 523794
61309 523794 530593 537869 545711 554185 563294 573249 584534 597404 611322 625132 637822 648971 658433
61296 658433 665947 671250 674360 675376 674089 670143 663745 655940 647926 640134 632116 623282 613556 603314
61282 603314 592903 582423 571972 561963 553077 545873 540399 536176 532563 529276 526605 525139 525153 526193
61268 526193 527343 528024 528523 529603 531559 533892 536096 538550 542269 547772 554537 561701 568891 576119 583200
61253 583200 589783 595957 602340 609356 616646 623329 628726 632645 635127 636145 635698 634157 632335 630966
61239 630966 630036 628815 626719 623992 621363 619261 617664 616583 616199 616521 617315 618577 620714 624092 628661
61224 628661 634183 640525 647545 654992 662789 671147 680122 689287 698141 706666 715106 723326 730740 736899
$$ packed form
61324E08270k021k168j990j467r29o36m04J36J017J940K705L434M337N355O215
61309E23794O799P276P842Q474R109R955J1285J2870J3918J3810J2690J1149R462
61296F58433P514N303L110J016j287l946o398p805q014p792q018q834r726j0242
61282F03314j0411j0480j0451j0009q886p204n474m223l613l287k671j466J4J040
61268E26193J150O81M99J080J956K333K204K454L719N503O765P164P190P228P081
61253E83200O583O174O383P016P290O683N397L919K482J018m47j541j822j369
61239F30966r30j221k096k727k629k102j597j081l84L22P94J262K137L378M569
61224F28661N522O342P020P447P797Q358Q975R165Q854Q525Q440Q220P414O159
$$ plain form
61210 736899 741877 746115 750117 754279 758726 763253 767594 771751 775891 780031 784053 788052 792484 797982
61196 797982 805154 814423 825735 838428 851684 865186 879130 893607 908304 922865 937150 950881
61184 950881 963307 973604 981537 987445 991623 994041 994742 994206 992999 991176 988324 984258 979342 973862
61170 973862 967291 958573 947266 934144 920517 907135 893821 879948 865014 848880 831716 813817
61158 813817 795430 776833 758566 741380 725748 711557 698471 686443 675700 666364 658381 651776
61146 651776 646685 643156 641072 640231 640202 640104 638975 636547 633437 630320 627125 623370 619212 615730 613928
61131 613928 613742 614401 615681 618393 623435 630777 639746 650072 662187 676595 693457 712815 734669
61118 734669 758634 784029 810667 839146 869998 902792 936433 970128 1003665 1036947 1069582
$$ packed form
61210G36899M978M238M002M162M447M527M341M157M140M140M022L999M432N498
61196G97982P172R269J1312J2693J3256J3502J3944J4477J4697J4561J4285J3731
61184I50881J2426J0297P933N908M178K418P01n36j207j823k852m066m916n480
61170I73862o571q718j1307j3122j3627j3382j3314j3873j4934j6134j7164j7899
61158H13817j8387j8597j8267j7186j5632j4191j3086j2028j0743r336p983o605
61146F51776n091l529k084q41k9r8j129k428l110l117l195l755m158l482j802
61131F13928j86O59J280K712N042P342Q969J0326J2115J4408J6862J9358K1854
61118G34669K3965K5395K6638K8479L0852L2794L3641L3695L3537L3282L2635
$$ plain form
61107 1069582 1100944 1130450 1157913 1183646 1207924 1230245 1249563 1265395 1278098 1287686 1293130 1293539
61095 1293539 1289454 1282028 1271325 1256454 1237186 1214329 1188433 1159267 1126934 1092617 1057708 1022885
61083 1022885 988505 955231 923680 893917 865826 839631 815586 793460 772765 753323 735270
61072 735270 718723 703780 690615 679346 669922 662265 656276 651601 647803 644902 643344 643200 643894 644985
61058 644985 646772 649708 653670 658248 663412 669430 676419 684467 693969 705349 718544 733088 748579
61045 748579 764812 781752 799713 819288 840694 863454 887134 912118 939087 967946 997795
61034 997795 1027993 1058728 1090545 1123689 1157993 1193092 1228714 1264904 1301877 1339496 1377194
61023 1377194 1414736 1452764 1492200 1533328 1575940 1620180 1666745 1716418 1769999 1828637 1893759
$$ packed form
61107A069582L1362K9506K7463K5733K4278K2321J9318J5832J2703R588N444M09
61095A293539m085p426j0703j4871j9268k2857k5896k9166l2333l4317l4909l4823
61083A022885l4380l3274l1551k9763k8091k6195k4045k2126k0695j9442j8053
61072G35270j6547j4943j3165j1269r424p657n989m675l798k901j558j44O94J091
61058F44985J787K936L962M578N164O018O989Q048R502J1380J3195J4544J5491
61045G48579J6233J6940J7961J9575K1406K2760K3680K4984K6969K8859K9849
61034I97795L0198L0735L1817L3144L4304L5099L5622L6190L6973L7619L7698
61023A377194L7542L8028L9436M1128M2612M4240M6565M9673N3581N8638O5122
$$ plain form
61012 1893759 1966620 2048392 2140809 2246675 2370135 2516954 2694271 2909739 3171648 3491167
61002 3491167 3884637 4373490 4983101 5742550 6681223 7815599 9130247 10570258 12057449
60993 12057449 13519884 14910454 16203511 17382162 18432943 19347450 20119114 20733737
60985 20733737 21166985 21397074 21421747 21261781 20947685 20502294 19931136 19221872 18350394
60976 18350394 17294234 16051102 14652021 13158548 11646106 10185842 8834016 7628019
60968 7628019 6585285 5704958 4973302 4370407 3874903 3466472 3127746 2845423 2609495
60959 2609495 2411453 2243572 2099589 1975150 1867267 1773649 1692510 1622450 1562147 1510339
60949 1510339 1466069 1428627 1397006 1369713 1345305 1323014 1302641 1283981 1266581 1250085 1234519
$$ packed form
61012A893759P2861Q1772R2417J05866J23460J46819J77317K15468K61909L19519
61002C491167L93470M88853O09611P59449R38673J134376J314648J440011J487191
60993A2057449J462435J390570J293057J178651J050781R14507P71664O14623
60985B0733737M33248K30089K4673j59966l14096m45391n71158p09264q71478
60976A8350394j056160j243132j399081j493473j512442j460264j351826j205997
60968G628019j042734q80327p31656o02895m95504m08431l38726k82323k35928
60959B609495j98042j67881j43983j24439j07883r3618q1139p0060o0303n1808
60949A510339m4270l7442l1621k7293k4408k2291k0373j8660j7400j6496j5566
$$ plain form
60938 1234519 1220075 1206665 1193876 1181386 1169379 1158459 1149179 1141637 1135478 1130302 1126134 1123463
60926 1123463 1122783 1124167 1127464 1132818 1140627 1150868 1162769 1175374 1188212 1201178 1214030 1226335
60914 1226335 1237823 1248452 1258156 1266795 1274332 1280837 1286289 1290458 1292855 1292728 1289405 1282925 1274083 1263530
60900 1263530 1251131 1236611 1220462 1203548 1186001 1167326 1147689 1128248 1109910 1092342 1074589
60889 1074589 1056114 1036862 1016844 996230 975561 955288 935256 915045 894718 874865 856056
60878 856056 838549 822394 807421 793212 779424 766123 753537 741575 729971 718869 708863
60867 708863 700258 692607 685175 677689 670397 663506 656907 650502 644503 639084 633847 628051 621562 615252
60853 615252 610124 606195 602534 598338 593555 588473 583176 577583 571753 565894 560228 554928 549968 544911
$$ packed form
60938A234519j4444j3410j2789j2490j2007j0920r280p542o159n176m168k671
60926A123463o80J384L297N354P809J0241J1901J2605J2838J2966J2852J2305
60914A226335J1488J0629R704Q639P537O505N452M169K397j27l323o480q842j0553
60900A263530j2399j4520j6149j6914j7547j8675j9637j9441j8338j7568j7753
60889A074589j8475j9252k0018k0614k0669k0273k0032k0211k0327j9853j8809
60878H56056j7507j6155j4973j4209j3788j3301j2586j1962j1604j1102j0006
60867G08863q605p651p432p486p292o891o599o405n999n419n237n796o489o310
60853F15252n128l929l661m196m783n082n297n593n830n859n666n300m960n057
$$ plain form
60839 544911 539080 532162 524535 516865 509515 502434 495516 488933 483109 478357 474486 470957 467605 464996
60825 464996 463703 463397 463188 462792 462755 463438 464479 465493 466659 468138 469484 470214 470601 471307 472535 474029
60809 474029 475636 477226 478263 478183 477233 476353 476158 476497 477040 477689 478204 477991 476674 474678 472880 471788 471186
60792 471186 470498 469338 467751 466029 464268 462242 459744 457005 454531 452558 450796 448692 445845 442228
60778 442228 438206 434219 430337 426256 421928 418015 415330 413866 412773 411306 409435 407490 405681 404252
60764 404252 403691 404316 405671 406718 406770 406092 405528 405690 406607 408037 409826 411832 413705 415110 416207 417647
60748 417647 419944 423050 426661 430643 434825 438602 441210 442505 443166 443995 445100 445786 445061 442317 437719
60733 437719 432117 426449 421207 416403 411891 407486 402909 397960 392872 388273 384659 381945 379611 377210
$$ packed form
60839E44911n831o918p627p670p350p081o918o583n824m752l871l529l352k609
60825D64996j293l06k09l96l7O83J041J014J166J479J346P30L87P06J228J494
60809D74029J607J590J037q0r50q80j95L39N43O49N15k13j317j996j798j092o02
60792D71186o88j160j587j722j761k026k498k739k474j973j762k104k847l617
60778D42228m022l987l882m081m328l913k685j464j093j467j871j945j809j429
60764D04252n61O25J355J047N2o78n64J62R17J430J789K006J873J405J097J440
60748D17647K297L106L611L982M182L777K608J295O61Q29J105O86p25k744m598
60733D37719n602n668n242m804m512m405m577m949n088m599l614k714k334k401
$$ plain form
60719 377210 374656 372031 369225 365894 361954 358041 355239 354136 354260 354446 353639 351438 348319 345533 344292
60704 344292 344598 345136 344719 343585 342818 342827 343114 343358 343856 344770 345720 346506 347570 349298 351324 353020 354329
60687 354329 355661 357218 358916 360822 363262 366524 370662 375488 380534 385267 389641 394258 399685 405724
60673 405724 411638 416910 421487 425436 428752 431453 433542 434950 435839 436783 438222 439793 440634 440348 439272
60658 439272 437782 435876 433611 431462 429904 428897 428104 427348 426644 425984 425399 425051 424976 424869 424387 423512 422349
60641 422349 420689 418131 414640 410673 406752 403112 399768 396676 393747 390919 388289 386035 384202 382699
60627 382699 381496 380641 380115 379915 380230 381218 382562 383580 383944 383995 384190 384482 384505 384120 383522 382973 382666 382672 382817
60608 382817 382796 382644 382838 383617 384493 384868 384907 385209 385788 386066 385947 386159 387221 388626 389453 389412 388893 388335 387961
$$ packed form
60719C77210k554k625k806l331l940l913k802j103J24J86q07k201l119k786j241
60704C44292L06N38m17j134p67RK87K44M98R14R50P86J064J728K026J696J309
60687C54329J332J557J698J906K440L262M138M826N046M733M374M617N427O039
60673D05724N914N272M577L949L316K701K089J408Q89R44J439J571Q41k86j076
60658D39272j490j906k265k149j558j007p93p56p04o60n85l48p5j07m82q75j163
60641D22349j660k558l491l967l921l640l344l092k929k828k630k254j833j503
60627C82699j203q55n26k00L15R88J344J018L64N1J95K92K3l85n98n49l07OJ45
60608C82817k1j52J94P79Q76L75L9L02N79K78j19K12J062J405Q27m1n19n58l74
$$ plain form
60589 387961 387885 388105 388476 388968 389728 390676 391306 391250 390825 390673 391027 391671 392409 393189 393972 394950 396777 400114 404986
60570 404986 410937 417707 425234 433205 441274 449795 459607 470811 482355 493127 502900 511716 518888
60557 518888 523321 524697 523735 521328 517871 513487 508456 503187 497997 493132 488988 486148 485080 485729 487515
60542 487515 490008 493581 499098 506794 515832 525239 534942 545464 556846 568454 579757 590648 600847
60529 600847 609526 615904 619874 621759 621803 620290 617890 615289 612480 608847 604069 598614 593217 588183 583382
60514 583382 578699 574266 570390 567389 565388 564166 563412 563234 564248 566900 570983 576112 582555 591157 602556
60499 602556 616890 634372 655653 681340 711373 745038 781350 819203 857425 894945 930852
60488 930852 964102 993346 1017271 1034907 1045410 1047846 1041720 1027712 1007367 981812 951078 915042
$$ packed form
60589C87961p6K20L71M92P60R48O30n6m25j52L54O44P38P80P83R78J827L337M872
60570D04986N951O770P527P971Q069Q521R812J1204J1544J0772R773Q816P172
60557E18888M433J376r62k407l457m384n031n269n190m865m144k840j068O49J786
60542D87515K493L573N517P696R038R407R703J0522J1382J1608J1303J0891J0199
60529F00847Q679O378L970J885M4j513k400k601k809l633m778n455n397n034m801
60514E83382m683m433l876l001k001j222p54j78J014K652M083N129O443Q602J1399
60499F02556J4334J7482K1281K5687L0033L3665L6312L7853L8222L7520L5907
60488I30852L3250K9244K3925J7636J0503K436o126j4008k0345k5555l0734l6036
$$ plain form
60476 915042 874932 833545 793744 756739 721989 688710 657205 628557 603381 581381 562049
60465 562049 545185 530495 517308 505167 494340 485203 477323 469671 461708 453832 446799 441092 436769
60452 436769 433482 430634 427888 425485 423720 422233 420312 417820 415230 412760 410200 407715 406075 405618
60438 405618 405564 404862 403368 401748 400549 399799 399249 398597 397709 396946 396946 397706 398247 397708 396462 395569 395369 395328 395139
60419 395139 395181 395751 396496 396927 397020 397088 397484 398598 400653 403180 405158 406106 406720 407993 409920 411607 412528
60402 412528 413146 414182 415688 417117 418093 418816 419722 420928 422138 423086 423898 424884 426107 427365 428610 430039
60386 430039 431650 433065 434100 435290 437421 440543 443821 446419 448218 449575 450702 451542 452099 452654 453651
60371 453651 455402 457777 460120 461694 462373 462809 463750 465303 467028 468592 470108 471906 474195 476943 479891
$$ packed form
60476I15042m0110m1387l9801l7005l4750l3279l1505k8648k5176k2000j9332
60465E62049j6864j4690j3187j2141j0827r137p880p652p963p876p033n707m323
60452D36769l287k848k746k403j765j487j921k492k590k470k560k485j640m57
60438D05618n4p02j494j620j199p50n50o52q88p63%P60N41n39j246q93k00m1j89
60419C95139M2N70P45M31R3O8L96J114K055K527J978R48O14J273J927J687R21
60402D12528O18J036J506J429R76P23R06J206J210R48Q12R86J223J258J245J429
60386D30039J611J415J035J190K131L122L278K598J799J357J127Q40N57N55R97
60371D53651J751K375K343J574O79M36R41J553J725J564J516J798K289K748K948
$$ plain form
60356 479891 482706 485320 488090 491488 495670 500539 506115 512533 519742 527511 535681 544061 552063 558985
60342 558985 564731 569737 573946 576415 576346 574091 570589 566170 560531 553668 546149 538498 530912 523669 517244
60327 517244 511828 507171 503071 499596 496736 494284 492250 490963 490489 490358 490165 490018 490112 490308 490631 491822
60311 491822 494760 499510 505546 512919 522549 535221 550770 568530 588160 609612 632452 655566
60299 655566 677538 697092 713174 724811 731134 731652 726590 716889 703670 687666 669308 649381
60287 649381 629314 610540 593693 578636 565227 553713 544393 537212 531855 527943 524898 521921 518505
60274 518505 514838 511303 507743 503666 499194 495153 492010 489263 486276 483272 480986 479612 478636 477468
60260 477468 475752 473280 470233 467495 466055 465948 466316 466555 466889 467676 468750 469778 470688 471409 471664 471483
$$ packed form
60356D79891K815K614K770L398M182M869N576O418P209P769Q170Q380Q002O922
60342E58985N746N006M209K469o9k255l502m419n639o863p519p651p586p243o425
60327E17244n416m657m100l475k860k452k034j287m74j31j93j47R4J96L23J191
60311D91822K938M750O036P373R630J2672J5549J7760J9630K1452K2840K3114
60299F55566K1972J9554J6082J1637O323N18n062r701j3219j6004j8358j9927
60287F49381k0067j8774j6847j5057j3409j1514r320p181n357l912l045k977l416
60274E18505l667l535l560m077m472m041l143k747k987l004k286j374r76j168
60260D77468j716k472l047k738j440j07L68K39L34P87J074J028R10P21K55j81
$$ plain form
60244 471483 471538 472423 473862 475099 475907 476642 477439 477905 477723 477139 476650 476472 476512 476740 477449 479043 481557 484432
60226 484432 487010 489318 492022 495458 499003 501786 503738 505490 507403 509234 510829 512667 515531 519919
60212 519919 525888 533149 541098 549019 556500 563644 570821 578390 586585 595358 604128 611990 618531 624285
60198 624285 630085 636022 641352 645466 648566 651226 653562 655151 655645 655107 653750 651703 649162 646505 643942
60183 643942 641182 637671 633126 627664 621555 615093 608615 602340 596238 590371 585296 581637 579183 576893
60169 576893 574038 570921 568190 565926 563844 562090 561152 561081 561380 561770 562532 563874 565362 566361 566826 567331
60153 567331 568369 569938 571835 574069 576693 579390 581567 583032 584378 586463 589609 593583 598201 603526
60139 603526 609424 615438 621403 627824 635279 643647 652274 660722 668976 676960 684286 690524 695397 698724
$$ packed form
60244D71483N5Q85J439J237Q08P35P97M66j82n84m89j78M0K28P09J594K514K875
60226D84432K578K308K704L436L545K783J952J752J913J831J595J838K864M388
60212E19919N969P261P949P921P481P144P177P569Q195Q773Q770P862O541N754
60198F24285N800N937N330M114L100K660K336J589M94n38j357k047k541k657k563
60183F43942k760l511m545n462o109o462o478o275o102n867n075l659k454k290
60169E76893k855l117k731k264k082j754r38p1K99L90P62J342J488R99M65N05
60153E67331J038J569J897K234K624K697K177J465J346K085L146L974M618N325
60139F03526N898O014N965O421P455Q368Q627Q448Q254P984P326O238M873L327
$$ plain form
60125 698724 700481 701057 701191 701420 701675 701509 700681 699487 698593 698595 699653 701449 703466 705333 706985 708611 710425
60108 710425 712340 713856 714438 714042 713064 711750 709894 707257 703977 700324 696305 691845 687277 683286 680305
60093 680305 678072 675820 672929 669573 666755 665482 665777 666745 667721 668947 670902 673441 676022 678499 681113
60078 681113 683852 686296 688050 688895 688595 686929 683887 679492 673582 666185 657967 649758 641694 633341 624623
60063 624623 615961 607495 598919 590348 582636 576376 571071 565827 560473 555538 551404 548029 545343 543425
60049 543425 542219 541487 541148 541479 542924 545786 550020 555179 560624 565966 571330 577141 583690 590922 598452
60034 598452 605608 611550 615632 617820 618757 619267 619639 619306 617371 613549 608477 602955 597012 589952 581252
60019 581252 571176 560549 550195 540550 531599 523129 515225 508459 503376 499870 497293 495077 492957
$$ packed form
60125F98724J757N76J34K29K55j66q28j194q94KJ058J796K017J867J652J626J814
60108G10425J915J516N82l96r78j314j856k637l280l653m019m460m568l991k981
60093F80305k233k252k891l356k818j273K95R68R76J226J955K539K581K477K614
60078F81113K739K444J754Q45l00j666l042m395n910p397q218q209q064q353q718
60063F24623q662q466q576q571p712o260n305n244n354m935m134l375k686j918
60049E43425j206p32l39L31J445K862M234N159N445N342N364N811O549P232P530
60034E98452P156N942M082K188R37N10L72l33j935l822n072n522n943p060q700
60019E81252j0076j0627j0354r645q951q470p904o766n083l506k577k216k120
$$ plain form
60006 492957 490847 488887 487518 486964 486718 486133 485489 485732 486958 487921 487473 485911 484393 483575 483415 483922 485347
59989 485347 487709 490655 493798 496897 499874 502967 506617 510785 514549 516851 517498 517028 515773 513656 510834
59974 510834 507944 505459 503211 500718 497731 494367 490994 488117 486159 485251 485304 486196 487709 489468 491348
59959 491348 493832 497489 502033 506289 509226 510692 511084 510818 510343 510253 510931 512271 514015 516140 518623 521054
59943 521054 522875 523960 524620 525041 525027 524335 523018 521336 519485 517482 515216 512595 509733 506976 504694
59928 504694 503068 502191 502168 502888 503847 504536 505071 506032 507660 509612 511708 514400 518083 522378 526664 531089
59912 531089 536246 541907 546868 550416 553254 556444 559913 562628 564018 564597 565203 566179 567334 568312 568833
59897 568833 568874 568762 568928 569595 570818 572724 575363 578441 581532 584574 587867 591631 595920 600890 606685
$$ packed form
60006D92957k110j960j369n54k46n85o44K43J226R63m48j562j518q18j60N07J425
59989D85347K362K946L143L099K977L093L650M168L764K302O47m70j255k117k822
59974E10834k890k485k248k493k987l364l373k877j958r08N3Q92J513J759J880
59959D91348K484L657M544M256K937J466L92k66m75r0O78J340J744K125K483K431
59943E21054J821J085O60M21j4o92j317j682j851k003k266k621k862k757k282
59928E04694j626q77k3P20R59O89N35R61J628J952K096K692L683M295M286M425
59912E31089N157N661M961L548K838L190L469K715J390N79O06R76J155R78N21
59897E68833M1j12J66O67J223J906K639L078L091L042L293L764M289M970N795
$$ plain form
59882 606685 612997 619213 625135 631192 637739 644520 650908 656330 660314 662636 663685 664218 664355 663132 659487
59867 659487 653483 646192 638584 630914 623080 615159 607521 600600 594538 589073 583973 579588 576566 574924
59853 574924 573880 572952 572733 574100 577088 581081 585829 591548 598193 605276 612425 619515 626275 632394 638054
59838 638054 643749 649395 654201 657603 659866 661554 662960 664323 665990 667899 669237 669101 667232 663809
59824 663809 658912 652688 645767 638855 631960 624538 616444 608269 600640 593642 587112 581118 575904 571606
59810 571606 568270 565892 564206 562597 560599 558424 556667 555436 554080 551976 549388 547279 546271 545982
59796 545982 545439 544020 541905 539674 537628 535566 533148 530351 527532 525108 523295 522106 521422 520962 520330
59781 520330 519279 517939 516638 515476 514166 512336 509942 507344 505019 503245 502049 501423 501443 502067 502873
$$ packed form
59882F06685O312O216N922O057O547O781O388N422L984K322J049N33J37j223l645
59867F59487o004p291p608p670p834p921p638o921o062n465n100m385l022j642
59853E74924j044r28k19J367K988L993M748N719O645P083P149P090O760O119N660
59838F38054N695N646M806L402K263J688J406J363J667J909J338j36j869l423
59824F63809m897o224o921o912o895p422q094q175p629o998o530n994n214m298
59810E71606l336k378j686j609j998k175j757j231j356k104k588k109j008k89
59796E45982n43j419k115k231k046k062k418k797k819k424j813j189o84m60o32
59781E20330j051j340j301j162j310j830k394k598k325j774j196o26K0O24Q06
$$ plain form
59766 502873 503376 503677 504495 506256 508426 510180 511483 512952 514708 516086 516801 517780 520307 524663 530104
59751 530104 535963 542188 548858 555698 562311 568584 574654 580659 586657 592668 598623 604285 609218 612929
59737 612929 615179 616239 616713 616952 616758 615780 614068 612048 610100 608450 607380 607166 607723 608585 609385 610203
59721 610203 611329 612789 614210 615058 614964 613919 612253 610350 608340 606076 603470 600813 598745 597824 598008
59706 598008 598515 598346 597110 595310 593744 592752 592188 591895 591876 591997 591959 591695 591494 591556 591691 591720 591906 592596 593581
59687 593581 594272 594578 595108 596304 597758 598768 599327 600084 601343 602522 602730 601611 599498 596971 594384 591623
59671 591623 588249 584054 579449 574971 570439 565140 559073 553445 549392 546690 544336 542085 540618 540257
59657 540257 540364 540220 539876 539847 540487 541972 544481 547937 551815 555440 558384 560462 561646 562038 561679 560303
$$ packed form
59766E02873N03L01Q18J761K170J754J303J469J756J378P15R79K527M356N441
59751E30104N859O225O670O840O613O273O070O005N998O011N955N662M933L711
59737F12929K250J060M74K39j94r78j712k020j948j650j070k14N57Q62Q00Q18
59721F10203J126J460J421Q48r4j045j666j903k010k264k606k657k068r21J84
59706E98008N07j69j236j800j566r92n64k93j9J21l8k64k01O2J35K9J86O90R85
59687E93581O91L06N30J196J454J010N59P57J259J179K08j119k113k527k587k761
59671E91623l374m195m605m478m532n299o067n628m053k702k354k251j467l61
59657E40257J07j44l44k9O40J485K509L456L878L625K944K078J184L92l59j376
$$ plain form
59641 560303 557671 554224 550998 548760 547603 547429 548241 549714 551137 552161 553138 554275 554997 554725 553865 553343
59625 553343 553369 553304 552616 551381 549881 548235 546508 544789 543077 541350 539730 538423 537593 537446 538139 539361
59609 539361 540373 540881 541594 543455 546511 550037 553540 557033 560436 563365 565615 567355 568692 569424 569378
59594 569378 568710 567754 566713 565459 563551 560659 557229 554388 552840 552100 551233 549985 548603 546835 543996
59579 543996 540044 535917 532598 530337 528822 527559 525977 523770 521376 519675 519036 519039 519225 519626 520406 521477
59563 521477 522768 524426 526439 528365 529694 530267 530187 529602 528812 528397 528983 530834 533622 536516 538717 540157
59547 540157 541526 543375 545554 547898 551045 555835 562179 569409 577592 587502 599068 610904 621870
59534 621870 632299 643030 653834 663376 670360 674224 675155 674019 672110 670488 669572 669438 670176 671800
$$ packed form
59641E60303k632l447l226k238j157j74Q12J473J423J024R77J137P22k72q60n22
59625E53343K6o5o88j235j500j646j727j719j712j727j620j307q30j47O93J222
59609E39361J012N08P13J861L056L526L503L493L403K929K250J740J337P32m6
59594E69378o68r56j041j254j908k892l430k841j548p40q67j248j382j768k839
59579E43996l952m127l319k261j515j263j582k207k394j701o39LJ86M01P80J071
59563E21477J291J658K013J926J329N73q0n85p90m15N86J851K788K894K201J440
59547E40157J369J849K179K344L147M790O344P230Q183R910J1566J1836J0966
59534F21870J0429J0731J0804R542O984L864R31j136j909j622r16j34P38J624
$$ plain form
59520 671800 674174 677200 680630 683598 685026 684783 683785 682507 680071 675411 668711 660948 652490 643034 632631
59505 632631 621918 611363 601045 591243 582579 575430 569680 565131 561765 559520 558113 557159 556241 555012
59491 555012 553529 552317 551760 551629 551654 552298 554305 557597 561315 565026 569166 574094 579443 584861 590775
59476 590775 597798 605666 613417 620519 627303 634263 641365 648153 654139 658914 662170 663917 664554 664540 664116
59461 664116 663549 663495 664773 667785 672422 678519 686062 694885 704605 715048 726379 738538 750930 762985
59447 762985 774662 785895 795854 803339 807759 809209 807789 803523 796832 788312 777984 765460 751001
59434 751001 735744 720735 706445 693393 682350 673499 666158 659925 655496 653768 654676 657568 662273
59421 662273 669153 678452 690227 704638 721697 741017 762324 785841 811460 837807 862818 885033
$$ packed form
59520F71800K374L026L430K968J428k43r98j278k436m660o700p763q458r456j0403
59505F32631j0713j0555j0318r802q664p149n750m549l366k245j407r54r18j229
59491E55012j483j212n57j31K5O44K007L292L718L711M140M928N349N418N914
59476E90775P023P868P751P102O784O960P102O788N986M775L256J747O37j4m24
59461F64116n67n4J278L012M637O097P543Q823R720J0443J1331J2159J2392J2055
59447G62985J1677J1233R959P485M420J450j420m266o691q520j0328j2524j4459
59434G51001j5257j5009j4290j3052j1043q851p341o233m429j728R08K892M705
59421F62273O880R299J1775J4411J7059J9320K1307K3517K5619K6347K5011K2215
$$ plain form
59409 885033 903729 918171 927708 932526 933347 930281 922976 912150 900041 888736 878703 869457 860979
59396 860979 853681 847333 840938 833686 825330 815420 802815 786539 766990 745902 725113 705664 688074
59383 688074 672949 660811 651477 644091 638002 633351 630671 630090 631048 632680 634406 636229 638450 641019
59369 641019 643363 645152 646955 649578 652798 655520 657342 659233 662279 666362 670625 674703 678900 683560
59355 683560 688942 695510 703704 713488 724573 736906 750543 765260 780778 797196 814707 833086
59343 833086 851915 871043 890235 908570 924876 938649 949889 958118 962384 962401 958991 953103 944869
59330 944869 933894 920027 903608 885340 866228 847314 829176 811755 794833 778519 763242
59319 763242 749461 737433 727014 717718 709158 701425 694774 689029 683624 678250 673113 668508 664485
$$ packed form
59409H85033J8696J4442R537M818Q21l066p305j0826j2109j1305j0033r246q478
59396H60979p298o348o395p252q356r910j2605j6276j9549k1088k0789j9449j7590
59383F88074j5125j2138r334p386o089m651k680n81R58J632J726J823K221K569
59369F41019K344J789J803K623L220K722J822J891L046M083M263M078M197M660
59355F83560N382O568Q194R784J1085J2333J3637J4717J5518J6418J7511J8379
59343H33086J8829J9128J9192J8335J6306J3773J1240Q229M266J7l410n888q234
59330I44869j0975j3867j6419j8268j9112j8914j8138j7421j6922j6314j5277
59319G63242j3781j2028j0419r296q560p733o651n745n405n374n137m605m023
$$ plain form
59306 664485 661017 658248 656391 655546 655734 657081 659965 664925 672140 680854 689598 697275 703746 709107 712721
59291 712721 713494 710890 705219 697100 687157 676119 664651 653138 642082 632526 625467 620906 618074
59278 618074 616615 616991 619680 624650 631741 640928 652011 664576 678503 693978 710734 727708 743741
59265 743741 758245 771003 781697 789884 795101 796918 795281 790944 785030 777976 769363 759022 747744
59252 747744 736552 725745 715165 705060 696148 688973 683632 680060 678216 677965 678972 680832 683291
59239 683291 686428 690566 695882 702157 709118 716770 725018 733111 740059 745696 750742 755614 759649 761720
59225 761720 761190 758099 752899 746364 739289 731953 724147 715935 707950 700639 693692 686650 679696 673365
59211 673365 667756 662503 657282 651932 646291 640387 634656 629504 624780 619993 614993 610016 605141 600153
$$ packed form
59306F64485l468k769j857q45J88J347K884M960P215Q714Q744P677O471N361L614
59291G12721P73k604n671q119r943j1038j1468j1513j1056r556p059m561k832
59278F18074j459L76K689M970P091R187J1083J2565J3927J5475J6756J6974J6033
59265G43741J4504J2758J0694Q187N217J817j637m337n914p054q613j0341j1278
59252G47744j1192j0807j0580j0105q912p175n341l572j844k51J007J860K459
59239F83291L137M138N316O275O961P652Q248Q093O948N637N046M872M035K071
59225G61720n30l091n200o535p075p336p806q212p985p311o947p042o954o331
59211F73365n609n253n221n350n641n904n731n152m724m787n000m977m875m988
$$ plain form
59197 600153 595003 590109 586082 583283 581609 580536 579452 578133 576886 576117 575962 576450 577777 580079 583052
59182 583052 586244 589685 593858 598928 604347 609435 614187 619287 625395 632633 640664 649029 657284 665116
59168 665116 672701 680952 690991 703060 716053 728353 739052 748238 756344 763487 769317 773151 774305
59155 774305 772588 768504 762756 755579 746778 736269 724321 711404 698103 685010 672348 659824
59143 659824 647281 635266 624449 614657 605126 595661 586823 578925 571668 564999 559584 555959 553754
59130 553754 552164 550758 549436 548066 546662 545642 545552 546691 549162 552903 557460 562203 567052 572572 579065
59115 579065 586099 593311 601068 609763 618858 627352 635000 642440 650215 658196 665912 672993 679214 684512
59101 684512 689025 692893 696080 698532 700427 702060 703571 704899 705821 705970 705136 703668 702268 701194 700085
$$ packed form
59197F00153n150m894m027k799j674j073j084j319j247p69j55M88J327K302K973
59182E83052L192L441M173N070N419N088M752N100O108P238Q031Q365Q255P832
59168F65116P585Q251J0039J2069J2993J2300J0699R186Q106P143N830L834J154
59155G74305j717m084n748p177q801j0509j1948j2917j3301j3093j2662j2524
59143F59824j2543j2015j0817r792r531r465q838p898p257o669n415l625k205
59130E53754j590j406j322j370j404j020r0J139K471L741M557M743M849N520O493
59115E79065P034P212P757Q695R095Q494P648P440P775P981P716P081O221N298
59101F84512M513L868L187K452J895J633J511J328R22J49q34j468j400j074j109
$$ plain form
59086 700085 698756 697611 696845 695677 692993 688503 682812 676563 669955 662868 655017 646183 636802 628117
59072 628117 621199 615888 611134 606285 601558 597309 593399 589431 585329 581546 578836 577670 577664 577725 577027 575731
59056 575731 574536 573787 573291 572787 572220 571658 571189 570698 569598 567231 563847 560693 558603 557041 555123 553084
59040 553084 551769 551025 549748 547642 545849 545541 546691 548629 551065 553979 557112 560232 563733 568409 574698
59025 574698 582419 591212 601001 612035 624464 637810 650936 662787 673135 682380 690705 697747 702999
59012 702999 706161 707148 706258 704376 702480 700792 698896 696832 695456 695455 696584 698406 701256 705747 711610
58997 711610 717871 724282 731848 741571 753111 765107 776513 787109 796838 805214 811707 816325 819423
58984 819423 821072 821029 819306 816403 812841 808825 804559 800628 797806 796627 797365 800191 805109 811870 820252
$$ packed form
59086G00085j329j145p66j168k684m490n691o249o608p087p851q834r381q685
59072F28117o918n311m754m849m727m249l910l968m102l783k710j166oO1o98j296
59056E75731j195p49m96n04n67n62m69m91j100k367l384l154k090j562j918k039
59040E53084j315p44j277k106j793l08J150J938K436K914L133L120L501M676O289
59025E74698P721Q793R789J1034J2429J3346J3126J1851J0348R245Q325P042N252
59012G02999L162R87q90j882j896j688j896k064j376jJ129J822K850M491N863
58997G11610O261O411P566R723J1540J1996J1406J0596R729Q376O493M618L098
58984H19423J649m3j723k903l562m016m266l931k822j179P38K826M918O761Q382
$$ plain form
58969 820252 830292 842019 855067 868875 883181 898075 913591 929511 945443 960791 974695
58958 974695 986340 995332 1001514 1004488 1003690 998966 990734 979451 965245 948187 928698 907536 885591
58945 885591 863732 842592 822318 802779 784218 767510 753544 742386 733269 725350 718336 712395
58933 712395 707726 704364 702320 701668 702375 704081 706119 707764 708472 708010 706415 703813 700275 696040 691918
58918 691918 689055 687923 687724 687275 686398 685906 686295 687135 687986 689223 691498 694901 699119 704086 710019 717163
58902 717163 725946 737008 750427 765175 779995 794785 810558 828095 847247 867589 889144 912213
58890 912213 936986 963590 992194 1022780 1054917 1087914 1121027 1153453 1184338 1212888 1238300
58879 1238300 1259544 1275467 1285325 1289144 1287484 1280856 1269371 1252911 1231646 1206437 1178646 1149550
$$ packed form
58969H20252J0040J1727J3048J3808J4306J4894J5516J5920J5932J5348J3904
58958I74695J1645Q992O182K974p98m724q232j1283j4206j7058j9489k1162k1945
58945H85591k1859k1140k0274j9539j8561j6708j3966j1158r117p919p014n941
58933G12395m669l362k044o52P07J706K038J645P08m62j595k602l538m235m122
58918F91918k863j132j99m49q77m92L89Q40Q51J237K275L403M218M967N933P144
58902G17163Q783J1062J3419J4748J4820J4790J5773J7537J9152K0342K1555K3069
58890I12213K4773K6604K8604L0586L2137L2997L3113L2426L0885K8550K5412
58879A238300K1244J5923R858L819j660o628j1485j6460k1265k5209k7791k9096
$$ plain form
58867 1149550 1120036 1090854 1062882 1036883 1013133 991484 971711 953659 937131 921828 907376
58856 907376 893399 879704 866395 853641 841339 829315 817809 807320 797853 788826 779989 771857
58844 771857 764794 758161 750998 743217 735456 727932 720138 711721 703011 694497 686170 677696 669062 660912
58830 660912 654199 649400 646000 643004 640029 637629 636413 636278 636804 638007 640231 643639 648226 654013 660694
58815 660694 667379 673260 678421 683444 688388 692672 695878 698167 699942 701538 703096 704275 704244 702438 699235
58800 699235 695401 691051 685777 679661 673450 667623 661876 655706 649032 642152 635481 629471 624432 620334
58786 620334 617051 614722 613598 613629 614556 616260 618689 621616 624882 628613 632706 636386 638896 640364 641271
58771 641271 641251 639373 635639 631305 627476 624128 620780 617395 614176 611063 607915 604900 602389 600706 600074
$$ packed form
58867A149550k9514k9182k7972k5999k3750k1649j9773j8052j6528j5303j4452
58856I07376j3977j3695j3309j2754j2302j2024j1506j0489r467r027q837q132
58844G71857p063o633p163p781p761p524p794q417q710q514q327q474q634q150
58830F60912o713m799l400k996k975k400j216j35N26J203K224L408M587N787O681
58815F60694O685N881N161N023M944M284L206K289J775J596J558J179l1j806l203
58800F99235l834m350n274o116o211n827n747o170o674o880o671o010n039m098
58786F20334l283k329j124L1R27J704K429K927L266L731M093L680K510J468R07
58771F41271k0j878l734m334l829l348l348l385l219l113l148l015k511j683o32
$$ plain form
58756 600074 600455 601390 602404 603752 606318 610586 616049 621775 627175 632105 636606 640813 644890 648903 652927
58741 652927 657270 662229 667695 673314 679061 685249 691919 698573 704626 709913 714827 720097 726176 732586
58727 732586 738204 742672 747160 753132 760638 768544 776153 783705 791418 799033 806494 814210 822434 831067
58713 831067 840237 850230 860519 869637 876474 881208 884623 887014 888023 887038 883375 876449 866120 852670
58699 852670 836419 817704 797180 775689 753782 731842 710554 690685 672365 655262 639469
58688 639469 625556 613738 603684 595162 588080 581813 575406 568753 562762 558015 554038 550246 546832
58675 546832 544236 542340 540758 539467 538769 539009 540658 544239 549912 557435 566559 576942 587695 597746
58661 597746 606874 615770 624864 633710 641608 648112 652717 654871 654583 652395 648656 643556 637904 632814
$$ packed form
58756F00074L81R35J014J348K566M268N463N726N400M930M501M207M077M013M024
58741F52927M343M959N466N619N747O188O670O654O053N287M914N270O079O410
58727G32586N618M468M488N972P506P906P609P552P713P615P461P716Q224Q633
58713H31067R170R993J0289R118O837M734L415K391J009r85l663o926j0329j3450
58699H52670j6251j8715k0524k1491k1907k1940k1288j9869j8320j7103j5793
58688F39469j3913j1818j0054q522p082o267o407o653n991m747l977l792l414
58675E46832k596j896j582j291o98K40J649L581N673P523R124J0383J0753J0051
58661E97746R128Q896R094Q846P898O504M605K154k88k188l739n100n652n090
$$ plain form
58647 632814 628313 623309 617359 611459 606562 602385 598369 594877 592581 591434 591106 591792 593838 597080 601276
58632 601276 606601 612956 619328 624605 628607 631689 633899 635272 636497 638340 640629 642543 643769 644873
58618 644873 646744 650122 655365 662102 669341 676413 683549 691244 699366 707378 715008 722130 728164 732155
58604 732155 733486 732338 729530 725934 721767 716470 709650 701945 694428 687290 679961 672474 665771 660568
58590 660568 656914 655108 655846 659047 663626 668976 675600 683733 692486 701165 710331 720592 731313 741564
58576 741564 751503 761697 771773 780900 789167 797365 805829 814519 824039 835610 850065 867442 887389
58563 887389 909394 932889 957614 983593 1010448 1037109 1062384 1085273 1104640 1119552 1130238
58552 1130238 1137678 1141834 1141544 1136775 1129580 1121866 1113499 1103728 1093179 1082904 1072507 1060854 1047986
$$ packed form
58647F32814m501n004n950n900m897m177m016l492k296j147l28O86K046L242M196
58632F01276N325O355O372N277M002L082K210J373J225J843K289J914J226J104
58618F44873J871L378N243O737P239P072P136P695Q122Q012P630P122O034L991
58604G32155J331j148k808l596m167n297o820p705p517p138p329p487o703n203
58590F60568l654j806P38L201M579N350O624Q133Q753Q679R166J0261J0721J0251
58576G41564R939J0194J0076R127Q267Q198Q464Q690R520J1571J4455J7377J9947
58563H87389K2005K3495K4725K5979K6855K6661K5275K2889J9367J4912J0686
58552A130238P440M156k90m769p195p714q367r771j0549j0275j0397j1653j2868
$$ plain form
58539 1047986 1034697 1020781 1005271 988120 970128 951463 931725 911442 892127 874809 859692
58528 859692 847188 838084 832463 829434 828112 828140 829284 831275 834004 837260 840399 842833 844526 845433 844991
58513 844991 842899 839868 836702 833096 828232 822170 815758 809600 803973 799252 795434 791670 787278 782771
58499 782771 778992 775740 772270 768609 765226 761855 757837 753328 749121 745626 742996 741827 742593 744746
58485 744746 747412 750599 754781 759963 766300 774921 786736 800849 815500 830105 845009 859797 873443
58472 873443 885706 896735 905535 910491 911368 909246 904574 896851 886323 874523 862947 852490 844160
58459 844160 838957 836867 837186 839856 845309 853088 861949 871278 881095 890728 898879 905097 909833 912920
58445 912920 913356 910750 905798 899159 890977 881613 871824 862182 853221 845880 840712 837019 834002 832330
$$ packed form
58539A047986j3289j3916j5510j7151j7992j8665j9738k0283j9315j7318j5117
58528H59692j2504r104n621l029j322K8J144J991K729L256L139K434J693R07m42
58513H44991k092l031l166l606m864o062o412o158n627m721l818l764m392m507
58499G82771l779l252l470l661l383l371m018m509m207l495k630j169P66K153
58485G44746K666L187M182N182O337Q621J1815J4113J4651J4605J4904J4788J3646
58472H73443J2263J1029Q800M956Q77k122m672p723j0528j1800j1576j0457q330
58459H44160n203k090L19K670N453P779Q861R329R817R633Q151O218M736L087
58445I12920M36k606m952o639q182r364r789r642q961p341n168l693l017j672
$$ plain form
58431 832330 833245 836520 840914 846266 853431 862322 871803 881512 892055 903279 913980 923452 931830 938826
58417 938826 943674 946333 947282 946200 942391 936368 929336 921265 911323 900091 889434 880141 871599 863665
58403 863665 856745 849979 841765 832514 824645 819361 815502 812047 809527 808331 807855 808114 810144 813923 817903
58388 817903 821412 825517 830718 835886 840510 845820 852399 858612 862794 865346 867363 868809 869454 870111 871474
58373 871474 872890 873509 873641 873992 874666 875806 878125 882018 887286 894257 903810 915693 928382 941254
58359 941254 955257 970613 985596 998626 1009998 1020444 1029454 1036147 1040524 1042888 1043284 1042401 1041685
58346 1041685 1041732 1041845 1041806 1042624 1044836 1047757 1051240 1056522 1064347 1073836 1084177 1095902 1109491 1124222
58332 1124222 1139360 1155069 1171285 1187148 1202319 1217333 1231931 1244716 1255197 1264416 1272822 1279417
$$ packed form
58431H32330R15L275M394N352P165Q891R481R709J0543J1224J0701R472Q378O996
58417I38826M848K659R49j082l809o023p032q071r942j1232j0657r293q542p934
58403H63665o920o766q214r251p869n284l859l455k520j196m76K59K030L779L980
58388H17903L509M105N201N168M624N310O579O213M182K552K017J446O45O57J363
58373H71474J416O19J32L51O74J140K319L893N268O971R553J1883J2689J2872
58359I41254J4003J5356J4983J3030J1372J0446R010O693M377K364L96q83p16
58346A041685M7J13l9Q18K212K921L483N282P825R489J0341J1725J3589J4731
58332A124222J5138J5709J6216J5863J5171J5014J4598J2785J0481R219Q406O595
$$ plain form
58320 1279417 1283837 1287296 1290521 1292719 1293629 1294605 1296612 1299097 1301909 1306247 1312506 1319274 1325827 1333628
58306 1333628 1344009 1356264 1369316 1383326 1398347 1413347 1427930 1443083 1458973 1474024 1487517
58295 1487517 1501011 1515847 1531381 1547034 1563855 1582496 1601813 1621022 1641068 1662312 1683201
58284 1683201 1702965 1723423 1746339 1771091 1796609 1823446 1852169 1881852 1911835 1942915 1975245
58273 1975245 2007359 2038836 2071560 2106788 2143444 2180849 2220406 2262900 2306980 2352159 2400443
58262 2400443 2452976 2507938 2563760 2621485 2681837 2743008 2803565 2864619 2926934 2988982 3050050
58251 3050050 3112075 3176192 3240951 3306204 3375026 3449195 3526598 3605937 3690091 3781763 3879617
58240 3879617 3981952 4090407 4206769 4329961 4459542 4598246 4747764 4906075 5072338
$$ packed form
58320A279417M420L459L225K198R10R76K007K485K812M338O259O768O553P801
58306A333628J0381J2255J3052J4010J5021J5000J4583J5153J5890J5051J3493
58295A487517J3494J4836J5534J5653J6821J8641J9317J9209K0046K1244K0889
58284A683201J9764K0458K2916K4752K5518K6837K8723K9683K9983L1080L2330
58273A975245L2114L1477L2724L5228L6656L7405L9557M2494M4080M5179M8284
58262B400443N2533N4962N5822N7725O0352O1171O0557O1054O2315O2048O1068
58251C050050O2025O4117O4759O5253O8822P4169P7403P9339Q4154R1672R7854
58240C879617J02335J08455J16362J23192J29581J38704J49518J58311J66263
$$ plain form
58231 5072338 5250058 5441902 5646006 5861202 6091228 6339827 6606581 6891673 7199697
58222 7199697 7534563 7895942 8285118 8708819 9172901 9678439 10228762 10833867 11502909
58213 11502909 12239422 13049496 13947652 14949628 16068064 17321818 18741695 20362032
58205 20362032 22217632 24356936 26850128 29781877 33253231 37401367 42407166 48484009
58197 48484009 55889051 64966882 76172564 90048638 107181678 128090030 152924786
58190 152924786 181064779 210990522 240713207 268476681 293135983 314002709 330515795
58183 330515795 342103651 348192619 348197923 341601056 328274180 308858610 284802030 257977943
58175 257977943 230214134 203018916 177486702 154265869 133596441 115448365 99674587
$$ packed form
58231E072338J77720J91844K04104K15196K30026K48599K66754K85092L08024
58222G199697L34866L61379L89176M23701M64082N05538N50323O05105O69042
58213A1502909P36513Q10074Q98156J001976J118436J253754J419877J620337
58205B0362032J855600K139304K493192K931749L471354M148136N005799O076843
58197D8484009P405042R077831J1205682J3876074J7133040K0908352K4834756
58190A52924786K8139993K9925743K9722685K7763474K4659302K0866726J6513086
58183C30515795J1587856O088968N304o596867j3326876j9415570k4056580k6824087
58175B57977943k7763809k7195218k5532214k3220833k0669428j8148076j5773778
$$ plain form
58168 99674587 86080283 74434245 64496386 56053261 48915149 42892856 37802426 33487989
58160 33487989 29822427 26692178 23998521 21668626 19649074 17890095 16346347 14986643
58152 14986643 13789030 12728592 11780071 10928269 10165029 9478659 8855497 8288613 7775609
58143 7775609 7310129 6883683 6493264 6139109 5817057 5520331 5246625 4996353 4765942
58134 4765942 4549564 4345674 4155563 3977190 3806417 3642722 3488080 3341798 3201791
58125 3201791 3069252 2946848 2833674 2726713 2625637 2531621 2443252 2358320 2277930 2204290
58115 2204290 2136044 2070232 2007135 1948698 1893916 1840362 1788779 1741486 1697443 1653453 1609290
58104 1609290 1567276 1527640 1488534 1449977 1413709 1379588 1345894 1312831 1282228 1254116 1226866
$$ packed form
58168I9674587j3594304j1646038r937859q443125p138112o022293n090430m314437
58160C3487989l665562l130249k693657k329895k019552j758979j543748j359704
58152A4986643j197613j060438r48521q51802p63240o86370o23162n66884n13004
58143G775609m65480m26446l90419l54155l22052k96726k73706k50272k30411
58134D765942k16378k03890j90111j78373j70773j63695j54642j46282j40007
58125C201791j32539j22404j13174j06961j01076r4016q8369q4932q0390p3640
58115B204290o8246o5812o3097n8437n4782n3554n1583m7293m4043m3990m4163
58104A609290m2014l9636l9106l8557l6268l4121l3694l3063l0603k8112k7250
$$ plain form
58093 1226866 1200271 1175449 1152229 1129555 1107883 1088311 1070028 1051399 1032809 1015683 999506
58082 999506 982662 965403 949182 933772 917760 901219 885232 869544 853304 837269 822661
58071 822661 808679 793816 778751 765211 752890 740352 728180 718196 710070 701641 692409 683893
58059 683893 676687 669685 662235 654754 647294 639508 631844 624894 617984 610251 602469 595928 590309 584678
58045 584678 579666 576447 574378 571958 569274 567159 564765 560617 555439 551308 548384 544931 540194 534857
58031 534857 529018 522175 514961 508489 502206 494671 486222 478585 472134 465840 459638 454469 450122 445441
58017 445441 440601 436843 433988 430476 425885 421242 416919 412476 408505 406227 405123 403275 400292 397668
58003 397668 396039 394340 392044 389942 388209 385778 382296 378837 376114 373669 371258 369303 367527 364843
$$ packed form
58093A226866k6595k4822k3220k2674k1672j9572j8283j8629j8590j7126j6177
58082I99506j6844j7259j6221j5410j6012j6541j5987j5688j6240j6035j4608
58071H22661j3982j4863j5065j3540j2321j2538j2172r984q126q429r232q516
58059F83893p206p002p450p481p460p786p664o950o910p733p782o541n619n631
58045E84678n012l219k069k420k684k115k394m148n178m131k924l453m737n337
58031E34857n839o843p214o472o283p535q449p637o451o294o202n169m347m681
58017D45441m840l758k855l512m591m643m323m443l971k278j104j848k983k624
58003C97668j629j699k296k102j733k431l482l459k723k445k411j955j776k684
$$ plain form
57989 364843 361152 357750 355551 354280 353641 353747 354202 354284 354263 355036 356360 356996 356690 356392 356402 356022 355158 354531
57971 354531 354038 352682 350507 348880 348414 348218 347616 347101 347119 347391 347831 348772 349945 350593 350865 351706 353154
57954 353154 354174 354329 354086 353359 351462 348818 346953 346388 346118 345616 345686 346844 348515 350449 353361 357505
57938 357505 362116 366983 373086 380933 389616 398267 407231 416985 427098 436965 446491 455368 462656 467748
57924 467748 470917 472460 472292 470693 468447 465889 462772 459186 455460 451096 445217 438285 431859 426323
57910 426323 420461 413767 407472 402588 398509 394473 390952 388420 385963 382314 377501 372536 368168 364605
57896 364605 361751 359022 355708 351990 348954 347224 346418 346205 346809 348098 349284 350008 350743 351737 352611 353378
57880 353378 354648 356437 357943 358946 360111 361438 361880 361182 360727 361642 363263 364365 364740 364611 363599 361329
$$ packed form
57989C64843l691l402k199j271o39J06M55Q2k1P73J324O36l06k98J0l80q64o27
57971C54531m93j356k175j627m66j96o02n15J8K72M40R41J173O48K72Q41J448
57954C53154J020J55k43p27j897k644j865n65k70n02P0J158J671J934K912M144
57938C57505M611M867O103P847Q683Q651Q964R754J0113R867R526Q877P288N092
57924D67748L169J543j68j599k246k558l117l586l726m364n879o932o426n536
57910D26323n862o694o295m884m079m036l521k532k457l649m813m965m368l563
57896C64605k854k729l314l718l036j730q06k13O04J289J186P24P35R94Q74P67
57880C53378J270J789J506J003J165J327M42o98m55R15J621J102L75j29j012k270
$$ plain form
57864 361329 358191 354656 350653 346386 342806 340453 338725 337041 335793 335411 335506 335775 336709 338487 340155
57849 340155 340912 341288 342060 342900 343142 343004 342945 342564 341267 339398 337588 335598 332847 329581 326429 323272
57833 323272 319574 315481 311680 308505 305920 304008 302746 301750 300966 301066 302373 303966 304728 304800 305163 306239
57817 306239 307804 309852 312503 315240 317097 317561 316790 315234 313547 312476 312132 311664 310157 307547 304256
57802 304256 300516 296695 293704 292238 291891 291725 291418 291322 291701 292533 293778 295288 296716 297908 299084 300362
57786 300362 301553 302690 304069 305495 306262 306432 307233 309513 312476 314699 315712 315953 315918 316194 317573 320119
57770 320119 322629 323914 324123 324041 323707 322711 321227 319640 317598 314538 310874 307596 304923 302393 300031
57755 300031 298403 297573 297087 296959 297693 299211 300693 301676 302609 304127 306343 309016 311872 314626 317035 318950
$$ packed form
57864C61329l138l535m003m267l580k353j728j684j248l82R5K69R34J778J668
57849C40155P57L76P72Q40K42j38n9l81j297j869j810j990k751l266l152l157
57833C23272l698m093l801l175k585j912j262r96p84J00J307J593P62P2L63J076
57817C06239J565K048K651K737J857M64p71j556j687j071l44m68j507k610l291
57802C04256l740l821k991j466l47j66l07r6L79Q32J245J510J428J192J176J278
57786C00362J191J137J379J426P67J70Q01K280K963K223J013K41l5K76J379K546
57770C20119K510J285K09q2l34r96j484j587k042l060l664l278k673k530k362
57755C00031j628q30m86j28P34J518J482R83R33J518K216K673K856K754K409J915
$$ plain form
57739 318950 320080 319972 318615 316798 315373 314349 313142 311353 308790 305121 300295 295136 290869 288028
57725 288028 286214 284744 283084 280940 278409 275856 273267 270123 266337 262777 260180 257981 254960 250731
57711 250731 245881 241026 236561 233057 230948 229798 228673 227156 225426 223477 221025 218156 215347 212794
57697 212794 210352 208122 206476 205495 204881 204425 204035 203426 202426 201581 201834 203434 205645 207635 209260 210958
57681 210958 213268 216556 221002 226842 234733 245730 260698 280000 303939 333143 368156 408819
57669 408819 454122 502120 549836 593969 632309 664066 688457 703647 707589 699326 678928 647128
57657 647128 606050 559757 512829 468347 427713 391722 360798 334565 312351 294047 279658
57646 279658 268345 258897 251020 245180 241280 238456 236068 233999 232040 229933 227979 226671 225735 224466
$$ packed form
57739C18950J130j08j357j817j425j024j207j789k563l669m826n159m267k841
57725B88028j814j470j660k144k531k553k589l144l786l560k597k199l021m229
57711B50731m850m855m465l504k109j150j125j517j730j949k452k869k809k553
57697B12794k442k230j646r81o14m56l90o09j000q45K53J600K211J990J625J698
57681B10958K310L288M446N840P891J0997J4968J9302K3939K9204L5013M0663
57669D08819M5303M7998M7716M4133L8340L1757K4391J5190L942q263k0398l1800
57657F47128m1078m6293m6928m4482m0634l5991l0924k6233k2214j8304j4389
57646B79658j1313r448p877n840l900k824k388k069j959k107j954j308r36j269
$$ plain form
57632 224466 222927 221800 221063 219909 218117 216395 215126 213840 212336 211324 211363 211876 211808 210756 209028 207067
57616 207067 205186 203494 201814 199988 198334 197385 197149 197111 196913 196481 195650 194355 193094 192354 191630 189966
57600 189966 187582 185876 185492 185418 184527 183071 181958 181282 180383 178888 176985 174882 172620 170257 167897 165628
57584 165628 163636 162120 160964 159770 158350 156831 155234 153403 151422 149561 147700 145399 142711 140305
57570 140305 138509 136894 135124 133548 132495 131622 130573 129722 129576 129814 129727 129481 130141 132276 135081 137175
57554 137175 138026 138350 139180 140718 142225 142970 143024 142950 143008 143066 143113 143342 143695 143892 144008 144472 145262 145596 144836 143335
57534 143335 142012 141290 140866 140342 139784 139560 139843 140347 140614 140586 140768 141628 142878 143622 143250 142039 140903 140680
57516 140680 141516 142765 143622 144025 144677 145982 147362 148059 148256 148787 149988 151480 152889 153989 154213 152897
$$ packed form
57632B24466j539j127p37j154j792j722j269j286j504j012L9N13o8j052j728j961
57616B07067j881j692j680j826j654r49k36l8j98m32q31j295j261p40p24j664
57600A89966k384j706l84p4q91j456j113o76q99j495j903k103k262k363k360k269
57584A65628j992j516j156j194j420j519j597j831j981j861j861k301k688k406
57570A40305j796j615j770j576j053q73j049q51j46K38q7k46O60K135K805K094
57554A37175Q51L24Q30J538J507P45N4p4N8N8M7K29L53J97J16M64P90L34p60j501
57534A43335j323p22m24n24n58k24K83N04K67k8J82Q60J250P44l72j211j136k23
57516A40680Q36J249Q57M03O52J305J380O97J97N31J201J492J409J100K24j316
$$ plain form
57500 152897 150207 147138 144444 142172 140327 139160 138522 137717 136385 134941 133740 132425 130581 128492 126711
57485 126711 125270 123890 122643 121929 121963 122660 123821 125103 126066 126603 127140 128079 129191 129830 129562 128349 126346
57468 126346 123874 121474 119635 118433 117574 116786 116104 115778 115958 116419 116678 116548 116413 116736 117416 117968 118186
57451 118186 118139 117630 116281 114259 112373 111165 110390 109668 109202 109496 110590 111951 113015 113639 114121 114859 115872
57434 115872 116688 116910 116792 116956 117566 118190 118449 118397 118234 118052 117911 117724 117117 115889 114638 114335 115183 116467
57416 116467 117631 118837 120210 121227 121276 120394 119078 117839 117183 117509 118549 119382 119460 119269 119538 120195 120611
57399 120611 120618 120653 120946 121081 120504 119235 117963 117459 117856 118604 119240 120025 121452 123352 125094 126672 128845
57382 128845 131867 134794 136581 137417 138413 140191 142257 143663 143908 143268 142453 141885 141228 139804 137499 134956
$$ packed form
57500A52897k690l069k694k272j845j167o38q05j332j444j201j315j844k089j781
57485A26711j441j380j247p14L4O97J161J282R63N37N37R39J112O39k68j213k003
57468A26346k472k400j839j202q59p88o82l26J80M61K59j30j35L23O80N52K18
57451A18186m7n09j349k022j886j208p75p22m66K94J094J361J064O24M82P38J013
57434A15872Q16K22j18J64O10O24K59n2j63j82j41j87o07j228j251l03Q48J284
57416A16467J164J206J373J017M9q82j316j239o56L26J040Q33P8j91K69O57M16
57399A20611PL5K93J35n77j269j272n04L97P48O36P85J427J900J742J578K173
57382A28845L022K927J787Q36R96J778K066J406K45o40q15n68o57j424k305k543
$$ plain form
57366 134956 132826 131190 129821 128602 127540 126747 126583 127402 128919 130266 130852 130798 130378 129593 128586 127943
57350 127943 128139 129087 130547 132545 134972 137228 138764 139670 140238 140258 139272 137396 135399 134007 133354 133042
57334 133042 132463 131250 129630 128208 127274 126549 125728 124922 124385 124121 123993 123889 123602 122918 122077 121772 122395 123612
57316 123612 124854 125830 126365 126287 125844 125789 126560 127681 128324 128134 127246 125975 124877 124708 125725 127287 128541
57299 128541 129298 129916 130664 131595 132708 133814 134523 134713 134793 135159 135758 136482 137518 138905 140110 140580 140439
57282 140439 140151 139785 139067 137986 136889 136184 136143 136702 137198 136844 135865 135596 136922 139131 140901 141960 143094
57265 143094 144917 147413 150396 153591 156417 158419 159882 161400 162981 164198 165094 166253 167973 169959
57251 169959 171849 173555 175059 176342 177461 178352 178753 178698 178805 179554 180546 181104 181374 182140 183702 185628 187507
$$ packed form
57366A34956k130j636j369j219j062p93j64Q19J517J347N86n4m20p85j007o43
57350A27943J96R48J460J998K427K256J536R06N68K0r86j876j997j392o53l12
57334A33042n79j213j620j422r34p25q21q06n37k64j28j04k87o84q41l05O23J217
57316A23612J242R76N35p8m43n5P71J121O43j90q88j271j098j69J017J562J254
57299A28541P57O18P48R31J113J106P09J90Q0L66N99P24J036J387J205M70j41
57282A40439k88l66p18j081j097p05m1N59M96l54r79k69J326K209J770J059J134
57265A43094J823K496K983L195K826K002J463J518J581J217Q96J159J720J986
57251A69959J890J706J504J283J119Q91M01n5J07P49R92N58K70P66J562J926J879
$$ plain form
57234 187507 189246 190707 191750 192631 193652 194414 194198 193168 192451 192865 194224 196094 198464 201258 203775
57219 203775 205237 205730 206248 207865 210994 215195 219533 223222 226026 228130 229803 231327 232970 234719 236238
57204 236238 237458 238920 241184 244079 246973 249536 251811 253855 255932 258771 262869 267661 272058 275771
57190 275771 279419 283451 287792 292569 298223 304619 310811 316087 320633 324839 328586 331534 333531 334281
57176 334281 333172 329933 325153 319801 314705 310833 309428 311071 314874 319363 324098 329825 337053 345195
57162 345195 353333 361259 369332 377634 385819 393715 401610 409798 418202 426685 435497 445091 455619 466955
57148 466955 479116 492284 506410 521161 536310 551783 567261 582224 596622 611158 626680
57137 626680 643564 661802 681235 701433 721804 742094 762458 782868 803111 823763 846456
$$ packed form
57234A87507J739J461J043Q81J021P62k16j030p17M14J359J870K370K794K517
57219B03775J462M93N18J617L129M201M338L689K804K104J673J524J643J749J519
57204B36238J220J462K264K895K894K563K275K044K077K839M098M792M397L713
57190B75771L648M032M341M777N654O396O192N276M546M206L747K948J997P50
57176C34281j109l239m780n352n096l872j405J643L803M489M735N727P228Q142
57162C45195Q138P926Q073Q302Q185P896P895Q188Q404Q483Q812R594J0528J1336
57148D66955J2161J3168J4126J4751J5149J5473J5478J4963J4398J4536J5522
57137F26680J6884J8238J9433K0198K0371K0290K0364K0410K0243K0652K2693
$$ plain form
57126 846456 872430 901057 930215 957716 981840 1001281 1015883 1027749 1041018 1060200 1088675
57115 1088675 1128101 1178187 1236911 1301726 1371198 1445573 1525924 1613126 1707689 1810336 1922552
57104 1922552 2046576 2185065 2341427 2521268 2733788 2991636 3309926 3706081 4200071
57095 4200071 4813402 5567430 6482814 7578603 8867730 10350511 12011192 13816696 15711759
57086 15711759 17613119 19416854 21024781 22373772 23446367 24260979 24856898 25281945
57078 25281945 25577298 25759146 25809804 25687487 25347105 24758004 23912957 22829484 21543506
57069 21543506 20097310 18530272 16879462 15186209 13498814 11868071 10340209 8951290
57061 8951290 7723317 6662559 5761712 5005048 4373311 3846779 3407245 3039312 2730436
$$ packed form
57126H46456K5974K8627K9158K7501K4124J9441J4602J1866J3269J9182K8475
57115A088675L9426N0086N8724O4815O9472P4375Q0351Q7202R4563J02647J12216
57104A922552J24024J38489J56362J79841K12520K57848L18290L96155M93990
57095D200071O13331P54028R15384J095789J289127J482781J660681J805504J895063
57086A5711759J901360J803735J607927J348991J072595Q14612N95919M25047
57078B5281945K95353J81848N0658j22317l40382n89101q45047j083473j285978
57069B1543506j446196j567038j650810j693253j687395j630743j527862j388919
57061H951290j227973j060758r00847p56664o31737n26532m39534l67933l08876
$$ plain form
57052 2730436 2470152 2249537 2060867 1897127 1752086 1621354 1503003 1396565 1301535 1216994
57042 1216994 1141857 1074709 1013855 958244 908007 863491 824188 789285 758747 733057 712222
57031 712222 695890 684340 678819 681020 692570 714195 744270 778281 810600 837210 856719 869351
57019 869351 875502 874651 864704 842599 806520 757813 700551 639622 579523 523990 475309 433667
57007 433667 397948 367299 341463 319867 301291 284654 269560 255965 243865 233316 224280 216367
56995 216367 209145 202711 197520 193715 191070 189569 189534 191173 194375 198959 204730 211297 218173 225053 231660
56980 231660 237406 241532 243541 243190 240233 234564 226642 217417 207864 198741 190626 183842 178451 174587
56966 174587 172692 173254 176558 182930 192872 206471 222779 240080 256661 271241 283074 292093 298702
$$ packed form
57052B730436k60284k20615j88670j63740j45041j30732j18351j06438r5030q4541
57042A216994p5137o7148o0854n5611n0237m4516l9303l4903l0538k5690k0835
57031G12222j6332j1550n521K201J1550K1625L0075L4011L2319K6610J9509J2632
57019H69351O151q51r947k2105l6079m8707n7262o0929o0099n5533m8681m1642
57007D33667l5719l0649k5836k1596j8576j6637j5094j3595j2100j0549r036p913
56995B16367p222o434n191l805k645j501l5J639L202M584N771O567O876O880O607
56980B31660N746M126K009l51k957n669p922r225r553r123q115o784n391l864
56966A74587j895N62L304O372R942J3599J6308J7301J6581J4580J1833R019O609
$$ plain form
56953 298702 303021 304482 302345 296341 286573 273357 257626 241105 225485 211622 199885 190906 185399
56940 185399 183525 185023 189870 198316 210407 225817 243943 263801 284091 303736 322051 338139
56928 338139 350672 358798 362730 362766 358146 347697 331436 310944 288395 265729 244353 224819 206886
56915 206886 190479 176375 165358 157104 150588 145281 141145 137807 134706 131956 130191 129618 129949 131081
56901 131081 132936 134866 136287 137942 141413 147192 154206 161516 169544 179233 190841 204072 218618
56888 218618 233956 249067 262928 275055 285333 293618 299719 303397 304209 301673 295731 286827 275668
56875 275668 263330 251502 241906 235292 231470 230398 232800 239646 251664 269476 293677 324369 360709
56862 360709 400859 442148 481648 517324 548643 575602 597280 611895 618108 615605 604652 586111
$$ packed form
56953B98702M319J461k137o004r768j3216j5731j6521j5620j3863j1737q979n507
56940A85399j874J498M847Q446J2091J5410J8126J9858K0290J9645J8315J6088
56928C38139J2533Q126L932L6m620j0449j6261k0492k2549k2666k1376j9534j7933
56915B06886j6407j4104j1017q254o516n307m136l338l101k750j765n73L31J132
56901A31081J855J930J421J655L471N779P014P310Q028R689J1608J3231J4546
56888B18618J5338J5111J3861J2127J0278Q285O101L678Q12k536n942q904j1159
56875B75668j2338j1828r596o614l822j072K402O846J2018J7812K4201L0692L6340
56862C60709M0150M1289L9500L5676L1319K6959K1678J4615O213k503j0953j8541
$$ plain form
56850 586111 561947 534850 507116 480554 457368 439996 429775 426721 431046 444083 467373 501664
56838 501664 547060 602883 666525 733181 797710 856582 907744 949560 980690 1000354 1007636 1000827
56826 1000827 978419 940893 891120 833298 771965 711525 655609 606531 565596 533836 512134
56815 512134 500862 500054 509899 530569 561375 600294 644271 689696 732843 770510 800644 822311
56803 822311 834958 837762 829667 809949 778796 737564 688701 635573 582144 532214 488306 451231
56791 451231 420952 397723 382033 373777 372261 377140 388559 405884 426789 448155 467751 484765
56779 484765 498971 509756 515942 516237 509798 496432 476413 450413 419828 386913 354001 322506
56767 322506 292965 265900 242080 221858 204782 190095 177278 166057 156320 148169 141641 136267
$$ packed form
56850E86111k4164k7097k7734k6562k3186j7372j0221l054M325J3037K3290L4291
56838E01664M5396N5823O3642O6656O4529N8872N1162M1816L1130J9664P282o809
56826A000827k2408l7526m9773n7822o1333o0440n5916m9078m0935l1760k1702
56815E12134j1272q08R845K0670L0806L8919M3977M5425M3147L7667L0134K1667
56803H22311J2647K804q095j9718l1153m1232m8863n3128n3429m9930m3908l7075
56791D51231l0279k3229j5690q256j516M879J1419J7325K0905K1366J9596J7014
56779D84765J4206J0785O186K95o439j3366k0019k6000l0585l2915l2912l1495
56767C22506k9541k7065k3820k0222j7076j4687j2817j1221r737q151o528n374
$$ plain form
56755 136267 131289 126416 121939 118071 114741 112129 110760 110678 111072 111048 110433 109536 108535 107439 106309 105195
56739 105195 104079 103079 102471 102372 102654 103188 103829 104198 103985 103482 103283 103445 103586 103806 104676 106115 107186 107412
56721 107412 107467 108025 108734 108969 108927 109222 109913 110685 111546 112570 113286 113128 112362 111894 112212 113028 113842 114399 114709
56702 114709 115017 115626 116420 116838 116638 116366 116653 117323 117694 117503 117088 116892 117236 118324 119945 121349 121919 121790
56684 121790 121376 120567 118951 116694 114577 113194 112570 112593 113312 114708 116521 118429 120201 121661 122701 123395
56668 123395 123968 124665 125593 126570 127190 127320 127465 128261 129646 131112 132733 135213 138655 142106 144768 146950
56652 146950 149274 151621 153581 155313 157171 158898 160023 160711 161410 161931 161745 161057 160664 160693 160296 158817
56636 158817 156701 154979 154263 154401 154829 155100 155164 155118 154757 153732 152305 151307 150985 150443 148833 146613 144916
$$ packed form
56755A36267m978m873m477l868l330k612j369q2L94k4o15q97j001j096j130j114
56739A05195j116j000o08r9K82N34O41L69k13n03j99J62J41K20Q70J439J071K26
56721A07412N5N58P09K35m2K95O91P72Q61J024P16j58p66m68L18Q16Q14N57L10
56702A14709L08O09P94M18k00k72K87O70L71j91m15j96L44J088J621J404N70j29
56684A21790m14q09j616k257k117j383o24K3P19J396J813J908J772J460J040O94
56668A23395N73O97R28R77O20J30J45P96J385J466J621K480L442L451K662K182
56652A46950K324K347J960J732J858J727J125O88O99N21j86o88l93K9l97j479
56636A58817k116j722p16J38M28K71O4m6l61j025j427r98l22n42j610k220j697
$$ plain form
56619 144916 144062 143467 142726 141959 141191 140218 139084 138029 137012 135911 135123 135259 136212 137150 137463 137155 136391
56602 136391 135320 134322 133760 133386 132670 131774 131564 132484 134018 135405 136288 136552 136157 135465 135184 135662 136553 137357
56584 137357 137917 138283 138512 138824 139546 140692 141883 142846 143676 144533 145413 146325 147392 148682 150202 152119 154651
56567 154651 157772 161371 165691 171156 177712 184809 192123 199850 208048 216118 223273 229298 234557 239346
56553 239346 243434 246227 247325 246889 245437 243302 240459 236934 233128 229547 226426 223716 221169 218329
56539 218329 214901 211336 208534 206611 204562 201658 198570 196390 195044 193509 191262 188628 185978 183553
56525 183553 181849 181145 180705 179501 177772 176801 176967 177166 176570 175906 176250 177411 178309 178433 178103 177591 176771
56508 176771 175674 174837 174841 175623 176412 176436 175762 175167 175072 174949 174194 173139 172526 172224 171354 169643 167844 166724
$$ packed form
56619A44916q54n95p41p67p68r73j134j055j017j101p88J36R53R38L13l08p64
56602A36391j071r98n62l74p16q96k10R20J534J387Q83K64l95o92k81M78Q91Q04
56584A37357N60L66K29L12P22J146J191R63Q30Q57Q80R12J067J290J520J917K532
56567A54651L121L599M320N465O556P097P314P727Q198Q070P155O025N259M789
56553B39346M088K793J098m36j452k135k843l525l806l581l121k710k547k840
56539B18329l428l565k802j923k049k904l088k180j346j535k247k634k650k425
56525A83553j704p04m40j204j729r71J66J99n96o64L44J161Q98J24l30n12q20
56508A76771j097q37MP82P89K4o74n95r5j23p55j055o13l02q70j711j799j120
$$ plain form
56490 166724 166392 166792 167986 169623 170849 171169 170901 170485 169900 169117 168505 168356 168463 168617 169125 170407 172359
56473 172359 174485 176400 177961 179132 179934 180407 180583 180716 181390 182935 184775 185966 186357 186585 186895 186809 186148
56456 186148 185522 185353 185175 184465 183570 183175 183299 183426 183319 183182 183289 183904 185296 187304 189063 189605 188756 187227
56438 187227 185919 185271 185106 184915 184413 183842 183560 183484 183323 183259 183852 185173 186622 187731 188552 189105 189117 188672
56420 188672 188490 189049 189903 190345 190368 190524 191125 191999 192843 193417 193570 193344 192993 192792 192948 193568 194415 194819 194395
56401 194395 193814 194218 195806 197656 199095 200423 201987 203322 203800 203579 203364 203609 204361 205534 206927 208261
56385 208261 209446 210467 210987 210700 210189 210654 212391 214300 215351 215792 216349 216953 217098 216951 217318 218747 221198
56368 221198 224298 227372 229590 230613 230887 230927 230724 230268 230081 230620 231521 232142 232565 233468 235190 237419 239615
$$ packed form
56490A66724l32M00J194J637J226L20k68m16n85p83o12j49J07J54N08J282J952
56473A72359K126J915J561J171Q02M73J76J33O74J545J840J191L91K28L10q6o61
56456A86148o26j69j78p10q95l95J24J27j07j37J07O15J392K008J759N42q49j529
56438A87227j308o48j65j91n02n71k82p6j61o4N93J321J449J109Q21N53J2m45
56420A88672j82N59Q54M42K3J56O01Q74Q44N74J53k26l51k01J56O20Q47M04m24
56401A94395n81M04J588J850J439J328J564J335M78k21k15K45P52J173J393J334
56385B08261J185J021N20k87n11M65J737J909J051M41N57O04J45j47L67J429K451
56368B21198L100L074K218J023K74M0k03m56j87N39R01O21M23R03J722K229K196
$$ plain form
56351 239615 241256 241923 241628 240974 240660 241004 242082 243891 246059 247875 249004 249786 250625 251663 253380 256614
56335 256614 261338 266080 269415 271540 273611 276088 278646 281259 284266 287526 290484 293069 295672 298222
56321 298222 300084 300969 301228 301150 300621 299644 298598 297801 297264 297050 297409 298344 299376 300009 300269 300632 301567 303251
56303 303251 305632 308680 312425 316679 320919 324739 328330 332136 336109 339759 342922 345957 349161 352585
56289 352585 356413 360835 365458 369609 373418 377779 383039 388608 394189 400435 407899 416265 425191 434984
56275 434984 445765 456877 467894 479401 491955 505069 518140 531674 546709 563597 582192
56264 582192 602576 624731 648217 673147 700840 732475 767746 805928 847726 894987 949099
56253 949099 1010784 1080872 1159977 1247775 1343907 1449322 1565508 1692498 1828745 1972740
$$ packed form
56351B39615J641O67k95o54l14L44J078J809K168J816J129P82Q39J038J717L234
56335B56614M724M742L335K125K071K477K558K613L007L260K958K585K603K550
56321B98222J862Q85K59p8n29r77j046p97n37k14L59R35J032O33K60L63R35J684
56303C03251K381L048L745M254M240L820L591L806L973L650L163L035L204L424
56289C52585L828M422M623M151L809M361N260N569N581O246P464Q366Q926R793
56275D34984J0781J1112J1017J1507J2554J3114J3071J3534J5035J6888J8595
56264E82192K0384K2155K3486K4930K7693L1635L5271L8182M1798M7261N4112
56253I49099O1685P0088P9105Q7798R6132J05415J16186J26990J36247J43995
$$ plain form
56243 1972740 2123571 2279893 2439398 2599305 2756476 2907164 3047563 3174514 3285034
56234 3285034 3375666 3443362 3486720 3505398 3498826 3466711 3410523 3333213 3237654 3126458 3002951
56223 3002951 2870877 2733125 2591842 2449601 2309134 2172041 2039059 1911533 1791248
56214 1791248 1678802 1573546 1475236 1384423 1301085 1224278 1153372 1088442 1029273 975248 926382
56203 926382 883123 844887 810074 777881 748804 723061 699880 678828 660482 645090 631721
56192 631721 619423 608267 598606 590167 582481 575431 568880 562491 556303 550801 546103 541743 537456 533462
56178 533462 529910 526863 524770 523948 523578 522418 520607 519582 519977 520898 521530 522193 523406 525169 527653 531382
56162 531382 536156 540868 544985 549249 554473 560648 567612 575485 583997 592585 601643 612503 625589 639790
$$ packed form
56243A972740J50831J56322J59505J59907J57171J50688J40399J26951J10520
56234C285034R0632O7696M3358J8678o572l2115n6188p7310r5559j11196j23507
56223C002951j32074j37752j41283j42241j40467j37093j32982j27526j20285
56214A791248j12446j05256r8310r0813q3338p6807p0906o4930n9169n4025m8866
56203I26382m3259l8236l4813l2193k9077k5743k3181k1052j8346j5392j3369
56192F31721j2298j1156r661q439p686p050o551o389o188n502m698m360m287l994
56178E33462l552l047k093q22l70j160j811j025L95R21O32O63J213J763K484L729
56162E31382M774M712M117M264N224O175O964P873Q512Q588R058J0860J3086J4201
$$ plain form
56148 639790 654396 670511 689757 712546 738441 767374 799694 835759 876114 921390 971428
56137 971428 1025072 1081195 1139138 1197810 1255447 1310896 1364351 1416303 1466430 1513828 1557530
56126 1557530 1596463 1629800 1657691 1680894 1699618 1713655 1723516 1729996 1732411 1728780 1718204 1701600
56114 1701600 1679660 1651662 1616975 1576189 1529982 1478353 1421967 1362896 1303005 1242842 1183110
56103 1183110 1125996 1073912 1027851 987918 954393 927230 905467 888129 874964 865567 858746 853604
56091 853604 850309 849035 849073 849774 851439 854502 858691 863645 869430 875909 882557 889394 897015 905314 913455
56076 913455 921467 930401 940401 950189 959097 967966 977381 986812 996289 1007010 1019258 1031564 1043119
56063 1043119 1055124 1068467 1082020 1094773 1107852 1122613 1138295 1153401 1168007 1182867 1197442
$$ packed form
56148F39790J4606J6115J9246K2789K5895K8933L2320L6065M0355M5276N0038
56137I71428N3644N6123N7943N8672N7637N5449N3455N1952N0127M7398M3702
56126A557530L8933L3337K7891K3203J8724J4037R861O480K415l631j0576j6604
56114A701600k1940k7998l4687m0786m6207n1629n6386n9071n9891o0163n9732
56103A183110n7114n2084m6061l9933l3525k7163k1763j7338j3165r397o821n142
56091H53604l295j274L8P01J665L063M189M954N785O479O648O837P621Q299Q141
56076I13455Q012Q934J0000R788Q908Q869R415R431R477J0721J2248J2306J1555
56063A043119J2005J3343J3553J2753J3079J4761J5682J5106J4606J4860J4575
$$ plain form
56052 1197442 1210675 1222829 1234918 1247198 1259592 1272694 1287007 1302107 1317696 1334372 1352365
56041 1352365 1370796 1389375 1409389 1431778 1455656 1479921 1504832 1530782 1557190 1583991 1612611
56030 1612611 1643984 1677091 1710719 1745062 1780448 1816444 1853465 1893123 1935503 1978355 2020498
56019 2020498 2063674 2109333 2156271 2203530 2252932 2306247 2362295 2419497 2478967 2542328 2608680
56008 2608680 2676570 2746968 2821494 2899606 2980264 3064447 3153390 3246474 3343447 3446436 3556970
55997 3556970 3673419 3794305 3921689 4058224 4203410 4356010 4517567 4690246 4873790
55988 4873790 5068114 5276264 5501319 5743061 6001224 6279182 6580889 6907377 7259962
55979 7259962 7643535 8062863 8519427 9016008 9560513 10161255 10823031 11552394 12362048
$$ packed form
56052A197442J3233J2154J2089J2280J2394J3102J4313J5100J5589J6676J7993
56041A352365J8431J8579K0014K2389K3878K4265K4911K5950K6408K6801K8620
56030A612611L1373L3107L3628L4343L5386L5996L7021L9658M2380M2852M2143
56019B020498M3176M5659M6938M7259M9402N3315N6048N7202N9470O3361O6352
56008B608680O7890P0398P4526P8112Q0658Q4183Q8943R3084R6973J02989J10534
55997C556970J16449J20886J27384J36535J45186J52600J61557J72679J83544
55988D873790J94324K08150K25055K41742K58163K77958L01707L26488L52585
55979G259962L83573M19328M56564M96581N44505O00742O61776P29363Q09654
$$ plain form
55970 12362048 13265629 14274150 15403381 16679715 18134611 19801457 21725213 23969657
55962 23969657 26612605 29747380 33499286 38033483 43546201 50272815 58525928 68720706
55954 68720706 81360183 96999513 116151663 139025479 165143746 193177681 221289085
55947 221289085 247775188 271456618 291552672 307367367 318193704 323415007 322551126
55940 322551126 315256111 301489781 281840322 257655711 230778974 203092385 176192374
55933 176192374 151267311 129060701 109871752 93637539 80080728 68835878 59517795
55926 59517795 51765653 45278222 39819179 35197142 31254546 27871035 24957320 22437981
55918 22437981 20246134 18330899 16656055 15188392 13895107 12751473 11740984 10846733
$$ packed form
55970A2362048R03581J008521J129231J276334J454896J666846J923756K244444
55962B3969657K642948L134775L751906M534197N512718O726614Q253113J0194778
55954F8720706J2639477J5639330J9152150K2873816K6118267K8033935K8111404
55947B21289085K6486103K3681430K0096054J5814695J0826337N221303q63881
55940C22551126p295015j3766330j9649459k4184611k6876737k7686589k6900011
55933A76192374k4925063k2206610j9188949j6234213j3556811j1244850r318083
55926E9517795p752142o487431n459043m622037l942596l383511k913715k519339
55918B2437981k191847j915235j674844j467663j293285j143634j010489q94251
$$ plain form
55910 10846733 10050130 9337820 8701821 8132306 7617102 7148286 6722496 6334576 5977202
55901 5977202 5646662 5342752 5062722 4801082 4555618 4328058 4118479 3924124 3743788
55892 3743788 3578176 3425592 3282122 3146514 3020420 2903691 2793869 2690568 2595886 2510024
55882 2510024 2430465 2355723 2285987 2219929 2154993 2091218 2030870 1973836 1917064 1858958 1800700
55871 1800700 1742968 1685124 1628152 1574568 1524567 1475735 1427416 1381998 1340947 1302848 1266481
55860 1266481 1232695 1202015 1173205 1145510 1119802 1096288 1073391 1050103 1027287 1005631 984296
55849 984296 962593 941112 920315 899688 878982 858616 838377 817486 796409 776818 759328
55838 759328 743043 727600 713706 701301 689252 677391 666849 657791 648758 638923 629110 619956
$$ packed form
55910A0846733p96603p12310o35999n69515n15204m68816m25790l87920l57374
55901E977202l30540l03910k80030k61640k45464k27560k09579j94355j80336
55892C743788j65612j52584j43470j35608j26094j16729j09822j03301r4682q5862
55882B510024p9559p4742o9736o6058o4936o3775o0348n7034n6772n8106n8258
55871A800700n7732n7844n6972n3584n0001m8832m8319m5418m1051l8099l6367
55860A266481l3786l0680k8810k7695k5708k3514k2897k3288k2816k1656k1335
55849I84296k1703k1481k0797k0627k0706k0366k0239k0891k1077j9591j7490
55838G59328j6285j5443j3894j2405j2049j1861j0542r058r033r835r813r154
$$ plain form
55826 619956 610971 602148 594585 588602 582899 576396 569328 561737 552654 541840 530888 521498 513763 506962
55812 506962 500885 495542 490640 486119 482364 479370 476666 474436 473695 474992 477988 482500 488693 495948
55798 495948 502934 509206 515412 521536 526370 529242 530872 531868 531714 529970 527168 523705 519013 512647 505234
55783 505234 497509 489351 480497 471339 462293 453185 443908 435000 426988 419960 414325 411250 411623 414981
55769 414981 419803 424430 427623 429009 429214 428916 427631 424099 417733 408854 397718 384584 370648 357476
55755 357476 345219 332759 319899 307948 297690 288341 279251 271189 264923 259771 254706 249929 246277
55742 246277 243803 241979 240695 240097 239949 239951 240300 241159 241978 242018 241315 240632 240645 241347 241915 241070 238156 233968
55724 233968 229907 226290 222362 217991 214204 211708 210006 208537 207637 207685 208283 209080 210653 213717 218062
$$ packed form
55826F19956q985q823p563n983n703o503p068p591r083j0814j0952r390p735o801
55812E06962o077n343m902m521l755k994k704k230p41J297K996M512O193P255
55798D95948O986O272O206O124M834K872J630R96j54j744k802l463m692o366p413
55783E05234p725q158q854r158r046r108r277q908q012p028n635l075L73L358
55769D14981M822M627L193J386K05k98j285l532o366q879j1136j3134j3936j3172
55755C57476j2257j2460j2860j1951j0258r349r090q062o266n152n065m777l652
55742B46277k474j824j284n98j48KL49Q59Q19M0p03o83J3P02N68q45k914m188
55724B33968m061l617l928m371l787k496j702j469r00M8N98P97J573L064M345
$$ plain form
55709 218062 222902 227720 232185 235905 238886 241599 243950 244842 243438 240270 236425 232246 227528 222431
55695 222431 217355 212270 206946 201631 196904 193040 189996 187781 186409 185701 185479 185729 186395 187394 188945
55680 188945 191399 194509 197388 199400 200574 201077 200978 200698 200836 201230 200948 199534 197443 194958 191727 187938
55664 187938 184927 183762 183966 184443 185009 186193 188160 190687 193715 197184 200660 203806 206817 209871 212686
55649 212686 215134 217645 220320 222319 222973 222877 222999 223144 222254 219876 216449 212390 207766 202696 197279 191266
55633 191266 184495 177541 171341 166267 162090 158597 155727 153371 151572 150607 150353 149948 148712 147020 145662
55618 145662 144751 143945 143283 142917 142418 141251 139724 138520 137489 135928 134018 132895 133045 133503 133059 131628
55602 131628 130089 129270 129373 129987 130390 130113 129310 128423 127547 126449 125060 123530 121925 120326 119143 118778
$$ packed form
55709B18062M840M818M465L720K981K713K351Q92j404l168l845m179m718n097
55695B22431n076n085n324n315m727l864l044k215j372p08k22K50O66R99J551
55680A88945K454L110K879K012J174N03r9k80J38L94k82j414k091k485l231l789
55664A87938l011j165K04M77N66J184J967K527L028L469L476L146L011L054K815
55649B12686K448K511K675J999O54r6J22J45q90k378l427m059m624n070n417o013
55633A91266o771o954o200n074m177l493k870k356j799r65k54m05j236j692j358
55618A45662r11q06o62l66m99j167j527j204j031j561j910j123J50M58m44j431
55602A31628j539q19J03O14M03k77q03q87q76j098j389j530j605j599j183l65
$$ plain form
55586 118778 118974 118998 118563 118093 118001 118129 118050 117554 116760 116028 115867 116642 118226 120078 121649 122590 122743 122261 121670
55567 121670 121541 122059 123058 124294 125508 126401 126863 127107 127259 127000 125905 124038 121919 120035 118642 117852
55551 117852 117589 117555 117540 117662 118055 118506 118712 118709 118693 118585 118170 117558 117150 117165 117478 117883 118268 118654 119219 120183 121439
55530 121439 122495 122985 123050 123004 122911 122751 122679 122727 122467 121385 119477 117177 114923 113045 111850 111390 111295 111142
55512 111142 110854 110473 109828 108756 107429 106139 105021 104269 104216 104771 105118 104546 103409 102727 102939 103486 103552 102868
55494 102868 101888 101446 102010 103022 103300 102410 101185 100517 100204 99669 99225 99657 100774 101489 101390 101299 101990 103109
55476 103109 103781 103747 103480 103480 103808 104196 104460 104760 105325 105906 105796 104677 103090 101765 100786 99862 99040 98522 98079
55457 98079 97344 96548 96304 96698 97186 97329 97057 96338 95276 94457 94507 95247 95927 96304 96736 97179 96932 95683 94131
$$ packed form
55586A18778J96K4m35m70r2J28p9m96p94p32j61P75J584J852J571R41J53m82n91
55567A21670j29N18R99J236J214Q93M62K44J52k59j095j867k119j884j393p90
55551A17852k63l4j5J22L93M51K06lj6j08m15o12m08J5L13M05L85L86N65R64J256
55530A21439J056M90O5m6r3j60p2M8k60j082j908k300k254j878j195m60r5j53
55512A11142k88l81o45j072j327j290j118p52n3N55L47n72j137o82K12N47O6o84
55494A02868r80m42N64J012K78q90j225o68l13n35m44M32J117P15r9r1O91J119
55476A03109O72l4k67%L28L88K64L00N65N81j10j119j587j325r79r24q22n18m43
55457I8079p35p96k44L94M88J43k72p19j062q19N0P40O80L77M32M43k47j249j552
$$ plain form
55438 94131 93200 93088 93373 93563 93294 92471 91494 90968 90962 90999 90911 91217 92308 93754 94805 95278 95566 96007 96598
55419 96598 97227 97899 98760 99940 101294 102376 102853 102865 102722 102333 101375 99962 98686 97894 97353 96728 96064 95645
55401 95645 95696 96323 97440 98639 99409 99522 99061 98197 97282 96910 97330 97916 97849 97285 97163 97831 98644 99140 99734
55382 99734 100795 101812 102107 101890 101883 102218 102372 101996 101222 100254 99196 98342 98107 98505 99025 99191 99080 99087 99302
55363 99302 99337 98871 98220 98093 98697 99353 99263 98518 97992 98349 99446 100687 101572 101942 102083 102647 104049 105812
55345 105812 106849 106551 105300 103878 102752 102041 101730 101608 101290 100658 100076 99978 100391 101022 101630 102070 102129 101570
55327 101570 100414 99095 98271 98339 99084 99929 100605 101275 101863 101673 100228 98143 96546 95759 95210 94644 94608 95485
55309 95485 96761 97670 98085 98384 98783 99216 99626 100058 100557 101147 101728 101975 101693 101276 101331 101753 101759 101127 100783 101633
$$ packed form
55438I4131r31j12K85J90k69q23r77n26oL7q8L06J091J446J051M73K88M41N91
55419I6598O29O72Q61J180J354J082M77J2j43l89r58j413j276p92n41o25o64m19
55401I5645N1O27J117J199P70J13m61q64r15l72M20N86o7n64j22O68Q13M96N94
55382I9734J061J017K95k17pL35J54l76p74r68j058q54k35L98N20J66j11PK15
55363I9302L5m66o51j27O04O56r0p45n26L57J097J241Q85L70J41N64J402J763
55345A05812J037k98j251j422j126p11l11j22l18o32n82r8M13O31O08M40N9n59
55327A01570j156j319q24O8P45Q45O76O70N88j90j445k085j597p87n49n66l6Q77
55309I5485J276R09M15K99L99M33M10M32M99N90N81K47k82m17N5M22Oo32l44Q50
$$ plain form
55289 101633 103268 104438 104530 103963 103283 102576 101872 101520 101797 102429 102823 102654 102021 101102 99993 98950 98449 98639
55271 98639 98873 98320 97134 96549 97467 99380 101092 102101 102729 103269 103770 104515 105855 107499 108651 109040 109196
55254 109196 109588 110100 110549 111028 111436 111269 110241 108682 107038 105473 104219 103711 103945 104144 103567 102351 101252
55237 101252 100887 101506 103029 104893 106304 107053 107767 108955 110180 110658 110378 110070 110296 110982 111708 112103 112054
55220 112054 111806 111673 111504 110765 109388 108050 107258 106629 105637 104666 104626 105705 107118 108015 108182 107911 107641 107702
55202 107702 108031 108220 108153 108341 109175 110128 110317 109724 109183 109159 109223 108880 108268 107753 107365 107055 107080 107664 108497 109013
55182 109013 109018 108702 108086 106940 105330 103881 103211 103278 103546 103658 103655 103590 103377 103125 103273 104104 105375 106693 107980
55163 107980 109326 110646 111814 112905 113865 114266 113866 113182 112901 112897 112495 111608 110798 110228 109399 108122 106945
$$ packed form
55289A01633J635J170R2n67o80p07p04l52K77O32L94j69o33r19j109j043n01J90
55271I8639K34n53j186n85R18J913J712J009O28N40N01P45J340J644J152L89J56
55254A09196L92N12M49M79M08j67j028j559j644j565j254n08K34J99n77j216j099
55237A01252l65O19J523J864J411P49P14J188J225M78k80l08K26O86P26L95m9
55220A12054k48j33j69p39j377j338p92o29r92r71m0J079J413Q97J67k71k70O1
55202A07702L29J89o7J88Q34R53J89n93n41k4O4l43o12n15l88l10K5N84Q33N16
55182A09013Nl16o16j146j610j449o70O7K68J12lo5k13k52J48Q31J271J318J287
55163A07980J346J320J168J091R60M01m00o84k81mm02q87q10n70q29j277j177
$$ plain form
55146 106945 106304 105988 105772 105904 106516 107205 107634 107995 108495 108993 109547 110633 112241 113435 113564 113339 113923 115360
55128 115360 116701 117429 117886 118379 118626 118197 117004 115352 113836 113063 113104 113355 113232 112765 112203 111445 110384
55111 110384 109500 109490 110413 111635 112451 112463 111661 110614 110237 110874 111898 112655 113381 114645 116279 117636 118610
55094 118610 119662 121006 122434 123775 124864 125295 124935 124531 124961 125970 126441 125904 124950 124140 123377 122578 122171
55077 122171 122560 123572 124675 125360 125276 124514 123813 123938 124737 125321 125216 124788 124494 124357 124342 124639 125305 126028 126440
55058 126440 126326 125575 124404 123547 123613 124216 124421 124080 123974 124472 124917 124683 124050 123527 122895 121607 119797 118313
55040 118313 117859 118373 119091 119098 118120 116929 116601 117205 117644 117022 115738 114928 115200 116237 117314 117841 117650 117083
55022 117083 116695 116697 116874 117118 117678 118721 119995 121198 122307 123297 123777 123315 122023 120588 119732 119706 120197 120683
$$ packed form
55146A06945o41l16k16J32O12O89M29L61N00M98N54J086J608J194J29k25N84J437
55128A15360J341P28M57M93K47m29j193j652j516p73M1K51j23m67n62p58j061
55111A10384q84j0R23J222Q16J2q02j047l77O37J024P57P26J264J634J357R74
55094A18610J052J344J428J341J089M31l60m04M30J009M71n37r54q10p63p99m07
55077A22171L89J012J103O85q4p62p01J25P99N84j05m28k94j37j5K97O66P23M12
55058A26440j14p51j171q57O6O03K05l41j06M98M45k34o33n23o32j288j810j484
55040A18313m54N14P18Pr78j191l28O04M39o22j284q10K72J037J077N27j91n67
55022A17083l88KJ77K44N60J043J274J203J109R90M80m62j292j435q56k6M91M86
$$ plain form
55004 120683 120962 121305 121964 122731 123257 123621 124136 124709 124888 124523 123869 123082 122196 121606 121900 122977 123883 123805 122799
54985 122799 121444 120312 119912 120503 121576 122096 121639 120896 120768 121418 122487 123712 124901 125764 126203 126463 126738
54968 126738 127009 127432 128278 129192 129222 128138 127092 127314 128652 130050 130970 131556 131792 131459 130844 130651 131164 132078
54950 132078 133050 133809 133817 132624 130635 128872 127854 127285 126889 126837 127142 127392 127488 128043 129476 131149 132036 132011
54932 132011 131855 132040 132221 132066 132006 132679 133977 135226 136295 138045 141439 146562 152744 159231 165371 170437
54916 170437 173992 176530 179194 182557 185972 188321 189098 188518 186877 184176 180326 175523 170422 165929 162626
54901 162626 160314 158281 156037 153541 150744 147403 143572 139922 137225 135679 134958 134702 134724 134905 135224 135834
54885 135834 136968 138751 141072 143499 145467 146899 148601 151556 155739 160206 164472 169143 174760 180663
$$ packed form
55004A20683K79L43O59P67N26L64N15N73J79l65o54p87q86n90K94J077R06p8j006
54985A22799j355j132m00N91J073N20m57p43j28O50J069J225J189Q63M39K60K75
54968A26738K71M23Q46R14L0j084j046K22J338J398R20N86K36l33o15j93N13R14
54950A32078R72P59Qj193j989j763j018n69l96n2L05K50R6N55J433J673Q87k5
54932A32011j56J85J81j55o0O73J298J249J069J750L394N123O182O487O140N066
54916A70437L555K538K664L363L415K349P77n80j641k701l850m803n101m493l303
54901A62626k312k033k244k496k797l341l831l650k697j546p21k56K2J81L19O10
54885A35834J134J783K321K427J968J432J702K955M183M467M266M671N617N903
$$ plain form
54871 180663 185658 189392 192325 194576 195531 194619 191902 187882 183212 178596 174458 170546 166244 161387 156465
54856 156465 151975 147953 144247 140865 137858 135110 132504 130139 128248 126940 126164 125787 125624 125417 124935
54841 124935 124201 123577 123486 123914 124310 124201 123851 123942 124616 125215 125206 124910 125008 125649 126495 127448 128779 130553 132367
54822 132367 133827 134953 135917 136575 136481 135412 133785 132466 132062 132375 132665 132434 131799 131096 130398 129584 128672
54805 128672 127847 127233 126812 126525 126358 126426 126953 127994 129173 130029 130670 131746 133501 135202 135831 135200 134067
54788 134067 133311 133254 133684 134241 134721 135207 135904 136844 137833 138762 139767 141047 142643 144434 146158 147440 148139
54771 148139 148758 150192 152880 156468 160369 164356 168534 173136 178486 184715 191286 197197 201916 205664
54757 205664 208550 210015 209550 207445 204265 199983 194315 187695 181275 176034 172251 169654 167582 165203
$$ packed form
54871A80663M995L734K933K251R55r12k717m020m670m616m138l912m302m857m922
54856A56465m490m022l706l382l007k748k606k365j891j308p76l77j63k07m82
54841A24935p34o24r1M28L96j09l50R1O74N99rk96R8O41Q46R53J331J774J814
54822A32367J460J126R64O58r4j069j627j319m04L13K90k31o35p03o98q14r12
54805A28672q25o14m21k87j67O8N27J041J179Q56O41J076J755J701O29o31j133
54788A34067p56n7M30N57M80M86O97R40R89R29J005J280J596J791J724J282O99
54771A48139O19J434K688L588L901L987M178M602N350O229O571N911M719L748
54757B05664K886J465m65k105l180m282n668o620o420n241l783k597k072k379
$$ plain form
54743 165203 162122 158826 156142 154342 153025 151703 150136 148288 146433 145165 144927 145579 146659 147863 149027
54728 149027 150012 151033 152745 155530 158960 162429 165948 169787 173686 177184 180458 184060 187918 191325
54714 191325 193897 195834 197200 197591 196600 194084 190088 185080 180136 176135 172754 168998 164751 161015 158530
54699 158530 156912 155390 153675 151816 149872 148043 146616 145543 144589 143966 144158 144934 145351 145071 144895 145488
54683 145488 146301 146362 145558 144442 143234 141793 140375 139642 139882 140688 141425 141706 141409 140566 139301 137794 136327
54666 136327 135297 134935 134999 135054 135056 135287 135684 135758 135284 134563 133805 132911 132137 132254 133464 134732 134900 134088 133344
54647 133344 133244 133587 134231 135313 136593 137370 137334 136970 136839 136920 136939 136993 137421 138230 138956 139107 138590 137734 137043
54628 137043 136880 137290 138041 138865 139685 140588 141531 142135 141942 141040 140216 140192 140729 140826 139887 138425 137419 137264 137545
$$ packed form
54743A65203l081l296k684j800j317j322j567j848j855j268k38O52J080J204J164
54728A49027R85J021J712K785L430L469L519L839L899L498L274L602L858L407
54714A91325K572J937J366L91r91k516l996n008m944m001l381l756m247l736k485
54699A58530j618j522j715j859j944j829j427j073r54o23J92P76M17k80j76N93
54683A45488Q13O1q04j116j208j441j418p33K40Q06P37K81k97q43j265j507j467
54666A36327j030l62O4N5KK31L97P4m74p21p58q94p74J17J210J268J68q12p44
54647A33344j00L43O44J082J280P77l6l64j31Q1J9N4M28Q09P26J51n17q56o91
54628A37043j63M10P51Q24Q20R03R43O04j93r02q24k4N37R7r39j462j006j55K81
$$ plain form
54609 137545 137661 137430 137135 137223 137968 139246 140639 141753 142472 142923 143341 143919 144646 145195 145145 144383 143212 142012
54591 142012 140935 139980 139216 138800 138825 139195 139641 139878 139844 139734 139753 139916 140164 140484 140741 140604 139902 138945 138211
54572 138211 137842 137676 137619 137629 137528 137216 137007 137323 138149 139221 140619 142602 144886 146675 147542 147723 147446 146546
54554 146546 145007 143370 142267 141851 141821 141689 141028 139883 139030 139272 140407 141401 141711 141787 142181 142924 144056
54537 144056 145895 148275 150211 150956 150821 150409 149665 148398 147159 146752 147185 147809 148217 148305 147821 146696 145607
54520 145607 145386 145915 146367 146436 146521 146688 146367 145350 144342 144130 144686 145447 146037 146373 146392 146084 145673 145511 145760
54501 145760 146256 146601 146446 145827 145173 144812 144561 144021 143184 142489 142330 142683 143215 143594 143773 144093 144947 146228
54483 146228 147330 147893 148189 148549 148811 148781 148836 149493 150591 151535 152241 153243 154856 156740 158308 159083 158767
$$ packed form
54609A37545J16k31k95Q8P45J278J393J114P19M51M18N78P27N49n0p62j171j200
54591A42012j077r55p64m16K5L70M46K37l4j10J9J63K48L20K57j37p02r57p34
54572A38211l69j66n7J0j01l12k09L16Q26J072J398J983K284J789Q67J81k77r00
54554A46546j539j637j103m16l0j32o61j145q53K42J135R94L10P6L94P43J132
54537A44056J839K380J936P45j35m12p44j267j239m07M33O24M08Q8m84j125j089
54520A45607k21N29M52O9Q5J67l21j017j008k12N56P61N90L36J9l08m11j62K49
54501A45760M96L45j55o19o54l61k51n40q37o95j59L53N32L79J79L20Q54J281
54483A46228J102N63K96L60K62l0N5O57J098R44P06J002J613J884J568P75l16
$$ plain form
54466 158767 157505 156127 155538 155746 155973 155773 155492 155476 155434 154902 153960 153115 152747 152877 153348 154028 154958 156283
54448 156283 157892 159230 159751 159440 158603 157347 155733 154237 153392 153022 152538 152000 152079 152796 153159 152529 151633
54431 151633 151637 152722 154135 155209 155786 155952 155996 156389 157282 158216 158765 159241 160216 161557 162525 162760 162597 162426
54413 162426 162272 162097 162066 162339 162878 163504 163962 163995 163725 163853 165040 167001 168675 169378 169387 169302 169297 169242 169126 168975
54393 168975 168657 168166 167909 168332 169365 170553 171630 172615 173431 173803 173568 172804 171648 170310 169285 169157 169922
54376 169922 170808 170981 170305 169261 168309 167614 167178 166892 166557 166129 165908 166198 166823 167341 167759 168639 170337 172448
54358 172448 174263 175540 176635 178022 180003 182713 186142 190082 194260 198546 202930 207288 211320 214773
54344 214773 217656 220133 222164 223282 222901 220961 218132 215153 212050 208281 203624 198583 193880 189907
$$ packed form
54466A58767j262j378n89K08K27k00k81j6m2n32r42q45l68J30M71O80R30J325
54448A56283J609J338N21l11q37j256j614j496q45l70m84n38P9P17L63o30q96
54431A51633MJ085J413J074N77J66M4L93Q93R34N49M76R75J341R68K35j63j71
54413A62426j54j75l1K73N39O26M58L3k70J28J187J961J674P03Rq5nn5j16j51
54393A68975l18m91k57M23J033J188J077R85Q16L72k35p64j156j338j025j28P65
54376A69922Q86J73o76j044r52o95m36k86l35m28k21K90O25N18M18Q80J698K111
54358A72448J815J277J095J387J981K710L429L940M178M286M384M358M032L453
54344B14773K883K477K031J118l81j940k829k979l103l769m657n041m703l973
$$ plain form
54330 189907 186781 184464 182579 180523 178157 176048 174647 173578 172273 171043 170806 171720 172763 172881 172024
54315 172024 170803 169624 168597 167940 167916 168403 168935 169246 169439 169576 169395 168683 167696 166862 166120 164921 163066
54298 163066 161228 160310 160352 160509 160150 159603 159642 160460 161455 161938 161862 161821 162408 163569 164660 165180 165286 165424 165692
54279 165692 166021 166775 168523 171057 173265 174301 174363 174059 173571 172917 172471 172494 172542 172028 171184 170785 171063 171571
54261 171571 172039 172673 173566 174490 175405 176536 177753 178424 178198 177524 177156 177455 178303 179303 179833 179330 177888
54244 177888 176370 175674 176008 176957 177978 178641 178593 177643 175947 174086 172829 172613 173076 173322 172867 172149 171811
54227 171811 171811 171644 171189 170706 170195 169484 168983 169590 171554 174020 175951 177016 177375 177165 176561 175918 175519 175426
54209 175426 175701 176317 176756 176303 175022 173840 173274 172757 171695 170597 170404 171150 172093 172913 173930 175165 175971
$$ packed form
54330A89907l126k317j885k056k366k109j401j069j305j230k37R14J043J18q57
54315A72024j221j179j027o57k4M87N32L11J93J37j81p12r87q34p42j199j855
54298A63066j838r18M2J57l59n47L9Q18R95M83p6m1N87J161J091N20J06J38K68
54279A65692L29P54J748K534K208J036O2l04m88o54m46K3M8n14q44l99K78N08
54261A71571M68O34Q93R24R15J131J217O71k26o74l68K99Q48J000N30n03j442
54244A77888j518o96L34R49J021O63m8r50j696j861j257k16M63K46m55p18l38
54227A71811%j67m55m83n11p11n01O07J964K466J931J065L59k10o04o43l99r3
54209A75426K75O16M39m53j281j182n66n17j062j098j93P46R43Q20J017J235Q06
$$ plain form
54192 175971 175793 174806 173575 172463 171531 170745 170130 169816 169964 170548 171333 172176 173182 174338 175267 175645 175648 175625
54174 175625 175544 175218 174932 175235 176113 176905 177151 177039 176817 176327 175434 174525 174101 174078 173929 173478 173101 173086 173138 172721
54154 172721 171716 170511 169533 168902 168555 168478 168654 168937 169201 169623 170584 172206 174033 175290 175511 174910 174149
54137 174149 173710 173505 173212 172938 173263 174499 176152 177416 178036 178346 178595 178682 178563 178486 178631 178878 179073 179258
54119 179258 179445 179456 179204 178962 179117 179814 180947 182371 183946 185456 186625 187228 187217 186855 186600 186645 186684 186415
54101 186415 186131 186354 186949 187175 186754 186340 186670 187731 189073 190479 191869 192895 193164 192741 192103 191660 191547
54084 191547 191671 191727 191381 190752 190531 191396 193465 196419 199805 202934 204982 205803 206461 208450 212294 217214
54068 217214 222064 226358 230532 235578 242364 250948 260464 269778 278146 285238 290857 294873 297178 297399
$$ packed form
54192A75971j78r87j231j112r32p86o15l14J48N84P85Q43J006J156R29L78Lk3
54174A75625q1l26k86L03Q78P92K46j12k22m90q93r09m24k3j49m51l77j5N2m17
54154A72721j005j205r78o31l47p7J76K83K64M22R61J622J827J257K21o01p61
54137A74149m39k05k93k74L25J236J653J264O20L10K49Q7j19p7J45K47J95J85
54119A79258J87J1k52k42J55O97J133J424J575J510J169O03j1l62k55M5L9k69
54101A86415k84K23N95K26m21m14L30J061J342J406J390J026K69m23o38m43j13
54084A91547J24N6l46o29k21Q65K069K954L386L129K048Q21O58J989L844M920
54068B17214M850M294M174N046O786Q584R516R314Q368P092N619M016K305K21
$$ plain form
54054 297399 295011 290056 283460 276214 268533 260304 252054 244828 239218 235114 232354 230998 230898 231588 232841
54039 232841 234887 237878 241474 245149 248654 252060 255653 259851 264957 270762 276562 281686 285911 289369
54025 289369 292257 294767 297092 299358 301539 303398 304547 304737 304181 303418 302708 301765 300187 297867 294805
54010 294805 290940 286546 282371 278809 275194 270554 264992 259685 255526 252420 250029 248496 247960 247809 246987
53995 246987 245067 242744 241099 240418 239826 238316 236109 234589 234709 235938 237197 238371 240223 243078 246416
53980 246416 249734 253019 256258 259195 261885 264859 268321 271541 273414 273398 271767 269204 266305 263228 259714
53965 259714 255659 251538 247874 244439 240619 236559 233203 231014 229395 227749 226389 225871 226035 226377 226967
53950 226967 228291 230367 232754 235351 238521 242298 246000 248991 251566 254737 259126 264270 269114 273088
$$ packed form
54054B97399k388m955o596p246p681q229q250p226n610m104k760j356j00O90J253
54039B32841K046K991L596L675L505L406L593M198N106N805N800N124M225L458
54025B89369K888K510K325K266K181J859J149J90n56p63p10r43j578k320l062
54010B94805l865m394m175l562l615m640n562n307m159l106k391j533n36j51q22
53995B46987j920k323j645o81n92j510k207j520J20J229J259J174J852K855L338
53980B46416L318L285L239K937K690K974L462L220J873j6j631k563k899l077l514
53965B59714m055m121l664l435l820m060l356k189j619j646j360n18J64L42N90
53950B26967J324K076K387K597L170L777L702K991K575L171M389N144M844L974
$$ plain form
53936 273088 276494 279847 283230 286556 290048 293853 297387 299831 301422 303507 306999 311287 315135 318201
53922 318201 321232 325084 330067 336119 343216 351571 361579 373482 387089 402124 418845 437849 459011
53909 459011 481049 502413 522151 539610 553803 563675 568743 569030 564575 555482 542310 526095 508136
53896 508136 489935 472884 457481 443099 429012 415456 403225 392524 382786 373484 364556 356091
53884 356091 348124 340745 333956 327429 320826 314282 308217 302795 298018 294122 291316 289214 287121 284831
53870 284831 282521 279914 276322 271734 267168 263620 261148 259192 257221 254837 251910 249018 247168 246533
53856 246533 245890 243921 240792 237922 236416 236244 236733 237176 236995 235936 234338 232832 231639 230439 229000
53841 229000 227581 226560 226003 225773 225834 226168 226580 226801 226687 226179 225244 224107 223413 223757 224989 226238 226770
$$ packed form
53936B73088L406L353L383L326L492L805L534K444J591K085L492M288L848L066
53922C18201L031L852M983O052P097Q355J0008J1903J3607J5035J6721J9004K1162
53909D59011K2038K1364J9738J7459J4193R872N068K87m455r093j3172j6215j7959
53896E08136j8201j7051j5403j4382j4087j3556j2231j0701r738r302q928q465
53884C56091p967p379o789o527o603o544o065n422m777l896k806k102k093k290
53870B84831k310k607l592m588m566l548k472j956j971k384k927k892j850o35
53856B46533o43j969l129k870j506j72M89M43j81j059j598j506j193j200j439
53841B29000j419j021n57k30O1L34M12K21j14n08r35j137o94L44J232J249N32
$$ plain form
53824 226770 226611 226228 225872 225503 225169 225093 225388 225992 226861 227999 229245 230411 231664 233406 235582 237560 238974
53807 238974 240364 242532 245575 249045 252869 257434 262747 268113 272894 277129 281180 285156 289026 292984
53793 292984 297247 301644 305730 309305 312550 315682 318651 321183 322966 323835 323923 323577 322963 321815 319700
53778 319700 316547 312732 308706 304650 300524 296280 291987 287880 284282 281295 278456 274887 270072 264517
53764 264517 259462 255824 253517 251851 250414 249279 248428 247405 245798 243794 241941 240415 238916 237312
53750 237312 235995 235342 235096 234612 233628 232547 231956 232091 232754 233530 233969 233825 233282 232843 232850 233191 233631 234277 235411
53731 235411 236853 237895 238099 237917 238184 239090 240026 240433 240460 240611 241127 241978 243180 244724 246312 247590 248692
53714 248692 250231 252606 255565 258500 260976 262854 264206 265315 266562 268077 269578 270758 271733 272952
$$ packed form
53824B26770j59l83l56l69l34p6K95O04Q69J138J246J166J253J742K176J978J414
53807B38974J390K168L043L470L824M565N313N366M781M235M051L976L870L958
53793B92984M263M397M086L575L245L132K969K532J783Q69Q8l46o14j148k115
53778C19700l153l815m026m056m126m244m293m107l598k987k839l569m815n555
53764B64517n055l638k307j666j437j135q51j023j607k004j853j526j499j604
53750B37312j317o53k46m84r84j081n91J35O63P76M39j44n43m39PL41M40O46J134
53731B35411J442J042K04j82K67R06R36M07K7J51N16Q51J202J544J588J278J102
53714B48692J539K375K959K935K476J878J352J109J247J515J501J180R75J219
$$ plain form
53700 272952 274752 277202 280250 283721 287185 290197 292740 295195 297705 299896 301456 302762 304559 307044
53686 307044 309601 311463 312305 312098 310820 308663 306283 304439 303329 302572 301806 300964 299943 298465 296542
53671 296542 294751 293695 293332 293179 293015 292973 292988 292644 291684 290267 288654 287084 286118 286449 287870 288922 288351
53654 288351 286717 285798 286449 287922 289360 290902 292719 293938 293599 292196 291176 291045 291045 290760 290851 291805 292969
53637 292969 293628 294315 296110 299020 301942 304093 305664 307073 308295 309159 309801 310601 312007 314411 317785
53622 317785 321366 324228 326329 328547 331562 335111 338528 341572 344454 347464 350890 354959 359535 364129
53608 364129 368426 372509 376349 379594 382226 384967 388455 392306 395615 398177 400587 403263 406067 408935
53594 408935 412159 415775 419231 422062 424477 426932 429395 431466 433047 434424 435605 435861 434226 430521
$$ packed form
53700B72952J800K450L048L471L464L012K543K455K510K191J560J306J797K485
53686C07044K557J862Q42k07j278k157k380j844j110p57p66q42j021j478j923
53671B96542j791j056l63j53j64m2J5l44r60j417j613j570r66L31J421J052n71
53654B88351j634r19O51J473J438J542J817J219l39j403j020j31%k85R1R54J164
53637B92969O59O87J795K910K922K151J571J409J222Q64O42Q00J406K404L374
53622C17785L581K862K101K218L015L549L417L044K882L010L426M069M576M594
53608C64129M297M083L840L245K632K741L488L851L309K562K410K676K804K868
53594D08935L224L616L456K831K415K455K463K071J581J377J181K56j635l705
$$ plain form
53580 430521 425717 421096 417030 412834 407914 402688 398025 394068 390186 386013 381907 378254 374930 371721
53566 371721 368775 366259 364010 362026 360966 361545 363567 366013 368048 369536 370642 371443 372037 372605 373204
53551 373204 373803 374600 375916 377651 379234 380422 381813 384192 387522 390971 393966 396875 400548 405357 410820
53536 410820 416186 421216 426290 431749 437394 442878 448427 454734 462141 470358 479102 488457 498328 508081
53522 508081 517304 526566 536809 548209 560268 572872 586469 601229 616803 633120 650577 669133
53510 669133 687963 706560 725619 746179 768304 791170 814079 836713 858687 879623 899658
53499 899658 919262 938559 957292 975330 992749 1009481 1025459 1041077 1056913 1072997 1088807
53488 1088807 1103997 1118609 1132664 1146254 1160073 1175065 1191242 1207491 1222824 1237247 1251086
$$ packed form
53580D30521m804m621m066m196m920n226m663l957l882m173m106l653l324l209
53566C71721k946k516k249j984j060N79K022K446K035J488J106Q01N94N68N99
53551C73204N99P97J316J735J583J188J391K379L330L449K995K909L673M809N463
53536D10820N366N030N074N459N645N484N549O307P407Q217Q744R355R871R753
53522E08081R223R262J0243J1400J2059J2604J3597J4760J5574J6317J7457J8556
53510F69133J8830J8597J9059K0560K2125K2866K2909K2634K1974K0936K0035
53499H99658J9604J9297J8733J8038J7419J6732J5978J5618J5836J6084J5810
53488A088807J5190J4612J4055J3590J3819J4992J6177J6249J5333J4423J3839
$$ plain form
53477 1251086 1264077 1275610 1285436 1293649 1300270 1305230 1308516 1310008 1309423 1306637 1301793 1295022 1286453 1276669
53463 1276669 1266528 1256250 1245188 1232788 1219167 1204425 1188152 1170310 1151941 1134223 1117223
53452 1117223 1100295 1083218 1066128 1048731 1030660 1012503 995589 980637 967298 954942 943205
53441 943205 931845 920891 911009 902990 896806 891756 887525 884336 882099 880311 878954 878674 879866 882335
53427 882335 886045 891320 897955 905012 911997 919563 928540 939013 950879 964575 980461 997978 1016142
53414 1016142 1034608 1053732 1073955 1095643 1119127 1144292 1170425 1197114 1224933 1254673 1286292
53403 1286292 1319371 1354231 1391622 1431371 1472302 1513663 1555840 1599391 1644118 1689548 1735717
53392 1735717 1782906 1830815 1878523 1925280 1971081 2016382 2061322 2105291 2147312 2186901 2224381
$$ packed form
53477A251086J2991J1533R826Q213O621M960L286J492n85k786m844o771q569r784
53463A276669j0141j0278j1062j2400j3621j4742j6273j7842j8369j7718j7000
53452A117223j6928j7077j7090j7397j8071j8157j6914j4952j3339j2356j1737
53441I43205j1360j0954r882q019o184n050m231l189k237j788j357k80J192K469
53427H82335L710N275O635P057O985P566Q977J0473J1866J3696J5886J7517J8164
53414A016142J8466J9124K0223K1688K3484K5165K6133K6689K7819K9740L1619
53403A286292L3079L4860L7391L9749M0931M1361M2177M3551M4727M5430M6169
53392A735717M7189M7909M7708M6757M5801M5301M4940M3969M2021L9589L7480
$$ plain form
53381 2224381 2260246 2294372 2326140 2355166 2381534 2405300 2426059 2443123 2455871 2463876 2466904 2464965
53369 2464965 2458263 2446959 2430965 2409993 2383867 2352910 2318023 2280218 2240036 2197572 2153089
53358 2153089 2107279 2060898 2014514 1968729 1924135 1880707 1837720 1794842 1752936 1713205 1675749
53347 1675749 1639575 1603836 1568411 1533392 1498826 1465096 1432851 1402310 1373180 1345440 1319613
53336 1319613 1296035 1274395 1254348 1236034 1219598 1204586 1190365 1176812 1164171 1152389 1141023
53325 1141023 1129741 1118587 1107788 1097447 1087368 1077148 1066644 1056352 1046995 1038650 1030804 1023383
53313 1023383 1017141 1012663 1009562 1007255 1006031 1006662 1009202 1013002 1017772 1023912 1031665 1040605 1050168 1060235
53299 1060235 1071088 1083207 1097203 1113483 1131789 1151400 1171866 1193196 1215338 1237964 1260876
$$ packed form
53381B224381L5865L4126L1768K9026K6368K3766K0759J7064J2748Q005L028j939
53369B464965o702j1304j5994k0972k6126l0957l4887l7805m0182m2464m4483
53358B153089m5810m6381m6384m5785m4594m3428m2987m2878m1906l9731l7456
53347A675749l6174l5739l5425l5019l4566l3730l2245l0541k9130k7740k5827
53336A319613k3578k1640k0047j8314j6436j5012j4221j3553j2641j1782j1366
53325A141023j1282j1154j0799j0341j0079j0220j0504j0292r357q345p846p421
53313A023383o242m478l101k307j224O31K540L800M770O140P753Q940R563J0067
53299A060235J0853J2119J3996J6280J8306J9611K0466K1330K2142K2626K2912
$$ plain form
53288 1260876 1284118 1307466 1330236 1351835 1372098 1390916 1407987 1423218 1436872 1448953 1458889
53277 1458889 1466214 1471109 1473766 1473612 1469831 1462486 1452615 1441275 1428916 1415437 1400312 1382871 1363058
53264 1363058 1341876 1320481 1298851 1275982 1251476 1226233 1201401 1177219 1153240 1129141 1104911
53253 1104911 1080664 1056686 1033407 1010927 988772 966421 943871 921478 899497 878077 857406
53242 857406 837495 818021 798703 779668 761176 743216 725834 709643 695458 683378 672681
53231 672681 662696 653401 645042 637497 630231 622695 614647 606231 597861 589809 581759 572880 562499 550728
53217 550728 538359 526208 514551 503179 491886 480816 470294 460427 451131 442551 435100 428841
53205 428841 423083 416954 410284 403613 397445 391880 386950 382749 378975 374704 369087 362238 355209 349030
$$ packed form
53288A260876K3242K3348K2770K1599K0263J8818J7071J5231J3654J2081R936
53277A458889P325M895K657j54l781p345r871j1340j2359j3479j5125j7441j9813
53264A363058k1182k1395k1630k2869k4506k5243k4832k4182k3979k4099k4230
53253A104911k4247k3978k3279k2480k2155k2351k2550k2393k1981k1420k0671
53242H57406j9911j9474j9318j9035j8492j7960j7382j6191j4185j2080j0697
53231F72681r985r295q359p545p266p536q048q416q370q052q050q879j0381j1771
53217E50728j2369j2151j1657j1372j1293j1070j0522r867r296q580p451o259
53205D28841n758o129o670o671o168n565m930m201l774m271n617o849p029o179
$$ plain form
53191 349030 343955 339605 335621 331950 328595 325364 322101 319056 316788 315560 314981 314331 313146 311466 309681
53176 309681 308245 307402 307058 306992 307222 307929 308952 309627 309360 308146 306338 304179 301888 299856 298310 296878
53160 296878 295039 292996 291573 291168 291207 290859 289973 289118 288932 289622 290860 292001 292464 292062 290995 289650 288516
53143 288516 288025 288122 288056 287026 285098 283160 281917 281305 280978 280921 281302 282018 282683 282936 282603 281761 280806 280256
53125 280256 280292 280568 280659 280586 280768 281590 283145 285305 287840 290467 292901 295008 296960 299142 301635 303787
53109 303787 304669 304126 303024 302148 301236 299560 297078 294351 291572 288488 285213 282323 280009 277867 275685
53094 275685 273733 272096 270486 268997 268271 268468 268821 268660 268144 267539 266610 265448 265094 266297 268161 269088
53078 269088 268841 268676 269550 271136 272588 273433 273626 273476 273631 274445 275275 275087 273860 272714 272441 272598 272318
$$ packed form
53191C49030n075m350l984l671l355l231l263l045k268j228n79o50j185j680j785
53176C09681j436q43l44o6K30P07J023O75k67j214j808k159k291k032j546j432
53160B96878j839k043j423m05L9l48q86q55j86O90J238J141M63m02j067j345j134
53143B88516m91R7o6j030j928j938j243o12l27n7L81P16O65K53l33q42r55n50
53125B80256L6K76R1p3J82Q22J555K160K535K627K434K107J952K182K493K152
53109C03787Q82n43j102q76r12j676k482k727k779l084l275k890k314k142k182
53094B75685j952j637j610j489p26J97L53j61n16o05r29j162l54J203J864R27
53078B69088k47j65Q74J586J452Q45J93j50J55Q14Q30j88j227j146k73J57k80
$$ plain form
53061 272318 271386 270186 269076 268216 267621 267110 266500 265993 265980 266293 266188 265407 264721 264968 265889 266465 266174 265458
53043 265458 264984 264935 265058 265089 264915 264496 263804 262887 261928 261117 260431 259577 258266 256416 254133 251717 249842 249322
53025 249322 250277 251781 252817 253443 254501 256305 258292 259982 261492 262864 263611 263418 262755 262320 262254 262307 262420
53008 262420 262675 263052 263634 264710 266139 267041 266802 266094 266134 267068 267872 267868 267471 267278 267294 267498 268379 270158 271957
52989 271957 272550 271805 270700 269959 269385 268658 268149 268522 269870 271591 272984 273747 274092 274625 275964 278188 280672
52972 280672 282660 283949 284889 285855 286942 288095 289250 290342 291427 292797 294742 297156 299525 301289 302078
52957 302078 301761 300671 299701 299678 300396 300629 299374 296810 293818 290870 287802 284494 281344 278987 277729 277243
52941 277243 276742 275614 274014 272689 272088 271867 271433 270649 269696 268522 266944 265215 264067 264022 264892 265964
$$ packed form
53061B72318r32j200j110q60n95n11o10n07j3L13j05p81o86K47R21N76k91p16
53043B65458m74m9J23L1j74m19o92r17r59q11o86q54j311j850k283k416j875n20
53025B49322R55J504J036O26J058J804J987J690J510J372P47j93o63m35o6N3J13
53008B62420K55L77N82J076J429R02k39p08M0R34Q04ml97j93J6K04Q81J779J799
52989B71957N93p45j105p41n74p27n09L73J348J721J393P63L45N33J339K224K484
52972B80672J988J289R40R66J087J153J155J092J085J370J945K414K369J764P89
52957C02078l17j090r70k3P18K33j255k564k992k948l068l308l150k357j258m86
52941B77243n01j128j600j325o01k21m34p84r53j174j578j729j148m5Q70J072
$$ plain form
52925 265964 266538 266291 265296 263732 261630 259106 256769 255440 255266 255506 255536 255638 256372 257620 258824 259852
52909 259852 260942 262017 262793 263408 264123 264454 263530 261525 259890 259731 260649 261574 262133 262614 263108 263369 263291 262968
52891 262968 262346 261326 260175 259529 259885 261185 262795 263895 264120 263931 264125 264906 265722 266105 266225 266424 266635
52874 266635 266644 266594 266818 267382 268203 269431 271301 273611 275767 277419 278865 280770 283589 287177 290812 293617
52858 293617 295077 295236 294469 293248 291987 290855 289613 287878 285581 282954 280119 277083 274142 271812 270143
52843 270143 268608 266886 265344 264454 264172 264278 264834 265811 266616 266639 266076 265664 265674 265716 265423 264830 264059 263162 262341
52824 262341 261864 261592 260994 259785 258263 256873 255761 254902 254421 254479 254976 255601 256208 257038 258446 260388 262277
52807 262277 263558 264400 265564 267431 269474 270897 271499 271549 271061 269716 267517 265062 263038 261694 260879 260321
$$ packed form
52925B65964N74k47r95j564k102k524k337j329j74K40L0J02P34J248J204J028
52909B59852J090J075P76O15P15L31r24k005j635j59R18R25N59M81M94K61p8l23
52891B62968o22j020j151o46L56J300J610J100K25j89J94P81Q16L83J20J99K11
52874B66635Rn0K24N64Q21J228J870K310K156J652J446J905K819L588L635K805
52858B93617J460J59p67j221j261j132j242j735k297k627k835l036k941k330j669
52843B70143j535j722j542q90k82J06N56R77Q05K3n63m12J0M2k93n93p71q97q21
52824B62341m77k72n98j209j522j390j112q59m81N8M97O25O07Q30J408J942J889
52807B62277J281Q42J164J867K043J423O02N0m88j345k199k455k024j344q15n58
$$ plain form
52791 260321 259772 259085 258276 257389 256286 254758 252918 251299 250441 250408 250701 250629 249866 248764 248033 247992 248294 248558
52773 248558 249063 250441 252712 254996 256277 256168 254935 253154 251570 250967 251702 253302 254759 255322 255040 254546
52757 254546 254420 254777 255356 255880 256327 256936 257985 259479 260954 261731 261540 260882 260598 261033 261807 262411 262825 263443
52739 263443 264555 266005 267291 267957 268055 268165 268856 270133 271569 272854 273913 274671 275201 276043 277700 279646
52723 279646 280532 279745 278166 276969 276222 275351 274440 274218 274875 275676 275791 275004 273574 271941 270600 269808 269317
52706 269317 268658 267693 266565 265343 264138 263365 263344 263698 263764 263561 263744 264549 265440 265915 266061 266089 265995 265953 266442
52687 266442 267538 268552 268829 268614 268730 269635 271166 272873 274245 274804 274455 273683 273130 272973 272934 272764 272533
52670 272533 272544 273121 274312 275638 276368 276249 275815 275698 275810 275547 274773 274249 274922 276976 279717 282380 284838
$$ packed form
52791B60321n49o87q09q87j103j528j840j619q58l3K93p2p63j102p31m1L02K64
52773B48558N05J378K271K284J281j09j233j781j584o03P35J600J457N63k82m94
52757B54546j26L57N79N24M47O09J049J494J475P77j91o58k84M35P74O04M14O18
52739B63443J112J450J286O66R8J10O91J277J436J285J059P58N30Q42J657J946
52723B79646Q86p87j579j197p47q71r11k22O57Q01J15p87j430j633j341p92m91
52706B69317o59r65j128j222j205p73k1L54O6k03J83Q05Q91M75J46K8r4m2M89
52687B66442J096J014K77k15J16R05J531J707J372N59l49p72n53j57l9j70k31
52670B72533J1N77J191J326P30j19m34j17J12k63p74n24O73K054K741K663K458
$$ plain form
52653 284838 287373 289854 291573 292157 292306 293112 294720 296204 296786 296580 295950 294812 293048 291124 289686 288762
52637 288762 287887 286871 285922 285128 284413 284089 284869 287046 290005 292868 295374 297781 300040 301516 301664 300719
52621 300719 299454 298318 297072 295335 293227 291263 289799 288869 288466 288560 288790 288528 287493 286138 285208 285098
52605 285098 285683 286490 286852 286196 284623 283102 282745 283876 285923 288095 289892 291087 291665 291849 291962 292158
52589 292158 292460 293015 293985 295151 295983 296310 296552 297036 297364 296931 295929 295361 295953 297450 299108 300460 301335
52572 301335 301553 301151 300743 301081 302110 302915 302756 301830 300851 300243 300001 299990 300061 300046 299944 299983 300223 300292 299790 298744
52552 298744 297433 296038 294843 294457 295211 296522 297441 297792 298066 298247 297574 295798 293882 292868 292584 292151
52536 292151 291400 291068 291647 292709 293533 293886 293917 293692 293226 292887 293337 294845 296822 298306 298894 298922 298729 298266
$$ packed form
52653B84838K535K481J719N84J49Q06J608J484N82k06o30j138j764j924j438r24
52637B88762q75j016r49p94p15l24P80K177K959K863K506K407K259J476J48r45
52621C00719j265j136j246j737k108j964j464r30m03R4K30k62j035j355r30j10
52605B85098N85Q07L62o56j573j521l57J131K047K172J797J195N78J84J13J96
52589B92158L02N55R70J166Q32L27K42M84L28m33j002n68N92J497J658J352Q75
52572C01335K18m02m08L38J029Q05j59r26r79o08k42j1P1j5j02L9K40O9n02j046
52552B98744j311j395j195l86P54J311R19L51K74J81o73j776j916j014k84m33
52536B92151p51l32N79J062Q24L53L1k25m66l39M50J508J977J484N88K8j93m63
$$ plain form
52518 298266 297706 297930 299707 302599 305423 307795 310441 313838 317310 319910 321540 322674 323531 324161 324870
52503 324870 325854 326607 326378 325075 323165 320816 317828 314369 311147 308645 306735 305134 303788 302627 301431
52488 301431 300165 299086 298292 297564 296894 296784 297702 299476 301487 303270 304623 305413 305674 305844 306537 308003
52472 308003 309982 312053 313920 315454 316748 318140 319957 322170 324506 326901 329492 332063 333895 334546
52458 334546 334501 334553 334606 333698 331366 328419 325958 324057 321946 319252 316370 313669 311011 308289 305894 304229
52442 304229 303089 301918 300519 299175 298169 297473 296860 296088 295013 293760 292727 292275 292404 292836 293313 293672
52426 293672 293775 293641 293602 294026 294833 295494 295695 295868 296828 298862 301316 303301 304747 306545 309551 313709 318396
52409 318396 323393 329132 336142 344667 354789 366312 378382 389737 399631 408114 415218 420357 422881
$$ packed form
52518B98266n60K24J777K892K824K372K646L397L472K600J630J134Q57O30P09
52503C24870R84P53k29j303j910k349k988l459l222k502j910j601j346j161j196
52488C01431j266j079p94p28o70j10R18J774K011J783J353P90K61J70O93J466
52472C08003J979K071J867J534J294J392J817K213K336K395K591K571J832O51
52458C34546m5N2N3r08k332k947k461j901k111k694k882k701k658k722k395j665
52442C04229j140j171j399j344j006o96o13p72j075j253j033m52J29M32M77L59
52426B93672J03j34l9M24Q07O61K01J73R60K034K454J985J446J798L006M158M687
52409C18396M997N739P010Q525J0122J1523J2070J1355R894Q483P104N139K524
$$ plain form
52396 422881 422731 420072 414703 406499 396227 385241 374419 363998 354458 346843 341825 338806 336346
52383 336346 333437 330282 327923 327191 327958 329395 330854 332315 334022 336116 338843 342643 347553 352853 357825
52368 357825 362591 367528 372128 375298 376831 377708 378664 379211 378550 376830 374908 373279 371834 370462 369263
52353 369263 368230 367190 366153 365448 365443 366283 367900 370137 372882 376082 379516 382561 384479 385184 385550 386715
52337 386715 389193 392813 397319 402701 409022 416205 424069 432416 441174 450582 461164 473305 486808
52324 486808 501038 515508 530239 545601 561906 579079 596577 613695 630143 646319 662822
52313 662822 679740 696625 713180 729688 746580 763732 780482 796341 811506 826565 841824
52302 841824 857161 872430 887662 902683 916820 929366 940270 949898 958061 963700 965912 965011 962238
$$ packed form
52396D22881j50k659n369q204j0272j0986j0822j0421r540p615n018l019k460
52383C36346k909l155k359p32P67J437J459J461J707K094K727L800M910N300M972
52368C57825M766M937M600L170J533Q77R56N47o61j720j922j629j445j372j199
52353C69263j033j040j037p05nQ40J617K237K745L200L434L045J918P05L66J165
52337C86715K478L620M506N382O321P183P864Q347Q758R408J0582J2141J3503
52324D86808J4230J4470J4731J5362J6305J7173J7498J7118J6448J6176J6503
52313F62822J6918J6885J6555J6508J6892J7152J6750J5859J5165J5059J5259
52302H41824J5337J5269J5232J5021J4137J2546J0904R628Q163N639K212r01k773
$$ plain form
52289 962238 958527 953950 948308 941816 934959 927947 920600 912808 904925 897709 891844 887488 884248 881680
52275 881680 879830 879163 879962 881931 884575 887874 892360 898498 906137 914674 923715 933443 944311 956420
52261 956420 969285 982233 994976 1007709 1020698 1033919 1047138 1060190 1073007 1085427 1097174
52250 1097174 1107996 1117750 1126307 1133491 1139056 1142608 1143669 1142110 1138483 1133584 1127607 1120089 1110810 1100354
52236 1100354 1089512 1078568 1067574 1056913 1046901 1037108 1026787 1016010 1005692 996375 987705 979342
52224 979342 971693 965282 959960 955238 951016 947398 944131 940885 937943 936069 935651 936434 938069 940499 943776
52209 943776 947820 952466 957429 962265 966649 970762 975156 980162 985571 990851 995543 999558 1003370 1007800
52195 1007800 1013292 1019416 1025317 1030564 1035273 1039585 1043489 1047147 1050861 1054565 1057692 1059725 1060583 1060363
$$ packed form
52289I62238l711m577n642o492o857p012p347p792p883p216n865m356l240k568
52275H81680j850o67P99J969K644L299M486O138P639Q537R041R728J0868J2109
52261I56420J2865J2948J2743J2733J2989J3221J3219J3052J2817J2420J1747
52250A097174J0822R754Q557P184N565L552J061j559l627m899n977p518r279j0456
52236A100354j0842j0944j0994j0661j0012r793j0321j0777j0318r317q670q363
52224I79342p649o411n322m722m222l618l267l246k942j874m18P83J635K430L277
52209I43776M044M646M963M836M384M113M394N006N409N280M692M015L812M430
52195A007800N492O124N901N247M709M312L904L658L714L704L127K033Q58k20
$$ plain form
52181 1060363 1059002 1056427 1052773 1048201 1042654 1036010 1028423 1020409 1012625 1005550 999242 993389 987726 982449
52167 982449 978123 975244 974003 974346 975981 978385 981113 984125 987561 991178 994313 996501 997924 999119
52153 999119 1000441 1001831 1002875 1003097 1002436 1001539 1001386 1002550 1004870 1007757 1010578 1012800 1014109 1014509 1014127 1013010
52137 1013010 1011386 1009983 1009634 1010400 1011544 1012550 1013839 1016292 1020388 1026154 1033734 1043652 1056424 1072086
52123 1072086 1090199 1110357 1132576 1157037 1183396 1210725 1238300 1266071 1293960 1321078 1346273
52112 1346273 1369301 1390779 1411024 1429553 1445794 1459633 1471220 1480854 1489235 1497214 1505107 1512762
52100 1512762 1520301 1528061 1535723 1542427 1548014 1553186 1557951 1560871 1560546 1556980 1550695 1541377 1528569 1513178
52086 1513178 1497035 1481109 1465164 1449016 1433114 1417859 1403383 1390226 1379341 1371125 1365068 1360606
$$ packed form
52181A060363j361k575l654m572n547o644p587q014p784p075o308n853n663n277
52167I82449m326k879j241L43J635K404K728L012L436L617L135K188J423J195
52153I99119J322J390J044K22o61q97j53J164K320K887K821K222J309M00l82j117
52137A013010j624j403l49P66J144J006J289K453M096N766P580R918J2772J5662
52123A072086J8113K0158K2219K4461K6359K7329K7575K7771K7889K7118K5195
52112A346273K3028K1478K0245J8529J6241J3839J1587R634Q381P979P893P655
52100A512762P539P760P662O704N587N172M765K920l25l566o285r318j2808j5391
52086A513178j6143j5926j5945j6148j5902j5255j4476j3157j0885q216o057m462
$$ plain form
52074 1360606 1357758 1356786 1357803 1360934 1366306 1373630 1382287 1392001 1402977 1415195 1428051 1440944 1453750
52061 1453750 1466503 1479057 1491363 1503633 1515879 1527597 1538235 1547721 1556275 1563919 1570449 1575714
52049 1575714 1579657 1582162 1582986 1581733 1577838 1570835 1560805 1548439 1534592 1519823 1504305 1487959 1470705
52036 1470705 1452894 1435466 1419341 1404623 1390775 1377585 1365448 1354533 1344200 1333634 1322701
52025 1322701 1311751 1300855 1289745 1278412 1267306 1256782 1246592 1236119 1225114 1214157 1204311
52014 1204311 1196201 1189437 1183063 1176489 1169721 1162764 1155265 1147017 1138416 1129972 1121396 1111571 1099582 1085604
$$ packed form
52074A360606k848r72J017L131N372P324Q657R714J0976J2218J2856J2893J2806
52061A453750J2753J2554J2306J2270J2246J1718J0638R486Q554P644O530N265
52049A575714L943K505Q24j253l895p003j0030j2366j3847j4769j5518j6346j7254
52036A470705j7811j7428j6125j4718j3848j3190j2137j0915j0333j0566j0933
52025A322701j0950j0896j1110j1333j1106j0524j0190j0473j1005j0957r846
52014A204311q110o764o374o574o768o957p499q248q601q444q576r825j1989j3978
$$ [...]
##END NTUPLES=NMR SPECTRUM
##END=
