##TITLE=AC1559_ROEFFECT0017_8269235_DeYnO6ElXE
##JCAMPDX= 6.0         $$ Bruker NMR JCAMP-DX V2.0
##DATA TYPE= NMR SPECTRUM
##DATA CLASS= NTUPLES
##ORIGIN= BRUKER
##OWNER= Administrator
$$ 1.72 TOPSPIN		Version 2.1
$$ 2013-10-18 15:54:57.693 -0700  Administrator@X
$$ Compression mode = diff/dup
##.OBSERVE FREQUENCY= 400.02188249412
##.OBSERVE NUCLEUS= ^1H
##.ACQUISITION MODE= SIMULTANEOUS (DQD)
##.ACQUISITION SCHEME= undefined
##.AVERAGES= 8
##.DIGITISER RES= 22
##SPECTROMETER/DATA SYSTEM= spect
##.PULSE SEQUENCE= zg30
##.SOLVENT NAME= COFFEE_meoh
##.SHIFT REFERENCE= INTERNAL, COFFEE_meoh, 1, 14.98509
##AUDIT TRAIL= $$ (NUMBER, WHEN, WHO, WHERE, PROCESS, VERSION, WHAT)
$$ ##TITLE= Audit trail, TOPSPIN		Version 2.1
$$ ##JCAMPDX= 5.01
$$ ##ORIGIN= Bruker BioSpin GmbH
$$ ##OWNER= Administrator
$$ $$ E:\/data/COFFEE/nmr/AC1559_ROEFFECT0017_8269235_DeYnO6ElXE/10/pdata/1/auditp.txt
$$ ##AUDIT TRAIL=  $$ (NUMBER, WHEN, WHO, WHERE, PROCESS, VERSION, WHAT)
(   1,<2013-10-18 15:54:51.037 -0700>,<Administrator>,<X>,<go>,<TOPSPIN 2.1>,
      <created by zg
	started at 2013-10-18 15:53:45.209 -0700,
	POWCHK enabled, PULCHK disabled,
       configuration hash MD5:
       C8 4E 4E 5D D3 5C D8 9E 9F 52 82 E0 59 8A DE 15
       data hash MD5: 64K
       05 98 A6 16 52 E3 01 A9 F3 D8 5D 75 5E 38 58 F5>)
(   2,<2013-10-18 15:54:53.912 -0700>,<Administrator>,<X>,<proc1d>,<TOPSPIN 2.1>,
      <Start of raw data processing
       efp LB = 0 FT_mod = 6 PKNL = 1 PHC0 = 0 PHC1 = 0 SI = 32K 
       data hash MD5: 32K
       5C 42 B1 48 89 6B E9 03 D8 C7 27 91 DF B9 93 93>)
(   3,<2013-10-18 15:54:54.193 -0700>,<Administrator>,<X>,<proc1d>,<TOPSPIN 2.1>,
      <pk PHC0 = 95.28992 PHC1 = 0 
       data hash MD5: 32K
       E4 A4 8B 86 49 EA 84 3D 5B 31 D8 6F 4F 70 C8 5F>)
(   4,<2013-10-18 15:54:54.287 -0700>,<Administrator>,<X>,<proc1d>,<TOPSPIN 2.1>,
      <abs ABSG = 1 
       data hash MD5: 32K
       AB B2 3D CD E6 1E 76 B7 71 DC C6 B5 FC D2 40 38>)
(   5,<2013-10-18 15:54:54.334 -0700>,<Administrator>,<X>,<proc1d>,<TOPSPIN 2.1>,
      <abs ABSG = 2 
       data hash MD5: 32K
       C5 D0 C7 38 BA C0 E4 86 76 CA 5E 35 55 7E 4D 50>)
(   6,<2013-10-18 15:54:54.412 -0700>,<Administrator>,<X>,<proc1d>,<TOPSPIN 2.1>,
      <abs ABSG = 3 
       data hash MD5: 32K
       A2 06 25 C3 11 90 88 5F 03 39 5C 1C 57 BA 6A BE>)
(   7,<2013-10-18 15:54:54.459 -0700>,<Administrator>,<X>,<proc1d>,<TOPSPIN 2.1>,
      <abs ABSG = 4 
       data hash MD5: 32K
       F0 99 DD D0 6F CD BC DB 30 AD 9B 9F 27 63 32 AF>)
(   8,<2013-10-18 15:54:54.521 -0700>,<Administrator>,<X>,<proc1d>,<TOPSPIN 2.1>,
      <abs ABSG = 5 
       data hash MD5: 32K
       0B 13 46 24 0B A3 BC F3 EB A6 1B 7B 2A B0 F2 73>)
$$ ##END=
$$ 
$$ $$ hash MD5
$$ $$ 97 F5 88 88 E2 5A FD 8F 43 C3 AB CA 5D 94 F8 77
##$RELAX= 
##$RELAX= 
##$RELAX= 
##$RELAX= 
##$RELAX= 
##$RELAX= 
##$RELAX= 
$$ Bruker specific parameters
$$ --------------------------
##$DU= <E:\>
##$EXPNO= 10
$$ [...]
##$TP= (0..7)
150 150 150 150 150 150 150 150
##$TP07= 0
##$TPNAME0= <>
##$TPNAME1= <>
##$TPNAME2= <>
##$TPNAME3= <>
##$TPNAME4= <>
##$TPNAME5= <>
##$TPNAME6= <>
##$TPNAME7= <>
##$TPOAL= (0..7)
0.5 0.5 0.5 0.5 0.5 0.5 0.5 0.5
##$TPOFFS= (0..7)
0 0 0 0 0 0 0 0
##$TUNHIN= 0
##$TUNHOUT= 0
##$TUNXOUT= 0
##$USERA1= <user>
##$USERA2= <user>
##$USERA3= <user>
##$USERA4= <user>
##$USERA5= <user>
##$V9= 5
##$VALIST= <valist>
##$VCLIST= <CCCCCCCCCCCCCCC>
##$VD= 0
##$VDLIST= <DDDDDDDDDDDDDDD>
##$VPLIST= <PPPPPPPPPPPPPPP>
##$VTLIST= <TTTTTTTTTTTTTTT>
##$WBST= 1024
##$WBSW= 4
##$XGAIN= (0..3)
0 0 0 0
##$XL= 0
##$YL= 0
##$YMAX_a= 639349
##$YMIN_a= -543134
##$ZGOPTNS= <>
##$ZL1= 120
##$ZL2= 120
##$ZL3= 120
##$ZL4= 120
##$ABSF1= 14.98509
##$ABSF2= -5.573092
##$ABSG= 5
##$ABSL= 3
##$ALPHA= 0
##$AQORDER= 0
##$ASSFAC= 0
##$ASSFACI= 0
##$ASSFACX= 0
##$ASSWID= 0
##$AUNMP= <proc_prof1d_extract_pilot.lims>
##$AXLEFT= 0
##$AXNAME= <>
##$AXNUC= <1H>
##$AXRIGHT= 0
##$AXTYPE= 0
##$AXUNIT= <>
##$AZFE= 0.1
##$AZFW= 0.1
##$BCFW= 0
##$BC_mod= 0
##$BYTORDP= 0
##$COROFFS= 0
##$CY= 15
##$DATMOD= 1
##$DC= 0
##$DFILT= <>
##$DTYPP= 0
##$F1P= 0
##$F2P= 0
##$FCOR= 0.5
##$FTSIZE= 32768
##$FT_mod= 6
##$GAMMA= 0
##$GB= 0
##$INTBC= 1
##$INTSCL= 1
##$ISEN= 128
##$LB= 0
##$LEV0= 0
##$LPBIN= 0
##$MAXI= 10000
##$MC2= 0
##$MEAN= 0
##$ME_mod= 0
##$MI= 0
##$NCOEF= 0
##$NC_proc= -8
##$NLEV= 6
##$NOISF1= 0
##$NOISF2= 0
##$NSP= 0
##$NTH_PI= 0
##$NZP= 0
##$OFFSET= 14.98509
##$PC= 1
##$PHC0= 95.28992
##$PHC1= 0
##$PH_mod= 1
##$PKNL= yes
##$PPARMOD= 0
##$PPDIAG= 0
##$PPIPTYP= 0
##$PPMPNUM= 2147483647
##$PPRESOL= 1
##$PSCAL= 4
##$PSIGN= 0
##$PYNMP= <proc.py>
##$REVERSE= no
##$SF= 400.02
##$SI= 32768
##$SIGF1= 0
##$SIGF2= 0
##$SINO= 400
##$SIOLD= 32768
##$SPECTYP= <>
##$SREGLST= <1H.CDCl3>
##$SSB= 0
##$STSI= 32768
##$STSR= 0
##$SW_p= 8223.68421052631
##$SYMM= 0
##$S_DEV= 0
##$TDeff= 65536
##$TDoff= 0
##$TI= <>
##$TILT= no
##$TM1= 0
##$TM2= 0
##$TOPLEV= 0
##$USERP1= <user>
##$USERP2= <user>
##$USERP3= <user>
##$USERP4= <user>
##$USERP5= <user>
##$WDW= 1
##$XDIM= 32768
##$YMAX_p= 465496419
##$YMIN_p= -804551
##$CURPLOT= <Network HP LaserJet P1505>
##$CURPRIN= <$Network HP LaserJet P1505>
##$DFORMAT= <normdp>
##$LAYOUT= <+/1D_H.xwp>
##$LFORMAT= <normlp>
##$PFORMAT= <normpl>
##$SURQMSG= 1
$$ End of Bruker specific parameters
$$ ---------------------------------
##NTUPLES= NMR SPECTRUM
##VAR_NAME=  FREQUENCY,     SPECTRUM/REAL,   SPECTRUM/IMAG
##SYMBOL=    X,             R,               I
##VAR_TYPE=  INDEPENDENT,   DEPENDENT,       DEPENDENT
##VAR_FORM=  AFFN,          ASDF,            ASDF
##VAR_DIM=   32768,         32768,           32768
##UNITS=     HZ,            ARBITRARY UNITS, ARBITRARY UNITS
##FACTOR=    0.250966925370066, 1,           1
##FIRST=     8223.43324360094, 184277,       44123
##LAST=      0,             -120420,         -115661
##MIN=       0,             -804551,         0
##MAX=       8223.43324360094, 465496419,    0
$$ Real data points
##PAGE= N=1
##DATA TABLE= (X++(R..R)), XYDATA
$$ [...]
$$ plain form
19525 25376 -48728 -176808 7564 -47628 218007 -181502 86866 -125274 26097 99642 -199043
19513 -19517 -153720 -125737 -167269 -89357 181032 -114373 -242110 238047 181499 -13417 216468
19501 -32969 1707 -135223 -32804 380342 -229151 -7022 -23957 -138909 -64569 -284952 190769
19489 -30405 210096 143229 116144 -40178 -68582 147924 123927 199393 -40760 -99073 138392
19477 -7022 -170269 -116434 -187958 18763 97276 -72176 -191143 109620 258469 -217161 135349
19465 -148049 -227770 166852 -25633 15081 -301887 130380 -338458 -177702 -77153 149306
19454 -203858 -333993 -129724 104328 244148 129444 129225 -62013 -63184 -58723 75055 267093
19443 267093 -176971 -145355 58148 -152717 -286253 -90615 -214844 -256369 -147959 10510
$$ packed form
19525B5376d8728j28080G564d7628B18007a81502H6866a25274B6097P3545a99043
19513a9517j34203K7983m1532P7912A81032a14373j27737B38047n6548a3417B16468
19501c2969A707a35223c2804C80342b29151g022j6935j14952f4569k20383A90769
19489c0405B10096o6867k7085d0178k8404A47924k3997P5466d0760n8313A38392
19477g022j63247N3835p1524A8763P8513g2176j18967A09620J48849b17161A35349
19465a48049p9721A66852b5633A5081c01887A30380c38458J60756g7153A49306
19454b03858j30135a29724A04328J39820j14704k19f2013j171M461G5055J92038
19443B67093a76971L1616E8148a52717j33536i0615j24229m1525J08410A0510
$$ plain form
19432 -41882 25591 -389939 48713 -46006 -19039 -71854 43995 -54702 48792 -232313 137398
19420 -88067 -35057 121864 -90907 -22979 -512168 -38660 -332357 -113646 -297064 70951 258176
19409 258176 -305670 -95613 -26587 166167 67434 116373 67484 -209623 144739 -332135
19398 -114464 52640 -176906 -306213 -165767 286823 280973 -315693 41743 144306 -178003
19387 7427 -162309 -140084 28863 -150344 227199 -58574 -376320 -263348 14508 -66689 -218225
19376 -218225 -309503 -118111 132772 150259 -74242 -3777 -225523 33821 -36858 -214702 415885
19364 -15214 363643 -204224 -255885 84501 -76825 -538790 120511 -9444 140375 -134611 -116862
19353 -116862 35166 38593 38230 -16393 135460 -83004 -30739 -47425 -9924 -224430 -54220 -296707
$$ packed form
19432d1882B5591c89939D8713d6006a9039n2815D3995e4702D8792b32313A37398
19420h8067c5057A21864i0907b2979m89189c8660k93697a13646j83418G0951J87225
19409B58176c05670i5613b6587A66167F7434M8939m8889b09623A44739c32135
19398a14464E2640a76906j29307J40446B86823n850c15693D1743J02563a78003
19387G427a62309K2225B8863a50344B27199e8574l17746J12972A4508f6689j51536
19376b18225r1278a18111A32772J7487g4242c777k21746C3821c6858j77844D15885
19364a5214C63643b04224n1661H4501g6825m61965A20511i444A40375a34611J7749
19353a16862C5166L427l63a6393A35460h3004c0739j6686i924k14506e4220k42487
$$ plain form
19341 -296707 -102568 -32334 185195 -333254 -172225 -118345 -64337 225881 -40296 -187575
19331 -187575 -83507 -179982 -16733 273970 43090 67454 83442 69017 -382961 190061 116148
19320 116148 91059 17187 -141937 124344 -459246 -44125 114501 -337707 -190067 -342984
19310 -342984 -296 -49520 -425242 118004 332816 34568 -184092 292244 -278677 44332 -142640
19298 -98778 176311 -288431 -197861 193301 -103953 -602233 -173924 -16157 -155877 99651
19287 -157446 -129837 -202521 -457176 25470 -15020 -142823 24242 143880 -181891 185701
19276 142639 1581 -374566 -180371 -218858 281151 -116357 128725 -151043 -299685 30479
19265 -81092 -61898 -214899 283997 -22264 262093 117387 221830 -353468 -13785 -66924
$$ packed form
19341b96707a02568c2334A85195c33254J61029N3880N4008B25881d0296j47279
19331a87575h3507r6475a6733B73970D3090K4364J5988j4425c82961A90061p3913
19320A16148k5089A7187a41937A24344d59246d4125A14501c37707J47640j52917
19310c42984b96m9224l75722A18004K14812C4568a84092B92244b78677D4332a42640
19298i8778A76311b88431R0570A93301a03953m98280a73924a6157j39720I9651
19287a57446K7609p2684k54655B5470a5020j27803B4242J19638a81891A85701
19276A42639A581c74566a80371l8487B81151a16357A28725a51043j48642C0479
19265h1092J9194j53001B83997b2264B62093A17387J04443c53468a3785n3139
$$ plain form
19255 -66924 -29192 -136632 -101793 79058 -361373 170617 -45171 41670 -106615 -207491 169215
19243 -85076 60721 -160615 -60739 235185 -192287 -133639 -7577 -148506 -112316 -70836 -254776
19232 -254776 -3139 -211300 -66870 -101003 -256507 -33084 3151 -15397 -49963 4550 113388
19221 113388 -176064 -375479 -120774 205707 -399787 93446 -373731 -72345 -191360 -183289
19211 -183289 104215 -122992 -26249 15711 -168291 -353803 -4712 125529 -232933 5873 -283302
19199 24787 1953 -406457 -111144 48170 211531 -143689 54458 57929 -112405 251781 -237348
19187 -376113 -169259 -139166 317394 356370 293278 -96558 -27659 -204721 -76715 233823 -55697
19175 -142513 -31735 -24882 -296871 187781 -301798 -195974 -152612 -110760 250409 -190429
$$ packed form
19255f6924b9192j07440L4839G9058c61373A70617d5171D1670a06615j00876A69215
19243h5076F0721a60615f0739B35185a92287N8648g577j40929L6190M1480j83940
19232b54776c139k08161f6870l4133j55504c3084C151a5397l4566D550J08838
19221A13388a76064j99415a20774B05707c99787I3446c73731g2345j19015Q071
19211a83289A04215a22992b6249A5711a68291j85512d712A25529b32933E873b83302
19199B4787A953d06457a11144D8170J63361a43689E4458L471a12405B51781b37348
19187c76113a69259L0093C17394L8976o3092i6558b7659j77062g6715B33823e5697
19175a42513c1735O853k71989A87781c01798J05824M3362M1852B50409a90429
$$ plain form
19164 223028 -260428 68191 -26301 408849 -18496 252784 220401 235055 -120000 240374
19153 60218 -198634 -386007 184647 -112110 -471725 -170703 -343414 -185744 105922 -34248
19142 214728 -153086 70143 -148093 47705 14690 10123 -271746 44755 -168798 -51863 -137042
19131 -137042 -423376 235267 -42239 2856 -185840 -234335 -3413 -105442 73174 -88809 91589
19119 56512 -128393 -21333 -493869 4355 36218 205073 -29469 -181097 -131760 -167235 -43105
19107 -192010 278435 164028 -254759 -78106 -236566 -363797 127058 161986 224648 145888
19097 145888 -289263 302972 296473 224308 281779 9875 157106 167035 39217 -296565 -109461
19085 42679 -15633 -126114 -69999 -13820 -231982 116793 -151887 105149 42165 120408 -122364
$$ packed form
19164B23028b60428F8191b6301D08849a8496B52784l2383J4654a20000B40374
19153F0218a98634j87373A84647a12110l59615a70703j72711J57670A05922c4248
19142B14728a53086G0143a48093D7705A4690m567b71746D4755a68798e1863q5179
19131a37042k86334B35267d2239B856a85840m8495c413j02029G3174h8809I1589
19119E6512a28393b1333m72536D355L1863J68855b9469j51628M9337l5475d3105
19107a92010B78435j14407b54759g8106j58460j27231A27058L4928O2662p8760
19097A45888b89263C02972o499p2165N7471I875J47231R929C9217b96565a09461
19085D2679a5633j10481N6115a3820k18162A16793a51887A05149D2165P8243a22364
$$ plain form
19073 -32322 -25349 -79939 -99985 72041 52603 -229632 367589 57132 -122762 -131040 -108532
19062 -108532 28804 -218712 -65321 -86187 139926 -190963 -378972 288952 190242 -100117
19051 -19487 -207279 -120561 -33120 -118802 180374 52531 -91385 8750 260922 162896 -150095
19039 -174863 -206846 -23876 -32347 -200926 46225 54379 -331090 -132279 139045 403 114664
19028 114664 173261 42576 377607 -66967 68997 3926 66238 16817 -41187 -264083 66810
19016 -52634 80065 -50017 283252 -70367 -289681 157807 -21602 -76204 -123109 41775 -70425
19004 -27600 75575 -379413 -147179 -44354 -92839 427811 198809 347415 -395187 306929
18993 26469 146330 -97551 -227911 80822 -209265 -211523 -141963 270466 -115886 -61382 -335671
$$ packed form
19073c2322O973n4590k0046G2041j9438b29632C67589E7132a22762q278K2508
19062a08532B8804b18712f5321k0866A39926a90963j88009B88952r8710a00117
19051a9487j87792Q6718c3120q5682A80374E2531i1385H750K52172r8026a50095
19039a74863l1983b3876q471j68579D6225Q154c31090a32279A39045D03J14261
19028A14664N8597D2576L35031f6967F8997C926O2312A6817d1187k22896F6810
19016e2634H0065e0017B83252g0367k19314A57807b1602n4602m6905D1775g0425
19004b7600G5575c79413a47179d4354m8485D27811A98809J48606c95187C06929
18993B6469J19861i7551j30360H0822b09265k258O9560B70466a15886N4504k74289
$$ plain form
18982 -335671 -351795 -129454 -213355 -1659 -274000 -45380 -222621 82549 -277545 -155275 151848
18970 3114 95876 130060 -251097 81213 202369 -274292 -58059 -4534 330342 -416082 -100810
18958 101716 92435 -82146 -193700 -147310 17476 59506 -241234 8822 -32365 189081 136828
18947 136828 -134156 -99921 -66413 32990 -330420 -389401 105752 -76181 153974 195107 187581
18936 187581 -159760 -6809 152730 39890 11385 -11300 193816 52476 11024 -116687 165778
18924 169278 -51709 348882 -138354 -119819 -8819 -141629 211377 -255241 -294381 123781
18913 -209325 -180991 -277046 -98257 -39348 -66090 197101 -350555 -141332 104377 140949 -352739
18901 95500 32626 70308 63645 323378 -341315 174636 -219319 -369980 28236 -199807 -251571
$$ packed form
18982c35671j6124a29454q3901a659k72341d5380j77241H2549b77545J22270A51848
18970C114R2762L4184b51097H1213J21156b74292e8059d534C30342d16082a00810
18958A01716r281h2146j11554M6390A7476M2030b41234H822c2365A89081n2253
18947A36828a34156L4235L3508C2990c30420n8981A05752g6181A53974M1133p526
18936A87581a59760f809A52730C9890A1385a1300A93816E2476A1024a16687A65778
18924A69278e1709C48882a38354J8535h819j32810B11377b55241l9140A23781
18913b09325K8334r6055i8257c9348k6742A97101c50555a41332A04377L6572c52739
18901I5500C2626L7682o663K59733c41315A74636b19319j50661B8236a99807n1764
$$ plain form
18890 -251571 -45230 -97843 22628 46830 320161 -216940 -25323 -76321 407829 -294289 67487
18878 -149831 20234 -286153 111011 -141782 -16018 -159338 -130625 -180464 -5445 109348 -51222
18866 -215125 -205888 -241505 -56374 -224902 -252497 -98041 -148398 85405 101145 -156468 -199853
18855 -199853 104348 -290023 -26232 -370376 -52724 190251 -61676 301462 38444 81950
18845 81950 63373 -347851 181629 15575 -288455 -113722 210563 71495 111090 82933 -84144
18833 -27324 -316092 -181924 -528337 160009 -343511 -8170 -265294 147339 -297178 196770
18822 -14664 -32889 -141387 -19030 -129903 36834 37768 39777 -54020 -155662 -303967 -138313
18810 79515 232321 68631 76083 -375160 84217 -101069 -87423 -51637 18226 -127787 41924
$$ packed form
18890b51571d5230n2613B2628K4202K73331b16940b5323n0998D07829b94289F7487
18878a49831B0234b86153A11011a41782a6018j43320K8713m9839e445A09348e1222
18866b15125R237l5617e6374j68528k7595i8041n0357H5405J5740a56468m3385
18855a99853A04348b90023b6232l44144e2724A90251f1676C01462C8444M3506
18845H1950j8577c47851A81629A5575b88455a13722B10563G1495L9595k8157h4144
18833b7324k88768J34168l46413A60009c43511h170k57124A47339b97178A96770
18822a4664j8225j08498a9030j10873C6834R34K009e4020j01642j48305a38313
18810G9515J52806F8631P452c75160H4217a01069J3646L5786A8226a27787D1924
$$ plain form
18798 -212427 -11991 -83414 71326 -97800 -106352 -69248 -220372 -102419 -319324 -113164 4676
18786 139811 -139161 51469 -185834 9559 70041 -138356 -107074 -214828 6946 -519223 17048
18774 54712 -366746 -77821 -114308 70845 -353663 -183758 -5867 246509 105086 -62567 -348193
18763 -348193 250481 -283435 -29359 -46196 -202110 127090 -170877 66066 -63895 178441
18752 12425 209733 -251898 -193536 -167961 55811 -152894 -49963 -8403 -93740 151049 121019
18741 121019 26560 79926 -314948 -131280 -324790 -219759 162810 168035 124804 -106467
18730 -98190 186033 352434 170614 -580120 -212927 126337 28832 -209793 98100 133362
18720 133362 0 137570 -73533 -192399 -84177 -205644 10482 -256781 -126701 108794 335773
$$ packed form
18798b12427a1991p1423G1326i7800q552L7104j51124a02419k16905a13164D676
18786A39811a39161E1469a85834I559O0482a38356L1282j07754F946e19223A7048
18774E4712c66746g7821l6487G0845c53663J69905e867B46509A05086f2567k85626
18763c48193B50481b83435b9359j6837j55914A27090a70877F6066f3895A78441
18752A2425J97308b51898N8362K5575E5811a52894d9963h403q5337A51049l0030
18741A21019B6560N3366c14948a31280j93510J05031A62810N225m3231a06467
18730i8190A86033J66401A70614e80120b12927A26337B8832b09793I8100L5262
18720A33362@A37570g3533j18866h4177j21467A0482b56781a26701A08794K26979
$$ plain form
18709 335773 90032 27180 91421 142114 -177277 122188 -155184 -118156 -23719 -184435 -385451
18698 -385451 1239 211209 193747 -84530 -15113 -344408 228294 110505 -60068 -293881 92053
18686 -11910 -217734 92751 -39771 -253484 58446 116986 -325781 220957 77009 238898 1503
18674 -76913 229218 135608 -186789 100560 137691 -348864 -155957 -89902 -181256 -32489 -200806
18663 -200806 -32825 42733 21571 166421 5115 48058 74866 460942 -32708 -134125 -64937
18651 82801 342385 -8232 -151743 20752 -136890 -119229 -71141 351502 23562 -239524 -261448
18640 -261448 -250896 -140203 -3965 -148772 -110109 148710 -69368 -150283 -229739 -153521 548
18628 97395 10334 -63974 -12161 134273 -372452 45241 258586 74389 -228724 -43645 -237356
$$ packed form
18709C35773I0032B7180O4241N0693a77277A22188a55184L7028b3719j60716k01016
18698c85451A239K09970j7462h4530a5113l29295B28294A10505f0068k33813I2053
18686a1910k05824I2751c9771k13713E8446N8540c25781B20957G7009J61889A503
18674g6913B29218r3610a86789A00560L7131c48864a55957O6055r1354c2489j68317
18663b00806c2825D2733k1162J44850E115M2943K6808L86076c2708j01417f4937
18651H2801K59584h232j43511B0752a36890J7661M8088C51502B3562b39524k1924
18640b61448J0552J10693c965j44807L8663A48710f9368q0915p9456P6218E48
18628I7395A0334f3974a2161A34273c72452D5241K13345G4389b28724d3645j93711
$$ plain form
18617 -237356 -48687 76061 101749 -396935 -16615 -223578 -183333 53752 125146 -136748 -343422
18606 -343422 -65558 -39006 11858 43534 -248892 126985 -319344 -267959 -155028 -272427
18596 -272427 104238 -3130 -154784 -211454 14328 -113603 -80561 -313694 -37192 172521 -77922
18584 -32155 -250656 -5014 -239427 -387166 -178216 11138 -27214 -248614 41855 273646 207171
18573 207171 -145119 -225502 -2769 150381 132905 -360868 -191053 55558 -226236 162761
18562 -116349 37938 5850 -84925 62982 229326 -11047 111910 -268119 -137507 9354 -121624
18550 -1116 110888 101912 193920 -15336 -92126 -230828 -65303 144862 -81678 -61508 -157514
18539 -157514 -304060 -157905 -37890 -278508 -204525 -179341 -28184 32626 -53447 300745 -103532
$$ packed form
18617b37356d8687G6061K5688c96935a6615k06963M0245E3752P1394a36748k06674
18606c43422f5558K6552A1858L1676b48892A26985c19344N1385J12931j17399
18596b72427A04238c130j51654n6670A4328a13603L3042k33133c7192A72521g7922
18584c2155k18501e014k34413j47739a78216A1138b7214k21400D1855K31791o6475
18573B07171a45119q0383b769A50381j7476c60868J69815E5558b26236A62761
18562a16349C7938E850h4925F2982J66344a1047A11910b68119J30612I354a21624
18550a116A10888q976R2008a5336p6790j38702f5303A44862h1678K0170r6006
18539a57514j46546J46155c7890k40618P3983K5184b8184C2626e3447C00745a03532
$$ plain form
18527 -26372 -133499 -105349 -290778 187032 -171980 -44031 -24609 -234731 -72134 -66332 -115597
18516 -115597 -16390 144544 -114098 -469267 -172242 244197 104895 -69253 -208388 284079
18505 474192 -135971 -2729 -167094 61058 -310771 66635 106314 -330386 -117506 1570 -365911
18493 33389 -137210 -187630 74964 -10777 54330 334144 225540 -198952 66037 -269413 147811
18481 -7143 -241156 -390131 -75200 -63755 -259017 -2672 140618 -25893 289612 -62481 301701
18469 -210203 183767 59730 -36452 -163835 -156418 -395513 140707 15528 -241006 -409856
18459 -409856 -247797 -236766 -345425 -24745 -10109 -107858 -31237 -243160 125360 -165874
18448 73850 -37759 35363 56733 109401 89656 -33020 -206231 162454 -241009 30524 -38991
$$ packed form
18527b6372j07127K8150j85429A87032a71980d4031J9422k10122g2134N802m9265
18516a15597a6390A44544a14098l55169a72242B44197A04895f9253j39135B84079
18505D74192a35971b729j64365F1058c10771F6635L9679c30386a17506A570c65911
18493C3389a37210n0420G4964a0777E4330K79814j08604a98952F6037b69413A47811
18481g143k34013j48975g5200J1445j95262b672A40618b5893B89612f2481C01701
18469b10203A83767E9730c6452j27383P417k39095A40707A5528b41006j68850
18459d09856J62059J1031j08659b4745a0109r7749c1237k11923A25360a65874
18448G3850c7759C5363K1370N2668j9745c3020j73211A62454b41009C0524c8991
$$ plain form
18436 89923 -243742 -168178 165481 -223653 -541694 -90862 -42694 -200984 -95962 -120359 206512
18424 -179603 -343149 -310236 -94341 -222163 158612 -93472 -113752 -157041 -97614 -1682 222423
18412 210769 105181 279311 -180315 -28834 -179358 108451 -22051 94651 -202798 -374699
18402 -374699 -57787 -88575 75760 216060 257358 -8382 -155785 38233 298277 9710 295554
18391 295554 124256 150139 143898 -341415 -374551 -47023 198920 -283551 -95359 62989 -458388
18379 -213861 146338 43666 3814 -141191 121258 -125348 -95518 -236065 -173585 87888 95697
18368 95697 -106871 -242414 -25351 16106 -181375 35397 22989 329231 131904 174024 -174525
18356 201972 121961 -103562 -21067 -29966 -139076 -205509 -246871 -253428 -163519 -97445 -339558
$$ packed form
18436H9923b43742P5564A65481b23653l18041i0862d2694j58290i5962k4397B06512
18424a79603j63546L2913i4341j27822A58612i3472k0280m3289N9427a682B22423
18412B10769A05181J74130a80315b8834j50524A08451b2051I4651b02798j71901
18402c74699e7787l0788G5760J40300M1298h382j47403C8233K60044I710K85844
18391B95554A24256K5883o241c41415l3136d7023A98920b83551i5359F2989d58388
18379b13861A46338D3666C814a41191A21258a25348K9830j40547O2480H7888P809
18368I5697a06871j35543b5351A6106a81375C5397j2408L06242A31904M2120a74525
18356B01972q0011a03562b1067q899j09110o6433m1362o557Q9909O6074k42113
$$ plain form
18345 -339558 92721 74190 86158 197201 -162549 -168285 -48844 191406 169718 -201976 -306169
18334 -306169 -130743 -154371 -62799 -101570 91423 -197915 -178166 13074 132728 273643 180022
18323 180022 -38529 -283553 46731 -65056 166519 -89644 205123 -203232 81808 134817 -530676
18311 217330 -149643 11685 19657 -133014 -47646 51277 132866 -118124 -297062 54169 18152
18299 -99802 -195673 251233 -58371 -120065 7469 332543 22730 -305154 147855 98779 123433
18288 123433 150297 206521 169699 75228 143734 -316163 -111239 69588 -33926 107845 -14305
18276 -167642 30254 45183 25614 -218694 15190 -6082 -183204 -328290 -257676 -100195 -277162
18265 -277162 173139 -28779 92842 -374637 401277 120303 -3431 72348 34490 -160887 -98472
$$ packed form
18345c39558I2721j8531J1968J11043a62549n736d8844A91406k1688b01976j04193
18334c06169a30743k3628f2799l8771I1423a97915J9749A3074J19654J40915r3621
18323A80022c8529k45024D6731f5056A66519h9644B05123b03232H1808N3009e30676
18311B17330a49643A1685P972a33014d7646E1277Q1589a18124j78938E4169A8152
18299i9802r5871B51233e8371o1694G469L25074B2730c05154A47855m9076K4654
18288A23433K6864N6224l6822G5228O8506c16163a11239F9588c3926A07845a4305
18276a67642C0254J4929j9569b18694A5190f082j77122j45086P0614a00195j76967
18265b77162A73139b8779I2842c74637D01277A20303c431G2348C4490a60887O2415
$$ plain form
18254 -98472 -41678 -8599 -9413 -80938 -174895 -34131 -225957 93356 -36238 -132021 -91966 -199840
18242 -199840 -107769 84334 209951 274273 -224676 -31244 -181863 220182 -55199 -423605
18232 -423605 -128122 -131539 -152933 12763 -99572 79554 -223941 -270788 19014 -283436 273078
18220 110360 -231145 209949 31475 66194 90885 -14346 231614 -335985 121901 -48093
18209 -104987 112353 18118 12886 -193502 -55578 -73121 -9132 -164922 -227139 -110663 282061
18197 4162 -245804 -19253 -263304 -93647 75046 -27662 -18201 139609 83899 216643 -6332
18185 9365 -117214 -148886 12190 -3128 221078 27422 27267 -210455 350894 -289738 248662
18173 -409911 233475 12917 86003 -133484 -80929 -212925 24266 -60925 -126060 -70911 214304
$$ packed form
18254i8472d1678h599q14p1525r3957c4131j91826I3356c6238r5783M0055j07874
18242a99840R2071H4334J25617O4322b24676c1244j50619B20182e5199l68406
18232d23605a28122l417k1394A2763i9572G9554b23941m6847A9014b83436B73078
18220A10360b31145B09949C1475L4719K4691a4346B31614c35985A21901d8093
18209a04987A12353A8118n232a93502e5578j7543i132j55790o2217a10663B82061
18197D162b45804a9253k44051i3647G5046b7662R461A39609n5710J32744f332
18185I365a17214l1672A2190c128B21078B7422j55b10455C50894b89738B48662
18173d09911B33475A2917P3086a33484N2555j31996B4266f0925o5135N5149B14304
$$ plain form
18161 -103161 -138721 -78906 14368 -51404 -211713 -19396 -174255 244024 76227 142600 98784
18150 98784 -52774 -293471 57776 -49845 14874 3616 1604 -59751 -6637 63580 317162 -105518
18137 -222456 202094 344532 12704 -12736 40354 69848 195057 -73302 20312 -137807 -227315
18126 -227315 25900 -213783 69389 -162662 -59721 7147 149251 116383 -50517 -212254 30075
18114 -99003 -62864 -3095 -195872 -157122 56289 273973 359903 -43358 19006 183629 -160038
18102 -119315 -304722 -231274 9266 -197584 -83581 3539 70576 292255 118516 85380 -177885
18090 96925 -5462 280826 196102 128924 -264163 -80162 -2632 -171307 192380 35141 -27047
18078 -86726 55931 -282439 -206081 26321 35158 -170054 94753 -134882 284036 -211791 -90717
$$ packed form
18161a03161l5560N9815A4368e1404j60309a9396j54859B44024G6227O6373m3816
18150I8784e2774k40697E7776d9845A4874C616A604e9751f637F3580K53582a05518
18137b22456B02094J42438A2704a2736D0354K9494J25209g3302B0312a37807q9508
18126b27315B5900b13783F9389a62662e9721G147J42104l2868e0517j61737C0075
18114i9003L6139c095j92777L8750E6289K17684Q5930d3358A9006J64623a60038
18102a19315j85407P3448I266a97584h3581C539O7037K21679A18516l3136a77885
18090I6925e462B80826q4724o7178b64163h0162b632j68675A92380C5141b7047
18078h6726E5931b82439P6358B6321Q837a70054I4753a34882B84036b11791i0717
$$ plain form
18066 -213765 -387493 42607 -91916 -124883 -138017 -283161 -28468 -236667 142821 90912 -437560
18054 409910 -183293 130782 -26449 30059 -190827 77911 -18969 -67359 -13740 -203908 -16201
18042 -34945 37096 -104698 -258683 -200575 -59171 75369 -229288 -351062 229327 -17824 233118
18030 84538 88844 151499 -59453 -22540 -171492 104910 -124199 60173 170478 -155537 -139339
18019 -139339 -69280 184396 45841 -71363 -108291 5482 -10104 -186333 129965 123270 149587
18008 149587 11273 -214956 144361 -176117 198058 -150786 -353344 -148179 15037 -50832
17997 -215550 -82012 90170 -531 197832 -318561 69537 -168547 -32251 5118 105756 -112921
17985 110849 -20644 66522 -251633 201512 -160044 -71005 130104 124460 43734 -1811 -178290
$$ packed form
18066b13765j73728D2607i1916l2967j3134j45144b8468k08199A42821n1909d37560
18054D09910a83293A30782b6449C0059a90827G7911a8969m8390a3740j90168a6201
18042c4945C7096a04698j53985N8108e9171G5369b29288j21774B29327a7824B33118
18030H4538M306O2655e9453b2540j48952A04910a24199F0173J10305a55537J6198
18019a39339f9280A84396D5841g1363l6928E482a0104j76229A29965o695K6317
18008A49587A1273b14956A44361a76117A98058a50786k02558a48179A5037e0832
17997b15550h2012I0170e31A97832c18561F9537a68547c2251E118J00638a12921
17985A10849b0644F6522b51633B01512a60044g1005A30104n644D3734a811j76479
$$ plain form
17974 -178290 -345107 337999 -317339 -40560 112914 136533 -61970 -166802 -70857 -229282
17964 -229282 -129238 204173 253636 132893 443543 220089 -245684 -63592 -23296 258896
17953 -109328 -108085 -298560 -263053 92164 -65238 22719 -70659 -54752 -358846 374741 236315
17942 236315 235834 -139816 264148 47971 -24138 86223 99295 80240 180715 -126728 3849
17930 -126465 -126840 -199792 96300 -251630 61944 -81737 29656 -55081 -31721 -67359 -275517
17919 -275517 26823 113962 29499 -73568 -56353 78982 -25153 -54344 197984 -123682 -115393
17908 -115393 366287 -90610 -279973 -4323 317197 76456 71810 231583 227093 -213017 107424
17896 -127208 -197022 81282 52261 23390 -25096 332975 -197567 19428 92210 -217001 106643
$$ packed form
17974a78290j66817C37999c17339d0560A12914K3619f1970j04832g0857j58425
17964b29282J00044B04173M9463j20743L10650B20089b45684f3592b3296B58896
17953a09328J243j90475L5507I2164f5238B2719g0659J5907l04094C74741j38426
17942B36315m81a39816B64148D7971b4138H6223J3072j9055J00475a26728C849
17930a26465l75p2952I6300b51630F1944h1737B9656e5081K3360l5638k08158
17919b75517B6823Q7139B9499g3568J7215G8982b5153k9191A97984a23682Q289
17908a15393C66287i0610j89363d323C17197G6456m646J59773m490b13017A07424
17896a27208o9814H1282k9021B3390b5096C32975a97567A9428P2782b17001A06643
$$ plain form
17884 286388 299169 -347108 -272388 322340 -171362 -11339 13060 65302 164696 -150557 168338
17872 -168858 45377 -9821 -133473 79108 -45763 -48436 244631 183326 161324 303445 167527
17861 167527 -196554 -177764 -324332 -69510 40029 -131379 -338567 181230 126675 -60300
17850 211030 -78799 -122754 245840 -197841 31367 -311052 -30952 275187 -143119 -229312
17840 -229312 171382 95293 -401022 134932 -6286 278800 -1078 68900 -7370 160337 174386
17829 174386 216664 -127315 91966 84634 -78215 125177 47223 -77576 152434 -59660 -17870
17817 194942 35781 -81757 -107895 -13501 -38882 256148 -119616 -116189 -237029 -29746 61803
17805 -96782 116800 -505819 -233042 453501 -131510 162460 214169 -22831 173277 253369
$$ packed form
17884B86388J2781c47108P4720C22340a71362a1339A3060N2242R9394a50557A68338
17872a68858D5377i821j23652G9108d5763k673B44631o1305k2002J42121j35918
17861A67527a96554J8790j46568f9510D0029a31379k07188A81230n4555f0300
17850B11030g8799m3955B45840a97841C1367c11052c0952B75187a43119q6193
17840b29312A71382p6089d01022A34932f286B78800a078F8900g370A60337J4049
17829A74386M2278a27315I1966p332g8215A25177D7223g7576A52434e9660a7870
17817A94942C5781h1757k6138a3501k5381B56148a19616L427j20840b9746F1803
17805i6782A16800e05819b33042D53501a31510A62460N1709b2831A73277Q0092
$$ plain form
17795 253369 -47173 -313364 -185969 -147907 49369 -109080 -252946 -23891 94443 -43899 -330828
17784 -330828 -69032 -1041 -35266 -24909 -149718 230745 -209474 76480 -104145 -113244 32916
17772 99050 46874 50895 -52201 91787 89448 -444694 138001 192720 -78051 200371 -9487 -160590
17760 -160590 -119938 -30701 107472 129246 163912 132198 -342399 107879 -77450 185499 -17518
17748 257257 -61701 -1414 -92788 71000 167393 -14684 -3536 32604 -109911 -291829 -21264
17736 -150443 -101026 -37303 55143 -199444 183880 -53065 -120281 260461 -351223 218985
17725 -378549 -76988 126649 158306 284261 -233770 -39045 175489 -67995 116556 -175148
17714 66335 -83689 -343941 -144828 -19349 -233970 96563 -61946 289596 114823 -1184 -97450
$$ packed form
17795B53369d7173k66191J27395L8062D9369a09080j43866b3891I4443d3899k86929
17784c30828f9032a041l4225J0357j24809B30745b09474G6480a04145r099C2916
17772I9050D6874M021e2201I1787k339d44694A38001N4719g8051B00371i487j51103
17760a60590M0652c0701A07472K1774L4666l1714c42399A07879g7450A85499a7518
17748B57257f1701a414r1374G1000R6393a4684c536C2604a09911j81918b1264
17736a50443M9417c7303E5143a99444A83880e3065o7216B60461c51223B18985
17725c78549g6988A26649L1657J25955b33770c9045A75489f7995A16556a75148
17714F6335h3689k60252a44828a9349k14621I6563f1946B89596A14823a184r6266
$$ plain form
17703 -97450 92114 -143325 -158511 -18624 -158647 -104280 126152 -218858 104950 -173648
17692 151927 116667 239894 -169238 54089 194519 106527 -132100 45473 -8337 -392133 -16212
17680 37466 -186192 -105373 293614 -19984 -104364 92811 151325 50565 -236241 73891 57942
17669 57942 -90496 -59247 46085 147159 -34480 114071 48584 -315888 37327 18516 10796
17658 10796 78419 252119 -110492 -13375 244773 157414 68030 216283 224255 232439 -196517
17646 164485 367076 21129 -59313 190415 128906 -329137 93642 28644 280352 -146913
17635 59967 141903 289834 70569 258041 162143 67107 -11720 29059 -463363 -113991 -55685
17623 50994 -128084 84203 -1218 -148033 69890 -323305 -66748 20575 61957 207430 72683
$$ packed form
17703i7450I2114a43325j5186a8624j40023N4367A26152b18858A04950a73648
17692A51927l5260J23227a69238E4089J40430q7992a32100D5473h337l83796a6212
17680C7466a86192Q0819B93614a9984q4380I2811N8514E0565b36241G3891j5949
17669E7942i0496L1249D6085J01074c4480A14071D8584c15888C7327A8516p720
17658A0796O7623J73700a10492a3375B44773q7359F8030J48253P972Q184a96517
17646A64485K02591B1129e9313A90415o1509c29137I3642B8644K51708a46913
17635E9967Q1936J47931G0569J87472r5898F7107a1720B9059d63363a13991e5685
17623E0994a28084H4203a218j46815F9890c23305f6748B0575M1382J45473G2683
$$ plain form
17611 151599 443471 -195291 -320399 187822 326488 -179706 136006 143796 176006 158442
17601 158442 -207355 275303 545691 229204 213814 -13409 7897 -52765 -127171 -66683 -149138
17590 -149138 143734 164603 87847 -303028 122013 -143092 -233107 12197 -151612 -268909
17580 -268909 -269986 199164 -65363 -279817 139500 -41288 -106535 247027 319116 330223 80258
17568 -221943 107612 144969 105343 9285 -25513 59932 98644 210221 -13651 -96727 -58384
17557 -58384 -159051 -121356 101359 395920 -105985 268508 170121 -122580 308951 15408
17546 217182 -172619 329024 95530 80627 119395 347873 73064 149942 50002 191408 -279565
17534 152960 91663 37863 2882 297277 203514 210384 76654 51173 139887 25683 257536
$$ packed form
17611A51599K91872a95291j25108A87822J38666a79706A36006P790L2210j7564
17601A58442b07355B75303K70388B29204j5390a3409G897e2765p4406O0488q2455
17590a49138A43734K0869p6756c03028A22013a43092r0015A2197a51612j17297
17580b68909j077A99164f5363k14454A39500d1288o5247B47027P2089J1107H0258
17568b21943A07612L7357l9626I285b5513E9932L8712J11577a3651q3076L8343
17557e8384j00667L7695A01359K94561a05985B68508r8387a22580C08951A5408
17546B17182a72619C29024I5530j4903L8768K28478G3064P6878E0002J41406b79565
17534A52960o1297C7863B882K94395r3763O870G6654k5481Q8714B5683K31853
$$ plain form
17523 257536 170848 356760 195960 148079 -183398 3347 227566 -65981 -95222 127679 -141750
17511 201725 137878 -64509 315337 -66458 271962 105047 -130089 94854 232084 192669
17501 192669 40789 45531 111799 56850 145735 458365 -121432 -3240 147054 154538 390031
17490 390031 21415 -109309 -36094 155628 71495 304127 306619 -156468 117608 334717
17480 334717 173025 -84676 -100056 205466 -55435 -74223 120078 -64735 334606 122763
17469 155546 -143486 190610 -47524 109106 84436 51885 86382 136636 367436 427900 258988
17458 258988 125072 -2555 309585 -64226 259996 -198932 26809 114704 392337 524830
17448 524830 396221 115442 700088 259567 310054 170314 220279 299024 174884 -20346
$$ packed form
17523B57536q6688J85912j60800m7881a83398C347K24219f5981k9241A27679a41750
17511B01725o3847f4509C15337f6458B71962A05047a30089I4854J37230l9415
17501A92669D0789M742O6268n4949Q8885L12630a21432c240A47054P484K35493
17490C90031B1415a09309c6094A55628G1495K32632K492a56468A17608K17109
17480C34717j61692h4676j5380B05466e5435j8788A20078f4735C34606A22763
17469A55546a43486A90610d7524A09106k4670l2551L4497N0254K30800O0464j68912
17458B58988A25072b555C09585f4226B59996a98932B6809Q7895K77633J32493
17448E24830j28609A15442N84646B59567N0487j39740M9965P8745j24140b0346
$$ plain form
17437 89671 369214 187955 448884 78409 36902 -22655 15072 340815 163743 143506 74720
17426 74720 123786 289937 450003 94955 164581 37463 401364 392602 434368 135298 317941
17415 317941 116616 327001 190976 362950 51544 -71755 291698 -197320 161163 -10994
17404 52153 272822 318456 506240 47222 311865 -83464 199776 178160 275068 29941 181220
17393 181220 -53889 194693 307457 88079 -8795 310274 90230 87564 182485 259268 406793
17382 406793 367494 275179 253223 331628 134297 -89466 -80481 -63459 130905 234971 80864
17370 101732 271998 339478 57347 136345 97550 -363178 198199 -155881 -19057 289512
17359 74346 -172324 199328 310221 760180 239333 253928 121986 140374 75115 7661 55339
$$ packed form
17437H9671K79543j81259K60929G8409C6902b2655A5072L25743A63743k0237o8786
17426G4720M9066J66151J60066I4955O9626C7463L63901q762M1766A35298J82643
17415C17941A16616K10385j36025J71974E1544g1755B91698a97320A61163a0994
17404E2153K20669M5634J87784D7222K64643h3464A99776k1616R6908B9941J51279
17393A81220e3889A94693J12764H8079h795C10274I0230k666R4921P6783J47525
17382D06793l9299r2315k1956P8405A34297h9466Q985J7022A30905J04066H0864
17370A01732J70266O7480E7347P8998l8795c63178A98199a55881a9057B89512
17359G4346a72324A99328J10893M49959B39333J4595A21986J8388o5259G661M7678
$$ plain form
17348 55339 5151 76373 286350 135465 -82837 275193 37977 42735 103789 -72521 68575
17336 -81390 139165 199398 203674 -81694 142780 -33827 -67074 -2723 346204 14065 -47142
17324 -12798 20202 -23922 -6735 -62586 -33880 70734 380771 137351 318197 285048 67261
17312 182676 317722 207592 -8924 301741 320688 -166313 128470 41511 92980 -58966 226727
17300 250664 135598 126672 -62709 188972 -66559 -148098 99640 219335 -89642 134464 114095
17289 114095 27412 152531 -25519 389250 94462 -31523 260304 22208 -73971 -22790 187223
17277 -31009 198586 -60985 223159 205991 283478 179418 87929 416834 312192 204483
17267 204483 304319 332656 162431 385583 170535 -11694 57850 99309 28416 229089 425836
$$ packed form
17348E5339E151P1222K09977A35465h2837B75193C7977M758O1054g2521F8575
17336h1390A39165O0233M276h1694A42780c3827l3247b723C46204A4065d7142
17324a2798B0202b3922f735n5851K8706G0734L10037A37351J80846l3149F7261
17312A82676J35046j10130h924C01741J8947a66313A28470D1511N1469e8966B26727
17300B50664j15066q926f2709A88972f6559q1539I9640J19695h9642A34464k0369
17289A14095B7412J25119b5519C89250I4462c1523B60304B2208g3971b2790A87223
17277c1009A98586f0985B23159j7168P7487j04060H7929L28905j04642j07709
17267B04483R9836K8337A62431K23152A70535a1694E7850M1459B8416K00673J96747
$$ plain form
17256 425836 209210 303831 223744 213955 105141 153945 402380 305013 136822 263565 171220
17245 171220 135205 129745 513844 113154 123330 377748 87302 243978 467797 102191
17234 169537 6681 324444 -3939 162977 216648 41322 66678 211399 321266 217054 136569
17223 136569 79641 473855 95164 120747 302002 85001 424833 133518 215591 419027
17213 419027 345008 196857 180295 428570 258253 344351 29613 279875 328978 119618
17202 104234 -28467 -10795 239917 140565 233498 85016 70184 -113720 281344 313354 280765
17191 280765 238480 418679 243172 442300 68579 33246 169163 -72447 120153 269121
17181 269121 475540 340761 164091 396444 225526 183053 485854 331902 346967 383645
$$ packed form
17256D25836B09210R4621q0087r789A05141M8804K48435r7367A36822J26743r2345
17245A71220l6015n460L84099A13154J0176K54418H7302J56676K23819A02191
17234A69537F681L17763c939A62977N3671D1322K5356J44721J09867j04212q0485
17223A36569n6928L94214I5164K5583J81255H5001L39832A33518Q2073K03436
17213D19027p4019j48151j6562K48275j70317Q6098B9613K50262M9103A19618
17202A04234b8467a0795B39917r9352R2933H5016j4832a13720B81344L2010l2589
17191B80765m2285J80199j75507J99128F8579C3246J35917g2447A20153J48968
17181B69121K06419j34779A64091K32353j70918m2473L02801j53952J5065L6678
$$ plain form
17171 383645 310688 446161 146194 274247 337577 295333 72341 513328 296072 642509
17161 642509 36265 342212 89775 651370 488943 59533 262203 325953 329234 446304 376559
17150 376559 189313 197654 336955 465053 254924 320993 92999 324475 240001 273459 479069
17139 479069 74358 141080 151844 285207 325391 307285 689682 -65186 71861 400465 332473
17128 332473 320634 413674 413283 326840 236705 542715 314225 159823 570987 228909 181079
17117 181079 420595 389591 202584 528582 530876 266683 145500 340149 107639 502483
17107 502483 499216 213377 178925 492071 141847 547567 382087 554604 253468 499913
17097 499913 606717 355863 541933 84671 61535 375590 836286 655236 743858 604588
$$ packed form
17171C83645p2957J35473A46194J28053O3330m2244G2341M40987k17256L46437
17161F42509C6265L05947H9775N61595j62427E9533K02670O3750L281J17070o9745
17150C76559j87246Q341J39301J28098k10129O6069I2999K31476q4474L3458K05610
17139D79069G4358O6722J0764J33363M0184j8106L82397f5186G1861L28604o7992
17128C32473j1839R3040l91q6443r0135L06010k28490j54402M11164B28909m7830
17117A81079K39516l1004j87007L25998K294k64193j21183J94649A07639L94844
17107E02483l267B13377l4452L13146A41847M05720j65480J72517B53468K46445
17097D99913J06804k50854J86070H4671k3136L14055M60696j81050Q8622j39270
$$ plain form
17087 604588 565235 246135 653800 416642 781976 452967 565606 279050 542271 445714
17077 445714 119649 367381 731918 294377 349295 483111 261866 325578 587856 210709
17066 532991 416800 315621 509454 490952 466303 446014 312722 705740 525269 233025
17055 336794 727834 467300 418297 469706 808496 300738 421315 397619 488090 778892
17045 778892 453639 469099 356894 553813 568558 565450 71436 423337 700716 624010 542374
17034 542374 460324 421972 415415 505111 780112 615635 436858 250727 765760 698279 811316
17023 811316 568131 526847 453154 857361 610087 813371 374113 1026103 839662 619933
17013 619933 704528 688459 342028 780944 987365 728156 492558 614385 1090340 465353
$$ packed form
17087F04588l9353B46135M07665k37158L65334l29009J12639B79050K63221r6557
17077D45714A19649K47732L64537B94377N4918J33816k21245O3712K62278B10709
17066E32991j16191j01179J93833j8502k4649k0289j33292L93018j80471B33025
17055C36794L91040k60534m9003N1409L38790C00738J20577k3696R0471K90802
17045G78892l25253J5460j12205J96919J4745l108G1436L51901K77379p6706q1636
17034E42374q2050l8352o557Q9696K75001j64477j78777j86131N15033o7481J13037
17023H11316k43185m1284p3693M04207k47274K03284C74113O51990j86441k19729
17013F19933Q4595j6069C42028M38916K06421k59209k35598J21827M75955D65353
$$ plain form
17002 690782 677286 658258 710793 600886 919426 736261 938587 821679 923442 711683
16992 711683 1105536 704388 534730 787536 848895 543212 1033017 951265 925068 882904
16982 882904 789349 1013147 916447 926631 779757 961563 1065045 609188 739726 797380
16972 797380 676985 1020502 729629 850202 810664 956872 1073463 1095787 991325 1156278
16962 1156278 1192186 1089038 964103 862378 563165 1247795 1127895 1089234 920345 1018502
16952 1018502 1030009 1062663 1141781 1173688 926103 1214605 1374262 1003885 704896 1157736
16942 1157736 1306438 1221248 1311275 1078734 1160552 1209815 934318 1385941 1563374 1195431
16932 1195431 1271480 1271515 1110643 1460629 1486371 1515425 1479975 1347591 1310985 1362675 1231527
$$ packed form
17002F90782j3496j9028N2535j09907L18540j83165K02326j16908J01763k11759
16992G11683L93853m01148j69658K52806O1359l05683M89805q1752k6197m2164
16982H82904r3555K23798r6700J0184j46874J81806J03482m55857J30538N7654
16972G97380j20395L43517k90873J20573l9538J46208J16591K2324j04462J64953
16962A156278L5908j03148j24935j01725k99213O84630j19900l8661j68889R8157
16952A018502J1507L2654P9118L1907k47585K88502J59657l70377k98989M52840
16942A157736J48702q5190R0027k32541Q1818M9263k75497M51623J77433l67943
16932A195431P6049L5j60872L49986K5742K9054l5450j32384l6606N1690j31148
$$ plain form
16921 1231527 1446950 1434056 1562921 1309728 1458533 1676657 1370863 1193719 1648462 1622078
16911 1622078 1432142 1439859 1557333 1296210 1639190 1742651 1354766 1464008 1337491 1574857
16901 1574857 1754022 1656705 1694665 1725411 1417027 1817294 1781865 1640768 1931319 1804146
16891 1804146 1657273 2009356 1677891 1802603 2164045 2082955 2000263 2163861 2168732 2012376
16881 2012376 2286050 1836430 2357013 2353367 2456517 2123134 2379462 2149731 2332170 2293541
16871 2293541 2635267 2375440 2664535 2464232 2649852 2371426 2474775 2633825 2435142
16862 2435142 2595349 2750107 2980456 3161761 2660280 2992948 2715468 3271716 3158255
16853 3158255 3182029 3165606 3127487 3270651 3181785 3205070 3183737 3253098 3436397 3534490 3706150
$$ packed form
16921A231527K15423j2894J28865k53193J48805K18124l05794j77144M54743k6384
16911A622078j89936P717J17474k61123L42980J03461l87885J09242j26517K37366
16901A574857J79165r7317L7960L0746l08384M00267l5429j41097K90551j27173
16891A804146j46873L52083l31465J24712L61442q1090q2692J63598M871j56356
16881B012376K73674m49620N20583l646J03150l33383K56328k29731J82439l8629
16871B293541L41726k59827K89095k00303J85620k78426J03349J59050j98683
16862B435142J60207J54758K30349J81305n01481L32668k77480N56248j13461
16853C158255K3774j6423l8119J43164q8866K3285k1333O9361J83299R8093J71660
$$ plain form
16842 3706150 3349257 3607888 3699936 3842487 3747079 3949296 3750775 3688569 3860203 4138895
16832 4138895 4329629 4288667 4535060 4246766 4032361 4593069 4739801 4546961 4970908 4644931
16822 4644931 4841758 5045906 5065013 5508445 5331198 5564195 5378521 5885003 5832773 5722421
16812 5722421 6033510 5974339 6126522 6335983 6591119 6629130 6872376 6990807 7189877 6833942
16802 6833942 7494859 7234185 7820662 7951385 7869761 8323767 8292310 8618137 8867185 9157039
16792 9157039 9163742 9223886 9858020 9981648 10293256 10370280 10979736 11367342 11453044 11921106
16782 11921106 11932451 12302072 12591048 13244896 13434271 14175630 14636091 15017522 15469253
16773 15469253 15737158 16276066 16756113 17361333 18216955 18680523 18929496 20172880 20955661
$$ packed form
16842C706150l56893K58631R2048J42551r5408K02217j98521o2206J71634K78692
16832D138895J90734m0962K46393k88294k14405N60708J46732j92840M23947l25977
16822D644931J96827K04148J9107M43432j77247K32997j85674N06482n2230j10352
16812E722421L11089n9171J52183K09461K55136L8011K43246J18431J99070l55935
16802F833942O60917k60674N86477J30723q1624M54006l1457L25827K49048K89854
16792I157039O703O0144O34134J23628L11608P7024O09456L87606Q5702M68062
16782A1921106J1345L69621K88976O53848J89375P41359M60461L81431M51731
16773A5469253K67905N38908M80047O05220Q55622M63568K48973J243384P82781
$$ plain form
16764 20955661 21518725 22326984 23094489 23904339 25155977 25998275 27064349 28209731 29196789
16755 29196789 30255832 31861138 33374656 34646376 36166081 38150338 40261507 41903358
16747 41903358 44217541 46289207 48928898 51364924 54161325 57242137 59997000 63800491
16739 63800491 67155436 71232976 75417172 80310020 85148787 90508166 95593206 101869217
16731 101869217 107957721 114714612 121557367 128775190 136209100 143455691 151392508 158800564
16723 158800564 166354514 173001657 179539552 185184241 189163253 192896649 194800020 195709431
16715 195709431 195212307 193276834 190293621 186066489 181063407 174455234 167952579 160618600
16707 160618600 153509106 145562747 137843685 130205385 122619242 115493526 109141535 102521625
$$ packed form
16764B0955661N63064Q08259P67505Q09850J251638Q42298J066074J145382R87058
16755B9196789J059043J605306J513518J271720J519705J984257K111169J641851
16747D1903358K314183K071666K639691K436026K796401L080812K754863L803491
16739F3800491L354945M077540M184196M892848M838767N359379N085040O276011
16731A01869217O088504O756891O842755P217823P433910P246591P936817P408056
16723A58800564P553950O647143O537895N644689L979012L733396J903371R09411
16715A95709431m97124j935473k983213m227132n003082o608173o502655p333979
16707A60618600p109494p946359p719062p638300p586143p125716o351991o619910
$$ plain form
16699 102521625 96652756 90629195 85321926 80452102 75258113 70997808 67080891 62975519
16691 62975519 59531809 56016489 53211791 50447939 47543783 45055513 42826524 40632859
16683 40632859 38745560 36818686 35085513 33397154 31796939 30426587 28986185 27527135
16675 27527135 26641882 25553098 24300390 23400029 22348316 21598487 20726060 20154596 19282231
16666 19282231 18463878 17734569 17036549 16669744 15862454 15467670 14789368 14418151 13878100
16657 13878100 13516638 13157223 12644554 12637088 11802631 11503089 10887494 10922632 10587585 10014722
16647 10014722 9999977 9625407 9553412 9266789 8794378 8862516 8162813 8423350 8207461 7502571
16637 7502571 7123296 7523203 7242695 7137332 6904760 6789223 6595706 6115987 6186735 6162538
$$ packed form
16699A02521625n868869o023561n307269m869824n193989m260305l916917m105372
16691F2975519l443710l515320k804698k763852k904156k488270k228989k193665
16683D0632859j887299j926874j733173j688359j600215j370352j440402j459050
16675B7527135q85253j088784j252708r00361j051713p49829q72427n71464q72365
16666A9282231q18353p29309o98020l66805q07290l94784o78302l71217n40051
16657A3878100l61462l59415n12669p466q34457k99542o15595L5138l35047n72863
16647A0014722j4745l74570p1995k86623m72411O8138o99703K60537k15889p04890
16637G502571l79275L99907k80508j05363k32572j15537j93517m79719P0748k4197
$$ plain form
16627 6162538 5739569 5518057 5633501 5537844 5347625 5364839 5113088 5228961 4609097 4778051
16617 4778051 5094586 4597782 4685022 4203362 4464617 4302580 4366410 4226908 4171166 3710379
16607 3710379 4133645 3846664 3624891 3557567 3839728 3694212 3490237 3441572 3404539 3451515
16597 3451515 3084365 3184490 2834077 3288376 3228187 3101654 2915136 2682845 2773603 2624516
16587 2624516 2814047 3048345 2509203 2412794 2373829 1952273 2446882 2435577 1996909 2364372
16577 2364372 2132960 2404010 2325182 2384551 2163982 1987397 1960345 2000404 1829150 2103415
16567 2103415 2104700 2100462 1837260 1737273 2044462 1674446 1747274 1872285 1936801 1779552 1538759
16556 1538759 1662573 1692356 1797831 1539266 1591539 1751926 1450708 1721430 1612999 1491086
$$ packed form
16627F162538m22969k21512J15444r5657j90219J7214k51751J15873o19864J68954
16617D778051L16535m96804Q7240m81660K61255j62037O3830j39502n5742m60787
16607C710379M23266k86981k21773o7324K82161j45516k03975m8665l7033M6976
16597C451515l67150J00125l50413M54299o0189j26533j86518k32291R0758j49087
16587B624516J89531K34298n39142r6409l8965m21556M94609j1305m38668L67463
16577B364372k31412K71050p8828N9369k20569j76585k7052M0059j71254K74265
16567B103415J285m238k63202r9987L07189l70016P2828J25011O4516j57249k40793
16556A538759J23814K9783J05475k58565N2273J60387l01218K70722j08431j21913
$$ plain form
16546 1491086 1387817 1389386 1345434 1500994 1152952 1312169 1078476 1426595 1238377 1193542
16536 1193542 1040637 1201955 1209521 1026215 1299273 1386510 1017459 1210316 962903 976722
16526 976722 1109083 1308331 1157335 1018268 812301 896894 1051568 1244701 1043565 903287
16516 903287 1210967 911744 1198961 861370 892427 803287 1207741 792077 819610 1093432
16506 1093432 961203 707073 600231 1037369 888053 1008844 428445 516204 897203 527572
16496 527572 856417 745850 832027 729891 753710 670936 746521 752910 697029 493885 821696
16485 821696 854974 817685 793850 847020 721111 548938 759077 507183 491460 383629
16475 383629 887319 913080 725583 779621 602502 818446 656714 663878 838647 390776
$$ packed form
16546A491086j03269J569m3952J55560l48042J59217k33693L48119j88218m4835
16536A193542j52905J61318P566j83306K73058Q7237l69051J92857k47413J3819
16526I76722J32361J99248j50996j39067k05967Q4593J54674J93133k01136j40278
16516I03287L07680k99223K87217l37591L1057q9140M04454m15664K7533K73822
16506A093432j32229k54130j06842M37138j49316J20791D28445Q7759L80999l69631
16496E27572L28845j10567Q6177j02136K3819q2774P5585O389n5881k03144L27811
16485H21696L3278l7289k3835N3170j25909j72173K10139k51894j5723j07831
16475C83629N03690K5761j87497N4038j77119K15944j61732P164J74769C90776
$$ plain form
16464 203863 717132 847896 370765 567738 869336 312297 501205 696737 183593 712900
16454 712900 551211 308393 492566 544543 757037 398631 292153 375585 227216 366553
16444 366553 746429 502141 516435 381843 505167 327373 339246 598026 445258 288770
16434 288770 402123 239979 580864 325749 717881 582888 610549 37304 476759 531837
16424 531837 471335 301847 407699 344925 428327 356183 377271 514294 310415 587849
16414 587849 221590 444767 459737 363780 294803 403639 482142 520794 221091 427520
16404 427520 324139 385163 230320 -5045 481848 273918 116771 259447 183831 325804
16394 325804 389136 291014 286665 125903 490030 90903 98304 283671 334249 548197 128429
$$ packed form
16464B03863N13269J30764C70765J96973L01598C12297J88908J95532A83593N29307
16454G12900j61689k42818J84173N1977K12494l58406j06478Q3432j48369J39337
16444C66553L79876k44288J4294j34592J23324j77794J1873K58780j52768j56488
16434B88770J13353j62144L40885k55115L92132j34993K7661C7304M39455N5078
16424E31837o0502j69488J05852o2774Q3402p2144K1088J37023k03879K77434
16414E87849B21590K23177J4970r5957o8977J08836P8503L8652B21091K06429
16404D27520j03381O1024j54843e045D81848k07930A16771J42676p5616J41973
16394C25804O3332r8122m349A25903L64127I0903P401J85367N0578K13948A28429
$$ plain form
16382 359437 123868 423650 -126257 133728 284922 167138 561480 487920 263580 244462
16372 244462 145351 425459 430900 505121 34774 202618 -226923 283861 -83712 58263 411631
16361 411631 231766 315433 267369 72914 208240 82508 331754 175503 38132 347725
16351 347725 115113 252529 8274 221751 78094 318448 338761 19781 62275 429108 282342
16340 282342 259533 254832 220247 106369 52596 42768 88403 231953 145222 207750 -204368
16328 -340500 131947 379094 256139 484453 45032 327437 223187 -15743 348032 20091
16317 22067 433615 1518 134567 207701 392916 71992 575155 126622 171246 218522 74039
16305 -16047 609987 38721 225403 -34601 455543 267628 123682 -62249 265074 197326
$$ packed form
16382C59437A23868K99782a26257A33728J51194j17784L94342p3560k24340j9118
16372B44462r9111K80108N441P4221C4774J67844b26923B83861h3712E8263L53368
16361D11631j79865Q3667m8064G2914J35326H2508K49246j56251C8132L09593
16351C47725A15113J37416H274K13477G8094K40354K0313A9781M2494L66833j46766
16340B82342k2809m701l4585A06369E2596r828M5635J43550q6731O2528b04368
16328c40500A31947K47147j22955K28314D5032K82405j04250a5743C48032B0091
16317B2067M11548A518J33049P3134J85215G1992N03163A26622M4624M7276G4039
16305a6047F09987C8721J86682c4601D55543j87915A23682f2249B65074o7748
$$ plain form
16295 197326 -153791 230115 53479 156493 430616 66609 252229 40963 209571 71072
16284 150999 30429 24821 83438 396898 107101 -165558 276801 -68878 538612 -41699 160512
16272 126007 244727 303433 217905 67835 466520 -73966 161946 72649 356984 159749
16261 -80779 -367086 -200750 458 30680 438431 217312 131946 -68705 152850 27097 150323
16250 150323 69513 63381 86279 289612 45787 -338280 66932 79046 19770 164749 -40016
16238 -88508 115678 31258 -147030 281156 51786 100135 -104096 264742 96066 -21101 168303
16226 -281269 -49003 175305 -147878 34451 212436 -105701 413475 115920 -119763 117476
16215 106687 1622 -107840 28564 179955 481166 -154853 138705 -81755 74831 2441 294555
$$ packed form
16295A97326a53791B30115E3479J03014K74123F6609J85620D0963J68608G1072
16284A50999C0429n608N8617L13460A07101a65558B76801f8878E38612d1699A60512
16272A26007J18720N8706q5528F7835L98685g3966A61946G2649K84335A59749
16261h0779k86307J66336D58L0222M07751B17312q5366f8705A52850B7097J23226
16250A50323F9513o132K2898K03333D5787c38280F6932J2114A9770J44979d0016
16238h8508A15678C1258a47030B81156E1786M8349a04096B64742I6066b1101A68303
16226b81269d9003A75305a47878C4451J77985a05701D13475A15920a19763A17476
16215A06687A622a07840B8564J51391L01211a54853A38705h1755G4831B441K92114
$$ plain form
16204 294555 -150404 175181 -124713 3998 -172138 -53214 145333 137713 95735 -162909 -84630
16193 -84630 151362 -14981 18683 -246292 -18615 43293 -108186 146633 227538 -38315 -100739
16182 -100739 217019 18813 143343 -149753 -58767 -262260 -148256 101593 270001 215624
16172 215624 251662 -174750 710651 170215 -173377 -234896 34695 -47507 -194325 910 -58545
16160 91718 -95273 -13208 136026 85403 -172736 65338 254284 244474 70095 -118590 96185
16148 25975 143312 -119251 -13488 260214 441064 250347 -257879 151925 92378 -15670
16137 -39902 -117590 -70865 282215 -229348 -175510 -54869 -159205 366076 229500 -431981
16126 -59470 2704 -69151 -57068 32763 238123 51334 26170 29805 7942 183953 74385 -230801
$$ packed form
16204B94555a50404A75181a24713C998a72138e3214A45333p620m1978a62909P8279
16193h4630A51362a4981A8683b46292a8615D3293a08186A46633Q0905c8315o2424
16182a00739B17019A8813J24530a49753e8767k03493J14004A01593J68408n4377
16172B15624L6038a74750G10651A70215a73377o1519C4695d7507j46818I10e8545
16160I1718i5273a3208A36026n0623a72736F5338J88946r810G0095a18590I6185
16148B5975J17337a19251a3488B60214J80850j90717b57879A51925n9547a5670
16137c9902p7688M6725B82215b29348N3838e4869j04336C66076j36576d31981
16126e9470B704f9151J2083C2763K05360E1334k5164L635G942J76011G4385b30801
$$ plain form
16113 353696 380339 -105378 -192592 122298 313440 -48664 15405 65754 105866 263258 94156
16101 16396 168647 -46834 -55358 80990 -13973 274742 -138197 96669 87174 -155299 -297405
16090 -297405 -40225 -153662 71133 -68493 -42060 52916 331108 -83525 253696 -108968 -100205
16079 -100205 -2258 234287 22717 129389 -49730 -101389 -137717 76050 -44042 -125541 -288156
16068 -288156 -4974 113264 -90688 116778 -37165 -257142 113076 4861 16317 -31680 46126
16056 115694 37789 94911 -146403 86273 -11044 54888 -208818 -81078 -6056 12609 184550
16045 184550 28452 115511 133216 157784 208763 -361656 -241596 -50169 94112 -121218 -127844
16034 -127844 66674 -128795 -16842 44819 -85687 -347891 -218221 -336600 104652 134949
$$ packed form
16113C53696K6643a05378q7214A22298J91142d8664A5405N0349M0112J57392I4156
16101A6396J52251d6834q524H0990a3973B74742a38197I6669r495a55299j42106
16090b97405d0225j13437G1133f8493K6433E2916K78192h3525B53696a08968Q763
16079a00205b258B34287B2717J06672d9730n1659l6328G6050d4042q1499j62615
16068b88156d974A13264i0688A16778c7165k19977A13076D861J1456c1680D6126
16056A15694C7789N7122a46403H6273a1044E4888b08818h1078f056A2609J71941
16045A84550B8452Q7059J7705K4568N0979c61656J20060e0169I4112a21218o626
16034a27844F6674a28795a6842D4819h5687k62204J29670j18379A04652L0297
$$ plain form
16024 134949 -268162 -80870 -43988 -150404 -92054 27093 -63951 -27496 147475 -115434 186856
16012 -184910 -118255 88311 3416 415506 -105027 -202930 -199972 -54396 245050 -47285 -69993
16001 -69993 -82831 -385293 90891 -78092 -124764 -124768 -249466 -268889 -18448 -324039 -51973 35055
15988 -2172 267115 -94144 104789 -166480 154329 143863 55501 242295 134795 267143
15978 267143 326512 -131546 -320625 -74562 -64791 85389 -59584 85032 13415 -10878 -467718
15967 -467718 119187 -64734 -5349 -402839 173901 -246625 -78962 -233107 191135 -41830
15956 -384140 -162209 -54196 -14469 172332 -193131 28023 -147995 486603 -6902 69616 -20410
15944 -343579 105139 -109919 -413052 1973 -25331 48324 -392549 -79403 -111695 50776 -138974
$$ packed form
16024A34949b68162h0870L6882j06416N8350B7093f3951b7496A47475a15434A86856
16012a84910O6655H8311C416M12090a05027r7903K958e4396B45050d7285k2708
16001f9993j2838l02462I0891g8092m6672mj24698j9423a8448l05591e1973C5055
15988b172B67115i4144A04789a66480A54329j0466E5501J86794j07500J32348
15978B67143N9369a31546j89079g4562R771H5389e9584H5032A3415a0878m56840
15967d67718A19187f4734e349l97490A73901b46625g8962j54145A91135d1830
15956c84140a62209e4196a4469A72332a93131B8023a47995D86603f902F9616b0410
15944c43579A05139a09919l03133A973b5331D8324c92549g9403l2292E0776a38974
$$ plain form
15932 -106053 -65483 -306704 -120502 -247951 -212292 134218 -208411 -66481 -70909 -138955 -255853
15921 -255853 -309142 146581 -168087 239663 333735 288378 119695 -183767 -74667 46291
15910 -233306 -149292 -19198 36911 105100 13484 -281312 293462 295344 -188514 -201593 -68018
15898 211268 -78307 -78921 -295140 -119025 110571 6264 183437 354016 -303717 -31194 149935
15886 -14076 75781 28731 137827 1523 148134 -18982 264225 30960 174903 -219035 -154886
15875 -154886 35709 -33524 -1842 175995 370066 -151756 -152781 92662 -191097 -73347 47141
15863 -249254 -155835 -29034 104836 110523 -52212 -203008 187606 -134250 -171427 256514 -22743
15851 88708 81473 -53920 104637 -195608 122 -189299 -24847 93407 -213221 -357558 -246647
$$ packed form
15932a06053M0570k41221a20502j27449L5659A34218b08411f6481m428o8046j16898
15921b55853n3289A46581a68087B39663R4072m5357A19695a83767g4667D6291
15910b33306Q4014a9198C6911O8189A3484b81312B93462J882a88514j3079f8018
15898B11268g8307o14k16219a19025A10571F264J77173J70579c03717c1194A49935
15886a4076G5781B8731J09096A523J46611a8982B64225C0960J43943b19035O4149
15875a54886C5709c3524a842A75995J94071a51756j025I2662a91097g3347D7141
15863b49254R3419b9034A04836N687e2212j50796A87606a34250l7177B56514b2743
15851H8708p235e3920A04637a95608A22a89299b4847I3407b13221j44337J10911
$$ plain form
15840 -246647 -50590 -151600 23464 -58498 32073 47014 48746 44577 308965 -74465 -328935
15829 -328935 91939 145545 -195225 -45313 116892 -116144 185124 -254175 -60857 -272844
15819 -272844 60494 -28617 -112124 -246929 36172 -288067 83386 -132043 -123802 -298449 -28349
15807 153287 -172757 59924 -43231 -177852 -157860 192837 292529 -46384 -8525 203296 -71733
15795 61851 -212266 -68750 45879 244529 308832 189506 -101790 87488 -288383 161454
15784 -53662 -349883 176617 -133119 11655 -6582 -23977 -12683 -67546 93450 -9431 -360649
15773 -360649 -27233 -50435 -186549 -217532 3602 1402 -81695 320797 -68171 -192204 80360
15761 -7894 -107968 55451 -220189 -159918 160979 323590 -97974 43852 60231 31395 -253361
$$ packed form
15840b46647e0590j01010B3464e8498C2073J4941J732m169K64388g4465k54470
15829c28935I1939N3606a95225d5313A16892a16144A85124b54175f0857k11987
15819b72844F0494b8617q3507j34805C6172b88067H3386a32043Q241j74647b8349
15807A53287a72757E9924d3231j34621J9992A92837R9692d6384h525B03296g1733
15795F1851b12266f8750D5879J98650O4303j19326a01790H7488b88383A61454
15784e3662k96221A76617a33119A1655f582j7395J1294n4863I3450i431l51218
15773c60649b7233k3202j36114l0983C602A402h1695C20797f8171j24033H0360
15761g894j00074E5451b20189O0271A60979J62611i7974D3852J6379k8836b53361
$$ plain form
15749 62207 -145898 -41250 -193547 134578 -152971 -9771 62912 -9014 105781 130284 130888
15738 130888 -246654 3489 -22041 -306099 -317803 -323861 1471 -158336 225899 -30661 -188123
15727 -188123 -132553 -139438 -243120 -282554 -195887 99506 44313 86765 -275723 362703 -60130
15715 -233025 -154987 97461 127441 52400 -156669 -371076 794 -57280 -201444 91678 21117
15703 -71682 29077 -16860 -300175 85668 20424 55970 -54339 -171017 86173 -340415 263905
15691 518229 23879 134903 175573 196568 -64260 33382 -259546 145818 37395 -55765 -327971
15680 -327971 -131061 157948 -40425 -15643 -27706 21135 27368 155068 -27910 231191 166544
15669 166544 62354 -60455 -166932 170184 101841 198170 -157612 -256709 100422 613644
$$ packed form
15749F2207a45898d1250j52297A34578a52971i771F2912i014A05781K4503O04
15738A30888b46654C489b2041k84058j1704o058A471a58336B25899c0661j57462
15727a88123N5570o885j03682l9434Q6667I9506D4313M2452b75723C62703f0130
15715b33025P8038I7461K9980E2400a56669k14407G94e7280j44164I1678B1117
15703g1682B9077a6860k83315H5668B0424L5546e4339j16678H6173c40415B63905
15691E18229B3879J11024M0670K0995f4260C3382b59546A45818C7395e5765k72206
15680c27971a31061A57948d0425a5643j2063B1135O233J27700b7910B31191o4647
15669A66544F2354f0455j06477A70184o8343R6329a57612r9097A00422N13222
$$ plain form
15659 613644 -135415 -113876 -219314 -219429 -109190 -64377 167270 140228 -41634 151235 -221867
15647 121826 278204 -130709 -396663 -161272 -52391 -63158 16492 -447109 -231896 67763
15636 -207785 -22007 -39142 -141460 -36067 95129 155181 163427 123907 -65099 292508 -188627
15624 44942 54373 -49688 -175336 88496 130799 67688 -20406 -128081 113214 11186 -11370
15612 71208 139746 -74931 -260486 -50023 -98049 -6421 -113359 -44598 -94353 -256069 -203189
15601 -203189 135503 -366350 3338 15319 -8551 51426 -97903 -152060 -250742 287236 21531
15589 -1638 -2104 85956 -96176 -68656 -66753 -109144 77452 -302475 -119536 -51326 -171470 -90901
15577 -90901 56278 124025 126189 83750 59913 65912 -216904 -116425 -231559 -91174 103573
$$ packed form
15659F13644a35415K1539j05438j15a09190M4813A67270k7042d1634A51235b21867
15647A21826J56378a30709k65954a61272e2391j0767A6492d47109K15213F7763
15636b07785b2007j7135j02318c6067I5129O0052Q246l9520f5099B92508a88627
15624D4942R431d9688j25648H8496M2303o3111b0406j07675A13214A1186a1370
15612G1208O8538g4931j85555e0023m8026f421j06938d4598m9755j61716N2880
15601b03189A35503c66350C338J1981h551E1426i7903n4157r8682B87236B1531
15589a638m66H5956i6176K7520J903m2391G7452c02475a19536e1326j20144Q0569
15577i0901E6278O7747K164m2439k3837N999b16904J00479j15134i1174A03573
$$ plain form
15565 -190550 -50596 -45980 -106536 1670 105632 -137373 -73064 -12875 -93396 -389539 -42326
15553 -219050 -362259 -24256 -260431 -28662 -284767 236645 141363 -163795 -186244 -138490
15543 -138490 136638 -97469 -42643 8346 69755 -82425 -84937 -90754 -173845 289677 -59504 -142596
15531 -142596 9852 170268 -136711 -145257 -93774 33516 99938 -74485 76050 32849 169384
15520 169384 -305825 5693 35954 15495 -219531 114588 285901 -148434 79564 -4476 -136666
15509 -136666 -18353 136860 235008 16202 196397 109692 -79540 -260977 -130997 -68902 -68610
15498 -68610 172715 129725 -442342 24166 303422 251245 22191 -281760 -48061 -102035 76718
15486 135375 -359209 78638 16846 61688 -25460 -199366 -199372 151225 43742 -149055 -209994
$$ packed form
15565a90550e0596M616o0556A670J03962a37373O4309a2875q0521k96143d2326
15553b19050j43209b4256k36175b8662k56105B36645r5282a63795k2449M7754
15543a38490A36638i7469d2643H346O1409h2425k512n817q3091B89677e9504q3092
15531a42596I852J60416a36711q546N1483C3516O6422g4485G6050C2849J36535
15520A69384c05825E693L0261A5495b19531A14588J71313a48434G9564d476j32190
15509a36666a8353A36860R8148A6202J80195q6705g9540j81437J29980O2095K92
15498f8610A72715m2990d42342B4166K79256n2177B2191b81760d8061n3974G6718
15486A35375c59209G8638A6846M4842b5460j73906oA51225D3742a49055o0939
$$ plain form
15475 -209994 84123 155261 208006 21090 -223956 -156268 241767 96428 206110 -354998 37703
15463 -17706 -253274 273743 -113547 -27757 227163 212 -1415 46645 22154 -118873 -113329
15452 -113329 -57523 121658 -250451 103576 178505 -107676 -248819 -27839 14098 47072
15442 47072 255426 75403 -183904 324579 -210401 332530 97774 -270456 168512 102361
15432 102361 69069 175758 24831 237812 64811 -108756 340175 -12162 178935 -18627
15421 132199 11009 -86137 -61270 -258046 24555 -84580 -270521 12510 189968 -274785 49927
15409 71637 -135644 -115588 -147914 474128 -225223 -102465 75008 120695 -267835 -35036 82209
15397 290116 256293 -202857 289228 -116595 -85042 -15024 -126991 -48863 27380 -37734 -261879
$$ packed form
15475b09994H4123P1138N2745B1090b23956O7688B41767I6428J09682c54998C7703
15463a7706k35568B73743a13547b7757B27163B12a415D6645B2154a18873N544
15452a13329N5806A21658b50451A03576P4929a07676j41143b7839A4098L2974
15442D7072K08354G5403a83904C24579b10401C32530I7774b70456A68512o6151
15432A02361l3292J06689B4831K12981F4811a08756C40175a2162A78935a8627
15421A32199A1009h6137K4867j96776B4555h4580j85941A2510J77458b74785D9927
15409G1637a35644K0056l2326D74128b25223a02465G5008M5687b67835c5036H2209
15397B90116l3823b02857B89228a16595L1553a5024j11967d8863B7380c7734k24145
$$ plain form
15386 -261879 326729 -25400 161957 38732 -84949 233501 -67177 146132 -233299 -220485
15376 -220485 -128472 76070 -340118 310484 -33769 64286 -18212 -89691 99385 108623 -97049
15364 -205223 41592 -153604 341260 -62700 -171047 -231905 125727 -55018 -38260 -402268
15354 -402268 -163573 148558 118139 -97040 -342336 -49792 -65296 81418 -47540 35251 -877
15342 -155871 -136084 -15739 42616 -127303 15150 -236507 108599 -113913 -5239 -95544 -86456
15331 -86456 65423 339103 89366 -66582 88287 276042 315323 123900 217274 48511 88324
15320 88324 -49853 -74997 -76160 200682 -56062 -210704 28885 13586 -25802 -66105 -142553
15309 -142553 5396 199050 93070 -155874 275511 -89960 267348 208368 -159101 -191992 -373187
$$ packed form
15386b61879C26729b5400A61957C8732h4949B33501f7177A46132b33299J2814
15376b20485R2013G6070c40118C10484c3769F4286a8212p1479I9385R238i7049
15364b05223D1592a53604C41260f2700j08347o0858A25727e5018J6758l64008
15354d02268a63573A48558l0419i7040k45296d9792j5504H1418d7540C5251h77
15342a55871J9787a5739D2616a27303A5150b36507A08599a13913e239r0305R088
15331h6456F5423K73680H9366f6582H8287J87755L9281A23900R3374D8511L9813
15320H8324d9853k5144j163B00682e6062j54642B8885A3586b5802m0303p6448
15309a42553E396J93654I3070a55874B75511h9960B67348n8980a59101l2891j81195
$$ plain form
15298 -373187 331109 -9999 8048 221990 109824 351008 -75372 -99677 133201 -7702 -20317
15287 -20317 184346 -288561 -75539 -119838 -231883 60176 61746 126243 -88439 -164593 264228
15275 239616 390755 -65774 -35057 -282 99177 13150 132975 243181 96401 204838 276074
15264 276074 80478 51287 147180 52595 -69082 130615 -334278 102646 -100962 328440
15253 -267296 174027 85211 113866 106374 -33236 774333 946015 1422904 1206344 1486024
15243 1486024 825523 387231 150452 199810 76419 -112964 299304 58667 459160 75203
15232 301597 -2079 93545 -3282 -176590 85989 45854 114574 153223 236408 -221151 70287
15220 -34312 92389 171481 -10874 185943 171945 34158 239729 140975 175502 8606 55331
$$ packed form
15298c73187C31109i999H048K13942A09824K41184g5372k4305A33201g702j2615
15287b0317A84346b88561g5539m4299j12045F0176J570O4497h8439p6154B64228
15275B39616J51139f5774L0717b82I9177A3150J19825J10206I6401J08437P1236
15264B76074H0478k9191R5893E2595f9082A30615c34278A02646a00962C28440
15253b67296A74027H5211K8655p492c3236G74333J71682M76889k16560K79680
15243A486024o60501C87231A50452M9358G6419a12964B99304E8667M00493G5203
15232C01597b079I3545c282j73308H5989m0135O8720L8649Q3185b21151G0287
15220c4312I2389P9092a0874A85943j3998C4158K05571r8754L4527H606M6725
$$ plain form
15209 55331 -221483 57363 225885 95790 115863 237030 172311 -169675 32594 374272 296134
15198 296134 98534 -56730 -298810 235461 75205 239539 -14479 177508 -152698 74299
15187 114474 -104041 28462 137001 186649 378175 9041 -84408 297030 21886 373507 32674
15175 246531 34466 -194759 -95049 -48816 231981 92501 81758 182591 -295825 206838
15164 -46876 -84405 -96282 -469093 8814 161786 14491 -134603 276363 -93470 -28150 -124546
15153 -124546 18518 260482 249143 70973 184804 -147388 284370 119708 514571 -103316
15142 6078 -154375 279727 -173270 190516 184633 317024 100347 270688 253510 211911 122267
15131 122267 53099 -97948 -183622 -44909 163721 50546 236726 139672 320772 199436 114336
$$ packed form
15209E5331b21483E7363J68522I5790K0073J21167o4719a69675C2594L41678p8138
15198B96134I8534e6730k42080B35461G5205J64334a4479A77508a52698G4299
15187A14474a04041B8462J08539M9648J91526I041h4408B97030B1886L51621C2674
15175B46531C4466a94759i5049M6233B31981I2501j0743J00833b95825B06838
15164d6876l7529j1877l72811H814J52972A4491a34603B76363i3470b8150r6396
15153a24546A8518K41964j1339G0973J13831a47388B84370A19708L94863a03316
15142F078a54375B79727a73270A90516n883J32391A00347J70341j7178m1599q9644
15131A22267E3099i7948q5674d4909A63721E0546J86180r7054J81100j21336q5100
$$ plain form
15120 114336 210110 142861 77996 431717 99367 -102101 136362 47019 219476 219588 551213
15109 551213 88090 215675 98671 424897 -107855 -302784 176608 196000 333147 304575
15099 304575 356975 297225 477157 118432 -66447 26269 152826 255599 317047 261664 236425
15088 236425 -236718 264238 53348 196588 85439 -59854 325194 128938 200727 24286
15077 -32635 40279 296582 -50704 240206 256607 142689 235587 -51695 230461 249020 314090
15066 314090 10871 20641 288669 64672 190667 163120 215931 -112749 351877 108766 61977
15055 61977 462991 158370 238744 207963 353894 210607 269296 -17664 404013 -51375 -106230
15044 -106230 265102 152366 -38226 208438 -44573 214743 259343 164802 242034 -81749 -185699
$$ packed form
15120A14336R5774o7249o4865L53721I9367a02101A36362D7019J72457J12L31625
15109E51213H8090J27585I8671L26226a07855j94929A76608J9392J37147k8572
15099C04575N2400n9750J79932A18432f6447B6269J26557J02773O1448n5383k5239
15088B36425b36718B64238E3348J43240H5439e9854C25194A28938P1789B4286
15077c2635D0279K56303e0704B40206J6401j13918R2898e1695B30461J8559O5070
15066C14090A0871R770K68028F4672J25995k7547N2811a12749C51877A08766m6789
15055F1977M01014A58370Q0374l0781J45931j43287N8689a7664D04013e1375n4855
15044a06230B65102j12736c8226B08438d4573B14743M4600r4541P7232h1749j03950
$$ plain form
15033 -185699 50796 42946 24213 246711 166698 546975 522880 156480 89300 -7300 111473
15021 -149163 481854 33330 151772 507330 117951 325639 98945 172587 316111 593905
15011 593905 -2042 417434 260438 -107544 -88073 270444 132848 14530 68137 -259928
15000 262266 111087 184075 -116651 216607 334049 414046 143725 143276 313554 411858 -208110
14988 130294 -25424 -39021 264101 272367 301729 241983 54446 256992 332228 282016 395923
14977 395923 301684 127356 587170 62628 102401 185982 48812 75819 453 15171 128694
14966 128694 44159 127382 -9000 353046 -55427 241712 -194855 260571 444883 441193 286934
14955 286934 155945 185570 361357 315223 156725 261793 230946 231966 -29405 361697 378290
$$ packed form
15033a85699E0796p850j8733K22498q0013L80277k4095A56480o7180g300A11473
15021a49163D81854C3330J18442L55558A17951K07688I8945P3642J43524K77794
15011E93905b042D17434j56996a07544J9471B70444A32848A4530N3607b59928
15000B62266A11087P2988a16651B16607J17442P9997A43725m49J70278R8304b08110
14988A30294b5424j3597B64101Q266K9362n9746E4446K02546P5236n0212J13907
14977C95923r4239A27356M59814F2628L9773Q3581D8812K7007D53J4718J13523
14966A28694D4159Q3223i000C53046e5427B41712a94855B60571J84312l690j54259
14955B86934j30989K9625J75787m6134A56725J05068l0847J020b9405C61697J6593
$$ plain form
14944 378290 448651 103874 432789 235502 556262 127804 -11075 554274 99802 379865
14934 379865 305265 173588 366341 216208 400039 182285 571002 257501 266021 318797
14924 318797 445254 234600 192901 337058 253301 96672 530592 344086 106714 577804
14914 577804 339769 462079 1910 427481 412310 209907 400355 527888 259047 515255
14904 515255 270633 81597 393479 448046 330006 172610 420669 404233 15272 390101
14894 390101 499404 174745 143924 343564 257484 442572 344016 515617 416738 141271
14883 253534 133494 538832 82761 491311 197396 604982 468074 228744 24273 409606
14873 409606 349968 298749 619204 289828 286212 506984 573544 438021 368418 341643 436876
$$ packed form
14944C78290P0361A03874L28915j97287L20760A27804a1075E54274I9802K80063
14934C79865p4600j31677J92753j50133J83831A82285L88717B57501Q520N2776
14924C18797J26457k10654m1699J44157q3757I6672M33920j86506A06714M71090
14914E77804k38035J22310A910M25571j5171k02403J90448J27533B59047K56208
14904E15255k44622H1597L11882N4567j18040j57396K48059j6436A5272L74829
14894C90101J09303A74745l0821J99640q6080J85088r8556J71601r8879A41271
14883B53534j20040M05338H2761M08550A97396M07586j36908B28744B4273L85333
14873D09606n9638n1219L20455B89828l616K20772O6560j35523o9603k6775R5233
$$ plain form
14862 436876 355960 110621 636428 414413 353169 -37588 174707 101163 466182 485636
14852 485636 485173 588603 393097 527197 400495 372888 257577 325034 557554 384433
14842 384433 333999 406240 743538 328259 625562 569693 361807 740612 689321 170558
14831 607292 476162 501277 561207 272100 293427 409889 262629 303812 341213 322576 511616
14820 511616 447064 568148 339025 552349 459953 576514 458329 292146 332014 609185
14810 609185 413379 392822 427444 753202 903743 428806 146047 463333 456815 338420
14800 338420 496279 410745 511203 499985 402942 550092 221424 548637 681112 669996
14790 669996 463215 507359 600423 430263 824518 420313 971369 563256 454456 652171
$$ packed form
14862D36876q0916A10621N25807k22015o1244c7588A74707p3544L65019J9454
14852D85636m63J03430j95506J34100j26702k7607j15311O7457K32520j73121
14842C84433n0434P2241L37298C28259K97303n5869k07886L78805n1291A70558
14831F07292j31130K5115N9930B72100K1327J16462j47260M1183L7401j8637J89040
14820E11616o4552J21084k29123K13324r2396J16561j18185j66183L9868K77171
14810F09185j95806k0557L4622L25758J50541D28806A46047L17286o518j18395
14800C38420J57859q5534J00458j1218r7043J47150B21424L27213J32475j1116
14790F69996k06781M4144R3064j70160L94255m04205N51056m08113j08800J97715
$$ plain form
14780 652171 589200 366244 404396 725708 427730 555561 621800 723656 370088 563804
14770 563804 561825 373229 519053 727054 818633 705237 1021866 897638 784374 593758
14760 593758 372659 702343 416222 926238 828308 499043 754694 407051 574519 819297
14750 819297 698074 366326 406328 671997 712069 653408 744475 859622 466786 898274
14740 898274 589400 739281 701323 406199 822906 805884 801606 420731 452833 623989
14730 623989 670429 805066 623637 703335 859343 897347 918905 982493 803233 1068005
14720 1068005 657778 940782 820847 800945 1054535 613455 835426 609133 912883 876973
14710 876973 700022 842254 1168450 583108 1111966 901781 828562 670776 824531 860815
$$ packed form
14780F52171o2971k22956L8152L21312k97978J27831O6239J01856l53568J93716
14770E63804j979j88596J45824K08001R1579j13396L16629j24228j13264j90616
14760E93758k21099L29684k86121N10016r7930l29265K55651l47643J67468K44778
14750H19297j21223l31748M0002K65669M0072n8661R1067J15147l92836M31488
14740H98274l08874J49881l7958k95124M16707j7022m278l80875L2102J71156
14730F23989M6440J34637j81429P9698J56008L8004K1558O3588j79260K64772
14720A068005m10227K83004j19935j9902K53590m41080K21971k26293L03750l5910
14710H76973j76951J42232L26196E83108N28858k10185p3219j57786J53755L6284
$$ plain form
14700 860815 648668 786824 813231 979651 739376 1016427 1139396 942619 1137878 820368
14690 820368 609256 905594 891631 1156324 1069746 1119952 842608 982010 1064815 763356
14680 763356 973763 1026156 989059 539407 964273 1042826 886668 793887 859446 983996
14670 983996 980361 1234935 985761 883786 1035280 655099 871687 1016053 1107175 1059575
14660 1059575 1034967 1111877 852836 933676 1114642 1026260 994257 1100309 972663 1236446
14650 1236446 1449346 771832 1099786 1168880 1390133 1196165 1276218 1206983 1174755 1142029
14640 1142029 1347827 1264255 1372479 1093947 1256853 902753 1220018 1141984 1418249 1325349
14630 1325349 1309346 1190806 1357519 1277763 1379589 1339107 1454474 1373535 1318889 1287865
$$ packed form
14700H60815k12147J38156K6407J66420k40275K77051J22969j96777J95259l17510
14690H20368k11112K96338j3963K64693q6578N0206k77344J39402Q2805l01459
14680G63356K10407N2393l7097m49652M24866P8553j56158r2781O5559J24550
14670I83996l635K54574k49174j01975J51494l80181K16588J44366R1122m7600
14660A059575k4608P6910k59041Q0840J80966q8382l2003J06052j27646K63783
14650A236446K12900o77514L27954O9094K21253j93968Q0053o9235l2228l2726
14640A142029K05798q3572J08224k78532J62906l54100L17265p8034K76265r2900
14630A325349j6003j18540J66713p9756J01826m0482J15367q0939n4646l1024
$$ plain form
14620 1287865 1502793 1542032 1480092 1331122 1199761 1644325 1460428 1245939 1513110 1392940
14610 1392940 1992125 1364891 1307532 1764038 1516497 1669675 1540486 1645839 1666252 1668741
14600 1668741 1936927 1767251 1577655 1336458 1475581 1578124 1738618 1719911 1914712 1724558
14590 1724558 1738968 1804977 1400052 2165851 1888716 1994105 1967524 1808916 1928434 1868722
14580 1868722 2004433 1884546 1922318 1963122 1907134 2010547 2298801 2178759 2366055 2108414
14570 2108414 2165802 2208796 2068101 2497528 2000652 2444538 2264774 2249476 2224197 2608265
14560 2608265 2308172 2615667 2846886 2832577 2362346 3342677 3355623 3511741 3775222 4475224
14550 4475224 5076148 6385442 9434569 16790743 34934426 49222222 25917037 12325975
$$ packed form
14620A287865K14928L9239o1940j48970j31361M44564j83897k14489K67171j20170
14610A392940N99185o27234n7359M56506k47541J53178j29189J05353K0413K489
14600A668741K68186j69676j89596k41197J39123J02543J60494j8707J94801j90154
14590A724558J4410O6009m04925P65799k77135J05389k6581j58608J19518n9712
14580A868722J35711j19887L7772M0804n5988J03413K88254j20042J87296k57641
14570B108414N7388M2994j40695M29427m96876M43886j79764j5298k5279L84068
14560B608265l00093L07495K31219j4309m70231R80331J2946J56118K63481P00002
14550D475224O00924J309294L049127P356174J8143683J4287796k3305185A2325975
$$ plain form
14541 6624395 3905147 2837600 2479616 2067964 2240534 1939893 1700726 1913791 1806761
14532 1806761 1995029 2130129 1747534 2052163 1938210 1840981 2371127 2238337 2023905 2295694
14522 2295694 2492796 2176007 2755487 2409950 2545320 2458543 2382379 2745266 2502253 2568827
14512 2568827 2872190 2962748 2688251 2716819 3075076 2797823 2942161 2925820 3141753 2878695
14502 2878695 2877131 2991654 2869306 3047646 3367486 3104328 3282986 3141624 3227062 3423317
14492 3423317 3453482 3296872 3676696 3395849 3549678 3346650 3833707 3455066 3655811 3844357
14482 3844357 3786118 3816482 3790357 3633196 4055441 3954733 3874390 4124572 3829346 3928766
14472 3928766 4625808 4253701 4563894 4527244 4260477 4801989 4813602 4693768 4362048 4484566
$$ packed form
14541F624395k719248j067547l57984m11652J72570l00641k39167K13065j07030
14532A806761J88268J35100l82595L04629j13953r7229N30146j32790k14432K71789
14522B295694J97102l16789N79480l45537J35370q6777p6164L62887k43013O6574
14512B568827L03363R0558k74497K8568L58257k77253J44338j6341K15933k63058
14502B878695j564J14523j22348J78340L19840k63158J78658j41362Q5438J96255
14492C423317L0165j56610L79824k80847J53829k03028M87057l78641K00745J88546
14482C844357n8239L0364k6125j57161M22245j00708q0343K50182k95226R9420
14472C928766O97042l72107L10193l6650k66767N41512J1613j19834l31720J22518
$$ plain form
14462 4484566 4859290 5109146 4902540 4354577 4920939 4855628 4561730 4874298 5192719 4857668
14452 4857668 5025490 5350534 5124554 5466454 5373808 5385274 5517886 5623777 5669857 6082703
14442 6082703 5812948 5974608 5882048 6217972 6228422 6351637 6041805 6129698 6800716 6512606
14432 6512606 6770956 6713230 6894793 6981119 7183856 7087534 7144441 7487797 7381942 7626535
14422 7626535 7321937 7345120 7782520 7889112 8192816 8597698 8110616 8256844 8534014 8435370
14412 8435370 8475528 8977800 8835768 8944027 9176142 8886686 9058795 9495799 9707679 10099220
14402 10099220 9807637 10229146 10467788 10748577 10270165 10972212 10886018 10976985 11566353 11653214
14392 11653214 11620786 11708915 12170593 12410583 12365328 12899458 12936014 13311642 13500134 13759520
$$ packed form
14462D484566L74724K49856k06606n47963N66362o5311k93898L12568L18421l35051
14452D857668J67822L25044k25980L41900r2646J1466J32612J05891M6080M12846
14442F082703k69755J61660r2560L35924J0450J23215l09832Q7893O71018k88110
14432F512606K58350n7726J81563Q6326K02737r6322N6907L43356j05855K44593
14422G626535l04598K3183M37400J06592L03704M04882m87082J46228K77170r8644
14412H435370M0158N02272j42032J08259K32115k89456J72109M37004K11880L91541
14402A0099220k91583M21509K38642K80789m78412P02047q6194R0967N89368Q6861
14392A1653214l2428Q8129M61678K39990m5255N34130L6556L75628J88492K59386
$$ plain form
14382 13759520 13716883 13879741 14401350 14886817 15230786 15106505 15143456 15573356 16241437 16410816
14372 16410816 16737378 16656908 17270397 17699454 18180482 18264785 18885579 19053225 19488662 19839117
14362 19839117 20496409 20963423 21431850 21956233 22597588 22691476 23367478 23637909 24204196
14353 24204196 24996412 25747588 26554550 26856106 27643667 28186398 29081892 29570987 30175777
14344 30175777 30985923 32014601 32913278 33763977 34375543 35813944 36807358 37640908 38568231
14335 38568231 39862704 40934801 42298222 43339174 44730288 46024597 47714596 49056800
14327 49056800 50591507 52037153 53813662 55668200 57338800 59452847 61501772 63761569
14319 63761569 66023027 68582246 71181663 73455318 76507331 79348358 82561571 85652581
$$ packed form
14382A3759520m2637J62858N21609M85467L43969j24281L6951M29900O68081J69379
14372A6410816L26562q0470O13489M29057M81028Q4303O20794J67646M35437L50455
14362A9839117O57292M67014M68427N24383O41355R3888O76002K70431N66287
14353B4204196P92216P51176Q06962L01556P87561N42731Q95494M89095O04790
14344C0175777Q10146J028678Q98677Q50699O11566J438401R93414Q33550R27323
14335C8568231J294473J072097J363421J040952J391114J294309J689999J342204
14327D9056800J534707J445646J776509J854538J670600K114047K048925K259797
14319F3761569K261458K559219K599417K273655L052013K841027L213213L091010
$$ plain form
14311 85652581 89416480 92604368 96847525 100943446 105390681 109788698 114789717 120012708
14303 120012708 125746163 131244650 137572643 143984093 151103917 158004068 166547944 174802510
14295 174802510 183881021 193046218 203020925 213728736 224625086 236662240 249039724
14288 249039724 261781764 275195397 289298828 304069695 319178315 334648152 350009183
14281 350009183 365877658 381202690 396193821 410995366 424524005 436760605 447520606
14274 447520606 456601676 462738996 465496419 465062205 462359693 459940014 457570626 451373387
14266 451373387 443665194 434989180 425111356 414759198 402564851 389765308 375339089
14259 375339089 359941871 344000550 328263334 312784802 297013545 282759251 269424676
$$ packed form
14311H5652581L763899L187888M243157M095921M447235M398017N001019N222991
14303A20012708N733455N498487O327993O411450P119824O900151Q543876Q254566
14295A74802510R078511R165197R974707J0707811J0896350J2037154J2377484
14288B49039724J2742040J3413633J4103431J4770867J5108620J5469837J5361031
14281C50009183J5868475J5325032J4991131J4801545J3528639J2236600J0760001
14274D47520606R081070O137320K757423m34214k702512k419679k369388o197239
14266D51373387p708193q676014r877824j0352158j2194347j2799543j4426219
14259C75339089j5397218j5941321j5737216j5478532j5771257j4254294j3334575
$$ plain form
14252 269424676 255751355 242824475 230393926 218796441 207708445 197263391 187642012
14245 187642012 178681185 170091846 162227653 154369838 146955024 140093705 133741401 127755518
14237 127755518 122656033 117239417 112205289 107169877 102494488 98299061 94846930 91180364
14229 91180364 87283798 83722910 80557224 77406085 74578084 71771710 69125749 66944802
14221 66944802 64247968 62149570 60267515 58585833 55958905 54314780 52427630 51073832
14213 51073832 49970333 47999800 46545667 44851819 43573516 42450517 41511103 40961689
14205 40961689 39225808 37852709 36785318 35709502 35057316 34520633 33432840 32268060
14197 32268060 31491516 30602526 29894995 29737576 28884920 27961365 27138822 26371558 25708785
$$ packed form
14252B69424676j3673321j2926880j2430549j1597485j1087996j0445054r621379
14245A87642012q960827q589339p864193p857815p414814o861319o352304n985883
14237A27755518n099485n416616n034128n035412m675389m195427l452131l666566
14229I1180364l896566l560888l165686l151139k828001k806374k645961k180947
14221F6944802k696834k098398j882055j681682k626928j644125j887150j353798
14213E1073832j103499j970533j454133j693848j278303j122999r39414n49414
14205D0961689j735881j373099j067391j075816o52186n36683j087793j164780
14197C2268060p76544q88990p07531j57419q52656r23555q22543p67264o62773
$$ plain form
14188 25708785 25034449 24551610 24174913 23638877 23137207 22680164 22175151 21358768 21085583
14179 21085583 20589581 20434619 19948679 19137065 19134966 18867487 18534084 18187093 17455636 17081471
14169 17081471 17212496 16784386 16566797 16130780 15576648 15203051 15290124 14572840 14678218
14160 14678218 14305944 13837103 13750507 13305744 13357128 13159895 12535212 12590884 12432055 12193615
14150 12193615 12255590 11655073 11548018 11637015 11388685 11186171 11400126 10848030 10673395 10399379
14140 10399379 10346130 10054487 10059688 9862184 9783473 9513912 9286529 9473693 9261723 9000146
14130 9000146 8553221 8661771 8687458 8183620 8705149 8359622 7973903 8392517 7947746 7981275
14120 7981275 7511932 7637888 7622771 7460425 7408379 7330507 7167514 6811941 6853184 6667346
$$ packed form
14188B5708785o74336m82839l76697n36036n01670m57043n05013q16383k73185
14179B1085583m96002j54962m85940q11614k099k67479l33403l46991p31457l74165
14169A7081471J31025m28110k17589m36017n54132l73597Q7073p17284J05378
14160A4678218l72274m68841q6596m44763N1384j97233o24683N5672j58829k38440
14150A2193615O1975o00517j07055Q8997k48330k02514K13955n52096j74635k74016
14140A0399379n3249k91643N201j97504p8711k69561k27383J87164k11970k61577
14130I000146m46925J08550K5687n03838N21529l45527l85719M18614m44771L3529
14120G981275m69343J25956j5117j62346n2046p7872j62993l55573M1243j85838
$$ plain form
14110 6667346 6841484 6779877 6504209 6674338 6458399 6337932 6126053 6456914 5903501 6196321
14100 6196321 5736483 5815560 5722018 5807928 5767823 5766440 5696843 5476662 5353522 5147705 5405475
14089 5405475 5724755 5661597 5161520 4727517 4993524 4946563 4816937 5297851 4598588 4600168
14079 4600168 4676641 4691208 4928117 4275811 4497354 4281359 4580687 4389083 3820288 4406892
14069 4406892 4105442 4306995 4286335 4354480 3714132 4138301 4069993 4017720 4077870 4068318 4114645
14058 4114645 4129606 4002356 3981560 3751361 3750679 3642991 3582342 3460253 3340827 3470957
14048 3470957 3638235 3390230 3315443 3205183 3532011 3513253 3474556 3262022 3096938 3049583
14038 3049583 2948262 3092559 2963254 3223149 3194316 3287233 2975472 2801031 2858406 2954962
$$ packed form
14110F667346J74138o1607k75668J70129k15939j20467k11879L30861n53413K92820
14100F196321m59838P9077r3542Q5910m0105j383o9597k20181j23140k05817K57770
14089E405475L19280o3158n00077m34003K66007m6961j29626M80914o99263J580
14079D600168P6473J4567K36909o52306K21543k15995K99328j91604n68795N86604
14069D406892l01450K01553k0660O8145o40348M24169o8308n2273O0150r552M6327
14058D114645J4961j27250k0796k30199o82j07688o0649j22089j19426J30130
14048C470957J67278k48005p4787j10260L26828j8758l8697k12534j65084m7355
14038C049583j01321J44297j29305K59895k8833R2917l11761j74441N7375R6556
$$ plain form
14028 2954962 2864920 2867628 2800318 2882637 2757461 2613153 2599462 2435993 2681778 2756286 2555111
14017 2555111 2507892 2622423 2584302 2729586 2444959 2143897 2067684 2330428 2469617 2271617
14007 2271617 2238060 2261040 2481907 2466462 1993305 2265786 2290885 1865788 2351906 2199451
13997 2199451 2208739 2174661 1723469 1748932 2247931 1944524 1963364 2386658 2748083 4643957
13987 4643957 10149198 26865083 48608722 31549605 15407514 9166138 6392246 5251717
13979 5251717 4472613 4094520 3276524 2940213 2983118 2690378 2354935 2485710 2460756 2577215
13969 2577215 2302136 2500180 2394511 2325807 2441765 2285377 2487108 2200648 2189063 2125114
13959 2125114 2074758 2036110 1974161 1805926 2019891 2143611 1982798 1834326 1913516 2128833
$$ packed form
14028B954962r0042K708o7310Q2319j25176j44308j3691j63469K45785P4508k01175
14017B555111m7219J14531l8121J45284k84627l01062p6213K62744J39189j98000
14007B271617l3557K2980K20867j5445m73157K72481K5099m25097M86118j52455
13997B199451R288l4078m51192K5463M98999l03407J8840M23294L61425J895874
13987D643957N505241J6715885K1743639j7059117A5407514o241376k773892j140529
13979E251717p79104l78093q17996l36311M2905k92740l35443J30775k4954J16459
13969B577215k75079J98044j05669o8704J15958j56388K01731k86460j1585o3949
13959B125114n0356l8648o1949j68235K13965J23720j60813j48472P9190K15317
$$ plain form
13949 2128833 2115954 1618657 1845033 1959132 1798958 2027777 1862235 1946168 1518583 1598407
13939 1598407 1372503 1793726 1542521 1888499 1753701 1838294 1628625 1963319 1603979 1738184
13929 1738184 1732521 1601098 1747389 1699262 1276782 1337348 1642488 1279646 1468704 1488203
13919 1488203 1486294 1367518 1493430 1157309 1359414 1180703 1209354 1403358 1479430 1296372
13909 1296372 1267774 1536774 1317499 1258817 1574235 1312116 1449215 1442506 1218248 1297628
13899 1297628 1401239 1448414 1346216 1014622 1597664 1340756 1737549 1599374 1661410 1264164
13889 1264164 946292 1136535 1358504 1332383 1301465 1320662 1093324 1220354 1074639 1328209
13879 1328209 1212461 1032022 1179034 1371508 931653 1219449 1327068 1201055 779574
$$ packed form
13949B128833j2879m97297K26376J14099j60174K28819j65542Q3933m27585P9824
13939A598407k25904M21223k51205L45978j34798Q4593k09669L34694l59340J34205
13929A738184n663j31423J46291m8127m22480O0566L05140l62842J89058J9499
13919A488203j909j18776J25912l36121K02105j78711K8651J94004P6072j83058
13909A296372k8598K69000k19275n8682L15418k62119J37099o709k24258P9380
13899A297628J03611M7175j02198l31594N83042k56908L96793j38175O2036l97246
13889A264164l17872J90243K21969k6121l0918J9197k27338J27030j45715K53570
13879A328209j15748j80439J47012J92474m39855K87796J07619j26013m21481
$$ plain form
13870 779574 1208990 1066721 862503 1397901 1190713 1029818 1095274 907390 1111102 1209808
13860 1209808 799416 880824 920641 928044 976288 1040642 1098760 1156389 1057763 1016452 839997
13849 839997 784017 1142152 1180697 1118609 1153386 1142889 807057 1076057 896695 1117123
13839 1117123 992483 1024943 933419 998433 745868 718550 1070159 695754 926754 723702
13829 723702 777467 1222251 1221548 833269 842993 624256 1086168 993389 806285 840045 1035231
13818 1035231 877142 1075075 854593 674584 507713 1067394 998526 790538 1019273 786282
13808 786282 653612 740544 701117 713440 975841 680313 542375 844881 857525 493621
13798 493621 812604 954548 888709 975634 811029 635542 670612 721596 580585 677046
$$ packed form
13870G79574M29416j42269k04218N35398k07188j60895O5456j87884K03712R8706
13860A209808m10392Q1408L9817P403M8244O4354N8118N7629r8626m1311j76455
13849H39997n5980L58135L8545o2088L4777j0497l35832K69000j79362K20428
13839A117123j24640L2460r1524O5014k52565k7318L51609l74405K31000k03052
13829G23702N3765M44784p03l88279R724k18737M61912r2779j87104L3760J95186
13818A035231j58089J97933k20482j80009j66871N59681o8868k07988K28735k32991
13808G86282j32670Q6932l9427J2323K62401k95528j37938L02506J2644l63904
13798D93621L18983J41944o5839Q6925j64605j75487L5070N0984j41011R6461
$$ plain form
13788 677046 906433 650227 648598 821186 675151 941873 487619 922979 986887 437647
13777 607794 926918 702326 643224 734156 711130 317029 547997 406678 278746 765342
13767 765342 459982 667771 602064 508823 531129 935904 643342 819594 557116 865713
13757 865713 830835 787340 467303 649224 792169 927116 790211 354449 908412 816336
13747 816336 282401 657145 552387 700492 904449 675867 828058 817741 743946 392932
13737 392932 297964 508550 615294 617307 450731 696503 549857 530731 733004 390589
13727 390589 297358 693242 542095 614578 263849 380668 385998 791965 608106 101192
13716 170581 288713 457882 446847 379876 788818 581395 208767 649720 155622 443154
$$ packed form
13788F77046K29387k56206j629J72588j46035K66722m54254M35360O3908D37647
13777F07794L19124k24592n9102R0932k3026C17029K30968j41319j27932M86596
13767G65342l05360K07789o5707r3241K2306M04775k92562J76252k62478L08597
13757H65713l4878m3495l20037J81921J42945J34947j36905C54449N53963r2076
13747H16336B82401L74744j04758J48105K03957k28582J52191j0317p3795l51014
13737C92932r4968K10586J06744K013j66576K45772j46646j9126K02273l42415
13727C90589r3231L95884j51147P2483B63849J16819N330M05967j83859A01192
13716A70581J18132J69169j1035o6971M08942k07423B08767M40953A55622K87532
$$ plain form
13706 443154 450103 673592 638094 696322 521046 376907 485164 510107 549278 326519 542257
13695 542257 403086 164974 371181 976239 479754 413631 576587 515968 517196 254163
13684 712737 453269 408590 368546 455972 115465 408361 294087 215312 490020 455322
13674 455322 702729 422055 430295 341885 360133 643136 654912 452093 640786 185558
13663 565647 399598 310532 546103 660810 535969 394519 870407 561521 454682 412632
13653 412632 548345 91817 493479 505529 299947 183743 183967 308295 414345 510537 356976
13642 356976 520637 537169 567390 368231 302029 539219 569913 420587 458065 382765 581013
13631 581013 726819 298437 405185 301750 368955 453778 80687 384576 165847 252356
$$ packed form
13706D43154O949K23489l5498N8228j75276j44139J08257K4943L9171k22759K15738
13695E42257j39171A64974K06207O05058D79754o6123J62956o0619J228B54163
13684G12737k59468m4679m0044Q7426A15465K92896j14274p8775K74708l4698
13674D55322K47407k80674Q240q8410J8248K83003J1776k02819J88693A85558
13663E65647j66049q9066K35571J14707j24841j41450M75888l08886j06839m2050
13653D12632J35713I1817M01662J2050k05582j16204K24J24328J06050R6192j53561
13642C56976J63661J6532L0221j99159o6202K37190L0694j49326L7478p5300J98248
13631E81013J45806B98437J06748j03435O7205Q4823H0687L03889A65847Q6509
$$ plain form
13621 252356 615777 435980 458720 582480 693507 363130 259096 503179 654799 -44219
13610 573984 345180 225190 217380 398729 542352 119883 348064 558091 246314 466658
13600 466658 408039 469729 475987 138172 373125 270488 384365 274967 170365 590330
13590 590330 44628 426304 304398 452198 182334 397565 332349 188506 245015 323010
13580 323010 583526 391503 453402 -67264 198460 490017 251573 268701 622499 286905
13569 -145940 283814 576546 314232 553053 373762 442809 398234 295817 43726 275334
13559 275334 498890 112486 608507 554945 148698 216590 176808 407197 463666 614481
13549 614481 -24297 208082 381630 61576 66924 310759 481803 327167 286105 83932 334762
$$ packed form
13621B52356L63421j79797K2740J23760J11027l30377j04034K44083J51620d4219
13610E73984k28804j19990p810J81349J43623A19883K28181K10027B46314K20344
13600D66658n8619O1690O258A38172K34953j02637J13877j09398j04602M19965
13590E90330D4628L81676j21906J47800A82334K15231o5216j43843N6509P7995
13580C23010K60516j92023O1899f7264A98460K91557k38444J7128L53798B86905
13569a45940B83814K92732k62314K38821j79291O9047m4575j02417D3726K31608
13559B75334K23556A12486M96021n3562A48698O7892l9782K30389N6469J50815
13549F14481b4297B08082J73548F1576N348K43835J71044j54636m1062H3932K50830
$$ plain form
13538 334762 556410 218038 339104 294947 386529 552397 441294 169052 458441 -125682
13527 143644 210646 -47474 224541 268399 119361 310036 79033 258529 243285 283810 482093
13516 482093 483329 16044 240942 127006 313596 468442 355318 -192191 86315 460763
13506 460763 323148 152595 330627 226225 230949 316656 -57029 484715 244076 -36986
13495 258306 241746 466216 295701 181341 244950 261966 362036 -155771 107725 226677
13485 226677 188545 507604 96328 346617 318867 239504 282208 259197 333512 173173 327001
13474 327001 22251 205091 363270 102362 267992 405620 265442 255217 560925 262775
13463 125206 123359 247856 -21906 81485 361406 300720 -8115 12361 370541 152539 271022
$$ packed form
13538C34762K21648B18038J21066m4157R1582J65868j11103A69052K89389a25682
13527A43644O7002d7474B24541M3858A19361J90675G9033J79496j5244M0525J98283
13516D82093J236A6044K24898j13936J86590J54846j13124a92191H6315L74448
13506D60763j37615A52595J78032j04402M724Q5707e7029D84715k40639c6986
13495B58306j6560K24470j70515j14360O3609J7016J00070a55771A07725J18952
13485B26677l8132L19059I6328K50289k7750p9363M2704k3011P4315j60339J53828
13474C27001B2251J82840J58179A02362J65630J37628j40178j0225L05708B62775
13463A25206j847J24497b1906H1485K79921o0686h115A2361L58180A52539J18483
$$ plain form
13452 271022 155065 -90331 292317 472403 229915 393397 117858 523577 -83719 60970
13441 -104480 167046 154876 200497 147866 351441 135483 347895 182085 48103 379868
13431 379868 -184268 299765 233439 214706 190010 68073 197794 390452 155328 115047
13421 115047 106180 173181 -21310 504533 414455 206509 62386 251805 143508 340415 -81958
13409 198867 97454 107668 333963 251148 327967 131378 381238 28617 -7299 248375 211215
13398 211215 235406 45499 124148 309829 249104 318642 264557 147468 286040 -55557 45614
13386 197568 125348 199043 117637 153008 353171 40069 312543 187955 342232 563317
13376 563317 140252 194821 306342 352575 336790 422608 432099 221738 144276 515777 35474
$$ packed form
13452B71022j15957i0331B92317J80086B29915J63482A17858M05719h3719F0970
13441a04480A67046j2170M5621n2631K03575A35483K12412j65810D8103L31765
13431C79868a84268B99765o6326j8733k4696F8073J29721J92658A55328m0281
13421A15047q867O7001b1310E04533r0078B06509F2386J89419j08297J96907h1958
13409A98867I7454J0214K26295q2815P6819A31378K49860B8617g299B48375l7160
13398B11215K4191D5499P8649J85681o0725O9538n4085j17089J38572e5557D5614
13386A97568p2220P3695q1406L5371K00163D0069K72474j24588J54277K21085
13376E63317A40252N4569J11521M6233j5785Q5818R491k10361p7462L71501C5474
$$ plain form
13364 193010 -88943 273703 272116 492544 141733 305805 10476 261314 293036 197802 168567
13353 168567 104416 -17483 160864 240415 327391 215702 304195 169076 88682 261925 397517
13342 397517 158816 203353 385483 392475 276712 158558 -172725 271115 -30851 324255
13331 301570 318315 151279 -18737 152339 63568 79425 -30653 1500 159192 274099 210627
13320 210627 -78032 -25757 -3774 440982 443031 320085 96377 63241 291363 85512 -41577
13308 290887 311380 190814 7796 65953 -20605 436225 85284 170347 97583 237608 337906
13297 337906 98619 169997 249597 231991 191625 133673 160692 51001 294087 164930 29325
13285 402257 77361 59928 15669 166691 163992 425354 197999 164790 -54813 -158249 138424
$$ packed form
13364A93010h8943B73703j587K20428A41733J64072A0476K50838L1722r5234k9235
13353A68567o4151a7483A60864P9551Q6976j11689Q8493j35119q0394J73243J35592
13342C97517A58816M4537J82130O992j15763j18154a72725B71115c0851C24255
13331C01570J6745A51279a8737A52339F3568J5857c0653A500J57692J14907o3472
13320B10627g8032b5757c774D40982K049j22946I6377l3136K28122H5512d1577
13308B90887K0493j20566G796N8157b0605D36225H5284Q5063p2764J40025J00298
13297C37906I8619P1378P9600j7606m0366n7952K7019E1001K43086j29157B9325
13285D02257G7361j7433A5669J51022k699K61362A97999l3209e4813j03436A38424
$$ plain form
13273 247633 -38369 62198 286295 -22288 483468 129307 566526 -213518 110249 49872
13262 51526 298567 168840 41600 435230 309738 213424 -458859 -54588 194009 -59616
13251 202524 -29551 -75216 -101420 115838 166380 276503 221215 -100588 10300 319615 116365
13239 127625 -108846 77408 279167 -75952 257922 172152 94694 216227 191250 -63080 281857
13227 -19927 138174 -71694 68028 105430 12483 -80605 -7019 -22322 57628 429357 343411
13216 343411 -57202 53092 261133 220336 -56880 -6235 -80434 229487 247371 65111 40020
13205 40020 144084 153100 -177257 -13964 -15618 123422 -180523 189695 135394 -188845 821851
13193 -174463 438189 231340 134371 233149 -152934 128546 130898 55934 33855 -55815 76562
$$ packed form
13273B47633c8369F2198K24097b2288D83468A29307M37219b13518A10249D9872
13262E1526K47041j29727D1600L93630j25492r6314d58859e4588A94009e9616
13251B02524b9551m5665k6204A15838N0542J10123n5288a00588A0300L09315A16365
13239A27625a08846G7408K01759g5952B57922q5770p7458J21533k4977f3080B81857
13227a9927A38174g1694F8028L7402A2483h0605g019j5303E7628L71729q5946
13216C43411e7202E3092K08041m0797e6880f235p4199B29487J7884F5111k5091
13205D0020J04064R016a77257a3964j654A23422a80523A89695n4301a88845H21851
13193a74463D38189k06849r6969R8778a52934A28546K352E5934k2079e5815G6562
$$ plain form
13181 -123358 78438 127269 74499 -59632 265331 176347 -139843 -121564 153238 -35972 -43405
13170 -43405 -33331 229301 135696 667581 120133 163246 187070 167153 -86614 136319 -271054
13158 172004 318209 -110490 216279 63511 309914 -428690 175728 -144596 -159800 -12994
13147 183887 68183 111977 367102 352265 51325 -12018 203725 -110390 43606 176405 428605
13136 428605 30434 9570 45198 92963 -76435 -84092 -209769 -62038 85986 -155613 -43738
13124 -306730 80466 119896 216848 8140 -181934 30913 -105647 89881 91406 18701 130908
13113 130908 -200368 131951 121642 344264 121604 201865 -25367 -199219 83383 21263
13102 420009 112913 92382 305816 314785 -19806 141349 27835 582238 41708 53789 -165587
$$ packed form
13181a23358G8438M8831n2770e9632B65331q8984a39843J8279A53238c5972p433
13170d3405J0074B29301r3605N31885A20133M3113K3824j9917h6614A36319b71054
13158A72004J46205a10490B16279F3511K46403d28690A75728a44596j5204a2994
13147A83887F8183M3794K55125j4837E1325a2018B03725a10390D3606J32799K52200
13136D28605C0434I570L5628M7765g6435p657j25677f2038H5986a55613d3738
13124c06730H0466L9430R6952H140a81934C0913a05647H9881J525A8701J12207
13113A30908b00368A31951j0309K22622A21604Q0261b5367j73852H3383B1263
13102D20009A12913k0531K13434Q969a9806A41349B7835N54403D1708J2081a65587
$$ plain form
13090 251028 -87191 6283 113093 40916 213476 142931 14092 -205912 185066 -95131 -176791
13079 -176791 -249856 274592 164316 47473 2802 -49812 199128 204694 332605 340077 -71088
13067 328487 432576 426789 103468 -25808 79482 137135 207891 402796 -19072 17077 62107
13056 62107 216882 -99537 -208477 113602 -272956 106549 77314 -147929 106232 -173417
13045 -178194 210630 65760 4660 82042 -132203 467819 156483 206030 239946 167467 317299
13034 317299 88713 259175 99978 -323328 267113 346969 -329384 -56614 25146 259010
13024 259010 91656 -238789 262183 -146898 62049 187288 -69457 121227 465041 17844
13013 -90129 235655 54241 345272 330717 22323 243745 -6422 153071 118170 120149 28516
$$ packed form
13090B51028h7191F283J06810D0916J72560p0545A4092b05912A85066i5131q1660
13079a76791p3065B74592j10276D7473B802d9812A99128N566J27911P472g1088
13067C28487J04089n787A03468b5808G9482N7653P0756J94905a9072A7077M5030
13056F2107J54775i9537j08940A13602b72956A06549k9235a47929A06232a73417
13045a78194B10630F5760D660P7382a32203D67819A56483M9547L3916p2479J49832
13034C17299H8713J70462I9978c23328B67113P9856c29384e6614B5146K33864
13024B59010I1656b38789B62183a46898F2049J25239f9457A21227L43814A7844
13013i0129B35655E4241K91031j4555B2323K21422f422A53071l4901J979B8516
$$ plain form
13001 299464 -102431 2966 -25372 210448 133871 95198 182806 152206 110175 193551 147315
12990 147315 145709 -127758 108824 -81512 14130 201314 76373 4380 222285 -47305 305823
12978 144567 -149910 20248 -306786 145098 9425 -313592 185593 245417 24229 -196019
12967 114859 -188266 78009 -102274 258143 442520 322356 187774 -100059 49209 77651
12957 77651 -138584 -96721 98468 259616 170510 128799 21568 156749 58020 80497 157013
12946 157013 28908 4819 -248036 -262769 -234731 297822 142650 3603 -31069 115607 -199357
12934 -168866 123250 -374265 12978 188250 -6385 368996 59720 -54235 51650 -110056 -74422
12923 -74422 -142095 -170044 142702 -46027 -7056 190720 123356 -70833 213320 4192 208888
$$ packed form
13001B99464a02431B966b5372B10448p6577l8673Q7608l0600m2031Q3376m6236
12990A47315j606a27758A08824h1512A4130J87184G6373D380K17905d7305C05823
12978A44567a49910B0248c06786A45098I425c13592A85593N9824B4229a96019
12967A14859a88266G8009a02274B58143J84377j20164j34582a00059D9209K8442
12957G7651a38584M1863I8468J61148q9106m1711B1568J35181E8020K2477P6516
12946A57013B8908D819b48036j4733K8038B97822A42650C603c1069A15607a99357
12934a68866A23250c74265A2978J75272f385C68996E9720e4235E1650a10056L5634
12923g4422o7673k7949A42702d6027g056A90720o7364g0833B13320D192K04696
$$ plain form
12912 208888 64290 -85928 -95189 10250 -39524 109997 273381 487769 54975 1118 -200906
12900 32170 -148003 -181227 118214 -149628 27023 -104654 301892 -76820 371496 87062
12889 -19321 -76236 14439 7351 40 161186 -235427 16813 8497 -52792 19728 2349 158486
12877 158486 131540 -183523 -138809 130663 -22550 -126281 125839 -53536 -74212 -191627
12867 -191627 -185484 -149851 37244 -15429 174700 -83437 235858 376606 -147032 -168068 -140448
12856 -140448 -185102 33402 53606 324809 142389 -76212 -209886 -19266 91635 -10004 -47508
12845 -47508 33840 -234227 -172181 98973 113255 -211648 116323 -104888 72172 -41068 -166455
12834 -166455 -56624 240569 49487 304933 225525 89621 99456 59043 -73599 262866 -277710
$$ packed form
12912B08888F4290h5928r261A0250c9524A09997J63384K14388E4975A118b00906
12900C2170a48003l3224A18214a49628B7023a04654C01892g6820C71496H7062
12889a9321n6915A4439p088D0J61146b35427A6813q316e2792A9728B349J56137
12877A58486k6946a83523M4714A30663b2550j03731A25839e3536k0676j17415
12867a91627O143L5633C7244a5429A74700h3437B35858J40748a47032k1036K7620
12856a40448m4654C3402K0204K71203A42389g6212j33674a9266I1635a0004l7504
12845d7508C3840b34227O2046I8973J4282b11648A16323a04888G2172d1068j25387
12834a66455e6624B40569D9487K55446p9408H9621R835m0413g3599B62866b77710
$$ plain form
12822 37878 184140 175018 -40532 192367 97053 127606 181753 316823 -184423 20892 31852
12811 31852 -310420 12664 4679 -224449 -238391 125172 -352057 91357 -249227 -20235 68821
12799 2911 157839 -240038 298843 -4952 99804 212994 307549 -197042 108758 -196706 33380
12787 -67285 -74217 140752 232979 428547 -43821 137534 -153757 -143070 26460 -335987 36424
12775 23446 188405 -10773 200897 -68557 89298 -11747 -226066 216116 21967 242437 15555
12763 -10841 14590 -315749 -301904 -168287 270099 69456 -149757 190931 -49512 -89434 97273
12751 40946 -75934 113279 421460 -85751 148147 115822 219770 -163175 -89101 20621 -55228
12739 -86612 -47882 362854 105200 224203 83305 304819 -365810 325092 130837 57213
$$ packed form
12822C7878J46262r122d0532A92367r5314L0553N4147J35070a84423B0892J0960
12811C1852c10420A2664D679b24449j3942A25172c52057I1357b49227b0235F8821
12799B911J54928b40038B98843d952I9804J13190R4555a97042A08758a96706C3380
12787f7285o932A40752R2227J95568d3821A37534a53757J0687B6460c35987C6424
12775B3446J64959a0773B00897f8557H9298a1747k14319B16116B1967K20470A5555
12763a0841A4590c15749J3845J33617B70099F9456a49757A90931d9512l9922I7273
12751D0946g5934A13279L08181h5751A48147l2325J03948a63175P4074B0621e5228
12739h6612L8730C62854A05200J19003H3305K21514c65810C25092A30837E7213
$$ plain form
12728 -10030 -182401 128728 357155 -40906 187566 -103906 138465 -171462 -232860 53581
12717 -99196 -175393 132633 -49129 -15885 100282 211004 341327 -35835 8087 271084 117890
12705 132719 -21063 345083 110676 136863 198670 46443 65912 108270 114373 209963 38382
12693 228982 -236688 -10019 -55822 -247904 -120527 149385 171204 -120963 31767 -52229
12682 -253866 -103538 -65476 36374 -85962 328807 -103253 93154 1156 21730 -80576 154632
12670 -75918 84239 240990 176726 38805 83258 187039 -364392 13506 -266281 279806 210612
12659 210612 235398 619655 558855 440187 62699 -82248 -231629 -198369 -13299 102571 139434
12648 139434 305344 30968 75646 119177 103220 -110504 -262745 -171573 301620 -54381 -283624
$$ packed form
12728a0030j72371A28728K28427d0906A87566a03906A38465a71462o1398E3581
12717i9196p6197A32633d9129a5885A00282J10722J30323c5835H087K62997A17890
12705A32719b1063C45083A10676K6187O1807D6443J9469M2358O103R5590C8382
12693B28982b36688a0019m5803j92082a20527A49385K1819a20963C1767e2229
12682b53866a03538L8062C6374h5962C28807a03253I3154A156K0574h0576A54632
12670g5918H4239J56751o4264C8805M4453J03781c64392A3506b66281B79806o9194
12659B10612K4786L84257o0800j18668F2699h2248j49381L3260a3299A02571L6863
12648A39434J65910C0968M4678M3531j5957a10504j52241R1172C01620e4381k29243
$$ plain form
12637 -283624 -102853 54657 -241676 -526 278681 254540 340110 129786 409378 -107688 -221967
12626 -221967 13034 435133 185457 -181100 96025 12685 177915 173759 70318 339057 -141034
12614 55983 21530 70082 8108 65847 77384 -64426 -47601 146449 143453 -371054 107172
12602 -134178 383683 -132441 175117 -27016 186142 205104 352218 73045 147412 57468
12591 -74414 261526 -376115 -90557 75011 246465 99927 -134930 112786 140113 -59759 -255591
12580 -255591 57213 -110944 94931 -211484 191603 336791 146398 387225 289495 243581
12570 243581 -145767 146853 65757 226963 -10010 32981 26827 -41111 337667 454336 -140974
12558 96850 100041 57928 169500 -165779 267027 -32095 179379 -78001 144636 29235 -177011
$$ packed form
12637b83624a02853E4657b41676e26B78681k4141Q5570A29786K79592a07688j14279
12626b21967A3034M22099A85457a81100I6025A2685J65230m156G0318K68739a41034
12614E5983B1530M8552H108N7739J1537f4426J6825A46449k996c71054A07172
12602a34178C83683a32441A75117b7016A86142J8962J47114G3045P4367E7468
12591g4414B61526c76115i0557G5011J71454I9927a34930A12786K7327e9759j95832
12580b55591E7213a10944I4931b11484A91603J45188A46398K40827r7730m5914
12570B43581a45767A46853F5757J61206a0010C2981o154d1111C37667J16669a40974
12558I6850L191m2113J11572a65779B67027c2095A79379g8001A44636B9235a77011
$$ plain form
12546 -342593 -275942 -118093 -18021 -9973 -139328 -446611 52955 -89161 36738 -111590 -9945
12534 403279 -52164 -138249 -256273 -328495 -426670 279211 25004 201580 39680 -28845 85280
12522 -5752 225041 188655 -302214 41077 119054 -94512 -93880 9509 -26554 226026 61940 144945
12510 144945 334346 102070 -105674 230077 70725 -56271 32205 201549 132 25064 4381
12498 -32999 46274 -41325 -51947 -76192 524098 325243 -184155 485577 387300 111426 -163889
12486 -148155 171134 127313 307939 47800 113768 90897 366495 -126215 -162080 -155599 -62320
12474 157409 -3482 41228 51754 245998 -97924 -87282 176835 8206 -286909 166033 -334608
12462 372667 -133987 251730 530442 272305 -86153 227568 178581 155797 -131656 -201068
$$ packed form
12546c42593O6651a18093a8021Q048j29355l07283E2955h9161C6738a11590i945
12534D03279e2164q6085j18024p2222r8175B79211B5004J76576C9680b8845H5280
12522e752B25041l6386c02214D1077P7977i4512O32I509b6554B26026F1940Q3005
12510A44945J89401A02070a05674B30077G0725e6271C2205J69344A32K4932D381
12498c2999D6274d1325j0622k4245E24098j98855a84155D85577r8277A11426a63889
12486a48155A71134m3821J80626D7800O5968k2871K75598a26215l5865O481f2320
12474A57409c482D1228J0526J94244i7924J0642A76835H206b86909A66033c34608
12462C72667a33987B51730K78712k58137h6153B27568m8987k2784a31656o9412
$$ plain form
12452 -201068 209051 -32748 -2339 340364 -121222 -205768 150762 -202085 -183392 -109029 -56836
12441 -56836 -229661 174396 -71120 69762 -119639 -166827 -144960 -374372 48416 -140187 63997
12429 386093 100143 -184136 -16874 -145881 -388501 169616 418037 -17009 97916 -446376
12418 78050 47693 -133691 284738 102048 -39507 -166890 -165585 168585 -191660 -151022 42502
12406 -97295 -111144 75620 -158592 396091 14106 -160137 -33223 -30636 -454267 -107460 -39914
12394 -396636 -331534 -254291 -165697 30686 158638 8859 299316 -211933 -29872 10349 -361683
12382 181074 -279434 63879 -9295 3840 -23966 37261 175350 -134286 54366 144371 -326075
12370 254793 142595 -61246 -200488 -635498 100202 246081 6794 -105879 239379 53514
$$ packed form
12452b01068B09051c2748b339C40364a21222q4546A50762b02085J8693P4363N2193
12441e6836j72825A74396g1120F9762a19639m7188K1867k29412D8416a40187F3997
12429C86093A00143a84136a6874j29007k42620A69616K48421a7009I7916d46376
12418G8050l0357a33691B84738A02048c9507j27383J305A68585a91660M0638D2502
12406i7295j3849G5620a58592C96091A4106a60137c3223K587m23631a07460c9914
12394c96636O5102P7243Q8594C0686J27952H859K90457b11933b9872A0349c61683
12382A81074b79434F3879i295C840b3966C7261J38089a34286E4366R0005c26075
12370B54793j12198f1246j39242m35010A00202J45879F794a05879B39379E3514
$$ plain form
12359 -147127 162773 137872 183421 173477 -115465 -130927 96884 291512 -59679 -387210 -188182
12347 -102683 33509 -84033 173425 216003 -292989 -3002 -25925 173538 166575 -286972 55300
12335 115052 -181243 -39543 -52215 56564 -48491 118242 259719 -140988 -43333 11730 -90254
12323 -130527 -222781 99489 206920 -233069 -131601 18170 -22565 25065 -140472 25060 25732
12312 25732 260955 48021 16174 -38725 156731 260543 299076 68346 -131214 -37054 90194
12300 207015 -14191 -115853 359140 143819 280554 -5880 -144862 180302 -214884 -281538
12290 -281538 31484 240822 26447 238765 26796 89954 -170633 -292606 197896 -227521
12279 -93275 -56248 28378 -323852 -37394 231408 46105 243644 85275 77832 -3898 319694
$$ packed form
12359a47127A62773k4901M5549r944a15465j5462I6884J94628e9679l27531a88182
12347a02683C3509h4033A73425M2578b92989c002k2923A73538o963b86972E5300
12335A15052a81243c9543j2672E6564d8491A18242J41477a40988d3333A1730i0254
12323a30527r2254I9489J07431b33069J01468A8170b2565B5065a40472B5060O72
12312B5732K35223D8021A6174c8725A56731J03812L8533F8346a31214c7054I0194
12300B07015a4191j01662C59140A43819J36735e880j38982A80302b14884o6654
12290b81538C1484K09338B6447K12318B6796O3158a70633j21973A97896b27521
12279i3275L7027B8378c23852c7394B31408D6105J97539H5275p443c898C19694
$$ plain form
12267 18448 27758 299621 292277 209642 72 -15605 122529 -39428 -73185 20179 -245412 393674
12254 -124985 385079 245319 177936 -108516 442858 138225 60933 -191177 158073 -33440
12243 260098 15696 103569 71534 30679 129532 -178102 -166774 -140102 -102700 366743 50378
12231 179775 -305713 -295747 -7310 466056 -233743 208479 255394 126426 153949 72273 121134
12220 121134 348832 -77464 318713 326278 -72725 -184114 280327 -34979 41558 67744 188021
12209 188021 162930 215390 195682 438378 305645 65032 342888 -121145 464207 193070
12198 318907 111605 169760 263547 203988 111651 326236 182973 120837 252693 220942 63907
12186 126289 -112170 207676 11912 482351 263372 245958 125595 283737 300199 286655
$$ packed form
12267A8448R310K71863p344q2635G2a5605A22529c9428l3757B0179b45412C93674
12254a24985C85079j39760o7383a08516D42858A38225F0933a91177A58073c3440
12243B60098A5696Q7873l2035C0679R8853a78102J1328K6672L7402C66743E0378
12231A79775c05713R966g310D66056b33743B08479M6915A26426K7523G2273M8861
12220A21134K27698g7464C18713P565g2725j11389B80327c4979D1558K6186J20277
12209A88021k5091N2460j9708K42696j32733F5032K77856a21145D64207A93070
12198C18907A11605N8155R3787n9559r2337K14585j43263o2136J31856l1751F3907
12186A26289a12170B07676A1912M70439k18979j7414j20363J58142J6462j3544
$$ plain form
12176 286655 140028 311255 403540 211628 58005 -12929 -356784 -8880 80198 -157038 127661
12164 318292 134565 234932 233755 116562 5378 185995 89278 254548 -52998 -1067 66083
12152 276244 83758 2131 -146846 362558 294541 167837 430151 -63820 -9312 53891 -95842
12140 58135 93680 54818 171748 170346 -310402 -131954 66016 22577 -101485 229067 39087
12128 241367 220183 59741 182574 40722 192160 -72457 68311 -127597 -231133 170898
12117 298278 71319 -107439 41033 99082 -32662 87690 -792 121039 -126994 2663 -129381
12105 -117369 101485 -113297 137604 -124718 -186231 193047 -127123 252338 -130320 59760
12094 25389 -171531 55530 -325790 -184144 -204287 255809 -10677 -188467 -129390 -249434
$$ packed form
12176B86655A40028J71227R2285j91912E8005a2929l43855h880H0198a57038A27661
12164C18292A34565J00367j177A16562E378J80617H9278J65270e2998a067F6083
12152B76244H3758B131a46846C62558o8017j26704K62314f3820i312E3891i5842
12140E8135L5545l8862J16930j402c10402a31954F6016B2577a01485B29067C9087
12128B41367k1184E9741J22833D0722J51438g2457F8311a27597j03536A70898
12117B98278G1319a07439D1033N8049c2662H7690g92A21039a26994B663a29381
12105a17369A01485a13297A37604a24718o1513A93047a27123B52338a30320E9760
12094B5389a71531E5530c25790J41646k0143B55809a0677j77790N9077j20044
$$ plain form
12084 -249434 -115866 59582 289736 -6092 -73277 -258515 59808 -282789 -19541 -142523 1436
12072 250518 187014 658796 2001483 1823286 760326 432738 -138852 188196 202385 46928
12061 259030 154568 -70798 -30640 -121999 34860 140673 -130162 -41133 75139 -138227 150859
12049 -126163 -70319 51161 -351610 161351 105338 238096 125076 42917 -112244 212432
12038 -151209 -68105 -32934 -65652 12024 87134 -66427 -22036 -97254 -11053 -67774 -98164
12027 -98164 -211703 -84175 97217 -97182 392461 159052 -106939 -223768 -290064 225766
12016 104335 208766 -103433 -219142 292553 6338 42498 37737 -165802 132914 -200563
12005 -56680 -118863 -69109 -424327 -287935 -280498 -52866 184 27900 264161 75822 -377112
$$ packed form
12084b49434a15866E9582K30154f092o7185j85238E9808b82789a9541j22982A436
12072B50518o3504M71782J342687j78197G60326l27588a38852A88196J4189D6928
12061B59030j04462g0798c0640r1359C4860J05813a30162d1133G5139a38227A50859
12049a26163N5844E1161c51610A61351n6013J32758j13020D2917a12244B12432
12038a51209f8105c2934l2718A2024P5110f6427b2036p5218a1053n6721l0390
12027i8164j13539h4175I7217i7182C92461A59052a06939j16829o6296B25766
12016A04335J04431a03433j15709B92553F338L6160m761a65802A32914b00563
12005e6680o2183M9754l55218J36392P437e2866A84K7716K36261G5822c77112
$$ plain form
11993 -4936 205821 147810 14079 69538 2166 -29261 85961 -87615 -11818 -456851 -30962 -176294
11981 -176294 -105797 -130505 -184231 -158051 -27100 -271070 -107329 -331692 -75680 310506 270744
11970 270744 -392398 -11020 -14508 43685 15872 11000 -229213 -20407 -357769 21102 22245
11959 22245 -107494 152354 -133444 -54042 54288 437117 397 340029 -213858 -183270 -115462
11948 -115462 91504 -59784 271952 73655 -286483 252451 75261 -266950 111224 -55305
11937 -122629 233118 96733 142968 5201 -98806 -14678 -20273 -9677 159144 143643 -123120
11925 44145 -245132 107300 193253 205133 121430 207207 -210171 -363711 177163 -233107
11914 -162064 -183552 30550 -132163 -84291 -51966 -345453 -40005 237034 155728 256792 -148562
$$ packed form
11993d936B05821n8011A4079N5459B166b9261H5961h7615a1818m45033c0962j45332
11981a76294P0497k4708n3726K6180b7100k43970a07329k24363g5680C10506l9762
11970B70744c92398a1020l488D3685A5872m872b29213b0407l37362B1102J143
11959B2245a07494A52354a33444e4042E4288L82829C97L39632b13858L0588O7808
11948a15462I1504e9784B71952G3655b86483B52451G5261b66950A11224e5305
11937a22629B33118I6733M6235E201i8806a4678n595i677A59144j5501a23120
11925D4145b45132A07300Q5953J1880q3703Q5777b10171j53540A77163b33107
11914a62064k1488C0550a32163M7872L2325k93487d0005B37034q1306J01064a48562
$$ plain form
11902 -133793 22776 337846 -18313 -85416 76742 -125760 151718 -13385 -196241 44312 48318
11891 48318 61679 -104419 -3352 234381 -529202 -45874 42133 193327 -389202 73744 87716
11880 87716 -327457 -99025 68216 144138 -131020 142669 205138 11931 -91930 -9891 191806
11868 -109296 91379 -24469 -80605 -401609 -243824 309853 -64830 18040 -15329 199385 -16061
11856 165848 -299795 131 -249478 -107334 -331553 315889 -139526 -41852 24402 -293098
11845 35340 -233151 136006 188661 -74825 -475422 30576 137798 93543 64423 -53254 -197468
11834 -197468 -31334 148073 -108654 -136973 -157073 -179234 178078 343295 -74649 -393184
11824 -393184 -45731 -122319 -75971 116172 -370836 257245 -34583 -343025 35450 -104190
$$ packed form
11902a33793B2776L15070a8313o7103G6742a25760A51718a3385j82856D4312M006
11891D8318J3361a04419c352B34381e29202d5874D2133J51194c89202G3744J3972
11880H7716c27457i9025F8216P5922a31020A42669O2469A1931i1930i891A91806
11868a09296I1379b4469n6136l21004J57785C09853f4830A8040a5329A99385a6061
11856A65848b99795A31b49478a07334k24219C15889a39526d1852B4402b93098
11845C5340b33151A36006N2655g4825m00597C0576J07222m4255k9120e3254j44214
11834a97468c1334A48073a08654k8319k0100k2161A78078J65217g4649l18535
11824c93184d5731p6588M6348A16172c70836B57245c4583l08442C5450a04190
$$ plain form
11813 -144223 29057 57163 -186996 -118472 312917 18537 -56380 -24396 25468 -156120 -247353
11802 -247353 -114401 10982 -66877 163113 362275 -192790 -262594 -326571 -158962 34194
11791 412292 109660 243794 263219 -75221 -36885 98300 101287 -49519 116920 -194681 157299
11779 -173974 -80946 -47664 221895 234694 -251328 54627 242215 1064 -95880 85684 21518
11767 -14300 -298363 -84286 -203184 -233378 172868 73724 -169597 261428 -125596 211252
11756 -236282 50975 102060 201748 13404 -283264 -37969 -156114 362689 -241349 174095
11745 -207117 149964 -81876 64821 -59603 -15069 -110530 -143610 -279424 -113634 185260 178005
11734 178005 112476 15562 -123531 346781 -73725 51365 21163 93637 -188897 -197081 11663
$$ packed form
11813a44223B9057K8106a86996O8524C12917A8537e6380b4396B5468a56120r1233
11802b47353a14401A0982f6877A63113J99162a92790o9804o3977a58962C4194
11791D12292A09660J34134J9425g5221c6885I8300K987d9519A16920a94681A57299
11779a73974h0946L3282B21895J2799b51328E4627J87588A064i5880H5684B1518
11767a4300k84063h4286j18898l0194A72868G3724a69597B61428a25596B11252
11756b36282E0975N1085R9688A3404b83264c7969j18145C62689b41349A74095
11745b07117A49964h1876F4821e9603a5069r5461l3080j35814a13634A85260p255
11734A78005o5529A5562a23531C46781g3725E1365B1163P2474a88897q184A1663
$$ plain form
11722 -20228 -261185 91390 -156679 175216 -89000 -71302 -8560 221193 32671 349480 -130820
11710 45889 40881 -76050 120180 -3511 -217005 94981 97724 29275 -66561 306162 68572 -115462
11697 -160918 61442 -247001 73465 -30693 49396 27723 -102476 48228 111947 134720 189427
11686 189427 -107230 -214870 176907 106434 204914 62310 27086 -199902 60977 -12104 -19778
11675 -19778 89624 286145 -132169 166434 71942 -5006 -309662 142030 4718 -104411 193869
11663 -194241 -24883 3118 -117317 75200 76167 241634 36021 9543 222278 82569 73809 -320899
11650 -52045 -102840 -41079 -98928 45111 72449 -250532 -73838 -163964 -15620 -41891 112814
11638 -113654 175662 39894 -213110 259070 9739 58154 -108282 -74715 -317898 -63817 16973
$$ packed form
11722b0228k40957I1390a56679A75216h9000J7698h560B21193C2671L16809a30820
11710D5889n008g6050A20180c511k13494I4981K743B9275f6561C06162F8572a15462
11697a60918F1442b47001G3465c0693D9396k1673a02476D8228O3719K2773N4707
11686A89427a07230j07640A76907p0473R8480F2310B7086a99902F0977a2104p674
11675a9778H9624J96521a32169A66434G1942e006l04656A42030D718a04411A93869
11663a94241b4883C118a17317G5200R67J65467C6021I543K12735H2569q760c20899
11650e2045n0795d1079n7849D5111K7338b50532g3838r0126a5620k6271A12814
11638a13654A75662C9894b13110B59070I739M8415a08282L3567k43183f3817A6973
$$ plain form
11626 265734 -256777 77658 299827 -81756 169192 -26981 -13347 -167006 53649 214789
11616 214789 76304 304783 65073 -46994 124921 -166021 -14118 20293 189242 113849 -140328
11604 139346 -35090 4236 -281881 283223 -111371 178005 -19489 117086 242471 -37434
11593 -69534 -177792 203663 -155765 -152649 -360301 172509 156098 148237 199321 376953 9716
11581 10599 -16420 -46273 -181119 6034 361084 28051 -65723 387626 302062 -142252 218461
11569 -66725 95561 -83761 -198239 377033 118716 -32884 -189084 29727 32083 78152 547726
11558 547726 125608 -57018 -135084 216499 328205 171007 -77973 -18170 427927 234070
11548 234070 49528 -118867 11283 -61853 -41628 9579 -127807 -108964 240546 231471 126536
$$ packed form
11626B65734b56777G7658K22169h1756A69192b6981a3347j53659E3649J61140
11616B14789G6304K28479F5073d6994A24921a66021a4118B0293J68949p5393a40328
11604A39346c5090D236b81881B83223a11371A78005a9489A17086J25385c7434
11593f9534j08258B03663a55765L116k07652A72509j6411p861N1084J77632I716
11581A0599a6420k9853j34846F034L55050B8051f5723C87626q5564a42252B18461
11569f6725I5561h3761j14478C77033A18716c2884j56200B9727K356M6069M69574
11558E47726A25608e7018p8066B16499J11706j57198g7973a8170D27927j93857
11548B34070D9528a18867A1283f1853K0225I579a27807J8843B40546r075j04935
$$ plain form
11537 126536 2443 21377 159622 239582 68160 268480 233812 -2883 127462 433441 -22963
11525 -190300 37050 102371 21758 -5230 64106 -74173 193392 -95924 -104632 30145 -256897
11513 110398 -68145 1616 -233685 298236 37018 -150026 -49345 143753 -156239 -172730 211426
11501 367427 32961 324331 -77565 42938 169039 90185 -98347 309322 108734 -147754
11490 80756 -31349 -68601 164842 151730 -42570 146202 139565 13477 194631 16418 49852
11479 49852 276975 129694 400604 48101 -160366 15447 147788 328679 1021 191863
11469 191863 92279 166643 128526 497480 117662 -100968 52020 -147713 20082 -111225
11458 -164438 270707 97967 98205 31320 197921 -120866 -130655 431738 -100994 -21522 213064
$$ packed form
11537A26536B443J8934J38245P9960F8160K00320l4668b883A27462L05979b2963
11525a90300C7050O5321B1758e230F4106g4173A93392i5924q708C0145b56897
11513A10398f8145A616b33685B98236C7018a50026d9345A43753a56239j6491B11426
11501C67427C2961K91370g7565D2938J26101p8854i8347C09322A08734a47754
11490H0756c1349l7252A64842j3112d2570A46202o637A3477J81154A6418L3434
11479D9852K27123A29694K70910D8101a60366A5447J32341J80891A021J90842
11469A91863I2279P4364l8117L68954A17662a00968E2020a47713B0082a11225
11458a64438B70707I7967K38C1320J66601a20866r789D31738a00994b1522B13064
$$ plain form
11446 -37935 56722 94407 -131077 38830 26840 225722 224144 -303505 -18787 -100942 -66157
11435 -66157 -22290 12527 3739 214831 57427 57710 143819 -193218 -75571 39417 132796 1825
11422 167146 -157111 -165676 9937 290638 329358 -200131 6675 -89325 37181 -35346 19473
11410 97418 203613 83280 71863 301556 59820 -35414 -144086 -208764 -73849 -128886 42164
11398 -11102 -66002 -165374 -159579 -239972 -12163 44427 57418 -63014 166175 -397003 -162846
11386 -50685 200130 235557 -44126 252867 -120945 37747 174125 -158191 -28626 113734
11375 337298 -177569 122763 -132423 36391 13393 139297 247646 438055 36824 -4869
11364 -478012 -141235 146077 50986 248035 -36659 -207020 -86057 -8161 -70975 168544 246426
$$ packed form
11446c7935E6722L7685a31077C8830j1990J98882j578c03505a8787q2155L4785
11435f6157b2290A2527C739K11092E7427K83Q6109a93218g5571C9417R3379A825
11422A67146a57111q565I937K80701L8720b00131F675h9325C7181c5346A9473
11410I7418J06195H3280j1417K29693E9820c5414j08672o4678g3849n5037D2164
11398a1102n4900r9372N795q0393a2163D4427J2991f3014A66175c97003a62846
11386e0685B00130L5427d4126B52867a20945C7747J36378a58191b8626A13734
11375C37298a77569A22763a32423C6391A3393J25904J08349J90409C6824d869
11364d78012a41235A46077E0986J97049c6659j70361h6057h161o2814A68544P7882
$$ plain form
11353 246426 79873 -323242 -267114 -195772 101170 -196366 302768 6238 262708 345264 385703
11342 385703 -185509 -110047 28122 168497 346881 343564 -23733 -365668 48443 -345361 210126
11330 -85949 -35218 -211892 40197 271235 -91939 45269 26190 -29044 -82393 45303 96008
11319 96008 132807 244908 191602 -129915 -48688 45240 95404 75484 -18707 -183667 -269659
11308 -269659 265559 135661 14689 72119 149836 -59587 339820 -206872 -79215 26857 116625
11297 116625 -206269 203520 202677 -7242 468303 39371 38938 -132792 -414425 -272628 -50192
11285 345457 20769 -148372 -136636 -338312 143643 249078 -296996 47045 51249 -157163
11274 2992 169743 -358312 -35588 54664 -206284 270252 420052 -91468 -310957 219304
$$ packed form
11353B46426G9873c23242N6128P1342A01170a96366C02768F238K56470Q2556M0439
11342C85703a85509P5462B8122J40375J78384l317b3733l41935D8443c45361B10126
11330h5949c5218j76674D0197K31038i1939D5269j9079b9044n3349D5303N0705
11319I6008L6799J12101n3306a29915d8688D5240N0164j9920a8707j64960q5992
11308b69659B65559j29898A4689N7430P7717e9587C39820b06872g9215B6857Q9768
11297A16625b06269B03520q43g242D68303C9371m33a32792k81633J41797e0192
11285C45457B0769a48372J1736k01676A43643J05435b96996D7045M204a57163
11274B992J66751c58312c5588E4664b06284B70252J49800i1468k19489B19304
$$ plain form
11263 -112994 29111 -193142 -58182 1726 -229848 54676 -153014 127341 -362515 -172369
11252 -350367 35039 -592 -253899 156100 -104836 191851 -159750 -178058 -75679 -266846 65785
11240 19577 -148793 -23835 366098 -72166 -118231 -263914 127286 -215081 -179831 72088 -33774
11228 -337164 -183780 -233638 -292966 207172 -424875 18764 57838 -242832 -29535 290415
11217 93733 91734 199473 131240 17175 99707 -56651 -263539 -143727 -268289 -173146 65021
11205 -102051 -215652 10590 -168901 -33640 3916 -114773 -205494 -60573 99431 -287496 56864
11193 -268230 132821 134268 -22924 -74163 -131900 -146427 -110097 -32959 -298422 -109606 -163689
11182 -163689 -46343 -65117 89272 16152 -10171 101534 -82828 286036 -131933 -84945 118344
$$ packed form
11263a12994B9111a93142e8182A726b29848E4676a53014A27341c62515a72369
11252c50367C5039e92k53307A56100a04836A91851a59750j8308g5679j91167F5785
11240A9577a48793b3835C66098g2166m6065j45683A27286b15081L5250G2088c3774
11228c37164J53384m9858n9328B07172d24875A8764L9074b42832b9535B90415
11217I3733j999J07739o8233A7175Q2532e6651k06888J19812j24562R5143F5021
11205a02051j13601A0590a68901c3640C916a14773r0721f0573I9431b87496E6864
11193b68230A32821J447b2924n1239n7737j4527L6330c2959k65463a09606n4083
11182a63689d6343j8774H9272A6152a0171A01534h2828B86036a31933M6988A18344
$$ plain form
11170 139185 -5454 -294397 -460308 -200418 58709 439 -21461 129796 283772 -547318 -338517
11159 -338517 155671 202210 -179595 81884 249841 101684 -42357 4508 -87224 -63315 -5345
11147 -157143 -129500 110178 -231377 -340998 203545 -43659 83883 -97071 -126511 -53459 -161210
11136 -161210 129083 -156918 266968 -31247 7216 586437 198026 285418 17504 80971 305980
11125 305980 36652 316904 -219064 125636 -79711 441480 218370 -281542 247110 -304087
11114 151282 475863 79672 -130678 320903 49681 168932 15661 176585 -273002 49331
11103 -50655 -161198 -98554 138734 259057 184585 -8558 370351 -43762 370779 65149 -26150
11091 431004 487840 131603 -266679 -64318 269130 -151929 82663 138517 -286957 199941
$$ packed form
11170A39185e454k88943j65911b00418E8709D39b1461A29796J53976e47318K08801
11159c38517A55671M6539a79595H1884J67957A01684d2357D508h7224K3909e345
11147a57143K7643A10178b31377j09621B03545d3659H3883i7071k9440e3459j07751
11136a61210A29083a56918B66968c1247G216N79221A98026Q7392A7504O3467K25009
11125C05980C6652K80252b19064A25636g9711D41480B18370b81542B47110c04087
11114A51282L24581G9672a30678C20903D9681J19251A5661J60924b73002D9331
11103e0655j10543O2644A38734J20323p4472h558C70351d3762C70779F5149b6150
11091D31004N6836A31603b66679f4318B69130a51929H2663N5854b86957A99941
$$ plain form
11080 144529 108926 49800 348864 205607 266658 217411 140700 -92088 164794 554590 231686
11068 297182 218774 391276 213628 344557 195218 328479 657559 473440 537355 498200
11058 498200 525382 538996 419754 420217 646048 717105 590910 505789 956590 253491 684874
11047 684874 800913 413292 526876 748258 367600 885807 366965 714236 647688 864837
11037 864837 824571 902450 482080 726343 536038 572276 497407 443048 828666 858867 786395
11026 786395 811220 565254 580812 809683 485206 559012 817809 642935 614560 436848
11016 436848 617894 642496 424564 486637 1113957 394290 578514 864595 242794 591293
11006 591293 290666 842724 699159 536709 617859 727660 610248 413671 777689 488519
$$ packed form
11080A44529l5603D9800K99064j43257O1051m9247p6711i2088A64794L89796B31686
11068B97182p8408J72502j77648J30929j49339J33261L29080j84119O3915l9155
11058D98200K7182J3614j19242M63K25831P1057j26195q5121M50801B53491M31383
11047F84874J16039l87621J13584K21382C67600N18207C66965L47271o6548K17149
11037H64837m0266P7879m20370K44263j90305L6238p4869n4359L85618L0201p2472
11026G86395K4825k45966J5558K28871l24477P3806K58797j74874k8375j77712
11016D36848J81046K4602k17932O2073O27320C94290J84224K86081B42794L48499
11006E91293B90666N52058j43565j62450Q1150J09801j17412j96577L64018k89170
$$ plain form
10996 488519 508923 647294 560084 570639 497702 486436 580213 536528 712104 586097 870446
10985 870446 957361 939188 801527 1266871 964294 1097055 1250840 1280208 1350598 1926239
10975 1926239 1764720 2302240 2052950 2461702 2537049 2662682 2512760 2343575 2437465 1758064
10965 1758064 1873655 1446218 1326853 1499951 1349139 1446691 1516912 1989904 2011118 1560426
10955 1560426 1905377 1619060 1522572 1271636 1022244 1019785 565178 371523 357444 328354
10945 328354 151377 380883 13542 356908 202411 337003 426689 131684 227768 61596
10934 467542 392347 145674 5412 -37848 21639 303187 134733 262738 102684 51109 -323018
10922 -87169 -32827 -390 -184448 -2618 -207317 155807 124258 248169 -272539 225715 -59104
$$ packed form
10996D88519K0404J38371q7210J0555p2937j1266R3777m3685J75576j26007K84349
10985H70446Q6915j8173j37661M65344l02577J32761J53785K9368P0390N75641
10975A926239j61519N37520k49290M08752P5347J25633j49922j69185R3890o79401
10965A758064J15591m27437j19365J73098j50812R7552P0221M72992K1214m50692
10955A560426L44951k86317r6488k50936k49392k459m54607j93655j4079k9090
10945C28354A51377K29506A3542L43366j54497J34592Q9686A31684R6084F1596
10934D67542p5195A45674E412c7848B1639K81548A34733J28005A02684E1109c23018
10922h7169c2827c90j84058b618k04699A55807l1549J23911b72539B25715e9104
$$ plain form
10910 233712 322101 223145 312555 -291482 62341 138562 -27557 -66659 -130930 -202157 -242649
10899 -242649 403350 98911 44054 27893 -240760 165863 40734 -160092 68301 3353 346825
10888 346825 129225 121139 380974 -307798 -54594 123106 -246257 134748 -107813 248981
10877 -29610 99680 39017 205800 -172555 327652 -172074 86112 -119884 -76207 -55447 -84189
10866 -84189 -216582 -80592 -100056 228462 75815 44055 -200927 -35873 -292054 -102093 -138096
10855 -138096 -325005 238997 -195479 25216 -52669 -66132 -42791 215010 277013 -254662
10844 -107918 307472 196627 -147761 157683 108388 43101 93272 80421 212789 -39109
10833 -453507 129332 8867 -166034 -137202 -258746 -206078 -363604 214510 385155 116010
$$ packed form
10910B33712Q8389r8956Q9410b91482F2341P6221b7557l9102o4271p1227m0492
10899b42649D03350I8911D4054j6161b40760A65863D0734a60092F8301C353L43472
10888C46825A29225q086K59835c07798e4594A23106b46257A34748a07813B48981
10877b9610I9680C9017J66783a72555C27652a72074H6112a19884M3677K0760k8742
10866h4189j32393h0592j9464B28462G5815l1760b00927c5873k56181a02093l6003
10855a38096j86909B38997a95479B5216e2669j3463K3341B15010O2003b54662
10844a07918C07472j10845a47761A57683m9295D3101N0171j2851J32368c9109
10833d53507A29332H867a66034K8832j21544N2668j57526B14510J70645A16010
$$ plain form
10822 212620 -141904 -65859 -125069 -187318 -210867 66947 -93692 -72942 -21906 -306889 119632
10810 -234234 158661 49627 -59272 -116528 323079 -44650 -416721 -232058 -88281 156432
10799 115507 -183875 -227427 -282685 -95543 -232464 -98487 48603 534843 -190036 -27306 148495
10787 18255 -184882 -73674 -188619 231808 -148575 -254037 202629 -298229 -147352 28790
10776 -19911 155164 148444 -61884 -139116 194470 -43822 149798 -137559 119450 -336704 -22911
10764 -25941 -191086 -24918 -158796 -307781 25902 77713 144331 -230760 130624 -38839 183062
10752 -194987 -128686 6798 45609 88833 44209 -238533 -376 105835 -73318 39882 -271245
10740 -247848 -128928 -279220 239223 -367048 -275264 18500 -167057 74885 171205 -339846
$$ packed form
10822B12620a41904f5859n9210o2249k3549F6947i3692K0750b1906k84983A19632
10810b34234A58661D9627e9272n7256C23079d4650l72071J84663h8281A56432
10799A15507a83875m3552n5258i5543j36921i8487D8603M86240a90036b7306A48495
10787A8255a84882g3674j14945B31808a48575j05462B02629b98229a47352B8790
10776a9911A55164o720f1884p7232A94470d3822A49798a37559A19450c36704b2911
10764b5941j65145b4918j33878j48985B5902N1811O6618b30760A30624c8839A83062
10752a94987O6301F798L8811M3224D4209b38533c76A05835g3318C9882b71245
10740b47848J18920j50292B39223c67048R1784A8500a67057G4885R6320c39846
$$ plain form
10729 -176520 120831 -23732 290260 -111479 -28661 -146927 -15195 -121411 -150256 -119227
10719 -119227 -154100 62629 -74780 8193 -11543 4576 -134741 -223348 -52294 -252240 -216128
10708 -216128 -336474 -30196 -3426 -245435 -283542 -69260 60217 110559 -114370 50685 -260464
10696 -23934 -156784 -153866 -115979 -109214 134890 -290298 -161313 -271737 -104328 110965 -142926
10684 46537 -120956 -161024 -38714 30848 -38299 -110309 -43837 -151029 -236044 -421866 172894
10672 -265298 -68002 25337 -54877 32883 -148722 77934 -119800 11324 23889 59836 96051
10661 96051 84390 -346859 -15693 -37916 -80266 -195465 -225369 -99206 208846 349517 40599
10649 -152109 15886 -176578 271291 -208723 -45889 -127066 45160 -136282 -17174 -155918
$$ packed form
10729a76520A20831b3732B90260a11479b8661j18266a5195j06216k8845L1029
10719a19227l4873F2629g4780H193a1543D576a34741q8607e2294j99946L6112
10708b16128j20346c0196c426k42009l8107f9260F0217N0342a14370E0685b60464
10696b3934j32850K918L7887O765A34890b90298J28985j10424a04328A10965a42926
10684D6537a20956m0068c8714C0848c8299p2010d3837j07192q5015j85822A72894
10672b65298f8002B5337e4877C2883a48722G7934a19800A1324J2565L5947L6215
10661I6051j1661c46859a5693k2223m2350j15199k9904i9206B08846J40671D0599
10649a52109A5886a76578B71291b08723d5889q1177D5160a36282a7174j38744
$$ plain form
10639 -155918 17958 234890 19757 -222174 -11993 -30835 10373 -31165 -50380 -256490 40872
10627 -202280 79339 -116620 -66468 2229 26886 -638529 59347 135510 44325 103331 -132619
10615 -148651 130251 104529 45075 -81630 91491 -308574 -226921 40740 -376437 39843 -433484
10603 -74623 125650 -71297 125862 -54616 97098 -66093 304221 -103245 -127934 -88700 -146802
10592 -146802 98191 -111219 -80072 -197660 -264031 -183267 -7451 -35849 98765 89220 -221285
10580 62299 238700 -22100 -86250 -82666 303082 66658 -8204 15985 181290 266822 -402108
10568 -156392 93895 -207321 -46223 168473 74342 -151448 -146246 219451 -187351 -163874 -113936
10557 -113936 -129226 53166 122628 -330959 -246789 -62553 -46327 -18091 -2476 -64761 -113866
$$ packed form
10639a55918A7958K16932A9757b22174a1993j8842A0373c1165j9215k06110D0872
10627b02280G9339a16620N0152B229K4657f38529E9347P6163D4325N9006a32619
10615a48651A30251k5722D5075h1630I1491c08574Q1653D0740c76437C9843d33484
10603g4623A25650g1297A25862e4616I7098f6093C04221a03245k4689L9234n8102
10592a46802I8191a11219L1147j17588o6371Q0764g451k8398I8765r545b21285
10580F2299J76401b2100o4150L584C03082F6658h204A5985J65305Q5532d02108
10568a56392I3895b07321d6223A68473G4342a51448N202B19451a87351K3477M9938
10557a13936j5290E3166O9462c30959Q4170f2553J6226a8091b476o2285m9105
$$ plain form
10546 -113866 38836 -17456 44389 -69241 131811 -339952 170131 -70859 96424 58875 376188
10535 376188 -99357 37769 8198 260364 51022 -123409 -189748 -125450 212404 -117943 -93489
10524 -93489 56256 219392 40888 -9926 172610 134360 -95729 110 -23202 -126475 58421 276200
10512 276200 161171 -49541 -35807 200165 93681 -36614 -149709 86400 -110749 150091
10501 -96621 -147282 -281677 -55797 2938 170230 -40042 -91967 166077 -15724 12757 -48547
10489 -53055 -327658 -101586 161501 104423 384 214840 172261 441384 -103087 281179 452445
10478 452445 524959 187869 265144 456424 266538 -136166 124611 400225 -54327 -23818
10467 108051 -237242 50544 -30255 7788 -29519 29154 -123582 36355 -48673 165159 145907
$$ packed form
10546a13866C8836a7456D4389f9241A31811c39952A70131g0859I6424l7549L17313
10535C76188i9357C7769H198K52166E1022a23409o6339O4298B12404a17943K4454
10524i3489E6256J63136D0888i926A72610l8250i5729A10b3202j03273E8421K17779
10512B76200j15029d9541J3734B00165I3681c6614j13095H6400a10749A50091
10501i6621n0661j34395e5797B938J67292d0042n1925A66077a5724A2757d8547
10489e3055k74603a01586A61501n7078C84K14456m2579K69123a03087B81179J71266
10478D52445P2514A87869P7275J91280j89886a36166A24611K75614e4327b3818
10467A08051b37242E0544c0255G788b9519B9154a23582C6355d8673A65159j9252
$$ plain form
10456 145907 162379 -253450 -101536 102431 -2310 93464 -66253 -241219 163455 189664 -72248
10444 -109163 -100383 -143946 -14048 -343076 -11564 -40584 -58370 42839 -64095 -106261 205854
10432 -89788 -201981 33022 22625 -232999 -149641 31398 13553 -118213 135149 157890 -91586
10420 270610 -99681 137549 72449 -20657 -207452 30636 -391517 24988 49114 13142 -196666
10408 31609 -80122 8074 -58621 8433 -193569 90602 -119463 -108067 -170334 5140 94065 52730
10396 52730 100326 -14191 150552 -16430 161765 455611 20996 -45853 -101020 -93332 -19028
10384 252384 -35307 -111930 233465 136292 -105575 658142 298066 355301 144122 198388
10374 198388 115816 348245 398415 238823 89473 485354 107640 124524 114036 608038
$$ packed form
10456A45907J6472b53450a01536A02431b310I3464f6253j74966A63455K6209g2248
10444a09163Q780m3563a4048l29028a1564k9020j7786D2839f4095m2166B05854
10432h9788j12193C3022j0397b32999Q3358C1398A3553a18213A35149K2741i1586
10420B70610i9681A37549o5100b0657j86795C0636c91517B4988K4126A3142a96666
10408C1609h0122H074e8621H433a93569I0602a19463J1396o2267E140Q8925m1335
10396E2730M7596a4191A50552a6430A61765K93846B0996d5853n5167P688a9028
10384B52384c5307p6623B33465r7173a05575F58142B98066N7235A44122N4266
10374A98388q2572K32429N0170j59592H9473L95881A07640J6884j0488M94002
$$ plain form
10364 608038 528756 296521 -34720 439572 351608 -79189 355912 212502 174323 108272 128755
10353 128755 -130801 256343 721826 73190 389958 392061 -159880 402070 97301 272143
10343 272143 216947 85910 463882 479951 114107 91460 1860 113969 117792 -134752 29558
10331 -32519 86496 300874 617 36634 206545 -253832 21708 112034 89729 28560 224675
10320 224675 108367 93303 26538 69735 41038 -216960 78319 -287 -316330 -59905 -125816
10309 -125816 86619 88405 -119742 -449138 82988 56942 18610 -66406 -406475 59578 23135
10297 36191 431360 135731 95345 42189 -170059 82182 97039 123332 103039 -78395 -173705
10286 -173705 -126416 -160416 234975 -144477 -211639 182825 -46767 -5159 -74412 -86709 308844
$$ packed form
10364F08038p9282k32235c4720D39572q7964g9189C55912j43410l8179o6051K0483
10353A28755a30801B56343M65483G3190L16768K103a59880D02070I7301J74842
10343B72143n5196H5910L77972J6069A14107k2647A860J12109L823a34752B9558
10331c2519H6496K14378F17L6017J69911b53832B1708R0326k2305B8560J96115
10320B24675A08367j5064B6538M3197k8697b16960G8319b87l16043e9905o5911
10309a25816H6619J786a19742l29396H2988k6046A8610f6406l40069E9578B3135
10297C6191L95169A35731m0386D2189a70059H2182J4857K6293k0293g8395r5310
10286a73705M7289l4000B34975a44477o7162A82825d6767e159o9253j2297C08844
$$ plain form
10274 91640 -31242 151435 200795 -218941 156063 -169208 147504 -443652 -178886 -214347
10264 -214347 -276534 -77482 141465 483487 169907 93974 168879 409134 310398 351408 549628
10253 549628 269602 -159889 -49986 -202864 -23639 -133904 -153531 140728 -241062 -314221
10243 -314221 79916 -161468 -187966 16459 -54445 181240 -340952 5630 -105621 -199372 -211202
10232 -211202 -87558 189653 -117946 229517 -206863 -50025 213760 -63329 16060 -215124
10221 -2232 -210801 -232727 -379909 -7017 47059 137444 -257898 45772 259484 -61789 -26652
10209 12111 47595 -11279 207443 -88319 -255737 87536 -179076 114494 -13733 -35783 -126720
10198 -126720 -210343 -106604 258799 101410 -195311 -216842 -308645 195899 69044 33855
$$ packed form
10274I1640c1242A51435M9360b18941A56063a69208A47504d43652a78886l5461
10264b14347o2187g7482A41465L42022A69907p5933P4905K40255r8736M1010J98220
10253E49628B69602a59889d9986j52878b3639j10265j9627A40728b41062p3159
10243c14221G9916a61468k6498A6459e4445A81240c40952E630a05621r3751j1830
10232b11202h7558A89653a17946B29517b06863e0025B13760f3329A6060b15124
10221b232k08569k1926j47182g017D7059R0385b57898D5772K13712f1789b6652
10209A2111L5484a1279B07443h8319j67418H7536a79076A14494a3733k2050r0937
10198a26720q3623J03739B58799A01410a95311k1531r1803A95899F9044C3855
$$ plain form
10187 638 20075 -42717 -57621 -56560 -111772 -103987 407288 54595 -225656 -21994 -4157 -418963
10175 -418963 -124618 -437447 192753 162153 -293110 75149 28260 -34785 29248 89838 -139671
10163 -29984 -94295 24085 44607 84251 177388 -49604 85725 -134402 -209348 -83436 174085
10151 -93105 -127428 -271447 90720 -155095 12743 -98412 -85146 156287 -441559 -169830 253371
10139 51984 -193002 85044 -364509 -69080 -108444 93649 -92694 68518 -108400 -76478 120383
10127 10755 151661 64990 378542 -207633 -283033 35426 181205 152575 26903 -147387 96324
10115 -111364 -119194 43797 99811 -133230 -297948 -136366 41166 31177 -262271 76282 185484
10104 185484 -212385 -11205 -257357 147772 -344455 -260367 202376 -155183 -23457 -41470
$$ packed form
10187F38J9437d2717j4904J061n5212P785D07288E4595b25656b1994d157m14806
10175d18963a24618l12829A92753l0600b93110G5149B8260c4785B9248O0590a39671
10163b9984o4311B4085K0522L9644R3137d9604H5725a34402p4946h3436A74085
10151i3105l4323j44019I0720a55095A2743i8412J3266A56287d41559a69830B53371
10139E1984a93002H5044c64509f9080l9364I3649i2694F8518a08400L1922A20383
10127A0755J40906F4990L13552b07633p5400C5426J45779k8630B6903a47387I6324
10115a11364p830D3797N6014a33230j64718a36366D1166r989b62271G6282J09202
10104A85484b12385a1205k46152A47772c44455Q4088B02376a55183b3457j8013
$$ plain form
10094 -41470 -322775 225300 -239397 -122535 92650 -326416 82790 276869 -172828 -34731
10083 -157174 -355016 239503 160489 -86144 123235 7509 -112408 -109931 69036 -207104 -291099
10072 -291099 206766 296107 -73856 92636 74776 41887 7913 -36322 -283100 -230612 45393
10060 153878 61055 -115345 -420070 74993 -138144 -236958 -50527 -18454 -265622 -199844 22413
10048 -123952 299095 -373279 -28937 -111691 -113710 163413 76502 -184788 -196908 -124159 -43063
10036 -273699 162884 -132541 -149392 65603 -26124 -230607 -48532 79354 -95238 -159154 -250139
10025 -250139 -60523 -103396 -203909 -128702 -235725 -10514 -255709 -244829 3408 -34829 -372756
10014 -372756 -59359 95466 -130915 -136809 -107867 -192379 164873 -134629 -14140 66524 -169363
$$ packed form
10094d1470k81305B25300b39397J16862I2650c26416H2790J94079a72828c4731
10083a57174j97842B39503p9014h6144A23235G509a12408K477F9036b07104q3995
10072b91099B06766Q9341g3856I2636j7860l2889G913c6322k46778N2488D5393
10060A53878F1055a15345l04725G4993a38144r8814e0527a8454k47168O5778B2413
10048a23952B99095c73279b8937q2754k019A63413G6502a84788j2120P2749d3063
10036b73699A62884a32541j6851F5603b6124k04483d8532G9354i5238o3916r0985
10025b50139f0523m2873j00513P5207j07023a0514k45195J0880C408c4829l37927
10014c72756e9359I5466a30915n894K8942q4512A64873a34629a4140F6524a69363
$$ plain form
10002 30854 -57936 -172844 -340249 -200832 -375710 -313275 -30146 -385504 253916 136337
9992 136337 285197 -116869 -178415 -64727 104467 -82466 -182878 -15407 38873 -128775 -244257
9981 -244257 -60692 354374 -82091 -247875 -172731 -68417 11895 -94705 125694 217716 -352452
9969 8973 42616 -17821 158076 -130746 20097 -132780 -241585 -110614 19684 -221085 -134783
9958 -134783 -203595 201245 192466 126634 -44733 16536 -8486 -133203 -283917 -52881 -146295
9947 -146295 -330403 -210106 45714 -39345 -15919 -48013 -158566 1553 -179459 28812 -144072
9935 -329952 -215473 90185 -29956 -195809 -240069 21027 -229187 -348683 65788 138425 -259316
9923 -119044 -149618 131758 -334118 20409 30626 116756 -43709 -33184 193190 -55179 57276
$$ packed form
10002C0854e7936j14908j67405J39417j74878O2435c0146l55358B53916j17579
9992A36337J48860a16869o1546f4727A04467h2466j00412a5407C8873a28775j15482
9981b44257f0692C54374h2091j65784P5144f8417A1895i4705A25694R2022c52452
9969H973L3643a7821A58076a30746B0097a32780j08805a10614A9684b21085Q6302
9958a34783o8812B01245q779o5832d4733A6536h486j24717j50714e2881r3414
9947a46295j84108J20297D5714c9345a5919l2094j10553A553a79459B8812a44072
9935c29952J14479I0185b9956j65853m4260B1027b29187j19496F5788P2637b59316
9923a19044l0574A31758c34118B0409J0217Q6130d3709J0525A93190e5179E7276
$$ plain form
9911 90744 125798 14128 53160 -148060 193122 -154835 127274 104443 -130369 -111520 76590
9899 -312918 605476 -253043 -80998 -13279 -204853 -177194 -270336 -42371 244807 -270824 -9372
9887 -46171 134374 -411068 -56831 -219514 -17186 71801 283198 334865 60786 -62923 -154752
9876 -154752 -349849 -60377 -121464 -497330 -269271 35069 226891 -50964 177596 -343169
9865 -63276 77361 -234879 195309 102696 -32619 119520 158381 49882 200241 -70275 51880
9853 257337 -149227 160752 -311460 -47258 -38066 -7030 -81545 209221 -407999 -122737 -112272
9842 -112272 -327986 241022 2799 -6147 -178375 -53081 -122230 -3113 76568 63108 50345 -142923
9829 -188625 20385 -82287 45813 -385593 6070 312321 -165666 -276562 140938 -121322 348353
$$ packed form
9911I0744L5054A4128L9032a48060A93122a54835A27274k2831a30369J8849G6590
9899c12918F05476b53043h0998a3279j91574K7659r3142d2371B44807b70824i372
9887d6171A34374d11068e6831j62683a7186G1801K11397N1667F0786f2923r1829
9876a54752j95097f0377o1087l75866K28059C5069J91822e0964A77596c43169
9865f3276G7361b34879A95309r2613c2619A19520L8861D9882J50359g0275E1880
9853B57337a49227A60752c11460d7258R192g030p4515B09221d07999a22737J0465
9842a12272k15714B41022B799f147j72228e3081o9149c113G6568j3460j2763a42923
9829a88625B0385h2287D5813c85593F070L06251a65666j10896A40938a21322C48353
$$ plain form
9817 -172701 10856 13332 -52089 -26387 -60662 254436 -213076 748 256095 70551 -35954 -421108
9805 -421108 -82439 -11139 262284 -99194 -218885 -232890 93631 -401337 -162215 -261464 -133186
9794 -133186 43264 160336 57731 152642 -44810 -94496 37794 160982 195559 178681 -97694
9782 -60416 -89550 -37353 52187 -187774 248083 -1499 -648534 -156949 -84564 -286928 -220726
9771 -220726 261351 94405 32684 98250 118059 -20709 -84313 -181613 -39304 -250828 -63154
9759 -53174 72059 -312520 -84394 45284 -134574 -265889 -220691 104251 -109278 -236628 -39048
9747 -11429 -75408 -203781 14912 251891 95351 13148 210557 52122 -97148 -221184 15159
9735 -104653 -221813 -156622 -79316 -151700 -139389 -166327 162495 -359397 -162394 80695 -558412
$$ packed form
9817a72701A0856K476e2089K5702l4275B54436b13076G48K55347G0551c5954l85154
9805d21108h2439a1139B62284i9194j19691j4005I3631d01337a62215r9249J28278
9794a33186D3264J17072E7731R4911d4810m9686C7794J23188L4577j6878i7694
9782f0416k9134c7353E2187a87774B48083a499o47035a56949P2385k02364O6202
9771b20726B61351I4405C2684O5566J9809b0709o3604r7300c9304k11524f3154
9759e3174G2059c12520h4394D5284a34574j31315M5198A04251a09278j27350c9048
9747a1429o3979j28373A4912K36979I5351A3148J97409E2122i7148j24036A5159
9735a04653j17160O5191P7306p2384J2311k6938A62495c59397a62394H0695e58412
$$ plain form
9723 -147505 -200459 -4486 -187221 -376147 -98346 131222 -191856 25899 -175217 -150841 -381533
9712 -381533 -71925 -144381 -60773 100836 -43282 125178 -195671 -204849 168550 295507 -246824
9700 -51690 -236691 -17717 -9018 -225034 -172761 -46144 99320 33373 -234333 190506 149191
9689 149191 -171369 66461 344671 2793 163952 4874 141298 -86878 -49287 36862 6861
9677 -87360 -22015 -88967 245942 37041 -212354 -78925 -121151 -150025 243542 -15536 -119295
9666 -119295 51570 193610 80334 -85344 -216421 -328155 -41010 88454 -260605 -91380 -21906
9654 307825 -241800 25369 202012 272715 77875 -216502 -212188 7224 55722 -14332 -248296
9643 -248296 12893 168152 -515313 191853 -313625 -101693 98489 168224 194355 111748 -38494
$$ packed form
9723a47505n2954d486j82735j88926i8346A31222a91856B5899a75217K4376k30692
9712c81533g1925p2456f0773A00836d3282A25178a95671r178A68550J26957b46824
9700e1690j85001a7717Q699k16016N2273d6144I9320C3373b34333A90506m1315
9689A49191a71369F6461K78210B793J61159D874J36424h6878L7591C6862F861
9677h7360b2015o6952B45942C7041b12354g8925m2226k8874B43542a5536j03759
9666a19295E1570J42040H0334h5344j31077j11734d1010H8454b60605i1380b1906
9654C07825b41800B5369J76643P0703G7875b16502M314G224M8498a4332k33964
9643b48296A2893J55259e15313A91853c13625a01693I8489O9735K6131q2607c8494
$$ plain form
9631 157614 -34141 -89628 -103018 -196050 -36064 -375364 59296 -117025 -182639 -69706 -122865
9620 -122865 -313511 -384368 -1333 64595 -347446 8289 45667 -136477 -79294 -148175 161439
9608 148451 -281963 -110321 -215478 15695 -8377 -340115 -280994 -85968 -62926 -153338 13714
9596 102721 -68697 162731 -231987 87162 -7001 225861 -264582 21139 -23859 -367203 70374
9584 -177848 -173523 -281411 -379198 206055 -35275 5243 -367520 -286969 76779 -241860 -459125
9573 -459125 211236 -295939 148693 124998 -80245 57243 -293036 -344806 24283 164056 -69361
9561 406842 287925 -296677 -337755 -150894 -106678 -58918 -92883 39421 104886 -120875 -322588
9550 -322588 -83816 -97081 -103838 -437691 -112328 -24558 109424 -9139 311044 48500 213691
$$ packed form
9631A57614c4141n5487j3390r3032c6064l39300E9296a17025o5614f9706n3159
9620a22865j90646p0857a333F4595c47446H289L7378a36477N7183o8881A61439
9608A48451b81963a10321j05157A5695h377l31738N9121h5968K3042r0412A3714
9596A02721f8697A62731b31987H7162g001B25861b64582B1139b3859l43344G0374
9584a77848M325j07888r7787B06055c5275E243c67520Q0551G6779b41860k17265
9573d59125B11236b95939A48693k3695h0245E7243b93036n1770B4283J39773f9361
9561D06842j18917b96677m1078a50894M4216M7760l3965C9421O5465a20875k01713
9550c22588h3816j3265o757l33853a12328b4558A09424i139C11044D8500J65191
$$ plain form
9539 213691 125670 -82145 -368852 -97850 -282045 232359 182450 174126 -394106 -157416 25126
9527 122401 32707 60920 -38497 -342734 -104557 10342 271 169992 156648 -202305 -370225
9516 -370225 128537 -216292 70203 146006 -156694 -34953 -177971 115515 62019 -235518
9505 12519 -14117 -83301 26362 74417 64424 -294496 -267436 -181816 144641 10301 13953 -233743
9492 42458 -306577 27386 -23952 -103899 -174436 -284027 -233870 -321696 -222401 218660 -96004
9480 148772 -191191 -161534 -266633 -334464 -31304 -128492 55325 -319916 3739 33130 -124630
9468 -412009 -28450 122740 238347 39058 -50303 -405710 -223730 -232585 189301 -165436 -99486
9457 -99486 -715910 153478 30830 -173693 -111049 -300680 -290030 21550 -7792 329027 -104883
$$ packed form
9539B13691q8021h2145k86707i7850j84195B32359m9909q324c94106a57416B5126
9527A22401C2707K8213c8497l04237a04557A0342B71J69721j3344b02305j67920
9516c70225A28537b16292G0203P5803a56694c4953j43018A15515n3496b35518
9505A2519a4117o9184B6362M8055r993b94496K7060Q5620A44641A0301L652b33743
9492D2458c06577B7386b3952p9947p0537j09591N0157q7826R9295B18660i6004
9480A48772a91191K9657j05099o7831c1304r7188E5325c19916C739K9391a24630
9468d12009b8450A22740J15607C9058e0303l55407J81980q855A89301a65436O5950
9457i9486o16424A53478C0830a73693O2644j89631J0650B1550g792C29027a04883
$$ plain form
9445 -299641 172921 -196818 -16606 -45439 -122350 -527198 -5650 49928 -347240 -190030 -268192
9434 -268192 -43686 103228 -41477 -20475 -92126 18724 -146696 -175431 -357401 -35533 -110975
9423 -110975 69382 -206117 212959 304637 -42467 -223904 -222840 39840 196882 -116472 -412189
9412 -412189 73917 96686 57744 8771 -970 -147404 270774 276615 -81639 -339759 -85432 -62115
9400 -62115 111383 -49656 -248093 -12386 156769 -98537 -146443 168057 -105104 -54876 175010
9388 -177239 46419 137709 -89818 226160 83738 -174061 -82556 -49601 -140791 80867 -133690
9376 -177874 -4668 265692 209325 -29515 100921 -57957 -92260 -353401 -103565 -11532 -278171
9365 -278171 -54223 -253273 -6689 50959 -79366 -101193 45454 -109576 -464917 173635 162947
$$ packed form
9445b99641A72921a96818a6606k8833p6911m04848e650D9928c47240J57210p8162
9434b68192d3686A03228d1477b0475p1651A8724a46696k8735j81970c5533p5442
9423a10975F9382b06117B12959R1678d2467j81437J064C9840J57042a16472k95717
9412d12189G3917K2769l8942H771i70j46434B70774N841h1639k58120h5432K3317
9400f2115A11383d9656j98437a2386A56769i8537m7906A68057a05104N0228A75010
9388a77239D6419R1290h9818B26160H3738a74061h2556L2955r1190H0867a33690
9376a77874d668B65692n6367b9515A00921e7957l4303k61141a03565a1532k66639
9365b78171e4223j99050f689E0959g9366k1827D5454a09576l55341A73635j0688
$$ plain form
9354 162947 -165952 -246643 48720 -35545 -248955 -157134 -1768 -87051 85294 -200379 -7624
9342 -294526 -119187 -50481 83324 -91950 -303946 50752 13021 -161967 14206 -134950 -171914
9331 -171914 12472 6272 -506050 58888 -344514 190323 -219836 -200817 65681 -281675 125375
9319 81520 94489 43417 -10119 8010 174237 -288012 184407 -437836 99739 350515 83009
9307 -137962 -30518 -173301 -182347 -63367 78411 -32852 -142317 -43602 -121210 45273 56459
9296 56459 -64471 192347 -152081 294685 131791 45001 -4068 279205 11094 -93618 -358866
9285 -358866 -219863 -70104 -195744 -122469 -55016 -218795 157627 -164056 -179042 166322
9274 -365108 -277903 63347 27453 60623 243385 -85944 116488 14951 66846 -113432 -65244
$$ packed form
9354A62947a65952q0691D8720c5545k13410R1821a768q5283H5294b00379g624
9342b94526a19187e0481H3324i1950k11996E0752A3021a61967A4206a34950l6964
9331a71914A2472o200e06050E8888c44514A90323b19836J9019F5681b81675A25375
9319H1520J2969D3417a0119H010J66227b88012A84407d37836I9739K50776H3009
9307a37962c0518j42783r046f3367G8411c2852j09465d3602p7608D5273J1186
9296E6459f4471A92347a52081B94685A31791D5001d068B79205A1094i3618k65248
9285c58866J39003g0104j25640P3275e5016j63779A57627a64056j4986A66322
9274c65108Q7205F3347B7453L3170J82762h5944A16488A4951N1895a13432M8188
$$ plain form
9263 -65244 -430959 -170657 3459 -125514 47444 143005 -235158 195504 -28969 -108354 -271168
9252 -271168 104100 -341824 81854 -347680 30984 87611 -372455 47520 -23329 -240334 38704
9240 -184306 -161517 3981 51000 -59104 -8524 -344902 33791 210739 -49392 -505586 41307
9228 -126022 -126712 -45330 100076 -167037 100801 -70700 -44920 -127174 -14097 212218 -87015
9216 -212667 -130400 -162292 171987 98380 -53333 -313933 -8104 925 -158602 -519918 -180417
9204 -273835 -119321 249104 138238 -273321 -336288 -187910 286215 -83128 -105968 59465
9193 216318 -99785 -146263 83679 -28917 200710 107467 24698 -131932 233308 -180409 91642
9181 -39270 43481 -268974 -141561 -158421 -189873 3754 -110598 372710 20154 -7902 -112663
$$ packed form
9263f5244l65715a70657C459a25514D7444R5561b35158A95504b8969p9385j62814
9252b71168A04100c41824H1854c47680C0984N6627c72455D7520b3329k17005C8704
9240a84306K2789C981M7019e9104h524l36378C3791J76948d9392m56194D1307
9228a26022o90d5330A00076a67037A00801g0700K5780q2254a4097B12218h7015
9216b12667Q2267l1892A71987p3607e3333k60600h104I25a58602l61316a80417
9204b73835a19321B49104j10866b73321o2967J48378B86215h3128k2840E9465
9193B16318i9785m6478H3679b8917B00710r3243B4698a31932B33308a80409I1642
9181c9270D3481b68974J27413j6860l1452C754a10598C72710B0154g902j04761
$$ plain form
9170 -112663 134007 -13780 141524 120096 21233 -92308 -400510 -206029 -67817 99669 -315457
9158 67468 -176992 28070 -156525 -202317 200234 120862 118511 29972 -16262 -68401 -131300
9147 -131300 -537100 58824 24090 -5836 -299520 -52129 -54387 -165715 38682 -562049 -86527
9135 245754 -537378 242266 -64497 -134472 -54158 -108686 99173 -288666 189849 -267468 -106173
9123 31778 210735 84635 -176321 -252751 -250727 13717 -206280 -291294 187013 -44040 154689
9111 -75608 -44110 -78594 -221136 -48258 24255 224359 -151278 -254774 -37086 -144653 -285181
9100 -285181 -183390 -115553 -212342 -24541 152582 33230 -53680 148040 19479 -263634 -40785
9088 -106162 100711 -35080 186075 33824 65926 -507049 -46909 -138321 58562 -484564 -68788
$$ packed form
9170a12663A34007a3780A41524k1428B1233i2308l08202J94481f7817I9669c15457
9158F7468a76992B8070a56525m5792B00234p9372k351B9972a6262n2139o2899
9147a31300m05800E8824B4090e836k93684e2129k258j11328C8682e62049h6527
9135B45754e37378B42266f4497o9975e4158n4528I9173b88666A89849b67468a06173
9123C1778J78957H4635a76321p6430K024A3717b06280q5014A87013d4040A54689
9111g5608L1498l4484j42542d8258B4255K00104a51278j03496c7086j07567j40528
9100b85181J01791O7837r6789b4541A52582C3230e3680A48040A9479b63634d0785
9088a06162A00711c5080A86075C3824L2102e07049d6909r1412E8562d84564f8788
$$ plain form
9076 162189 -60810 -2669 -325349 -180463 -320511 -53112 154995 54519 -49898 -23438 -114071
9065 -114071 -191406 -49970 58119 -86272 144643 200601 -157028 -265173 -47341 102809 107688
9054 107688 -53681 -188740 -245126 28965 -200850 -270543 -168926 145521 -101338 -170711 129080
9042 51807 -256655 -192354 -154251 133656 -190350 -48011 1674 156324 -15694 -42745 -99107
9031 -99107 -226117 -61762 17782 -52418 -78563 -7114 -234257 137997 36964 162977 -96630
9019 149824 -159035 -66164 -216151 -13040 -69909 -77191 7247 -94663 -467052 354005 97794
9007 85401 -109395 76499 124400 -186326 -246228 -95427 260329 17630 -38254 -324119 -286841
8996 -286841 -14414 -235626 342176 23990 -323995 -129549 56202 -231809 216081 -135344
$$ packed form
9076A62189f0810b669l22680J44886j40048e3112A54995E4519d9898b3438r0633
9065a14071p7335d9970E8119h6272A44643N5958a57028j08145d7341A02809M879
9054A07688e3681j35059n6386B8965b00850o9693J01617A45521a01338o9373A29080
9042E1807b56655O4301L8103A33656a90350d8011A674J54650a5694k7051n6362
9031i9107j27010f1762A7782e2418k6145g114k27143A37997C6964J26013i6630
9019A49824a59035f6164j49987a3040n6869p282G247i4663l72389C54005I7794
9007H5401a09395G6499M7901a86326n9902i5427B60329A7630c8254k85865L7278
8996b86841a4414k21212C42176B3990c23995a29549E6202b31809B16081a35344
$$ plain form
8985 37333 -87845 -70874 50434 243260 19916 104914 -158355 333433 46212 115273 5897
8973 -12151 -202530 -111434 -183609 -125118 -330694 62401 163530 -142459 84049 -132416 -288275
8962 -288275 -315742 -74863 -130014 -106153 -213588 4617 60990 177576 89645 -106317 223704
8950 148338 -295117 127326 -197911 -314770 -235088 -249225 -60840 -145432 -177111 232295 342787
8939 342787 330759 -21400 -443160 422091 217908 610384 103496 -157792 -231991 53492
8928 -292573 119045 -5959 422926 727959 904532 2623924 9111448 16143330 4930481
8918 1569489 787843 856938 749102 -256396 8732 -60144 117917 -164885 97373 350365
8908 350365 254448 -197812 175116 194888 180802 -33722 -194255 9108 -69696 192974 127334
$$ packed form
8985C7333h7845J6971E0434J92826A9916Q4998a58355C33433D6212O9061E897
8973a2151j90379R1096p2175N8491k05576F2401J01129a42459H4049a32416j55859
8962b88275k7467g4863n5151K3861j07435D617N6373J16586q7931a06317B23704
8950A48338b95117A27326a97911j16859P9682j4137f0840q4592l1679B32295J10492
8939C42787j2028b1400m21760D22091k04183L92476A03496a57792p4199E3492
8928b92573A19045e959D22926L05033J76573J719392O487524P031882D930481
8918A569489p81646O9095j07836b56396H732f0144A17917a64885I7373K52992
8908C50365r5917a97812A75116J9772j4086c3722j60533I108f9696A92974o5640
$$ plain form
8897 127334 108818 -363976 3211 -103211 68333 209283 -47518 6915 -182410 -109622 1116
8885 -186050 18807 -54066 -460557 150003 14236 71311 -283405 169293 -262619 69177 30664
8873 214626 -27457 60062 27562 1301 -163191 -353234 -294413 -225064 -186994 -80688 32783
8861 -77203 13789 -179747 -62937 106473 138193 -160330 -276091 78367 -170885 -300021 -198699
8850 -198699 206726 101661 -137482 -81407 192829 152413 -254141 -60463 -380561 -282848
$$ packed form
8897A27334j8516c63976C211a03211F8333J40950d7518F915a82410P2788A116
8885a86050A8807e4066m06491A50003A4236N7075b83405A69293b62619F9177C0664
8873B14626b7457F0062B7562A301a63191j90043N8821O9349L8070h0688C2783
8861g7203A3789a79747f2937A06473L1720a60330j15761G8367a70885j29136J01322
8850a98699B06726A01661a37482N6075A92829m0416b54141f0463l20098R7713
$$ [...]
##END NTUPLES=NMR SPECTRUM
##END=
