##TITLE=AC1559_ROEFFECT0017_8269235_DeYnO6ElXE
##JCAMPDX= 6.0         $$ Bruker NMR JCAMP-DX V2.0
##DATA TYPE= NMR SPECTRUM
##DATA CLASS= NTUPLES
##ORIGIN= BRUKER
##OWNER= Administrator
$$ 1.72 TOPSPIN		Version 2.1
$$ 2013-10-18 16:07:57.471 -0700  Administrator@X
$$ Compression mode = diff/dup
##.OBSERVE FREQUENCY= 400.02188249412
##.OBSERVE NUCLEUS= ^1H
##.ACQUISITION MODE= SIMULTANEOUS (DQD)
##.ACQUISITION SCHEME= undefined
##.AVERAGES= 64
##.DIGITISER RES= 22
##SPECTROMETER/DATA SYSTEM= spect
##.PULSE SEQUENCE= noesygpps1d.comp
##.SOLVENT NAME= COFFEE_meoh
##.SHIFT REFERENCE= INTERNAL, COFFEE_meoh, 1, 14.96109
##AUDIT TRAIL= $$ (NUMBER, WHEN, WHO, WHERE, PROCESS, VERSION, WHAT)
$$ ##TITLE= Audit trail, TOPSPIN		Version 2.1
$$ ##JCAMPDX= 5.01
$$ ##ORIGIN= Bruker BioSpin GmbH
$$ ##OWNER= Administrator
$$ $$ E:\/data/COFFEE/nmr/AC1559_ROEFFECT0017_8269235_DeYnO6ElXE/12/pdata/1/auditp.txt
$$ ##AUDIT TRAIL=  $$ (NUMBER, WHEN, WHO, WHERE, PROCESS, VERSION, WHAT)
(   1,<2013-10-18 16:07:52.675 -0700>,<Administrator>,<X>,<go>,<TOPSPIN 2.1>,
      <created by zg
	started at 2013-10-18 15:56:22.459 -0700,
	POWCHK enabled, PULCHK disabled,
       configuration hash MD5:
       C8 4E 4E 5D D3 5C D8 9E 9F 52 82 E0 59 8A DE 15
       data hash MD5: 64K
       31 23 79 84 05 3B 53 B0 F3 65 46 08 AC 08 79 16>)
(   2,<2013-10-18 16:07:55.628 -0700>,<Administrator>,<X>,<proc1d>,<TOPSPIN 2.1>,
      <Start of raw data processing
       efp LB = 0.3 FT_mod = 6 PKNL = 1 PHC0 = 0 PHC1 = 0 SI = 128K 
       data hash MD5: 128K
       01 86 09 54 C4 6C 3F 90 10 5D 2E 85 2C 9F A7 63>)
(   3,<2013-10-18 16:07:56.550 -0700>,<Administrator>,<X>,<proc1d>,<TOPSPIN 2.1>,
      <pk PHC0 = -82.6062 PHC1 = 0 
       data hash MD5: 128K
       4A F9 95 AD B7 A2 C7 7F E3 F2 84 59 31 94 9E C0>)
(   4,<2013-10-18 16:07:56.909 -0700>,<Administrator>,<X>,<proc1d>,<TOPSPIN 2.1>,
      <abs ABSG = 1 
       data hash MD5: 128K
       5B 96 0B 8A 03 E8 B8 EA 9D A1 BC 13 05 3F 5E 72>)
(   5,<2013-10-18 16:07:57.003 -0700>,<Administrator>,<X>,<proc1d>,<TOPSPIN 2.1>,
      <abs ABSG = 2 
       data hash MD5: 128K
       35 13 82 6D A2 16 54 61 E9 7C 89 67 02 20 3D F2>)
(   6,<2013-10-18 16:07:57.096 -0700>,<Administrator>,<X>,<proc1d>,<TOPSPIN 2.1>,
      <abs ABSG = 3 
       data hash MD5: 128K
       F5 7C CB 25 14 61 38 DF 3D C5 26 FF E2 F3 B0 6E>)
(   7,<2013-10-18 16:07:57.190 -0700>,<Administrator>,<X>,<proc1d>,<TOPSPIN 2.1>,
      <abs ABSG = 4 
       data hash MD5: 128K
       1D 46 F6 67 D1 2F 3A 4A 4D 5D CD 22 4A CE C9 72>)
(   8,<2013-10-18 16:07:57.268 -0700>,<Administrator>,<X>,<proc1d>,<TOPSPIN 2.1>,
      <abs ABSG = 5 
       data hash MD5: 128K
       A4 AC AD 4E 30 4F D5 A9 3D 5D 35 07 A0 AD 0B FE>)
$$ ##END=
$$ 
$$ $$ hash MD5
$$ $$ F1 A4 7B 44 98 16 67 7C AD DE D2 70 9C 90 D4 E0
##$RELAX= 
##$RELAX= 
##$RELAX= 
##$RELAX= 
##$RELAX= 
##$RELAX= 
##$RELAX= 
##$RELAX= 
$$ Bruker specific parameters
$$ --------------------------
##$DU= <E:\>
##$EXPNO= 12
$$ [...]
150 150 150 150 150 150 150 150
##$TP07= 0
##$TPNAME0= <>
##$TPNAME1= <>
##$TPNAME2= <>
##$TPNAME3= <>
##$TPNAME4= <>
##$TPNAME5= <>
##$TPNAME6= <>
##$TPNAME7= <>
##$TPOAL= (0..7)
0.5 0.5 0.5 0.5 0.5 0.5 0.5 0.5
##$TPOFFS= (0..7)
0 0 0 0 0 0 0 0
##$TUNHIN= 0
##$TUNHOUT= 0
##$TUNXOUT= 0
##$USERA1= <user>
##$USERA2= <user>
##$USERA3= <user>
##$USERA4= <user>
##$USERA5= <user>
##$V9= 5
##$VALIST= <valist>
##$VCLIST= <CCCCCCCCCCCCCCC>
##$VD= 0
##$VDLIST= <DDDDDDDDDDDDDDD>
##$VPLIST= <PPPPPPPPPPPPPPP>
##$VTLIST= <TTTTTTTTTTTTTTT>
##$WBST= 1024
##$WBSW= 4
##$XGAIN= (0..3)
0 0 0 0
##$XL= 0
##$YL= 0
##$YMAX_a= 6050421
##$YMIN_a= -13018180
##$ZGOPTNS= <>
##$ZL1= 120
##$ZL2= 120
##$ZL3= 120
##$ZL4= 120
##$ABSF1= 14.96109
##$ABSF2= -5.597092
##$ABSG= 5
##$ABSL= 3
##$ALPHA= 0
##$AQORDER= 0
##$ASSFAC= 0
##$ASSFACI= 0
##$ASSFACX= 0
##$ASSWID= 0
##$AUNMP= <proc_prof1d_extract.lims>
##$AXLEFT= 0
##$AXNAME= <>
##$AXNUC= <1H>
##$AXRIGHT= 0
##$AXTYPE= 0
##$AXUNIT= <>
##$AZFE= 0.1
##$AZFW= 0.1
##$BCFW= 0
##$BC_mod= 0
##$BYTORDP= 0
##$COROFFS= 0
##$CY= 15
##$DATMOD= 1
##$DC= 0
##$DFILT= <>
##$DTYPP= 0
##$F1P= 0
##$F2P= 0
##$FCOR= 0.5
##$FTSIZE= 131072
##$FT_mod= 6
##$GAMMA= 0
##$GB= 0
##$INTBC= 1
##$INTSCL= 1
##$ISEN= 128
##$LB= 0.3
##$LEV0= 0
##$LPBIN= 0
##$MAXI= 10000
##$MC2= 0
##$MEAN= 0
##$ME_mod= 0
##$MI= 0
##$NCOEF= 0
##$NC_proc= -2
##$NLEV= 6
##$NOISF1= 0
##$NOISF2= 0
##$NSP= 0
##$NTH_PI= 0
##$NZP= 0
##$OFFSET= 14.96109
##$PC= 1
##$PHC0= -82.6062
##$PHC1= 0
##$PH_mod= 1
##$PKNL= yes
##$PPARMOD= 0
##$PPDIAG= 0
##$PPIPTYP= 0
##$PPMPNUM= 2147483647
##$PPRESOL= 1
##$PSCAL= 4
##$PSIGN= 0
##$PYNMP= <proc.py>
##$REVERSE= no
##$SF= 400.020009601932
##$SI= 131072
##$SIGF1= 0
##$SIGF2= 0
##$SINO= 400
##$SIOLD= 131072
##$SPECTYP= <>
##$SREGLST= <1H.CDCl3>
##$SSB= 0
##$STSI= 131072
##$STSR= 0
##$SW_p= 8223.68421052631
##$SYMM= 0
##$S_DEV= 0
##$TDeff= 65536
##$TDoff= 0
##$TI= <>
##$TILT= no
##$TM1= 0
##$TM2= 0
##$TOPLEV= 0
##$USERP1= <user>
##$USERP2= <user>
##$USERP3= <user>
##$USERP4= <user>
##$USERP5= <user>
##$WDW= 1
##$XDIM= 131072
##$YMAX_p= 409937981
##$YMIN_p= -11665
##$CURPLOT= <Network HP LaserJet P1505>
##$CURPRIN= <$Network HP LaserJet P1505>
##$DFORMAT= <normdp>
##$LAYOUT= <+/1D_H.xwp>
##$LFORMAT= <normlp>
##$PFORMAT= <normpl>
##$SURQMSG= 1
$$ End of Bruker specific parameters
$$ ---------------------------------
##NTUPLES= NMR SPECTRUM
##VAR_NAME=  FREQUENCY,     SPECTRUM/REAL,   SPECTRUM/IMAG
##SYMBOL=    X,             R,               I
##VAR_TYPE=  INDEPENDENT,   DEPENDENT,       DEPENDENT
##VAR_FORM=  AFFN,          ASDF,            ASDF
##VAR_DIM=   131072,        131072,          131072
##UNITS=     HZ,            ARBITRARY UNITS, ARBITRARY UNITS
##FACTOR=    0.0627417313425164, 1,          1
##FIRST=     8223.62146879497, 1583,         -61912
##LAST=      0,             3965,            -62201
##MIN=       0,             -11665,          0
##MAX=       8223.62146879497, 409937981,    0
$$ Real data points
##PAGE= N=1
##DATA TABLE= (X++(R..R)), XYDATA
$$ [...]
67741 96833 97122 98386 100371 102475 103857 104003 103100 101619 99701 97241 94434 91789 89544 87472 85405
67726 85405 83610 82431 81821 81419 80904 80091 78999 78002 77557 77479 76878 75312 73695 73479 74991 77158 78820
67709 78820 79672 79795 79030 77326 75248 73638 72878 72869 73462 74501 75526 75858 75113 73507 71685 70352 69887
67692 69887 70073 70274 70136 70026 70546 71689 72833 73517 73863 74098 74089 73675 73220 73448 74645 76289 77539 78016
67674 78016 78030 78141 78619 79328 79990 80470 80842 81295 82029 83123 84439 85777 87183 88966 91195 93253 94208
67657 94208 93726 92384 91013 89935 89034 88295 87886 87733 87409 86660 85809 85415 85634 86116 86441 86372 85714 84256
67639 84256 82126 80000 78661 78300 78421 78471 78389 78520 79190 80567 82742 85625 88705 91174 92534 93037 93379
67622 93379 94013 94844 95554 96031 96422 96918 97537 98057 98115 97563 96803 96579 97246 98400 99476 100529 102048 103967
67604 103967 105378 105461 104441 103298 102688 102389 101681 100024 97474 94690 92477 91048 89812 88135 86141
67589 86141 84404 83044 81701 80459 80107 81072 82558 83312 82985 82238 81661 81173 80519 79782 79121 78387 77339
67572 77339 76121 75213 74933 75117 75296 75105 74573 74063 73893 73988 73995 73720 73397 73515 74471 76278 78414 79926 80014
67553 80014 78707 76795 74980 73349 71797 70668 70523 71374 72548 73332 73477 73076 72369 71823 72040 73240
67537 73240 74996 76650 77884 78730 79219 79315 79107 78781 78369 77716 76732 75490 74105 72648 71237 70057 69217
67520 69217 68650 68212 67849 67671 67869 68469 69186 69701 70136 71002 72495 74047 74894 74907 74552 74150 73552 72535
67502 72535 71134 69593 68299 67728 67992 68467 68395 68000 68407 70173 72471 74120 74890 75245 75275 74645 73454
67485 73454 72398 72034 72377 73230 74371 75375 75777 75639 75563 75967 76620 76937 76459 75035 72953 70995 69968
67468 69968 70021 70712 71708 72938 74045 74337 73654 72785 72620 73213 74040 74768 75338 75647 75652 75616 75813 76194 76698 77599
67448 77599 78978 80143 80227 79300 78239 77511 76808 75962 75480 75802 76656 77580 78601 79937 81462 82959 84541
67431 84541 86206 87234 86742 84829 82601 81011 80184 79932 80211 80792 81093 80828 80449 80451 80555 80125 79168 78253
67413 78253 77515 76478 75023 73814 73319 72989 71987 70490 69627 70154 71649 72996 73324 72505 71178 70315
67397 70315 70373 70811 70808 70428 70531 71443 72424 72802 73018 73883 75238 76124 76114 75661 75109 74166 72647 71078 70100
67378 70100 69724 69605 69699 70101 70543 70623 70456 70560 71084 71681 72241 73173 74654 76053 76553 76186 75745 75755 75954
67359 75954 75888 75614 75520 75649 75529 74747 73479 72349 71847 72017 72586 73156 73193 72161 70067 67860 66859 67526
67341 67526 69039 70310 71230 72539 74575 76683 77984 78375 78529 79132 80399 82172 84134 85943 87440
67326 87440 88832 90502 92541 94548 95979 96639 96720 96377 95448 93758 91591 89597 88185 87191 86242 85199
67310 85199 84023 82493 80505 78518 77233 76788 76677 76560 76719 77569 79141 81266 83869 86773 89567 91954
67294 91954 93962 95625 96832 97753 98910 100408 101547 101757 101402 101016 100165 97991 94740 91715 89648 88034
67278 88034 86308 84801 84040 83816 83543 83054 82525 81950 81238 80635 80627 81466 83031 84965 86832 88389 89821
67261 89821 91469 93202 94446 94949 95002 94719 93668 91699 89648 88578 88576 88824 88671 88133 87468 86792 86106 85356
67243 85356 84460 83569 83150 83505 84274 84731 84495 83790 83182 83222 84060 85093 85393 84858 84588 85561 87283 88422
67225 88422 88513 88289 88438 88853 89207 89448 89443 88833 87591 86271 85371 84893 84756 85160 86200 87501 88604 89420
67207 89420 90012 90336 90481 90759 91155 91056 90058 88732 88049 88168 88384 88200 87881 87855 88148 88634 89437 90728 92288
67188 92288 93547 93978 93406 92171 91124 91187 92538 94326 95453 95616 95378 95297 95405 95535 95744 96145 96621 97011
67170 97011 97372 97729 97801 97348 96669 96303 96294 96257 96184 96658 97977 99565 100556 100665 100189 99477 98745 98173 97863 97808
67150 97808 98073 98748 99553 99908 99720 99659 100248 101083 101520 101741 102428 103657 104873 105832 106724 107398 107394 106901 106878 107827
67130 107827 109168 110223 111158 112397 113669 114258 113922 113093 112415 112515 113897 116487 119467 122019 124124 126199
67114 126199 128088 128981 128396 126819 125242 124379 124436 125367 127093 129468 132093 134310 135641 136319 137122 138420
67098 138420 139597 139723 138663 137168 135994 135330 135078 135235 135797 136611 137612 138997 140922 143096 144921 146006
67082 146006 146464 146687 146952 147227 147310 147159 147111 147627 148725 149792 150239 150339 151100 153122 155838 158138 159575
67065 159575 160628 161907 163559 165447 167437 169355 171065 172796 174935 177235 178725 178825 178183 177919 178361
67050 178361 179122 180084 181525 183382 185213 187018 189341 192309 195221 197432 199077 200559 201850 202826 203823
67035 203823 205305 207184 209006 210721 212799 215583 218824 221916 224390 226208 227739 229408 231262 232989
67021 232989 234377 235599 237003 238852 241331 244465 247868 250920 253500 256244 259759 263768 267431 270358
67007 270358 272985 275948 279449 283286 287275 291450 295900 300482 304877 309031 313372 318314 323566 328361
66993 328361 332440 336439 341114 346498 352045 357262 361978 366292 370544 375127 380027 384723 388717 392034
66979 392034 395105 398502 402845 408468 414881 420979 426237 431387 437543 444963 453050 461180 468997 476189
66965 476189 482662 488928 495828 503765 512413 521095 529202 536511 543446 550828 559047 567709 576450 585641
66951 585641 595729 606275 616418 626171 636431 647717 659594 671504 683464 695666 707934 719958
66939 719958 731814 744010 757186 771729 787408 803399 819018 834411 850240 866863 884235
66928 884235 902395 921409 940894 960305 979796 1000177 1021856 1044419 1067392 1090837 1114987
66917 1114987 1139878 1165545 1191986 1218769 1245329 1271957 1299836 1329672 1360949 1392965 1425874
66906 1425874 1460043 1495045 1530199 1565762 1602689 1641291 1680911 1720900 1761305 1802504 1844774
66895 1844774 1888241 1932744 1977617 2022124 2066287 2110889 2156499 2202792 2248967 2294522 2339502
66884 2339502 2384287 2429319 2474716 2519923 2563956 2606242 2647128 2687366 2727201 2766098 2803324
66873 2803324 2838593 2872147 2904302 2934947 2963379 2988598 3009877 3027225 3041373 3053208 3063104
66862 3063104 3070801 3075873 3078152 3077540 3073627 3065976 3054841 3041177 3025597 3007570 2986006 2960575 2932124
66849 2932124 2901826 2870226 2837191 2802486 2766144 2728357 2689227 2648726 2606882 2563944 2520355
66838 2520355 2476556 2432773 2388972 2344980 2300705 2256265 2211897 2167748 2123833 2080177 2036817
66827 2036817 1993616 1950314 1907000 1864332 1822930 1782621 1742667 1702797 1663657 1626098 1590272
66816 1590272 1555599 1521405 1487409 1453745 1420689 1388336 1356484 1324958 1293994 1264133 1235718
66805 1235718 1208690 1182780 1157524 1132155 1106028 1079412 1053384 1028669 1004996 981879 959493
66794 959493 938244 917982 898335 879533 862026 845428 828724 811713 795298 779976 764903
66783 764903 749124 733105 718111 704427 691123 677556 664146 651367 638847 626057 613353
66772 613353 601582 590872 580438 569554 558191 546696 535412 524777 515270 506937 499282 491832
66760 491832 484495 477171 469491 461371 453460 446466 440207 433849 427073 420487 414845 410231 406102 401724
66746 401724 396498 390216 383248 376309 369976 364504 359903 355872 351853 347610 343626 340370 337243 332989
66732 332989 327288 321241 315967 311429 307132 303253 300349 298273 296140 293297 289852 286328 283233 280861
66718 280861 279048 277165 274698 271762 268770 265748 262372 258556 254613 250885 247596 244985 243234 242184
66704 242184 241367 240204 238100 234694 230437 226592 224094 222565 220964 219010 217283 216073 214915 213385
66690 213385 211583 209572 207069 204009 200879 198047 195280 192351 189668 187770 186574 185612 184769 184247 183988
66675 183988 183649 183081 182418 181698 180738 179409 177749 175882 174084 172816 172315 172138 171436 169761 167397 164966
66659 164966 162919 161383 160208 159140 158087 157206 156560 155884 154956 154017 153470 153275 153136 153139 153581 154146 154003 152955
66641 152955 151760 150894 149689 147401 144580 142466 141288 140134 138486 136978 136376 136615 137195 137806 138114 137581
66625 137581 136169 134783 134328 134554 134437 133530 132283 131127 129944 128538 127032 125599 124263 123183 122750
66610 122750 123086 123719 123954 123403 122102 120406 118880 117958 117478 116793 115516 113958 112694 111924 111499 111316 111432
66593 111432 111842 112357 112682 112612 112248 112010 112217 112648 112780 112396 111627 110464 108853 107348 106990 108057 109499
66576 109499 110146 110060 110045 110218 109887 108734 107310 106225 105520 105067 104969 105191 105231 104588 103354 102021 100891 99946
66558 99946 99139 98524 98163 98163 98730 99923 101296 102045 101660 100400 98966 97745 96562 95181 93845 93083 93119
66541 93119 93736 94626 95517 95955 95445 94091 92734 92163 92367 92777 92999 93010 92908 92855 93085 93658 94317 94850 95350
66522 95350 95776 95617 94502 92960 91973 91832 92011 92122 92371 92925 93405 93269 92348 90868 89300 88257 88065
66505 88065 88325 88267 87661 86884 86084 84930 83506 82711 83231 84615 85929 86968 88132 89395 90119 89902 88999
66488 88999 87851 86700 85795 85465 85698 85962 85713 84996 84348 84234 84678 85310 85655 85441 84824 84318 84400 85126 86126
66469 86126 87025 87839 88839 90051 91078 91562 91676 91877 92259 92444 92146 91548 91015 90682 90449 90143 89562 88603
66451 88603 87534 86932 87073 87535 87630 87200 86748 86822 87413 88037 88311 88453 89128 90733 92885 94792 96079 96981
66433 96981 97745 98246 98323 98093 97644 96749 95253 93526 92129 91162 90299 89423 88832 88779 89092 89425 89648 89901 90324
66414 90324 90802 90961 90456 89286 87809 86442 85475 85126 85468 86139 86434 85927 84813 83512 82208 81085 80609
66397 80609 81032 81821 82139 81955 82152 83430 85472 87365 88439 88570 88011 87225 86633 86310 86105 86127 86780 88042
66379 88042 89065 88944 87827 86865 86990 88084 89464 90872 92606 94732 96583 97362 97131 96827 97168 97776
66363 97776 97643 96300 94259 92352 91004 90220 89936 90122 90609 91020 90969 90332 89392 88640 88315 88137 87618 86597
66345 86597 85322 84049 82786 81522 80452 79837 79768 80155 80819 81488 81887 81963 81943 82042 82247 82433 82531 82467 82147
66326 82147 81685 81417 81465 81470 81069 80504 80377 80826 81345 81494 81428 81563 82060 82795 83548 83940 83483 82153 80766 80323
66306 80323 80920 81627 81567 80775 79895 79383 79302 79616 80292 81159 81987 82771 83675 84703 85619 86282 86814 87303 87497
66287 87497 86994 85751 84286 83337 83310 83993 84789 85304 85661 86147 86592 86377 85207 83700 82977 83683 85511 87647
66269 87647 89441 90641 91197 91089 90390 89374 88475 88055 88183 88636 89063 89191 88990 88732 88796 89237 89593 89338
66251 89338 88572 88073 88482 89650 90864 91568 91658 91253 90545 89905 89821 90553 91887 93264 94151 94354 94098 93782
66233 93782 93513 92972 91931 90821 90473 91234 92584 93741 94366 94530 94226 93330 91977 90627 89612 88836 88080
66216 88080 87564 87955 89686 92274 94443 95067 94021 92102 90253 89017 88595 89003 89957 90864 91313 91545 92151
66199 92151 93286 94437 94971 94729 94028 93361 93205 93875 95281 96930 98335 99385 100201 100792 101045 100909 100354
66182 100354 99177 97180 94576 92032 90179 89267 89270 90078 91421 92790 93660 93832 93531 93268 93601 94800 96610
66165 96610 98458 99955 101108 102025 102682 103096 103422 103615 103250 102062 100549 99680 99945 100994 102153 102949 103124
66148 103124 102545 101362 100064 99167 98950 99463 100554 101722 102238 101693 100458 99483 99646 101193 103496 105253
66132 105253 105260 103396 100845 99108 98737 99113 99314 98991 98459 98210 98455 99021 99575 99978 100447 101296 102464 103386
66114 103386 103472 102733 101829 101430 101601 101965 102338 102940 103886 104796 105169 104975 104611 104423 104576 105198 106236 107211 107645
66095 107645 107765 108287 109346 110202 110316 110251 110971 112574 114205 115109 115300 115305 115680 116692 117989 118623 117858 116074
66077 116074 114487 113881 113958 114025 113864 113691 113630 113629 113670 113748 113751 113642 113637 113913 114214 114126 113734 113643 114190 114950 115314 115305 115486
66054 115486 116096 116736 116981 116930 116864 116682 116154 115629 115920 117317 119080 120194 120390 120149 119919 119709 119371 118930
66036 118930 118551 118439 118840 119926 121546 123245 124713 126128 127902 130038 131874 132584 131987 130821 130165 130599
66020 130599 131965 133802 135755 137541 138853 139560 139896 140216 140638 141120 141774 142778 143963 144818 145120 145375
66004 145375 146390 148442 151028 153473 155634 157962 160937 164550 168360 171994 175584 179683 184675 190225
65990 190225 195427 199636 203078 206323 209153 210453 209556 207366 205586 204891 204395 202938 200326 197126 193796
65975 193796 190485 187336 184490 181854 179220 176578 174007 171353 168315 164931 161751 159385 157907 156788
65961 156788 155469 154042 153203 153352 153929 154028 153577 153368 153830 154372 154246 153548 152921 152778 153393 155371 159238 164561
65943 164561 170073 174836 178997 183372 188545 194275 199530 203218 205197 206408 207799 209378 210703 211870
65929 211870 213372 215200 216846 218173 219651 221633 224008 226669 229760 233300 237106 241140 245464 249788
65915 249788 253699 257444 261804 266982 272281 277188 282082 287357 292454 296359 298630 299438 299006 297704 296367
65900 296367 295806 296025 296399 296556 296587 296463 295814 294438 292588 290491 287802 283805 278198 271639 265377 260145
65884 260145 255387 249846 243047 235914 229744 224897 220805 216966 213409 210255 207348 204568 202222 200841
65870 200841 200554 200761 200546 199540 198334 197916 198704 200246 201782 202753 202818 201852 200164 198407 196931 195453
65854 195453 193618 191655 190181 189482 189263 189001 188393 187524 186778 186480 186576 186798 187129 187792 188731 189562 190207 191166
65836 191166 192784 194656 196115 197034 197763 198595 199676 201164 203054 205114 207444 210839 216034 222758 230035
65821 230035 237323 244820 252739 260787 268342 274745 279541 282882 285509 287757 288737 287250 283430 278761
65807 278761 274358 270102 265629 261248 257371 253793 250260 247210 245211 243985 242728 241256 240136 239680
65793 239680 239483 239073 238576 238477 239050 240242 241920 244083 246996 251213 257231 264941 273590 282505 291820 302324
65777 302324 314640 328764 344326 360936 377989 394368 408819 420710 430177 437374 441863 442913
65765 442913 440179 433813 424167 411764 397519 382575 367763 353449 339995 328218 319201 313672
65753 313672 311653 312752 316818 324244 335443 350063 367059 385733 406351 429380 454296 479617
65741 479617 503952 526608 547208 565189 579831 590455 596505 597664 593950 585490 572307 554700
65729 554700 533770 511121 487971 464897 442361 420825 400210 379905 359773 340724 323864
65718 323864 309346 296364 283943 271431 258656 246178 235202 226636 220204 214778 209523 204414
65706 204414 199829 196086 193330 191470 190119 188888 187795 187118 186898 186861 186811 186823 187007 187330 187732 188176 188635
65689 188635 189225 190323 192223 194640 196892 198681 200489 203102 206963 212035 218033 224646 231744 239478
65675 239478 248060 257511 268000 280438 296150 315565 337612 360889 385171 411230 439277 468240
65663 468240 496696 523965 549995 574653 597548 618244 636145 650356 660274 666381 670005 672142
65651 672142 672939 672507 671687 671533 672313 673563 675040 676983 679318 681080 680918 677907 671710 662265 649620
65636 649620 633819 614695 591960 565776 537054 506932 476167 445365 415516 387717 362371
65625 362371 339190 318042 299264 282934 268427 255130 243193 233078 224607 217022 209936 203709
65613 203709 198758 194911 191685 188911 186794 185415 184385 183093 181298 179400 178048 177410 176974 176150 174892
65598 174892 173580 172544 171992 172143 172948 173787 174062 174146 175157 177547 180502 183125 185635 188829 192790 196894
65582 196894 201018 206021 212913 222017 233024 245480 259170 274426 292013 312303 334579 357739
65570 357739 381684 407278 434713 462626 489176 513302 534386 551478 563763 571499 575494 575698
65558 575698 571106 561163 546502 528129 506563 482231 456165 429709 403711 378376 353846 330570
65546 330570 309106 289806 272742 257877 245241 234895 226703 220298 215450 212372 211296 211698 212276
65533 212276 211978 210954 210291 210875 212562 214367 215275 214875 213315 210841 207586 203847 200265 197372 194998
65518 194998 192501 189614 186717 184198 181922 179630 177504 175996 175173 174607 173910 173164 172776 173042 173875 174806
65502 174806 175277 175065 174450 173910 173651 173526 173363 173255 173480 174203 175347 176746 178471 180909 184470 189137 194410
65485 194410 199722 204881 210003 215097 219792 223518 225902 226970 227037 226417 225262 223632 221637 219429 217059
65470 217059 214413 211333 207789 203926 199944 195977 192120 188554 185505 182944 180417 177443 174098 171003
65456 171003 168635 166942 165750 165199 165424 166053 166514 166711 166986 167442 167766 167817 167895 168259 168813 169561 170947 173327
65438 173327 176274 178898 180800 182403 184326 186743 189374 191862 194018 195948 198097 201028 204825 208647
65424 208647 211097 211286 209502 206717 203573 200165 196752 194075 192610 191894 191143 190298 189887 189959 189835 189025
65408 189025 187777 186533 185424 184567 184293 184712 185528 186622 188291 190489 192466 193866 195647 198931 203206
65393 203206 206712 208691 210314 213095 217195 221658 225523 228093 228688 227047 223848 220317 217276 214833
65379 214833 212740 210675 208358 205876 203824 202753 202527 202591 202767 203301 204195 205006 205498 206064 207322 209527
65363 209527 212469 215580 218145 219924 221828 225470 231679 239831 248991 259164 270794 283488 296143
65350 296143 308236 320058 331498 341429 348732 353399 356223 357848 358471 357972 355897 351666 345337 337877
65336 337877 330313 322880 315345 307688 299907 291529 282159 272355 263311 255654 249183 243686 239271 235816
65322 235816 232882 230339 228418 226937 225210 223022 221038 219739 218601 216871 214654 212579 210745 208681
65308 208681 206101 203068 199595 195726 192059 189531 188517 188517 188842 189279 190014 191239 192997 195178 197572 200096
65292 200096 202964 206416 210242 213779 216437 218065 218821 218917 218523 217722 216481 214844 213166 211928 211249 210741
65276 210741 209974 208969 208107 207625 207322 206748 205678 204360 203310 202852 202913 203276 203889 204840 206175 207921 210226
65259 210226 213207 216580 219644 221844 223311 224721 226540 228571 230268 231310 231609 230862 228606 224878 220419
65244 220419 215867 211079 205756 200423 196117 193138 190813 188601 186790 185777 185312 184855 184301 183905 183881 184431
65228 184431 185762 187567 188810 188569 186991 185051 183558 182743 182537 182725 182982 183181 183524 184030 184190 183658 183084
65211 183084 183616 185624 188372 190843 192375 192675 191991 191291 191575 192764 193776 193839 193223 192566 192095 191754 191482
65194 191482 191106 190380 189471 188882 188608 187927 186477 185061 184804 185834 187395 189034 190979 193347 195595 197035
65178 197035 197596 197858 198488 199715 201212 202389 202850 202623 201972 201163 200453 200033 199724 198954 197400 195682 194989
65161 194989 195927 197999 200409 203076 206476 210649 214822 218198 220749 222995 225265 227577 230123 233378
65147 233378 237665 243007 249550 257657 267339 278048 289472 302229 317258 334647 353477 372658
65135 372658 391478 409459 426333 442269 457675 472619 486787 500030 512438 523712 532949 539416
65123 539416 543306 545533 546957 547922 548233 547275 544312 538826 530580 519410 505325 488891 471218 453324
65109 453324 435623 418050 400455 382851 365540 349088 333909 319783 306076 292546 279663
65098 279663 268140 258453 250756 244751 239485 233883 227844 222394 218447 215826 213840 212404 212026 212898
65084 212898 214479 215919 216609 216430 215741 215019 214348 213445 212248 211096 210113 208964 207632 206963 207778 209706
65068 209706 211538 212587 213116 213598 214207 215046 216170 217260 217780 217652 217326 217102 216822 216390 216140 216464 217436
65051 217436 218930 220726 222313 223031 222671 221636 220270 218416 215984 213569 212015 211469 211319 210969 210307 209390
65035 209390 208076 206177 203765 201114 198391 195513 192342 188978 185791 183117 180986 179245 177912 177199
65021 177199 177128 177294 177221 176865 176622 176928 177956 179621 181649 183649 185336 186799 188401 190330 192356 194190
65005 194190 195975 198244 201358 205159 209276 213598 218221 222966 227270 230701 233420 235897 238190 239774
64991 239774 240186 239668 239018 238937 239733 241593 244810 249534 255454 261931 268387 274427 279675 283769 286582 288219
64975 288219 288722 287901 285539 281582 276109 269383 262092 255271 249606 244876 240302 235401 230331 225561 221481
64960 221481 218269 215763 213427 210754 207836 205352 203904 203493 203669 204021 204443 205011 205633 205801 204961 203253
64944 203253 201592 200587 199590 197452 194194 191324 190287 191127 192895 194821 196683 198445 200111 201800 203582
64929 203582 205236 206414 206943 206795 205903 204265 202126 199902 197969 196571 195759 195378 195299 195690 196771 198309
64913 198309 199769 201037 202468 204114 205497 206504 207899 210394 213700 217095 220543 224597 229532 235326
64899 235326 242256 250676 260218 269995 279688 289726 300253 310607 320176 329278 338813 349338 360640
64886 360640 371898 382082 390537 397369 402979 407164 409103 408376 405505 401186 395419 387811 378490 368243
64872 368243 357917 348045 339014 331247 325079 320597 317567 315448 313543 311342 308757 306037 303485 301225
64858 301225 299032 296284 292192 286289 278797 270552 262562 255447 249121 243031 236845 230870 225696 221543
64844 221543 218180 215371 213034 210974 208890 206840 205380 204966 205347 205775 205727 205293 204908 204876 205128 205394 205600
64827 205600 206018 206922 208154 209262 210091 211031 212578 214814 217411 220036 222667 225638 229471 234524 240718
64812 240718 247623 254856 262358 270302 278898 288300 298473 309022 319220 328367 336069 342147 346294
64799 346294 347978 346733 342583 336186 328523 320467 312577 305108 298025 291144 284602 279172 275663 273876
64785 273876 272614 271008 269438 268733 268893 269204 269360 269765 270736 272090 273730 276059 279552 284246 289914 296433
64769 296433 303741 311661 319987 328691 337930 347906 358647 369767 380584 390676 400233 409555 418414
64756 418414 426369 433561 440670 448058 455442 462513 469366 476231 483163 490039 496365 501084 503117 502206
64742 502206 498640 492214 482267 469076 454302 439495 424830 409956 395453 382602 372021 363328
64730 363328 355999 349850 344769 340601 337392 335290 334174 333713 333789 334503 335857 337772 340358 343865 348423
64715 348423 354098 361061 369330 378458 387762 396740 404998 411931 416882 419461 419384 416219 409748 400514 389557
64700 389557 377645 365102 352216 339392 327013 315603 305957 298481 292417 286349 279710 273313 268247
64687 268247 264772 262480 261016 260237 260016 260344 261564 264213 268581 274432 281048 287622 293919 300609 308695
64672 308695 318451 329122 339680 349575 358677 366829 373750 379115 382512 383455 381677 377435 371390 364256
64658 364256 356569 348671 340830 333425 326964 321875 318335 316451 316405 318133 320912 323675 325848 327702 329915
64643 329915 333067 337503 343232 349817 356796 364386 373478 384708 397858 412346 427935 444567 461733
64630 461733 478418 493652 506854 517697 525861 530932 532487 530309 524579 515671 503727 488702 471011
64617 471011 451909 432954 415205 399054 384554 371605 360030 349818 341238 334413 328884 323890
64605 323890 319063 314560 310609 307232 304379 301974 299806 297750 296226 296081 297746 300784 304460 308582
64591 308582 313494 319363 325802 332252 338596 345318 353131 362422 372971 384185 395643 407428 419943
64578 419943 433454 447814 462504 476782 489834 500917 509496 515316 518419 519056 517451 513536 506991
64565 506991 497671 485954 472604 458276 443197 427280 410436 392916 375494 359293 345188 333360
64553 333360 323567 315686 309689 305045 300735 296202 291989 289036 287559 287084 287436 289102 292501 297338 302846
64538 302846 308269 312894 316048 317440 317384 316394 314721 312363 309249 305143 299708 293080 286209 280286 275869
64523 275869 272825 270898 269917 269589 269573 269758 270081 270095 269301 268040 267522 268644 271118 274079 277210 280806 284921
64506 284921 289015 292642 296198 300758 307152 315279 324328 333659 343360 353818 364897 375755 385450
64493 385450 393390 399162 402392 403194 402470 401290 399956 397987 395048 391546 388205 385399 383197 381879 381963
64478 381963 383593 386086 388244 389076 388137 385339 380779 374858 368317 361850 355737 350066 345233 341957 340714
64463 340714 341348 343340 346248 349814 353833 358109 362420 366398 369510 371270 371360 369543 365736 360376 354535
64448 354535 349337 345268 342191 339863 338204 337212 337035 338104 340779 344758 349244 353954 359627 367225 376883
64433 376883 388016 400243 413786 429015 446140 465518 487847 513828 543897 578542 618681
64422 618681 665475 720004 783490 857682 944554 1045527 1161087 1290813 1432930 1583528
64412 1583528 1736814 1886957 2029885 2163412 2286104 2396493 2492996 2573721 2636057 2677026
64402 2677026 2694533 2688300 2659566 2610216 2542310 2457894 2358527 2244888 2117320 1977206 1828070
64391 1828070 1675438 1525623 1384110 1254377 1137649 1033665 941764 861400 791958 732543
64381 732543 682117 639697 604252 574576 549505 528226 510203 494903 481825 470758 461640 453988
64369 453988 446712 438758 429847 420402 410901 401524 392284 383116 373772 363990 353918 344188 335461 328034
64355 328034 321899 316928 312895 309631 307348 306603 307784 310800 315406 321373 328072 334308 339122 342605
64341 342605 345379 347432 347993 346518 343145 338161 331744 324531 317761 312259 307713 303532 300074 298326
64327 298326 298490 299666 301111 303165 306508 310848 314946 317900 320036 322356 325398 328896 332438 336045
64313 336045 339865 343523 346150 347075 346252 344036 340889 337352 333830 329984 324669 316975 307351 297381 288442
64298 288442 280933 274702 269646 265639 262271 259123 256216 253881 252268 251186 250422 249977 249953 250357 251126 252249
64282 252249 253810 255942 258758 262366 266918 272568 279265 286657 294406 302573 311455 320899 330076 338141
64268 338141 344911 350645 355375 358819 360875 361743 361619 360669 359322 358168 357453 357135 357490 359007 361305 362801
64252 362801 362044 359044 354619 348863 341150 331563 321348 311714 302885 294668 287227 280827 275331 270572
64238 270572 266836 264448 263077 262029 261047 260387 260208 260350 260676 261217 261935 262712 263533 264402 265051 265119 264694 264395
64220 264395 264820 266009 267475 268557 268742 267871 266145 263902 261452 259138 257282 255844 254349 252417 250262
64205 250262 248407 247127 246378 246008 245718 245111 244264 243967 244865 246582 248329 250150 252796 256542 261131 266946
64189 266946 275117 285997 298518 311661 325720 341297 357791 373879 389044 403466 416513 426401
64177 426401 431575 431737 427399 419193 407974 394972 381303 367565 354170 341695 330535 320394
64165 320394 310547 300644 291074 282512 275256 269064 263541 258523 254025 250007 246530 244146 243670 245264
64151 245264 248040 250964 253936 257572 262083 266947 271702 276449 281315 285926 289767 292815 295417 297702
64137 297702 299456 300538 301111 301386 301337 300713 299255 296884 293802 290498 287576 285461 284189 283534 283385 283983
64121 283983 285714 288691 292715 297658 303641 310675 318333 326110 334075 342863 352989 364348 376397
64108 376397 388520 400082 410347 418654 424757 428936 431781 433836 435396 436655 438068 440460 444558
64095 444558 450421 457481 465111 472894 480271 486290 490027 491208 490203 487437 483017 476951 469493 461128
64081 461128 452254 443081 433846 424977 416889 409603 402643 395407 387650 379652 371992 365141 359196 353968
64067 353968 349368 345657 343186 341893 341221 340596 339807 338880 337828 336754 336003 335910 336421 337218 338179 339475 341213
64050 341213 343222 345261 347281 349440 352011 355318 359620 365050 371768 380058 390018 401193 412878 424873
64036 424873 437551 450895 463780 474601 482572 488083 491794 493756 493584 491272 487511 483210 478944
64023 478944 474927 471378 468682 467158 466819 467418 468520 469412 469106 466778 462273 456052 448620 440264 431358
64008 431358 422593 414550 407130 399703 391938 384384 378087 373661 370741 368291 365383 361765 357861 354444
63994 354444 352291 351831 352818 354395 355748 356881 358572 361453 365238 369032 372300 375295 378508 381990 385470
63979 385470 389061 393454 399192 405910 412621 418790 424842 431464 438745 446251 453745 461384 469284 477374
63965 477374 485872 495526 507017 520276 534674 549761 565527 582055 599384 617909 638541 662154
63953 662154 689019 719117 753010 792034 837515 890089 950161 1018895 1098369 1190594 1296668
63942 1296668 1416999 1552003 1702118 1867163 2046104 2237584 2440387 2653105 2873493
63933 2873493 3098422 3324389 3547713 3764076 3968164 4154212 4317142 4453217 4559760
63924 4559760 4634635 4676303 4684158 4658432 4599672 4508643 4386954 4237650 4065096 3874425 3671067
63913 3671067 3460294 3246578 3033240 2822900 2618247 2422178 2237214 2065054 1906680
63904 1906680 1762600 1632908 1517348 1415517 1326952 1251005 1186714 1132815 1087793 1050073
63894 1050073 1018447 992267 970922 953134 937133 921631 906170 890338 873100 853445 831476
63883 831476 808438 785736 764323 744899 728079 714061 702441 692696 684784 679278 677099 679206
63871 679206 686111 697362 711622 727697 745662 766808 792370 822411 855942 891895 929724 969229
63859 969229 1010190 1052383 1095673 1139731 1183670 1226282 1266737 1304865 1340593 1373304 1401933
63848 1401933 1425505 1443382 1455125 1460530 1459826 1453453 1441514 1423684 1399865 1370689 1337168 1300003
63836 1300003 1259447 1215680 1169013 1119876 1068979 1017515 966859 917886 870847 825912 783509
63825 783509 743928 707004 672501 640589 611502 584897 560044 536665 515135 495745 478205
63814 478205 462072 447280 433912 421742 410465 400229 391511 384412 378431 373009 368013 363544 359479
63801 359479 355382 350809 345636 340204 335134 330831 327078 323222 318813 313890 308682 303370 298316 294208
63787 294208 291502 289758 287856 285015 281391 277679 274404 271746 269718 268212 266952 265698 264514 263684
63773 263684 263343 263327 263357 263189 262641 261707 260708 260063 259773 259341 258370 257076 255984 255298 254811 254333 253885 253506 253175
63754 253175 252994 253138 253573 254072 254591 255293 256108 256553 256313 255737 255455 255662 256182 257174 259301 262992 267821 272832
63736 272832 277379 281461 285353 289145 292681 295767 298290 300205 301542 302519 303621 305433 308257 311858
63722 311858 315609 319057 322409 326386 331455 337190 342507 346570 349303 351038 351938 352021 351490 350664 349599
63707 349599 348049 345814 342895 339414 335678 332253 329544 327266 324802 322202 320344 319848 320347 321281 322942
63692 322942 326108 330721 335545 339251 341500 342955 344543 346794 349602 352438 354896 357018 358975 360584
63678 360584 361428 361407 360953 360668 360967 361940 363278 364328 364625 364495 364885 366432 368868 371467 373829 375950 377659
63661 377659 378391 377731 376016 374084 372317 370142 366678 361760 356039 350180 344375 338768 333884 330209 327557
63646 327557 325198 322586 319773 317254 315618 315240 315991 317347 318907 320732 323034 325787 328852 332240 335966
63631 335966 339897 344018 348655 354040 359854 365545 370929 376197 381630 387698 395035 403722 412856 421570
63617 421570 430353 440706 453576 468834 486142 505419 526298 548105 570783 595134 621713 650090
63605 650090 679547 709819 740565 770705 798947 824516 846749 864318 875699 880474 879765 875372
63593 875372 868789 860845 851777 841576 830428 818774 806765 793846 779171 762353 743606 723317
63581 723317 701809 679478 656952 635069 614686 596363 580134 565749 553109 542232 532896 524852
63569 524852 518462 514582 513518 514528 516671 519665 523532 527892 532206 536490 541232 546726 552890 559674
63555 559674 567277 576078 586572 599219 614166 631393 651339 674959 702859 734827 770615 810613
63543 810613 854970 902290 949787 994431 1033262 1063050 1081018 1086474 1081241 1068299 1050452 1030253
63531 1030253 1010180 992086 976545 963043 950651 938367 925114 909747 891215 868858 842782
63520 842782 813889 783316 751859 720093 688807 658865 630685 604220 579466 556659 536033
63509 536033 517718 501748 487775 474886 462224 449779 438167 427679 418153 409721 402964 398065
63497 398065 394402 391247 388347 385568 382590 379360 376396 374093 372145 370118 368317 367468 367679 368282 368732
63482 368732 369201 370191 371952 374455 377613 381263 385044 388576 391805 395009 398349 401497 403890 405328 406078
63467 406078 406321 405766 404048 401270 397922 394435 391118 388317 386246 384756 383604 382816 382421 382071 381484 381192
63451 381192 382197 384773 388176 391655 395191 399129 403717 409276 416260 424799 434589 445473 457640 471067
63437 471067 485524 501570 520838 544652 572828 604459 639304 677406 717563 757042 792818
63426 792818 822449 844028 856517 860662 859054 854871 850738 848706 850506 857315 869587 887408 910639
63413 910639 938472 969228 1000960 1032010 1060742 1085143 1103302 1114260 1118168 1115808 1108274 1097001
63401 1097001 1083591 1069398 1055281 1041537 1027755 1012864 995795 976215 954336 930033 902694
63390 902694 872254 839982 807750 776557 746172 716212 687123 659927 635298 613169 593183
63379 593183 575282 559849 547345 537806 530648 525116 520947 518523 518307 520298 524189 529813 537201 546312
63365 546312 557035 569516 584196 601409 621002 642418 665171 689335 715674 745074 777580
63354 777580 812114 847439 883257 919898 956849 992048 1022884 1047664 1066016 1078304 1085014 1086477
63342 1086477 1082826 1074356 1062194 1048372 1034785 1021984 1009215 995461 980128 962804 942923 919995
63330 919995 894014 865521 835463 805080 775689 748322 723606 702031 684128 670261 660468 654757
63318 654757 653383 656347 662464 669053 672664 670188 659753 641373 617136 590328 563699 538346 514364
63305 514364 492238 473064 457433 444737 433909 424499 416672 410419 405240 400541 395981 391378 386624
63292 386624 381801 377226 373204 369775 366712 363762 360908 358384 356393 354767 353044 350928 348493 345930
63278 345930 343383 341128 339599 338907 338587 338086 337354 336695 336300 336260 336769 337839 339004 339839 340674 342275 344833
63261 344833 347869 351140 354916 359173 363209 366550 369748 373744 378700 383929 388766 393036 396826 400286
63247 400286 403740 407642 412225 417325 422625 428058 433970 440924 449272 458919 469570 481141 493807
63234 493807 507745 523113 540229 559379 580369 602541 625367 648698 672315 695676 718391
63223 718391 740644 762793 784796 806351 827393 848102 868541 888694 908822 929481 951035
63212 951035 973250 995329 1016210 1034861 1050364 1061757 1067957 1068149 1062354 1051331 1035825 1016188
63200 1016188 992856 966845 939446 911633 884029 857235 831798 808025 786104 766388 749369
63189 749369 735462 724950 717889 713886 712261 712740 715772 721813 730567 741339 753874 768284 784300
63176 784300 801203 818474 835923 853076 869160 884037 898585 913694 929157 944002 957669
63165 957669 970319 982013 992045 999188 1002371 1001133 995721 986831 974926 959612 939973 915788
63153 915788 888280 859339 830139 800878 771708 743300 716318 690940 667289 645850 626904
63142 626904 609861 593911 579189 566624 556607 548462 541334 534893 528965 523241 517825 513472 510665
63129 510665 508848 507210 505936 506094 508335 512233 516860 521583 526253 530951 535674 540130 543933 547060
63115 547060 549878 552574 554927 556959 559389 562914 567198 571133 573998 575951 577482 578883 580301 581838
63101 581838 583409 584800 585909 586781 587420 587854 588260 588725 588949 588540 587609 586744 586414 586661 587307 588128 588893 589563
63083 589563 590421 591673 593009 593949 594558 595402 596778 598450 600225 602381 605388 609500 614706 620721 626996
63068 626996 633106 639317 646466 655142 665282 676640 689306 703550 719444 736850 755652 775865
63056 775865 797736 821844 848936 879522 913697 951279 991924 1035121 1080421 1127754 1177365
63045 1177365 1229372 1283546 1339388 1396154 1452924 1509011 1564330 1619028 1672835 1725167 1775918
63034 1775918 1825681 1875143 1924605 1974048 2023053 2070414 2114377 2153575 2187336 2214812 2234244
63023 2234244 2243556 2241422 2227502 2201947 2165171 2118011 2061872 1998760 1931259 1862053 1793057 1725158
63011 1725158 1659096 1596427 1539259 1489089 1446161 1409864 1379510 1354818 1336048 1323779 1318372
63000 1318372 1319522 1326344 1337877 1353446 1372638 1395008 1419786 1445882 1472327 1498790 1525567 1553005
62988 1553005 1581049 1609358 1637610 1665483 1692456 1717764 1740543 1760006 1775509 1786460 1792102
62977 1792102 1791495 1783915 1769132 1747109 1717634 1680724 1637408 1589665 1539431 1487974 1436139 1384611
62965 1384611 1333759 1283821 1235606 1190506 1149410 1111980 1077417 1045482 1016143 988710 962210
62954 962210 936629 912950 891697 872045 852656 832936 813057 793206 773445 754306 736869
62943 736869 721865 708858 696610 684276 672028 660475 649829 639937 630919 623245 617023 611553
62931 611553 605901 599809 593878 588960 585423 582940 580839 578676 576498 574489 572537 570377 568036 565777
62917 565777 563580 561109 558295 555638 553701 552651 552397 552738 553108 552623 550830 548220 545625 543335 541189
62902 541189 539294 538113 537875 538317 539050 539940 541095 542694 544812 547284 549812 552270 554639 556491 556943
62887 556943 555571 553102 550701 548769 546963 545249 544212 544242 544998 545898 546683 547267 547504 547414 547311 547372 547276 546561
62869 546561 545099 542988 540201 536709 532835 529173 526066 523393 520846 518286 515802 513582 511766 510393
62855 510393 509502 509295 510027 511612 513377 514501 514789 514904 515704 517324 519012 519876 519744 519211 518942 519075 519336
62838 519336 519540 519717 519795 519410 518272 516595 515025 514065 513693 513549 513350 513041 512645 512180 511734 511500 511672 512437
62820 512437 514011 516463 519402 522152 524464 526913 530273 534594 539186 543409 547184 550807 554698 559327
62806 559327 564930 571057 576774 581518 585579 589616 594085 599317 605722 613465 622204 631525 641491 652378
62792 652378 664050 676117 688707 702652 718754 737210 757951 781377 808479 840214 876825
62781 876825 917868 962987 1012647 1067959 1129705 1197660 1270869 1348299 1429075 1512393 1597650
62770 1597650 1684466 1772104 1858666 1941099 2016167 2081496 2135865 2178725 2209423 2226762 2229362
62759 2229362 2216613 2189281 2149127 2098068 2037770 1969684 1895074 1815117 1731331 1645862 1560934
62748 1560934 1478026 1397893 1321328 1249352 1182511 1120508 1062937 1010033 962249 919278 880091
62737 880091 844024 811367 782617 757426 734673 713555 694234 677235 662452 649068 636407
62726 636407 624561 614042 605060 597433 591101 586398 583667 582718 582861 583464 584397 585940 588408 592030 597055
62711 597055 603644 611612 620592 630722 642933 658152 676316 696580 718504 742663 770025 801153
62699 801153 836155 874970 917361 962912 1011375 1062842 1117343 1174477 1233732 1294978 1358244
62688 1358244 1422939 1487450 1549489 1606730 1657253 1699620 1732551 1754631 1764614 1762135 1747831 1722599
62676 1722599 1687048 1641972 1588987 1530228 1467556 1402420 1336326 1270904 1207404 1146526 1088819
62665 1088819 1034927 985240 939530 897151 857621 820869 786947 755605 726455 699664 676166
62654 676166 656716 640749 626657 613248 600443 588497 577236 566414 556155 546482 536929 527252
62642 527252 518084 510217 503545 497457 491967 487672 484748 482825 481746 481646 482300 483189 484280 485863 487452
62627 487452 487791 486354 484114 482315 481078 479662 477578 474909 472004 469423 467897 467793 468741 470115 471731
62612 471731 473865 476848 480923 486129 492024 497779 502959 508011 513786 520772 528975 538158 547933 558045
62598 558045 569030 582286 598951 618971 641745 667431 696919 730604 767810 807560 849231
62587 849231 892222 935505 977979 1019001 1058106 1094287 1125969 1151738 1170844 1182899 1187375 1183770
62575 1183770 1172264 1153934 1130141 1101858 1069774 1034815 998168 960722 922853 884934 847789
62564 847789 812363 779079 747790 718387 691252 667006 645858 627302 610514 595047 581040
62553 581040 568792 558263 549057 540657 532563 524511 516898 510721 506635 504106 501935 499569 497392 495777
62539 495777 494505 493380 492767 492989 493600 493796 493363 492743 492244 491660 490723 489617 488942 489301 490977 493881 497851
62522 497851 503056 510065 519432 531246 545081 560327 576635 594280 614122 636981 663001 691831
62510 691831 723335 757698 794714 833442 872931 912910 953435 994078 1033797 1071379 1105626
62499 1105626 1135321 1159493 1177743 1190096 1196706 1198057 1195312 1190047 1183618 1177159 1172098 1170151 1172578
62486 1172578 1179718 1191408 1207609 1228452 1253942 1283871 1317931 1355641 1396185 1438355 1480542
62475 1480542 1520579 1555705 1583126 1601053 1609258 1608457 1599050 1580595 1552471 1514724 1468035 1413262
62463 1413262 1351611 1285175 1216641 1148158 1080845 1015629 954015 897538 846742 801229 760690
62452 760690 725361 695408 670248 648759 630015 613713 599969 588872 580201 573574 568760 565737
62440 565737 564467 564756 566419 569398 573619 578886 585000 591798 598896 605459 610396 612758 612075 608604 603296
62425 603296 597108 590095 581519 571136 560067 549898 541125 533005 524821 516691 509037 501832 494774
62412 494774 487842 481287 475238 469619 464467 460024 456416 453379 450424 447249 443954 440897 438449 436872
62398 436872 436217 436122 435855 434943 433936 434210 436673 440732 444796 447762 449832 451975 454860 458348 461834 464969
62382 464969 468101 471958 476872 482431 488064 493824 500257 507517 515007 522122 529085 536666 545184 554186
62368 554186 563265 572833 583698 596042 609259 622963 637832 655236 676255 701273 730240 762901
62356 762901 798891 838104 880986 928027 978850 1032084 1086177 1139913 1192011 1240687 1283960
62345 1283960 1320191 1348219 1367445 1378166 1381480 1378426 1369297 1354115 1333473 1308485 1280066 1248710
62333 1248710 1214976 1179773 1144073 1108662 1074204 1041319 1010507 982118 956304 932852 911223
62322 911223 891046 872420 855321 838812 821384 802286 782113 761878 741855 721655 701197
62311 701197 681166 662514 645793 630991 617751 605608 594234 583676 574327 566501 560020 554374
62299 554374 549270 544863 541383 538735 536699 535369 535063 535772 536918 537836 538428 539265 541039 543842 546994
62284 546994 549690 551863 554194 557210 560715 564301 567962 571690 574842 576686 577530 578575 580544 583093
62270 583093 585676 588339 591467 595447 600863 608350 617898 628932 641482 656625 675309 697454 722870
62257 722870 752324 786793 826085 869159 915622 966034 1020756 1079127 1139628 1200097 1257860
62246 1257860 1310366 1355865 1393223 1421421 1439989 1449673 1451795 1446913 1434782 1415498 1389730 1357751
62234 1357751 1319316 1274949 1226619 1176687 1126747 1077841 1031112 987663 948074 912520 881096
62223 881096 853853 830854 812338 798391 788252 780479 774098 769141 765844 763915 762868 762408 761945
62210 761945 760395 757134 752698 747878 742510 735954 728356 720505 712574 704026 694892 686147 678412 671102
62196 671102 663471 655973 649889 645840 643330 641674 640818 641122 642848 646097 650959 657320 664603 671995 679050
62181 679050 685961 693156 700669 708001 714596 720338 725529 730364 734635 738123 741311 745494 752091 761887
62167 761887 775003 791359 810968 833963 860626 891342 926155 964312 1004488 1045469 1086280
62156 1086280 1125564 1161275 1191280 1214145 1229334 1237082 1238351 1234496 1226419 1214087 1197125 1175664
62144 1175664 1150354 1121810 1090524 1057300 1023427 990292 958947 929970 903611 880178 860338
62133 860338 844745 833216 824656 818079 813338 810492 808918 807726 806811 806785 807895 809631 811480 813590
62119 813590 816579 821080 827479 835665 844981 854753 864911 875691 886842 897516 906828 913989 917986
62106 917986 917911 913920 907356 899664 891571 883486 876153 870410 866495 863893 861784 859568 857192 855145 854088
62091 854088 854408 856147 859181 863295 868315 874411 881989 890894 900018 908242 915566 922783 930295 938035
62077 938035 946413 956474 968964 983915 1001184 1020605 1041476 1062808 1084387 1106809 1130121 1153227
62065 1153227 1175167 1196338 1217882 1240388 1263699 1287473 1311397 1335159 1358540 1381136 1401727
62054 1401727 1418553 1430675 1438523 1442744 1443132 1439182 1430984 1418870 1402727 1382471 1358639 1331712
62042 1331712 1301235 1266554 1228192 1187628 1145839 1102939 1059249 1015873 973981 934132 896366
62031 896366 860435 825875 792485 760971 732638 708235 687366 669098 652725 637874 624253
62020 624253 611568 599485 587667 576032 564955 554911 545898 537481 529377 521714 514695 508382 502852
62007 502852 498354 495154 493364 492917 493605 495178 497563 500912 505251 510219 515350 520490 525721 530984 536045
61992 536045 540779 545230 549389 553039 555801 557262 557251 556089 554373 552348 549742 546436 543005 540189 538053
61977 538053 536027 533710 531257 529047 527263 525822 524523 523249 522068 521056 520028 518743 517384 516365
61963 516365 515473 513797 510946 507800 505452 503759 501678 498828 495916 493635 491933 490584 489821 489965 490830
61948 490830 491928 493171 495073 498191 502439 507067 511462 515976 521704 529341 538561 548781 560133 573243
61934 573243 588170 604097 620074 635728 651203 666625 681695 695686 707926 718342 727308 734857
61922 734857 740420 743610 744874 744989 744213 742374 739504 735854 731519 726633 721812 717898 715295 714025 714348
61907 714348 716838 721824 729112 738190 748352 758802 769071 779124 788583 796135 800401 801350 800115
61894 800115 797396 792742 785563 776113 765152 753183 740429 727234 714172 701891 690967 681628
61882 681628 673540 666081 658889 651943 645149 638195 630858 623166 615306 607662 600819 595140 590381 586113
61868 586113 582510 580287 579873 580945 582731 584442 585671 586835 589105 593310 599078 605644 613341 623443
61854 623443 636449 651344 666820 682599 699359 718012 739342 763641 790259 817864 845414
61843 845414 872526 898820 923504 945811 965264 981326 993401 1001447 1005927 1006922 1004113 998054 990636
61830 990636 983530 976828 970020 963769 959677 958494 959538 961981 965889 971695 979165 987202 994379 999491
61816 999491 1001801 1001002 996928 989357 978135 963425 945687 925525 903670 881032 858539 836869
61804 836869 816269 796532 777216 758207 740112 723833 709664 697054 685373 674610 665162 657186
61792 657186 650337 643981 637568 630988 624677 619152 614389 609875 605256 600621 596116 591697 587417 583566
61778 583566 580395 577935 576125 574759 573264 571061 568309 565838 564165 563056 562114 561208 560112 558451 556448
61763 556448 555049 554746 554820 554371 553620 553455 554059 554739 554953 554813 554710 555079 556450 559007 561983 564066 564547
61746 564547 563733 562213 560239 557933 555611 553558 551673 549583 547081 544412 542155 540717 539840 538808 537285
61731 537285 535737 534778 534351 533925 533370 533188 533924 535684 538257 541336 544517 547361 549638 551469 553239 555406
61715 555406 558206 561325 563951 565402 565677 565264 564500 563264 561234 558310 554819 551404 548535 546050 543339
61700 543339 540051 536391 532621 528637 524293 519851 515836 512606 510238 508506 506709 503966 500110 495988
61686 495988 492470 489410 486048 482147 478151 474478 471288 468806 467125 465649 463447 460398 457419 455310
61672 455310 453870 452395 450591 448638 446775 445259 444409 444204 443914 442625 440222 437595 435735 434812 434274
61657 434274 433663 433056 432745 432765 433020 433640 434845 436435 437789 438488 438656 438614 438607 439088 440703 443537 446629 448833
61639 448833 450016 450944 452143 453421 454454 455205 455597 455293 454006 451724 448507 444456 440039 435962 432445
61624 432445 428971 425111 421294 418384 416690 415803 415260 414915 414622 414015 412803 411053 408978 406604 403828
61609 403828 400624 397026 392984 388524 384009 379956 376508 373276 369834 366207 362729 359620 356931 354746
61595 354746 353137 351924 350709 349148 347090 344546 341792 339367 337626 336296 334739 332720 330638 329034
61581 329034 328110 327774 327829 328038 328194 328126 327528 326010 323667 321394 320074 319583 319165 318683 318740 319455 319968 319455
61563 319455 318035 316342 314841 313885 313739 314163 314601 315146 316548 318799 320672 321436 322093 323876 326215 327487
61547 327487 327374 327047 327177 327198 326814 326891 328280 330606 332910 334798 336382 337643 338511 339383 340992 343737 347338
61530 347338 351091 354379 356976 358916 360019 359832 358240 355887 353631 351829 350522 349978 350390 351251 351780
61515 351780 351967 352511 353660 354803 355312 355191 354721 354129 353762 353953 354402 354292 353343 352211 351530 351079 350272 348968
61497 348968 347418 345830 344460 343727 343718 343868 343617 343161 343114 343553 343893 343754 343545 344069 345677 347898 349903 351316
61479 351316 352506 353973 355603 356882 357761 358834 360533 362550 364276 365455 366151 366457 366591 367013 367982 369100
61463 369100 369624 369277 368564 368258 368729 369740 370760 371445 371894 372466 373397 374614 375843 376832 377564 378338 379506
61446 379506 380985 382163 382483 382028 381337 380868 380893 381682 383379 385714 388129 390128 391360 391705 391671 392374 394558
61429 394558 397805 401171 404292 407225 409567 410736 411051 411537 412527 413384 413819 414514 416110 418455 421289 424763
61413 424763 428712 432278 434980 437449 440269 442732 443648 442986 441789 440759 439784 438710 437699 436769 435639
61398 435639 434119 432172 429660 426617 423747 422070 421917 422651 423395 423644 423224 422169 420806 419626 418848 418340
61382 418340 417955 417692 417518 417295 416925 416421 415867 415487 415606 416316 417252 417961 418398 418811 419334 420026 421175 423001
61364 423001 425018 426123 425667 424292 423462 424174 426208 428639 430968 433570 437016 441199 445474 449571 453967
61349 453967 459254 465508 472436 479776 487354 495038 502872 511000 519330 527563 535657 543725 551296 557285
61335 557285 561194 563822 566241 568502 569987 570650 571039 571220 570486 568236 564615 560211 555669 551642 548571
61320 548571 546382 544805 544023 544537 546316 548665 551066 553672 556825 560576 564948 570185 576424 583468 591231
61305 591231 600116 610595 622628 635875 650287 666030 682776 699383 714438 726994 736814 744089
61293 744089 749076 751859 752211 749614 743656 734607 723556 711753 699795 687610 675150 662750 650800
61280 650800 639518 629216 620382 613105 606785 600780 595203 590689 587542 585513 584284 583776 584019 585034
61266 585034 586778 588944 590951 592516 594145 596671 600383 604949 610084 615883 622608 630595 640270 651706
61252 651706 664072 675997 686564 695558 702776 707753 710401 711370 711368 710444 708247 704736 700373 695824 691704
61237 691704 688386 685830 683671 681604 679561 677602 675985 675303 676111 678231 680844 683537 686837 691495 697629
61222 697629 704874 712974 721766 730923 740237 749962 760367 771059 781213 790438 798967 807011 814389
61209 814389 820890 826567 831565 836000 840132 844317 848579 852525 855946 859315 863519 869261 876778 885837
61195 885837 895842 906290 917510 930718 946922 965871 986416 1007661 1029170 1050126 1069108
61184 1069108 1085125 1098369 1109479 1118432 1124692 1128216 1129711 1129912 1129148 1127603 1125454 1122486 1117979 1111264
61170 1111264 1102280 1091368 1078763 1064419 1048269 1030499 1011560 991824 971162 949086 925614
61159 925614 901800 878992 857606 837160 817441 799015 782413 767497 753994 742115 732191 724123
61147 724123 717687 713059 710513 709812 710260 711184 712029 712271 711618 710105 707726 704292 700012 695816 692646 690795
61131 690795 690367 691869 695670 701273 707986 716072 726379 739054 753535 769799 788575 810118 833642
61118 833642 858391 884534 912675 943085 975765 1010619 1047098 1084155 1121007 1157548 1193763
61107 1193763 1229250 1263617 1296712 1327979 1356140 1380152 1400101 1416624 1429749 1438905 1443759 1444353
61095 1444353 1440511 1431773 1417962 1399346 1376131 1348266 1315970 1280219 1242513 1204199 1165983 1128003
61083 1128003 1090336 1053414 1017864 984041 951965 921680 893306 866710 841666 818582 798522
61072 798522 782031 768271 755853 744254 733903 725065 717342 710393 704620 700837 699477 700225 702276
61059 702276 704857 707690 711031 715272 720585 726992 734540 743252 753031 763858 775910 789336 804138
61046 804138 820453 838713 859154 881416 904949 929695 955957 983772 1012762 1042555 1072915
61035 1072915 1103591 1134435 1165658 1197546 1229915 1262272 1294522 1327120 1360469 1394511 1428984
61024 1428984 1463817 1499284 1536009 1574609 1614866 1655381 1694691 1732853 1771512 1812595 1857594
61013 1857594 1908057 1965779 2032089 2107648 2193291 2290491 2400857 2526376 2671032 2841771
61003 2841771 3047479 3297911 3604268 3979828 4439051 4997118 5671772 6484649 7458994
60994 7458994 8616524 9976981 11554875 13343481 15289194 17276784 19143634 20719371
60986 20719371 21871841 22544687 22779852 22715105 22544280 22445426 22509654 22709043 22915372 22950259
60976 22950259 22640985 21870018 20612852 18951055 17046515 15083806 13212351 11519312
60968 11519312 10036956 8764301 7684081 6771917 6002589 5354366 4809461 4352092 3967791
60959 3967791 3644075 3370190 3136043 2932613 2753483 2594858 2453942 2328185 2216064
60950 2216064 2117151 2030831 1955820 1891164 1836516 1790727 1751218 1715527 1682653 1652068 1622403
60939 1622403 1592372 1562518 1534715 1510014 1487981 1468040 1450271 1434685 1420764 1408309 1398081
60928 1398081 1390997 1387064 1385540 1385858 1387963 1391911 1397521 1404478 1412510 1421315 1430395 1439086 1446880 1453663
60914 1453663 1459456 1463989 1466747 1467507 1466505 1463950 1459715 1453689 1446105 1437216 1426990 1415418 1402743
60901 1402743 1388920 1373224 1355018 1334784 1313793 1292767 1271420 1249289 1226481 1203474 1180662
60890 1180662 1158252 1136256 1114411 1092446 1070590 1049548 1029804 1011137 992907 974628 956215
60879 956215 937967 920399 903920 888537 873939 859854 846213 833044 820381 808284 796787
60868 796787 785878 775544 765712 756150 746742 737990 730753 725133 720052 714403 708313 702670 697742 692944
60854 692944 687832 682515 677078 671298 665103 658726 652268 645669 639236 633620 629086 625316 622043 619258
60840 619258 616609 613245 608672 603246 597461 591236 584268 576649 568625 560178 551368 542915 535875 530803
60826 530803 527516 525516 524292 523342 522366 521583 521619 522923 525267 527788 529596 530457 530935 531726 532900 533957
60810 533957 534565 534915 535325 535799 536175 536485 537084 538441 540719 543344 545158 545335 544115 542337 540432 538322
60794 538322 536159 534428 533219 532007 530422 528720 527185 525503 523078 519692 515645 511530 507960 505144
60780 505144 502540 499303 495198 490686 486076 481198 476140 471604 468084 465114 461874 458180 454531 451494
60766 451494 449465 448735 449292 450704 452501 454480 456433 457976 459020 460158 462130 465005 468140 470803 472612
60751 472612 473620 474262 475078 476356 478161 480753 484499 489281 494408 499342 504058 508423 511715 513148 512478
60736 512478 509775 505107 498874 492033 485405 479058 472796 466919 461906 457596 453258 448426 443251 438119
60722 438119 433306 428930 424901 420972 417036 413293 409995 407228 404970 403052 401062 398811 396921 396242
60708 396242 396420 395871 393675 390728 388430 387020 385996 385479 386014 387372 388620 389254 389464 389404 389095 388947 389567
60691 389567 390992 392757 394669 396865 399249 401623 404284 407726 411817 416064 420654 426314 432978 439460
60677 439460 444731 448883 452588 456298 460243 464597 469283 474047 478941 484232 489642 494221 497235 498759
60663 498759 499206 498744 497427 495459 493034 490215 487171 484229 481550 479096 476981 475470 474537 473814 473118
60648 473118 472667 472708 473244 474133 475035 475297 474409 472658 470822 469065 466666 462997 458309 453352 448679 444511
60632 444511 440859 437570 434599 432376 431416 431441 431369 430443 428962 427744 427316 427828 429237 431136 432716 433231
60616 433231 432382 430293 427514 425067 423870 423835 423951 423503 422771 422375 422545 423313 424766 426604 427946 428164 427586
60599 427586 426942 426460 425991 425674 425868 426660 427895 429505 431348 432953 433981 434724 435608 436386 436498 436211 436650
60582 436650 438444 440868 442644 443260 443172 443005 442998 443127 443431 444058 445171 446957 449684 453629 458884 465318 472799
60565 472799 481387 491206 502175 513978 526286 538803 551071 562386 572017 579501 584651 587370 587496
60552 587496 584860 579561 572300 564350 557057 551297 547418 545479 545367 546743 549127 552123 555545 559415
60538 559415 564003 569782 577221 586596 597930 610874 624624 638294 651500 664285 676320 686632
60526 686632 694354 699294 701447 700578 696882 691575 686077 680857 675678 670530 665501 660138 654048 648062
60512 648062 643637 640974 638746 635945 633008 630824 629667 629630 631170 634514 639226 645096 652931 663749
60498 663749 677678 694313 713855 737245 765339 798349 835853 876907 920374 965406 1011299
60487 1011299 1056651 1099114 1136330 1166668 1188761 1201064 1202568 1193560 1174969 1147366 1111366 1068791
60475 1068791 1022580 975418 928877 883807 840893 800679 763509 729693 699561 673243 650487
60464 650487 630685 613115 597350 583484 571680 561448 551849 542518 533959 526515 519565 512278 504718
60451 504718 497668 491672 486794 482998 480118 477555 474631 471248 467792 464485 461231 458072 455362 453500
60437 453500 452691 452817 453310 453438 453073 452901 453470 454392 454903 454805 454220 452853 450428 447758 446332 446601 447503 448030
60419 448030 448537 449935 452099 453787 453989 452838 451183 449697 448561 447751 447332 447424 448047 449099 450411 451693
60403 451693 452541 452805 452878 453319 454111 454745 455147 456046 458051 460798 463443 465740 468105 470812 473633 476229
60387 476229 478483 480449 482311 484377 486815 489413 491816 493936 495906 497764 499424 500838 502004 502983
60373 502983 504092 505806 508139 510443 512136 513374 514597 515761 516591 517341 518582 520247 521565 522113 522425
60358 522425 523363 525237 527775 530678 534017 538204 543529 549642 555729 561522 567915 576095 586140 596922
60344 596922 607377 617293 626729 635151 641484 644819 644920 642214 637452 631251 623894 615635 607057 599016
60330 599016 592273 587262 583934 581607 579258 576374 573316 570494 567485 563593 559123 555359 553098 551789
60316 551789 550424 548896 548073 548740 550750 553270 555756 558622 562848 568985 576871 586370 597951 612249
60302 612249 629504 649813 673363 699700 727056 753145 776420 795807 809561 815590 813212 803673
60290 803673 788641 769095 746106 721734 698279 677032 658405 642795 630541 621164 613482 606544
60278 606544 600070 593976 588007 582049 576436 571633 567648 563954 559989 555654 551241 546983 542860 538924
60264 538924 535550 533100 531458 530147 528775 527144 525119 522795 520750 519697 519766 520423 521094 521547 521724 521657
60248 521657 521648 522081 522921 523735 524344 525031 525934 526682 526930 526926 527152 527626 527920 527789 527463 527308 527473 527971 528993 530932
60228 530932 534007 537872 541820 545372 548535 551457 554229 557190 560907 565368 569575 572618 575001 578192
60214 578192 582919 588603 594493 600600 607293 614703 622873 631863 641316 650472 659019 667376 675752 683499
60200 683499 690037 695875 701946 708234 713889 718564 722789 726886 730330 732514 733521 733631 732478 729355
60186 729355 724322 718439 712745 707299 701487 695004 688177 681398 674728 668206 662187 657003 652471 648120
60172 648120 643823 639856 636335 633015 629811 627222 625946 626076 626836 627143 626479 625231 624195 623871 624398 625966
60156 625966 628691 631924 634376 635520 636438 638556 641856 645062 647469 649647 652290 655280 658301 661593
60142 661593 665572 670173 675067 680209 685754 691744 698289 705809 714692 724772 735414 745977 756050
60129 756050 765428 773982 781405 787076 790526 792134 792966 793687 793964 793162 791301 789135 787566 787207 788156 789948
60113 789948 791965 794062 796508 799205 801453 802734 803221 803225 802658 801431 799848 798024 795342 791112 785504
60098 785504 779229 772666 766021 760102 755957 753603 751850 749648 747125 745060 743931 743775 744495 745813 747237
60083 747237 748515 750027 752400 755791 759850 764233 768781 773117 776425 777889 777286 774942 771238 766299
60069 766299 760054 752347 742989 732077 720355 708900 698193 687846 677534 667830 659530 652334 644961
60056 644961 636765 628645 622028 617377 614050 611284 608940 607353 606825 607327 608621 610666 613771 618151 623479
60041 623479 629243 635478 642652 650752 659040 666898 674329 681277 687034 690943 693365 695262 696830 697068
60027 697068 694842 690107 683998 677839 672039 665833 658151 648768 638473 628179 618217 608575 599360 590715
60013 590715 582653 575350 569340 565010 562054 559767 557663 555478 552850 549536 545860 542503 539774 537480
59999 537480 535456 533904 533137 533288 534284 535862 537621 539365 541375 544089 547507 551222 555066 559297 564029
59984 564029 568785 572903 576161 578765 580833 582179 582598 582132 580951 579099 576461 572942 568619 563847 559283
59969 559283 555664 553266 551582 549796 547632 545513 543869 542732 542204 542814 544892 547917 551070 554246 557869
59954 557869 561834 565346 567920 569882 571662 573197 574285 575013 575556 575987 576580 577757 579406 580704 581017
59939 581017 580583 579930 579046 577603 575657 573555 571362 568924 566436 564490 563468 563101 562675 561682 560423 559951
59923 559951 561064 563251 565097 565904 566451 567897 570521 573954 578116 583171 588850 594490 599756 604890 610226
59908 610226 615780 621204 625951 629649 632489 634921 636790 637304 636273 634870 634527 635426 636684 637667 638390
59893 638390 638893 639180 639806 641739 645370 650192 655588 661438 667757 674253 680512 686378 691945 697418 703037
59878 703037 708927 714984 721142 727604 734464 741116 746495 749910 751287 750561 747269 740986 731970 721292
59864 721292 710488 701006 693589 687912 682930 677663 671680 665022 657953 650791 643839 637462 632246 628835
59850 628835 627449 627769 629480 632673 637459 643575 650744 659152 669032 679917 690765 700714 709308 716136
59836 716136 720850 723617 725125 726127 727349 729709 733961 739839 745963 750820 753612 754122 752213 747773
59822 747773 740998 732465 722894 712809 702319 691335 680122 669539 660462 653074 646906 641485 636690
59809 636690 632616 629359 626814 624483 621668 618256 615057 612918 611618 610114 607829 605221 603050 601613
59795 601613 600724 599948 598682 596501 593700 591146 589332 587891 586276 584622 583538 583187 582977 582220 580857
59780 580857 579331 577926 576524 575044 573788 573071 572672 572082 571202 570338 569397 567651 564616 560791 557283 554957
59764 554957 554237 555257 557715 560732 563312 565006 566091 567367 569779 573707 578382 582526 585921 589822
59750 589822 595404 602379 609645 616719 623814 630967 638010 645138 652662 660240 667057 672685 677174 680451
59736 680451 682345 683129 683370 683197 682289 680575 678457 676377 674636 673471 672793 672032 670810 669563 668857 668385
59720 668385 667437 666197 665629 666114 667026 667758 668278 668502 667961 666481 664581 662907 661708 660975 660601 660278 659783
59703 659783 659393 659589 660298 660931 661054 660458 658786 655935 652832 650930 650745 651517 652326 652807 652765 652016 650839
59686 650839 649830 649066 648101 646944 646266 646480 647369 648751 650591 652274 652747 651773 650169 648409 645875 642016
59670 642016 637371 632789 628383 623906 619566 615761 612449 609342 606320 603247 599847 596196 592935 590626
59656 590626 589335 589113 590235 592540 595128 597262 599132 601413 604533 608657 613701 618946 623219 625917
59642 625917 627316 627598 626359 623579 620278 617466 615058 612483 609767 607308 605160 603364 602452 602737 603416
59627 603416 603301 602261 601160 600453 599601 597872 595158 591953 588951 586681 585134 583768 582063 579999 577905
59612 577905 576089 574806 574256 574436 575317 577227 580605 585241 590303 595280 600297 605340 609975 614062 617910
59597 617910 621314 623449 624250 624871 625884 625994 623680 619400 615017 611526 608553 605765 603468 601803 600426
59582 600426 599078 597685 595928 593539 590980 589031 587660 586069 583875 581520 579453 577676 576207 575290
59568 575290 574930 574757 574516 574227 573905 573623 573854 575127 577264 579528 581596 583823 586378 588687 590096 590704
59552 590704 591245 592328 593999 595870 597518 598783 599753 600556 601402 602875 605814 610640 617064 624682 633624
59537 633624 644365 657223 672237 689105 706751 723291 736808 746028 750134 748714 742678 734793
59525 734793 728356 725168 725131 727518 731879 737795 744437 750684 755508 758348 759409 759353 758282 755214 748997
59510 748997 739624 728227 715974 703391 690646 677985 665869 654906 645503 637367 629617 621756
59498 621756 614280 608010 603120 599222 596067 593726 592290 591774 592070 592677 592850 592388 591926 592124 593001 594440
59482 594440 596699 599826 603157 606063 608843 612229 616483 621524 627370 633711 639696 645028 650659 657360
59468 657360 664161 669464 673359 677424 682340 687095 690722 693534 696236 698934 701572 704504 708090 712402
59454 712402 717743 724861 734173 745165 756863 768516 779666 789951 799107 806864 812690 815932 816215
59441 816215 813513 807955 799846 789737 778120 765311 751916 739022 727404 716960 707477 699527
59429 699527 693831 690172 687833 686823 687734 690636 695093 701209 709656 720687 734034 749748 768170
59416 768170 788983 811194 834157 857817 881943 906071 930189 954401 977556 997008 1009963
59405 1009963 1014503 1009652 995835 975704 953423 932546 915050 902278 895457 894624 897851 902076 904140
59392 904140 901046 890584 872785 850241 826391 803664 783264 765766 751167 738888 728334 719369
59380 719369 712140 706866 703793 702790 702946 703248 703706 705081 707449 709916 711851 713455 714905 715972 716825
59365 716825 718234 720520 723201 726091 729796 734589 739718 744436 748932 753674 758664 764005 770436 778630
59351 778630 788597 800321 814274 830699 849086 868969 890479 913467 936816 959437 981269 1002527
59339 1002527 1022562 1040233 1054889 1066264 1073923 1077562 1077343 1073205 1064428 1050748 1033427 1014344
59327 1014344 994372 973425 951665 929754 908217 887513 868533 852119 838108 825521 813662
59316 813662 802467 791993 782292 773618 766055 758994 751674 744187 737382 731730 726916 722579 718864 716046
59302 716046 713985 712242 710656 709818 710938 714943 721553 729592 738372 748315 759769 771587 781318 786600
59288 786600 786113 779701 768256 753457 737233 721375 707533 696950 689762 685022 681893 680534 681569
59275 681569 685177 691216 699685 710414 722651 735676 749637 765168 782303 800267 818166 835277
59263 835277 850746 863592 873130 879094 881354 879879 874945 867173 857380 846421 834928 823033 810623
59250 810623 798041 786196 775839 767095 759938 754587 751150 749335 748881 749866 752233 755518 759502 764693
59236 764693 771717 780564 790759 801769 812809 822818 831233 838358 844436 848821 850678 850000 847325
59223 847325 842878 836727 829324 821107 811906 801572 790891 780981 771968 763120 754200 745786 738214 731094
59209 731094 724096 717492 711572 706021 700136 693365 685531 676948 668444 660972 655007 650426 646867 643955
59195 643955 641366 639034 637201 635962 634917 633713 632775 633035 634853 637580 640248 642358 643965 645366 646903
59180 646903 648964 651930 655995 660974 666408 672062 678259 685471 693678 702454 711603 721257 731382 741811
59166 741811 752847 765199 779030 793560 807792 821098 832914 842502 849339 853280 854162 851832 846738
59153 846738 839791 831365 821166 809226 796146 782134 766872 750832 735586 722076 709590 697236
59141 697236 685410 674836 665147 655629 646546 638522 631258 624126 617433 611776 606676 601252 595915 591942
59127 591942 589563 587871 586571 586438 587902 590445 593611 597499 602052 606961 612510 619496 628004 637180
59113 637180 646523 656493 667506 679100 690522 701431 711708 721163 729758 737634 744796 751265 757488
59100 757488 763897 769972 774502 776977 778106 778755 779014 778491 776936 774402 771311 768503 766633 765405 764004
59085 764004 762341 761164 760683 759762 756933 751757 744888 737168 729039 720621 712070 703844 696501 690060 683744
59070 683744 676757 669234 662094 656123 651539 648170 645526 642856 639736 636558 634006 632174 630655 629274
59056 629274 628163 627260 626381 625640 625231 624829 623844 622223 620540 619330 618760 618765 619009 618849 617860 616260 614431
59039 614431 612409 610302 608721 608108 608038 607894 607821 608292 609217 610366 612166 615029 618406 621722 625926 632730
59023 632730 642419 653733 665873 679213 693839 708776 723063 736424 748438 758182 765188 769781
59011 769781 772081 771615 768444 763726 758617 753394 748148 743550 740363 738833 739020 741148 745256 751101 758699
58996 758699 768256 779322 790752 801950 813425 825665 838099 849715 860099 869370 877480 884092
58984 884092 888798 891177 890911 888134 883428 877486 871138 865526 861596 859316 858034 857690 859093 862995 869513
58969 869513 878505 889753 902664 916453 930827 945899 961473 977141 993091 1009964 1027772 1045616
58957 1045616 1062466 1077351 1088870 1095596 1097283 1094779 1088544 1078087 1063080 1044131 1022270 998543
58945 998543 974289 950789 928319 906466 885547 866687 850268 835496 821908 810127 800599 792793
58933 792793 786288 781527 778672 776735 774757 772999 772064 771655 771110 770490 770118 769516 767771 764690 760904 757091
58917 757091 753680 751039 749275 748052 746953 745865 744821 743886 743463 744224 746494 750136 755170 761876 770099
58902 770099 779191 788940 799877 812396 826307 841517 858321 876608 895606 914919 935176 957216
58890 957216 981323 1007688 1036869 1069206 1104324 1141605 1180589 1220624 1260708 1299822 1336660
58879 1336660 1368967 1394356 1412283 1424174 1431037 1431833 1424840 1409690 1387393 1359313 1326923 1291863
58867 1291863 1255416 1218396 1182000 1148014 1117667 1091006 1067830 1048250 1031753 1016748 1001966
58856 1001966 987583 974222 961596 948862 935556 921479 906543 891605 878582 868690 861026 853647
58844 853647 845514 836696 827464 818108 809059 800277 790985 780745 770290 760596 751679 742966 734285 725819
58830 725819 717666 710076 703526 697968 692684 687488 683288 680856 679888 680018 681788 685728 691265 697481 704197
58815 704197 711443 718639 725250 731555 737782 743208 747062 749646 751664 753165 754070 754863 755665 755402 753079
58800 753079 749222 744920 740118 734162 727398 720864 714761 708514 702045 695826 689875 683806 677705 672089
58786 672089 667289 663618 661688 661671 662785 664350 666750 670418 674571 678098 681051 684091 687069 689400 691222
58771 691222 692730 692918 690548 686150 681576 677635 673565 668850 664153 660235 657006 654006 651020 648166
58757 648166 645978 645338 646703 649641 653655 658916 665373 671836 676966 680763 684045 686984 689307 691529
58743 691529 694788 699622 705832 713172 721168 728760 735303 741512 748347 755361 761377 766359 771342 776850
58729 776850 782689 789051 796481 804926 813975 823805 834659 845673 855530 864090 872166 879957 887064 893911
58715 893911 901699 910904 920971 931397 941899 951635 959527 965441 969943 973004 973995 972748 969402 963368
58701 963368 953680 940272 923812 904520 882385 858286 833587 808830 784125 760462 739124 719960
58689 719960 701817 684623 669522 656921 645972 636089 627466 619917 612623 605220 597908 590449 582443
58676 582443 574620 568363 563862 560174 557197 555976 556878 559119 562444 567703 575253 584292 594377 606251
58662 606251 620518 636570 653289 669752 684852 697278 706317 711847 713550 711196 705691 698562 690386
58649 690386 681012 671268 662844 656176 650021 643460 636936 631033 625795 621651 619477 619146 619447 620011 621958
58634 621958 626049 631564 637620 644221 651218 657462 661853 664328 665223 664637 662970 661116 659578 658221 657249
58619 657249 657492 659418 662860 667898 674920 683635 693229 703712 715865 729569 743486 756636 768853
58606 768853 779352 786366 788954 787921 784412 778744 771103 762165 752441 742010 731257 720806 710575
58593 710575 700171 690368 682781 677846 674711 673320 674806 679343 685515 692608 701730 713689 727386
58580 727386 741425 755842 770995 786007 799566 811348 821631 830418 837885 844856 851993 859286
58568 859286 866947 876004 887450 901720 919395 941308 967412 996568 1027941 1061543 1096970 1132692
58556 1132692 1166974 1198380 1225122 1245329 1258408 1265004 1265490 1260059 1250463 1239686 1229178 1218157
58544 1218157 1206243 1194828 1184868 1175175 1164106 1151423 1137320 1121110 1102188 1081106 1058604 1034704
58532 1034704 1009764 985311 962914 943314 927233 915616 908223 903377 899968 898398 898846 900244 901871
58519 901871 904376 908052 911577 913545 913919 913019 910537 906592 902291 898116 893191 887134 881106 875901 870548
58504 870548 864000 856757 849630 842481 835455 829875 826476 824031 821045 817475 813603 808812 802898 797164
58490 797164 792711 788981 785349 782736 782202 783334 785486 789245 795135 802252 809837 818931 830816 844994
58476 844994 860301 876882 895332 914755 933163 948948 960772 967135 967573 963420 956263 946613 934963
58463 934963 922695 910788 899089 888077 879745 875336 873794 873948 876623 882938 892025 902255 913409
58450 913409 925847 938743 950722 961075 968876 972276 970279 964037 955086 943719 930371 916794
58438 916794 904250 892289 881027 872685 868940 868492 869252 871185 874945 879592 884085 889411 896841 905580
58424 905580 914462 924382 936506 949503 961109 971100 980224 987565 991669 993033 992762 989942 983156 973605
58410 973605 963835 954181 943170 930703 918064 905423 892044 878611 866796 856856 847879 839917
58398 839917 833669 828557 823354 818285 814530 812157 810390 809166 808591 807723 805782 803602 802110 800584 798357
58383 798357 796825 797585 799930 802497 805971 811754 819267 827124 835641 845652 856096 865398 874016 883056
58369 883056 891830 899420 907127 916434 925936 933377 939470 946681 955578 965495 977315 992044 1007758
58356 1007758 1021577 1033833 1046842 1060358 1071726 1079881 1085777 1089432 1089926 1087955 1085320 1082379 1078814
58343 1078814 1076012 1075628 1076688 1077222 1077842 1080630 1085630 1091794 1100229 1113018 1129714 1148370 1168930 1192153
58329 1192153 1216404 1239136 1260428 1281441 1300765 1316169 1328580 1340180 1349922 1355261 1357089 1358434
58317 1358434 1359445 1358368 1356438 1356789 1359197 1360817 1361575 1363933 1367856 1371083 1374142 1380075 1389310 1399625
58303 1399625 1411033 1425755 1443388 1460937 1477735 1495629 1514432 1531892 1548097 1565283 1583479
58292 1583479 1600955 1618482 1638282 1659294 1678469 1696106 1714693 1733205 1748147 1759610 1770593
58281 1770593 1780953 1787992 1792553 1798278 1805169 1810206 1814195 1821677 1834319 1850885 1873483 1906788 1950748
58268 1950748 2000625 2054318 2112995 2174834 2235696 2296250 2361178 2431109 2502632 2576074 2655172
58257 2655172 2738876 2821809 2903254 2987230 3073222 3155778 3234069 3312724 3392216 3467812 3539444
58246 3539444 3613203 3691518 3771201 3852605 3940844 4036272 4133767 4233243 4340768 4457642 4579050
58235 4579050 4705329 4843306 4994338 5152563 5317318 5495385 5688510 5891268 6104119
58226 6104119 6335688 6589107 6859450 7147727 7463184 7808182 8175649 8565554 8988625
58217 8988625 9449787 9944551 10476668 11062035 11709671 12417019 13190251 14050531 15013986
58208 15013986 16086133 17283801 18641886 20191519 21955909 23978210 26330919 29090929
58200 29090929 32335632 36178075 40780181 46323294 53002756 61068632 70837275 82650374
58192 82650374 96868850 113921726 134291597 158397551 186509763 218717458 254705955
58185 254705955 293231934 331692348 366316610 392986790 408213309 409937981 398136456
58178 398136456 375042182 344597045 311146773 278114120 247423087 219722535 194901188
58171 194901188 172526580 152178893 133666640 117022689 102322499 89538269 78539204
58164 78539204 69143691 61134972 54278489 48371812 43269741 38855085 35014628 31656231
58156 31656231 28719809 26152658 23892831 21887572 20106226 18522004 17099219 15809171
58148 15809171 14640548 13583013 12616251 11724689 10907483 10164270 9484958 8861731 8296769
58139 8296769 7789193 7327297 6902035 6515824 6169984 5855271 5562693 5292440 5044379
58130 5044379 4810407 4584034 4367970 4165215 3972004 3786095 3612595 3454665 3307112
58121 3307112 3165578 3033543 2914026 2802723 2695803 2596596 2508332 2427644 2351253 2281815
58111 2281815 2221244 2165158 2109724 2057450 2010813 1966707 1922545 1881280 1844874 1808976 1769598
58100 1769598 1729433 1692518 1658374 1626268 1599432 1579829 1563944 1548432 1534576 1522753 1508291
58089 1508291 1487793 1464220 1440747 1414810 1383248 1348254 1313069 1276546 1237163 1198003 1162610
58078 1162610 1129922 1097933 1068244 1042315 1017280 990342 963641 940235 918989 897896 878781
58067 878781 864048 852078 840206 829099 820095 811563 802041 793646 788229 783300 775843 767000 758973
58054 758973 750485 739443 727016 715007 702260 687805 674517 665289 658289 650241 641786 635392 630553
58041 630553 625373 620596 617734 615240 610778 605595 602720 602425 602968 603978 605547 605815 603146 599069 595657
58026 595657 591691 584784 575572 566354 557217 546964 536442 527647 520725 514821 510466 508262 506619 503660
58012 503660 499973 496954 494168 490903 488379 487598 486859 484288 480924 478416 475660 470880 465208 460947 457824
57997 457824 454183 450391 448026 447096 446944 448354 451810 455302 456921 458072 461059 465097 467965 470030 473184
57982 473184 477035 479583 480635 481223 480628 477320 472146 467471 463754 459802 455613 452071 448631 444227 439839
57967 439839 437310 436305 435113 433721 433313 433420 432469 430679 429762 430099 430664 431243 432275 433034 432351 430672
57951 430672 429219 427726 425178 421996 419303 416832 413813 411025 409694 409231 408344 407436 407590 408323 408886 410729
57935 410729 416014 424485 434339 445237 457755 470851 482783 493823 505228 516183 524601 530387
57923 530387 535070 538704 539993 539080 537366 534831 530269 523992 517683 511756 505402 498907 493336 488196
57909 488196 482101 475555 470462 467002 463585 459688 456113 452604 447911 442266 437136 432401 426351 418679
57895 418679 411025 404387 398382 393205 389853 388041 386139 383541 381127 379298 377578 376174 375878 376442 377088
57880 377088 378362 381309 385073 387673 388917 390129 391245 390898 389336 388454 388717 388770 388401 389210 391818 394962
57864 394962 397794 400536 402383 401469 397817 393938 391615 390280 389185 388750 388872 388277 386764 386026 387040
57849 387040 388399 388298 386628 384218 381600 379371 378218 377759 376663 374447 371801 368807 364568 359071 353699
57834 353699 349333 345549 342124 339681 338311 337207 336154 335773 335931 335625 334821 334592 335087 335260 335076 335940
57818 335940 338229 340352 341109 341158 341334 341372 341233 341948 344032 346473 348281 349632 350627 350334 348086 344611 341076
57801 341076 338033 335831 334869 334890 335138 335624 337046 339222 340955 341735 342150 342392 341930 340889 340147 339767 339022
57784 339022 338189 338433 339558 339881 338902 338158 338840 340533 342921 346604 351289 355258 357776 360171 363435 366541
57768 366541 368301 369094 369488 368809 366435 363053 359361 354921 349523 344301 340237 336836 333436 330580 328856
57753 328856 327652 326291 325299 325430 326520 328284 331078 334854 338534 341534 344721 348776 352731 355220 356100
57738 356100 355822 354310 351562 348362 345413 342643 340063 338163 336683 334392 330988 327867 326008 324500
57724 324500 322242 319607 317186 314400 310844 307653 305850 304385 301524 297342 293200 289506 285610 281421
57710 281421 277579 274263 271023 267641 264240 260846 257550 254640 252036 249233 246293 243931 242047 239412
57696 239412 235643 232254 230681 230397 230150 229898 230157 230385 229589 227909 226226 224693 222891 220987 219622 218989
57680 218989 219041 220201 223051 227723 234381 243737 256388 272320 291774 315989 346312 383185 426587
57667 426587 476573 532653 593182 655635 716247 768863 805796 821362 814272 786509 741736 685675
57655 685675 625885 568703 516727 470254 429888 396183 368028 343567 322361 305067 291449
57644 291449 280261 270731 262683 255565 248759 242669 238229 235541 234014 233470 233941 234698 234657 233607 232179
57629 232179 230889 230049 230144 231315 232742 233345 232835 231548 229891 228536 228327 229185 229851 229440 228402 227221
57613 227221 225362 222473 219511 217471 215958 214188 212371 210895 209296 207410 206424 207206 208575 208883 208333
57598 208333 207984 207409 205402 202353 199828 198170 196398 194178 192011 189676 186348 182268 178658 176054 174160
57583 174160 173067 172938 172735 171067 168272 165936 164388 162425 159557 156687 154280 151555 147969 144020 140175
57568 140175 136319 132604 129581 127211 124912 122782 121512 120953 120107 118671 117281 116002 114044 111338 108975
57553 108975 107616 106752 106122 106585 108857 112332 115856 118941 121636 123860 125312 125682 124787 122953 121125
57538 121125 119902 118715 116774 114546 113203 112838 112452 111637 110949 110519 109680 108264 107038 106432 105981 105434
57522 105434 105329 105958 106743 107156 107472 108110 108963 109733 110278 110318 109505 108055 106696 105766 105007 104353 104197 104704
57504 104704 105553 106506 107593 108676 109456 109941 110216 109807 108076 105266 102355 99883 97603 95216 92605 89506
57488 89506 85921 82791 81276 81300 81724 81947 82385 83373 84621 85877 87192 88400 89221 89876 90644 90829 89210
57471 89210 85607 81011 76100 70739 65004 59620 55112 51467 48786 47248 46299 44929 42986 41310 40462
57456 40462 40294 40813 42279 44263 45767 46584 47466 48735 49825 50417 50826 51025 50533 49675 49688 51049 52824
57439 52824 54200 55512 57145 58555 59152 59304 59706 60425 61158 61753 62074 62038 62054 62650 63382 63125 61769 60575
57421 60575 60337 60310 59605 58609 58182 58296 58339 58181 58155 58408 58909 59692 60636 61363 61703 61842 61863 61614 61174 60776
57401 60776 60206 59029 57467 56211 55236 53831 52034 50991 51455 52882 54417 55904 57518 59346 61728
57386 61728 65078 68991 72430 75229 78400 82527 86911 90840 94595 98484 101869 103944 104742 104696 104037
57371 104037 103176 102779 102771 102138 100408 98447 97091 95906 94163 92120 90333 88479 85950 83087 80790 79284
57355 79284 78172 77371 77114 77200 77053 76427 75528 74529 73366 71885 69975 67796 65963 65002 64544 63667 62156
57338 62156 60673 59573 58439 57106 56188 56082 56320 56408 56475 56564 56132 54902 53520 52764 52726 53242 54338 55736
57320 55736 56764 57363 58397 60335 62383 63579 64020 64336 64716 65172 66082 67667 69431 70734 71392 71288
57304 71288 70191 68463 67126 66593 66153 65274 64488 64304 64245 63850 63692 64305 64955 64680 63892 63803 64669 65684
57286 65684 66246 66352 66112 65840 66362 68280 70989 73081 73611 72549 70416 68075 66463 65842 65609 65265 65102
57269 65102 65544 66438 67542 69053 71001 72794 74018 75165 76924 79289 81916 84589 86754 87396 86200
57254 86200 84137 82118 79769 76311 71904 67228 62420 57323 52175 47200 42194 37326 33603 31513
57240 31513 29975 27730 25156 23577 23370 23925 24958 26596 28495 30078 31474 33242 35481 38067 41377
57225 41377 45792 50808 55689 60679 66576 73402 80432 87236 93779 99909 105730 112087 119586 127473
57211 127473 134549 140892 147585 155044 162715 170224 177639 184651 190663 195812 201023 206964 213627 220829
57197 220829 228317 235548 242133 248445 255114 262225 269647 277769 287065 297346 308359 320766 335518
57184 335518 352525 370902 390222 410513 431251 451465 470771 489269 506463 521281 533228
57173 533228 542641 549742 554114 555158 552444 545832 535955 524539 513627 504626 498565 496841 500952 511783
57159 511783 529733 555060 587365 625178 666857 711559 758689 807018 855206 902617 948717
57148 948717 992177 1031606 1066806 1098500 1127374 1154230 1180311 1206340 1231750 1255917 1279550
57137 1279550 1303822 1328830 1354209 1380588 1409014 1439369 1470696 1502561 1534725 1566069 1595553
57126 1595553 1624052 1653716 1685561 1719056 1753824 1790302 1828849 1869629 1913398 1961199 2013448
57115 2013448 2070613 2134812 2209671 2298707 2404447 2527847 2666776 2816016 2971935 3138816
57105 3138816 3330208 3564276 3858605 4228465 4687596 5249832 5931556 6754436 7747221
57096 7747221 8946453 10395850 12143044 14234518 16712643 19615283 22972718 26799879
57088 26799879 31090303 35816492 40931510 46366940 52031497 57811322 63558718 69062842
57080 69062842 74028854 78106421 80973356 82431198 82460182 81211182 78943907 75938817
57072 75938817 72422701 68543968 64399077 60072572 55654209 51233173 46891331 42703751
57064 42703751 38737487 35044965 31659533 28596841 25857076 23425963 21278431 19385396
57056 19385396 17718349 16249674 14952684 13803462 12781857 11870398 11053479 10317814
57048 10317814 9652321 9047015 8492601 7980905 7504618 7056658 6630831 6223167 5832046
57039 5832046 5457403 5100494 4763635 4448792 4156439 3886300 3638420 3412538 3207180
57030 3207180 3020649 2852473 2702874 2571528 2457957 2362452 2285275 2225655 2182903 2157473
57020 2157473 2148647 2150866 2153810 2146458 2120638 2071972 2000160 1909429 1807384 1702079 1599603
57009 1599603 1503327 1414027 1330700 1252381 1179427 1112570 1051196 993675 939157 887918 840009
56998 840009 794755 751757 711371 673969 639491 607876 579339 554143 532746 516073 504942
56987 504942 499185 497903 500460 506713 516490 529446 545169 562657 579790 593889 602756 605003 600182
56974 600182 589517 575964 562396 549728 537435 525412 514338 504607 496137 489237 484558 482111
56962 482111 481341 482473 486902 495909 509516 526768 546506 567562 588526 607509 621932 628890 626456
56949 626456 614939 596705 574760 551588 528892 507770 488969 473109 460633 451597 445872 443641
56937 443641 445227 450398 458583 470070 486230 508093 535343 566961 601811 637772 671089 697530
56925 697530 713904 718228 709714 689796 662455 632188 601717 572207 544857 520902 500386 482217
56913 482217 465552 450296 436414 423650 411903 401246 391568 382759 374973 368210 361913 355522 349062
56900 349062 342783 336749 331287 327175 324762 323633 323810 326416 332237 340508 350264 362133 377482 396471
56886 396471 418328 443013 470887 500690 529170 552876 569429 577374 576279 567359 553102 536037
56874 536037 518284 501813 488045 477259 469244 464367 463300 466167 473057 485018 503398 528448
56862 528448 559776 597949 644291 698911 759809 823601 885673 939633 978348 996751 993702 971581
56850 971581 935124 890419 843481 798656 758316 723729 695561 673988 659445 653384 657606 672979
56838 672979 699468 737104 786123 846645 919144 1004462 1101577 1205022 1305377 1392202 1455918
56827 1455918 1488396 1484896 1446806 1381531 1299037 1208800 1119015 1035994 962837 899550 845334
56816 845334 800401 765648 741809 729399 728578 738715 759050 790020 832882 887498 951266 1020313
56804 1020313 1090350 1155573 1207882 1238695 1242111 1216983 1167207 1100593 1026343 952068 882302
56793 882302 819098 763287 715167 674833 642295 617172 598644 586294 580773 582907 592424 608334
56781 608334 630215 657983 690370 724438 756372 781799 795811 794454 776915 745647 704462 657324
56769 657324 608442 561632 518872 480332 445951 415924 389692 366033 344630 326381 311723
56758 311723 299743 289423 280595 273145 266387 259865 253878 248684 244058 240060 237266 235683 234320 232385
56744 232385 230117 227957 225752 223324 221039 219248 217758 216335 215126 214241 213474 212712 212043 211241 209865
56729 209865 208040 206501 205704 205504 205744 206406 207204 207799 208378 209179 209659 209158 208184 207791 207792 207009 205360 204214
56711 204214 204400 205246 205950 206471 206727 206339 205667 205789 206906 208040 208695 209426 210332 210524 209735 208937 208637 208028
56693 208028 206748 205948 206632 208209 209739 211343 213285 214883 215528 215788 216382 216999 217153 217178 217325 216926 215625
56676 215625 214443 214328 214548 213779 212060 210383 209048 207678 206376 205576 205105 204496 203909 203868 204476 205744 208152
56659 208152 211928 216227 220027 223429 227201 231362 235215 238513 241690 245012 248199 250854 252811 254192
56645 254192 255413 256849 258299 259242 259747 260503 261766 263051 264153 265542 267415 269168 270265 270723 270489
56630 270489 269346 267826 267030 266984 266289 264022 260851 257686 254522 251355 248879 247259 245435 242732 240090
56615 240090 238637 238073 237549 237090 236974 236693 235710 234475 233591 232810 231817 231036 230671 230015 228828 228255 229136 230485
56597 230485 231085 231505 232953 235089 236670 237636 238883 240484 241732 242477 242973 242890 241928 240908 240816 241243 241201
56580 241201 241003 241739 243277 244392 244654 244720 244909 244942 244979 245579 246740 248166 250274 253625 257550 260687 262873
56563 262873 265391 269480 275620 283991 294390 305835 317344 328919 340701 351577 359864 365057 367663
56550 367663 367704 364866 359994 354937 350727 347007 343261 339445 335452 331067 326580 322521 318867 315338 312166
56535 312166 309680 307449 304897 302351 300400 298666 296481 294350 293352 293314 292960 291750 290238 288750 287062
56520 287062 285350 284142 283304 282233 281020 280211 279529 278078 275806 273555 271718 270025 268573 267797 267408
56505 267408 266602 265381 264472 263956 263172 262018 261117 260595 259807 258415 256729 254988 253297 252165 251985 252045 251188
56488 251188 249455 248001 247467 247522 247900 248709 249754 250665 251664 253130 254527 254878 254175 253222 252331 251368 250829
56471 250829 251442 252834 253947 254679 255797 257331 258487 259140 259946 261028 261934 262871 264431 266008 266072 264295
56455 264295 262076 260710 260348 260852 262177 263593 263931 263107 262267 262172 262492 262871 263460 264179 264553 264500 264326 263935
56437 263935 263105 262378 262446 262820 262376 261105 259951 259172 258318 257688 258057 258991 259132 258305 257708 257888 258180 258285
56419 258285 258685 259230 259041 258149 257583 257567 257301 256826 257334 259170 261217 262751 264255 265939 267120 267591 268012
56402 268012 268516 268535 268394 269289 271227 272821 273620 274720 276445 277532 277541 277962 279702 281303 281101 279609 278321
56385 278321 277464 276406 275235 274563 274473 274722 275400 276638 278334 280610 283657 286849 289139 290626 292492 295060
56369 295060 297362 298993 300852 303517 306411 309104 311829 314164 314948 314260 313755 314194 314366 313348 312046
56354 312046 311395 310794 309671 309051 310124 312440 314848 317115 319462 321544 323029 324340 325938 327746 329838
56339 329838 332561 335441 337354 338411 340162 343269 346572 349196 351868 355277 358930 362678 367526 373681
56325 373681 379501 383731 387209 391062 394807 397668 400158 402775 404562 404560 403417 402148 400532 398181 395860
56310 395860 394257 392719 390699 389170 389099 389757 390142 390885 393104 396409 399644 402600 405547 408111 410161
56295 410161 412812 417005 421977 426542 430894 435752 440770 445364 450085 455688 461706 467426 473364 480304
56281 480304 487749 494744 501433 508510 515989 523787 532513 542374 552355 561818 571857 583723 596983
56268 596983 610648 625063 641196 659150 678761 700605 724901 750526 776690 804689 836579
56257 836579 873047 913917 959574 1010473 1066409 1127817 1196661 1274622 1361582 1457336 1563361
56246 1563361 1681180 1810285 1949436 2098628 2257805 2424781 2596411 2770713 2945899
56237 2945899 3118326 3283307 3436940 3575305 3693108 3785411 3850034 3886529 3893901 3871401
56227 3871401 3820653 3744928 3647146 3530372 3399188 3258343 3110780 2958737 2805610 2654615
56217 2654615 2506723 2362207 2223219 2092440 1970098 1854776 1746457 1646355 1554406 1469375
56207 1469375 1390947 1319394 1253692 1192381 1135906 1085808 1041844 1002052 965331 931875 901511
56196 901511 873735 849016 827933 809325 791397 774260 759379 746841 735222 723825 713092
56185 713092 703179 694036 686470 681171 677086 672511 667313 662327 657360 651790 646374 642421 639760 637485
56171 637485 635864 635496 635503 634775 634144 635087 637124 638853 640639 643855 648293 652827 657768 663967 670455 675691
56155 675691 680434 686594 693919 700640 706727 713571 721011 727785 734682 744264 757554 773761 793032
56142 793032 816748 845288 878235 916611 962217 1015082 1074211 1140394 1215325 1298202 1385997
56131 1385997 1476606 1568616 1658266 1740135 1811347 1872505 1924641 1968215 2005068 2038112 2068440
56120 2068440 2094963 2116720 2132981 2141555 2140150 2129591 2113033 2092118 2066453 2036239 2002076 1962281
56108 1962281 1913632 1855059 1788058 1713993 1634209 1552567 1474372 1402486 1337092 1278906 1229477
56097 1229477 1188615 1154793 1127938 1108796 1095945 1086710 1080595 1078506 1079235 1080396 1082305 1087067 1094228
56084 1094228 1101250 1107912 1116121 1125584 1133829 1140450 1147188 1153902 1158731 1162202 1166850 1172725 1177594 1181621
56070 1181621 1187370 1195096 1202649 1210197 1220353 1233359 1246868 1260783 1277470 1296775 1315770 1333920
56058 1333920 1353541 1374592 1393970 1410654 1426605 1442059 1455086 1466322 1478848 1492670 1504668
56047 1504668 1514508 1524956 1535725 1543040 1546410 1549842 1555099 1559730 1563047 1567981 1575496 1583338 1591974
56034 1591974 1605828 1627022 1653832 1686614 1728597 1778962 1831648 1883092 1934901 1987361 2037311
56023 2037311 2084689 2134269 2188423 2244672 2302408 2364997 2433023 2502715 2573447 2649385 2731300
56012 2731300 2814358 2896612 2981724 3070564 3158328 3243107 3329135 3418417 3507620 3596418 3690046
56001 3690046 3790130 3892077 3995161 4105666 4226113 4351317 4479433 4616663 4766264
55992 4766264 4923384 5086024 5260475 5450392 5651439 5862607 6091672 6343198 6612555
55983 6612555 6898246 7208255 7547404 7910802 8297001 8714890 9170113 9658457 10180919
55974 10180919 10751264 11380196 12067247 12817639 13651144 14584362 15621768 16776036 18079658
55965 18079658 19565204 21254994 23185602 25423632 28044668 31122527 34760043 39109929
55957 39109929 44350342 50670884 58307485 67563339 78773939 92290098 108523200 127951768
55949 127951768 151019888 178039094 209159117 244200872 282170831 320746275 356290503
55942 356290503 384559289 401706581 405180613 394402955 371101586 338953104 302444184
55935 302444184 265522222 230814095 199631339 172368102 148885441 128795554 111671696
55928 111671696 97138496 84845575 74440541 65605172 58085865 51667468 46148322
55921 46148322 41361577 37192853 33554227 30359373 27537160 25044589 22845841 20894054
55913 20894054 19147127 17583539 16187389 14932513 13794324 12762822 11830749 10981494
55905 10981494 10200403 9485788 8837327 8244712 7698162 7198874 6748324 6337257 5955510
55896 5955510 5603492 5284201 4992585 4722022 4473156 4247294 4038580 3840968 3655940
55887 3655940 3485827 3326715 3175198 3034865 2908766 2792451 2681564 2579403 2489747 2408832
55877 2408832 2331596 2259583 2195495 2135826 2075935 2017033 1961553 1906961 1850607 1795494 1744932
55866 1744932 1696538 1647621 1601381 1561545 1525749 1490403 1457466 1430205 1406815 1384388 1364902
55855 1364902 1350960 1339371 1324929 1307019 1287006 1262919 1232503 1198104 1162878 1125412 1083282
55844 1083282 1038533 994347 949860 903792 859876 822863 791928 763482 737698 716719 699034
55833 699034 681381 664233 650104 638279 626328 615079 607137 601949 596931 591929 588258 584818 579452
55820 579452 572619 565740 557573 546222 533061 520627 508355 494408 480157 468714 460423 453622
55808 453622 448481 446289 446263 446785 448592 453291 460064 467225 475541 486599 499411 512058 525100 539778
55794 539778 554322 565697 573637 579437 582187 579945 573530 565556 556709 546363 535699 526662 518674
55781 518674 509717 499850 490507 481296 470652 458799 447091 435451 423397 412439 404404 398561 393399
55768 393399 389876 389553 390788 390332 387756 384850 381559 376154 368783 361331 354121 346025 337452 330128 324210
55753 324210 318590 313663 310916 310194 310081 310430 311707 312581 311129 307883 304820 301988 298057 293496 289981
55738 289981 287217 283487 278981 275515 273236 270712 267919 266066 264741 262340 259118 256705 254834 251739
55724 251739 247674 244720 243009 240436 236386 232561 229693 226644 223398 221844 222664 224141 224977 225860 227461
55709 227461 229226 230905 233100 235616 237355 238363 239874 241894 242864 242112 240500 238273 234513 229195 223597
55694 223597 218186 212234 206041 201307 198685 197046 195734 195446 196222 196790 196799 197691 200372 203747 206514 208877
55678 208877 211615 214845 218433 222334 225951 228312 229236 229200 228016 225127 221251 218052 215982 214071 212005
55663 212005 210706 210590 210958 211412 212236 213127 213293 213193 214477 217805 222223 226979 232246 237756 242483 246179
55647 246179 249597 252760 254563 254478 253053 250393 245819 239469 232637 226001 219071 211813 205185 199575 194236
55632 194236 188859 184191 180629 177636 175060 173556 173199 173050 172598 172268 172174 171775 171117 170921 171104 170716 169698
55615 169698 169099 169116 168512 166580 164153 162070 160128 158068 156179 154319 151772 148637 145979 144123 142252
55600 142252 140114 138576 137938 137245 135988 134940 134606 134314 133647 133296 133659 133907 133294 132212 131185 130068
55584 130068 128973 128739 129648 130780 131435 132086 133209 134283 134736 134875 135114 135271 135325 135950 137652 140209 143390
55567 143390 147314 151692 155735 159236 162705 166105 168623 170052 171191 172466 173339 173505 173362 172814 170954
55552 170954 167577 163817 160690 158113 155805 153862 151914 149084 145437 142282 140441 139467 139074 139907 142174
55537 142174 144910 147419 150142 153301 155904 157031 157013 156538 155665 154433 153337 152458 151206 149545 148301
55522 148301 147607 146347 143879 141040 138691 136589 134578 133534 134021 135111 135617 135551 135497 135555 135732 136339 137139
55505 137139 137123 135962 134701 134243 134228 134057 133805 133403 132205 130245 128615 127746 126693 125006 123748 123531 123145
55488 123145 121591 120101 120465 122474 124586 126137 127371 128106 128004 127520 127260 126990 126436 126205 126715 127112 126571
55471 126571 125780 125708 125801 125013 123861 123769 124844 125827 125885 125078 123513 121481 120068 120220 121433 122512 123227 123981
55453 123981 124373 123562 121790 120129 118857 117390 115706 114573 114320 114479 114622 114688 114568 114219 113886 113439 111950
55436 111950 108930 105528 103381 102653 102325 102025 102313 103356 104596 105650 106510 106966 106888 106944 107960 109653 110980
55419 110980 111595 111987 112305 112168 111637 111354 111613 112103 112498 112576 111926 110423 108814 107934 107544 106783 105559 104503
55401 104503 103768 102920 101990 101520 101502 101274 100607 100031 99930 100056 100085 100010 99930 100066 100878 102521 104278 105214 105306 105241
55381 105241 105255 104935 104146 103431 103459 104523 106443 108515 109812 110136 110379 111398 112945 114265 115200 115852 115769
55364 115769 114534 112874 112057 112304 112734 112756 112592 112541 112618 112945 113685 114566 115077 114988 114216 112659 110803 109874 110409
55345 110409 111282 111272 111016 112023 114137 115531 115190 113948 112921 112261 111729 111247 110572 109470 108449 108288 108684
55328 108684 108464 107413 106707 107204 108367 109324 109920 110277 110255 109932 109834 110146 110406 110348 110300 110409 110322 110081 110457 111828
55308 111828 113472 114568 115265 116119 117102 117825 118304 118865 119590 120360 121132 121714 121557 120312 118429 116813 115899
55291 115899 115365 114703 113866 113365 113769 115046 116466 117313 117621 117984 118779 119823 120704 121138 121101 120847 120655 120418
55273 120418 119748 118776 118347 118985 120072 120599 120414 120123 120114 120339 120739 121159 121149 120584 120224 120838 122051 122892 123241
55254 123241 123756 124575 125144 125312 125514 125772 125584 124959 124546 124435 123826 122316 120670 119819 119755 119875 119857 119731 119536
55235 119536 119252 118858 118292 117645 117266 117228 116872 115561 113780 112763 113030 114065 115396 117076 118942 120292
55219 120292 120634 120115 118985 117336 115549 114267 113674 113407 113299 113521 113879 113834 113432 113397 114011 114702 115040 115313
55201 115313 115727 115880 115557 115304 115610 116123 116272 116196 116450 117179 118097 119029 119998 120945 121683 122005 121751 120989 120133
55182 120133 119554 119125 118553 118077 118298 119348 120750 122125 123468 124800 126123 127611 129221 130330 130523 130559
55166 130559 131559 133378 134907 135882 137056 138409 138727 137528 136045 135467 135399 134972 134367 134131 133835 132701
55150 132701 131050 129961 129729 129678 129395 129292 129907 131206 132638 133525 133546 133082 132880 133117 133140 132352 130898 129275
55132 129275 127802 126797 126640 127191 127727 127901 128239 129187 130258 130727 130673 130673 130884 131114 131466 132189 133103 133767 134087
55113 134087 134245 134219 133880 133510 133709 134750 136234 137376 137606 137114 136847 137581 138908 139642 139242 138275 137325 136250
55095 136250 134893 133739 133281 133282 133235 133100 133038 132985 133028 133678 135087 136445 136876 136611 136609 137242 137987 138230 137797 136863
55075 136863 135891 135486 135942 136969 138179 139501 140855 141889 142498 143172 144306 145536 146276 146511 146508 146215 145592
55058 145592 145156 145381 145801 145471 144205 142687 141516 140789 140536 140773 141086 140897 140308 140107 140780 141957 142948
55041 142948 143357 143011 141771 139796 137800 136704 136991 138382 140100 141394 141929 141766 141138 140327 139615 139088
55025 139088 138572 138016 137804 138265 139016 139346 139209 139161 139253 138821 137615 136378 135849 135886 136034 136314 136861 137376 137545
55006 137545 137558 137629 137511 137074 136890 137561 138840 140077 141166 142356 143506 144294 144880 145602 146209 146159 145584 145248
54988 145248 145571 146235 146746 146861 146506 145736 144778 143812 142870 142173 142177 142887 143605 143885 144274 145415 146830 147441 147039
54969 147039 146406 146139 146200 146525 147166 147745 147605 146697 145720 145228 145217 145602 146474 147665 148726 149546 150464 151560
54951 151560 152372 152645 152879 153742 155167 156353 156618 156065 155475 155550 156206 156685 156424 155686 155216 155540 156727 158516
54933 158516 160384 161791 162716 163690 165010 166304 167201 168046 169410 171340 173692 176825 181230 186641 192269
54918 192269 197834 203751 210303 217150 223566 228683 231783 232949 233108 232656 230394 224877 216751 208636 202426
54903 202426 197730 193284 188852 185030 181953 179139 176288 173538 171003 168573 166218 164148 162669 161979
54889 161979 162059 162704 163729 165189 167199 169570 171795 173478 174663 175821 177605 180547 184790 190188 196659
54874 196659 204106 211794 218355 222917 225909 228213 229797 229822 227898 224504 220173 215019 209187 203159 197362
54859 197362 191938 187041 182935 179656 176909 174354 171770 169070 166569 165037 164854 165181 164603 162600 159733
54844 159733 156429 152551 148427 145401 144627 145795 147572 148930 149616 149691 149269 148625 148076 147716 147497 147501 147884
54827 147884 148613 149465 150262 151014 151819 152678 153344 153382 152554 151202 150162 150127 151088 152349 153097 153060 152707 152722 153272
54808 153272 153934 154313 154410 154384 154350 154652 155808 157810 159820 161024 161461 161646 161699 161389 160729 159955 159155 158467 158385
54789 158385 159230 160503 161439 162017 162721 163467 163585 162921 162179 161974 162205 162535 162912 163439 164226 165573 167816 170862
54771 170862 174270 177828 181652 185769 190123 194934 200465 206404 212126 217559 223139 228807 233739 237181
54757 237181 238935 238933 237138 234060 230545 226739 221935 215853 209363 203532 198587 194283 190650 187776 185369
54742 185369 183145 181317 180182 179540 178992 178513 178217 177841 177017 175896 175011 174594 174468 174580 175277 177022 180030
54725 180030 184134 188788 193306 197355 201258 205659 210894 216719 222579 227972 232537 235857 237378 236781
54711 236781 234419 231108 227282 222667 216991 210715 204730 199617 195496 192238 189386 186285 182831 179776
54697 179776 177673 175980 173967 172105 171406 171561 170995 169010 166720 165418 165003 164643 164112 163684 163335 162878
54681 162878 162619 163156 164580 166288 167528 167902 167459 166513 165300 163811 162164 160975 160962 162152 163824 165191
54665 165191 165753 165237 163767 162088 160992 160579 160538 160858 161455 161459 160075 158137 157516 158651 159859 159613 158348
54648 158348 157389 157214 157597 158543 160005 161312 161847 161940 162305 163015 163727 164511 165614 166667 166885 166022 164595
54631 164595 163345 162819 163265 164426 165614 166294 166423 166179 165730 165407 165498 165672 165252 164330 163850 164237 164785 164892
54613 164892 165056 165901 166998 167471 167171 166419 165208 163582 162311 162196 163004 163949 164922 166291 167698 168092 167074
54596 167074 165496 164565 164798 165796 166598 166356 165110 163801 163240 163321 163498 163550 163426 162880 161880 160945 160462 160097
54578 160097 159526 159225 159758 160670 161001 160631 160259 160213 160188 160079 160244 160861 161737 162807 164247 165965 167466 168294
54560 168294 168308 167649 166741 166127 166001 166138 166490 167324 168494 169270 169404 169561 170020 169777 168020 165836 165187 166488
54542 166488 168406 169788 170596 171062 171194 171293 171902 173006 174084 174985 175983 177020 177804 178611 179959 181438 181903
54525 181903 181056 179935 179608 180178 181139 181857 181597 180052 178060 176862 176502 175903 174709 173888 174123 174693 174589
54508 174589 173875 173270 173097 173277 173758 174372 174721 174660 174438 174110 173403 172448 171870 171757 171349 170320 169587 170114 171510
54489 171510 172622 173115 173589 174398 175155 175477 175577 175892 176420 176664 176276 175700 175914 177191 178433 178337 177126 176353
54471 176353 176916 178136 179041 179639 180301 180687 180195 179075 178328 178605 179710 181072 182202 182818 182911 182661 182140
54454 182140 181272 180223 179516 179474 179837 180214 180616 181254 182022 182468 182178 181117 179827 179283 180114 181894 183617
54437 183617 184876 185963 186773 186550 185164 183782 183472 183747 183334 182021 180845 180637 181208 181997 182743 183370 183803
54420 183803 184170 184782 185651 186347 186518 186370 186456 187114 188188 189175 189571 189215 188390 187577 187091 186926 186944 187155 187750
54401 187750 188764 189718 189886 189128 188264 188265 189186 190213 190661 190580 190420 190563 191164 192020 192514 192163 191335 190961 191432
54382 191432 192227 192755 193013 193155 192977 192338 191691 191709 192484 193450 194012 194071 194059 194623 196070 197966 199451 200114 200411
54363 200411 201118 202579 204508 206328 207649 208611 209736 211249 212714 213727 214745 216638 219461 222328 224603
54348 224603 226586 228913 231894 235610 239999 244531 248390 251248 253276 254237 253340 250355 246124 241500 236490
54333 236490 231000 225751 221667 218840 216754 215098 213706 212180 210360 208848 208300 208367 208069 207039 205757
54318 205757 204705 203931 203345 202829 202076 200876 199555 198655 198219 197816 197212 196606 196268 196319 196750 197273 197323 196583
54300 196583 195363 194146 193013 191859 190865 190253 189882 189597 189632 190073 190306 189790 189158 189664 191565 193853 195591
54283 195591 196685 197280 197359 197247 197724 199106 200735 201842 202444 203008 203640 204049 204054 203733 203238 202724 202254 201586
54265 201586 200313 198471 196740 195780 195572 195653 195893 196680 198405 200951 203726 206066 207610 208386 208623 208559 208524
54248 208524 208937 209903 210800 210654 209121 206911 205073 204050 203596 203395 203417 203663 203858 203655 203041 202338 201803 201402
54230 201402 201058 200916 201174 201800 202687 203872 205247 206153 205861 204609 203702 204221 205998 208092 209883 211294
54214 211294 212312 212815 212799 212397 211727 211005 210594 210611 210676 210418 210036 209933 209997 209810 209438 209416 209891 210382 210536 210620
54194 210620 211035 211780 212654 213583 214402 214618 213852 212407 211025 210041 209051 207494 205384 203365 202127 201887 202381
54177 202381 203162 203810 204006 203720 203353 203452 204081 204615 204318 203107 201620 200608 200319 200421 200431 200220 200096 200349
54159 200349 200849 201248 201420 201462 201371 201147 201128 201662 202399 202513 201876 201460 202128 203521 204594 204860 204585 204064 203319
54140 203319 202363 201297 200196 199238 198811 199114 199818 200479 201067 201733 202322 202563 202536 202484 202356 202099 202170 203115 204680
54121 204680 205957 206437 206363 206088 205773 205750 206475 207835 209114 210007 211127 213056 215349 217099 218266 219778
54105 219778 222163 224599 225740 225306 224387 224077 224243 224010 223118 222130 221383 220564 219538 218809 218662 218542 217975
54088 217975 217544 218044 219090 219550 219223 219028 219481 220004 220065 220090 220714 221823 222991 224433 226807 230244 234159
54071 234159 238092 242367 247710 254438 262261 270980 281082 293174 306737 319938 330927 338910 343633
54058 343633 344503 341029 333816 324330 313764 302870 292639 284069 277124 270890 265064 260476 257802 256644
54044 256644 256369 257042 258838 261170 263236 265090 267425 270518 274075 277977 282491 287636 292960 298104 303207
54029 303207 308477 313585 317806 320790 323071 325636 328937 332467 335453 337788 339943 342061 343624 344153
54015 344153 343832 343185 342402 341232 339343 336564 332965 328919 324932 321189 317283 312620 307174 301809 297750
54000 297750 295590 294748 294063 293001 292123 292290 293741 296150 299190 302567 305811 308665 311521 314920 318664
53985 318664 321994 324596 326725 328288 328525 326875 323596 319266 314176 308524 302763 297405 292719 288769
53971 288769 285400 282098 278317 274115 270132 266841 264294 262639 262231 262970 264018 264516 264175 263065 261395
53956 261395 259782 259086 259558 260596 261660 262913 264645 266692 268837 271236 273896 276267 277951 279406 281345
53941 281345 283836 286548 289509 292981 296905 301068 305616 310718 315980 320801 325171 329504 333857 337888
53927 337888 341488 344838 347907 350571 353243 356877 362249 369565 378641 388980 399869 411129 423813
53914 423813 439503 458726 480626 504352 530040 557888 586535 612827 633102 644610 646174 638259
53902 638259 622766 602531 580549 559237 540073 523707 510151 498751 488230 477337 465792
53891 465792 454481 444515 436214 429059 422367 415770 409218 402752 396276 389553 382569 375846 369994 364869
53877 364869 359636 353847 348013 342889 338700 335326 332595 329925 326332 321522 316535 312565 309530 306610
53863 306610 303730 301412 299342 296378 292245 288105 284943 282325 279375 276210 273562 271503 269458 267296
53849 267296 265651 265009 265015 264880 264216 263333 262827 262912 263108 262663 261353 259721 258468 257803 257579 257783 258559 259771
53831 259771 260919 261613 261947 262277 262720 263019 262889 262400 261901 261592 261313 260887 260547 260763 261608 262563 263118 263379
53813 263379 263893 264969 266451 268150 270140 272458 274875 277269 280027 283647 287973 292291 296273 300340
53799 300340 304883 309661 314334 319140 324475 330094 335358 340110 344688 349171 353338 357349 361688 366225
53785 366225 370019 372412 373710 374422 374323 372771 369614 365387 360793 356218 351481 345983 339509 332948 327647
53770 327647 323893 320680 317181 313656 310504 307352 303778 300174 297009 293859 290174 286538 284110 283049
53756 283049 282417 281531 280438 279156 277385 275119 272748 270494 268438 267047 266808 267283 267384 266792 266278 266433
53740 266433 266879 267068 267095 267312 267751 268374 269317 270495 271468 272062 272623 273316 273658 273246 272506 272208 272547 273117 273664
53721 273664 274430 275896 278377 281760 285480 288918 291892 294540 296784 298304 299099 299576 299942 300029 299897 300072
53705 300072 300897 302171 303763 306103 309608 314004 318659 323250 327709 331907 335830 339734 343571 346600
53691 346600 348127 348459 348606 349138 349910 350798 352074 353843 355566 356428 356029 354668 353056 351810 351057 350492
53675 350492 349813 348984 348059 347021 345935 345011 344302 343578 342709 341845 340933 339446 337091 334493 332594 331519
53659 331519 330630 329697 329255 329655 330430 330961 331312 331945 332965 334066 334970 335446 335088 333695 331880 330832 331263
53642 331263 332867 334886 336797 338325 339263 339717 340273 341454 343156 344989 346979 349374 351847 353602 354478
53627 354478 355321 356927 359138 361411 363737 366374 369037 371161 372851 374935 377988 381802 385838 389700
53613 389700 393195 396446 400019 404371 409066 413102 416186 419128 422698 426685 430455 433969 437739 442092
53599 442092 446958 452137 457326 462059 466028 469415 472594 475613 478299 480765 483483 486805 490601 494315
53585 494315 497232 498813 499047 498415 497317 495581 492698 488430 483021 476880 470329 463605 456911 450439 444481
53570 444481 439462 435722 433212 431474 429890 427972 425581 423060 421027 419911 419678 420085 420985 422267 423649
53555 423649 424797 425645 426452 427532 428990 430641 432120 433181 434036 435300 437434 440223 442990 445321 447476
53540 447476 450040 453271 456886 460471 463988 467772 472087 476890 482071 487690 493788 500164 506626 513348
53526 513348 520708 528882 537918 548057 559544 572066 584851 597450 610051 622912 635977 649294
53514 649294 663418 678977 696066 714370 733693 754093 775656 798378 822112 846411 870632
53503 870632 894442 917985 941318 963962 985399 1005775 1025631 1045017 1063499 1081162 1099011
53492 1099011 1117979 1137789 1157180 1175211 1192039 1208447 1224930 1241405 1257582 1273378 1288976
53481 1288976 1304721 1320943 1337652 1354305 1370107 1384696 1398372 1411470 1423692 1434293 1442769
53470 1442769 1449054 1453134 1454810 1453893 1450424 1444686 1437133 1428203 1417982 1406241 1393054 1379189 1365484
53457 1365484 1351937 1337834 1322697 1306733 1290369 1273789 1256931 1239562 1221390 1202453 1183295
53446 1183295 1164346 1145414 1126345 1107868 1090938 1075407 1060442 1046274 1034264 1024885 1016859 1009005
53434 1009005 1001893 996771 993689 991745 990533 990227 990659 991455 992991 996193 1001335 1007732 1014677 1022094 1030336
53419 1030336 1039912 1051347 1064752 1079631 1095578 1112950 1132306 1153491 1175985 1199899 1225778
53408 1225778 1253517 1282318 1311735 1341967 1373078 1404799 1437283 1471263 1507149 1544663 1583647
53397 1583647 1624559 1667820 1713239 1760428 1809190 1859162 1909665 1960383 2011699 2063824 2116010
53386 2116010 2167207 2217177 2266416 2315090 2362635 2408357 2451925 2493124 2531526 2566678 2598484
53375 2598484 2627215 2653072 2675760 2694496 2708453 2717226 2720921 2719869 2714177 2703401 2686647 2663315
53363 2663315 2633884 2599694 2561784 2520266 2475147 2427324 2378230 2328687 2278680 2228230 2177931
53352 2177931 2128533 2080435 2033691 1988206 1943957 1901275 1860803 1822716 1786103 1749616 1712672
53341 1712672 1675549 1638498 1601570 1565364 1531089 1499475 1470209 1442751 1417130 1393598 1372087
53330 1372087 1352499 1335064 1319848 1306265 1293559 1281497 1270122 1259055 1247565 1235270 1222416
53319 1222416 1209611 1197518 1186618 1176889 1167799 1158938 1150552 1143231 1137293 1132757 1129705 1128259 1128280 1129447
53305 1129447 1131592 1134729 1138795 1143701 1149576 1156753 1165530 1176150 1188881 1203876 1221036 1240189 1261260
53292 1261260 1283951 1307476 1331074 1354799 1379357 1405024 1431080 1456484 1480783 1504069 1526292
53281 1526292 1547043 1565982 1583096 1598351 1611321 1621401 1628333 1632280 1633453 1631879 1627598 1620808
53269 1620808 1611660 1600091 1586048 1569754 1551545 1531600 1510050 1487231 1463561 1439259 1414474
53258 1414474 1389545 1364736 1339743 1313886 1286870 1259049 1230915 1202784 1175118 1148654 1123747
53247 1123747 1099770 1075557 1050473 1024957 1000053 976489 954123 932226 910323 888719 868083
53236 868083 848676 830283 812805 796507 781643 768185 755990 744897 734572 724632 715051 706096
53224 706096 697692 689265 680411 671336 662395 653473 644059 633659 621964 609025 595542 582608 570784
53211 570784 559678 548682 537794 527377 517526 508189 499667 492438 486507 481280 476035 470264 463769
53198 463769 456812 450003 443684 437561 431238 424873 418879 413254 407780 402720 398649 395583 392878 390153
53184 390153 387764 386149 385099 383922 382021 379218 375862 372705 370300 368371 366172 363550 361162 359416
53170 359416 357764 355507 352842 350526 348739 346991 345089 343522 342630 341917 340544 338277 335572 332888 330317
53155 330317 327885 325853 324466 323568 322760 321976 321669 322202 323200 323779 323495 322777 322235 321784 320855 319326 317740
53138 317740 316456 315123 313421 311885 311353 311765 312233 312394 312900 314187 315513 315892 315539 315619 316791 318735
53122 318735 321047 323708 326484 328714 330209 331786 334364 337859 341451 344661 347592 350273 352413 353939
53108 353939 355306 356902 358334 358617 357119 354142 350491 346585 342266 337490 332852 329135 326548 324764
53094 324764 323479 322477 321263 319264 316577 314016 312213 311096 310386 310088 310133 310069 309597 309107 309179 309760 310253
53077 310253 310319 310191 310317 310953 312022 313092 313645 313622 313541 313829 314225 314104 313169 311616 309843 308256 307057 305939
53059 305939 304348 302377 300956 300701 301018 300976 300667 300866 301636 302174 302056 301719 301570 301463 301349 301672 302623 303578
53041 303578 303753 303020 301771 300405 299343 299096 299722 300466 300423 299422 297949 296431 295099 294382 294780 296136
53025 296136 297486 297968 297768 297914 299124 300995 302396 302594 301897 301210 301060 301172 300974 300420 300235 301236 303370
53008 303370 305527 306570 306447 306034 305944 306013 306072 306517 307646 308981 309913 310591 311414 311946 311308 309653 308234 307764
52990 307764 307618 307083 306587 306987 308265 309695 310984 312509 314488 316536 318146 319225 320097 321234 323027
52975 323027 325583 328633 331674 334168 335687 336118 335880 335691 336052 337065 338744 341059 343567 345508 346640
52960 346640 347601 349016 350514 351108 350345 348605 346409 343950 341353 338916 336861 335082 333279 331236 328915
52945 328915 326459 324090 321920 319854 317810 315924 314464 313563 313168 313137 313306 313532 313752 313883 313657 312819 311556
52928 311556 310439 309732 309099 308194 307171 306266 305247 303772 302086 300826 300261 300196 300536 301393 302657 303984
52912 303984 305271 306630 307820 308235 307668 306657 305785 305051 304210 303380 302911 302896 303179 303716 304558 305510 306106 306075
52894 306075 305685 305503 305824 306383 306648 306384 305809 305208 304614 303997 303512 303314 303277 303256 303463 304159 305089 305715 305987
52875 305987 306400 307232 308262 309374 310812 312575 314087 314876 315216 315764 316988 319248 322898 327716 332597
52860 332597 336448 339194 341384 343108 343977 344000 343659 343035 341539 338736 334910 330661 326412 322473 319099
52845 319099 316230 313501 310718 308031 305595 303469 301888 301114 300813 300129 298691 297048 295812 294887 293957
52830 293957 293258 293304 294189 295649 297560 299786 301760 302843 303007 302642 301808 300286 298312 296586 295475 294761
52814 294761 294364 294691 295983 297792 299469 300878 302294 303847 305390 306752 307816 308468 308707 308734 308731 308579 307921
52797 307921 306460 304207 301522 298988 297055 295717 294582 293258 291599 289686 287828 286527 286081 286171 286167 285965
52781 285965 286175 287296 289001 290480 291276 291593 291938 292670 293730 294713 295330 295838 296710 297853 298613 298779 299059
52764 299059 300109 301525 302339 302237 301683 301010 300129 299213 299001 300068 302111 304210 305641 306327 306709 307280 308090
52747 308090 308681 308685 308445 308742 309868 311278 312267 312723 313082 313778 314894 316186 317289 318010 318530 319241 320329
52730 320329 321620 322807 323640 323927 323624 323064 322830 323186 323696 323636 322691 321207 319789 318763 317879 316485 314084
52713 314084 310911 307935 306203 306052 306886 307654 307614 306832 305976 305556 305402 304975 304095 303141 302533 302279 302113 301876
52695 301876 301643 301646 302143 303159 304235 304676 304266 303589 303437 304099 305476 307679 310974 315066 318919 321655 323371
52678 323371 324674 325581 325406 323873 321884 320754 320817 321138 320620 319113 317388 316287 316071 316383 316696 316795 316886
52661 316886 317206 317654 318008 318420 319329 320838 322598 324460 326714 329344 331484 332231 331850 331602 332332 333645
52645 333645 334474 334070 332350 329704 326732 323973 321748 320243 319596 319664 319909 319914 320002 320922 322880 325298 327540
52628 327540 329453 331094 332524 334130 336577 339926 343089 344713 344528 343366 341984 340376 338340 336199
52614 336199 334588 333734 333263 332697 331895 330941 329911 329001 328679 329313 330610 331791 332484 333037 333736 334142 333721
52597 333721 332795 332250 332345 332440 331963 331084 330299 329855 329877 330630 332255 334420 336445 337715 338026 337807 337972 339173
52579 339173 341156 343194 345029 346865 348476 349127 348644 347840 347477 347464 347498 347751 348299 348507 347854 346923 346664 346950
52561 346950 346767 345747 344569 343793 343173 342384 341683 341477 341750 342180 342446 342221 341356 340277 339724 339822 339869 339333
52543 339333 338581 338187 337920 336990 335166 333117 331685 331135 331219 331677 332542 334004 336013 338020 339291 339508 339008
52526 339008 338391 338083 338314 339195 340568 341962 343015 343913 345210 347204 349636 351945 353719 354987 356269
52511 356269 358296 361456 365462 369658 373566 376988 379669 381263 381778 381710 381466 380798 379146 376471 373339
52496 373339 370120 366534 362311 357994 354604 352526 351255 350350 350117 350949 352323 353077 352669 351637 350670 349760
52480 349760 348642 347692 347736 348963 350589 351829 352802 354135 355984 357946 359794 361696 363615 365031 365610
52465 365610 365805 366452 368059 370848 375083 380682 386591 391248 393850 394741 394478 393093 390477 386830 382308
52450 382308 376703 370120 363663 358779 355902 354190 352558 350553 348269 345965 343986 342618 341717 340743 339420
52435 339420 338184 337692 337988 338454 338542 338290 338006 337759 337443 337220 337507 338423 339450 339944 339801 339445 339258 339383
52417 339383 339958 341191 343009 344987 346845 348786 351198 354195 357684 361724 366628 372843 380889 391309
52403 391309 404366 419710 436335 452774 467418 478911 486384 489309 487233 480085 468857 455613
52391 455613 442490 430714 420598 412129 405260 399872 395773 392696 390240 388002 385949 384413 383618 383457
52377 383457 383798 384636 385785 386920 388252 390664 394757 400144 406093 412395 418973 425072 429647 432413 433824
52362 433824 434068 432859 430267 427120 424315 422207 420748 419801 419217 418999 419473 420861 422682 424031 424548 424661
52346 424661 424858 425193 425632 426350 427459 428793 430104 431241 432139 433063 434811 438160 443032 448719 454948 462078
52330 462078 470161 478600 487128 496489 507580 520301 533713 547047 560268 573972 588989 605684
52318 605684 623278 640199 655425 669180 682202 694922 707722 721289 736052 751662 767703
52307 767703 784526 802683 821806 840837 859269 877427 895545 913346 930751 948301 966439
52296 966439 984641 1001534 1015781 1026848 1035144 1041475 1046126 1048523 1048028 1044942 1040371 1035134 1029250
52283 1029250 1022554 1015334 1008156 1001374 995069 989227 983819 978892 974757 971910 970574 970448 971058 972308
52269 972308 974551 978153 983082 988905 995186 1001846 1009037 1016702 1024551 1032654 1041705 1052269 1063927 1075768
52255 1075768 1087768 1101046 1116441 1133359 1150449 1167023 1183178 1198750 1212894 1224874 1234653
52244 1234653 1242304 1247295 1248869 1247123 1243208 1238364 1233008 1226920 1220030 1212685 1205178 1197303 1188557 1178692
52230 1178692 1167940 1156750 1145441 1134188 1123197 1112725 1102911 1093742 1085285 1077750 1071158 1065099
52218 1065099 1059152 1053503 1048804 1045296 1042411 1039522 1036858 1035395 1035953 1038558 1042512 1046830 1050788 1054425
52204 1054425 1058462 1063435 1068954 1074121 1078533 1082506 1086386 1090191 1094080 1098651 1104439 1111336 1118757 1126162
52190 1126162 1133264 1139996 1146501 1152953 1159137 1164376 1168097 1170322 1171324 1170928 1168436 1163339 1155913 1147088
52176 1147088 1137811 1128560 1119473 1110790 1102947 1096070 1089683 1083323 1077382 1072841 1070049 1068261 1066670 1065518
52162 1065518 1065788 1068033 1071876 1076498 1081228 1085670 1089647 1093130 1096072 1098232 1099234 1098812 1097105 1094827
52148 1094827 1093109 1092793 1093761 1095183 1096611 1098508 1101478 1105216 1108621 1110829 1111849 1112246 1112494 1112664 1112528
52133 1112528 1111882 1110844 1109870 1109523 1110321 1112799 1117403 1124253 1133232 1144405 1158085 1174375 1193035 1213966
52119 1213966 1237311 1262698 1288824 1314426 1339486 1364849 1390729 1416188 1440163 1462419 1483240
52108 1483240 1502651 1520329 1536150 1550572 1564472 1578668 1593502 1608803 1624258 1639676 1654840
52097 1654840 1669332 1682808 1695250 1706574 1715980 1722070 1723757 1720917 1714139 1704111 1691257 1675709
52085 1675709 1657553 1637301 1616202 1595872 1577500 1561455 1547538 1535324 1524270 1513955 1504465
52074 1504465 1496365 1490059 1485334 1481748 1479357 1478776 1480468 1484154 1489045 1494577 1500863 1508413 1517523 1528051
52060 1528051 1539707 1552325 1565713 1579378 1592678 1605337 1617715 1630418 1643554 1656395 1667880
52049 1667880 1677444 1685184 1691157 1694825 1695623 1693808 1690184 1684930 1677372 1667189 1655326 1643231 1631605
52036 1631605 1620330 1609278 1598543 1588028 1577409 1566551 1555513 1544166 1532202 1519567 1506436
52025 1506436 1492746 1478232 1463031 1447801 1432998 1418357 1403436 1388447 1374284 1361720 1350772
52014 1350772 1340862 1331513 1322803 1315123 1308562 1302746 1297319 1292236 1287315 1281752 1274516 1265198 1254126 1241610
52000 1241610 1227381 1210886 1191980 1171312 1150189 1130040 1111799 1095725 1081777 1069862 1059485
51989 1059485 1049485 1038644 1026633 1014090 1001733 989632 977294 964149 949952 934971 919782
51978 919782 904667 889245 872964 855884 838699 822062 806185 791079 776914 764168 753702
51967 753702 746539 743267 743653 747048 752946 760797 769644 778581 787483 796599 805385 812396 816469 817452 815532
51952 815532 810509 802156 790981 778275 765577 754182 744793 737453 732004 728643 727777 729499 733715
51939 733715 740709 750825 763463 777054 790317 802905 814611 824767 832927 839391 844324 846913
51927 846913 846123 841869 834664 824501 811039 794784 777211 759579 742336 725831 710810 697776
51915 697776 686356 675921 666729 660016 656777 656694 658526 661627 666805 675471 688147 704256 723210
51902 723210 744926 768942 793661 816917 836881 852045 860931 862654 857584 846747 830746 809851
51890 809851 785019 758049 730655 704015 679216 657397 639175 624488 613218 605456 600936 598935
51878 598935 599139 602166 608673 618332 630218 643888 659429 676460 693678 709544 723048 733600
51866 733600 740454 742629 739500 731519 720264 707679 695081 682921 671430 661258 653190 647435 643516
51853 643516 640960 639819 640305 642103 644254 645730 645979 644931 642648 639115 634344 628581 622297 615963 609852
51838 609852 604046 598533 593193 587779 582176 576839 572810 570974 571258 572721 574507 576480 578843 581401
51824 581401 583413 584073 582993 580323 576558 572132 567108 561488 555951 551936 550557 551611 554017 557042
51810 557042 560564 564281 567448 569607 570924 571425 570437 567320 562448 556942 551660 546903 542911 540048 538408
51795 538408 537714 537701 538203 538757 538547 537038 534442 531349 528134 525060 522753 522057 523151 525083 526471 526620
51779 526620 525739 524292 522524 520682 519168 518143 517367 516841 517380 520021 524907 531351 539007 548407 560056
51764 560056 573446 587365 600879 613593 625061 634351 640342 642378 640602 635708 628396 619192 608793
51751 608793 598267 588506 579603 571183 563300 556496 551005 546505 542822 540332 539345 539623 540867 543248
51737 543248 547057 552194 558355 565308 572594 579431 585439 591111 596973 602516 606537 608271 607689 605068
51723 605068 601077 597106 594527 593345 592209 589973 586687 582942 578916 574508 569950 565844 562731 560862
51709 560862 560184 560299 560586 560570 560177 559667 559553 560529 563178 567629 573626 580816 588551 595465 599912 601263
51693 601263 600492 599220 598399 598182 598681 600243 602887 605827 607805 607849 605734 601813 596527 590151 583060 576107
51677 576107 570489 567062 565826 566120 567204 568597 569997 571121 571711 571694 571249 570715 570487 571009 572771 576118
51661 576118 581000 586979 593454 599743 604942 608085 608739 607388 605128 603084 602217 603375 607127 613480 621932
51646 621932 631730 641862 650892 657134 659204 656517 649395 638876 626300 612852 599406 586729 575505
51633 575505 565959 557626 549779 542072 534694 528056 522551 518438 515722 514174 513550 513612 513789 513216 511456
51618 511456 508957 506396 503783 500625 496854 493100 490054 487972 486765 486155 485672 484891 483842 483075 483292
51603 483292 485029 488418 492939 497594 501795 505993 511056 517175 523893 531093 539334 549089 560201 572160
51589 572160 584310 595498 603930 607884 606626 600791 592206 583240 575756 570397 567004 565582 566472 569843
51575 569843 575728 584609 597252 613744 633305 655185 679110 704658 731054 758085 786525 816995
51563 816995 848940 881383 914255 948350 984421 1023135 1065634 1113165 1165843 1222162 1279600
51552 1279600 1335215 1385628 1427135 1456332 1470807 1469622 1453573 1424889 1386145 1339228 1285526
51541 1285526 1226874 1165826 1104884 1045784 989605 937164 889173 846192 808524 776001 747854
51530 747854 723092 701019 681245 663343 646913 632053 619313 608973 600590 593404 586924 580979
51518 580979 575490 570498 566197 562652 559601 556837 554636 553500 553477 554084 554911 555954 557246 558555 559729
51503 559729 560997 562492 563697 563848 562839 561210 559176 556308 552436 548359 545183 543250 542157 541548 541358
51488 541358 541442 541507 541398 541073 540363 539139 537541 535552 532480 527533 520918 513727 506673 499669 492841 487117
51472 487117 483214 480559 477897 474724 471576 469102 467311 465688 463667 461066 458271 455903 454177 452747
51458 452747 451346 450208 449675 449796 450628 452532 455653 459468 463404 467684 472985 479423 486555 494331 503317
51443 503317 513817 525461 538025 552180 568893 588157 608501 627556 643036 653568 659079 660494
51431 660494 658980 655494 650876 645798 640199 633035 623139 610436 596028 581143 566447 552474 540164
51418 540164 530419 523282 518025 514005 511095 509339 508684 509117 510612 512772 514988 517090 519393 521929 524369
51403 524369 527072 531391 538108 546136 553665 560219 566530 572766 578245 582976 588079 594198 600661 606932
51389 606932 613894 622912 634382 648083 664279 683593 706330 732932 764762 803472 849671 902937
51377 902937 962868 1029303 1101571 1178397 1258575 1340874 1422911 1500560 1568742 1622717 1659057
51366 1659057 1676200 1674427 1655044 1619579 1569952 1508998 1440035 1365905 1288935 1211665 1136740
51355 1136740 1065887 999680 938577 883597 835646 794663 759818 730135 704601 682109 661905
51344 661905 644023 628836 616111 604816 593962 583452 573852 565366 557361 549157 541128 534458 529637
51331 529637 525699 521264 515954 510400 505272 500821 497053 493671 490059 485984 482238 479857 478695 477487
51317 477487 475446 473156 471666 471335 471892 473042 474610 476373 478182 480090 482274 484995 488633 493300 498365
51302 498365 502827 506359 509609 513275 517294 521072 524016 525569 525191 522703 518435 512842 506309 499493
51288 499493 493322 488255 483892 479766 476245 474235 474192 475899 479028 483473 489126 495664 502575 509189 514740
51273 514740 518680 520923 521700 521234 519740 517620 515441 513701 512658 512324 512629 513739 516135 520045 524748
51258 524748 528816 531231 531990 531536 530092 527873 525430 523203 520893 517805 513747 509211 504846 501180 498710
51243 498710 497581 497081 495993 493830 491431 490097 490337 491630 493099 494085 494260 493618 492411 490816 488607
51228 488607 485512 481982 479208 477910 477318 475890 473095 469981 467832 466863 466623 467103 468647 470927 472908
51213 472908 473983 474590 475465 476829 478556 480611 482911 485200 487556 490679 495166 500677 506263 511456 516572
51198 516572 521979 527470 532437 536322 538823 539945 539962 539161 537562 535025 531655 527879 524097 520480 517194
51183 517194 514596 512980 512236 511945 511832 511953 512420 513088 513642 513974 514289 514779 515228 515075 513854 511628 509046
51166 509046 507049 506335 506975 508563 510832 513946 518037 522599 526724 529945 532549 534903 536718 537212 535902
51151 535902 533032 529306 525450 522073 519681 518432 517891 517346 516615 516300 516873 517741 517771 516725 515519 514881
51135 514881 514419 513401 511794 509990 508079 506111 504542 503550 502322 500030 497289 495557 495144 494994 494562
51120 494562 494643 495934 497919 499825 501667 503626 505270 506302 507413 509455 512294 515274 518300 521604 524933
51105 524933 527961 531124 535008 539145 542538 545251 548340 552063 555304 557105 557832 558338 558764 558745 558156 557020
51089 557020 555115 552278 548869 545506 542487 539822 537575 535840 534522 533486 532819 532663 532875 533061 532892
51074 532892 532252 531223 530139 529509 529699 530721 532444 534894 538198 542335 547108 552384 558304 565346 574231
51059 574231 585587 599522 615546 632956 651166 669601 687498 704057 718803 731743 743328
51048 743328 754553 766922 781817 799436 818302 836028 850701 861617 868840 872324 871601 866248
51036 866248 856505 843489 828925 814624 801827 790662 780077 768467 754654 738539 720984 703166
51024 703166 686064 670440 656997 646228 638159 632496 629106 628067 629159 631696 635157 639656 645488
51011 645488 652583 660957 671376 684706 700448 716683 731829 745961 760083 774655 789346 803819
50999 803819 818121 832309 846159 859257 871172 881658 890918 899606 908246 916664 924075 929691 933141
50986 933141 934503 934130 932402 929614 926227 923133 921280 920952 921854 924099 928589 936027 945957 957201 969067
50971 969067 981699 995568 1011181 1029313 1051092 1077724 1110135 1148572 1192288 1239880 1290268
50960 1290268 1343215 1398739 1456423 1515659 1576181 1637810 1699850 1761142 1820432 1876219 1926632
50949 1926632 1970154 2006477 2036133 2059484 2076657 2088322 2095815 2100436 2103108 2104657 2105689 2106017 2104756
50936 2104756 2101070 2094446 2084289 2070028 2051847 2030812 2008063 1984272 1959881 1935143 1909630 1882230
50924 1882230 1851965 1818525 1781835 1741698 1698143 1651735 1603182 1553028 1502042 1451475 1402568
50913 1402568 1355990 1311993 1270747 1232239 1196246 1162812 1132554 1106091 1083242 1063058 1044536
50902 1044536 1027163 1010967 996277 983298 971689 960706 949921 939694 930792 923629 917911 912864
50890 912864 907826 902853 898765 896366 895566 895545 895768 896428 897852 899916 902294 904901 907901 911582 916323
50875 916323 922296 929045 935854 942746 950597 959982 970477 981577 993744 1007828 1023817 1040947 1058954
50862 1058954 1078500 1100300 1124513 1151182 1180762 1213846 1250722 1291557 1336861 1387487 1444180
50851 1444180 1507301 1577038 1653799 1738341 1831460 1933511 2044131 2162310 2286708 2416109
50841 2416109 2549873 2687885 2829696 2973474 3115940 3253402 3382704 3501206 3606303
50832 3606303 3695453 3766715 3819121 3852583 3867663 3865503 3848032 3818189 3779706 3736331 3691171
50821 3691171 3646767 3605494 3569365 3539466 3515936 3498380 3485647 3475121 3462996 3445803 3421379
50810 3421379 3388175 3344297 3287945 3218597 3137198 3045234 2944013 2834759 2719063 2599294
50800 2599294 2478643 2360420 2246867 2138818 2036782 1941993 1855872 1778751 1709830 1648435
50790 1648435 1594744 1549161 1511451 1480755 1456124 1436846 1422357 1412009 1404817 1399499 1394910 1390430
50778 1390430 1385791 1380648 1374630 1367746 1360445 1353137 1345765 1337829 1328711 1318046 1306020 1293286 1280387
50765 1280387 1267237 1253267 1237959 1221111 1202816 1183582 1164510 1146932 1131604 1118337 1106529
50754 1106529 1096023 1087388 1081368 1078133 1077141 1077782 1079988 1084080 1090225 1098506 1109447 1123876 1142020
50741 1142020 1163219 1186908 1213545 1244233 1279767 1320366 1365938 1416154 1470653 1529668 1594144
50730 1594144 1664532 1739664 1817401 1896228 1975595 2054920 2133131 2209230 2282552 2352246 2417177
50719 2417177 2476515 2529786 2576123 2614078 2642405 2660349 2666886 2660572 2640929 2609639 2569830 2524582
50707 2524582 2476647 2429051 2384856 2346067 2313275 2286469 2265745 2251137 2242068 2237187 2234549 2231911
50695 2231911 2227092 2218211 2203625 2181874 2151941 2113491 2066708 2012116 1950899 1885308 1818243 1752236
50683 1752236 1688939 1629518 1575063 1526381 1483692 1446890 1416026 1391318 1372822 1360377 1353881
50672 1353881 1353290 1358214 1367824 1381389 1398722 1419653 1443151 1467461 1491325 1514649 1537627 1559608
50660 1559608 1579455 1596855 1612567 1627264 1640837 1653169 1664947 1677098 1689767 1702552 1715528
50649 1715528 1729349 1744349 1760274 1777202 1796175 1818481 1844593 1874171 1906864 1942785 1982333
50638 1982333 2025946 2073968 2126421 2182795 2242168 2303439 2365302 2426199 2484746 2540326 2593105
50627 2593105 2643502 2691936 2738981 2785056 2829335 2868865 2898954 2914574 2911848 2889247 2848457
50616 2848457 2794407 2733930 2673651 2618514 2571548 2534210 2506583 2487517 2475103 2467422 2463029 2460856
50604 2460856 2459558 2456870 2449734 2435432 2412794 2382218 2344395 2299222 2246187 2185680 2119578 2050333
50592 2050333 1979811 1909293 1840387 1775186 1715140 1660137 1609314 1562638 1521079 1485141 1453898
50581 1453898 1425832 1400110 1376609 1355149 1335276 1316611 1298905 1281958 1265990 1251896 1240578
50570 1240578 1232081 1225919 1222019 1220669 1221665 1224331 1228535 1234891 1243716 1254486 1266691 1280606 1296772
50557 1296772 1315306 1336170 1359641 1385936 1414638 1444892 1475899 1506890 1536980 1565472 1592059
50546 1592059 1616455 1638242 1657501 1675232 1692772 1711100 1731040 1753618 1779575 1808911 1841498
50535 1841498 1877933 1919271 1966185 2018942 2077933 2143597 2216036 2295268 2381659 2475487 2576315
50524 2576315 2683449 2796799 2916432 3041305 3169176 3297842 3425654 3550656 3669942
50515 3669942 3780209 3878534 3962404 4029520 4077930 4106263 4113850 4100959 4068767 4018693 3951932
50504 3951932 3870184 3776702 3675868 3571674 3467288 3366037 3271828 3188244 3117889 3062864
50494 3062864 3025014 3005101 3002269 3014794 3040814 3077837 3122086 3168908 3213469 3250629 3274837
50483 3274837 3281237 3267043 3231495 3174868 3098289 3004437 2897523 2782043 2661597 2538923 2416590
50472 2416590 2297302 2183482 2076675 1977397 1885648 1801537 1725278 1656666 1594937 1539372 1489875
50461 1489875 1446707 1409742 1378178 1350980 1327610 1308374 1294052 1285011 1280717 1280209 1282841 1288315
50449 1288315 1296189 1305805 1316607 1327998 1338977 1348613 1357084 1365737 1375858 1387774 1401159 1415451
50437 1415451 1429688 1442677 1453811 1463239 1470859 1475894 1478124 1478911 1480160 1482539 1485424 1488282 1491360
50424 1491360 1495219 1500421 1507590 1517031 1528279 1540690 1554559 1571018 1590812 1613816 1639813 1669032
50412 1669032 1701750 1738065 1778395 1823482 1873426 1927090 1982971 2040291 2098817 2157899 2216238
50401 2216238 2272501 2325696 2374941 2419259 2457676 2489272 2513004 2527643 2532052 2525496 2507667 2478470
50389 2478470 2437945 2386565 2325736 2257974 2186415 2114034 2043269 1976233 1914961 1861282 1816520
50378 1816520 1781470 1756554 1741779 1736535 1739677 1749918 1765984 1786206 1808155 1829028 1846439 1858616
50366 1858616 1863812 1860043 1845819 1821013 1786801 1744971 1697506 1646503 1593781 1540463 1487308 1435371
50354 1435371 1385813 1339004 1294377 1251351 1209987 1170638 1133557 1099179 1068279 1041396 1018396
50343 1018396 998921 982925 970413 961089 954727 951511 951546 954407 959754 968116 980312 996221 1014793
50330 1014793 1035155 1056946 1079338 1100426 1117932 1130187 1136332 1136191 1130466 1120805 1109288 1097771
50318 1097771 1087702 1080097 1075296 1072789 1071603 1070950 1070470 1069974 1069149 1067619 1065328 1062826 1060985 1060279 1060385
50303 1060385 1060708 1061261 1062779 1065903 1070530 1076143 1082630 1090470 1100164 1111808 1125406 1141301 1159917
50290 1159917 1181083 1204116 1228722 1255205 1283129 1309956 1331609 1344449 1346366 1336501 1315229 1284959
50278 1284959 1250083 1215168 1183193 1155566 1133050 1115928 1103736 1095694 1091379 1090484 1092237 1095673
50266 1095673 1100264 1105710 1111345 1116481 1121217 1126090 1130840 1134270 1135529 1134954 1133474 1131765 1130186 1128959
50252 1128959 1127962 1126701 1124874 1122776 1121009 1119985 1119908 1120983 1123477 1127648 1133723 1141878 1152343 1165596
50238 1165596 1182252 1202454 1225547 1250564 1276800 1303608 1330065 1355473 1379979 1404075 1427645
50227 1427645 1450139 1471419 1491472 1509228 1522622 1530072 1531093 1525279 1511729 1490183 1462100 1429996
50215 1429996 1396151 1362396 1330506 1301987 1277612 1257540 1241589 1229024 1218421 1208148 1196735
50204 1196735 1182592 1164043 1140277 1112057 1081134 1049333 1018440 990180 965380 943446 923396
50193 923396 905229 889645 876712 865632 855714 846799 838735 831177 824081 817766 812271 807166 802178
50180 802178 797534 793529 790179 787501 785714 784916 784873 785279 785979 786815 787538 788056 788520 789062 789692 790523 791837
50163 791837 793837 796554 800039 804326 809133 813987 818830 824209 830668 838132 846096 854173 862290 870610
50149 870610 879489 889241 899577 909326 916986 921618 923169 922150 919346 915672 911845 907941 903497 898333
50135 898333 893302 890055 889991 893450 899928 909024 921078 936852 956728 980377 1007226 1037022 1069816
50122 1069816 1105555 1144006 1185139 1229215 1276137 1324765 1373251 1420378 1466528 1513217 1561657
50111 1561657 1611708 1662028 1710963 1757238 1799838 1837256 1867049 1886428 1893515 1887975 1870478 1841991
50099 1841991 1803872 1758219 1707407 1653175 1596627 1539112 1482537 1428605 1378270 1332242 1291509
50088 1291509 1256743 1227423 1202024 1179086 1157813 1137865 1119119 1101702 1085884 1071664 1058686
50077 1058686 1046665 1035730 1026255 1018470 1012411 1008146 1005819 1005314 1005904 1006458 1006197 1005242 1004276 1003630 1002877
50062 1002877 1001299 998569 994845 990410 985409 979918 974124 968416 963160 958293 953267 947713 942134 937641
50048 937641 934889 933580 933054 933022 933537 934674 936572 939564 943978 949903 957286 966055 976023 986994 999117
50033 999117 1012781 1027882 1043554 1058979 1074156 1089529 1105154 1120613 1135464 1149312 1161711
50022 1161711 1172378 1181350 1188528 1193416 1195803 1196399 1196167 1195228 1193097 1189808 1185972 1181719 1176402 1169729
50008 1169729 1162681 1157068 1154561 1156184 1162158 1172013 1185270 1202144 1223229 1248504 1277235 1308856
49996 1308856 1343127 1379284 1415897 1452072 1488004 1523708 1557879 1588773 1615676 1638555 1656451
49985 1656451 1667123 1668293 1658581 1637258 1604089 1560001 1507561 1450367 1391926 1335013 1281548 1232588
49973 1232588 1188418 1148873 1113715 1082787 1055852 1032335 1011355 992236 975001 960146 947846
49962 947846 937664 929162 922387 917444 914024 911917 911754 914551 920460 928610 938355 950135 964665 981658
49948 981658 999777 1017627 1034277 1048880 1060451 1068462 1073430 1076475 1078203 1078277 1076096 1071526 1064660
49935 1064660 1055252 1042954 1028132 1011810 994497 975552 954133 930514 906034 882061 859555
49924 859555 839421 822397 808308 796066 784957 775636 769335 766248 765250 765256 766340 769140 773482 778176
49910 778176 782303 786253 791109 797289 804338 812059 821231 832851 847118 863615 882144 902704 924724
49897 924724 946931 968192 988035 1006088 1021449 1032987 1040138 1043151 1042660 1039152 1032652 1022738 1009009
49884 1009009 991745 972019 951071 929723 908474 887789 867989 849053 830890 813695 797773
49873 797773 783167 769810 757926 747868 739618 732882 727751 724717 723858 724451 725785 728033 731955 737921
49859 737921 745652 754786 765330 777569 791807 808191 826438 845690 864996 883951 902558 920335
49847 920335 935991 948324 957226 963512 967954 970715 971477 969585 964109 954347 940566 924065 906338
49834 906338 888422 871094 855171 841187 829061 818590 810119 804190 800569 798253 796667 796362 798210
49821 798210 802347 808361 816261 826611 839672 854888 871378 888616 906451 924707 942927 960348
49809 960348 975986 988892 998574 1005231 1009572 1012359 1013921 1013894 1011502 1006287 998518 988708 976959 963282
49795 963282 948457 933867 920224 906994 893480 879884 866822 854304 841986 830146 819552
49784 819552 810415 802315 795383 790638 788691 788651 788895 788594 788032 787825 788408 790200 793671 799098 806448 815521
49768 815521 825999 837439 849451 861817 874151 885482 894577 900889 905066 908314 911231 913345 913760
49755 913760 912151 908914 904309 897708 888082 875162 859783 843074 825827 808822 793182 779878
49743 779878 769049 760229 753074 747478 743165 739665 736734 734393 732573 731088 730011 729734 730538 732361
49729 732361 735054 738555 742729 747271 751910 756638 761751 767851 775698 785778 798002 812014 827670
49716 827670 844823 862705 879945 895297 908053 917763 924021 926718 926168 922868 917381 910365 902194
49703 902194 892506 880814 867792 855248 844365 834610 824978 815697 807883 801861 796753 791685 786559
49690 786559 781670 777399 774537 774098 776331 780369 785258 790949 797946 806445 816254 827325 839797 853658
49676 853658 868822 885635 904921 927316 952461 978740 1003709 1025024 1041248 1051881 1056824 1056295
49664 1056295 1051448 1044610 1038281 1033829 1031397 1030789 1031839 1033810 1035013 1033394 1027343 1015897 998669 976178
49650 976178 950190 923263 897640 874513 854144 836451 821318 808569 797968 789429 783175 779453
49638 779453 777961 777714 777745 777873 778491 779585 780354 780014 778633 776801 774642 771552 766872 760522 752952 744849
49622 744849 736986 730045 724274 719338 714683 710069 705766 702277 699842 698134 696480 694508 692591 691526
49608 691526 691740 692924 694418 695782 696930 697906 698700 699318 699937 700850 702055 702975 702920 702015 701272 701418 701973
49591 701973 702023 701650 701881 703316 705552 708099 711010 714213 717034 719015 720675 722823 725498 728258 731103
49576 731103 734319 737642 740415 742649 745197 748826 753719 759907 767529 776500 786567 797969 811486
49563 811486 827424 844868 862171 877917 891277 901870 909575 914260 915551 913138 907429 899537 890508
49550 890508 880972 871610 863323 856605 851197 846794 843624 841902 841152 840699 840543 841067 841994 842372 841692 840560
49534 840560 840019 840562 842036 844318 847808 853173 860615 869555 879294 889987 902652 918101 936275 956819
49520 956819 979681 1004517 1029782 1053183 1073055 1088838 1100376 1107546 1110845 1111753 1112069 1113160 1115988
49507 1115988 1121321 1129347 1139152 1148942 1156765 1160933 1160018 1153010 1139752 1121198 1099187 1075921 1053381
49494 1053381 1032840 1014627 998356 983523 970032 958163 948045 939298 931436 924564 919333 915995
49482 915995 913809 911726 909475 907586 906485 906082 906277 907348 909511 912456 915616 918714 921814 925095 928850
49467 928850 933498 939204 945515 951715 957524 963186 968877 974310 979032 982851 985815 987961 989248 989615
49453 989615 988881 986649 982548 976565 969030 960212 950163 939064 927582 916662 906923 898356 890655
49440 890655 883763 878045 873969 871639 870688 870686 871721 874419 879300 886171 894357 903536 914147 926949 942337
49425 942337 960097 979574 999975 1020757 1041952 1063892 1086422 1108481 1128647 1145810 1158999
49414 1158999 1166805 1167763 1161678 1150468 1137482 1126038 1118437 1115850 1118592 1126405 1138648 1154340 1172194
49401 1172194 1190827 1209157 1226640 1243166 1258807 1273675 1287837 1301217 1313553 1324549 1334120
49390 1334120 1342557 1350361 1357708 1363909 1367525 1367216 1362527 1353815 1341674 1326696 1309603 1291069 1271402
49377 1271402 1250910 1230774 1213027 1199157 1189015 1181494 1176054 1173053 1172770 1174838 1178784 1184436 1191379
49364 1191379 1198446 1204286 1208348 1210914 1212206 1211827 1209148 1203957 1196655 1187964 1178514 1168517 1157790 1146211
49350 1146211 1134265 1123001 1113352 1105510 1098992 1093210 1087920 1083174 1079003 1075282 1071908 1068949 1066361
49337 1066361 1063589 1059779 1054642 1048783 1042877 1036795 1030111 1023290 1017595 1013688 1011038 1009079 1008199 1008953
49323 1008953 1010942 1013347 1016272 1020610 1026599 1033470 1040699 1048694 1057835 1067522 1076794 1085418 1093829 1102320
49309 1102320 1110904 1119756 1129185 1139157 1149355 1159877 1171599 1185697 1202806 1222553 1243777 1265298
49297 1265298 1286617 1307851 1329031 1349617 1368583 1384518 1395531 1399750 1396601 1387534 1375134 1361566
49285 1361566 1347939 1334658 1321655 1308356 1293998 1278197 1261110 1243212 1225276 1208374 1193427
49274 1193427 1180754 1170387 1162644 1157908 1155974 1156258 1158656 1163595 1171094 1180402 1190777 1202052 1214096
49261 1214096 1226252 1237686 1247893 1256464 1262951 1267641 1272321 1279628 1291547 1308770 1331203 1358437
49249 1358437 1389433 1422062 1453170 1479192 1497036 1504878 1502328 1489840 1468152 1438564 1403486 1366082
49237 1366082 1329046 1293868 1261321 1232221 1207410 1187260 1171604 1160131 1152581 1148604 1147754 1149726
49225 1149726 1154323 1161028 1168876 1177054 1185541 1194852 1205121 1215694 1225700 1234776 1243120 1251109 1259004
49212 1259004 1266789 1274068 1280309 1285457 1290133 1295032 1300447 1306766 1315068 1326504 1341047 1357462 1374657
49199 1374657 1392437 1410736 1428818 1445795 1461445 1475931 1489036 1500321 1509848 1518083 1525099 1530532
49187 1530532 1534342 1536983 1538621 1538883 1537848 1536783 1537307 1540057 1544759 1551447 1561044 1574713 1593249 1617366
49173 1617366 1648165 1686838 1733991 1789407 1852196 1920745 1992382 2063141 2127885 2180841 2216812
49162 2216812 2232935 2229952 2211962 2184918 2155029 2127566 2105769 2090099 2078760 2069445 2060817 2052532
49150 2052532 2044480 2036472 2028521 2021020 2014616 2010088 2008162 2009104 2012518 2017789 2024639 2032990 2042382 2051987
49136 2051987 2061298 2070520 2080165 2090534 2101683 2113606 2126260 2139507 2153173 2167126 2181276 2195593
49124 2195593 2210076 2224559 2238662 2252267 2266063 2281282 2298765 2318518 2340298 2364360 2391503
49113 2391503 2422683 2458854 2501005 2550130 2607320 2674155 2752968 2846400 2956409 3083227 3224624
49102 3224624 3375757 3530130 3681671 3826676 3964011 4093123 4211060 4310465 4380193 4409061
49092 4409061 4391206 4329771 4235917 4123290 4001735 3874685 3741505 3602028 3459326 3319188
49082 3319188 3187839 3070144 2968964 2885070 2817232 2762720 2718258 2680977 2648933 2621064 2596730
49071 2596730 2575203 2555572 2537110 2519569 2503061 2487856 2474376 2462993 2453540 2445224 2437393 2430217
49059 2430217 2424237 2419377 2414921 2410343 2405649 2400905 2396029 2391245 2387236 2384490 2382800 2381576 2380384 2379055
49045 2379055 2377686 2376796 2377225 2379604 2384133 2390976 2400557 2413232 2428861 2446776 2465802 2484175 2499943
49032 2499943 2511918 2520173 2525516 2528753 2530539 2531377 2531389 2530382 2528429 2526001 2523228 2519517 2514375 2508229
49018 2508229 2501875 2495539 2489144 2483229 2478729 2475834 2473794 2472071 2471057 2471412 2473182 2475854 2478890 2481988
49004 2481988 2485142 2488726 2493186 2498345 2503254 2507090 2510090 2513321 2517518 2522358 2526851 2530187 2532134 2532792
48990 2532792 2532240 2530465 2527522 2523571 2518792 2513370 2507549 2501542 2495387 2489126 2483145 2478017 2473847 2470080
48976 2470080 2466215 2462510 2459578 2457384 2455025 2451634 2447276 2442830 2439039 2435677 2431673 2426199 2419724 2413853
48962 2413853 2410016 2408379 2408140 2408595 2409676 2411660 2414818 2419427 2425862 2434489 2445510 2458827 2474004 2490442
48948 2490442 2507743 2525889 2545000 2565037 2585824 2607194 2628956 2650814 2672499 2693849 2714788
48937 2714788 2735503 2756782 2779898 2805861 2834950 2867100 2902390 2940771 2981573 3023793 3066847
48926 3066847 3110758 3155735 3201917 3249405 3298225 3348281 3399608 3452561 3507409 3563812 3621058
48915 3621058 3678707 3736560 3793995 3849800 3902853 3952775 3999884 4044847 4088384 4131039 4172913
48904 4172913 4213649 4252667 4289493 4324080 4356969 4388894 4419949 4449281 4475908 4499732 4521528
48893 4521528 4542099 4561693 4580023 4596459 4610319 4621378 4629989 4636309 4639554 4638494 4632727 4623051
48881 4623051 4610612 4596083 4579740 4561908 4543084 4523709 4503796 4482645 4459024 4431817 4400358
48870 4400358 4364097 4322459 4275493 4224324 4170452 4114877 4058354 4002009 3946878 3893070 3840284
48859 3840284 3789057 3740625 3695522 3653192 3613073 3575159 3539334 3505208 3473008 3443754 3417966
48848 3417966 3394868 3373429 3353579 3335931 3320936 3308871 3300062 3294424 3291190 3289716 3290216 3293191 3298468
48835 3298468 3305398 3313688 3323402 3334352 3346042 3358213 3371080 3385101 3400753 3418237 3437120 3456594
48823 3456594 3476395 3497057 3518862 3541056 3562763 3584366 3607218 3632046 3658213 3684463 3709810
48812 3709810 3733709 3756026 3777136 3797756 3818470 3839539 3861081 3883232 3906124 3929973 3955112
48801 3955112 3981787 4009997 4039628 4070493 4102035 4133370 4163962 4194047 4223983 4253354 4281057
48790 4281057 4306118 4328078 4346937 4363209 4377922 4391906 4404909 4415643 4422639 4424845 4421683 4413087
48778 4413087 4399477 4381287 4358485 4330906 4298910 4263309 4224787 4183943 4141812 4099589 4057519
48767 4057519 4014528 3969335 3921686 3872322 3822101 3771529 3720989 3671032 3622322 3575348 3530260
$$ [...]
##END NTUPLES=NMR SPECTRUM
##END=
