##TITLE=AC1560_ROEFFECT0018_8270752_uZRMrDbaa0
##JCAMPDX= 6.0         $$ Bruker NMR JCAMP-DX V2.0
##DATA TYPE= NMR SPECTRUM
##DATA CLASS= NTUPLES
##ORIGIN= BRUKER
##OWNER= Administrator
$$ 1.72 TOPSPIN		Version 2.1
$$ 2013-10-12 16:48:05.738 -0700  Administrator@X
$$ Compression mode = diff/dup
##.OBSERVE FREQUENCY= 400.02188249412
##.OBSERVE NUCLEUS= ^1H
##.ACQUISITION MODE= SIMULTANEOUS (DQD)
##.ACQUISITION SCHEME= undefined
##.AVERAGES= 8
##.DIGITISER RES= 22
##SPECTROMETER/DATA SYSTEM= spect
##.PULSE SEQUENCE= zg30
##.SOLVENT NAME= COFFEE_meoh
##.SHIFT REFERENCE= INTERNAL, COFFEE_meoh, 1, 14.98509
##AUDIT TRAIL= $$ (NUMBER, WHEN, WHO, WHERE, PROCESS, VERSION, WHAT)
$$ ##TITLE= Audit trail, TOPSPIN		Version 2.1
$$ ##JCAMPDX= 5.01
$$ ##ORIGIN= Bruker BioSpin GmbH
$$ ##OWNER= Administrator
$$ $$ E:\/data/COFFEE/nmr/AC1560_ROEFFECT0018_8270752_uZRMrDbaa0/10/pdata/1/auditp.txt
$$ ##AUDIT TRAIL=  $$ (NUMBER, WHEN, WHO, WHERE, PROCESS, VERSION, WHAT)
(   1,<2013-10-12 16:47:58.332 -0700>,<Administrator>,<X>,<go>,<TOPSPIN 2.1>,
      <created by zg
	started at 2013-10-12 16:46:52.580 -0700,
	POWCHK enabled, PULCHK disabled,
       configuration hash MD5:
       C8 4E 4E 5D D3 5C D8 9E 9F 52 82 E0 59 8A DE 15
       data hash MD5: 64K
       C8 54 8A 6A C8 4A 84 31 68 B3 E8 2F E8 7D 2A 27>)
(   2,<2013-10-12 16:48:01.301 -0700>,<Administrator>,<X>,<proc1d>,<TOPSPIN 2.1>,
      <Start of raw data processing
       efp LB = 0 FT_mod = 6 PKNL = 1 PHC0 = 0 PHC1 = 0 SI = 32K 
       data hash MD5: 32K
       A5 5C AF 92 33 66 22 7D DF 4A 80 C7 5F BA 10 FC>)
(   3,<2013-10-12 16:48:01.644 -0700>,<Administrator>,<X>,<proc1d>,<TOPSPIN 2.1>,
      <pk PHC0 = 97.98706 PHC1 = 0 
       data hash MD5: 32K
       AE 69 1A 7C B7 43 54 4D 69 7F 16 7B 05 0F 7F 83>)
(   4,<2013-10-12 16:48:01.863 -0700>,<Administrator>,<X>,<proc1d>,<TOPSPIN 2.1>,
      <abs ABSG = 1 
       data hash MD5: 32K
       ED 7D 94 36 73 CC 44 2A 8C 06 A6 9B 91 A6 97 88>)
(   5,<2013-10-12 16:48:01.957 -0700>,<Administrator>,<X>,<proc1d>,<TOPSPIN 2.1>,
      <abs ABSG = 2 
       data hash MD5: 32K
       9E 84 34 3C 68 63 B3 CB 99 30 80 BE B7 6D CE FB>)
(   6,<2013-10-12 16:48:02.019 -0700>,<Administrator>,<X>,<proc1d>,<TOPSPIN 2.1>,
      <abs ABSG = 3 
       data hash MD5: 32K
       79 6D A7 D2 FD F9 6D C1 7D 28 51 C6 4D A1 1D 96>)
(   7,<2013-10-12 16:48:02.129 -0700>,<Administrator>,<X>,<proc1d>,<TOPSPIN 2.1>,
      <abs ABSG = 4 
       data hash MD5: 32K
       7B DF 29 73 D2 6F C5 25 B5 FB AF 3C 3D 61 D0 D2>)
(   8,<2013-10-12 16:48:02.222 -0700>,<Administrator>,<X>,<proc1d>,<TOPSPIN 2.1>,
      <abs ABSG = 5 
       data hash MD5: 32K
       7F AC DC 48 1C A1 67 87 7C C7 B9 B0 3F 3B 7C 7A>)
$$ ##END=
$$ 
$$ $$ hash MD5
$$ $$ CC D5 08 49 FD F1 F8 E8 57 33 54 2C 18 B7 EE 4F
##$RELAX= 
##$RELAX= 
##$RELAX= 
##$RELAX= 
##$RELAX= 
##$RELAX= 
##$RELAX= 
$$ Bruker specific parameters
$$ --------------------------
##$DU= <E:\>
##$EXPNO= 10
$$ [...]
150 150 150 150 150 150 150 150
##$TP07= 0
##$TPNAME0= <>
##$TPNAME1= <>
##$TPNAME2= <>
##$TPNAME3= <>
##$TPNAME4= <>
##$TPNAME5= <>
##$TPNAME6= <>
##$TPNAME7= <>
##$TPOAL= (0..7)
0.5 0.5 0.5 0.5 0.5 0.5 0.5 0.5
##$TPOFFS= (0..7)
0 0 0 0 0 0 0 0
##$TUNHIN= 0
##$TUNHOUT= 0
##$TUNXOUT= 0
##$USERA1= <user>
##$USERA2= <user>
##$USERA3= <user>
##$USERA4= <user>
##$USERA5= <user>
##$V9= 5
##$VALIST= <valist>
##$VCLIST= <CCCCCCCCCCCCCCC>
##$VD= 0
##$VDLIST= <DDDDDDDDDDDDDDD>
##$VPLIST= <PPPPPPPPPPPPPPP>
##$VTLIST= <TTTTTTTTTTTTTTT>
##$WBST= 1024
##$WBSW= 4
##$XGAIN= (0..3)
0 0 0 0
##$XL= 0
##$YL= 0
##$YMAX_a= 594936
##$YMIN_a= -505701
##$ZGOPTNS= <>
##$ZL1= 120
##$ZL2= 120
##$ZL3= 120
##$ZL4= 120
##$ABSF1= 14.98509
##$ABSF2= -5.573092
##$ABSG= 5
##$ABSL= 3
##$ALPHA= 0
##$AQORDER= 0
##$ASSFAC= 0
##$ASSFACI= 0
##$ASSFACX= 0
##$ASSWID= 0
##$AUNMP= <proc_prof1d_extract_pilot.lims>
##$AXLEFT= 0
##$AXNAME= <>
##$AXNUC= <1H>
##$AXRIGHT= 0
##$AXTYPE= 0
##$AXUNIT= <>
##$AZFE= 0.1
##$AZFW= 0.1
##$BCFW= 0
##$BC_mod= 0
##$BYTORDP= 0
##$COROFFS= 0
##$CY= 15
##$DATMOD= 1
##$DC= 0
##$DFILT= <>
##$DTYPP= 0
##$F1P= 0
##$F2P= 0
##$FCOR= 0.5
##$FTSIZE= 32768
##$FT_mod= 6
##$GAMMA= 0
##$GB= 0
##$INTBC= 1
##$INTSCL= 1
##$ISEN= 128
##$LB= 0
##$LEV0= 0
##$LPBIN= 0
##$MAXI= 10000
##$MC2= 0
##$MEAN= 0
##$ME_mod= 0
##$MI= 0
##$NCOEF= 0
##$NC_proc= -8
##$NLEV= 6
##$NOISF1= 0
##$NOISF2= 0
##$NSP= 0
##$NTH_PI= 0
##$NZP= 0
##$OFFSET= 14.98509
##$PC= 1
##$PHC0= 97.98706
##$PHC1= 0
##$PH_mod= 1
##$PKNL= yes
##$PPARMOD= 0
##$PPDIAG= 0
##$PPIPTYP= 0
##$PPMPNUM= 2147483647
##$PPRESOL= 1
##$PSCAL= 4
##$PSIGN= 0
##$PYNMP= <proc.py>
##$REVERSE= no
##$SF= 400.02
##$SI= 32768
##$SIGF1= 0
##$SIGF2= 0
##$SINO= 400
##$SIOLD= 32768
##$SPECTYP= <>
##$SREGLST= <1H.CDCl3>
##$SSB= 0
##$STSI= 32768
##$STSR= 0
##$SW_p= 8223.68421052631
##$SYMM= 0
##$S_DEV= 0
##$TDeff= 65536
##$TDoff= 0
##$TI= <>
##$TILT= no
##$TM1= 0
##$TM2= 0
##$TOPLEV= 0
##$USERP1= <user>
##$USERP2= <user>
##$USERP3= <user>
##$USERP4= <user>
##$USERP5= <user>
##$WDW= 1
##$XDIM= 32768
##$YMAX_p= 418249256
##$YMIN_p= -635765
##$CURPLOT= <Network HP LaserJet P1505>
##$CURPRIN= <$Network HP LaserJet P1505>
##$DFORMAT= <normdp>
##$LAYOUT= <+/1D_H.xwp>
##$LFORMAT= <normlp>
##$PFORMAT= <normpl>
##$SURQMSG= 1
$$ End of Bruker specific parameters
$$ ---------------------------------
##NTUPLES= NMR SPECTRUM
##VAR_NAME=  FREQUENCY,     SPECTRUM/REAL,   SPECTRUM/IMAG
##SYMBOL=    X,             R,               I
##VAR_TYPE=  INDEPENDENT,   DEPENDENT,       DEPENDENT
##VAR_FORM=  AFFN,          ASDF,            ASDF
##VAR_DIM=   32768,         32768,           32768
##UNITS=     HZ,            ARBITRARY UNITS, ARBITRARY UNITS
##FACTOR=    0.250966925370066, 1,           1
##FIRST=     8223.43324360094, -111057,      -18274
##LAST=      0,             -147299,         -150092
##MIN=       0,             -635765,         0
##MAX=       8223.43324360094, 418249256,    0
$$ Real data points
##PAGE= N=1
##DATA TABLE= (X++(R..R)), XYDATA
$$ [...]
19570A04116b67583I8190k9705J98146b77529c6000I3952b93167e4223B55804
19559B22210c64254P0901a15403M4599j23234n859H7386a11200l40584I5790a32558
19547a46295L0308B29795J9442K12356a59861M3963d7300j21889A9026a00997
19536a48005B12858a36179A18254J16720b5795F892a65003j34000Q4080G2114
19525h5524D6449f8121c3259j72248A66966d9402A47018c9222B26086b8922B87509
19513g8151a9544B05595g8421K6387A59924f1404k80038a60126d1673k7718k89028
19502c58419r3605F2799a54497j12008I3500b94773a12650B19204d4657j36526
19492a81183k22864b8053k12156a05088m0735B44640F9405g8843j34441g4040
$$ plain form
19570 104116 -267583 98190 68485 266631 -277529 -36000 93952 -293167 -54223 255804
19559 222210 -364254 -293353 -115403 -70804 -194038 -199897 87386 -111200 -451784 95790 -132558
19547 -146295 -115987 229795 249237 461593 -159861 -115898 -47300 -169189 19026 -100997
19536 -148005 212858 -136179 118254 234974 -25795 6892 -165003 -299003 -214923 72114
19525 -85524 46449 -68121 -33259 -205507 166966 -49402 147018 -39222 226086 -28922 287509
19513 -78151 -19544 205595 -78421 -52034 159924 -61404 -341442 -160126 -41673 -69391 -358419
19502 -358419 -452024 62799 -154497 -266505 93500 -294773 -112650 219204 -44657 -181183
19492 -181183 -404047 -28053 -240209 -105088 -145823 244640 69405 -78843 -213284 -74040
19481b14166i5297C024a25169e3541l4332B13714j1188f5083m5684k45469A58341
19469B79303b99484e0567O000j51932o4160i3062j30706P0145d1655h774E8815
19457B0351J3729g2754m9398j74813A3094K23046a54924O3753A0520b2479l8031
19446f0510C96767j67701i8344I3202d94204A77513D4423A4650a83173k36515
19436d19688k6887A73734a22405d2438A03409g2416j41326G9018o83a76317a9230
19424b7715j0106o1700B1060a89726f0551o6354f289I8872c7925j45282f6079
19412d2625B06879c05622B99014c68242c0804j19467C5984i597l11807h2642A63615
19400e3483p072C29483H077b14904a3721q542G7434J36438J5556E3806f7638j17699
$$ plain form
19481 -214166 -95297 3024 -125169 -53541 -87873 213714 202526 -65083 -110767 -356236 158341
19469 279303 -299484 -50567 -44567 -196499 -260659 -93062 -223768 -153623 -41655 -8774 58815
19457 20351 34080 -72754 -122152 -296965 13094 236140 -154924 -91171 10520 -22479 -60510
19446 -60510 396767 229066 -98344 93202 -494204 177513 44423 14650 -183173 -419688
19436 -419688 -446575 173734 -122405 -42438 103409 -72416 -213742 79018 78335 -176317 -19230
19424 -27715 -37821 -99521 21060 -189726 -60551 -126905 -6289 98872 -37925 -183207 -66079
19412 -42625 206879 -305622 299014 -368242 -30804 -150271 35984 -9597 -321404 -82642 163615
19400 -53483 -60555 329483 8077 -214904 -13721 -22263 77434 213872 229428 53806 -67638 -185337
19388a85337d6861a464r9696d2788C00938N6863A59538a01785D7799a9046m1951
19377f0997j82553A61785f6948o2531F5586g1349j09188G0754O1807b8721G7355
19365a68399j50806L7442A67257c2481p0515H3683b00847L5274P2881M1673a4503
19353b70972d936E9051a22465j95481E1980b32967J13132L9207q6983p6601h4695
19341A42551a09486K6473E2115B4287b83565J23241A55602b5212B10149C7101
19330E057c00095B05368e17778K50741J26959A9285N8171l5324i01A87861H7255
19318f857j5970j03354j19025N8383Q0427A20074l7723J42138g8270F2648O0369
19307A23017a49943k90M1119F2279b25277J02751l9533f1640b4232B29224d6161
$$ plain form
19388 -185337 -46861 -1464 -101160 -42788 300938 357801 159538 -101785 47799 -19046 -60997
19377 -60997 -243550 161785 -66948 -129479 65586 -71349 -180537 70754 132561 -28721 77355
19365 -168399 -319205 -281763 167257 -32481 -102996 83683 -200847 -165573 -92692 -51019 -14503
19353 -270972 -4936 59051 -122465 -317946 51980 -232967 -119835 -80628 -167611 -244212 -84695
19341 142551 -109486 -83013 52115 24287 -283565 -160324 155602 -25212 210149 37101
19330 5057 -300095 205368 -517778 -267037 -140078 19285 77456 42132 -901 187861 87255
19318 -6857 -22827 -126181 -245206 -186823 -106396 120074 82351 224489 -78270 62648 123017
19307 123017 -149943 -150233 -109114 62279 -225277 -122526 -162059 -61640 -24232 229224 -46161
19295b0166l7188j78668a05297j0495A32657i7638B85439a80638d7653m2930G6417
19283F004O1063a41932j36685R247J1636O1407E8649J25443a59169A90687b66372
19271b9288A82303L9878q9506h1484m20737A73690c15892J24645C95396a5484
19260i6222A13436c50183G4330c9201j37713a7353j19733G973P2007j3355L2520
19249I9145Q7352c3612A09989b55715P0885o2591d5124a1429B76467d3459m7750
19238i1209m6151H9186d14433d2602A06171J81078a17009j2619l19102c9435H1349
19226I9901K9294a07560a5004j685l01244h3024j38194a184D9463d3035m6529
19215h9564E9378a24505B9616Q2602J34460b28458C9156P2901h9176k68943B2594
$$ plain form
19295 -20166 -57354 -236022 -105297 -115792 132657 -97638 285439 -180638 -47653 -90583 76417
19283 6004 67067 -141932 -278617 -269370 -257734 -196327 58649 184092 -159169 190687 -266372
19271 -29288 182303 222181 132675 -81484 -502221 173690 -315892 -191247 395396 -15484
19260 -96222 113436 -350183 74330 -39201 -176914 -17353 -137086 7973 79980 66625 99145
19249 99145 186497 -33612 109989 -255715 -184830 -247421 -45124 -11429 276467 -43459 -91209
19238 -91209 -137360 89186 -414433 -42602 106171 287249 -117009 -129628 -448730 -39435 81349
19226 99901 129195 -107560 -15004 -16689 -317933 -83024 -221218 -1184 49463 -43035 -89564
19215 -89564 59378 -124505 29616 112218 246678 -228458 39156 112057 -89176 -358119 22594
19203b12998e7398j99920J27542l3190A91686K118g023j19743A3729L5935K52753
19192C02417o0158I4540P5904L1738A3868B826a86851O523C15980a29640A22243
19180a21743B78088I9691a74306P7842q9811h9103e234j95580O1911a7804j06557
19169a24361e0056A04578a08267A00309l5247J70217a67800q6279M1092b2876
19158a59216c4801H3303l050B274d85762a37539J5758D07266c03560J31778A10665
19146F5248R3209b26624j38644A46618J37318a30243f723j72947b5061k74162
19136b99223F4157J19003D624a33835G5537K01494h8624B0115c26473p3260G3535
19124c2636C1511J15628h4393A49210c2236E7449b22828m4687D5188K995a32234
$$ plain form
19203 -212998 -57398 -257318 -129776 -162966 191686 193804 -7023 -126766 13729 49664 302417
19192 302417 242259 94540 170444 202182 13868 2826 -186851 -180328 315980 -129640 122243
19180 -121743 278088 99691 -174306 -96464 -186275 -89103 -5234 -200814 -138903 -17804 -124361
19169 -124361 -50056 104578 -108267 100309 65062 235279 -167800 -254079 -212987 -22876
19158 -159216 -34801 83303 80253 2274 -485762 -137539 -121781 407266 -303560 -171782 110665
19146 65248 158457 -226624 -365268 146618 283936 -130243 -6723 -179670 -25061 -299223
19136 -299223 64157 183160 4624 -133835 75537 277031 -88624 20115 -326473 -399733 73535
19124 -32636 31511 147139 -84393 149210 -32236 57449 -222828 -267515 45188 48183 -132234
19112f5262a3052j92460a1366j08642M4633C9755a76416G5937b17153d2252l5526
19101g7778q1732B42202J5611b63386a10292O938A60172a95500N1697I5529a13454
19089a19454j53406j0886C81489d9710o1133j408J1749A05572D5701B0147c08859
19077d18458A67487b21928B6747b57864F8472a38190n865k8023K146n8538A40328
19065D8056K39870q7093l5851b39147b1946A6375a93472F1607B8489a77967N1742
19054a26225J5203j64998f8870j2102j21606L4918a8899p206l8853K9515p8011
19043a13454A06903a1065A12140b05981A40699d8121A48787b4306A7181b41453
19032B12d5713C2118a11066C74808j38117l2196l3924N543l3866O5954K77449
$$ plain form
19112 -65262 -13052 -205512 -11366 -120008 -75375 39755 -176416 75937 -217153 -42252 -77778
19101 -77778 -159510 242202 257813 -263386 -110292 -103354 160172 -195500 -143803 95529 -113454
19089 -119454 -272860 -283746 381489 -49710 -110843 -112251 -100502 105572 45701 20147 -308859
19077 -418458 167487 -221928 26747 -257864 68472 -138190 -144055 -172078 -169932 -228470 140328
19065 48056 287926 200833 164982 -239147 -21946 16375 -193472 61607 28489 -177967 -126225
19054 -126225 -111022 -276020 -68870 -80972 -202578 -167660 -18899 -26105 -64958 -35443 -113454
19043 -113454 106903 -11065 112140 -205981 140699 -48121 148787 -24306 17181 -241453
19032 212 -45713 32118 -111066 374808 236691 204495 170571 176114 142248 208202 485651
19021D85651A97670n6027J6599n5953c9485m42966b18370g6000l36397h9168H381
19009F0683j1445J38182E0250M1254e1588j41220j98733B66402j31216i4684G0908
18997c07566A66949a53269a752j40009M7499J2889E3672a27673D992a1844k6388
18986c8232A85007c59088R6795a11784A40409m8326b33225f0818k06440J01416
18976a65842B8838R0616k738A5157i0353N217j46674a00147A28998h934B31021
18964c7360A45555k0053L4938c19472l08692h7078A33777a08640m2220b7411B10806
18952b3806j85282O4082G228R949a398A10339A8296N8793K41874A43151a27189
18940e0357B17992m1672b0904C4898a95434C3801i5129D2395b53277C2909A5085
$$ plain form
19021 485651 197670 141643 158242 102289 -39485 -482451 -218370 -76000 -412397 -89168 8381
19009 60683 49238 187420 50250 91504 -51588 -192808 -391541 266402 135186 -94684 70908
18997 -307566 166949 -153269 -1752 -141761 -94262 -81373 53672 -127673 4992 -11844 -38232
18986 -38232 185007 -359088 -262293 -111784 140409 92083 -233225 -60818 -267258 -165842
18976 -165842 28838 119454 116716 15157 -90353 -85136 -231810 -100147 128998 -8934 231021
18964 -37360 145555 125502 160440 -319472 -628164 -87078 133777 -108640 -150860 -27411 210806
18952 -23806 -209088 -145006 7228 17177 -1398 110339 18296 77089 318963 143151 -127189
18940 -50357 217992 176320 -20904 34898 -195434 33801 -95129 42395 -253277 32909 15085
18928a15199p284j465N5066j4402L8498j02946O4370m5393F9908b6142E1126a70490
18915i7908c2067j60719B09761b17297k56018b4399j53641a0214l7840k2223c3250
18903B62552i6172A42530J04869b43165H5764D0832a20555A6884J95028a81470
18892b55314B13397B0212J47684i0674k09135J13513g6802F3897b82555B45541
18881b8153m307f975l5673D4672i1221A49789d80217A97621c02620N6173J16608
18870a29839d850j01265H5552h6666D7527c89467J31790B14985f2394A09652a70043
18858A10406L8204b31185b4548j17067O1752A323R9446J06382b66740I3660f8510
18846B98474b01757A00583b54182a13755I0452J3988D704d04053F6918b25729
$$ plain form
18928 -115199 -122483 -123948 -68882 -83284 -44786 -147732 -83362 -128755 69908 -26142 51126 -170490
18915 -97908 -32067 -192786 209761 -217297 -473315 -24399 -178040 -10214 -48054 -70277 -33250
18903 262552 -96172 142530 247399 -243165 85764 40832 -120555 16884 211912 -181470
18892 -255314 213397 20212 167896 -90674 -299809 -186296 -76802 63897 -282555 245541
18881 -28153 -32460 -6975 -42648 44672 -91221 149789 -480217 197621 -302620 -246447 -129839
18870 -129839 -4850 -106115 85552 -86666 47527 -389467 -257677 214985 -62394 109652 -170043
18858 110406 148610 -231185 -24548 -141615 -79863 1323 100769 207151 -266740 93660 -68510
18846 298474 -201757 100583 -254182 -113755 90452 104440 4704 -404053 66918 -225729
18835a12769E2341b73033B65208c99662J68673G84P3741g6219r8296N9241M1812
18824g3462L4086j13548g4251B28611c1227m09164D09157A0988K57695b22655
18813G4198a13431H1052i1092d3342C17210c8298A44233K54549A48648a56523
18802A36042a887o8665q6197A25722e9593A98882c14008k7639a04811A18166c1855
18790a95590i4250Q815H6085a51043l4194C69988i8494r5316g6538j10398j45581
18779c32517a62378f5675q8671d8408B08785a91935r034M8624c8668L316k38023
18768b73375A1528l801a07912k15503c1341n2168c0023G4415O3965e7189A01556
18756f816A74715a53801d4788G7055d0977k8217k28056J07771I0753a60526p6635
$$ plain form
18835 -112769 52341 -273033 265208 -399662 -230989 784 74525 -76219 -174515 -115274 -73462
18824 -73462 -39376 -152924 -74251 228611 -31227 -440391 409157 10988 268683 -222655
18813 74198 -113431 81052 -91092 -43342 317210 -38298 144233 398782 148648 -156523
18802 136042 -1887 -70552 -156749 125722 -59593 198882 -314008 -341647 -104811 118166 -31855
18790 -195590 -94250 -85435 86085 -151043 -185237 369988 -98494 -193810 -76538 -186936 -332517
18779 -332517 -162378 -65675 -154346 -48408 208785 -191935 -200969 -152345 -38668 -35352 -273375
18768 -273375 11528 7727 -107912 -323415 -31341 -83509 -30023 74415 138380 -57189 101556
18756 -6816 174715 -153801 -44788 77055 -40977 -69194 -297250 -189479 90753 -160526 -237161
18745b37161G0861a61735e3836j33612A02136b24649l9637A07889K2399b13078
18734b34743d7774j45460A45850R3255r2313J6168L7258e0709B4220c6712o1924
18723i8636A01539b30499a10171D18J74559j3036f0932k76074j06000e7942l649
18712f1591A9312b3998j1546j48634E1493g1345J7501j86081Q9560B3174a10819
18700D4891n685M51540a7138j49142o8502E3658b96026R9619i8088d2713q0307
18689a23020l4440B46389G1113a27791l4102c0137B35774E0363b28986A27514
18678a7940j86621B835K3671b01475J00040M1363A91002i8159B97357a14572m74432
18667e89004a23012m9144B9410d6322l71674G7933b18049B11983A5828e8137k1513
$$ plain form
18745 -237161 70861 -161735 -53836 -187448 102136 -224649 -264286 107889 130288 -213078
18734 -234743 -47774 -193234 145850 239105 146792 162960 200218 -50709 24220 -36712 -98636
18723 -98636 101539 -230499 -110171 418 174977 161941 -60932 -337006 -443006 -57942 -61591
18712 -61591 19312 -23998 -35544 -184178 51493 -71345 -53844 -239925 -150365 23174 -110819
18700 44891 39206 490746 -17138 -166280 -234782 53658 -296026 -196407 -98088 -42713 -123020
18689 -123020 -157460 246389 71113 -127791 -161893 -30137 235774 50363 -228986 127514
18678 -17940 -204561 2835 26506 -201475 -101435 -60072 191002 -98159 297357 -114572 -589004
18667 -589004 -123012 -172156 29410 -46322 -417996 77933 -218049 211983 15828 -58137 -79650
18656g9650j71986K3279i069k87553A17100c05514l4355a29807c9190j75446k04799
18645d19435B42472d69376a98740I7902f7498C16201C128M0746K62605A04931
18634e5545k41823a01712m9364k8973A94172j04a8472q9657L9447G758J92348
18623B00106m8594b60644G6140o289c02400C47454c54893Q7221C8315R6523c66624
18611C2452a00762p2916I3386b2028A18401m5266b17696B0271K7736a65969c1385
18599B89942f3740j8376A82908p0642A4840a15391C5275b4450l5829o9647o7678
18588a97604g1972B92221b69637c7826o9913C09217I8929B0549M20727I2907K5408
18577A18315J68a94684k2250E1762a45039A62020e2150p8911B38864f6716m8518
$$ plain form
18656 -79650 -251636 -228357 -9069 -296622 117100 -305514 -339869 -129807 -39190 -214636 -419435
18645 -419435 242472 -469376 -198740 97902 -67498 316201 3128 43874 306479 104931
18634 -55545 -297368 -101712 -151076 -180049 194172 194068 -18472 -108129 -68682 7758 200106
18623 200106 151512 -260644 76140 69851 -302400 347454 -354893 -267672 38315 134838 -366624
18611 32452 -100762 -173678 93386 -22028 118401 73135 -217696 20271 48007 -165969 -31385
18599 289942 -63740 -82116 182908 112266 14840 -115391 35275 -24450 -60279 -129926 -197604
18588 -197604 -71972 292221 -269637 -37826 -107739 309217 98929 20549 441276 92907 118315
18577 118315 118483 -194684 -216934 51762 -145039 162020 -52150 -131061 238864 -66716 -115234
18566a15234k3408k6871G5865j5434j1832J3302a15396F3349a78683M5346e4263
18554A05906K13422D2653l978a36795C21727b30497a8023j12086j43598A08849
18543A39174g6271A68089D9289b7593d283A5767h5099k10920a07191B05158H6680
18531A06604b59929J20497H5669b80777J36761r1484A8398H242O9268b02414D713
18519c08649n5808a3184k53297f429H079c20939I8121f0002A15793b42846A04128
18507a39661O8586B3882L49605a25758f165k6020B64090d6429k63977E8798K8741
18496H7539J80595c2857l972k02471l1443a26143J5651N2183j11285b2239q7524
18485a09763e3483j3668j15324m6874d6822H4507b2458q2536G0019j4649d0676
$$ plain form
18566 -115234 -138642 -165513 75865 60431 48599 61901 -115396 63349 -178683 -133337 -54263
18554 105906 319328 42653 38675 -136795 321727 -230497 -18023 -130109 -273707 108849
18543 139174 -76271 168089 49289 -27593 -4283 15767 -85099 -296019 -107191 205158 86680
18531 106604 -259929 -139432 85669 -280777 -144016 -235500 18398 8242 77510 -202414 4713
18519 -308649 -364457 -13184 -266481 -6429 8079 -320939 98121 -60002 115793 -242846 104128
18507 -139661 -71075 23882 373487 -125758 -6165 -32185 264090 -46429 -310406 58798 87539
18496 87539 268134 -32857 -36829 -239300 -270743 -126143 -110492 -58309 -169594 -22239 -109763
18485 -109763 -53483 -67151 -182475 -229349 -46822 84507 -22458 -104994 70019 55370 -40676
18473H2152j3083f9550l9237h320D9960P6436a83824j16187o427K3672E338K60802
18461B66140E9491b5231D24518E1306k3119K28787a39464D1567b7715r2749a9065
18449F5060a12585p1148B38262r9292I335L4759E506f4785H9265d44027K17660
18438b26367i9756r9028g5442I8798K8320J19350a55079j16560D5414b55962a03262
18426a16173B9304a64072k9603A45986J28391a14175j27532B41534e5181B42764
18415a6516j05645A51898d8064o1318O569A35719C1624i9707C00067a36175C07204
18403i983C09681e2377p6133e9037b553A9086J16666a8247A55317a413l13715
18392c15128a18413r652B0389e7295l29546J2105b4112A40310D8410P350A0358
$$ plain form
18473 82152 69069 -69550 -108787 -8320 49960 126396 -183824 -300011 -306438 -282766 5338 266140
18461 266140 59491 -25231 424518 51306 28187 256974 -139464 41567 -27715 -120464 -19065
18449 65060 -112585 -183733 238262 138970 9335 44094 5506 -64785 89265 -444027 -226367
18438 -226367 -99756 -198784 -75442 98798 127118 246468 -155079 -271639 45414 -255962 -103262
18426 -116173 29304 -164072 -193675 145986 274377 -114175 -241707 241534 -55181 242764
18415 -16516 -122161 151898 -48064 -109382 -102813 135719 31624 -99707 300067 -136175 307204
18403 -9983 309681 -52377 -128510 -59037 -2553 19086 135752 -18247 155317 -1413 -315128
18392 -315128 -118413 -128065 20389 -57295 -386841 -374736 -24112 140310 48410 55760 10358
18380e0046B40715h5048B9837P4921c05017i9419l04588A19645c48004J02577
18370b45427m2138J8424A49237a73392C0620K47803F327K14550m1099G9657F190
18358a81165G9542b3555o2637B8741J76972e4409b5583p6430E8185R4532k3230
18347A29487J55307b22281h1528E5959K4329P882P3462b03562j74842a07313m23615
18336e30928a41261G409K1923c00680D9728J5302b41816j2406g7896k5145j8810
18325a21851l6997M8008B2470L46930a95967Q7921A22209R9510h2336M1111k7934
18314f9159l04236P8673A15750C3571a61650e6140k1220o6854M42A66687M2881
18303B09568A5233L0242N8344J51752e00144A28207a02973a8303p1062j53900
$$ plain form
18380 -50046 240715 -85048 29837 104758 -305017 -99419 -404007 119645 -348004 -245427
18370 -245427 -287565 -269141 149237 -173392 30620 278423 6327 220877 179778 79657 6190
18358 -181165 79542 -23555 -86192 28741 205713 -54409 -25583 -102013 58185 152717 129487
18347 129487 284794 -222281 -81528 55959 80288 88170 161632 -203562 -378404 -107313 -530928
18336 -530928 -141261 7409 29332 -300680 49728 65030 -241816 -254222 -77896 -103041 -121851
18325 -121851 -158848 -110840 22470 369400 -195967 -108046 122209 221719 -82336 -41225 -69159
18314 -69159 -373395 -294722 115750 33571 -161650 -56140 -77360 -144214 -143772 166687 209568
18303 209568 15233 45475 103819 255571 -500144 128207 -102973 -18303 -89365 -243265
18293b43265A33153H07J05512b19577C17248a55659g1060A35646C4859b37845
18282b97007b3943j01447m095A4151e87913g4691E0686K5020a84715l7437B24007
18270D6483L06064b13306A22043D6192L30001F2808J00806a84976G1501d433o5294
18259f9727l39305a27057B00913F5328a81200f0633k70028a59105A11203b59802
18248A75490R9689b279A65884a53452N3167B07268b9024o6680j56679A76967J22237
18237B99204A15531J09634a14258A8371f9023A19145c41617J41208M5579N6044
18227i8786D8248a74208B86952i8397F1325a57910B369a19822q9754c4951d188
18215D2345g7103k6656p272C86652j91983c20190k4312G6962L12999A29290B9142
$$ plain form
18293 -243265 133153 807 106319 -219577 317248 -155659 -71060 135646 34859 -237845
18282 -297007 -23943 -125390 -129485 14151 -587913 -74691 50686 75706 -184715 -222152 224007
18270 46483 352547 -213306 122043 46192 376193 62808 163614 -184976 71501 -4433 -69727
18259 -69727 -409032 -127057 200913 65328 -181200 -60633 -330661 -159105 111203 -259802
18248 175490 275179 -2279 165884 -153452 -100285 207268 -29024 -95704 -252383 176967 299204
18237 299204 115531 225165 -114258 18371 -69023 119145 -341617 -200409 -154830 -98786
18227 -98786 48248 -174208 286952 -98397 61325 -157910 2369 -119822 -209576 -34951 -4188
18215 42345 -77103 -103759 -111031 386652 194669 -320190 -344502 76962 389961 129290 29142
18203d49845B22391o9625i318C24444j50451b53397I1678m4715a54960k7897d5908
18191a39628k4012B14782H2988J35780H2592c0213I9195c54505Q1165P1301I0809
18179C0517N1991b68073M5666n9335A7036d9371a6824j51431G9752c921n467k19452
18167b28840D2084a11845d0638C4383J05258d3087B1147J63143M0587d5369j33291
18156a78660a3610F0341d7208p2673k64878D9601Q6547j2172d8825n2009r9000
18145a99834b5878j07176k12236I5700j9804N4032b42892g9062k66750b1975D6007
18133a06026k0970l4135M4527r7425d2659j08077E62492d3229j3107F2392R6742
18122A59134g2739B18235A1858b29573e7535p9046p8621C5175K98913A0777J6123
$$ plain form
18203 -449845 222391 152766 -9318 324444 173993 -253397 91678 46963 -154960 -182857 -45908
18191 -139628 -163640 214782 82988 218768 82592 -30213 99195 -354505 -273340 -202039 90809
18179 30517 82508 -268073 -222407 -281742 17036 -49371 -16824 -168255 79752 -3921 -9388 -228840
18167 -228840 42084 -111845 -40638 34383 139641 -43087 21147 184290 224877 -45369 -178660
18156 -178660 -13610 60341 -47208 -119881 -384759 49601 136148 123976 -48825 -100834 -199834
18145 -199834 -25878 -133054 -345290 95700 75896 129928 -242892 -79062 -345812 -21975 46007
18133 -106026 -126996 -161131 -116604 -214029 -42659 -150736 562492 -43229 -56336 62392 159134
18122 159134 -72739 218235 11858 -229573 -57535 -136581 -215202 35175 334088 10777 26900
18111B6900g5809A88570b9294j08322K8789C62179j26453l475c92455J24258A4512
18099F3249l0824a87485j3269P1877B7779i659A32596h4414B19529K00824h0854
18087c17079O6533c0927B0645M1635J84105a23822B05320d64934g4030k67709
18077c41739A24861c0024B02222n9995b86754A87830C347a33288k06048a58748
18066A37360K48998h2149Q801k27972A7560J79646b08153D9376e3056m88834B10106
18054A62004o5658a34839L7899A51213a88993B86581a08302l6734C1221b2636
18043d9112j08968B44739d1138k39187k77719A83439c2970b026H3964K04531a14189
18031a16271H8393a85638B65209A1153N3568J7220a7209q6803n9978j6363M7108
$$ plain form
18111 26900 -75809 188570 -29294 -137616 -108827 362179 235726 232251 -392455 -268197 14512
18099 63249 32425 -187485 -200754 -128877 27779 -9659 132596 -84414 219529 420353 -80854
18087 -317079 -250546 -30927 20645 62280 246385 -123822 205320 -464934 -74030 -341739
18077 -341739 124861 -30024 202222 142227 -286754 187830 3347 -133288 -339336 -158748
18066 137360 386358 -82149 -73348 -301320 17560 197206 -208153 49376 -53056 -541890 210106
18054 162004 96346 -134839 -96940 151213 -188993 286581 -108302 -145036 31221 -22636
18043 -49112 -158080 244739 -41138 -280325 -558044 183439 -32970 -2026 83964 288495 -114189
18031 -116271 88393 -185638 265209 11153 64721 81941 -17209 -104012 -163990 -180353 -133245
18020a33245q8712B48306a68852A49909I116a9401k62688B03841A3659M82985
18010D96644a39128k41594J13259C1179J7153P3234a47110H2236J00884c05654
17999A14816E6878b7472j67785f9633e7B42300h0591q9607c3646l30612J31523
17988b32735A4155L5302R7480E8499j1216k3399R7502O005L4123L2679g429A75697
17975B04774o2959D8527b49173A22889l5810a37976A22330H640g0087A39668E3633
17963f1016j30570Q4688A28903P2284I9108d8234A35391k001J15234D1402b90102
17951a41623A70636a58956C50224b82180i932j89831e6647j14731L4566A01300
17940d8106l9879c4654j92467A7695P2703f8094l8054b1793l16963A3423c5243
$$ plain form
18020 -133245 -221957 248306 -168852 149909 9116 -19401 -282089 203841 13659 496644
18010 496644 -139128 -380722 -267463 31179 48332 121566 -147110 82236 183120 -305654
17999 114816 56878 -27472 -195257 -69633 -57 242300 -80591 -170198 -33646 -364258 -232735
17988 -232735 14155 49457 146937 58499 47283 23884 121386 127391 161514 194193 -7429 175697
17975 204774 141815 48527 -249173 122889 87079 -137976 122330 8640 -70087 139668 53633
17963 -61016 -191586 -106898 128903 201187 99108 -48234 135391 133390 248624 41402 -290102
17951 -141623 170636 -158956 350224 -282180 -9932 -199763 -56647 -171378 -136812 101300
17940 -48106 -87985 -34654 -227121 17695 90398 -68094 -106148 -21793 -338756 13423 -35243
17928b41076F2873b63393I1547e8695F5993J7361d9656p4084j33711a14104H9350
17916f273C53733i5113A31526E1063h7616B54578j24743C6006K1444a62994G0251
17904b07816j20608g9235E9651J19850n3829o2344j5113J92508m2686c06555B38765
17892A7845d5013A13680D430Q4265b1741A09518b432j65914G4406L1467j8234
17881H7639A1006g1034o8247c5257j26358F6013b63331J25134d0607C56751j76762
17870A79989J7766a75320A53529d0104J7237C20354i3199A42851b03583O8580
17860a35003N5127A85194a12301L7794b399B5911a13598A60481F5873d2079A21509
17848A84203o0938F1578J26973a65812O694E7883A6767c7203B71897d03578e3079
$$ plain form
17928 -241076 62873 -263393 91547 -58695 65993 83354 -49656 -123740 -257451 -114104 89350
17916 -6273 353733 -95113 131526 51063 -87616 254578 129835 36006 57450 -162994 70251
17904 -207816 -328424 -79235 59651 179501 125672 63328 48215 240723 198037 -306555 238765
17892 17845 -45013 113680 4430 88695 -21741 109518 -2432 -168346 74406 105873 87639
17881 87639 11006 -71034 -139281 -35257 -161615 66013 -263331 -138197 -40607 356751 179989
17870 179989 197755 -175320 153529 -40104 -22867 320354 -93199 142851 -203583 -135003
17860 -135003 -79876 185194 -112301 -74507 -2399 25911 -113598 160481 65873 -42079 121509
17848 184203 123265 61578 188551 -165812 -159118 57883 16767 -37203 271897 -403578 -53079
17836c15388c2464D05428A56417b668C4948i0975A3764B059d8096n1864A44425
17824b20652C96091a75429K6063f2645B29161f5695G2942N920a22457A74741b2335
17812D9744c18368i7560b4979A37925B6075Q5108Q2256n0767C5894a2560A17903
17800i9791l2454j08967J01827j31185j64495E8871k5892b60296D211P6509J31512
17789B12232b13257R7621K246m79219D87785D9228k2665a43213D3624Q204K55170
17778C06998m2892a65203K9548B61913C8898a20423l04244B32273a08979C3823
17767a24633M9676G3829K63575a28806l5472A02497n171k7719j7191a35963r9488
17756b35451B11158D4521L514J41484e7058I3864e8123o2323F3775O6363N4302
$$ plain form
17836 -315388 -32464 405428 156417 -2668 34948 -90975 13764 2059 -48096 -99960 144425
17824 -220652 396091 -175429 -149366 -62645 229161 -65695 72942 78862 -122457 174741 -22335
17812 49744 -318368 -97560 -24979 137925 26075 111183 193439 142672 35894 -12560 117903
17800 -99791 -132245 -241212 -139385 -270570 -435065 58871 32979 -260296 4211 80720 212232
17789 212232 -213257 -115636 -113390 -592609 487785 49228 26563 -143213 43624 51828 306998
17778 306998 264106 -165203 -135655 261913 38898 -120423 -424667 232273 -108979 33823
17767 -124633 -74957 73829 337404 -128806 -164278 102497 97326 69607 52416 -135963 -235451
17756 -235451 211158 44521 48035 189519 -57058 93864 -58123 -120446 63775 130138 184440
17745A84440f0201B84078a33131f5145a9889A10405J02926d5305n9147J6714j48772
17734b36510e706j07612A06295a38109A36805K05576A46620b01848A01922L13918
17724D15840c18233c4948h061o1335K4405A45685e4471B51697B2936N5069f2928
17712A972i7368A8949J5087M0417g3109j8949j59678C9496b1072k34247o8847
17701c24166A96707i034B32604m252A3738Q0850m5936J01284a18064a817l557
17690e374m7979D95301b67917B3524J17994a26032K5143K1138L2027k54994J39766
17679a62952L6195k33420B10221g8754A26973i1501A81303b32492m2764e6978
17668A25447a19370b5172a292D8463P0329O1545h4923B63243b40358J11090E1651
$$ plain form
17745 184440 -60201 284078 -133131 -65145 -19889 110405 213331 -45305 -104452 -87738 -236510
17734 -236510 -5706 -113318 106295 -138109 136805 342381 146620 -201848 101922 415840
17724 415840 -318233 -34948 -8061 -69396 -44991 145685 -54471 251697 22936 78005 -62928
17712 1972 -97368 18949 34036 74453 -73109 -92058 -251736 39496 -21072 -255319 -324166
17701 -324166 196707 -9034 232604 228352 13738 94588 48652 149936 -118064 -1817 -5374
17690 -5374 -53353 495301 -267917 23524 141518 -126032 -100889 -79751 -47724 -302718 -162952
17679 -162952 -126757 -360177 210221 -78754 126973 -91501 181303 -232492 -275256 -56978
17668 125447 -119370 -25172 -1292 48463 118792 180337 -84923 263243 -240358 -129268 51651
17656D912b77638N0662A04474K1849K57295i7452d459A36422J17966j23175E8178
17644B0229J96913M7756a21477C1566b42478B6499d511k02664B82302a26854B84279
17632a10200D2856h6911B41692E5301g1625B96248E9123N9705a91784F5688M61385
17621E27073b3234n8116a3461A92392K9611B395M2753b36246f755l8732k98308
17610c43795a00204E85074A2958J39055R8142M4650j39610n4342N1623b09718
17599B36464a01801A23886J6093k1649D3650b29882h8835C0955O2019J31815f9564
17587A11275a5093H768e200k1552I9616a2240K935j35760C96346A62517g9270
17575C5464b05052k38427c0936j84550C7876J48472b0228j85431H8359c03517
$$ plain form
17656 4912 -277638 -226976 104474 126323 383618 -97452 -4459 136422 254388 131213 58178
17644 20229 217142 264898 -121477 31566 -242478 26499 -4511 -207175 282302 -126854 284279
17632 -110200 42856 -86911 241692 55301 -71625 296248 59123 118828 -191784 65688 527073
17621 527073 -23234 -81350 -13461 192392 222003 2395 45148 -236246 -6755 -45487 -343795
17610 -343795 -100204 585074 12958 152013 250155 294805 155195 100853 152476 -209718
17599 236464 -101801 123886 139979 118330 43650 -229882 -88835 30955 92974 224789 -69564
17587 111275 -15093 8768 -5200 -26752 99616 -12240 -9305 -145065 396346 162517 -79270
17575 35464 -205052 -443479 -30936 -215486 37876 186348 -20228 -205659 88359 -303517
17564a29605p5610N6007f7155E9741d5377B3916K63709E906k283O251M4363b7587
17551a00264B22619E3588O993J22619b11285N8164B43836R5400D4671h682B48963
17539c8632B1344J9261f6003j77641B75362e8463C6246M3867a42224B96400a03633
17527C30017a67326f3482G1438R9750a38725j54069J45803B20615g7569B17655
17516a10790B62859a11725q6494H3566B2601O2674f6065B11673O1985F3166J71854
17505B35020O7718J37660G276b00147a4911B02813I6743j4509C3296K03508E4025
17493c2538B85678e4702a5159j65936A67385J08703P5048j39061D2349N2142a27416
17481A778b68674A27909a62276L0993A24385n7629H100K57360j18625R2905J13966
$$ plain form
17564 -129605 -205215 -149208 -67155 59741 -45377 23916 287625 5906 3623 9874 54237 -27587
17551 -100264 222619 53588 60581 183200 -211285 -153121 243836 339236 44671 -8682 248963
17539 -38632 21344 40605 -66003 -243644 275362 -58463 36246 80113 -142224 296400 -103633
17527 330017 -167326 -63482 71438 171188 -138725 -292794 -146991 220615 -77569 217655
17516 -110790 262859 -111725 -198219 83566 22601 85275 -66065 211673 273658 63166 235020
17505 235020 302738 440398 7276 -200147 -14911 202813 96743 82234 33296 236804 54025
17493 -32538 285678 -54702 -15159 -181095 167385 276088 351136 212075 42349 94491 -127416
17481 1778 -268674 127909 -162276 -131283 124385 66756 8100 265460 146835 239740 353706
17470C53706C1254K68905D9633L37458a79701Q6033L2971D2957J73920K67480
17460D84357G7319K32675g5803q7527B60682e879C49482F1476J72726J33835N4050
17449D22087H9399M23899j82582j52099N8463L3161J6031A05072J7975K27374
17439C50421A67456M92Q4877m8585M05J69860j47158P4026Q121A37983o6239L04653
17427C76397A55920o024F8875J12026A2603L22640A00296k3979J13988J44706
17417C35011I5184a906B67366C1813K86208j34002j0908d07864B05956j0505f6694
17405C95281B9117J09359J18133j3456o479Q2087a73386B45779a36633n4821A58511
17393C10684A25395K8107l0946K48421B8108J01985J4090f7417F5218K47250Q329
$$ plain form
17470 353706 31254 300159 49633 387091 -179701 -93668 -60697 42957 216877 484357
17460 484357 77319 309994 -75803 -163330 260682 -5879 349482 61476 234202 368037 422087
17449 422087 89399 513298 330716 178617 237080 270241 286272 105072 123047 350421
17439 350421 167456 167948 252825 204240 204645 374505 227347 301373 309494 137983 71744 376397
17427 376397 155920 149896 68875 180901 12603 335243 100296 76317 190305 335011
17417 335011 95184 -1906 267366 31813 318021 184019 173111 -407864 205956 195451 -66694
17405 395281 29117 138476 256609 243153 236674 318761 -173386 245779 -136633 -191454 158511
17393 310684 125395 153502 122556 370977 28108 130093 144183 -67417 65218 312468 320797
17382C20797G7078k167j0552J62819a10279C25661A26353f2146G2687K4072C5474
17370A6386J24880J70228a24637M6567B83618q6722F6289K2956j0729K03610j3994
17359B68132d2195B15759a93773R5004C45515a50400d8422A55677P2311o0678
17349A67310B493K4495J71216H0763J92029A14269D7519f7815B21892r3222F0672
17337A05844b7956A09582b1614m3096j6293l0564A48424d3649C52578j68300K0534
17326B04812o1792b2310C31119j19193C0056J87290B1708J77317I129J08488a4434
17314d6942E4331f161j04544C18345A9264h7436D8534K16662I8041M5840b2689
17302D08997j91880K2636I8379J38142r0423l4796E3245O6692K57627m0449A25485
$$ plain form
17382 320797 77078 74911 64359 227178 -110279 325661 126353 -62146 72687 96759 35474
17370 16386 141266 311494 -124637 -78070 283618 196896 66289 89245 78516 282126 268132
17359 268132 -42195 215759 -193773 -98769 345515 -150400 -48422 155677 227988 167310
17349 167310 2493 26988 198204 80763 272792 114269 47519 -67815 221892 128670 60672
17337 105844 -27956 109582 -21614 -64710 -81003 -111567 148424 -43649 352578 184278 204812
17326 204812 143020 -22310 331119 211926 30056 217346 21708 199025 9129 117617 -14434
17314 -46942 54331 -6161 -110705 318345 19264 -87436 48534 265196 98041 143881 -22689
17302 408997 217117 239753 98379 236521 146098 111302 53245 119937 377564 337115 125485
17290D36896j45927b6263B09217J99302j81140n6563J43199J357l4246D9124J94191
17279B43315M2082P05P7703b79090A57690B8064L44486b4352I3371A3866n754
17268H112J14568g884B26601P4859I3330K56188a97980B69421A24093K54541a3496
17256D66722B07624R1321A24229J94993j17437n7287L8741c33204E28796B07367
17245B68477c00890E360L95481E1693K4976b49698A38389e2370A46387a5821C47414
17233B10160L76135j08656a12987b1642C33464A18569O6322G8160J91071j32450
17223A36781K30242A24641J87718O4671K5740G0361J6290O8572n0425K81323R8578
17212D84699a61354C34806e954C18954A29046o2337K27500A28980a8306o9037
$$ plain form
17290 436896 290969 -26263 209217 408519 227379 170816 314015 315372 281126 49124 243315
17279 243315 285397 286102 363805 -279090 157690 28064 372550 -24352 93371 13866 8112
17268 8112 122680 -7884 226601 301460 93330 349518 -197980 269421 124093 378634 -13496
17256 466722 207624 298945 124229 319222 201785 144498 183239 -333204 528796 207367
17245 268477 -300890 5360 400841 51693 76669 -249698 138389 -52370 146387 -15821 347414
17233 210160 586295 477639 -112987 -21642 333464 118569 184891 78160 269231 136781
17223 136781 367023 124641 312359 377030 402770 70361 86651 155223 104798 386121 484699
17212 484699 -161354 334806 -5954 318954 129046 66709 294209 128980 -18306 -87343
17202h7343B20150l7699P2704M3652I6497L2341C3164K15180K2140a2712D46652
17190C93569Q8668A10994L86504E7598O8499A561K01239G9316L65399k17704J3291
17179B40302j01385k7095J13241J42645A20196L8205K03105e9959C16423A26173
17168A72198O7773C9720J82975J0613J32527m8853J85399G7965N98517F8174c7132
17156B38757J56735j8786J13519A8604K76988K66870j96337q5320P2548J40635
17146D93988a35472A53737M6543O319Q7687p3844m6979O7451r2736L84117j24286
17135D08009L635F8564J87214J61317A91914C3909K17335p9231k2242O4086C8601
17123B72407R1576A64337J94150O5842O02524C16886K40036A09965K57798J08916
$$ plain form
17202 -87343 220150 182451 255155 298807 96497 128838 33164 248344 270484 -12712 446652
17190 393569 482237 110994 497498 57598 126097 1561 202800 79316 444715 227011 240302
17179 240302 138917 111822 225063 367708 120196 158401 361506 -59959 316423 126173
17168 172198 239971 39720 222695 233308 365835 316982 502381 77965 676482 68174 -37132
17156 238757 395492 376706 490225 18604 295592 562462 366125 280805 353353 493988
17146 493988 -135472 153737 200280 206599 294286 220442 173463 240914 148178 532295 408009
17135 408009 411644 68564 255778 417095 191914 33909 251244 172013 149771 213857 38601
17123 272407 363983 164337 358487 424329 1026853 316886 556922 109965 367763 476679
17113D76679k04619J93720B00629J88661k0472q8194p8820K89790B05105r5005
17103A10100J67256J67402j17386N3793o3569C0899L71056J44415A96880K35318
17093D32198A14863K65463J2006n6749H8997J76905N0885N0608K43142k62494
17083C48043R9586j18521j5746Q304l9106J70068j38211A53273P0821M07744B67112
17071C26763J35495O1430j27908K05007B9350K28294J67099K2198O611o6156J22255
17060E09651j88531J26562j90386L41820k39928P636A80310M78971H8539N54818
17050F43357j44514o5989L73589k98018B23409O34707B80161J10536O2922j09025
17040C44594K93749A72243M05459j98283K79594l6598k66537N2477L95305C50627
$$ plain form
17113 476679 272060 465780 200629 389290 368818 280624 201804 491594 205105 110100
17103 110100 277356 444758 327372 381165 317596 30899 401955 546370 196880 432198
17093 432198 114863 380326 392332 335583 88997 265902 316787 367395 610537 348043
17083 348043 447629 329108 313362 321666 282560 452628 314417 153273 224094 631838 267112
17071 326763 462258 523688 395780 600787 29350 257644 424743 446941 453552 387396 509651
17060 509651 321120 447682 257296 599116 359188 366824 180310 659281 88539 643357
17050 643357 498843 432854 806443 508425 223409 858116 280161 390697 453619 344594
17040 344594 638343 172243 577702 379419 659013 622415 355878 408355 803660 350627
17029B79482L22685J34563q8673j02312k12797R5442K03736j50386k31701P1692
17019C21731K44444k42093J85688l2401L16034r1478K11152m31496M15977K5997
17009I23555m50036J50400r8526K93874k62043J38549k93709r9866O60308D74744
16998F19645j55740J69241o8182j45889J02641O6626j4044k49316J63289K21521
16988G09792j58959K91533J05895r4060k13328k4110N1315j11285L02630P5322
16978I34745k31827K02807n6218J43777j94635L05910n300l4971j45931j11537
16968H06820k15383M99213n8675j65995j37202J93340m05704J8851M26905p9701
16958H82469L0471l1307r8201P9877K33589l51904L82378L6866E59753L03019
$$ plain form
17029 279482 602167 736730 648057 545745 332948 428390 632126 481740 250039 321731
17019 321731 566175 324082 509770 477369 793403 701925 913077 481581 897558 923555
17009 923555 473519 623919 525393 819267 557224 695773 402064 302198 962506 474744
16998 619645 463905 633146 564964 419075 521716 588342 574298 324982 488271 709792
16988 709792 550833 842366 948261 854201 640873 616763 668078 556793 859423 934745
16978 934745 702918 905725 849507 993284 798649 1104559 1099259 1064288 918357 806820
16968 806820 591437 1090650 1031975 865980 728778 922118 516414 535265 962170 882469
16958 882469 912940 881633 783432 863309 1096898 744994 1127372 1164238 559753 862772
16948H62772J88967J25794r2670k30786N4966j18368K91542j94040M9224p8691
16938H58710R9156p6126M42000j04906j14495j65170K65321Q6200l23907J12981
16928A079764m9155J6058L77460m08749J43966J52384N8160j27961j33899K78486
16918A386514k1150j2897O5425l86827M48574j09593j84938N61034n30123J30234
16908A346253j92685M54645j90549j74116M28324n03718K25988K50688l94941
16899A249889K10378K93670j55033k21827P8531J23212k4869N0270M7178J25172
16889A776571j90085K6394J51611P6554k7878J01931j10878k8506K13366m9953
16879A939127r7761L84332j45115j73604K41469l72078J05430M47248J16920j85945
$$ plain form
16948 862772 1051739 1177533 1084863 854077 909043 790675 1082217 888177 937401 858710
16938 858710 957866 881740 1323740 1218834 1104339 939169 1204490 1290690 966783 1079764
16928 1079764 1030609 1046667 1424127 1015378 1159344 1311728 1369888 1241927 1108028 1386514
16918 1386514 1365364 1352467 1417892 1031065 1479639 1370046 1185108 1746142 1216019 1346253
16908 1346253 1153568 1608213 1417664 1243548 1671872 1168154 1394142 1644830 1249889
16899 1249889 1460267 1753937 1598904 1377077 1455608 1578820 1553951 1604221 1651399 1776571
16889 1776571 1586486 1612880 1764491 1841045 1813167 1915098 1804220 1775714 1989080 1939127
16879 1939127 1841366 2225698 2080583 1906979 2148448 1776370 1881800 2329048 2445968 2260023
16869B260023k21464L85881k07186R6676k42229K9976L43354R3357j65153K59120
16859B632355j94873K52040r0918L26855n19207N31927k59223K30915N3811j91519
16849B772163K4291j23395L65939n0330L8157l1415l11208O07915Q7258j7374
16839C362001k76691J69808N21891k38666O649K12137j02772K31574n60885M57616
16829C782662J87233l68794N08083R3374M2513j88645N32567o6810O0253l4312
16819D548124m3291q7223M15102M5315K32735R0881l22469K86611K35360L70671
16809E771816r4307K29082R7343o5789p6710r1573N53842L37508J14748N8113
16799F834073o1450K96756k47926N08797K50920K14248k26569Q30382J58121j84487
$$ plain form
16869 2260023 2038559 2424440 2217254 2313930 2071701 2101677 2445031 2538388 2373235 2632355
16859 2632355 2437482 2689522 2598604 2925459 2406252 2938179 2678956 2909871 2963682 2772163
16849 2772163 2796454 2673059 3038998 2988668 3026825 2995410 2684202 3292117 3379375 3362001
16839 3362001 3085310 3255118 3777009 3538343 3544992 3757129 3654357 3885931 3325046 3782662
16829 3782662 3969895 3601101 4109184 4202558 4245071 4056426 4588993 4522183 4582436 4548124
16819 4548124 4504833 4417610 4832712 4878027 5110762 5201643 4879174 5165785 5401145 5771816
16809 5771816 5677509 5906591 6003934 5938145 5861435 5769862 6323704 6661212 6775960 6834073
16799 6834073 6772623 7069379 6821453 7330250 7581170 7795418 7568849 8399231 8557352 8372865
16789H372865N52994L2667N15503M59742L0292J78900M19871n830K87950N05578
16779A1350532K95731L14864L49878M25126O43019J64672Q86450j29284P06635
16770A5007623J82669J106649q3856P37937Q92057Q04418O94406O08104O29317
16761B0579324Q56890R42125P30748J028135J170188J546394P10603J112828J327436
16752C0004671J755441J061634J530102K077144J349467K508584J869354K339039
16744D4495436K120372K477732L158640K656388L280479L306363M200707L622481
16736F9318598M329017M688507N124108N119147N894116O032335O198062O913567
16728A13617457P155660P054006P663798Q017329P427137P623732P015257O356195
$$ plain form
16789 8372865 8925859 8958526 9474029 9933771 9964063 10142963 10562834 10557004 10844954 11350532
16779 11350532 11646263 11961127 12311005 12736131 13379150 13543822 14430272 14300988 15007623
16770 15007623 15190292 16296941 16213085 16951022 17843079 18647497 19341903 19950007 20579324
16761 20579324 21436214 22378339 23109087 24137222 25307410 26853804 27564407 28677235 30004671
16752 30004671 31760112 32821746 34351848 36428992 37778459 40287043 42156397 44495436
16744 44495436 46615808 49093540 52252180 54908568 58189047 61495410 65696117 69318598
16736 69318598 73647615 78336122 83460230 88579377 94473493 100505828 106703890 113617457
16728 113617457 120773117 127827123 135490921 143508250 150935387 158559119 165574376 171930571
16720A71930571N664198M776738L531716K290201O82245n02807k371315l432698
16712A82568849m570708n702172o195206p365952p377520p975509p297313q262040
16704A27822429p543857p073283p325891o489417o388966o109295n559073m931015
16696G6401632m902344m500760m020284m006416l487028k821356l299596l173240
16688D6190608k345712k453575k139278j778649k008371j437148k213621j284933
16680C0529321j637351j157916j250166j155301j397516j123539o43465j178533
16672B0985534p57980j082487p20051l73839p29332q81233n87136l04472n71842
16663A4977162o19806p27836k15936l56058n28924l77787m31371o62727r7259
$$ plain form
16720 171930571 177594769 182371507 185903223 188193424 188875669 188372862 186001547 182568849
16712 182568849 177998141 172295969 166100763 158734811 151357291 143381782 136084469 127822429
16704 127822429 120278572 113205289 105879398 99389981 93001015 86891720 81332647 76401632
16696 76401632 71499288 66998528 62978244 58971828 55484800 52663444 49363848 46190608
16688 46190608 43844896 41391321 39252043 37473394 35465023 34027875 31814254 30529321
16680 30529321 28891970 27734054 26483888 25328587 23931071 22807532 22164067 20985534
16672 20985534 20227554 19145067 18425016 18051177 17321845 16440612 15853476 15549004 14977162
16663 14977162 14357356 13629520 13413584 13057526 12528602 12150815 11719444 11056717 10959458
16654A0959458o24284j40810r2623o06510p1698l33984k50969l51233j5645m18600
16644H053102l48980p5697q4181l66196l43134l91881N61646m72491j79296J07442
16634F460334j65960j40546n73900K49597k05330n27710J05734k78692L44435
16625E267962l02603l10621K9721L7610n17689K68388j39409k13799M9668j10881
16615D058347n04544L72409n78888L85482j45663r1025n7633J3175l28402J57780
16605C281038j47701l3006J19554l42435J86068k63679j9800k3513k32374J08332
16595B632484K55551k79681q3976j69269j14666j65179M15036j73145p0524j7125
16585B229506o6747r4407K46641l2970k29802q8381M9207N2313k03023J51247
$$ plain form
16654 10959458 10335174 10194364 10101741 9495231 9423533 9089549 8838580 8487347 8471702 8053102
16644 8053102 7704122 7628425 7544244 7178048 6834914 6443033 7004679 6532188 6352892 6460334
16634 6460334 6294374 6153828 5579928 5829525 5624195 5096485 5202219 4923527 5267962
16625 5267962 4965359 4654738 4684459 4722069 4204380 4472768 4333359 4119560 4169228 4058347
16615 4058347 3553803 3926212 3347324 3732806 3587143 3496118 3438485 3451660 3123258 3281038
16605 3281038 3133337 3100331 3219885 2877450 3063518 2799839 2780039 2756526 2524152 2632484
16595 2632484 2888035 2608354 2524378 2355109 2240443 2075264 2490300 2317155 2246631 2229506
16585 2229506 2162759 2068352 2314993 2282023 2052221 1963840 2013047 2065360 1862337 2013584
16575B013584M1444j41294j41252r7438K12992p0788K4551o69745M68625J14427
16565A755106m24073o825M69089n7010k63022k11612J36224j52562J16576K51868
16555A613759j85096J73719k68243K3253j53555J65641k85423J81894J31933l2634
16545A365248l52814J47721O0064J28106q2867R1080P841j20408P6967k49658
16535A071280J31074l02029K92796O4513j67255p0629K68085k27615K5648p6571
16525A009297M0773j56k09158r3421L89369k62023J32143K90035m22041J85224
16515A060042M9572J92834n22958O152M49672l54328l28175K08199J70089k66515
16505F64584K16205R2381J190l74873j61019M14354m8198j29269J87369j36423
$$ plain form
16575 2013584 2055028 1913734 1772482 1675044 1888036 1817248 1841799 1172054 1640679 1755106
16565 1755106 1331033 1324208 1793297 1736287 1473265 1261653 1397877 1245315 1361891 1613759
16555 1613759 1428663 1602382 1334139 1357392 1203837 1369478 1084055 1265949 1397882 1365248
16545 1365248 1012434 1160155 1220219 1348325 1265458 1356538 1364379 1243971 1320938 1071280
16535 1071280 1202354 900325 1193121 1257634 1090379 1019750 1287835 1060220 1085868 1009297
16525 1009297 1050070 1049914 840756 747335 1136704 874681 1006824 1296859 874818 1060042
16515 1060042 1109614 1302448 779490 785642 1235314 880986 552811 761010 931099 664584
16505 664584 880789 973170 974360 599487 438468 852822 804624 675355 862724 726301
16495G26301n7218M3953j00719P1483J28688j25653j8703L97096k03644N906O0270
16484I27760q0523k60288j35776J34829o5661J24191L296k72061K0330L10868
16474G06965j06474j68376K98055m7102p5076q1156P0331N8021R4584C12380R4222
16463D06602K18297j75449j01360N28767m04974J80863k53517j50227J44205j18932
16453B74275K0536J70216B11488L80929B70230L47944K1416B02863M74525k47509
16443D29879G8399J74968O8426j24870n9648L84288J24967l0183j71173P9146
16433E24320k49777J06820L5565L1259P9853k38155J44582O5113k41852n1515
16423B06213R5277A26689C4079J49801L20808j92488J81743Q9403k60068J45807
$$ plain form
16495 726301 669083 713036 612317 683800 812488 686835 668132 1065228 861584 867490 927760
16484 927760 847237 586949 451173 586002 520341 644532 647828 375767 396097 706965
16474 706965 600491 432115 730170 683068 607992 526836 597167 655188 749772 312380 406602
16463 406602 624899 449450 348090 876857 471883 652746 399229 249002 393207 274275
16453 274275 294811 465027 211488 592417 270230 618174 639590 202863 677388 429879
16443 429879 78399 253367 321793 196923 137275 521563 646530 616347 445174 524320
16433 524320 274543 381363 416928 448187 528040 289885 434467 499580 257728 206213
16423 206213 301490 126689 34079 183880 504688 312200 493943 583346 323278 469085
16413D69085k21079L35989j97949K657g843C53329p417J1216A42475K6971N2740
16402B22186q1018Q9272N2245H5097L71364A24393k3693M7490O35592B92701J32812
16391D25513j55921J99382J18333j16591j76867A45208P9755J44840k4394p1923
16381B73486J4229j09900Q600K00069K95806C32058o4015k6145J59050A66494
16370C75347G0403j2724e3533C63344I0803R9883b4769A55618J79877A54285J912
16359A56197K77570A18704M01586B00431K2631o9979F0678P7918J32170c5680
16348B36607R4182p4429d4583C23050n6244n7635J95444j6110j71245J36133r1616
16337B61777A1917a41309A01755J9142a36479d6424B67416E0570K92998a37339
$$ plain form
16413 469085 248006 583995 386046 388703 -7843 353329 345912 357128 142475 169446 222186
16402 222186 141168 230440 282685 85097 456461 124393 100700 148190 783782 292701 425513
16391 425513 269592 468974 587307 470716 293849 145208 224963 369803 345409 273486
16381 273486 287715 177815 186415 386484 682290 332058 268043 241898 400948 166494
16370 375347 70403 57679 -53533 363344 90803 190686 -24769 155618 335495 154285 156197
16359 156197 433767 118704 520290 200431 223062 153083 60678 138596 270766 -35680
16348 236607 330789 256360 -44583 323050 266806 209171 404615 388505 217260 353393 261777
16337 261777 11917 -141309 101755 120897 -136479 -46424 267416 50570 343568 -137339
16326F8587K06401r51a2258C07284M9751A78118m4343J3465c4830A83449d9953
16314a7859j97336B0661J02198e8449B22519B7391L4459a73287C212L06024F4284
16302a6523B02396J02530C2079h4750A84994K3947a27609c5362A9877h8469C15074
16290G0258J04768a8621A67881K7743b23501B16503a03664A67943h2420A97862
16279a47442H4044L15693A55630p0769P32552D0988b18500A48968M542B8821L36242
16268C65063i313D66444j96333A25347e3331D3050J97174L8968d6694A00729a0505
16256B77686j08032K70798b1324A69434c02235A82075i3586A27328L642R7775
16246B28745k2817a6211m7068B88731a46496b5476C99673A72975J64839a47948
$$ plain form
16326 68587 274988 274037 -12258 307284 357035 178118 133775 147240 -34830 183449 -49953
16314 -17859 -215195 20661 122859 -58449 222519 27391 61850 -173287 3212 309236 64284
16302 -16523 202396 304926 32079 -84750 184994 208941 -127609 -35362 19877 -88469 315074
16290 70258 175026 -18621 167881 195624 -223501 216503 -103664 167943 -82420 197862
16279 -147442 84044 399737 155630 84861 817413 40988 -218500 148968 153510 28821 365063
16268 365063 -9313 466444 270111 125347 -53331 43050 240224 279192 -46694 100729 -10505
16256 277686 169654 440452 -21324 169434 -302235 182075 -93586 127328 130970 228745
16246 228745 205928 -16211 -63279 288731 -146496 -25476 399673 172975 337814 -147948
16235A18991K54534A36764E1677L1621N1402a5740F3965M0379J70443a86346B79268
16223B08321a34791B22549b8280A13899L11419b25237N3808A91961D005a1784
16212B91219n8997F8103O3224M1719a60696j55257D2673L71728A47961c7302G8455
16200h8712G8471L1299L05799a74523G3496J00256a11752B02699q3601h7686B9894
16188G7510a30029L495A16154C9686O2876D4878J64831a2088B42908I4831d9346
16176F7299d6385e176B55102g2397I8899M415l3378a12342k0099b3232D52255
16164C91197b24217A80779a61597N9938B03961k1223a65847m8793h281E6474e9379
16152A21864c00253D5150e7518l0031j9108K5490E8661a58916e0298C21455g2992
$$ plain form
16235 118991 373525 136764 51677 83298 134700 -15740 63965 104344 274787 -186346 279268
16223 208321 -134791 222549 -28280 113899 425318 -225237 -171429 191961 4005 -11784
16212 291219 232222 68103 131327 173046 -160696 -315953 42673 414401 147961 -37302 78455
16200 -88712 78471 109770 415569 -174523 73496 173752 -111752 202699 119098 -87686 29894
16188 77510 -130029 -126534 116154 39686 102562 44878 209709 -12088 242908 94831 -49346
16176 67299 -46385 -5176 255102 -72397 98899 103314 69936 -112342 -132441 -23232 452255
16164 391197 -224217 180779 -161597 -101659 203961 182738 -165847 -214640 -8281 56474 -59379
16152 121864 -300253 45150 -57518 -87549 -106657 -81167 58661 -158916 -50298 321455 -72992
16140a37794B7596P4136P5616D2982J87516R4497j16016J95997a41937c8535o1860
16129a00395d9583A52394a43960B44604f3757G0854L5236C5078A5855Q1657J30425
16118B27937a46005j21485a21196A9777J59629f0947B85977d699C3997g8836I3268
16106c08046g3270G9731K42818a28215A4986g9904N112A75375h8232a6194k09761
16095b25955C8014K33446A13569c4268n2072B6201b2539A19252B3410J04204g6688
16083a02508q8195A3747L1950j4625b751A05431i4008C6315b70756H5449d62904
16071a56983E7075J65803f9014k3772A10286m6577L5709k034a30942l8605G2575
16059a42373q3254B65433A0830i6141D0253h9646B13112A6423K23368b1542I7296
$$ plain form
16140 -137794 27596 101732 177348 42982 230498 324995 208979 404976 -141937 -38535 -100395
16129 -100395 -49583 152394 -143960 244604 -63757 70854 106090 35078 15855 97512 227937
16118 227937 -146005 -267490 -121196 19777 179406 -60947 285977 -4699 33997 -78836 93268
16106 -308046 -73270 79731 322549 -128215 14986 -79904 -74792 175375 -88232 -16194 -225955
16095 -225955 38014 271460 113569 -34268 -86340 26201 -22539 119252 23410 127614 -76688
16083 -102508 -190703 13747 45697 31072 -2751 105431 -94008 36315 -270756 85449 -462904
16071 -156983 57075 222878 -69014 -92786 110286 63709 99418 97384 -130942 -169547 72575
16059 -142373 -225627 265433 10830 -96141 40253 -89646 213112 16423 239791 -21542 97296
16047C16892g2949A3838a82092n2534M7378j31526F1323b14043B30268i1428E6289
16035e6308L395D8757b28671I8669a47073B76172E8125a00747j7558P147G9173
16023a96004b6707A3874J26491F6090b93416h9779O739n364A37985A8611J4937
16012C3548c3530E2591b5419j73675C4475J88801d8448o2882E8335a15819b4315
16000h7232K4183k8712Q659C5796i6274j4599l64879E4219O1879K7941P4934B9767
15987a27229j72044c0673F5755c8128f236B41609J91508d7015C24259I9912O7100
15976A67012F0521B1910H100b20525j76438J22603e2266B77031H0402b63617A04480
15964B40532b75955A30304a47564A25149D0443K69707b16023K7372A53879a55766
$$ plain form
16047 316892 -72949 13838 -182092 -234626 -187248 -318774 61323 -214043 230268 -91428 56289
16035 -56308 -52913 48757 -228671 98669 -147073 276172 58125 -100747 -118305 -111158 79173
16023 -196004 -26707 13874 140365 66090 -293416 -89779 -83040 -88404 137985 18611 33548
16012 33548 -33530 52591 -25419 -199094 34475 223276 -48448 -111330 58335 -115819 -24315
16000 -87232 -63049 -91761 -83102 35796 -96274 -110873 -475752 54219 116098 144039 218973 29767
15987 -127229 -299273 -30673 65755 -38128 -6236 241609 433117 -47015 324259 99912 167012
15976 167012 60521 21910 8100 -220525 -396963 -274360 -52266 277031 80402 -263617 104480
15964 240532 -275955 130304 -147564 125149 40443 310150 -216023 -188651 153879 -155766
15953D3383b50323P9374N6576G6318e3344j25379i697j60884L2361k6661C8184
15941B21233c5657o2490n3341q1358a03886A46779b27193j4040D87265A03801
15930a89794A31885D4983c75215J75460A65552k8041a4105j27349j9212B9319
15919i6395B2246K5690a93250J5984A6833N7313M4201c28206O5996B50967f2980
15907d5312j94051E8007b7879j72542Q9108H9038h2281I1494h8911c8855A41117
15895d30918B33525a85060A34274b55654f8875l26573L4196a54842m3752I0578
15884c6423B28375i4695G8047A4228J15161n3298N4372b96455B83784c48673P6827
15873b71846A3858b60418A39220b26957A47594a97377O1357j00422H6790d1796
$$ plain form
15953 43383 -250323 -170949 -114373 76318 -53344 -178723 -9697 -170581 -138220 -164881 38184
15941 221233 -35657 -98147 -151488 -232846 -103886 146779 -227193 -241233 487265 103801
15930 -189794 131885 44983 -375215 -199755 165552 137511 -14105 -141454 -160666 29319
15919 -96395 22246 47936 -193250 -177266 16833 74146 118347 -328206 -262210 250967 -62980
15907 -45312 -239363 58007 -27879 -200421 -111313 89038 -82281 91494 -88911 -38855 141117
15895 -430918 233525 -185060 134274 -255654 -68875 -395448 -361252 -154842 -198594 90578
15884 -36423 228375 -94695 78047 14228 129389 76091 130463 -296455 283784 -348673 -271846
15873 -271846 13858 -260418 139220 -226957 147594 -197377 -136020 -236442 86790 -41796
15862d53405a6036A8565Q5634A1399g0076B5184a60555l6385A27523b49062B99491
15850A41646a93375n3255A09062D8777a96214q6432H5298a57030b0525B5207L62955
15839C88162a6167b056l1301m5079C8989O8300a9637F8424J06908g3589j14905
15828a88494A34509g7567m3283j28344A95488a92068q8241B46596q3680c9587
15817a81520J3324k82932a13825h209B0107b22135A54131b71967e6085a4437k35164
15806b49601B25212a87098F7057J1555a60234A10525f4556A18432b51751A43117
15795f6144n9941A64229m4625L01390A66886m1214J17026f4619A20792A8360e9071
15783A58714c5603g109j77649q2568a2198A61482n7204a62541M3588E6002h1354
$$ plain form
15862 -453405 -16036 18565 104199 11399 -70076 25184 -160555 -196940 127523 -249062 299491
15850 141646 -193375 -246630 109062 48777 -196214 -282646 85298 -157030 -20525 25207 388162
15839 388162 -16167 -2056 -33357 -78436 38989 107289 -19637 68424 175332 -73589 -188494
15828 -188494 134509 -77567 -120850 -249194 195488 -192068 -280309 246596 162916 -39587
15817 -181520 -168196 -451128 -113825 -8209 20107 -222135 154131 -271967 -56085 -14437 -249601
15806 -249601 225212 -187098 67057 78612 -160234 110525 -64556 118432 -251751 143117
15795 -66144 -126085 164229 119604 420994 166886 125672 242698 -64619 120792 18360 -59071
15783 158714 -35603 -7109 -184758 -267326 -12198 161482 104278 -162541 -118953 56002 -81354
15771G4110a32584M1943H2440O0646d630j66384I4299a96933b556A94289N6031
15760B50320b61144E4352b47430H4272b0418K907F5698P9552e9287q8911A8693
15748d79419A1071c63470b2830E2510K0552J59668D8002a64080j57808M2845H945
15736A04757a04438H4006B8518J27839k8881c91018A03768a32369N3919i200A2660
15724b13901N6434A60384a90355d3083j38751B26030D6502a53239K6704N2540
15714g3995A28323a72694B65811B2651d38795I462a27852A90382G1897a76257
15703a86319P5420I6355J87049f7616k93167b5841B13121a16546A08367d8164
15692B4768e7275o2466A0388L10118E4336f5910j64609c0366p2896B4657a24878
$$ plain form
15771 74110 -132584 -90641 82440 143086 -4630 -171014 94299 -196933 -2556 194289 250320
15760 250320 -261144 54352 -247430 84272 -20418 -17511 65698 145250 -59287 -148198 18693
15748 -479419 11071 -363470 -22830 52510 73062 232730 48002 -164080 -321888 -279043 8945
15736 104757 -104438 84006 28518 156357 127476 -391018 103768 -132369 -78450 -9200 12660
15724 -213901 -157467 160384 -190355 -43083 -181834 226030 46502 -153239 -126535 -73995
15714 -73995 128323 -172694 265811 22651 -438795 9462 -127852 190382 71897 -176257
15703 -186319 -110899 96355 283404 -67616 -360783 -25841 213121 -116546 108367 -48164
15692 24768 -57275 -119741 10388 320506 54336 -65910 -230519 -30366 -103262 24657 -124878
15680F4794a41998j01646C4681c0663C8560c128j2389m12693G7472a55855B25605
15668B10449K81430A78255m7479a35617O3272A33906J44103b11326j73324A8078
15657B91772f7269m6334j77971i9659j51355B73881a32407B8366b87508A30692
15646B39427c9633k29951B2292d4479A32159D8673R9710J15072O3327i3648b5543
15634a8513k00564R0146A30569B7238b96568a29032B43544c03157a23958L2885
15624i1073H8083a34116k29211j2956h7816A37115f9041A4523i3645C06803h1323
15612A04733b27294j42741B04846n0842B7598a06651n7951C0712Q133b22800m4532
15601b67332A2436J22467b63828d0219j43342C4710M8350j0230c300E1357P8159
$$ plain form
15680 64794 -141998 -243644 34681 -30663 38560 -3128 -15517 -428210 77472 -155855 225605
15668 210449 491879 178255 130776 -135617 -72345 133906 278009 -211326 -384650 18078
15657 291772 -67269 -113603 -291574 -99659 -251014 273881 -132407 28366 -287508 130692
15646 239427 -39633 -269584 22292 -44479 132159 48673 148383 263455 326782 -93648 -25543
15634 -18513 -219077 -128931 130569 27238 -296568 -129032 243544 -303157 -123958 -91073
15624 -91073 88083 -134116 -363327 -376283 -87816 137115 -69041 14523 -93645 306803 -81323
15612 104733 -227294 -370035 204846 154004 27598 -106651 -164602 30712 38845 -222800 -267332
15601 -267332 12436 134903 -263828 -40219 -183561 34710 83060 72830 -3300 51357 129516
15590A29516b91772f2019k66058A42559b01400A21523a14566B08204F4031O9338
15580A33369D797h2742k01952A02129f9058j14922j4504c0809p6769d3359A12380
15568i6095B6920c59354a62082F1786J77210D6970J4205M4357a43334H0756O1098
15557A41854L06103b74439A24384C364a44278A97151b64327Q6026o570B02510
15546C4533g3088B8867a94278C31472n3071g729j0217B66161a46543H3382h2438
15534g5848j10912O0785D6293c16453A23200E5238I225f4988H4895a54315H7264
15522A36099f3282A01520l5865B7094J94785b40619B99787a5273k34279c6918
15511a31515A87939I0902b1847j16982A69399G6588J04688f3231I131a54698C6150
$$ plain form
15590 129516 -291772 -62019 -328077 142559 -201400 121523 -114566 208204 64031 133369
15580 133369 4797 -82742 -284694 102129 -69058 -183980 -198484 -30809 -107578 -43359 112380
15568 -96095 26920 -359354 -162082 61786 238996 46970 61175 105532 -143334 80756 141854
15557 141854 447957 -274439 124384 3364 -144278 197151 -264327 -178301 -184871 202510
15546 34533 -73088 28867 -194278 331472 278401 -7729 -17946 266161 -146543 83382 -82438
15534 -75848 -186760 -125975 46293 -316453 123200 55238 9225 -64988 84895 -154315 87264
15522 136099 -63282 101520 65655 27094 221879 -240619 299787 -15273 -249552 -36918
15511 -131515 187939 90902 -21847 -138829 169399 76588 181276 -63231 9131 -154698 36150
15499A2021i1626D2153j721i6230C84148a88610k6391l4197k51735I5590a96039
15487B01197a81947G1545A9140o077b10337A89766q9588d3105j3242j71996O5456
15476a62887A65765N6325d1344r7653I885J91136h730D9673Q0938L3990L15l0237
15464A34679E2671J30811d371j94483c5517B86667g9685F7339b50221F5067a28280
15452D6290A2225L58002B0419c96462a35608A94175M08608h6437E3903K62066
15442C15969o7139f0949H7362L1289c11796e4004B1344b96002P5497B08910a57099
15430B82749G4705b57571a11699m5219j22726C4081f1178A29264a43851A20378
15419H4115p079i0335j08455g5167E4089b8542n6284A32258j0463J10472n0596
$$ plain form
15499 12021 -91626 42153 40432 -96230 384148 -188610 -215001 -249198 -500933 95590 -196039
15487 201197 -181947 71545 19140 13063 -210337 189766 100178 -43105 -56347 -228343 -162887
15476 -162887 165765 222090 -41344 -138997 9885 201021 -8730 49673 130611 164601 164916 134679
15464 134679 52671 183482 -4371 -198854 -35517 286667 -79685 67339 -250221 65067 -128280
15452 46290 12225 370227 20419 -396462 -135608 194175 602783 -86437 53903 315969
15442 315969 248830 -60949 87362 118651 -311796 -54004 21344 -296002 -220505 208910 -157099
15430 282749 74705 -257571 -111699 -156918 -279644 34081 -61178 129264 -143851 120378
15419 84115 77036 -90335 -198790 -75167 54089 -28542 -84826 132258 121795 232267 181671
15408A81671k0937e2153H0987O1044a00679B7387A3641h568j08144B17086b33703
15396C37040A65034e283B42328A17949e723F9138L8066d0178j77480j17095B34490
15384i4871A56053f1673j32933G9766K17794e6287l6803A02529j4393r775b3647
15372a29284k20749A10359A4666e7945B61974d18684J42529C6800e4020G4220
15361B1708J4546f2116j37002B26386e6264k34430A75252b83873A70449a75955
15350A3772e574B9294a30912A1528a29935E5353a50965A0227J31572c05047C04817
15338F1514c9427B85345i4288j65983C54789j64702E6148f9670o376j0270D52393
15326a0173B50805l1897K13946j71116D7963e2034j3304A11271f4148m04940a17682
$$ plain form
15408 181671 160734 -52153 80987 142031 -100679 27387 13641 -8568 -116712 217086 -233703
15396 337040 165034 -5283 242328 117949 -5723 69138 107204 -40178 -217658 -334753 234490
15384 -94871 156053 -61673 -194606 79766 297560 -56287 -93090 102529 88136 78361 -23647
15372 -129284 -350033 110359 14666 -57945 261974 -418684 -276155 36800 -54020 74220
15361 21708 36254 -62116 -199118 226386 -56264 -290694 175252 -283873 170449 -175955
15350 13772 -5574 29294 -130912 11528 -129935 55353 -150965 10227 141799 -305047 304817
15338 61514 -39427 285345 -94288 -260271 354789 190087 56148 -69670 -76046 -86316 452393
15326 -10173 250805 218908 432854 261738 47963 -52034 -65338 111271 -64148 -469088 -117682
15314D224Q9544L5276Q3338o0520l7567a1663A06134L0699o4404b05342A57120
15302A39348J8842E9851i201A8512A96N5962i3684A4161M66J39870a80296A1650
15289D327a66968C81391C8345a46880E5206N7609J98031H6819K55440j48908a83816
15277d2306I0536a41972H6204M3460O2455b10951d504m8537A24914e637m03922
15266d09559f2222j10946a1067q1730A09741d29A20483K79442G2100c4473j3279
15255d7752B5367J86285d5380C19122r2252K1895J09833K08653J273366m03884
15245A436733o7242K77283D03334j90218J37802m2780A40971O8681G4302b1078
15234f2940H9156h9033D45647b35271B16072p8392L4225J8918b18506C6139M65402
$$ plain form
15314 4224 93768 129044 212382 151862 114295 -11663 106134 136833 72429 -205342 157120
15302 139348 158190 59851 -9201 18512 196 56158 -93684 14161 14627 154497 -180296 11650
15289 4327 -166968 381391 38345 -146880 55206 112815 310846 86819 342259 193351 -183816
15277 -42306 90536 -141972 86204 129664 192119 -210951 -4504 -53041 124914 -5637 -409559
15266 -409559 -62222 -173168 -11067 -92797 109741 -429 120483 399925 72100 -34473 -47752
15255 -47752 25367 211652 -45380 319122 226870 248765 358598 567251 1840617 1436733
15245 1436733 1369491 1646774 403334 213116 350918 308138 140971 209652 74302 -21078
15234 -62940 89156 -89033 445647 -235271 216072 137680 171905 190823 -218506 36139 501541
15223E01541D4887c7246j50025A16490h2628p1402A74803e1159p7080j01997h1042
15211A40924O2430a01025B10391M8927q3155b28396B89185A41539c3016C11621
15200A26465c9119k1789A05810J22576p880H389P1082a84517K7670A14877j8804
15189I6073b492p5919A72907M082J57228J2905E8196N0956O1735p2363Q4749g8880
15176D43449B8687J34313N5988n679a56744N3833B19912b55526h0894C19585o4339
15165B55246N7584m5248A4250N2998M8941a03321l3943j18986F9326K19272I8653
15153A13254n2291e1698H4372J8173N8646J13564a4712q7320C75739A61458f0946
15141B17502r5780B6924J74635E7569a06588C69463K61783d256E8849c31329B41448
$$ plain form
15223 501541 44887 -37246 -187271 116490 -82628 -154030 174803 -51159 -128239 -230236 -81042
15211 140924 203354 -101025 210391 259318 176163 -228396 289185 141539 -33016 311621
15200 126465 -39119 -60908 105810 228386 220506 8389 79471 -184517 -156847 114877 96073
15189 96073 -2492 -78411 172907 176989 334217 347122 58196 109152 170887 98524 183273 -78880
15176 443449 28687 163000 218988 213309 -156744 -102911 219912 -255526 -80894 319585 255246
15165 255246 312830 267582 14250 67248 116189 -103321 -137264 -256250 69326 288598 98653
15153 113254 60963 -51698 84372 102545 161191 274755 -14712 -102032 375739 161458 -60946
15141 217502 121722 26924 201559 57569 -106588 369463 631246 -4256 58849 -331329 241448
15129C9478K5646N1061K56445D8840J20713a35361B10780I5100Q7394K46295m0591
15118C88198A84294f7208A35739b2675A36494C5990L95844A16257g1758B8174
15107G4137J52264p3894d3549A76816J39287o6706a8722A78420h7363r0509D95654
15095C91281F3115K88134C6817J26577n6416J02301J66103b81613A89759J1195
15085B00954Q9389G6452K11481b8534J0915D57338K4565I8799k2953C5319J54179
15074A89498J94912A04120I919K20405J23153M1353G3900J54871K8701d0902H3844
15062A73710H4918J63918A22873f1956b7320n8651A34793a30599A36427J36137
15052B72564N0641A25959M8883E1600L11284g122B74414d9045G32707l65028q4146
$$ plain form
15129 39478 65124 116185 372630 48840 169553 -135361 210780 95100 182494 428789 388198
15118 388198 184294 -67208 135739 -22675 136494 35990 431834 116257 -71758 28174
15107 74137 226401 152507 -43549 176816 316103 249397 -18722 178420 -87363 -177872 495654
15095 391281 63115 351249 36817 163394 106978 209279 375382 -281613 189759 200954
15085 200954 290343 76452 287933 -28534 -17619 457338 481903 98799 75846 35319 189498
15074 189498 384410 104120 9919 230324 353477 394830 73900 228771 257472 -40902 83844
15062 173710 84918 248836 122873 -61956 -27320 -85971 134793 -130599 136427 272564
15052 272564 323205 125959 174842 51600 362884 -7122 274414 -49045 732707 367679 283533
15041B83533M2767b9110B24960k8179I3615i4913B26061g3572B53004J32021B0046
15029B52643j10938J56946r5338J81444j24558a93925B91123j25574p7116J72659
15019B61092E2100Q0049J18276o8500J23352j06206Q7346l8251r0299a22644B47654
15007C88531A81714J32924A4647N8558K16412J308g6576B73278K15380m5584j96455
14996B46619J78113M4329A13953K79975j41702J9319R2689j67646P4302a08109
14985C23454j44394e2663D66222A85641J1651K35530A20556M13262A75718N44454
14975G20172q273A58329q728Q3272g5475B64942N2541D5574h1102A77917E8543
14963c9673B01554J06845J06211A40658L19175A43739a41380A20199j596J87823
$$ plain form
15041 283533 326300 -29110 224960 196781 93615 -94913 226061 -73572 253004 385025 20046
15029 252643 141705 298651 203313 384757 260199 -193925 291123 165549 88433 261092
15019 261092 52100 132149 250425 181925 305277 199071 286417 248166 157867 -122644 247654
15007 388531 181714 314638 14647 73205 289617 290925 -76576 273278 488658 443074 246619
14996 246619 424732 469061 113953 393928 252226 271545 364234 196588 270890 -108109
14985 323454 179060 -52663 466222 185641 197292 432822 120556 533818 175718 720172
14975 720172 711899 158329 149601 232873 -75475 264942 317483 45574 -81102 177917 58543
14963 -39673 201554 308399 414610 140658 459833 143739 -141380 120199 118603 306426
14953C06426J17385j46334P7563d7210E74508A32079L13453j72179j09628P6537
14943B40262N7360J7010A51834K60090K33649B50282J9541M1219N6649a26400
14932C66149L33030A89628J63044p0121K20150B21660A08004J23064J20546q9521
14922B62093Qo5932O2307I8549K82173A60042B1693M01502j69468j18104J22434
14911B58057J80632j54968A14218K40414L62113h107E23001A24063L73336k07373
14901B90026k5022L24976b1248B68169J13266L08383B63072J65263k13620K22069
14891D36784j33884K38483A08036R6780g2477B44790M92315j67154j67106j83504
14881B19341M251J90985Q4547D7733K35826P0312K0970j36930J84775R7458B43729
$$ plain form
14953 306426 423811 277477 355040 -47210 574508 132079 445532 273353 163725 240262
14943 240262 297622 314632 151834 411924 645573 250282 269823 311042 367691 -126400
14932 366149 699179 189628 352672 282551 502701 221660 108004 231068 351614 262093
14922 262093 262101 196169 258476 98549 380722 160042 21693 423195 253727 135623 258057
14911 258057 438689 283721 114218 354632 716745 -8107 523001 124063 497399 290026
14901 290026 265004 589980 -21248 268169 381435 689818 263072 428335 214715 436784
14891 436784 302900 541383 108036 204816 -72477 244790 737105 569951 402845 219341
14881 219341 223592 414577 499124 47733 283559 353871 374841 237911 422686 520144 243729
14869G64490k53178j656J9484C9787N05555C0383M26116A84503L94359j95375
14859C83487K24723B44787L07284j04687A02449N66428k60483J76472A15677M17926
14849E33603A80902N51049k62845j46074k6160J30141J6928m7591L28110k51894
14839D72566J28321P6197B26944L21842n4396j51986k5494R0010r0293j7123J37404
14828D36908n0723J90828j94116O3723L47772l16313j92665J44930J65970k2303
14818E74011j08748K41480j66812J23551j97402J46392m2336q368r0014A78817
14807G80595B47695j8382L56330j45974A42055L67525N2079r9259j4020j42111
14797C06269m0725L78718B50603J15973R1275A96864J74824J03300j25758l3211
$$ plain form
14869 764490 511312 509656 529140 39787 545342 30383 456499 184503 578862 383487
14859 383487 608210 244787 552071 447384 102449 668877 408394 584866 115677 533603
14849 533603 180902 731951 469106 323032 296872 427013 443941 396350 724460 472566
14839 472566 600887 677084 226944 548786 494390 342404 316910 406920 316627 299504 436908
14828 436908 386185 577013 382897 446620 794392 478079 285414 430344 596314 574011
14818 574011 465263 706743 539931 663482 466080 612472 570136 561768 471754 178817
14807 780595 247695 229313 585643 439669 142055 509580 561659 462400 448380 306269
14797 306269 265544 644262 250603 366576 457851 196864 371688 474988 349230 316019
14787C16019K20793K04122j47497m1643j5046P5763k09009A90212K57073J5545
14777D62830r5252K94153B11361M03378Q6763B55515O44436l93363M70561D86427
14766H52507j96512j57250K30950l21167L6896J05332j03760L08175J38660D20985
14755D49251L01586l2762C38173N83176k80249l9967p4314A94199L93311j60013
14745D27497J85469P9313k80126N1276L00082k09499K35400k60399k6392L84144
14735H86765p8745j49828K866l1234J65939k18649J26798j5065k50971J95934
14725F33810P4006L1413R8452p9604J36157J15450j97111m9697J75906B72093
14714G62243J70986l72555J24662J09646l3463l08807K37128j32116K89052J66447
$$ plain form
14787 316019 536812 740934 593437 551794 536748 612511 403502 190212 447285 462830
14777 462830 367578 661731 211361 614739 701502 255515 899951 506588 977149 486427
14766 852507 655995 498745 729695 408528 445424 550756 446996 755171 893831 420985
14755 449251 750837 718075 338173 921349 641100 601133 526819 194199 587510 427497
14745 427497 612966 692279 412153 463429 763511 554012 789412 529013 502621 886765
14735 886765 808020 658192 661058 629824 795763 577114 703912 688847 437876 633810
14725 633810 707816 739229 837681 758077 894234 1009684 812573 762876 938782 272093
14714 762243 933229 560674 685336 794982 761519 452712 689840 557724 846776 1013223
14704A013223L3236k89651j55425M6449j5515K7594K34655k31508P9383n1299
14694F91142K75020J28682l72644L39970j44658k14632o6580L87694j00938l0149
14684H92907K080Q9921K2691j37926j39784M00739j25497j47121l54298Q17489
14674A321201l65656o0112k06503M36769m2720j06502J37106j12453k60210P931
14664G48851M28905j75328K399J24764N6690r520q1305j67230o5568K87222k53112
14653H96768j44714M03876m7541l90226L52228j32712N39191k49087j77522J60903
14643A211164K51201l42230M4829L396J63751J44448m07553J18752n5555k0204
14633A111999N8968K94372l00372K38077j32526m9680L56636j96109j6242n2870
$$ plain form
14704 1013223 1046459 756808 601383 647832 632317 659911 894566 663058 742441 691142
14694 691142 966162 1094844 722200 1062170 917512 702880 636300 1023994 923056 892907
14684 892907 894987 984908 1007599 869673 729889 1130628 1005131 858010 503712 1321201
14674 1321201 955545 895433 688930 1125699 1082979 976477 1113583 1001130 740920 748851
14664 748851 1177756 1002428 1004827 1129591 1186281 1176761 1095456 928226 862658 1149880 896768
14653 896768 752054 1155930 1108389 718163 1070391 937679 1476870 1227783 1050261 1211164
14643 1211164 1462365 1120135 1164964 1168360 1332111 1476559 1069006 1187758 1132203 1111999
14633 1111999 1170967 1465339 1164967 1403044 1270518 1220838 1577474 1381365 1365123 1312253
14623A312253j50436L30485O496l7463j89650K04721k08782K57976q6835m2647
14613A396118j30216K8201M66649l33031j44864K00519K39322j80319R86l6805
14603A506560R5958R9495j11003J76513j74469k27366K58691M80739m45860j18533
14593A540725R4044J35521j88687K61660j90679J58831p1963O7490j21061r718
14583A676163K81544j67608J84026j78484j10590N09510j46144j95644L619J21413
14573A977805K14840j09402j34339J42241J39477J57438N7169j06813o9675j06246
14563B162495M29875l94776L61729J51799K908k682K58191K8965N41098l77547
14553C162055K20692L42724L64704J194668J349203M018158Q953840J7655476
$$ plain form
14623 1312253 1161817 1492302 1498798 1461335 1271685 1476406 1267624 1525600 1438765 1396118
14613 1396118 1265902 1294103 1760752 1427721 1282857 1483376 1722698 1542379 1543365 1506560
14603 1506560 1602518 1702013 1591010 1767523 1593054 1365688 1624379 2105118 1659258 1540725
14593 1540725 1634769 1770290 1581603 1843263 1652584 1811415 1739452 1806942 1685881 1676163
14583 1676163 1957707 1790099 1974125 1795641 1685051 2194561 2048417 1852773 1856392 1977805
14573 1977805 2192645 2083243 1948904 2091145 2230622 2388060 2445229 2338416 2268741 2162495
14563 2162495 2592370 2197594 2559323 2711122 2714030 2711348 2969539 2998504 3539602 3162055
14553 3162055 3382747 3725471 4090175 5284843 6634046 10652204 19606044 37261520
14545C7261520Q73588A8683270p857325m831536k740456o33652n5640p43814J24173
14536A945020j79604J58468R572K39550l24538m7045J48072J36537J97969k92702
14526A991299L22406k95154N8986K92659K74539p8640j54028J01620R8341m9185
14516B562843K10135o70510J75309K36660L70854l33224O6213J88146l47549L55819
14506B814696O1177K10058k69666p6099K56162j83141j1253j7747J15539k18665
14496B681061L91785N6077L226j88407J03577k7657M42761n30400Q08059n14364
14486C225718P1200Q4297K81249n7181k22245K94181j18358K10759J9288J51760
14476C940668o5562l11547O6222J01655K06092J78957j49024j03896L82606j30037
$$ plain form
14545 37261520 38135108 18683270 10825945 5994409 3253953 2620301 2564661 1820847 1945020
14536 1945020 1765416 1923884 1933456 2173006 1848468 1801423 1949495 2086032 2284001 1991299
14526 1991299 2313705 2018551 2077537 2370196 2644735 2566095 2412067 2513687 2612028 2562843
14516 2562843 2772978 2102468 2277777 2514437 2885291 2552067 2618280 2806426 2458877 2814696
14506 2814696 2875873 3085931 2816265 2740166 2996328 2813187 2801934 2784187 2899726 2681061
14496 2681061 3072846 3128923 3132149 2943742 3047319 3019662 3462423 2932023 3740082 3225718
14486 3225718 3296918 3381215 3662464 3605283 3383038 3677219 3558861 3769620 3788908 3940668
14476 3940668 3875106 3563559 3629781 3731436 3937528 4116485 3967461 3863565 4246171 4116134
14466D116134q2189L91852q8582N1334P1229j19466k0407O19050J130j19017J4885
14455D835953k499M4777J26027L5090j52480J60424N96695n41151N67731n16299
14445E154268L02845n9688L8114J96542j53171J45011L42111K7878l44517K74561
14435E923954L85979j16965L5812o0700M19583o6679K10207k49522K20262N8287
14425F760218k96028L48793L90805R8954K58517j04868l8922M87558J00707J81987
14415H187721m49124L44900L86058j04784K5844l3436R6337L44684K00276L10507
14405I308983L42279J62123n98338K16564K87713K15327n905L73539J79127j03611
14395A0377801N75023q7273k7658K99320K57688R9874N18378Q4527O4307M32917
$$ plain form
14466 4116134 4033945 4425797 4337215 4388549 4459778 4340312 4319905 4938955 4940085 4821068 4835953
14455 4835953 4833454 4878231 5004258 5039348 4886868 5047292 5643987 5102836 5670567 5154268
14445 5154268 5457113 5397425 5435539 5632081 5478910 5623921 5966032 5993910 5649393 5923954
14435 5923954 6309933 6192968 6228780 6168080 6587663 6520984 6731191 6481669 6701931 6760218
14425 6760218 6464190 6812983 7203788 7302742 7561259 7456391 7417469 7905027 8005734 8187721
14415 8187721 7738597 8083497 8469555 8364771 8390615 8357179 8453516 8798200 8998476 9308983
14405 9308983 9651262 9813385 9215047 9431611 9719324 9934651 9928746 10302285 10481412 10377801
14395 10377801 10952824 10865551 10837893 11137213 11394901 11494775 12013153 12097680 12161987 12594904
14385A2594904L25294j91552L15743K29834L96409M79200n6178M87128j9554L49670
14375A4910898K77239M82636J12289K6449N74618N66612k433M59935K40065M52310
14365A8100618M07261L43378K54351M36101J27167O65079L14844Q22426J65075
14356B1636300O80947L83837N15140O40723K60746N92073Q40469O37030P80076
14347B6967341M93756P51952O30021N36818J087412Q24780P92504P23424P06593
14338C3514601Q79595J160128J079882J062695J071189R48119R71891J574201
14330D2262301J334258J407308J056968J957585J178839J204300K593633J194596
14322E4189788J958432K333070J956377J788419K465785K397723K338217K502238
$$ plain form
14385 12594904 12920198 12728646 13044389 13274223 13670632 14149832 14093654 14580782 14561228 14910898
14375 14910898 15188137 15670773 15783062 15809511 16384129 16950741 16948308 17408243 17648308 18100618
14365 18100618 18507879 18851257 19105608 19541709 19668876 20333955 20648799 21471225 21636300
14356 21636300 22317247 22701084 23216224 23856947 24117693 24709766 25550235 26187265 26967341
14347 26967341 27461097 28213049 28843070 29379888 30467300 31292080 32084584 32808008 33514601
14338 33514601 34394196 35554324 36634206 37696901 38768090 39716209 40688100 42262301
14330 42262301 43596559 45003867 46060835 48018420 49197259 50401559 52995192 54189788
14322 54189788 56148220 58481290 60437667 62226086 64691871 67089594 69427811 71930049
14314G1930049K771213L075533K974034L048871L351177L475419L978672M126253
14306I8731221L905646M706892M702163M835004N105640N962226N776288O213939
14298A39939019O628880O908305P333019P993198Q143807Q236687R782654R689609
14290B04655178J0178359J0403407J1298730J1703637J1961767J2513571J2694227
14283B85408876J3186242J3385254J3130463J3751062J2738950J2883590J2066469
14276C76550906J1261659J0531998Q851141P152108L500865M00579j56921o41309
14268D17451026m257343k657319n592176o326273p683234q924007j0446512j2117989
14260C59446173j2955677j2897182j3425259j3777740j3849821j3982844j2631563
$$ plain form
14314 71930049 74701262 77776795 80750829 83799700 87150877 90626296 94604968 98731221
14306 98731221 102636867 107343759 112045922 116880926 121986566 127948792 133725080 139939019
14298 139939019 146567899 153476204 160809223 168802421 176946228 185182915 194965569 204655178
14290 204655178 214833537 225236944 236535674 248239311 260201078 272714649 285408876
14283 285408876 298595118 311980372 325110835 338861897 351600847 364484437 376550906
14276 376550906 387812565 398344563 407195704 414347812 417848677 418249256 418092335 417451026
14268 417451026 413193683 410536364 404944188 398617915 390934681 382010674 371564162 359446173
14260 359446173 346490496 333593314 320168055 306390315 292540494 278557650 265926087
14253B65926087j2649137j2637240j1626991j1620605j0601577j0393502r983928
14246A86413107q818823q563251p831547p518115p616350o565200o777560o008534
14238A26713727n505037m974815m979042m950180m884258m024115l857350l696387
14230H9842543l550137l364444l472379k707701l191674k915670k440920k736031
14222F5463587k151667k081690j785189k254881k195919j674546j736110j690222
14214D9893363j368827q70169j923765j455324j462497q87455j399559n23667
14206D0002100j121688j674855q77208r41600q38344r50545p81453r99939q67623
14197C0948845r09280r88146m95992m48565r23206n05034p41397r01345m69820
$$ plain form
14253 265926087 253276950 240639710 229012719 217392114 206790537 196397035 186413107
14246 186413107 177594284 169031033 161199486 153681371 146065021 139499821 132722261 126713727
14238 126713727 121208690 116233875 111254833 106304653 101420395 97396280 93538930 89842543
14230 89842543 86292406 82927962 79455583 76747882 73556208 70640538 68199618 65463587
14222 65463587 63311920 61230230 59445041 57190160 54994241 53319695 51583585 49893363
14214 49893363 48524536 47654367 45730602 44275278 42812781 41925326 40525767 40002100
14206 40002100 38880412 37205557 36328349 35386749 34548405 33597860 32816407 31816468 30948845
14197 30948845 30039565 29051419 28555427 28106862 27183656 26678622 25937225 25035880 24566060
14188B4566060o65514n42050l01404n82800o75099m89529l75625m98457k48013
14179B0187569j53283j001268l79207j62079p37364k16323k65622o69573K83188
14170A6886038o02401l56755m46807J2518l01011n68682j72307k85183l8150k71779
14160A3855481l73202m65059l32484J3061k49474j55891j17200j31042m01469
14151A1642721q087n57759J94545m03889k95460K6432k62473j36895l13102j77626
14141I708407j74530J74414m84601L01989n15311K64970k01747k17321j1199o34233
14131H210838K51552j97460j40699J49885m44897K81767n10581P9608K10812n53460
14121G337365J69653j61926K5722k60845j05116j86946l9092M2247m17568q3936
$$ plain form
14188 24566060 23900546 23358496 23057092 22474292 21799193 21309664 20934039 20435582 20187569
14179 20187569 20034286 19033018 18653811 18491732 17754368 17538045 17272423 16602850 16886038
14170 16886038 16283637 15926882 15480075 15492593 15191582 14622900 14450593 14165410 14127260 13855481
14160 13855481 13482279 13017220 12684736 12697797 12448323 12292432 12175232 12044190 11642721
14151 11642721 11634634 11076875 11271420 10867531 10572071 10598503 10336030 10199135 9886033 9708407
14141 9708407 9533877 9708291 9223690 9525679 9010368 9275338 9073591 8856270 8845071 8210838
14131 8210838 8462390 8264930 8124231 8274116 7829219 8110986 7600405 7680013 7890825 7337365
14121 7337365 7507018 7345092 7370814 7109969 7004853 6817907 6778815 6821062 6403494 6319558
14111F319558M2473o3608J35900j99797j17485J41593j06761L47381n88503j04194
14101E806557j32587J15674k26938J14602p0702k87706j26718J85622j54606j41811
14091E081387r1885j33962K63667j36776j08306L9719k6734k29959L2056j45683
14081D543524J76946k04604L34458k88408l18694K16610j47965l77123N23216
14072D457960l38573J429j32040k05442K71312k80231J98220l3487n8552J95902
14062D076498l69707L02470j04996p4772K47539j89390m21046j85459K02694j01101
14052C382730k92165L40569l97091J23028N99099o29976O447K87688l86823r8151
14042B935355J9837N1585J49394p9323k37723k3326k00410R0805J85303l63486
$$ plain form
14111 6319558 6362031 6298423 6434323 6234526 6117041 6258634 6151873 6499254 5910751 5806557
14101 5806557 5673970 5789644 5562706 5677308 5606606 5318900 5192182 5377804 5223198 5081387
14091 5081387 4989502 4855540 5119207 4982431 4874125 4913844 4887110 4657151 4689207 4543524
14081 4543524 4720470 4515866 4850324 4561916 4243222 4459832 4311867 3934744 4457960
14072 4457960 4119387 4120816 3988776 3783334 4054646 3774415 3972635 3939148 3880596 4076498
14062 4076498 3706791 4009261 3904265 3829493 4077032 3887642 3466596 3281137 3483831 3382730
14052 3382730 3090565 3431134 3034043 3157071 3756170 3126194 3132641 3420329 3033506 2935355
14042 2935355 2955192 3006777 3156171 3076848 2839125 2815799 2615389 2706194 2891497 2528011
14032B528011K23326j81344J22462k26839L49942l7680k10528j85938L13566l78071
14022B316907K54144k23051K5710P0266o9748l5645J28388j93754J91173o1865
14012B402525j50904j62043K04043M3079j05903j4114M8415N837Q0683m08697
14002A942921o8498N5432J90492k41522m90131R90919k79171l11384M07511k05257
13992A991312J87435K264O99553N10975K114503P703628J8574697Q497975j7374208
13983B2908134j0458268m307800k323263j052285q22489l27937l21842k39338
13975C054912j46727j40012l15153l27462M61988l96627j46585j52841L99460
13966B290953j15565n59235L68612k53863L51334q5917J51798m48167K85449L14770
$$ plain form
14032 2528011 2751337 2569993 2692455 2465616 2815558 2777878 2567350 2381412 2694978 2316907
14022 2316907 2571051 2348000 2373710 2443976 2374228 2338583 2466971 2273217 2464390 2402525
14012 2402525 2251621 2089578 2293621 2336700 2230797 2216683 2265098 2270935 2351618 1942921
14002 1942921 1874423 1929855 2120347 1878825 1388694 2379613 2100442 1789058 2196569 1991312
13992 1991312 2178747 2181011 2880564 3391539 5506042 13209670 31784367 40282342 22908134
13983 22908134 12449866 8142066 5818803 4766518 3944029 3616092 3294250 3054912
13975 3054912 2908185 2768173 2453020 2125558 2587546 2190919 2044334 1891493 2290953
13966 2290953 2175388 1616153 1984765 1730902 2082236 1996319 2148117 1699950 1985399 2300169
13956B300169o24807q6979L01257k6371m86152N14755r2399j23406J32017K1628
13946A829712k10881L8885m7164k64265M13562R8728o07145L64838M8806K6656
13936A691732m25420N83299o21815J41048l9043J05930K08386q0407n0273O6779
13926A580216o4187l45977K2975L63162J38928k67753l8836p3892J62851N6184
13916A533671n1907l4803O9003j06393Q2165l69221N15356m41831N62562n12585
13906A246017K06995m00506o2747L08508j67686L62743l38311K03322j23374j97077
13896A037884L72699j75203L7088P8875l68804L18018K07883m05087j2286K16020
13886A307087O050K2307m48534K57659l5029k15991M42310j5628j85224l63010
$$ plain form
13956 2300169 1675362 1588383 1889640 1863269 1377117 1891872 1799473 1676067 1808084 1829712
13946 1829712 1618831 1657716 1610552 1346287 1759849 1858577 1251432 1616270 1665076 1691732
13936 1691732 1266312 1849611 1227796 1368844 1329801 1435731 1644117 1563710 1513437 1580216
13926 1580216 1516029 1170052 1193027 1556189 1695117 1427364 1388528 1314636 1477487 1533671
13916 1533671 1481764 1446961 1515964 1409571 1491736 1122515 1637871 1196040 1758602 1246017
13906 1246017 1453012 1052506 989759 1298267 1130581 1493324 1155013 1358335 1234961 1037884
13896 1037884 1410583 1235380 1272468 1351343 982539 1300557 1508440 1103353 1091067 1307087
13886 1307087 1313137 1335444 886910 1144569 1109540 893549 1335859 1320231 1135007 771997
13876G71997j0750N46M06573j25374P7645E39058P05894k88875j34267J80984
13866A002794K341j05979M11684k28943j66143r3835J03276K93472p060l32791
13856H78816J99827j94718J37047M6528o3991k33128L23004j10738N8108l6626
13846A004129k93300M23259n44448K92621J605J52927j71137k05907L52384M0497
13836A052630m003q334o0914k77849K95575J4984l13603j0160L22465l53283K37533
13825H95041k1245J18805n1352J52494D89968M57837j06853O724j029j43647J8333
13814G21333q9310K5647j41991N33133l44660K96317j02987k18423J45087k13904
13804F10242k74371L08661j16300J34866M4000j17562J15908R3328p2717j12344
$$ plain form
13876 771997 761247 761793 1168366 1042992 1120637 539058 1244952 956077 821810 1002794
13866 1002794 1005135 899156 1310840 1081897 915754 821919 925195 1218667 1211607 878816
13856 878816 1078643 883925 1020972 1067500 1003509 770381 1093385 982647 1040755 1004129
13846 1004129 710829 1134088 589640 882261 883866 1036793 865656 659749 1012133 1052630
13836 1052630 1048627 1040293 979379 701530 997105 1012089 698486 688326 1010791 657508 895041
13825 895041 873796 992601 941249 1093743 489968 947805 840952 847676 846647 703000 721333
13814 721333 632023 657670 515679 1048812 704152 1000469 897482 679059 824146 610242
13804 610242 335871 644532 528232 663098 707098 589536 705444 798772 726055 613711
13794F13711k15210K64818j19973l5900J02835N1643j57585L12633j38587J05877
13784G84262p8544C07735K16229K4793M26033l30256o1829j97722L42772j68627
13774E59128M752J68306p883K01213k89041K06309N6111q3874q1311k42143k4984
13763D66583J59762k45375K75159j4886k7190O2635k41068L15369k34710j10037
13753D06242N5830K75067l04899K76940q8133k20914K3802O3079J11633p6889
13743E21758L723J98062J03391l23558L74103B73896R6694J85819j53013K60932
13733F64328L0424k68342L9701j8077Q510M6433K19991l21271J95391O3108j65574
13722D94622q7732K277j59691N90614C32149K62512B41866A11398M60075P1103
$$ plain form
13794 613711 398501 663319 543346 507446 610281 661924 504339 816972 678385 784262
13784 784262 705718 307735 523964 548757 974790 644534 582705 384983 727755 559128
13774 559128 563880 732186 724303 925516 636475 842784 898895 815021 733710 491567 466583
13763 466583 626345 380970 656129 641243 614053 676688 435620 750989 516279 406242
13753 406242 462072 737139 432240 709180 621047 400133 423935 487014 598647 521758
13743 521758 525481 723543 826934 503376 877479 273896 370590 556409 403396 664328
13733 664328 694752 426410 466111 448034 456544 502977 722968 401697 597088 660196 494622
13722 494622 406890 409167 249476 840090 332149 594661 241866 111398 571473 642576
13712F42576k70887K04241k65542L84116k9527Q6238C33400L30511R9577C11297
13701F78647j6375k32193J31525B46918J32224N6368j46445l5138M2224L05694
13691F01845B91857K08359r284k6355A73944K31662M85777C42420L59197m2488
13681F59129k43338J9938L4055B22562L97113B58262m0783L67280A47428J35536
13671B82964R7819P6758J17147j91428O845P3429r718q5681j13683L5461j43160
13660A46753J14701L23185A57629L51178j91562A06622N11359A87212K90925k17498
13650B60639k99P9885K13843J14406k11785J16774J10181l7955B73343K08896
13640D82239k09j55641L302B1384J35841J61608L00835B09582R286l922n3245
$$ plain form
13712 642576 371689 575930 310388 694504 664977 751215 333400 663911 763488 311297
13701 678647 662272 430079 561604 246918 379142 435510 289065 253927 296151 601845
13691 601845 291857 500216 490932 464577 173944 405606 891383 342420 701617 659129
13681 659129 415791 435729 469784 222562 619675 258262 217479 584759 147428 282964
13671 282964 380783 457541 574688 383260 390105 463534 453816 368135 254452 289913 146753
13660 146753 261454 584639 157629 508807 317245 106622 617981 187212 478137 260639
13650 260639 260340 340225 554068 668474 456689 573463 683644 645689 273343 482239
13640 482239 482030 326389 329691 21384 157225 318833 619668 209582 218868 214946 161701
13629A61701L20954j10279j72100K95633p7855A72600K78645A86515B2368J10595
13619A32963J99696D3879K95472I2712J42095J92930j76096K7077K17536j16325
13609C79929q4807j47512d413D31477b3443B21378J27309m6485p6305L74291B78231
13597B63992N5167K4961m4119o6554B8904l820K94052N8801j41169J3411M07368
13586F57547d3104a5959C93075f2059B61824M4852j41747d0092A80502d2646A67648
13574D99149A25844K44968G6485J37240p891J93741J4382A14959J16389F339M56573
13563D62912H2618k4695c6103D59112B00272L0980K50893l8355E1088M19590j62760
13552C07918e062A18209K44006E9758M38070f0469F45286B38162J61824n3003
$$ plain form
13629 161701 482655 372376 200276 495909 418054 172600 451245 186515 22368 132963
13619 132963 332659 43879 339351 92712 234807 427737 251641 278718 496254 379929
13609 379929 295122 147610 -4413 431477 -23443 221378 348687 302202 225897 600188 278231
13597 263992 319159 344120 300001 233447 28904 25084 319136 377937 236768 250179 657547
13586 657547 -43104 -15959 393075 -62059 261824 306676 164929 -40092 180502 -42646 167648
13574 499149 125844 370812 76485 213725 205834 399575 413957 114959 231348 6339 462912
13563 462912 82618 57923 -36103 459112 200272 231252 482145 443790 51088 470678 307918
13552 307918 -5062 118209 362215 59758 497828 -60469 645286 238162 399986 346983
13542C46983j58929J24374O9923A27680P8570L15419A94444E1650J61019O9315
13532B81984R906J8659O8673j19202G1571M96920B71449c3926C82722j43286L53686
13521E93122B83262j33360J04354J9092f8567D18955n3848A58924J036m7558C7927
13509A92229p4712J467J53158J69543n4193E9978J3645J99590J13993E6299a1793
13497B95584c4815D95174k01422J80635Q8912c2866E50869r3176r9236j9436I3011
13485a04484B16309K7447m5981J5901J38944j68023Q0168L4749C8577L3644f5730
13473C24614A16798N00283C1844h7598r1599a3777C57751A42687L7480J03383
13463B83550Q4599j82341d2933D65052k22231p0627a1494B04823J29383J50995
$$ plain form
13542 346983 188054 312428 382351 127680 206250 521669 194444 51650 212669 281984
13532 281984 291890 310549 379222 260020 71571 568491 271449 -33926 382722 239436 593122
13521 593122 283262 149902 254256 273348 -68567 418955 365107 158924 159960 112402 37927
13509 192229 117517 118984 272142 441685 387492 59978 73623 273213 387206 56299 -11793
13497 295584 -34815 495174 293752 474387 563299 -32866 550869 457693 358457 339021 93011
13485 -104484 216309 243756 197775 213676 352620 184597 264765 299514 38577 72221 -65730
13473 324614 116798 617081 31844 -87598 -179197 -13777 357751 142687 180167 283550
13463 283550 368149 185808 -42933 465052 242821 172194 -11494 204823 334206 485201
13453D85201J80011k86486o5919B7528R7417J51741m5409j4277j65J51024A2296
13441A97323J93886K7128F8390O836i4164b2674B81115K4548J9776m9042K49728
13430E26125d7444B83636j05653C1518K92117b5855A46386c8028A44299b79782
13419d10572B44087N4594L9651A2653N23984A04244J94980H6864K2524J57328
13409B66716E076M5913J9021A1348K36993H8711l9579R7050j7585J79006k6238
13398B81365o6124J4729B9713a4486A00657J65472N6676A26910F730J89675p3498
13387A22907L630K19746j02512J04133l7922k4557A02189N3479n6434R5119j6962
13376A77391b3110r520C80073j47368I4933J11140N9995m5942Q4257j12222P1778
$$ plain form
13453 485201 665212 378726 312807 27528 124945 276686 231277 217000 216835 367859 12296
13441 197323 391209 418337 68390 75226 -94164 -22674 281115 305663 325439 276397 526125
13430 526125 -47444 283636 177983 31518 323635 -25855 146386 -38028 144299 -279782
13419 -410572 244087 298681 338332 12653 536637 104244 299224 86864 109388 266716
13409 266716 5076 50989 70010 11348 248341 88711 49132 146182 128597 307603 281365
13398 281365 215241 229970 29713 -14486 100657 266129 322805 126910 6730 196405 122907
13387 122907 126537 346283 243771 347904 309982 285425 102189 155668 99234 194353 177391
13376 177391 -23110 -32630 380073 232705 94933 206073 266068 220126 304383 192161 263939
13365B63939m1323I7916a96853A30367m2855a17577B63852N0668j19349h2648
13354C14020m8351I9623L00483A28755k2005L49683A39651a31420C06600a59695
13343B91779M2467r4638j4658J25529a43721B87992A36607J57758M7279A15357
13332B07661K46346q8570A17363J43313R1728N4786A35394J03695J66009l8111
13322C66987E1211j2432N3739K28364I9642Q7346f812l8744H5491J36221n7489
13311A64223p134J56951a2341B32160n1594g3939A49393p253K44493j84304K44332
13300D46661i259o3897B12480h2799B36555O9197f20E8515i4669L1043n8543B15926
13287a22141A55626O9422g9517C21669I9682a21685D00153A08464A2741A27J73707
$$ plain form
13365 263939 222616 97916 -196853 130367 87512 -117577 263852 314520 195171 -82648
13354 314020 265669 99623 400106 128755 106750 456433 139651 -131420 306600 -159695
13343 291779 334246 239608 224950 350479 -143721 287992 136607 294365 341644 115357
13332 207661 454007 365437 117363 260676 352404 407190 135394 239089 405098 366987
13322 366987 51211 38779 92518 320882 99642 186988 -6812 -45556 85491 221712 164223
13311 164223 157089 314040 -12341 232160 180566 -73939 149393 142140 386633 202329 446661
13300 446661 -9259 -73156 212480 -82799 236555 305752 -620 58515 -94669 -63626 -122169 215926
13287 -122141 155626 225048 -79517 321669 99682 -121685 400153 108464 12741 127 173834
13276A73834E8491N3656K91289j63199J31408i1825a9792j89037B55645d7532
13265B73743H9996h6057l1985B23351J38612a8272p3837A41268k278b8489D3725
13253C15899r8988B3051b5900C28461A29369a19104A21752m2290J56321a29111
13242D44586G1324J96179K9823c7699C3987J22469J22372j28719O4929a37672
13231H4778K63907a1023B05629Q7285A30811L14440A24558A7054d3626B41528
13220g4301B26671J8287F0143b6703k09626m0866B62635J34181C6334J4699M7382
13209I8415c3344A37130L88937A7860P7734L177P3154J36889E6757O5873b12261
13197A23511E0190Q8972J3043o1279J07687J1536a5397B5115c0602D16032j78495
$$ plain form
13276 173834 58491 112147 403436 240237 371645 -91825 -19792 -208829 255645 -47532
13265 273743 89996 -86057 -118042 223351 361963 -18272 -92109 141268 138990 -28489 43725
13253 315899 216911 23051 -25900 328461 129369 -119104 121752 79462 235783 -129111
13242 444586 71324 267503 297326 -37699 33987 156456 278828 150109 215038 -137672
13231 84778 348685 -11023 205629 292914 130811 445251 124558 17054 -43626 241528
13220 -74301 226671 244958 60143 -26703 -236329 -277195 262635 396816 36334 51033 98415
13209 98415 -33344 137130 526067 17860 95594 98771 171925 308814 56757 122630 -212261
13197 123511 50190 139162 152205 90926 198613 210149 -15397 25115 -30602 416032 237537
13186B37537k3599j04061R8162J54395j79997a95269B34612r0496c17620A11904
13175C4557a73922a0535B92294l3835a20912A7681M1909b91157E5030j3849j6951
13164B4230J42906C6702Q3724C2496I888Q5179a34023G7368b08212A03793K2991
13153A26784a46751b253D4972d5599m0865D7847O5136J45783R244m5329J4404
13142B37085r6036J04054a77612F3796c0743F0211b19387A17193E5833J99359
13132B55192f6315A14469J65865r9919J84706c93598B60381b3577j36078E5822
13121B65244F5380b44446a15141F9947G058d4425A37682j3725a46183j73221A59285
13109a98621b59B53954r6733A3618c44693a53675j34772A11116D6082a54578B85252
$$ plain form
13186 237537 213938 109877 208039 362434 182437 -195269 234612 144116 -317620 111904
13175 34557 -173922 -10535 292294 258459 -120912 17681 59590 -291157 55030 41181 24230
13164 24230 167136 36702 120426 32496 9888 95067 -134023 77368 -208212 103793 126784
13153 126784 -146751 -2253 44972 -45599 -86464 47847 112983 258766 268010 222681 237085
13142 237085 141049 245103 -177612 63796 -30743 60211 -219387 117193 55833 255192
13132 255192 -66315 114469 280334 180415 365121 -393598 260381 -23577 -159655 55822
13121 265244 65380 -244446 -115141 69947 7058 -44425 137682 123957 -146183 -319404 159285
13109 -198621 -259 253954 157221 13618 -344693 -153675 -288447 111116 46082 -154578 285252
13097b04021A63713d5707B72152o6504a34257I3300a23819A30943n8227A8984
13086A8902M0011J33752b14023A56378j6632K17917j78160b58968A53535a24571
13075A52414p3272O4843M9744a26334B44774F6316K64089B1018a08863j80852
13065b89715O0778A64589b3570j1305k8432b0035A07793K5721h6607C0000d2234
13053A05565K5631r120c1956k50525A30712C6194c27212B47640c15455a2692A30062
13041A47504P2717i179A28592e9821j26056G5777p128k6349a2746B26456E0540
13029B24057a04349d5854p953C28073q2308i3699A02552L56931A97037b65419
13018B95552l0220I5328J60835D7111j0441J79477H2192C129K0375k087R4091
$$ plain form
13097 -204021 163713 -45707 272152 205648 -134257 93300 -123819 130943 72716 18984
13086 18902 58913 192665 -214023 156378 139746 357663 179503 -258968 153535 -124571
13075 152414 79142 143985 193729 -126334 244774 66316 330405 21018 -108863 -289715
13065 -289715 -228937 164589 -23570 -34875 -63307 -20035 107793 133514 -86607 30000 -42234
13053 105565 131196 122076 -31956 -282481 130712 36194 -327212 247640 -315455 -12692 130062
13041 147504 220221 -9179 128592 -59821 -185877 75777 68649 42300 -12746 226456 50540
13029 224057 -104349 -45854 -53807 328073 245765 -93699 102552 459483 197037 -265419
13018 295552 265332 95328 256163 47111 36670 216147 82192 3129 23504 21417 115508
13007A15508i0658c8052A8098A64b63383f7786C87862a171B05789N5873q8027
12996A73635b3375A57421K44050a74685C1056g5532b7037D30694j54116G1948
12985G7957P2589o2201a08305d8302C52339J0986A43671J31114L3681e7004C9560
12973g3873j16212n6005j00042B43174m06h2880B44626a25483B53921A07140Q4266
12962A91406a47797F2983J44392B0913a65860A19100b0264j66878I0235f2214
12951A38066E9914a34098B92844F2836m92e0021B98817r7177P1862a40308k942
12940a43250I5008a79743B36920a2558C6170K74493m7354a07501B20882H7308
12929G5163j0154a4189I6930a05090A33665k2616j2696J61518d8522F7196j2461
$$ plain form
13007 115508 -90658 -38052 18098 164 -263383 -67786 387862 -1171 205789 261662 173635
12996 173635 -23375 157421 401471 -174685 31056 -75532 -27037 430694 276578 71948
12985 77957 150546 88345 -108305 -48302 352339 363325 143671 274785 308466 -57004 39560
12973 -73873 -190085 -246090 -346132 243174 242768 -82880 244626 -125483 253921 107140 191406
12962 191406 -147797 62983 207375 20913 -165860 119100 -20264 -187142 90235 -62214
12951 138066 59914 -134098 292844 62836 62344 -50021 298817 201640 273502 -140308 -143250
12940 -143250 95008 -179743 236920 -12558 36170 310663 263309 -107501 220882 87308
12929 75163 65009 -14189 96930 -105090 133665 111049 98353 259871 -48522 67196 54735
12918E4735Q9664b66511B51000a41293a1107A42334n7631K83346j48889I8947
12907a21310b6840n2462D5755d48835G8860c2290J1159n6968A35890B2775d1649
12895C34944I1778a54528C04830m4719a49572j47631A60098J17718G822K74803
12885B82625a42892b7880A01643m9055a93048B4627O2741g565D9213g1692o1169
12874a32861D9941a53723A32503A3908a8538r9078A59955a50765C1027J84844
12864B15871a57547D4516K24168j20807e5251A91618o7022l947J6967b09115A23273
12852I7363a37670A17575K7417f7737a0812a80B69904b39344G0958D635K21982
12841B26617a84224M3732N7339E363L50158E5087M6025J44677a44059b9132q4663
$$ plain form
12918 54735 144399 -266511 251000 -141293 -11107 142334 84703 368049 219160 98947
12907 -121310 -26840 -79302 45755 -448835 78860 -32290 -21131 -78099 135890 22775 -41649
12895 334944 91778 -154528 304830 260111 -149572 -297203 160098 277816 7822 282625
12885 282625 -142892 -27880 101643 52588 -193048 24627 87368 -7565 49213 -71692 -132861
12874 -132861 49941 -153723 132503 13908 -18538 -117616 159955 -150765 31027 215871
12864 215871 -157547 44516 268684 147877 -55251 191618 124596 120649 137616 -209115 123273
12852 97363 -137670 117575 144992 -67737 -10812 -180 269904 -239344 70958 4635 226617
12841 226617 -184224 -140492 -83153 5363 355521 55087 101112 245789 -144059 -29132 -113795
12830a13795B72630p2204E6100h6591C31843B3639a08045D4107k1170a69200c4452
12818c38018F0736a14658j7803j03430I8108J35654F3029b05652K2004f6230m08826
12807d75056E0186d89948H5135g1581j62128C4032c3396j81555b8843k82151d3943
12795a88926M2395j9129P5327j18244A60364G6743O6674b4329j20900C7104Q6316
12784A23420a38628o8357A5425L1216J85769e74199a5576A92440b63148j7013
12774b80161d9917j18678D08956j98130e661l618o8935C30322F9808P8514D2328
12762b65665G3977M3452b08592A13145A3377J0927j2033M8941J3930b42831A02646
12750B66496c7195D5485a55950A18470b34309B63829n1661h4220H1974b85760
$$ plain form
12830 -113795 272630 200426 56100 -86591 331843 23639 -108045 44107 22937 -169200 -34452
12818 -338018 60736 -114658 -132461 -235891 98108 233762 63029 -205652 -183648 -66230 -475056
12807 -475056 50186 -489948 85135 -71581 -233709 34032 -33396 -214951 -28843 -310994 -43943
12795 -188926 -146531 -165660 -90333 -208577 160364 76743 143417 -24329 -145229 37104 123420
12784 123420 -138628 -206985 15425 46641 232410 -574199 -15576 192440 -263148 -280161
12774 -280161 -49917 -168595 408956 210826 -5661 -9279 -78214 330322 69808 148322 42328
12762 -265665 73977 117429 -208592 113145 13377 24304 12271 61212 75142 -242831 102646
12750 266496 -37195 45485 -155950 118470 -234309 263829 212168 -84220 81974 -285760
12739f6989A97899k7258E3003f9018B35903I6083K23641a13739D2543K74987r1421
12728B26109b8674B93206A2553i5260B77376a88328N0646c3570p7510f701E2789
12716a38127C8590K15016d8564F3755a11428D6823b2792r6709C94258A19937J53633
12705B73570K28919a65255J3421B76407j21584b8599j22369M2108a158D26272
12694A898b1749k67784E8606K22049r5417G3999J46192P378A8378a32478D0179
12682B0550c39787I0393j1300J10664j6499B4089h8500A94834d3323B23761A06096
12670e9873j3706p2697O1277j20970A69808K01350a99644H6635a34985B35568
12659a45309C64185A03065B9402J22004m2133C4210J08243k1057L9226E9084b78616
$$ plain form
12739 -66989 197899 170641 53003 -69018 235903 96083 319724 -113739 42543 317530 226109
12728 226109 -28674 293206 12553 -95260 277376 -188328 -137682 -33570 -111080 -6701 52789
12716 -138127 38590 253606 -48564 63755 -111428 46823 -22792 -119501 394258 119937 273570
12705 273570 502489 -165255 -151834 276407 154823 -28599 -150968 -108860 -1158 426272
12694 1898 -21749 -289533 58606 280655 185238 73999 220191 227569 18378 -132478 40179
12682 20550 -339787 90393 79093 189757 173258 24089 -88500 194834 -43323 223761 106096
12670 -59873 -73579 -146276 -84999 -205969 169808 371158 -199644 86635 -134985 235568
12659 -145309 364185 103065 29402 151406 109273 34210 142453 121396 160622 59084 -278616
12647g2715D94P3947h1493A28926N7654c00996a6762I9030h3737D5831i8010a5889
12634A80508d7534A39587J44194l4830i8810C53675E2715Q9184m4211J98052a27413
12622D30180A02228J15726n1828R2329A14123J8501l7328i3161A91595E2604A9755
12610g0651j38078g3776B49567c14006A57678b600r1129q8549h167B052a31349
12598I9478m0135K24196I5504E892L28350i0066O659A29950J62406d02485I8043
12586f9853q0515j7541B35920q0595a89755a9308A53662K8405P7032A00877N4462
12575A55339L2806b00873Q0378N8306j56760K436H3166P2438J17926C2647a11898
12563D2615c8865D7099b34003I0371c82j17718f386A34903a6123A21398i8947
$$ plain form
12647 -72715 494 74441 -81493 128926 186580 -300996 -16762 99030 -83737 45831 -98010 -15889
12634 180508 -47534 139587 283781 248951 -98810 353675 52715 141899 97688 295740 -127413
12622 430180 102228 217954 166126 258455 114123 132624 95296 -93161 191595 52604 19755
12610 -70651 -208729 -73776 249567 -314006 157678 -2600 -93729 -182278 -8167 2052 -131349
12598 99478 59343 283539 95504 5892 334242 -90066 -83407 129950 292356 -402485 98043
12586 -69853 -150368 -167909 235920 155325 -189755 -19308 153662 182067 259099 100877 155339
12575 155339 188145 -200873 -120495 -62189 -218949 -216513 83166 155604 273530 32647 -111898
12563 42615 -38865 47099 -234003 90371 -382 -118100 -6386 134903 -16123 121398 -98947
12551g4869K0353j40328f2910o5220H314R9828h1134H188F31a68267m8889A20039
12538E9633j8280M8396B1783N5050a07531A19712B9509b36401A4849b48967B7109
12526g0611F6270a75942K9952B8335M7905a97584e7861B57391e6202D74839A58418
12514b6668C5803Q617L9821A1552i3297A20932J45124n7070a20789B63669o9839
12503A93830b63430R8115n7397C49381b26859B84467f6156L0250l59089c6987
12492i3189o7791e2200j97430Q9529D8002J50271o6914a43158A68631l8812a73509
12480a39996a2404j40593P1089A80556g0510A07823J68451A7486a35256O0399
12470g4857p8448p5591C2925J10885m9414b32392m0015D3043b33437B04363a47322
$$ plain form
12551 -74869 -54516 -194844 -62910 -128130 8314 108142 -81134 8188 631 -168267 -217156 120039
12538 59633 41353 89749 21783 76833 -107531 119712 29509 -236401 14849 -248967 27109
12526 -70611 66270 -175942 -145990 28335 76240 -197584 -57861 257391 -56202 474839 158418
12514 -26668 35803 44420 84241 11552 -93297 120932 266056 208986 -120789 263669 193830
12503 193830 -263430 -165315 -222712 349381 -226859 284467 -66156 -35906 -394995 -36987
12492 -93189 -160980 -52200 -249630 -160101 48002 198273 131359 -143158 168631 129819 -173509
12480 -139996 -12404 -152997 -81908 180556 -70510 107823 276274 17486 -135256 -74857
12470 -74857 -153305 -228896 32925 143810 94396 -232392 -272407 43043 -233437 204363 -147322
12458a61357O6323A00791b12335k0068j64b4007o4483J0532j56871R777G0346
12446A16019a88976b3175A83518E0657L2332J2745k6849a66178j4865P2585F8379
12434f0693H3827b23401G2015J20292g0661k6223k3278B9911b14515N8078f1491
12422A86002a18359j58764B57944A27965B8710a88497R1402k6192H3392K5627
12412A09019g8545H882a40460b6210j03520c7616C3989a0773A30726a33835A02846
12400b58978d8480m256I7109Q5443e4535j22356k45667C4705C566f8732F4961
12388g7700A52188h7435k2115B2779a55351N755A12290D5933a23132H1221f3675
12376G6628J35078n4317J05778a95169Q588p3234a4878A88428E7713L2838A279
$$ plain form
12458 -161357 -95034 100791 -212335 -232403 -232567 -24007 -88490 -77958 -234829 -225052 70346
12446 116019 -188976 -23175 183518 50657 82989 95734 68885 -166178 -181043 -108458 68379
12434 -60693 83827 -223401 72015 192307 -70661 -96884 -120162 29911 -214515 -156437 -61491
12422 186002 -118359 -277123 257944 127965 28710 -188497 -97095 -123287 83392 109019
12412 109019 -78545 8882 -140460 -26210 -129730 -37616 33989 -10773 130726 -133835 102846
12400 -258978 -48480 -52736 97109 182552 -54535 -176891 -422558 34705 3566 -68732 64961
12388 -77700 152188 -87435 -109550 22779 -155351 -149596 112290 45933 -123132 81221 -63675
12376 76628 211706 157389 263167 -195169 -186581 -259815 -14878 188428 57713 90551 1279
12364b03418L1210F3602a09702j1178M1066J2058G4750b53181F4943a75690I7305
12352e0191r9143A59401C013K4431c76C2487a74763C5951K58240D7889O0703c92429
12339A30299b8529F5945a54004A17253D0841J87143L7691F1801p318M2069c50852
12327I3219l4818b62794C39098h4608B7292J89775b57258j2800D99666f3784B5783
12315A3963R016J20082d6549m9879c91r1700J8897a4373k08885a3341j70626a772
12302c36343H2811b5206j67657A5054J81952C7791Q6635a89661D1991A3383Q3508
12291I6891B5340p406Q0944k0644a77469A38572J8260e6979D4026a47973B54774
12279D6165a8882F7393K01999I9742C1678c748A19545l2179N7381J63990A32316
$$ plain form
12364 -203418 -172208 63602 -109702 -120880 -79814 -67756 74750 -253181 64943 -175690 97305
12352 -50191 -149334 159401 3013 27444 -376 32487 -174763 35951 294191 47889 108592 -392429
12339 130299 -28529 65945 -154004 117253 40841 227984 265675 61801 54483 96552 -350852
12327 93219 58401 -262794 339098 -84608 27292 217067 -257258 -270058 499666 -63784 25783
12315 13963 22979 143061 -46549 -96428 -391 -92091 -73194 -14373 -223258 -13341 -183967 -1772
12302 -336343 82811 -25206 -192863 15054 197006 37791 124426 -189661 41991 13383 96891
12291 96891 25340 17934 98878 78234 -177469 138572 156832 -56979 44026 -147973 254774
12279 46165 -18882 67393 269392 99742 31678 -3748 119545 87366 144747 308737 132316
12267C3710e8907A76075a85131A58688B2525J1411e2342k77242C1255b10942A74876
12255i6644B00672b32875e2776H6540K42476c29573B47483a35454c8969D77619
12244b93710b6817A92944F8712N6340B9310L87538a73779e8510n892j24401D436
12232B65516a08808A11195K47842I2283l3943J60289j07929b25450D03991f2064
12221A8560J91763N8788i2487A65031i668j6788A36948g1543j49751A93367p8935
12210A14432P4934q5248C8619a43593E9017a20412A05983k6622b10108i1936o6043
12199a57979B40034H5130N3334L8554J5865q7856J23088J84849B04579j00060
12189A04519D3539R2445R7068R2855A13019Q8732r0767a13095C69871f4640I6553
$$ plain form
12267 33710 -58907 176075 -185131 158688 22525 33936 -52342 -329584 31255 -210942 174876
12255 -96644 200672 -232875 -52776 86540 329016 -329573 247483 -135454 -38969 477619
12244 -293710 -26817 192944 68712 125052 29310 416848 -173779 -58510 -64402 -188803 4436
12232 265516 -108808 111195 359037 92283 58340 218629 110700 -225450 403991 -62064
12221 18560 210323 269111 -92487 165031 -9668 -26456 136948 -71543 -221294 193367 114432
12210 114432 189366 104118 38619 -143593 59017 -120412 105983 79361 -210108 -91936 -157979
12199 -157979 240034 85130 138464 177018 192883 105027 228115 412964 204579 104519
12189 104519 43539 135984 233052 325907 113019 201751 110984 -113095 369871 -64640 96553
12177B29960p5779E4838i3344F9135J82846b01284C51696d1321C82526j91253
12167A91273L64321B62173j22225h978B0802G440J52791J88950B4256i2924B77409
12155b48121B4454e1243j34877J3803B3258l415K97367M1569A10365a6698l4347
12144e1045j294J6899B75418i9755A81061J1099F0690a67560I5878J39490J53527
12133C88895b17247j76149e4436B20866c61041A50894i7033m7486b8109E1463
12122C9175i0192j25687E1503d3398a6969F187p45K67745k9470a44001B12916
12110b04804p1749A36888O6630A2661b83439A46465A0292a2591F8051N6914J06001
12099B30966c0641k2489C78997I8178P904a50243d4991D6109K43672h3152q8645
$$ plain form
12177 229960 154181 54838 -93344 69135 251981 -201284 351696 -41321 382526 191273
12167 191273 555594 262173 139948 -8978 20802 7440 160231 349181 24256 -92924 277409
12155 -248121 24454 -51243 -186120 -172317 23258 19843 317210 358779 110365 -16698 -51045
12144 -51045 -52339 -35440 275418 -99755 181061 192160 60690 -167560 95878 235368 388895
12133 388895 -217247 -393396 -54436 220866 -361041 150894 -97033 -144519 -28109 51463
12122 39175 -90192 -215879 51503 -43398 -16969 6187 5442 273187 243717 -144001 212916
12110 -204804 -276553 136888 203518 12661 -283439 146465 10292 -12591 68051 124965 230966
12099 230966 -30641 -53130 378997 98178 106082 -150243 -44991 46109 289781 -83152 -171797
12088a71797r488P0863L8797A06788b28007k19951a97896A37239a11940m1320
12078a53260d6176C899b82275E177b98063A21859b18585I8819K42523g5361j40228
12067b15589l6898N9786b8493j02207A26241a47728D58799a15435F1057f5508
12056H90081N22070k36951A90025a3447B01545l6675G9423B0548K69302A13353
12045b28092K469a1844F4067h6661o9679j65032i7992j43625C229b2738j92723
12034b15461a700k13522A36004c2126A80418J19359A14784b60566J28297H2843
12023I3696E802f8286b8193A7661a3422q4536B09211J02173a84091h2576D3557
12011b1221Q365A33630E5561b10631A6644R0209C6083K80191a16756B7982b49860
$$ plain form
12088 -171797 -181285 -110422 -71625 106788 -228007 -447958 -197896 137239 -111940 -153260
12078 -153260 -46176 3899 -282275 5177 -298063 121859 -218585 98819 341342 -75361 -215589
12067 -215589 -252487 -192701 -28493 -130700 126241 -147728 458799 -115435 61057 -65508
12056 890081 1412151 1175200 190025 -13447 201545 164870 79423 20548 289850 113353
12045 -228092 -225623 -11844 64067 -86661 -156340 -321372 -97992 -241617 3229 -22738 -215461
12034 -215461 -1700 -215222 136004 -32126 180418 299777 114784 -260566 -132269 82843
12023 93696 5802 -68286 -28193 17661 -13422 -97958 209211 311384 -184091 -82576 43557
12011 -21221 -12856 133630 55561 -210631 16644 106853 36083 316274 -116756 27982 -249860
11999a13715D0796H684J03381a74885j90544E6565J27508b700m71052G4281h91
11987e4743A51587a1229B59548a14289c6506k85543H8510e0768E5760b5265k13460
11976b38725m879C36114F9680b9122B3807g1317R353A69662b21764i925m0385
11965e0310r6540F3902K33628a06116d4897j4089j85635C13845H6119e6679n6581
11954a13260B10664I9918b27424N5604D5528b6741F8535B0894J65084q7313C538
11942i189D853K37896e51q2837j3559c5584B80390b81578e4881p2647k2638L5169
11930a14997c7379j10203a9385e246k14143r825B01365a80604N1999B63850j26897
11919A36953N5701h8722M640B81916a6911A27027a75057D5345b50756A12700a51739
$$ plain form
11999 -113715 40796 8684 112065 -174885 -365429 56565 184073 -2700 -473752 74281 -891
11987 -54743 151587 -11229 259548 -114289 -36506 -322049 88510 -50768 55760 -25265 -238725
11976 -238725 -243604 336114 69680 -29122 23807 -71317 -61964 169662 -221764 -9925 -50310
11965 -50310 -146850 63902 297530 -106116 -44897 -58986 -244621 313845 86119 -56679 -113260
11954 -113260 210664 99918 -227424 -171820 45528 -26741 68535 20894 185978 98665 3538
11942 -9189 4853 242749 -551 -83388 -96947 -35584 280390 -281578 -54881 -127528 -150166 -114997
11930 -114997 -37379 -147582 -19385 -5246 -219389 -229214 201365 -180604 -128605 263850 136953
11919 136953 192654 -88722 -84082 281916 -16911 127027 -175057 45345 -250756 112700 -151739
11907a64203A88167E2742a79841C54322d18670h1222C04920j48146F5781a19655
11896f9295b2909C0252a05789j43013B92537p2623f0484G378b75790J2373H3968
11884a06018K279p650A29657M1890B2018g9308k38376C04625A17249Q1833i9310
11872A1408b2266A19254K9396a97654h0403D8507b93320B34312r2628n5419a9800
11860b18060C52944f6438m6432A23052B1515Q9491h0262A35646d7193A17864F819
11848a2774I2027a44449A14502b33819A8406a59983M1362A21149J70923c40094
11837a34377B56971b64068f8673L208k15952A86597a33412j86494A262K69453
11827B70715A16868b0526j80266A9872h3518A69028d1893j31583B5786c61992
$$ plain form
11907 -164203 188167 52742 -179841 354322 -418670 -81222 304920 156774 65781 -119655
11896 -69295 -22909 30252 -105789 -248802 292537 219914 -60484 7378 -275790 -263417 83968
11884 -106018 -103739 -111389 129657 171547 22018 -79308 -317684 304625 117249 199082 -99310
11872 11408 -22266 119254 148650 -197654 -80403 48507 -293320 234312 141684 86265 -19800
11860 -218060 352944 -66438 -112870 123052 21515 111006 -80262 135646 -47193 117864 6819
11848 -12774 92027 -144449 114502 -233819 18406 -159983 -118621 121149 292072 -340094
11837 -134377 256971 -264068 -68673 -65465 -281417 186597 -133412 -319906 1262 270715
11827 270715 116868 -20526 -200792 19872 -83518 169028 -41893 -173476 25786 -361992
11816a37201B31273a38049E2238K5099P0973B2950a35500o9548m6653C52958b13864
11804A08184c1023r1114a3025j39459J8706B16887a73148A98724b13690C8824
11793f7399k59b0637j45060A07705L00102f4967D6399b15583g3814G7486e3185
11781E1876f2772A2359J46126b21502N7092B41147a10903B05002l327h9576A02895
11769b6382k85085B31841c94340A8440J11007e0355q1656A13086a53476k05911
11759c59387g114j81961A53232P324a10376A03870L28448a52988H7770a2605l35454
11748c48059F1404a91758A78315a59831C63812F0595M8117a61739B00327b0754
11737A22874j1440h4103H6986g5457A40479a39929I625a77503D7503b18131A41244
$$ plain form
11816 -137201 231273 -138049 52238 77337 148310 22950 -135500 -205048 -251701 352958 -213864
11804 108184 -31023 -122137 -13025 -152484 -133778 216887 -173148 198724 -213690 38824
11793 -67399 -67658 -20637 -165697 107705 407807 -64967 46399 -215583 -73814 77486 -53185
11781 51876 -62772 12359 158485 -221502 -164410 241147 -110903 205002 201675 -89576 102895
11769 -26382 -311467 231841 -394340 18440 129447 -50355 -132011 113086 -153476 -359387
11759 -359387 -7114 -189075 153232 160556 -110376 103870 432318 -152988 87770 -12605 -348059
11748 -348059 61404 -191758 178315 -159831 363812 60595 108712 -161739 200327 -20754
11737 122874 111434 -84103 86986 -75457 140479 -139929 9625 -177503 47503 -218131 141244
11725E5288b02723q73b8548G9702a64969m5911f5238A51710K1780K22579A33394
11713f5473D6500J5562G169a06984A28212l5055j1438h6172n473p9942F00K6294
11701B6894B844J73566d1943A05723j7474M2374J61018i6848B85422b20533A96429
11689H0284h0507p0292F7406a51451N5179B65858f0320j610A52542K27403f565
11677b70786A1850L1607a7464A54710e163q021r1268c7725A52898A8189L2179
11666E0368g3264A12850b23667A20110k2247b34425J2191H0972d9572A5781B992
11654a90464I3682d7132G1804C3598a83527A5185K02943B4226K24224f9073A48694
11642d6004m2927B8200J76756A00062b638l7407J4113F3385a42174A46109E9344
$$ plain form
11725 55288 -202723 -203596 -28548 79702 -164969 -210880 -65238 151710 173490 396069 133394
11713 -65473 46500 62062 7169 -106984 128212 93157 81719 -86172 -91645 -171587 600 26894
11701 26894 2844 176410 -41943 105723 88249 130623 291641 -96848 285422 -220533 196429
11689 80284 -80507 -150799 67406 -151451 -96272 265858 -60320 -61930 152542 379945 -6565
11677 -270786 11850 43457 -17464 154710 -5163 -13184 -104452 -37725 152898 18189 50368
11666 50368 -73264 112850 -223667 120110 97863 -234425 -222234 80972 -49572 15781 2992
11654 -190464 93682 -47132 71804 33598 -183527 15185 218128 24226 248450 -69073 148694
11642 -46004 -88931 28200 204956 100062 -2638 -40045 -25932 63385 -142174 146109 59344
11630A12138c06043B19621J5809A15190K28306E0570N0646K0252c3810j54151
11620a87961J1825O4787A00241D8797J16832d4333A7400e7020Q093B64169n3269
11609B10900a11883H1415P6425R1110c264j3207k11065B5152K02825H3092a22589
11597b09404F2063M54669a48213C9581L91676e0187j75561B51217I1240J03061
11587A94301c19034C56527b15625A86424q4438K21206j41889H4468b28587c7872
11576a66608A06707e4993p3808A88606B4469i297C10315c74165C4411a28242B38313
11564a1240A93740k5549o7803a65398c6079H8611l8863N4j1292f6143j76793M8165
11552a94771N966A73237a07429H7729a85790H9979k6373a00767c3724r1826c6753
$$ plain form
11630 112138 -306043 219621 235430 115190 343496 50570 101216 121468 -33810 -187961
11620 -187961 -176136 -111349 100241 48797 165629 -44333 17400 -57020 -48927 264169 210900
11609 210900 -111883 81415 157840 248950 -3264 -16471 -227536 25152 227977 83092 -122589
11597 -209404 62063 516732 -148213 39581 431257 -50187 -225748 251217 91240 194301
11587 194301 -319034 356527 -215625 186424 101986 323192 181303 84468 -228587 -37872
11576 -166608 106707 -54993 -128801 188606 24469 -9297 310315 -374165 34411 -128242 238313
11564 -11240 193740 168191 100388 -165398 -36079 88611 49748 49802 38510 -66143 -242936 -194771
11552 -194771 -188805 173237 -107429 87729 -185790 89979 63606 -100767 -33724 -125550 -36753
11540D662M51001k14006a44460C96776A05290P0389a01336C40029j37071L400
11530B06358C6026K98063c9819A85640H9723K5733a64320a288k0190j11105q2159
11519b14742A00868D1976J70364l8662C9293A911L59712j48393g5789E8934k7578
11508C1356J62176E2621O3637R2415j5387D0159L04785m6918a41674A22643L1358
11497A54001L2455p5788K35660b7106k87290c7741A42022l5778l0086a87661B80925
11485B83935E4147a54309A2084J94938b29733C05534j01380b01957d6724C22249
11474D68093p7989B7334N7344J65407L53046B16253J30484A50333m7080b6556
11463a27713I2795a26663A91857m32J05299I5025D1848a60301D15002j68759b2928
$$ plain form
11540 4662 455663 241657 -144460 396776 105290 175679 -101336 340029 202958 206358
11530 206358 36026 334089 -39819 185640 89723 115456 -164320 -1288 -21478 -132583 -214742
11519 -214742 100868 41976 212340 173678 39293 1911 361623 213230 -75789 58934 31356
11508 31356 193532 52621 116258 208673 193286 40159 344944 298026 -141674 122643 154001
11497 154001 186456 110668 346328 -27106 -314396 -37741 142022 106244 76158 -187661 280925
11485 283935 54147 -154309 12084 207022 -229733 305534 204154 -201957 -46724 322249
11474 468093 390104 27334 84678 250085 603131 216253 346737 150333 103253 -26556
11463 -127713 92795 -126663 191857 191425 296724 95025 41848 -160301 415002 246243 -22928
11451D0317j9543a16617F6518J00239I648J39540K45287j64331r9024n7970c23258
11439B24566A8119a22422F3759J01631R3142b52311B16861A8688J86659e9045
11428a54650D20559b07604A4802c6753l0811A315J3604K83757I7872b72580R3767
11417a78813A11497D6203J81506a34048A5436b02107G0124c4818D2407b36256
11406c22140E2965c10489A96617q1509a72241A51613a098A43431A3642L1079B1970
11394I1501e1045C10140a16509I7371a9837j32561A86568a55955d5977A43347
11383a76813H1649f9191b9012D34418A40167i2896J00A46432J41694b9854G9666
11371A41702D0463A0596M2658j4198a73487B1904b69171Q0706H249L08764H3516
$$ plain form
11451 40317 20774 -116617 66518 166757 9648 149188 394475 230144 131120 73150 -323258
11439 224566 18119 -122422 63759 165390 258532 -252311 216861 18688 205347 -59045
11428 -154650 420559 -207604 14802 -36753 -67564 1315 14919 298676 97872 -272580 -178813
11417 -178813 111497 46203 227709 -134048 15436 -202107 70124 -34818 42407 -236256
11406 -322140 52965 -310489 196617 115108 -172241 151613 -1098 143431 13642 44721 21970
11394 91501 -51045 310140 -116509 97371 -19837 -152398 186568 -155955 -45977 143347
11383 -176813 81649 -69191 -29012 434418 140167 -92896 -92796 146432 288126 -29854 79666
11371 141702 40463 10596 53254 39056 -173487 21904 -269171 -188465 8249 317013 83516
11359C56572G5474J79154a90531N7757j33386D09879b7412l07972A17490b1749
11348H9426g762F8038d4163k05608d0447j97433d1919A19453L4720j9299b8550
11336D8660R5124C8709c16393B81400c16775b5181l66769e5868B81068j13659
11326A67409b35753M7401B32f8142j08483g6159m5406j83754a44156B42641a23710
11314A42250d0559l69964A42006a21411p7043n2130g6596A06070a27755A75231
11303C1592J65597a68282d4161H4400a38744B23701c41591A40824c5179I4621
11292E1436a47317c3007A54370c60721O9522J00209H3155a50039r3754K8979C30173
11280a19046A09705a01195Q678B05923K385i3128A02239C0800J24603E4209a08802
$$ plain form
11359 356572 75474 254628 -190531 -132774 -266160 409879 -27412 -335384 117490 -21749
11348 89426 -7762 68038 -44163 -249771 -40447 -237880 -41919 119453 154173 134874 -28550
11336 48660 143784 38709 -316393 281400 -316775 -25181 -391950 -55868 281068 167409
11326 167409 -235753 -188352 232 -68142 -176625 -76159 -121565 -305319 -144156 242641 -123710
11314 142250 -40559 -410523 142006 -121411 -198454 -250584 -76596 106070 -127755 175231
11303 31592 197189 -168282 -44161 84400 -138744 223701 -341591 140824 -35179 94621
11292 51436 -147317 -33007 154370 -360721 -291199 -190990 83155 -150039 -243793 -214814 330173
11280 -119046 109705 -101195 -92517 205923 208308 -93128 102239 30800 155403 54209 -108802
11268h2107L0900p792B02150a20700P083B24717b334C3035a37502B52453i6501
11256b4516B76501b06641A28718J69559a74986h1919j60289C24698b27540A03340
11245c82203B6111K63779j9744A7980J40398b42035B32703A5136J64930N5683
11235B35749F6707i6026A56329D5357J7614d1947A67941O4990a54725b0106n1788
11224g1894j78473j80013a13696l10950A10868g9259A71573b51937C6096d38658
11213b37223A01349a73154A82006c60926A01024a167A40463J0003h671B59578
11202b88441I3323c05872d331A67665h7996A87915a9532j45051J248F6617O5402
11191A32019b10733A0114a02759b5844k2230A58319q469e9739B89998b25757P0608
$$ plain form
11268 -82107 -51207 -58999 202150 -120700 -113617 224717 -2334 33035 -137502 252453 -96501
11256 -24516 276501 -206641 128718 298277 -174986 -81919 -242208 324698 -227540 103340
11245 -382203 26111 289890 270146 17980 158378 -242035 232703 15136 180066 235749
11235 235749 66707 -96026 156329 45357 62971 -41947 167941 232931 -154725 -20106 -71894
11224 -71894 -250367 -430380 -113696 -424646 110868 -79259 171573 -251937 36096 -438658
11213 -237223 101349 -173154 182006 -360926 101024 -1167 140463 150466 -8671 259578
11202 -288441 93323 -305872 -4331 167665 -87996 187915 -19532 -164583 -163335 66617 132019
11191 132019 -210733 10114 -102759 -25844 -48074 158319 149850 -59739 289998 -225757 -155149
11180a55149j65190A39548a53230l8433h5265k16826a1424B45703A6481O1664
11170G8145J20294a4746j8819I9658a04034l37000A0489a30948B0832b0447j42510
11159a62957j12471E3873c40800N0361F9682a06586A31098a92157B43115b7224
11148a99466D6598J01445g7098b2752A69909a53243e6575k5119p372M1804j02840
11137a50102k2562o5801I6274a36420n2562B38095C7413g0387A1886J43755d686
11125A27269a83859D0378a38652m0686n2268d0378A50906B2254h7525C43051r7476
11114B45575D969R8801J84903a61888A92839d3400A71717J22148h6341k1043C63415
11102F7705K0348R75P4286I135L84061B2482N64084G4495J49709J71274Q1513
$$ plain form
11180 -155149 -320339 139548 -153230 -191663 -85265 -302091 -11424 245703 16481 78145
11170 78145 198439 -14746 -33565 99658 -104034 -441034 10489 -130948 20832 -20447 -162957
11159 -162957 -275428 53873 -340800 -290439 69682 -106586 131098 -192157 243115 -27224
11148 -199466 46598 148043 -77098 -22752 169909 -153243 -56575 -81694 -89066 -47262 -150102
11137 -150102 -172664 -238465 96274 -136420 -188982 238095 37413 -70387 11886 155641 -4686
11125 127269 -183859 40378 -138652 -179338 -231606 -40378 150906 22254 -87525 343051 245575
11114 245575 4969 103770 288673 -161888 192839 -43400 171717 293865 -86341 -107384 363415
11102 67705 88053 89028 163314 9135 393196 22482 586566 74495 224204 395478 476991
11091D76991c6449B10440e4923j15391A40022n7415O0092D8588L59385N518A04329
11079I8867L31259A84418O2800J74690A87702H945L96654C2337M68308k37028
11069B63617J01906I8126N1184K4909P5473J49165j20631J46760J70075K7373
11059F22434k47286n9030K07808j4284j24969K55184l12361L79788k49110L51377
11049H09551k05634J48999k66031R4854R3104L036j0785n5581k08593K52187K23095
11038H78202D23036L95733C39005P48914E41819k02522K92203k97867N0624K1203
11028D05460n6839M62101o2398j63461j912L0828B77366L42114j65336N8460K6619
11017E39223k1173p8372M8862M4542K05304j56791J30013o9126k73375J76464
$$ plain form
11091 476991 -36449 210440 -54923 -170314 140022 82607 142699 48588 407973 413491 104329
11079 98867 430126 184418 247218 421908 187702 8945 405599 32337 500645 263617
11069 263617 365523 98126 149310 174219 249692 398857 278226 424986 595061 622434
11059 622434 375148 316118 523926 509642 384673 639857 327496 707284 458174 809551
11049 809551 603917 752916 486885 581739 674843 677879 667094 611513 402920 655107 878202
11038 878202 423036 818769 339005 1087919 541819 339297 631500 333633 384257 405460
11028 405460 348621 810722 748324 584863 582951 613779 277366 619480 454144 512604 539223
11017 539223 518050 439678 488540 533082 738386 581595 711608 642482 369107 545571
11007E45571J47097k68911L66943J24556l61312Q6435q4317J60338J64414C94806
10996E24306J58006p2272J09883j21204l5706Q3749K29032l93385K70028J79549
10986I31986j9905j6820l6301j79087J98462L54122k30016L82414Q7057J59820
10976A631732J72446n5131J95289M21954l0997J4141L18946j16451k51334j34497
10966B166098J37739l16132k20480o3243O9768m10351N73698m76134K02286j89430
10956A473819L26007m2556m36336k53019o8413L3953j23599j98587j85748N2678
10946E78199j89229J85498B10521j03576K12461A57713J73945m5221I0199O4488
10936A54687N1955J06492A28033N1529a03810j51927A20834b06925b4718A0253
$$ plain form
11007 545571 692668 423757 790700 915256 553944 640379 556062 716400 880814 394806
10996 524306 682312 610040 719923 598719 563013 646762 875794 482409 752437 931986
10986 931986 912081 895261 858960 679873 878335 1232457 1002441 1384855 1471912 1631732
10976 1631732 1804178 1749047 1944336 2366290 2335293 2349434 2668380 2551929 2300595 2166098
10966 2166098 2303837 1987705 1767225 1703982 1773750 1363399 1937097 1460963 1663249 1473819
10956 1473819 1799826 1757270 1320934 1067915 999502 1033455 909856 711269 525521 578199
10946 578199 388970 574468 210521 106945 319406 157713 331658 286437 90199 154687
10936 154687 206642 313134 128033 179562 -103810 -255737 120834 -206925 -24718 10253
10925C7657a53180F2005J5846d3361A28402h463p6986B4175g440C38360H5667
10913A00926c88940J23927G0217f8713G3953B4454a44503A29233J68707a82114
10902B54410g5010j10485N8208A6476N8482a13319A59323L19316F248L4122J62975
10891B03345G1869b98026A31302A0430J62153a5749A37163b3029r1785k8126d0912
10879C957a07737d6735C5420Q6039a73998N4014A32908B833h3329c8577A49703
10867b17032N2184o6934B42664A16574a22652M5779l3258F5518L4312b93166D562
10855A55547c22240A4890J07090D9823J77958C6218M5983d4832A49043k1964a22660
10843a73596A34422D8733j7341e7428j50114E9413L2287m773k0040a88382M0600
$$ plain form
10925 37657 -153180 62005 77851 -43361 128402 -8463 -85449 24175 -7440 338360 85667
10913 100926 -388940 -265013 70217 -68713 73953 24454 -144503 129233 297940 -182114
10902 254410 -75010 -185495 -127287 16476 74958 -113319 159323 478639 6248 40370 203345
10891 203345 71869 -298026 131302 10430 172583 -15749 137163 -23029 -114814 -142940 -40912
10879 3957 -107737 -46735 35420 121459 -173998 -119984 132908 2833 -83329 -38577 149703
10867 -217032 -164848 -231782 242664 116574 -122652 -76873 -110131 65518 99830 -293166 4562
10855 155547 -322240 14890 121980 49823 227781 36218 82201 -44832 149043 127079 -122660
10843 -173596 134422 48733 31392 -57428 -207542 59413 91700 86927 66887 -188382 -147782
10832a47782c4951D380c9027D3133a99466J9965C4023J80540I906f9585L1304
10821c8281A34092A8941h5380G8897a22909H4830a04636L3665b2426A44319b0140
10809I0249b78576J36297B71546a62499c8801l15894a7672n8192j66714e7141
10798d43530a97151j81135J42793A01878b9144m4347a2739k32858c7023j16084
10788a53107N8692m1310J2199c1196C35474f6866k78345B7861b21533B20824A9696
10776B31797a83705k7637d6077l07318A76905c40327J45694r5997D332d7968m7297
10765i5265q5586A117a22826D5102M6528a12969j46132l7249A4715o217b92478
10753C4246c1762D0437J84919d02865a28354F9545J50931a38826I2553a67085
$$ plain form
10832 -147782 -34951 4380 -39027 43133 -199466 -179501 34023 214563 9906 -69585 -38281
10821 -38281 134092 18941 -85380 78897 -122909 84830 -104636 -70971 -22426 144319 -20140
10809 90249 -278576 -142279 271546 -162499 -38801 -354695 -17672 -75864 -242578 -57141
10798 -443530 -197151 -378286 -235493 101878 -29144 -73491 -12739 -245597 -37023 -153107
10788 -153107 -94415 -135725 -123526 -31196 335474 -66866 -345211 27861 -221533 220824 19696
10776 231797 -183705 -211342 -46077 -353395 176905 -340327 -194633 -290630 4332 -47968 -95265
10765 -95265 -180851 1117 -122826 45102 91630 -112969 -259101 -296350 14715 8498 -292478
10753 34246 -31762 40437 225356 -402865 -128354 69545 220476 -138826 92553 -167085
10742a5553d351j48658M9081A96082K9909J0894d30966G6438i0469a557D0828
10730F1317B1647f4703j14240E9478a5536k0315k02120J1691m0911K0689A64949
10718e2097J6848I9103a31700O4278o2745k11368E769a15483j50021r3926j325
10707c60755d9703I5587J69400m8312b77484R2823f4623I7543B1957L4535c02306
10695A5107J80999h5419l2980j02547d2969B27744i6774j07208I7349a27441N0992
10684g6449j59728P8630A64112a81746B06133r3142l0901d4068C4898a20449d7862
10672H9561a95014K8560B6748g3382o262B24417k0833l4030A7944R6785c31589
10660a67534b1541I1039i9269E6139b95744E6670i6131C59883E2353J18765O1525
$$ plain form
10742 -15553 -4351 -153009 -103928 196082 225991 236885 -430966 76438 -90469 -1557 40828
10730 61317 21647 -64703 -178943 59478 -15536 -35851 -237971 -226280 -267191 -246502 164949
10718 -52097 -35249 99103 -131700 -67422 -130167 -341535 5769 -115483 -265504 -359430 -360755
10707 -360755 -49703 95587 264987 216675 -277484 -184661 -64623 97543 21957 56492 -302306
10695 15107 196106 -85419 -118399 -220946 -42969 227744 -96774 -203982 97349 -127441 -76449
10684 -76449 -236177 -157547 164112 -181746 206133 112991 82090 -44068 34898 -120449 -47862
10672 89561 -195014 -166454 26748 -73382 -79644 224417 203584 169554 17944 114729 -331589
10660 -167534 -21541 91039 -99269 56139 -295744 56670 -96131 359883 52353 171118 232643
10649B32643a56303d8691B37127f8059j48792K9352g0803l23670b3397k15881
10639b39278J09376M9586l6356k8588A99167a2248m56605a21n7684B5967c62125
10627F1365J00691e3966k80822C53572H199a98322D892K21598b04098f7592n2128
10616a19720B55700c38821e479A01087g3786M527K538C16310a7371H2957M2510
10605A25467B0543a84160A52225a09142E9285J026b7435j15453j11974i9170B29131
10593F2147a49423C6039M4969f3716A77598J5970a93069g7409j4131A82720J759
10582A84479f9C5032a53270g6396E0528K9781K76029a30724B14458P9264j03128
10571A90594d3238k17253d3201o6201B56722C9504c3800m55821h7680o4779M9773
$$ plain form
10649 232643 -156303 -48691 237127 -68059 -216851 -187499 -70803 -394473 -23397 -239278
10639 -239278 -129902 -80316 -116672 -145260 199167 -12248 -468853 -121 -57805 25967 -362125
10627 61365 162056 -53966 -334788 353572 8199 -198322 4892 226490 -204098 -67592 -119720
10616 -119720 255700 -338821 -5479 101087 -73786 -69259 -66721 316310 -17371 82957 125467
10605 125467 20543 -184160 152225 -109142 59285 60311 -27435 -142888 -254862 -99170 229131
10593 62147 -149423 36039 81008 -63716 177598 193568 -193069 -77409 -91540 182720 184479
10582 184479 -69 35032 -153270 -76396 50528 80309 356338 -130724 214458 293722 190594
10571 190594 -43238 -260491 -43201 -109402 256722 39504 -33800 -489621 -87680 -152459 -102686
10560a02686A12295b6905g95I7499D7934b5166l18918h3001j7187b4720m23498
10549d48218e0975A07516L0684E3595K1181J84329g068p104H0191e4631A15974
10537A60077b45376p9670C2095b701k49232A43296g3109h475G7917l1110d06938
10525A78707a2326p1332j64190J8062C367c560j74065F5978a33457H2057a39327
10513b18344A46733e9952A07611b2739j73877Q5487c0914B10970l2159a01576
10502A29308C4056J42882a02717B06282a21614j21813a06179p0048j20800K2325
10492b74702E546c36823A84594H0749a06634k4863A01529l1703a65251d1283B68334
10480A80498K6234K11278J36267a74674B76096p6246R6172c4461B29143C9752
$$ plain form
10560 -102686 112295 -26905 -795 97499 47934 -25166 -344084 -83001 -100188 -24720 -448218
10549 -448218 -50975 107516 138200 53595 74776 259105 -7068 -14172 80191 -54631 115974
10537 160077 -245376 -325046 32095 -2701 -251933 143296 -73109 -8475 77917 46807 -406938
10525 178707 -12326 -83658 -247848 -229786 3367 -3560 -177625 65978 -133457 82057 -139327
10513 -218344 146733 -59952 107611 -22739 -196616 -111129 -30914 210970 178811 -101576
10502 129308 34056 176938 -102717 206282 -121614 -243427 -106179 -176227 -297027 -274702
10492 -274702 5546 -336823 184594 80749 -106634 -131497 101529 69826 -165251 -41283 268334
10480 180498 206732 418010 554277 -174674 276096 199850 296022 -34461 229143 39752
10469a57176A52190B3967a53834k0751d9402A11318Q3975N5676b83189J35657
10459a47532C06292j39382c93283b7662j97427m0519J08918k00732a09253G5165
10448c71171D012b32916O4831C85413i2984d3919G3401b10816B22483I712a83916
10436C9100d3985l8593A91156m426b0875J0152B23863f5512G5560a56878C0972
10424B4497f8717L189m6132A07488g5135A37783n16a19690H325c5834k44223J28189
10412a51868f6781k17173A13477c44295c8581H7231a20422B64765B5981B275b04970
10400c2979C5941a16598J2a1666q782j16796d6719H3804a90247f6086B47036l8297
10388B08739a3016I148d4524B04315r5579a59896O5904B88144B8478K85399J24330
$$ plain form
10469 -157176 152190 23967 -153834 -174585 -49402 111318 195293 250969 -283189 -147532
10459 -147532 306292 166910 -393283 -27662 -225089 -265608 -156690 -357422 -109253 75165
10448 -371171 4012 -232916 -168085 385413 -92984 -43919 73401 -210816 222483 9712 -183916
10436 39100 -43985 -82578 191156 186730 -20875 -10723 223863 -65512 75560 -156878 30972
10424 24497 -68717 -65528 -111660 107488 -75135 137783 137267 -119690 8325 -35834 -280057 -151868
10412 -151868 -66781 -283954 113477 -344295 -38581 87231 -120422 264765 25981 2275 -204970
10400 -32979 35941 -116598 -116586 -11666 -20448 -137244 -46719 83804 -190247 -66086 247036 208739
10388 208739 -13016 9148 -44524 204315 108736 -159896 -93992 288144 28478 313877 438207
10377D38207J0475A40239c8839D23859b5526E9316R3444K79534n2105j1936L3869
10366D02122J40360J42872A43544K05885o381j38678i805B66539E0695K6383M39459
10355E16537B14056J29548m4131J2981J59038J1248j79131N4807P9625B01579
10344E26414a7639C02283J60557j56264n6866J00586K23185B29102r7099L67486
10334D99489b27979B64385J19768j10187e2563r7558P0624A58438a07A0082M1801
10323E1883R9271D9926a34146N1443H7549l2918a5687C7367M32296a65361E0767
10311A72510e1337A69098a32593m8072g6200A48746B8070f7266j87464h4046E4828
10299A33000P6754r038a06046J2762A24250D3717b00946L3525j02008A12970a55164
$$ plain form
10377 438207 448682 140239 -38839 423859 -25526 59316 152760 432294 380189 368253 402122
10366 402122 542482 685354 143544 349429 343048 204370 -9805 266539 50695 77078 516537
10355 516537 214056 343604 299473 312454 471492 482740 303609 358416 438041 201579
10344 526414 -17639 302283 462840 306576 249710 350296 573481 229102 132003 499489
10334 499489 -227979 264385 384153 273966 -52563 -150121 -79497 158438 -107 10082 51883
10323 51883 151154 49926 -134146 -82703 87549 54631 -15687 37367 469663 -165361 50767
10311 172510 -51337 169098 -132593 -180665 -76200 148746 28070 -67266 -254730 -84046 54828
10299 133000 209754 200716 -106046 -93284 124250 43717 -200946 -167421 -269429 112970 -155164
10287g8968k67317B10157b54085D2040J7635a87918l1820A73593b68903P2181
10277a96722M0767k19465a61803B22504a439m42k99000e1499A44024g6728C2882
10265g6584A54218M9975a73669A86108p761Q2539q7992K53832A33041J18580O6752
10254C18373c08685a8936G9355J51497a75168L1990C82673j28343B1496P0861
10244I2357k2541a17025E9300K38886a8153A22756a25922i806D0260J63883E2987
10232c10129J12007O2444H3183a71318A67671a47864G0910a52528A75061p6587
10222I8474a63720B14438G8373e6476A0787Q9479a17951B15026d17728c1090q2592
10211a13682n4171l2189m1264Q7529J5013n9681o5734k10240B04859c48499B00765
$$ plain form
10287 -78968 -346285 210157 -254085 42040 59675 -187918 -219738 173593 -268903 -196722
10277 -196722 -155955 -375420 -161803 222504 -1439 -1881 -300881 -51499 144024 -76728 32882
10265 -76584 154218 204193 -173669 186108 178347 260886 172894 426726 133041 251621 318373
10254 318373 -308685 -18936 79355 230852 -175168 -143178 382673 254330 21496 92357
10244 92357 69816 -117025 59300 298186 -18153 122756 -125922 -9806 40260 204143 52987
10232 -310129 -198122 -135678 83183 -171318 167671 -147864 70910 -152528 175061 98474
10222 98474 -163720 214438 78373 -56476 10787 100266 -117951 215026 -417728 -31090 -113682
10211 -113682 -167853 -200042 -241306 -153777 -138764 -198445 -264179 -474419 204859 -348499 200765
10199a78527N8922I7937J2281A4817J35582a26054k30190a25657j48321c5607
10188a94182O6561J5685l17517A6436a62361H6594N7631E5817P5643m9647J42897
10177B24710d15468G6252A0438k587a51101N8951j16876B2052P1330J04878b4956
10165c83891A92285h1729I4900b11923j28823I2225K21813a80318m3056G9886
10154a86593D1577O3486D3607d71360F4905a09049K367C31647i5781n524B40161
10142a75276M1777M3686q4239B24852i6327C3679d40246a73178B16354b0131n6008
10131g6139k3328j5879B1942L473a92421A38301d1247j6946k8326j19056k184
10120b07759j31804A63702j4199n1313b10834G100a46549I5095b13299d465l0765
$$ plain form
10199 -178527 -119605 97937 110218 14817 150399 -126054 -356244 -125657 -273978 -35607
10188 -194182 -127621 -111936 -429453 16436 -162361 86594 144225 55817 131460 81813 224710
10177 224710 -415468 76252 10438 7851 -151101 -92150 -209026 22052 93382 198260 -24956
10165 -383891 192285 -81729 94900 -211923 -340746 92225 314038 -180318 -223374 79886
10154 -186593 41577 105063 43607 -471360 64905 -109049 -106682 331647 -95781 -101305 240161
10142 -175276 -133499 -89813 -174052 224852 -96327 33679 -440246 -173178 216354 -20131 -76139
10131 -76139 -99467 -115346 21942 25415 -192421 138301 -41247 -58193 -86519 -205575 -207759
10120 -207759 -339563 163702 149503 98190 -210834 7100 -146549 95095 -213299 -4465 -35230
10109c5230H6597b06886P0930A11681b40095J12239o3489h5293A41478c89096
10098H6414J64660E1794i9578r3422d1964a5429l54519J72194a5666l56233A95898
10086A25788A5329J98728A03848L6634c67729I3427B7307c3184G3368b80771J36951
10075a43820J0688r8995I1009K0832a2237k16627B38093b57011b4259A65622a92620
10063A48054K5191f4583H4488Q9674i382j46438C5110e3833a714r3022G2963O3741
10051A36704e6600j88946B75798b75491h9423K0542J5442F6492a34115r3852q4236
10040c12203D6351a85102f2384B36265C4153J534a83918B47914a81498G1100j1834
10029E9266c54275A984Q2473h1628A14612d3974k77405c5465j26948n4609B05066
$$ plain form
10109 -35230 86597 -206886 -135956 111681 -240095 -127856 -191345 -85293 141478 -389096
10098 86414 251074 51794 -99578 -193000 -41964 -15429 -369948 -197754 -15666 -371899 195898
10086 125788 15329 214057 103848 140482 -367729 93427 27307 -33184 73368 -280771 -143820
10075 -143820 -133132 -232127 91009 111841 -12237 -228864 238093 -257011 -24259 165622 -192620
10063 148054 173245 -64583 84488 174162 -9382 -155820 35110 -53833 -1714 -94736 72963 136704
10051 136704 -56600 -245546 275798 -275491 -89423 -68881 -53439 66492 -134115 -227967 -312203
10040 -312203 46351 -185102 -62384 236265 34153 35687 -183918 247914 -181498 71100 59266
10029 59266 -354275 1984 84457 -81628 114612 -43974 -321379 -35465 -162413 -217022 205066
10017F951e2210n5471A04351D3505f7363h564r0975A65198c40687b8539j42245
10006a70784A96242f7647j30119a2690A0586J35706l902a65136A4565K3119d1498
9994H7297d68964K30992f6078b656r1307A96931H3523b56978J18379j66055A23603
9982A517g2129A48805h1685A73796a68546k52416A7200a33740k2072m5758i1382
9970A78549O467c09867A1408K42154G7621b62208J03456q9938e4907j59921A21124
9958a34716c7054A09855a32815j60704B00373F725Q5922b71313g0462n9233H4354
9946a57837j28999A09084k786M0632j2695a82937B80803b94528a04732d709F9046
9934H099d87735A22355n497B6926a29208j50602f4280A49980c60130A30285n4623
$$ plain form
10017 6951 -52210 -107681 104351 43505 -67363 -8564 -99539 165198 -340687 -28539 -170784
10006 -170784 196242 -67647 -197766 -12690 10586 146292 142390 -165136 14565 37684 -41498
9994 87297 -468964 -237972 -66078 -2656 -93963 196931 83523 -256978 -138599 -304654 123603
9982 1517 -72129 148805 -81685 173796 -168546 -420962 17200 -133740 -155812 -201570 -91382
9970 178549 185016 -309867 11408 253562 77621 -262208 -158752 -248690 -54907 -214828 121124
9958 -134716 -37054 109855 -132815 -293519 200373 6725 92647 -271313 -70462 -129695 84354
9946 -157837 -286836 109084 106298 146930 134235 -182937 280803 -294528 -104732 -4709 69046
9934 8099 -487735 122355 116858 26926 -129208 -279810 -64280 149980 -360130 130285 75662
9923G5662c8969g204H1517b62320A38487l3885A8818d61374B22633I8116Q6607
9912A84723d7500A97831a91886h9745n7193j48044J5829j35991b4041p1814K3557
9901g2298k25123d1202A65415b17413J08436L2045A66457b08330i9650H465a56526
9889A04049b30114f6528B4949a13431B11224c78477q4659B04160b26514B4446
9878H8454g7503j38234L7294A95103d00800G9871Q8106a19265M0564r228j61094
9867b49023R0192n897m9250p5851I9050g2805A18493d27385F4379c5573j3021
9856d8594j34568c6736j36067E8237c8232l0348C3554c2724j15864D4616b83984
9844C02744a08573j5257h019C16333a76854C1832d73610A21533b38663P8624q0141
$$ plain form
9923 75662 -38969 -7204 81517 -262320 138487 104602 18818 -461374 222633 98116 184723
9912 184723 -47500 197831 -191886 -89745 -146938 -294982 -279153 -415144 -24041 -95855 -72298
9901 -72298 -297421 -41202 165415 -217413 -108977 -76932 166457 -208330 -99650 8465 -156526
9889 104049 -230114 -66528 24949 -113431 211224 -378477 -463136 204160 -226514 24446
9878 88454 -77503 -215737 -178443 195103 -400800 79871 167977 -119265 -78701 -87929 -249023
9867 -249023 -158831 -164728 -213978 -289829 99050 -72805 118493 -427385 64379 -35573 -48594
9856 -48594 -183162 -36736 -172803 58237 -38232 -68580 33554 -32724 -148588 44616 -283984
9844 302744 -108573 -123830 -8019 316333 -176854 31832 -473610 121533 -238663 -160039 -240180
9833b40180r1900f0985E3047B047i2337a5073C8075K21325C8394G152L31953A0899
9820e014q906K496G9231B5927J09973J25897l4058b38762C72862g4246H4493a12569
9807c66639J41908A26698m6840f1695j59099M8281C0492A3090Q4016b24961F9852
9795b73166J4543D4651a31520b175A18074a525B90391i6966F2738B0910e3743
9783d20724d288j65798Q0305M4760j66033i5059K391k7117b4100k32929F1554
9771A03638N6735A826K95821a11036A52112a76410A62555a47936O9332k7265R544
9760i6325k9925b6308j40732A62542j6378a62359o6080i629k64352g7495l5444
9749a12939A60202a67360f1012A37099c01960E2388L1193c2298B81712D9725d4961
$$ plain form
9833 -240180 -332080 -60985 53047 2047 -92337 -15073 38075 259400 38394 7152 339105 10899
9820 -5014 -13920 -11424 79231 25927 135900 261797 227739 -238762 372862 -74246 84493 -112569
9807 -366639 -224731 126698 79858 -61695 -220794 -172513 30492 13090 97106 -224961 69852
9795 -273166 -258623 44651 -131520 -2175 118074 -1525 290391 -96966 62738 20910 -53743
9783 -420724 -4288 -170086 -89781 -45021 -211054 -95059 -92668 -119785 -24100 -257029 61554
9771 103638 160373 1826 297647 -111036 152112 -176410 162555 -147936 -78604 -105869 -96325
9760 -96325 -126250 -26308 -167040 162542 146164 -162359 -228439 -9629 -273981 -77495 -112939
9749 -112939 160202 -167360 -61012 137099 -301960 52388 83581 -32298 281712 49725 -44961
9737I9387b5280l62400e2059j02010j77058a62809A19766c360p5784j2735l40435
9726d32314J08184h3071n1196b1750l04847J27493C4570K261J05693b77507a21970
9714a74116P9313P237K0266k01124j7948e4567j1502B1041f2516A03059d3539
9702A55075c43932C27824n8580F7144c35934A15809g7952l41904i7464a2131j45260
9691a57391R052e8739A04453a3552k96877H0N7129a66846A15463a29566l784A59511
9678H5400a42333F093a74183j9902j50115E9282i7334A76240a61474A90915a00966
9666A51300b09815r0188h5683K824k0470A976b47131H6558Q0469c26649D2536
9654f349A59330g3773L2679k09456B0117a01050A36184a72311C4948K32532c14259
$$ plain form
9737 99387 -25280 -387680 -52059 -154069 -331127 -162809 119766 -3360 -79144 -91879 -432314
9726 -432314 -324130 -83071 -134267 -21750 -326597 -199104 34570 36831 142524 -277507 -121970
9714 -174116 -94803 -87566 -67300 -268424 -286372 -54567 -66069 21041 -62516 103059 -43539
9702 155075 -343932 327824 269244 67144 -335934 115809 -77952 -419856 -97464 -12131 -157391
9691 -157391 -148339 -58739 104453 -13552 -310429 80 57209 -166846 115463 -129566 -133350 159511
9678 85400 -142333 6093 -174183 -194085 -344200 59282 -97334 176240 -161474 190915 -100966
9666 151300 -209815 -300003 -85683 -82859 -103329 1976 -247131 86558 167027 -326649 42536
9654 -6349 159330 -73773 -41094 -250550 20117 -101050 136184 -172311 34948 267480 -314259
9642I8388a82657G960a77655N9014j27893F874b24800a4576D47272g017r5611
9631a02628r4302k55526b03287F352O3562a62202g959A0889b20581N5514P9015
9620h6052j71756R9814A4837i7156m0738a0794A15046b30949N6900A6827J54862
9609A71689H3842M8278b12153h2314A26512g1927n3931q2272A9319L2266J95247
9598B46832G8639a51590I2859j6847d36417B4000d20351A99244b4021m22789a50878
9586b91274H3815L6317a63519C0771a15937j1045M6227j24421C99788a40166N891
9575a34275B66261j31290a63516O9364o3732a3668j23049B3964M1245b49460O9440
9564a80020B76784B1518a32529m9268e5750A18053K08084b48806b0908A94630
$$ plain form
9642 98388 -182657 7960 -177655 -118641 -246534 6874 -224800 -14576 447272 -7017 -102628
9631 -102628 -196930 -452456 -203287 6352 69914 -162202 -7959 10889 -220581 -165067 -86052
9620 -86052 -257808 -157994 14837 -97156 -137894 -10794 115046 -230949 -174049 16827 171689
9609 171689 83842 132120 -212153 -82314 126512 -71927 -125858 -208130 19319 51585 246832
9598 246832 78639 -151590 92859 76012 -436417 24000 -420351 199244 -24021 -446810 -150878
9586 -291274 83815 120132 -163519 30771 -115937 -126982 -80755 -205176 399788 -140166 -134275
9575 -134275 266261 134971 -163516 -94152 -157884 -13668 -136717 23964 65209 -249460 -180020
9564 -180020 276784 21518 -132529 -181797 -55750 118053 326137 -248806 -20908 194630
9553c72267f1966l43219a59771A07983b24910p7870C7455a90852Q7870B12343
9542a88590G6321g074j36316F2845a94791H5598L0205a89157j49386O7063j91161
9531d62641B05400J00399b0117j10456c0925l2708c0243j01944a8384m0184A5085
9519i9700I674c16177D7573a37916I1239b24832B32696b8011A60079c59165J08756
9508b50409F1581f7460k14624D88317a83981H2313b61807A46159a91486c3653
9497A78175a24739q0728c419l28706H5539c26275a03384A23425k9750a02570N0095
9486e2475r0432j67579b5914k6610G1932d04382p8682A6423f113k46368c0627
9474h1727A40931e9844B6483b06105g7693c4924m4434p1887D8016e41461e4852
$$ plain form
9553 -372267 -61966 -405185 -159771 107983 -224910 -302780 37455 -190852 -102982 212343
9542 -188590 76321 -7074 -143390 62845 -194791 85598 115803 -189157 -338543 -271480 -462641
9531 -462641 205400 305799 -20117 -130573 -30925 -63633 -30243 -132187 -18384 -58568 15085
9519 -99700 9674 -316177 47573 -137916 91239 -224832 232696 -28011 160079 -359165 -250409
9508 -250409 61581 -67460 -282084 488317 -183981 82313 -261807 146159 -191486 -33653
9497 178175 -124739 -205467 -3419 -332125 85539 -326275 -103384 123425 93675 -102570 -52475
9486 -52475 -142907 -310486 -25914 -52524 71932 -404382 -483064 16423 -6113 -252481 -30627
9474 -81727 140931 -59844 26483 -206105 -77693 -34924 -79358 -151245 48016 -541461 -54852
9462A2314a85678G0538b96160B5308c89852A49908a58613B82660i5457C41009
9451a21898H115J491J1067L08240b59063a8602I8815m4167d30992F6812n268j2938
9439D8606b3106m7060p0144O6460B601b40627c9259j85944j09771A25057e3641
9427g8524B57371a79978E0272a88407F8133c8151b267k41209B06868j02519f4954
9415b25164D2746A2263J06384A1170J06898J7517k9960M6844a69058j5119h3449
9403C4199M0086k127f3119D0173M9056a8674C37084b51965B4290a03359a3684
9391A82331a99548C9747b57558r0981K5339c0055m0021r7262I8874e4016k11074
9380b65090h040C9435a22926b2470n4161b8480A15141b3511j57121G1184c56532
$$ plain form
9462 12314 -185678 70538 -296160 25308 -389852 149908 -158613 282660 -95457 341009
9451 -121898 8115 9606 20673 328913 -259063 -18602 98815 54648 -430992 66812 61544 48606
9439 48606 -23106 -70166 -140310 -73850 2601 -240627 -39259 -225203 -334974 125057 -53641
9427 -78524 257371 -179978 50272 -188407 68133 -38151 -2267 -243476 206868 104349 -64954
9415 -225164 42746 12263 118647 11170 118068 135585 105625 152469 -169058 -184177 -83449
9403 34199 74285 72158 -63119 40173 89229 -18674 337084 -251965 24290 -103359 -13684
9391 182331 -199548 39747 -257558 -348539 -323200 -30055 -70076 -167338 98874 -54016 -265090
9380 -265090 -8040 39435 -122926 -22470 -76631 -28480 115141 -23511 -180632 71184 -356532
9368a53182J1934b0882B0025b00991P2823F208d2045a8832A57148a67429m9878
9357b17307B10818e1526b2936F6212a31005o2057a5576k24044K6169b496B18808
9345A26878G074a83096n4407A78775a13374J0256A18643J09737A9234J50758f0585
9333b33198i5653k05698C3953a1202j76306f1438j872n2604J5041A86651a04576
9321a61488B58539c0589j92914e8337j9655k8360A92701h3540j55040a01332k50278
9310c51610A13573A3065P4968m2409b82553Q3337h5565c9880E5633L2072f4647
9298h7201K1286p7242I4382d00468J96545d9058B42357j03901b80854e9087l68784
9287d27871E4121f3704l3428C1277a54322k73628A62518N4621F0284a42253j3630
$$ plain form
9368 -153182 -141248 -20882 20025 -200991 -128168 6208 -42045 -18832 157148 -167429 -217307
9357 -217307 210818 -51526 -22936 66212 -131005 -193062 -15576 -239620 -213451 -2496 218808
9345 126878 7074 -183096 -237503 178775 -113374 -103118 118643 228380 19234 169992 -60585
9333 -233198 -95653 -301351 33953 -11202 -187508 -61438 -63310 -115914 -100873 186651 -104576
9321 -161488 258539 -30589 -223503 -58337 -77992 -106352 192701 -83540 -238580 -101332 -351610
9310 -351610 113573 13065 88033 45624 -282553 -199216 -85565 -39880 55633 87705 -64647
9298 -87201 -65915 -143157 94382 -400468 -203923 -49058 242357 138456 -280854 -59087 -427871
9287 -427871 54121 -63704 -97132 31277 -154322 -427950 162518 217139 60284 -142253 -155883
9276a55883n4929P6359f4073j57946O8992B2185J62198p3254a07327A11838a84527
9264a96329L2965A90049b05380C21144h0497H1754J61366q3260B0674a04708B31559
9252c88908e8844D3009b31943J04857l6622H5650a42240a6518m82563B56205F4541
9240A99005m0694j5141B860e5504J3840l02315B16494c53579a41331a6515A48694
9228a41936k12805J74991g2531F1679A8521c65795J19640m5544a39886A78466
9217a26845e0177h437j13755j49322A80576c58263e7533B17741M5474G9407c7155
9205d23559g6916k69761c2437C8245j8809J42644b4250j90742a0512j5262F2268
9193a10037b2112o88k88649J04740a7031B90391a61983H6953C0982b8215D0576
$$ plain form
9276 -155883 -210812 -134453 -64073 -222019 -153027 22185 184383 111129 -107327 111838 -184527
9264 -196329 -163364 190049 -205380 321144 -80497 81754 243120 159860 20674 -104708 231559
9252 -388908 -58844 43009 -231943 -127086 -163708 85650 -142240 -16518 -499081 256205 64541
9240 199005 158311 143170 2860 -55504 -41664 -343979 216494 -353579 -141331 -16515 148694
9228 -141936 -354741 -179750 -72531 61679 18521 -365795 -246155 -291699 -139886 178466
9217 -126845 -50177 -8437 -122192 -271514 180576 -358263 -57533 217741 263215 79407 -37155
9205 -423559 -76916 -346677 -32437 38245 19436 162080 -24250 -214992 -10512 -25774 62268
9193 -110037 -22112 -22800 -311449 -206709 -17031 290391 -161983 86953 30982 -28215 40576
9181i9538A11835b07508J02556j43490l3842J36996a506k42526J08585C24694
9170b0238m7625A20676a55578M9613B26053b54165g683j86704c8231j43069j45358
9159c26658a0970j57579N1255A68006N6411q2350a52910g4624C3280c80595i2512
9147g3588A39292b33017A59639L305D5406e5838a2525k32460R5887A61401F5168
9135d8835l4075A05667b33022j79433g7885r4806A29845a73587q0325A12250a63681
9123B32158p8134c26762b6087A05527b27553m9250f55k29737R2314I2827a19654
9111G9610a01338A54351J28709G2188a3314k0560a1992B20147n2207J12679b90461
9099H0555d6306k64748A56170J8508h2176o7632D30859a35414N7426A80957q5516
$$ plain form
9181 -99538 111835 -207508 -104952 -248442 -282284 -145288 -1506 -244032 -135447 324694
9170 -20238 -67863 120676 -155578 -105965 226053 -254165 -7683 -194387 -38231 -181300 -326658
9159 -326658 -10970 -168549 -117294 168006 224417 142067 -152910 -74624 33280 -380595 -92512
9147 -73588 139292 -233017 159639 162944 45406 -55838 -12525 -244985 -149098 161401 65168
9135 -48835 -82910 105667 -233022 -412455 -77885 -172691 129845 -173587 -253912 112250 -163681
9123 232158 154024 -326762 -26087 105527 -227553 -276803 -655 -230392 -138078 92827 -119654
9111 79610 -101338 154351 283060 72188 -13314 -33874 -11992 220147 167940 280619 -290461
9099 80555 -46306 -311054 156170 174678 -82176 -149808 430859 -135414 -77988 180957 95441
9088I5441b38167G8062a49903A52942D7281a8901C0404f0831K3742n2984q897
9077i8970o7418e9594C3991f3495A4370b65028B0201K03249E9092J1988d4635
9065d0036n1196A19042h224k08324Q1463r821q9484B7336P2813a63066B35891
9053a13395c152j32734k24430F8655J34121p3597j3779J10032J29511f7682j80486
9042b48168A0923b00353A16436b18246A70374b11023b5082l60010J81972j972
9032b05092r3954d9847H1565c35348A56545G6304a11549a6596A25003j8496c8397
9020d93700d5992H6372a32855o4532b3918l26167b0956j14350n3454L7625n1705
9009b02840A78415C2968E093b41482e3876F4437c74978H5823B8388a29554j18663
$$ plain form
9088 95441 -238167 78062 -149903 152942 47281 -18901 30404 -60831 -37089 -90073 -98970
9077 -98970 -166388 -59594 33991 -63495 14370 -265028 20201 223450 59092 71080 -44635
9065 -40036 -91232 119042 -8224 -216548 -135085 -144906 -234390 27336 100149 -163066 235891
9053 -113395 -3152 -135886 -360316 68655 202776 129179 115400 225432 354943 -67682 -248168
9042 -248168 10923 -200353 116436 -218246 170374 -211023 -25082 -385092 -203120 -205092
9032 -205092 -299046 -49847 81565 -335348 156545 76304 -111549 -16596 125003 106507 -38397
9020 -493700 -45992 86372 -132855 -197387 -23918 -350085 -20956 -135306 -188760 -151135 -202840
9009 -202840 178415 32968 5093 -241482 -53876 64437 -374978 85823 28388 -129554 -248217
8998b48217n374b483m731j35505K1005l6727B33398a80081k26F6865b08903q6808
8986b95711J3717a39096j22225a00428q8632A330J60152a68815A2343K92827d4002
8974c32016A19145g6611A23433J26256H3900b55999a15138L9697k16484a08631
8963a2218H3502k4606H471K07614A3503d6410E9748J29036E3646J34392b15842
8951C0895Q0169k3650L00879a65087j74520R0916A43866D2358J18591a04407J9425
8940h4982a8811n0688A85447a31n5404D06984H8072a54916a6217A0771g9528A55950
8927a4271j66852F07637j35498J051167K704598J0043835o159211B579242I73242
8917D86407o6722j86321I1862N3112n8072j9078J5720b66903A74165n1060C1711
$$ plain form
8998 -248217 -253591 -2483 -7214 -142719 -121714 -158441 233398 -180081 -180307 66865 -208903 -295711
8986 -295711 -281994 -139096 -261321 -100428 -189060 1330 161482 -168815 12343 305170 -44002
8974 -332016 119145 -76611 123433 249689 83900 -255999 -115138 -75441 -291925 -108631
8963 -12218 83502 58896 8471 216085 13503 -46410 59748 188784 53646 188038 -215842
8951 30895 111064 87414 388293 -165087 -339607 -248691 143866 42358 160949 -104407 -84982
8940 -84982 -18811 -69499 185447 -131 -55535 406984 88072 -154916 -16217 10771 -79528 155950
8927 -14271 -181123 607637 472139 1523306 4227904 14271739 8112528 2579242 973242
8917 486407 419685 233364 91862 144974 86902 67824 83544 -266903 174165 123105 31711
8905h2559k7011B99538b63566A04705a63174m5184A6857I16J04389b18499l27272
8894e45771b18825C41890A4928c03422a34543B48964c189p5906K4610k24493I2792
8882A39179d93021a63335A23584L00573b63538J00973A34026D9463b02136g7675
8871b58819A1148a61518P1972o9460L9323B2932c1323b322j63190k45108a49672
8859A54765N7415b89803a34079p4299G0411h3500h884m7875j25752P3041k05742
$$ plain form
8905 -82559 -109570 299538 -263566 104705 -163174 -208358 16857 916 105305 -218499 -545771
8894 -545771 -218825 341890 14928 -303422 -134543 248964 -3189 -79095 -54485 -278978 92792
8882 139179 -493021 -163335 123584 424157 -263538 -162565 134026 49463 -202136 -77675
8871 -258819 11148 -161518 -89546 -159006 -119683 22932 -31323 -2322 -165512 -410620 -149672
8859 154765 212180 -289803 -134079 -208378 70411 -83500 -8884 -56759 -182511 -109470 -315212
$$ [...]
##END NTUPLES=NMR SPECTRUM
##END=
