##TITLE=AC1560_ROEFFECT0018_8270752_uZRMrDbaa0
##JCAMPDX= 6.0         $$ Bruker NMR JCAMP-DX V2.0
##DATA TYPE= NMR SPECTRUM
##DATA CLASS= NTUPLES
##ORIGIN= BRUKER
##OWNER= Administrator
$$ 1.72 TOPSPIN		Version 2.1
$$ 2013-10-12 17:01:04.559 -0700  Administrator@X
$$ Compression mode = diff/dup
##.OBSERVE FREQUENCY= 400.02188249412
##.OBSERVE NUCLEUS= ^1H
##.ACQUISITION MODE= SIMULTANEOUS (DQD)
##.ACQUISITION SCHEME= undefined
##.AVERAGES= 64
##.DIGITISER RES= 22
##SPECTROMETER/DATA SYSTEM= spect
##.PULSE SEQUENCE= noesygpps1d.comp
##.SOLVENT NAME= COFFEE_meoh
##.SHIFT REFERENCE= INTERNAL, COFFEE_meoh, 1, 14.96075
##AUDIT TRAIL= $$ (NUMBER, WHEN, WHO, WHERE, PROCESS, VERSION, WHAT)
$$ ##TITLE= Audit trail, TOPSPIN		Version 2.1
$$ ##JCAMPDX= 5.01
$$ ##ORIGIN= Bruker BioSpin GmbH
$$ ##OWNER= Administrator
$$ $$ E:\/data/COFFEE/nmr/AC1560_ROEFFECT0018_8270752_uZRMrDbaa0/12/pdata/1/auditp.txt
$$ ##AUDIT TRAIL=  $$ (NUMBER, WHEN, WHO, WHERE, PROCESS, VERSION, WHAT)
(   1,<2013-10-12 17:00:59.622 -0700>,<Administrator>,<X>,<go>,<TOPSPIN 2.1>,
      <created by zg
	started at 2013-10-12 16:49:29.832 -0700,
	POWCHK enabled, PULCHK disabled,
       configuration hash MD5:
       C8 4E 4E 5D D3 5C D8 9E 9F 52 82 E0 59 8A DE 15
       data hash MD5: 64K
       8D DB EC E5 42 AC 08 00 2D 62 E3 11 0B 94 CC F2>)
(   2,<2013-10-12 17:01:02.653 -0700>,<Administrator>,<X>,<proc1d>,<TOPSPIN 2.1>,
      <Start of raw data processing
       efp LB = 0.3 FT_mod = 6 PKNL = 1 PHC0 = 0 PHC1 = 0 SI = 128K 
       data hash MD5: 128K
       85 7B DD 3F 2F EA 66 56 67 DB 17 32 0F 9C A8 22>)
(   3,<2013-10-12 17:01:03.591 -0700>,<Administrator>,<X>,<proc1d>,<TOPSPIN 2.1>,
      <pk PHC0 = -79.4751 PHC1 = 0 
       data hash MD5: 128K
       9B 2B 84 DB 0E 99 D1 AA 3C F3 B9 6F 79 B3 22 9C>)
(   4,<2013-10-12 17:01:03.981 -0700>,<Administrator>,<X>,<proc1d>,<TOPSPIN 2.1>,
      <abs ABSG = 1 
       data hash MD5: 128K
       93 19 BC 86 21 8A 43 10 07 CC 23 D4 E0 1A 0A CC>)
(   5,<2013-10-12 17:01:04.075 -0700>,<Administrator>,<X>,<proc1d>,<TOPSPIN 2.1>,
      <abs ABSG = 2 
       data hash MD5: 128K
       37 32 F2 FD 4C 17 5B 19 5F E9 9E 82 1E 69 52 99>)
(   6,<2013-10-12 17:01:04.169 -0700>,<Administrator>,<X>,<proc1d>,<TOPSPIN 2.1>,
      <abs ABSG = 3 
       data hash MD5: 128K
       42 27 96 5C 1E D8 C1 24 87 CC 0B 8D E1 54 E9 C0>)
(   7,<2013-10-12 17:01:04.262 -0700>,<Administrator>,<X>,<proc1d>,<TOPSPIN 2.1>,
      <abs ABSG = 4 
       data hash MD5: 128K
       D9 43 CF A0 A7 78 6D B1 5C F7 70 F0 CE 94 6B 79>)
(   8,<2013-10-12 17:01:04.341 -0700>,<Administrator>,<X>,<proc1d>,<TOPSPIN 2.1>,
      <abs ABSG = 5 
       data hash MD5: 128K
       46 5F C2 CB D5 7D BD 07 FB FE 13 12 8B B3 FF 92>)
$$ ##END=
$$ 
$$ $$ hash MD5
$$ $$ 75 A0 C3 90 95 4F 91 4B 2C 9E D2 52 68 C4 50 A7
##$RELAX= 
##$RELAX= 
##$RELAX= 
##$RELAX= 
##$RELAX= 
##$RELAX= 
##$RELAX= 
##$RELAX= 
$$ Bruker specific parameters
$$ --------------------------
##$DU= <E:\>
##$EXPNO= 12
$$ [...]
150 150 150 150 150 150 150 150
##$TP07= 0
##$TPNAME0= <>
##$TPNAME1= <>
##$TPNAME2= <>
##$TPNAME3= <>
##$TPNAME4= <>
##$TPNAME5= <>
##$TPNAME6= <>
##$TPNAME7= <>
##$TPOAL= (0..7)
0.5 0.5 0.5 0.5 0.5 0.5 0.5 0.5
##$TPOFFS= (0..7)
0 0 0 0 0 0 0 0
##$TUNHIN= 0
##$TUNHOUT= 0
##$TUNXOUT= 0
##$USERA1= <user>
##$USERA2= <user>
##$USERA3= <user>
##$USERA4= <user>
##$USERA5= <user>
##$V9= 5
##$VALIST= <valist>
##$VCLIST= <CCCCCCCCCCCCCCC>
##$VD= 0
##$VDLIST= <DDDDDDDDDDDDDDD>
##$VPLIST= <PPPPPPPPPPPPPPP>
##$VTLIST= <TTTTTTTTTTTTTTT>
##$WBST= 1024
##$WBSW= 4
##$XGAIN= (0..3)
0 0 0 0
##$XL= 0
##$YL= 0
##$YMAX_a= 6255974
##$YMIN_a= -13567271
##$ZGOPTNS= <>
##$ZL1= 120
##$ZL2= 120
##$ZL3= 120
##$ZL4= 120
##$ABSF1= 14.96075
##$ABSF2= -5.597432
##$ABSG= 5
##$ABSL= 3
##$ALPHA= 0
##$AQORDER= 0
##$ASSFAC= 0
##$ASSFACI= 0
##$ASSFACX= 0
##$ASSWID= 0
##$AUNMP= <proc_prof1d_extract.lims>
##$AXLEFT= 0
##$AXNAME= <>
##$AXNUC= <1H>
##$AXRIGHT= 0
##$AXTYPE= 0
##$AXUNIT= <>
##$AZFE= 0.1
##$AZFW= 0.1
##$BCFW= 0
##$BC_mod= 0
##$BYTORDP= 0
##$COROFFS= 0
##$CY= 15
##$DATMOD= 1
##$DC= 0
##$DFILT= <>
##$DTYPP= 0
##$F1P= 0
##$F2P= 0
##$FCOR= 0.5
##$FTSIZE= 131072
##$FT_mod= 6
##$GAMMA= 0
##$GB= 0
##$INTBC= 1
##$INTSCL= 1
##$ISEN= 128
##$LB= 0.3
##$LEV0= 0
##$LPBIN= 0
##$MAXI= 10000
##$MC2= 0
##$MEAN= 0
##$ME_mod= 0
##$MI= 0
##$NCOEF= 0
##$NC_proc= -2
##$NLEV= 6
##$NOISF1= 0
##$NOISF2= 0
##$NSP= 0
##$NTH_PI= 0
##$NZP= 0
##$OFFSET= 14.96075
##$PC= 1
##$PHC0= -79.4751
##$PHC1= 0
##$PH_mod= 1
##$PKNL= yes
##$PPARMOD= 0
##$PPDIAG= 0
##$PPIPTYP= 0
##$PPMPNUM= 2147483647
##$PPRESOL= 1
##$PSCAL= 4
##$PSIGN= 0
##$PYNMP= <proc.py>
##$REVERSE= no
##$SF= 400.020009736238
##$SI= 131072
##$SIGF1= 0
##$SIGF2= 0
##$SINO= 400
##$SIOLD= 131072
##$SPECTYP= <>
##$SREGLST= <1H.CDCl3>
##$SSB= 0
##$STSI= 131072
##$STSR= 0
##$SW_p= 8223.68421052631
##$SYMM= 0
##$S_DEV= 0
##$TDeff= 65536
##$TDoff= 0
##$TI= <>
##$TILT= no
##$TM1= 0
##$TM2= 0
##$TOPLEV= 0
##$USERP1= <user>
##$USERP2= <user>
##$USERP3= <user>
##$USERP4= <user>
##$USERP5= <user>
##$WDW= 1
##$XDIM= 131072
##$YMAX_p= 387504311
##$YMIN_p= -11337
##$CURPLOT= <Network HP LaserJet P1505>
##$CURPRIN= <$Network HP LaserJet P1505>
##$DFORMAT= <normdp>
##$LAYOUT= <+/1D_H.xwp>
##$LFORMAT= <normlp>
##$PFORMAT= <normpl>
##$SURQMSG= 1
$$ End of Bruker specific parameters
$$ ---------------------------------
##NTUPLES= NMR SPECTRUM
##VAR_NAME=  FREQUENCY,     SPECTRUM/REAL,   SPECTRUM/IMAG
##SYMBOL=    X,             R,               I
##VAR_TYPE=  INDEPENDENT,   DEPENDENT,       DEPENDENT
##VAR_FORM=  AFFN,          ASDF,            ASDF
##VAR_DIM=   131072,        131072,          131072
##UNITS=     HZ,            ARBITRARY UNITS, ARBITRARY UNITS
##FACTOR=    0.0627417313425164, 1,          1
##FIRST=     8223.62146879497, 1661,         -68466
##LAST=      0,             4126,            -68569
##MIN=       0,             -11337,          0
##MAX=       8223.62146879497, 387504311,    0
$$ Real data points
##PAGE= N=1
##DATA TABLE= (X++(R..R)), XYDATA
$$ [...]
63839A848037m5548n1763n6773o0709o3731o6308o8611o9706o8437o5232o1971
63828A169248n9755n7816n4967n1028m6441m1499l6663l2689k9783k7398k5363
63817G05846k4299k4323k4351k3608k2823k2931k3326k2712k1079j9499j8305
63806D58590j6750j4525j2404j1152j0634j0237r559q476p139o062n747o115o599
63793C33191o748o425n631m627l924l700l463k883k541l085l907l730k447j385
63779B78695j489k145k246j694j284j520k116k430k140j495j065j081j098o34
63765B56258O2L35J13J1L21N60K71k49l97q5K37K06j14m16m69l68m00o53p98n40
63745B53885m2L57O90J136J445J197O15M61R98J645J868J817J869K077K386K846
$$ plain form
63839 1848037 1802489 1750726 1693953 1633244 1569513 1503205 1434594 1364888 1296451 1231219 1169248
63828 1169248 1109493 1051677 996710 945682 899241 857742 821079 788390 758607 731209 705846
63817 705846 681547 657224 632873 609265 586442 563511 540185 517473 496394 476895 458590
63806 458590 441840 427315 414911 403759 393125 382888 373329 364853 357714 351652 345905 339790 333191
63793 333191 326443 320018 314387 309760 305836 302136 298673 295790 293249 290164 286257 282527 280080 278695
63779 278695 277206 275061 272815 271121 269837 268317 266201 263771 261631 260136 259071 257990 256892 256258
63765 256258 256320 256655 256768 256779 257100 257660 257931 257682 257285 257200 257437 257643 257529 257113 256644 256276 255876 255223 254425 253885
63745 253885 253843 254200 254890 256026 257471 258668 259283 259744 260742 262387 264255 266072 267941 270018 272404 275250
63729B75250L330L439L140L014L451M017M099L879M034M688N230N172M697M251
63715C31691L952L584L008K380J872J311K47j397k968l685l559l235l051k791
63701C27359k454k558l269l787l152j400N51J872K326K102J662J619K265L232
63687C26368L922M176M193M025L547K862K272J862J479J090Q45P61O80N50N15
63672C59147O40Q88J293J932K645L091L150L054K968K705J936O47p76j919k714
63657C78687l392m067m526m626m652m966n338n158m380l667l411l141k336j258
63643C23769m90j8N56J212J653K026K788L895M822N422O030O661O791O234N588
63628C76939N414N476N201M527L947L890M342M938N250N213N261N862O908Q004
$$ plain form
63729 275250 278580 282019 285159 288173 291624 295641 299740 303619 307653 312341 317571 322743 327440 331691
63715 331691 335643 339227 342235 344615 346487 347798 348045 346648 343680 339995 336436 333201 330150 327359
63701 327359 324905 322347 319078 315291 312139 310739 311290 313162 315488 317590 319252 320871 323136 326368
63687 326368 330290 334466 338659 342684 346231 349093 351365 353227 354706 355796 356641 357402 358082 358632 359147
63672 359147 359787 360675 361968 363900 366545 369636 372786 375840 378808 381513 383449 384096 383320 381401 378687
63657 378687 375295 371228 366702 362076 357424 352458 347120 341962 337582 333915 330504 327363 325027 323769
63643 323769 323279 323261 323817 325029 326682 328708 331496 335391 340213 345635 351665 358326 365117 371351 376939
63628 376939 382353 387829 393030 397557 401504 405394 409736 414674 419924 425137 430398 436260 443168 451172
63614D51172R284J1341J4130J6601J7883J8327J8940K0216K2005K4163K6532K8539
63602F79133K9507K9404K8733K7498K4945K0520J4772Q938L897j34l121m916n533
63589H53643n489n528o082p179q895j1475j4804j8046k0364k1889k3365k4812
63577F85715k5235k3995k1829j9910j8343j6331j3574j0741q482o722n113l586
63565E11854k038j03K280M328N099M649M062M182M788N209N445O127P492Q997
63551E72371J0251J1878J4849J9088K3450K7240L1092L5834M1066M5459M8240
63540H80818M9457M8776M4901L6793K5163J2356Q80p731j3052j5409j5551j4311
63528A033090j2376j0359q987q904j0237j2573j5481j8837k2460k5740k8081k9672
$$ plain form
63614 451172 460456 471797 485927 502528 520411 538738 557678 577894 599899 624062 650594 679133
63602 679133 708640 738044 766777 794275 819220 839740 854512 863450 867347 867213 864092 859176 853643
63589 853643 848154 842626 836544 829365 820470 808995 794191 776145 755781 733892 710527 685715
63577 685715 660480 636485 614656 594746 576403 560072 546498 535757 527275 520553 515440 511854
63565 511854 509816 509713 511993 516321 521420 526069 530131 534313 539101 544310 549755 555882 563374 572371
63551 572371 582622 594500 609349 628437 651887 679127 710219 746053 787119 832578 880818
63540 880818 930275 979051 1023952 1060745 1085908 1098264 1099144 1091413 1078361 1062952 1047401 1033090
63528 1033090 1020714 1010355 1001368 992464 982227 969654 954173 935336 912876 887136 859055 829383
63516H29383l1269l2952l3618l2240k9382k6715k5030k3492k1140j8338j6149
63505E39058j4792j3605j2271j1199j0600j0050r301q805q961r292r006q070p141
63492D05965o572o024n146m142l405k912k253j282l77L2J25O11J865L363M187
63477C84035M092L746L895M606N394N818N613M621K958J171r2o98j050j527k073
63462D20509k330j979j004K18J043J045M76PpJ53J11l0J12N99J046J189J254J634
63444D24046K356L137L904M980O628Q612J0424J1886J3349J5368J8295K2145K6628
63431E71758L1325L5969M0381M3814M4549M0775L2307K1137J0019P52o023r977
63419H56786j0826q821m839K40N896J1685J7108K1955K6365L0222L2665L2576
$$ plain form
63516 829383 798114 765162 731544 699304 669922 643207 618177 594685 573545 555207 539058
63505 539058 524266 510661 498390 487191 476591 466541 457240 448435 439474 430182 421176 413106 405965
63492 405965 399393 393369 388223 384081 380676 377764 375511 374229 373852 373884 374009 374620 376485 379848 384035
63477 384035 388127 391873 395768 400374 405768 411586 417199 421820 424778 425949 425857 425159 424109 422582 420509
63462 420509 418179 416200 415196 415414 416457 417502 417978 417985 417978 418131 418242 418212 418324 418923 419969 421158 422412 424046
63444 424046 426402 429539 433443 438423 445051 453663 464087 475973 489322 504690 522985 545130 571758
63431 571758 603083 639052 679433 723247 767796 808571 840878 862015 872034 872786 866763 856786
63419 856786 845960 837139 832300 832540 838436 850121 867229 889184 915549 945771 978436 1011012
63407A011012K9519K4146J7689J1175N085l45m638p252q306q805r698j0968j2160
63394A036454j3566j6095j9927k4143k7923l1320l4324l6069l5828l4242l2577
63383G30440l1041k8844k5795k2796k0544j8722j6820j4903j3059j0868q088n387
63371E13573l563k402r92J015L101M867O612Q806J1417J4018J6274J8182K0082
63358F10990K2426K5363K8465L1131L3288L5418L7755L9771M0636M0005L8125
63347I83373L5218L1128K5657J9093J2218N775J32m430p427q573q497q547r570
63334A065550j1184j2638j4086j6493k0331k4830k8671l1052l1997l1965l1325
63323H10978l0035k7669k3918j9092j3932q968m290k8L202M413K660k458j0187
$$ plain form
63407 1011012 1040531 1064677 1082366 1093541 1098626 1098281 1093643 1086391 1078085 1069280 1059582 1048614 1036454
63394 1036454 1022888 1006793 986866 962723 934800 903480 869156 833087 797259 763017 730440
63383 730440 699399 670555 644760 621964 601420 582698 565878 550975 537916 527048 518960 513573
63371 513573 510010 507608 506616 507631 510732 515599 522211 531017 542434 556452 572726 590908 610990
63358 610990 633416 658779 687244 718375 751663 787081 824836 864607 905243 945248 983373
63347 983373 1018591 1049719 1075376 1094469 1106687 1112462 1112594 1108164 1100737 1092164 1083667 1075120 1065550
63334 1065550 1054366 1041728 1027642 1011149 990818 965988 937317 906265 874268 842303 810978
63323 810978 780943 753274 729356 710264 696332 687364 683074 683046 686248 690661 693321 690863 680676
63310F80676j8421k4663k7680k8023k6892k4967k2496j9885j7593j5661j3902
63299D40493j2371j1167r948q268o318m882m380m406m317l850l118k349j819j717
63285C61583j879j953j871j932k252k445k109j406r42j091j603j831j353m65p
63270C38444m02r91o89N92J734J796J213J139J930K882L393L718M363N176N509
63255C69807N105M457M170M260M294M080L919M124M629N275O186P512Q932R841
63241D46591J0100J0219J0655J1351J2087J3008J4422J6341J8408K0169K1283
63230F04634K1678K1767K2245K3370K4581K5158K5059K4819K4734K4588K4169
63219H66802K3650K3396K3596K4239K5115K5778K5696K4559K2392J9358J5668
$$ plain form
63310 680676 662255 637592 609912 581889 554997 530030 507534 487649 470056 454395 440493
63299 440493 428122 416955 407007 398739 392421 387539 383159 378753 374436 370586 367468 365119 363300 361583
63285 361583 359704 357751 355880 353948 351696 349251 347142 345736 344794 343703 342100 340269 338916 338451 338444
63270 338444 338042 337051 336362 336954 338688 340484 341697 342836 344766 347648 351041 354759 359122 364298 369807
63255 369807 374912 379369 383539 387799 392093 396173 400092 404216 408845 414120 420306 427818 436750 446591
63241 446591 456691 466910 477565 488916 501003 514011 528433 544774 563182 583351 604634
63230 604634 626312 648079 670324 693694 718275 743433 768492 793311 818045 842633 866802
63219 866802 890452 913848 937444 961683 986798 1012576 1038272 1062831 1085223 1104581 1120249
63208A120249J1610P403K853k526q881j5607k1671k6348k9599l1853l3507l4544
63196I37579l4531l3107l0455k7242k4023k0810j7315j3504r733o374l397m48
63184G16640K701N891Q818J1453J3982J6364J8196J9202J9637K0021K0562K1010
63172H94477K0977K0248J8892J7262J5805J4577J3131J1046Q448N662K584j169
63160A041940n498r805j3792j7791k1991k5844k8674l0510l1892l2941l3174l2246
63148G57782l0499k8565k6696k4685k2343j9859j7540j5401j3213j0953q996p607
63136E31425o543n377m147l262k843k592k387k494k955l232k779j770q27k59J39
63121D90097O14J161J658K010K176K199K195K200K181K261K672L303L622L353
$$ plain form
63208 1120249 1131859 1139262 1142115 1139589 1130708 1115101 1093430 1067082 1037483 1005630 972123 937579
63196 937579 903048 869941 839486 812244 788221 767411 750096 736592 726859 720485 717088 716640
63184 716640 719341 725232 734050 745503 759485 775849 794045 813247 832884 852905 873467 894477
63172 894477 915454 935702 954594 971856 987661 1002238 1015369 1026415 1034863 1040525 1043109 1041940
63160 1041940 1036442 1026637 1012845 995054 973063 947219 918545 888035 856143 823202 790028 757782
63148 757782 727283 698718 672022 647337 624994 605135 587595 572194 558981 548028 539032 531425
63136 531425 524882 519505 515358 512096 509253 506661 504274 501780 498825 495593 492814 491044 490217 489958 490097
63121 490097 490711 491872 493530 495540 497716 499915 502110 504310 506491 508752 511424 514727 518349 521702
63107E21702K988L138L608L632L010K394K338K600K638K403K243K272K278K197
63093E59441K344L042M210N401O242O703O881O598N426L237N80j649k949l464
63079F02043l581l397k687j318L92J855K856L838N287O892P832P913P943Q641
63065F44509R734J0627J1472J2915J4981J7029J8724K0399K2411K4788K7550L0720
63053H65859L3928L6742L9491M3006M7245N1026N3531N5344N7371N9467O0895
63042A403905O1646O2300O2920O3019O2608O2447O3018O3879O4281O4004O3349
63031B097376O2575O1434N9122N4694M7765L8722K8111J6122K920j0891k4651
63020B433299l8151n1135o2535p1058p6519p9868q1740q1717p9219p4481o8345
$$ plain form
63107 521702 524690 527828 531436 535068 538078 540472 542810 545410 548048 550451 552694 554966 557244 559441
63093 559441 561785 564827 569037 574438 580680 587383 594264 600862 606288 609525 610105 608456 605507 602043
63079 602043 598462 595065 592378 591060 591452 593307 596163 600001 605288 612180 620012 627925 635868 644509
63065 644509 654243 664870 676342 689257 704238 721267 739991 760390 782801 807589 835139 865859
63053 865859 899787 936529 976020 1019026 1066271 1117297 1170828 1226172 1283543 1343010 1403905
63042 1403905 1465551 1527851 1590771 1653790 1716398 1778845 1841863 1905742 1970023 2034027 2097376
63031 2097376 2159951 2221385 2280507 2335201 2382966 2421688 2449799 2465921 2468841 2457950 2433299
63020 2433299 2395148 2344013 2281478 2210420 2133901 2054033 1972293 1890576 1811357 1736876 1668531
63009A668531o1625n4901m8346m1502l3687k4931j6050p602N01Q037J4008J7817
62997A420250K0322K2870K5646K7736K8567K8542K8335K8303K8566K9054K9390
62986A717581K9177K8390K7087K4956K1661J7459J2811P439O10p640j6400k5098
62974A838033l3888m2452m9469n4059n7002n9636o1914o2571o1029n8166n5023
62963A242824n1668m7723m3435l9597l6650l4306l2032k9569k6999k4546k2422
62952H53877k0777j9639j8890j8325j7750j7115j6482j5866j5214j4489j3782
62941F65548j3168j2583j1943j1291j0666r844q513o762n182m228l699l109k443
62928E62117k124k241k256j739j005o00m81k37J2l95j610k889l513l545l337k791
$$ plain form
63009 1668531 1606906 1552005 1503659 1462157 1428470 1403539 1387489 1379887 1380388 1388425 1402433 1420250
62997 1420250 1440572 1463442 1489088 1516824 1545391 1573933 1602268 1630571 1659137 1688191 1717581
62986 1717581 1746758 1775148 1802235 1827191 1848852 1866311 1879122 1886561 1887171 1879531 1863131 1838033
62974 1838033 1804145 1761693 1712224 1658165 1601163 1541527 1479613 1417042 1356013 1297847 1242824
62963 1242824 1191156 1143433 1099998 1060401 1023751 989445 957413 927844 900845 876299 853877
62952 853877 833100 813461 794571 776246 758496 741381 724899 709033 693819 679330 665548
62941 665548 652380 639797 627854 616563 605897 596053 587540 580778 575596 571368 567669 564560 562117
62928 562117 559993 557752 555496 553757 552752 552152 551671 551434 551446 551051 549441 546552 543039 539494 536157 533366
62912E33366j809r89j041j634j673q44j06l61j315k089k385k520k681k738k621
62897E08560k395k028j432o67J90J186K179K577J927O76j77k67j81m97r81j115
62881E07555r29q68j029r84l66O78J727K438K557J931P30m37j000j081j415k553
62865E06954m206n515n804m984l450j919j207j717k912l584k908j212L78R91O23
62850D69528q4m31r7P81J799K616L090L217K991K386J439L55m36n33l3L72O9p41
62832D86288j271j107n82k03q2n4K1L29J084K118K843K880K529K356K578L115
62816E02842L803M286M015K950J933J839K531L199L560M077N026N945O242N898
62802E58146N406N344O010P232Q463R340J0110J1164J2335J3101J3424J3870J4883
$$ plain form
62912 533366 531557 530568 529527 527893 526220 525376 525270 524909 523594 521505 519120 516600 513919 511181 508560
62897 508560 506165 504137 502705 502038 502228 503414 505593 508170 510097 510773 510596 510329 510148 509651 508670 507555
62881 507555 506626 505758 504729 503745 503379 504057 505784 508222 510779 512710 513440 513003 512003 510922 509507 506954
62865 506954 502748 497233 491429 486445 482995 481076 479869 478152 475240 471656 468748 467536 467914 468905 469528
62850 469528 469444 469013 468916 469697 471496 474112 477202 480419 483410 485796 487235 487590 487154 486621 486588 486960 487029 486288
62832 486288 485017 483910 483328 483125 483043 482989 483010 483339 484423 486541 489384 492264 494793 497149 499727 502842
62816 502842 506645 510931 514946 517896 519829 521668 524199 527398 530958 535035 540061 546006 552248 558146
62802 558146 563552 568896 574906 582138 590601 599941 610051 621215 633550 646651 660075 673945 688828
62789F88828J6450J8522K1188K4292K7425L0509L3958L8069M2741M7950N4021
62778A043953O1073O8616P6030Q3090Q9759R5729J00467J03511J04529J03356
62768A930113J00128R4976Q7461P6840O3147M7660L1808J5984k10j6839l3202
62757B397866m8273o1218p1636p9695q5985r0945r4500r6294r6084r3870q9985
62746A489381q5176q0262p5446p0338o4796n9302n4274m9576m5001m0748l6965
62735H27497l3317k9483k5641k2033j8582j5492j3585j3244j3416j2614j0656
62724F19434q610p152n940m548l147j975q51N06K080L630M805N299N290N577O818
62709F21216Q757J0768J2842J5348J8162K0879K3757K7362L1358L4781L7664M1222
$$ plain form
62789 688828 705278 723800 744988 769280 796705 827214 861172 899241 941982 989932 1043953
62778 1043953 1105026 1173642 1249672 1332762 1422521 1518250 1618717 1722228 1826757 1930113
62768 1930113 2030241 2125217 2212678 2289518 2352665 2400325 2432133 2448117 2447907 2431068 2397866
62757 2397866 2349593 2288375 2216739 2137044 2051059 1960114 1865614 1769320 1673236 1579366 1489381
62746 1489381 1404205 1323943 1248497 1178159 1113363 1054061 999787 950211 905210 864462 827497
62735 827497 794180 764697 739056 717023 698441 682949 669364 656120 642704 630090 619434
62724 619434 610824 603672 597732 593184 590037 588062 587211 587717 589797 593427 598232 603531 608821 614398 621216
62709 621216 629973 640741 653583 668931 687093 707972 731729 759091 790449 825230 862894 904116
62697I04116M6028N1099N5350N8927O2438O5717O8252P0072P1348P1576P0001
62686A594924O6508O1320N4194M4674L2974J9998O610o579j9027l0480m1157n1133
62674A732826n9752o6149p0169p2207p2479p1144o8857o6340o3501n9752n5274
62663A007202n1061m7563m4135m0144l5964l2338k9340k6534k3792k1392j9423
62652F35516j7611j5765j4033j2653j1657j0943j0489j0311j0218r732q511o806
62640D96787n337m525m068l476k804k471k488k293j509n21l8k80p80r28n52n2
62624D64665p7r80k436l546l482k166l59R89J463J338J133J206J771K866M118
62609D66503M830M775M666N367O693P660P991Q610J0368J2899J5218J6963J8525
$$ plain form
62697 904116 950144 1001243 1056593 1115520 1177958 1243675 1311927 1381999 1453347 1524923 1594924
62686 1594924 1661432 1722752 1776946 1821620 1854594 1874592 1881202 1874623 1855596 1825116 1783959 1732826
62674 1732826 1673074 1606925 1536756 1464549 1392070 1320926 1252069 1185729 1122228 1062476 1007202
62663 1007202 956141 908578 864443 824299 788335 755997 726657 700123 676331 654939 635516
62652 635516 617905 602140 588107 575454 563797 552854 542365 532054 521836 512104 503593 496787
62640 496787 491450 486925 482857 479381 476577 474106 471618 469325 467816 467295 467257 466977 466197 465269 464717 464665
62624 464665 464588 463608 461172 457626 454144 451978 451619 452608 454071 455409 456542 457748 459519 462385 466503
62609 466503 471333 476108 480774 486141 492834 500494 508485 517095 527463 540362 555580 572543 591068
62596E91068K0333K2589K5436K8810L2345L5862L9643M3672M7004M8625M8728
62585I84115M8319M7581M5488M1222L5149K8107K0423J2102L385n334j3790k1647
62573A225120k8340l3530l7519m0799m3404m4924m5042m3817m1633l9128l6926
62562G90058l5170l3380l0986k7907k4559k1459j8938j6982j5232j3348j1467
62551E40630j0038r162q466p722p086o490n447l933k870k993l576l195j579J09
62537D68182R16J143J465J851J891J658J505J368R23L07P2M75J307K461M171O422
62521D96117Q654J0278J1378J2566J4328J6684J9350K2067K4745K7399K9919L2061
62509G25546L3897L6062L9114M2468M4540M4265M2055L8856L4834K9647K3574
$$ plain form
62596 591068 611401 633990 659426 688236 720581 756443 796086 839758 886762 935387 984115
62585 984115 1032434 1080015 1125503 1166725 1201874 1229981 1250404 1262506 1265891 1260557 1246767 1225120
62573 1225120 1196780 1163250 1125731 1084932 1041528 996604 951562 907745 866112 826984 790058
62562 790058 754888 721508 690522 662615 638056 616597 597659 580677 565445 552097 540630
62551 540630 530592 521430 512964 505242 498156 491666 486219 482286 479416 476423 472847 469652 468073 468182
62537 468182 469098 470241 471706 473557 475448 477106 478611 479979 480902 481209 481281 481756 483063 485524 489695 496117
62521 496117 504771 515049 526427 538993 553321 570005 589355 611422 636167 663566 693485 725546
62509 725546 759443 795505 834619 877087 921627 965892 1007947 1046803 1081637 1111284 1134858
62498A134858J7378J1130M197l363j0313j5624j9449k2227k3628k3246k1730k0132
62486A007851j8445j5735j1662o961k391J864N616Q427J0381J2319J4745J7017
62474A023026J8087J7579J5616J2141P168J505l683q116j2672j8179k4351l0090
62462I98031l4545l7518l9154l9587l8979l7646l5945l4086l2054k9731k7013
62451F11773k3887k0462j7001j3847j1325r609q611p799o364l941j244M81Q49
62438D89013Q35J567K977M136M610M787M914M607L570K191R73k33j931m114o095
62423E11807p219p455p298p244p363p327o793n800m790m219m243m596m695m075
62409D28690k978k319k682l498l638k788j721j229j318j616j911j994j515m52
$$ plain form
62498 1134858 1152236 1163366 1167563 1164200 1153887 1138263 1118814 1096587 1072959 1049713 1027983 1007851
62486 1007851 989406 973671 962009 955048 952657 954521 960137 968564 978945 991264 1006009 1023026
62474 1023026 1041113 1058692 1074308 1086449 1093617 1095122 1091439 1083323 1070651 1052472 1028121 998031
62462 998031 963486 925968 886814 847227 808248 770602 734657 700571 668517 638786 611773
62451 611773 587886 567424 550423 536576 525251 515642 507031 499232 492868 488927 487683 488164 489013
62438 489013 489848 491415 494392 498528 503138 507925 512839 517446 521016 523207 524180 523947 522016 517902 511807
62423 511807 504588 497133 489835 482591 475228 467901 461108 455308 450518 446299 442056 437460 432765 428690
62409 428690 425712 423393 420711 417213 413575 410787 409066 407837 406519 404903 402992 400998 399483 399031
62395C99031O73J487K290L433M520M796M203L425K959K628K158J783J992K880
62381D38258L949M558M518M222M164M388M625M900N664P108Q673R566R628R415
62367E23636R501R983J0610J1213J1936J3134J5039J7553K0380K3363K6490K9741
62355G22579L3207L7287M2252M7543N1922N4591N5657N5376N3450M9470M3649
62344A246983L6678K9099K1237J3406N866j264p759j3350j8241k3124k8208l2717
62332A228606l5800l7467l8064l7469l5600l3250l1378k9800k7570k4622k2054
62321H75532k0706k0376k0552k1003k1388k1221k0592k0238k0458k0647k0241
62310F48110j9502j8807j7898j6385j4494j2709j1104r524q091o917n676m098
$$ plain form
62395 399031 399704 401191 403481 406914 411434 416230 420433 423858 426817 429445 431603 433386 435378 438258
62381 438258 442207 446765 451283 455505 459669 464057 468682 473582 479246 486354 495027 504593 514221 523636
62367 523636 533137 543120 553730 564943 576879 590013 605052 622605 642985 666348 692838 722579
62355 722579 755786 793073 835325 882868 934790 989381 1045038 1100414 1153864 1203334 1246983
62344 1246983 1283661 1312760 1333997 1347403 1353269 1352005 1344246 1330896 1312655 1289531 1261323 1228606
62332 1228606 1192806 1155339 1117275 1079806 1044206 1010956 979578 949778 922208 897586 875532
62321 875532 854826 834450 813898 792895 771507 750286 729694 709456 688998 668351 648110
62310 648110 628608 609801 591903 575518 561024 548315 537211 527687 519596 512679 507003 502905
62298E02905k687k256k801l371l156k267j324o74j91L42Q98J290J530J908K571
62283D92717L197L378L184K909K413J388L05K67J501K762K864K236K173K969L719
62268E27982L837L785M165M981O170Q124J1088J4370J6933J8706K0806K4297K9051
62255F94295L4081L8708M2996M7134N0911N4059N6565N8191N8048N5352N0527
62244A240867M4762L8413L0700K1283J1216J772o922j5341k3286l0127l5946m1339
62232A236052m6219m9778n1746n2655n2684n1238m8034m3892l9792l5896l2020
62221G32098k8470k5628k3174k0526j7849j5816j4481j3123j1362r693q665q088
62209E35223p446o670o068n770n614n449n129m408l147j672n44JJ36M9j22jQ86
$$ plain form
62298 502905 500218 497962 495161 491790 488634 486367 485043 484369 484178 484520 485418 486708 488238 490146 492717
62283 492717 495914 499292 502476 505385 507798 509186 509491 509758 511259 514021 516885 519121 521294 524263 527982
62268 527982 531819 535604 539769 544750 550920 559044 570132 584502 601435 620141 640947 665244 694295
62255 694295 728376 767084 810080 857214 908125 962184 1018749 1076940 1134988 1190340 1240867
62244 1240867 1285629 1324042 1354742 1376025 1387241 1389013 1382091 1366750 1343464 1313337 1277391 1236052
62232 1236052 1189833 1140055 1088309 1035654 982970 931732 883698 839806 800014 764118 732098
62221 732098 703628 678000 654826 634300 616451 600635 586154 573031 561669 551976 543311 535223
62209 535223 527777 521107 515039 509269 503655 498206 493077 488669 485522 483850 483306 483307 483443 483492 483370 483369 484255
62192D84255K427L885M794N507O467P384P770P953Q738J0079J0929J0653R824
62179E80665R247Q824P990O761N617M650L578K550K237K996M493O351Q688J1797
62165F66444J5564J9600K3699K7932L2292L6437L9797M1906M2670M2213M0442
62154A028996L6929L1522K4959J8448J2588P049J436l950q665j2985j7644k2636
62142A096047k6838k9143k9611k9116k8100k6171k3025j9149j5257j1426p234
62131H50977k627J893N902R354J2234J4386J5944J7413J9040K0448K1259K1734
62119A007957K2331K2933K2940K2057K0501J8527J6157J3294R772N382J91n184
62107A176858j0030j4119j7471j9678k0110j8830j6810j4922j3248j1547r936
$$ plain form
62192 484255 486682 490567 495361 500868 507335 514719 522489 530442 539180 549259 560188 570841 580665
62179 580665 589912 598736 606726 613487 619104 623754 627332 629882 632119 635115 639608 645959 654647 666444
62165 666444 682008 701608 725307 753239 785531 821968 861765 903671 946341 988554 1028996
62154 1028996 1065925 1097447 1122406 1140854 1153442 1160491 1161927 1157977 1149312 1136327 1118683 1096047
62142 1096047 1069209 1040066 1010455 981339 953239 927068 904043 884894 869637 858211 850977
62131 850977 848350 850243 856145 865499 877733 892119 908063 925476 944516 964964 986223 1007957
62119 1007957 1030288 1053221 1076161 1098218 1118719 1137246 1153403 1166697 1176469 1181851 1182042 1176858
62107 1176858 1166828 1152709 1135238 1115560 1095450 1076620 1059810 1044888 1031640 1020093 1010157
62096A010157q691p643o214m053j365J308L496M982N807O170O280O295O204N846
62082A028579N177M646M923O107P509Q593R743J1520J3568J5057J5989J7070J8281
62069A166762J8670J7934J7058J6731J6142J4362J2167J1278J2102J3504J4736
62058A331446J6296J8564K0701K1566K1039J9718J7748J4725J0646O262K281j430
62046A499562n644j0920j7038k3249k8922l3956l8550m2728m6183m8528m9668
62035A154176m9910m9717m9234m8086m5765m2361l8607l5135l1906k8609k5318
62024G09528k2335j9656j7091j4871j3533j3107j2888j2263j1328j0505r954r610
62012E42387r451r303q723p470n932m690l797k915k000j311o90M93K446M443N616
$$ plain form
62096 1010157 1001466 993823 987609 983556 982191 983499 986995 991977 997784 1003954 1010234 1016529 1022733 1028579
62082 1028579 1033756 1038402 1043325 1049432 1056941 1065534 1075277 1086797 1100365 1115422 1131411 1148481 1166762
62069 1166762 1185432 1203366 1220424 1237155 1253297 1267659 1279826 1291104 1303206 1316710 1331446
62058 1331446 1347742 1366306 1387007 1408573 1429612 1449330 1467078 1481803 1492449 1498711 1500992 1499562
62046 1499562 1493918 1482998 1465960 1442711 1413789 1379833 1341283 1298555 1252372 1203844 1154176
62035 1154176 1104266 1054549 1005315 957229 911464 869103 830496 795361 763455 734846 709528
62024 709528 687193 667537 650446 635575 622042 608935 596047 583784 572456 561951 551997 542387
62012 542387 532936 523633 514910 507440 501508 496818 493021 490106 488106 486795 486105 486598 489044 493487 499103
61997D99103N910N865N657M967L713K406J526J002M56k75j182k356l904n653p282
61982E09953q589r418r519q856p972p522p471p168o317n386m846m489l872l075
61968D15453k548k415k366k143j729j166n25o8n7l06k41M76J582K487K799K602
61952D11835K403K756L749M927N867O704P828R198J0351J1037J1510J2148J3148
61939E13461J4538J6160J7573J8377J8698J9030J9518J9818J9692J9259J8528
61928G14652J7233J5441J3758J2475J0992Q649N714K989O66j692m166o257p701
61915G82753q801r668r727q415o007l312q18J495L733N914Q157J0598J2997J4700
61901G93599J5217J4602J3134J0845P586L597l93l821o853r945j2965j5146j6097
$$ plain form
61997 499103 505013 510878 516535 521502 525215 527621 529147 530149 530605 530330 529148 526792 522888 517235 509953
61982 509953 501364 491946 482427 473571 465599 458077 450606 443438 437121 431735 426889 422400 418528 415453
61968 415453 412905 410490 408124 405981 404252 403086 402561 402493 402436 402130 401889 402365 403947 406434 409233 411835
61952 411835 414238 416994 420743 425670 431537 438241 446069 455267 465618 476655 488165 500313 513461
61939 513461 527999 544159 561732 580109 598807 617837 637355 657173 676865 696124 714652
61928 714652 731885 747326 761084 773559 784551 793200 798914 801903 802569 800877 796711 790454 782753
61915 782753 773952 764284 754557 746142 740135 736823 736005 737500 741233 747147 755304 765902 778899 793599
61901 793599 808816 823418 836552 847397 854983 858580 858187 854366 847513 837568 824603 809457 793360
61888G93360j6426j7009j7878j8264j7659j6361j4985j3846j2989j2415j1965
61877F23563j1356j0582j0034r872r552q452o846n625n079m503l287j811q00k37
61863E35527M78J531K598L698N439Q054J0864J3135J5034J7173J9509K1436K2837
61850F77313K4293K6164K8076K9657L1175L2991L4662L5159L3880L1137K7675
61839A012182K3987K0097J5741J0737N219m16n755j0420j3887j5635j5602j4224
61827A012024j1835q415m139K50M076P426J0644J3426J5016J5148J4087J1805
61815A079513P877K464l327q454j2873j7114k1284k4919k7535k8968k9311k8872
61803H87197k8024k6903k5346k3298k1109j9228j7774j6548j5269j3726j1927
$$ plain form
61888 793360 776934 759925 742047 723783 706124 689763 674778 660932 647943 635528 623563
61877 623563 612207 601625 591591 581719 572167 563715 556869 551244 546165 541662 538375 536564 535764 535527
61863 535527 536005 537536 540134 543832 549271 557325 568189 581324 596358 613531 633040 654476 677313
61850 677313 701606 727770 755846 785503 816678 849669 884331 919490 953370 984507 1012182
61839 1012182 1036169 1056266 1072007 1082744 1087963 1087547 1081792 1071372 1057485 1041850 1026248 1012024
61827 1012024 1000189 991774 987635 987885 991961 999387 1010031 1023457 1038473 1053621 1067708 1079513
61815 1079513 1087390 1089854 1086527 1078073 1065200 1048086 1026802 1001883 974348 945380 916069 887197
61803 887197 859173 832270 806924 783626 762517 743289 725515 708967 693698 679972 668045
61792F68045j0248r130q490p807o948o402o482o729o557o034n524m990m219l377
61778E75108k693j911q17n0m35j594k214j878j604k166k891k778k064j711j866
61763E48436j817j312r18r87j074p93n42q81j576j773j085m2N62N00J77Q5L29
61746E37289O29O33K33m15j070j584j825j615r74l73m00r38j062j40J243K033
61730E31664K233K864M268N313M951L828L512M454N627O078N935N767N748N871
61716E98113O309P129P927Q093P324N799M056K664J721P15p31k184k937l072l271
61701F37655l645l700l581m249n944p473p694o933o182n671n128m760m890n000
61687E62805m294k942j884j470j358j500k166k963l001k263j803k224k940l295
$$ plain form
61792 668045 657797 648667 640177 632370 625422 619020 612538 605809 599252 593218 587694 582704 578485 575108
61778 575108 572415 570504 569687 569637 569202 567608 565394 563516 561912 559746 556855 554077 552013 550302 548436
61763 548436 546619 545307 544389 543402 542328 541535 540993 540112 538536 536763 535678 535636 536198 536698 536875 536960 537289
61746 537289 537918 538551 538784 538369 537299 535715 533890 532275 531301 530928 530528 529590 528528 528388 529631 531664
61730 531664 533897 536761 541029 546342 551293 555121 558633 563087 568714 574792 580727 586494 592242 598113
61716 598113 604422 611551 619478 627571 634895 640694 644750 647414 649135 649850 649119 646935 643998 640926 637655
61701 637655 634010 630310 626729 622480 616536 609063 601369 594436 588254 582583 577455 572695 567805 562805
61687 562805 558511 555569 553685 552215 550857 549357 547191 544228 541227 538964 537161 534937 531997 528702
61673E28702l454l710l714l137k375j929j582r49l29k92p02r44r31j113j542j664
61657E00335j154m15K2J15J07N0j62m59o13n29k81J81J036K132K765K302J116
61640E06548L66O74J407J628J271P72O1j208k538k839k046j525k303l677m227
61625D92364l705l096l160l663l934l602k726j629o94j07J28r6q98j851k018j105
61609D60208j58m80k104l905n018n448n439n050m541m458m900n239m894m123l656
61594D00795l781m127m260m163m061l972l685l148k708k700k939k932k598k380
61580C53341k508k605k289j753j438j518j994k875l759l749k459q68k65n76n61
61565C24124L28J216J153L23m98r86j243j239q58k88J41L19L09J43m8N1N88J222
$$ plain form
61673 528702 525248 521538 517824 514687 512312 510383 508801 507852 507523 507231 506529 505585 504654 503541 501999 500335
61657 500335 499181 498766 498788 498903 499010 499060 498898 498439 497826 497297 497016 497197 498233 500365 503130 505432 506548
61640 506548 506914 507588 508995 510623 511894 512666 512727 511519 508981 506142 504096 502571 500268 496591 492364
61625 492364 488659 485563 482403 478740 474806 471204 468478 466849 466155 466048 466176 466080 465182 463331 461313 460208
61609 460208 460050 459570 457466 453561 448543 443095 437656 432606 428065 423607 418707 413468 408574 404451 400795
61594 400795 397014 392887 388627 384464 380403 376431 372746 369598 366890 364190 361251 358319 355721 353341
61580 353341 350833 348228 345939 344186 342748 341230 339236 336361 332602 328853 326394 325526 325261 324685 324124
61565 324124 324452 325668 326821 327144 326646 325660 324417 323178 322320 322032 322173 322492 322801 322944 322896 322947 323535 324757
61547C24757J465J200P42M49M45N75N77L87K87N82J174J706K036K227K160J719
61531C42488J329J593K217K049O79p23q79k06k75j661l302m009l823l462l154
61516C28861k616j884j492j663j828j272j24P04O20M6k72k85n38j182j714j749
61500C13612j478j184q48n42o52j254j684j280k82N16P14M49r9q02j295j301j111
61483C01479j147j133m27P91J428R33J23J02Q78J612J861J991K336K595K260J369
61467C17051O22O88J424J919J428K42o02n19LJ28l01p26o89l13J5J63L21O76J102
61448C22632J222P87N2l77j32N01Q93P68M47M44R22J616K197K596K975L399L676
61431C44618L554L037K379J770J229P89O34Q25J038Q53L32O7M91J337J913J923
$$ plain form
61547 324757 326222 327422 328164 328613 329058 329633 330210 330597 330884 331466 332640 334346 336382 338609 340769 342488
61531 342488 343817 345410 347627 349676 350355 349632 348753 348547 348272 346611 343309 339300 335477 332015 328861
61516 328861 326245 324361 322869 321206 319378 318106 317982 318686 319306 319352 319080 318795 318257 317075 315361 313612
61500 313612 312134 310950 310102 309560 308908 307654 305970 304690 304408 304924 305638 306087 305988 305186 303891 302590 301479
61483 301479 300332 299199 298772 299563 300991 301924 302047 302149 303027 304639 306500 308491 310827 313422 315682 317051
61467 317051 317673 318361 319785 321704 323132 323374 322772 322253 322256 322384 322083 321357 320668 320355 320370 320533 320854 321530 322632
61448 322632 323854 324641 324693 324316 324184 324685 325578 326346 326793 327237 328159 329775 331972 334568 337543 340942 344618
61431 344618 348172 351209 353588 355358 356587 357376 358010 358835 359873 360726 361058 361125 361616 362953 364866 366789
61415C66789J771K005K675L338L574L209K229P59p45j618j601j161r93j282j677
61400C77272j875j918j921j916k072k705l787m636m490l379k132j448j244r84
61386C42765m32J66M98M71J97j60l90l18L4M54P59R55J122J244J227J037P62O02
61368C50993P60J275J832J948J457P37L68O24J405K451L401L827L529K830K366
61353C79803K518L215M178N144N895O399O981Q005R328J0312J0517J0098R449
61340D71842Q681P787O968O559O627O824O636N729M208K613J489Q59L14l97j111
61325E35628j644k062k461k798l108l444l483k696j279l20m92j009n78Q79K307
61310E13440L121L800M798N778O352O853P861R356J0895J2249J3441J4316J4548
$$ plain form
61415 366789 368560 370565 373240 376578 380152 383361 385590 386349 385604 383986 382385 381224 380231 378949 377272
61400 377272 375397 373479 371558 369642 367570 364865 361078 356442 351952 348573 346441 344993 343749 342765
61386 342765 342333 342499 342997 343468 343665 343505 343115 342797 342831 343285 344044 344999 346121 347365 348592 349629 350391 350993
61368 350993 351753 353028 354860 356808 358265 359002 359370 359994 361399 363850 367251 371078 374607 377437 379803
61353 379803 382321 385536 389714 394858 400753 407152 414133 422138 431466 441778 452295 462393 471842
61340 471842 480523 488310 495278 501837 508464 515288 521924 527653 531861 534474 535963 536822 537136 536739 535628
61325 535628 533984 531922 529461 526663 523555 520111 516628 513932 512653 512333 511841 510832 510254 511133 513440
61310 513440 516561 520361 525159 530937 537289 544142 552003 561359 572254 584503 597944 612260 626808
61297F26808J3949J2492J0131O944L401J71k326m105n440o664p945r036r438r045
61283F19897q436q187q137p698o847o157n809n198l864k366j626j646j440k94
61269E52192J422K841L555L767L801L861M045M288M421M496M929O020P476Q691
61255F15805R451J0006J0568J1073J1382J1321J0588R107P451O330N628M502K609
61242G25821N57j108k616m220n474n892n855o033o344o182n412m358l119j676
61228F68089n30k47m30M0J596L565N266O660P757Q172P760O964O272N800N784
61213G32518O640Q124R054Q566P195O097N571M985L946K810K112J984K230K626
61199H04458L091L688M545N716P248R310J1928J4644J6806J8336J9695K0976K1620
$$ plain form
61297 626808 640757 653249 663380 670324 673725 673896 671570 667465 662025 655361 647416 638380 628942 619897
61283 619897 611461 603274 595137 587439 580592 574435 568626 563428 559564 557198 555572 553926 552486 552192
61269 552192 553614 556455 560010 563777 567578 571439 575484 579772 584193 588689 593618 599638 607114 615805
61255 615805 625256 635262 645830 656903 668285 679606 690194 699301 706752 713082 718710 723212 725821
61242 725821 726378 725270 722654 718434 712960 707068 701213 695180 688836 682654 677242 672884 669765 668089
61228 668089 667559 667312 666882 666922 668518 672083 677349 684009 691766 699938 707698 714662 720934 726734 732518
61213 732518 739158 747282 756336 764902 772097 778194 783765 788750 792696 795506 797618 799602 801832 804458
61199 804458 807549 811237 815782 821498 828746 838056 849984 864628 881434 899770 919465 940441 962061
61186I62061K1303K0473J9579J8342J6398J4128J2217J0718R287Q027P348P069
61174A126950O391M790K432k50k831m860o180p353r114j1375j3300j4500j5575
61161A055225j7211j9241k0929k1849k2162k2217k2146k1824k1127k0190j9301
61150H27028j8403j6967j4644j1828r192o856m546k468j284j158j474j796k468
61137G33944l887n588o625o588n859n018m244l220j454J106L678N246N777O436
61123G13704Q270J1040J3764J6055J8271K0674K3150K5791K8917L2261L4901L6411
61111I83209L7518L9011M0470M0825L9921L8713L7825L6799L5034L2749L0456
61100A392530K8028K4903K0995J6673J1993O619N83n487j1086j6366k1669k6878
$$ plain form
61186 962061 983364 1003837 1023416 1041758 1058156 1072284 1084501 1095219 1104506 1112533 1119881 1126950
61174 1126950 1133341 1138131 1140563 1140313 1137482 1132622 1126442 1119089 1109975 1098600 1085300 1070800 1055225
61161 1055225 1038014 1018773 997844 975995 953833 931616 909470 887646 866519 846329 827028
61150 827028 808625 791658 777014 765186 755994 749138 744592 742124 740840 739682 738208 736412 733944
61137 733944 730057 724469 717844 711256 705397 700379 696135 692915 691461 692567 696245 701491 707268 713704
61123 713704 721974 733014 746778 762833 781104 801778 824928 850719 879636 911897 946798 983209
61111 983209 1020727 1059738 1100208 1141033 1180954 1219667 1257492 1294291 1329325 1362074 1392530
61100 1392530 1420558 1445461 1466456 1483129 1495122 1501741 1502324 1496837 1485751 1469385 1447716 1420838
61088A420838l1467l4958l7134l8085l8201l7985l7697l7263l6557l5547l4196
61077A021748l2553l0906k9469k7879k5531k2560j9980j8530j7748j6530j4343
61066G65719j1589r078p393o546n954m962l447j779j98J278K428L000L447M630
61052G29556O478P826Q136Q518J0227J2843J4927J6004J6874J8230J9996K1897
61040H91512K3817K5581K7091K8608L0371L2122L3587L5054L6729L7981L8177
61029A240630L7955L8577M0219M1947M3294M4608M5910M6616M6666M6722M6999
61018A720143M6956M6634M7300N0263N5702O2970P1317Q0200Q9702J00812J14596
61007B486595J31347J51809J78905K16669K67371L31515M10602N07454O23758
$$ plain form
61088 1420838 1389371 1354413 1317279 1279194 1240993 1203008 1165311 1128048 1091491 1055944 1021748
61077 1021748 989195 958289 928820 900941 875410 852850 832870 814340 796592 780062 765719
61066 765719 754130 745052 737659 731113 725159 720197 716750 714971 714773 716051 718479 721479 724926 729556
61052 729556 736034 743860 751996 760514 770741 783584 798511 814515 831389 849619 869615 891512
61040 891512 915329 940910 968001 996609 1026980 1059102 1092689 1127743 1164472 1202453 1240630
61029 1240630 1278585 1317162 1357381 1399328 1442622 1487230 1533140 1579756 1626422 1673144 1720143
61018 1720143 1767099 1813733 1861033 1911296 1966998 2029968 2101285 2181485 2271187 2371999 2486595
61007 2486595 2617942 2769751 2948656 3165325 3432696 3764211 4174813 4682267 5306025
60998E306025P60951R24517J121552J348396J583505J798862J975725K097604
60990A6917137K124493J990776J653701J154812O23873K06555k0383p0616n048
60981B4575300J10282K02721J80496l8120m63286j005916j522382j894099k075319
60972A8069677k085558j974739j794782j586465j375966j177195r97235q39977
60964F237760p06260n94021n00370m22957l59333l06865k63989k30093k03492
60955B650380j81123j60930j43038j27782j14104j00995q8996p8977p0414o2350
60945A521671n5171n0093m7359m6102m5580m5443m5117m4025m2281m0373l8269
60934A021858l5624l2641l0028k8155k6875k6045k5509k4696k2932k0339j7925
$$ plain form
60998 5306025 6066976 6991493 8113045 9461441 11044946 12843808 14819533 16917137
60990 16917137 19041630 21032406 22686107 23840919 24464792 24671347 24650964 24580348 24575300
60981 24575300 24685582 24888303 25068799 25030679 24567393 23561477 22039095 20144996 18069677
60972 18069677 15984119 14009380 12214598 10628133 9252167 8074972 7077737 6237760
60964 6237760 5531500 4937479 4437109 4014152 3654819 3347954 3083965 2853872 2650380
60955 2650380 2469257 2308327 2165289 2037507 1923403 1822408 1733412 1654435 1584021 1521671
60945 1521671 1466500 1416407 1369048 1322946 1277366 1231923 1186806 1142781 1100500 1060127 1021858
60934 1021858 986234 953593 923565 895410 868535 842490 816981 792285 769353 749014 731089
60923G31089j6620j6372j6282j5471j3810j1920j0400r199p939o704n925n526
60911E94921m880l762k711k095j541p10J4K15K62P82J657K249K302K053J638J032
60895E91426M04l6m42j089j835k262k274k166k264k784l877n303o328o387n804
60880E48979n393n443n531n305m956m884n152n451n399m881m188l671l224k353
60866D83148r77K13N07P5k19K11J215K220K822L151L827N278O985P743O959N313
60850E28471L939L381L590M414N513O258O311O011N687N021L630J948P49O1p40
60835E84244j913l172m330n346n835n287l898k487j533r02m52k81l01l06n32j462
60819E46207k932m101m446m222l849l571l768m724n867o054n000l697l005k729
$$ plain form
60923 731089 714469 698097 681815 666344 652534 640614 630214 621015 613076 606372 600447 594921
60911 594921 590041 586279 583568 581473 579932 579222 579236 579451 579713 580495 582152 584401 586703 588756 590394 591426
60895 591426 591830 591794 591352 590263 588428 586166 583892 581726 579462 576678 572801 567498 561170 554783 548979
60880 548979 543586 538143 532612 527307 522351 517467 512315 506864 501465 496584 492396 488725 485501 483148
60866 483148 482171 482384 482891 482966 482747 482958 484173 486393 489215 492366 496193 501471 508456 516199 523158 528471
60850 528471 532410 535791 539381 543795 549308 555566 561877 567888 573575 578596 582226 584174 584923 584984 584244
60835 584244 582331 579159 574829 569483 563648 558361 554463 551976 550443 549541 549089 548808 548507 548201 547669 546207
60819 546207 543275 539174 534728 530506 526657 523086 519318 514594 508727 502673 497673 493976 490971 488242
60805D88242k518k697l388l642k578q69L5j45m28l27m07q99r61N6J429K021J854
60788D74778J919K636L338L338K802K303K096K170K657L609M594M988M807M731
60774E20766N225N963O378O388O329O444O802P443Q225Q662Q441P947P787P831
60760F20631P317O040M867M776N772P024P728P596O797N884N556O099P051P681
60746G10819P707P430P281P445P842Q201Q264Q040P796P597P097O070M976M603
60732H11168N142N974O550P051P935R096R890R937R503Q985Q391P608O879O576
60718I20685O585O366N682M867M170L262J790N2j321k269l351m901o555p782q513
60703I18767r033r540j0067j0709j1594j2639j3460j3667j3296j2891j3050j3812
$$ plain form
60805 488242 485724 483027 479639 475997 473419 472550 472585 472440 472012 471685 471278 470379 469418 469474 470903 472924 474778
60788 474778 476697 479333 482671 486009 488811 491114 493210 495380 498037 501646 506240 511228 516035 520766
60774 520766 525991 531954 538332 544720 551049 557493 564295 571738 579963 588625 597066 605013 612800 620631
60760 620631 627948 633988 638855 643631 649403 656427 664155 671751 678548 684432 689988 696087 703138 710819
60746 710819 718526 725956 733237 740682 748524 756725 764989 773029 780825 788422 795519 801589 806565 811168
60732 811168 816310 822284 828834 835885 843820 852916 862806 872743 882246 891231 899622 907230 914109 920685
60718 920685 927270 933636 939318 944185 948355 951617 953407 953459 952138 949869 946518 941617 935062 927280 918767
60703 918767 909734 900194 890127 879418 867824 855185 841725 828058 814762 801871 788821 775009
60691G75009j4628j4983j4848j4489j3990j3309j2509j1782j1224j0850j0615
60680F31782j0276r495q389p576p348p162o489n795n861o405o332n369m487m417
60666E36381m705m633m250l933l648l309l314l944m679m805m343l751l088k213
60652D81766j470j280j160j90J547K861L063K890L303M056M098L014J484L72j54
60637E04200n27j060j538j453o55L25P92O73N90J053J811K218K013J572J316J160
60621E12490O66l29j382j877j720j434j532j954k259k270k260k556l080l443l378
60606D83682l042k817k907l168l363l416l356l116k679k277k203k366k393k198
60592D44381k080k133j976j318m45J98N90R15J036O50j41q40j126j028o58j31
$$ plain form
60691 775009 760381 745398 730550 716061 702071 688762 676253 664471 653247 642397 631782
60680 631782 621506 612011 603622 596046 588698 581536 575047 569252 563391 556986 550654 545285 540798 536381
60666 536381 531676 527043 522793 518860 515212 511903 508589 504645 499966 495161 490818 487067 483979 481766
60652 481766 480296 479016 477856 477666 479213 482074 485137 488027 491330 495386 499484 502498 503982 504354 504200
60637 504200 503673 502613 501075 499622 498967 499292 500084 500757 501347 502400 504211 506429 508442 510014 511330 512490
60621 512490 513156 512827 511445 509568 507848 506414 504882 502928 500669 498399 496139 493583 490503 487060 483682
60606 483682 480640 477823 474916 471748 468385 464969 461613 458497 455818 453541 451338 448972 446579 444381
60592 444381 442301 440168 438192 436874 436429 436627 437217 438132 439168 439818 439677 438837 437711 436683 436025 435894
60576D35894K98M54O14J235K271L206L832M504N430O181O353O350P034Q630J0365
60561E02651J1295J1154J0262Q911P115M961K792Q11j250l655n910o980o489n243
60547E30425m223l441k327r12K12J030K293M265O001O544O344O746Q188R634R880
60532E80659Q845P275N668L909J866j75j752k687l195l568l887m001l727l067
60518E82163k206j379p58m58n03o57m77K33J044J311J003Q31J320K118K543K593
60502E88721K905L869N312P094R475J2714J6702K1267K6334L1561L6102L9166
60490H01222M0612M0715L9533L6735L1940K5040J6398O825k875j2462k1967l0779
60478I70937l7596m1610m3157m2823m0643l6893l2864k9798k7337k4238k0454
$$ plain form
60576 435894 436192 436646 437260 438495 440766 443972 447804 452308 457738 463919 470272 476622 483656 492286 502651
60561 502651 513946 525100 535362 544273 551388 556349 559141 559952 558702 555047 549137 542157 535668 530425
60547 530425 526202 522761 520434 519522 519734 520764 523057 527322 533323 539867 546211 552957 561145 570779 580659
60532 580659 589504 596779 602447 606356 608222 608047 606295 603608 600413 596845 592958 588957 585230 582163
60518 582163 579957 578578 577820 577362 576859 576202 575725 575958 577002 578313 579316 580147 581467 583585 586128 588721
60502 588721 591626 595495 600807 607901 617376 630090 646792 668059 694393 725954 762056 801222
60490 801222 841834 882549 922082 958817 990757 1015797 1032195 1039020 1036145 1023683 1001716 970937
60478 970937 933341 891731 848574 805751 765108 728215 695351 665553 638216 613978 593524
60467E93524j7359j5739j4793j3519j2055j0963j0075q859p393o268n752n646
60455D65103n641n376m536l326k511k457k551k149j669j962k815l014j920l08
60441D24868N75K69p40j610j725j108m73n76j384k144k312k033j655j211o22n5
60425D08064K37J88r4m55o10k88L89R19J060J146J565K116K276J885J228N86J23
60408D20335J08P67J815K509K372J618Q20L27J79K51L86M60M80N35O32P82J181
60391D35557K008K962L391L045K351J792J397J085J059J370J588J468J552K354
60377D62979L230L031J830J020J423K277K501K075J583J176P40N03N80M69k27
60362D85190q68n42M93J103R72R94J765K658K777K160J537J411J854K805M084
$$ plain form
60467 593524 576165 560426 545633 532114 520059 509096 499021 490162 482769 476501 470749 465103
60455 465103 459462 454086 449550 446224 443713 441256 438705 436556 434887 432925 430110 427096 425176 424868
60441 424868 425443 425712 424972 423362 421637 420529 420056 419480 418096 415952 413640 411607 409952 408741 408119 408064
60425 408064 408301 408489 408395 407940 407330 407042 407431 408350 409410 410556 412121 414237 416513 418398 419626 420212 420335
60408 420335 420443 421210 423025 425534 427906 429524 430344 430671 430850 431101 431487 431947 432427 432962 433594 434376 435557
60391 435557 437565 440527 443918 446963 449314 451106 452503 453588 454647 456017 457605 459073 460625 462979
60377 462979 466209 469240 471070 472090 473513 475790 478291 480366 481949 483125 483865 484368 484948 485417 485190
60362 485190 484322 483780 484273 485376 486348 487342 489107 491765 494542 496702 498239 499650 501504 504309 508393
60347E08393N295O110O530O798P158P778Q658R563J0206J0521J0378R239O591
60334F13218K897n27k798m240n655p312q923j0121j0567r936q332o510n274m740
60320E31180m406l787k776j608p69p04j310j899j870j281n31K88J406K927M667
60305E19527O393Q016R588J1289J3290J5522J7526J8597J8058J5670J2018Q288
60293F73782N168K099j738n758q205q280p089o021m989l166p54R60J137P4j529
60278F35691l286n061o809q539j0085j1015j1206j1179j1419j1559j0866r306
60266E25361p555o082m954m322m310m394l788k554j589j387j491j420j316j355
60252D78844j259q28l91k61j96R1L14P7l60l25L88J296J812J769J424J206J334
$$ plain form
60347 508393 513688 519798 526328 533126 540284 548062 556720 566283 576489 587010 597388 606627 613218
60334 613218 616115 615588 612790 608550 602895 595583 586660 576539 565972 556036 547704 541194 535920 531180
60320 531180 526774 522987 520211 518603 517834 517130 515820 513921 512051 510770 510239 510527 511933 514860 519527
60305 519527 525920 533936 543524 554813 568103 583625 601151 619748 637806 653476 665494 673782
60293 673782 678950 681049 679311 673553 665348 657068 649979 643958 638969 635803 635049 636009 637146 637220 635691
60278 635691 632405 627344 620535 611996 601911 590896 579690 568511 557092 545533 534667 525361
60266 525361 517806 511724 506770 502448 498138 493744 489956 487402 485813 484426 482935 481515 480199 478844
60252 478844 477585 476757 476366 476105 475909 476000 476314 476391 476031 475706 476094 477390 479202 480971 482395 483601 484935
60235D84935J616J735J746J982K393K460J966J440J497J975K215J945J496J256
60221E10657J291J510J840K223K564K807L047L510M343N306N775N381M616M410
60207E59280N057N970O555O813O880O526N600M547L921L705L612L756M339M895
60193F31456M606L507K656K773L235K827J227p01j903k128j939k046k658l405
60179F37507l814l857l979m520n215n424m886m089l695l721l548k781j798j169
60165E85011q74m84M0K45j2k15J24Q06J306J439J374J266J219J369J687J775J324
60148E97400O09K45N01J171J938K544K745K599K692L586N062O345P139P889Q909
60133F51374R833J0166R917R315Q317O860N243L792K378P51p60j539j634j833
$$ plain form
60235 484935 486551 488286 490032 492014 494407 496867 498833 500273 501770 503745 505960 507905 509401 510657
60221 510657 511948 513458 515298 517521 520085 522892 525939 529449 533792 539098 544873 550254 554870 559280
60207 559280 564337 570307 576862 583675 590555 597081 602681 607228 611149 614854 618466 622222 626561 631456
60193 631456 636062 639569 642225 644998 648233 651060 652287 651586 649683 647555 645616 643570 640912 637507
60179 637507 633693 629836 625857 621337 616122 610698 605812 601723 598028 594307 590759 587978 586180 585011
60165 585011 584137 583653 583693 583938 583926 583711 583835 584641 585947 587386 588760 590026 591245 592614 594301 596076 597400
60148 597400 598009 598254 598755 599926 601864 604408 607153 609752 612444 616030 621092 627437 634576 642465 651374
60133 651374 661207 671373 681290 690605 698922 705782 711025 714817 717195 717946 717186 715647 714013 712180
60119G12180k584l328l266k393j407p67l24J39M84N32M75O11Q19O28o5p22q67
60102G00145q24j368k641l853m252m019l860l987l963l481k784k129j376l54O91
60087F61945J484K251L412M794N688N780N562N672O070O181N602M491L284K298
60073G24514J448L48j322l401n306o621p458q179q919r538r921j0047r842r218
60059F36538q296p410o819o498o260o005n798n716n643n313m646l901l294k579
60045E58360j338L36J801K676L274L995M740N253N707O388P089P255O758N989
60031F18283N219M323L178J892N71p69k008k989l947n430p628r994j1725j2368
60017E76608j1936j0740r337q298p769p314o419n045l643k737k576k993l425l242
$$ plain form
60119 712180 709596 706268 703002 700609 699202 698435 698111 698250 698734 699266 699741 700352 701171 701799 701734 701012 700145
60102 700145 699321 697953 695312 691459 687207 683188 679328 675341 671378 667897 665113 662984 661608 661254 661945
60087 661945 663429 665680 669092 673886 679574 685354 690916 696588 702658 708839 714441 718932 722216 724514
60073 724514 725962 726310 724988 721587 716281 709660 702202 694023 685104 675566 665645 655598 645756 636538
60059 636538 628242 620832 614013 607515 601255 595250 589452 583736 578093 572780 568134 564233 560939 558360
60045 558360 557022 557358 559159 561835 565109 569104 573844 579097 584804 591192 598281 605536 612294 618283
60031 618283 623502 627825 631003 632895 633466 632697 630689 627700 623753 618323 610695 600701 588976 576608
60017 576608 564672 553932 544595 536297 528528 521214 514795 509750 506107 503370 500794 497801 494376 491134
60003D91134k242q61J94N62N68R68K174L666M432M100L406L240L610L972M127
59988E23050M216M130L717L413L806M524M523L626K807K580K113O03j375k739
59974E58994l447m219n118n414m787l769k953k384j821j087j57P13J025O77L42
59959E26595P31J610K192K318K556L117L493L350K999K632J782J37j578k208j563
59944E48163o74n78j257j926k061j868j769j806j832k049k863m095m892m736m113
59929E11644l705l364k514j351q33j331k036k009j287n83k39L1N86J402K175K677
59913D99263K924L092L263L338L318L471M078M938N523N576N298M941M539M112
59899E57674L801L647L473L209L075L231L499L629L730M107M762N330N511N411
$$ plain form
60003 491134 488892 488031 488225 488787 489355 490323 492497 496163 500595 504695 508101 511341 514951 518923 523050
59988 523050 527266 531396 535113 538526 542332 546856 551379 555005 557812 560392 562505 563108 561733 558994
59974 558994 555547 551328 546210 540796 536009 532240 529287 526903 525082 523995 523838 524551 525576 526253 526595
59959 526595 527326 528936 531128 533446 536002 539119 542612 545962 548961 551593 553375 553512 551934 549726 548163
59944 548163 547489 546911 545654 543728 541667 539799 538030 536224 534392 532343 529480 525385 520493 515757 511644
59929 511644 507939 504575 502061 500710 499877 498546 496510 494501 493214 492631 492392 492423 493009 494411 496586 499263
59913 499263 502187 505279 508542 511880 515198 518669 522747 527685 533208 538784 544082 549023 553562 557674
59899 557674 561475 565122 568595 571804 574879 578110 581609 585238 588968 593075 597837 603167 608678 614089
59885F14089N300N275N218N115N112N229N180M741M139L847L931L963L604K928
59871F77671K079R60m34j809k967m118n376o329o600o524o731p217p426p136o631
59856F11412o012n064l877k970k557k199j379n1J641L587N475O798P404P694Q023
59841F27925Q284Q256P888O940M978K188j91r42j50J089K023K657K926K213J39
59826F76223k658m944o137o765p678r015j0138j0518j0330j0060r799r320q648
59813E70213q114p816p483o924o231n403m226k770j636j309j568j808j767j566
59799E11592j226n67L25R00N88n61j809k381k244k098k461k980k907k071r63l0
59783D91107N74N99k17j516k398k438k090j795j289k80Q39J460J525J291P47n2
$$ plain form
59885 614089 619389 624664 629882 634997 640109 645338 650518 655259 659398 663245 667176 671139 674743 677671
59871 677671 679750 680710 680276 678467 675500 671382 666006 659677 653077 646553 639822 632605 625179 618043 611412
59856 611412 605400 600336 596459 593489 590932 588733 587354 587303 588944 592531 598006 604804 612208 619902 627925
59841 627925 636209 644465 652353 659293 664271 666459 666268 665326 665176 666265 668288 670945 673871 676084 676223
59826 676223 673565 668621 662484 655719 648041 639026 628888 618370 608040 597980 588181 578861 570213
59813 570213 562099 554283 546800 539876 533645 528242 524016 521246 519610 518301 516733 514925 513158 511592
59799 511592 510366 509799 510124 511024 511612 511051 509242 506861 504617 502519 500058 497078 494171 492100 491137 491107
59783 491107 491681 492280 492063 490547 488149 485711 483621 481826 480537 480257 481096 482556 484081 485372 486119 486067
59767D86067n54k79L89P62R49J598K631L178K867K376K389K760L131L681M686
59752E16631N727O076N685N263N320N620N724N761O251P214P831P303N860M532
59738F00798L812L085J708J82l79K32J039J163P42K97j19o65j031p48JM66L35
59721F10918J40L63N97Q5j058j767j344l76K6l15n67j76L53K67l08n75j62M52
59703F06553O27K99j39l88m72n08m88l99l82o03q92p81j14N61N63j00q25j247
59685F01265j461j451r51j40K18k56r72j205j048r83j000q87r46j621k578l039
59669E82945k979l116l645l897l457k832k615k704k791k955l222l073k051n91
59655E43017M19O81O15O75J006J669K603L352L384K791K254K140J995J194k12
$$ plain form
59767 486067 485513 485234 485623 486385 487334 488932 491563 494741 497608 499984 502373 505133 508264 511945 516631
59752 516631 522358 528434 534119 539382 544702 550322 556046 561807 568058 575272 583103 590406 596266 600798
59738 600798 604610 607695 609403 609585 609206 609438 610477 611640 612382 612679 612560 611895 610864 610116 610117 610583 610918
59721 610918 611058 611421 612018 612103 611045 609278 607934 607558 607584 607269 606702 606526 606879 607146 606838 606263 606101 606553
59703 606553 607180 607479 607340 606952 606480 605972 605484 605085 604703 604100 603208 602427 602313 602874 603437 603337 602512 601265
59685 601265 599804 598353 597402 597262 597480 597224 596252 595047 593999 593016 592016 591129 590183 588562 585984 582945
59669 582945 579966 576850 573205 569308 565851 563019 560404 557700 554909 551954 548732 545659 543608 543017
59655 543017 543436 544117 544732 545407 546413 548082 550685 554037 557421 560212 562466 564606 566601 567795 567583
59640E67583j581k421k762k795k591k221j954j990k137j984j430p45j65L12O64
59625E43783P50O29N66M80k09j650k866k591q02J212K253K212J646R96M92K78
59609E47179L33N12Q29J429K213K902L518M303M984M748L258J241l73j367j967
59594E73742k191k055j951k183k388k119j707j791k240k334k004j977k520k896
59580E43386k445j541r99j020j241j432j600j693j680j779k132k416k187j545
59566E19676r87o22n0R10J775J970J522R56O62O42P78J088J632K294K712K469
59550E37427J466K01m64m6J047J890K022J888K248L307M712O234Q075J0328J2572
59535E92907J4348J5815J7346J8439J7611J3840P844J625l064n491n598l743q59
$$ plain form
59640 567583 566002 563581 560819 558024 555433 553212 551258 549268 547131 545147 543717 542972 542807 543119 543783
59625 543783 544533 545162 545728 546208 545999 544349 541483 538892 538090 539302 541555 543767 545413 546409 546901 547179
59609 547179 547512 548024 548853 550282 552495 555397 558915 563218 568202 572950 576208 577449 577076 575709 573742
59594 573742 571551 569496 567545 565362 562974 560855 559148 557357 555117 552783 550779 548802 546282 543386
59580 543386 540941 539400 538401 537381 536140 534708 533108 531415 529735 527956 525824 523408 521221 519676
59566 519676 518689 518067 518017 518927 520702 522672 524194 525150 525812 526454 527232 528320 529952 532246 534958 537427
59550 537427 538893 539094 538630 538584 539631 541521 543543 545431 547679 550986 555698 561932 570007 580335 592907
59535 592907 607255 623070 640416 658855 676466 690306 698150 699775 696711 691220 685622 681879 681020
59522F81020J883L896N412O624P141O696N902N559N418M277J448k423o071q718
59508G18064j0379j1472j2382j3133j3409j3010j2263j1624j0975r861q420p412
59496E83724p107o789n797m498l666l314k795j849r17m88n80q79r34l06J016K410
59480E47231L201L487L937M837N746O193O248O253O307O239N941N493N084M741
59466F20938M190L142J853J138J451K248K671K666K901L733M886O144P687R575
59452F75223J1479J3165J4735J6122J6880J6804J6284J5725J4893J3228J0439
59441H34977O465J305m609j0077j3820j5614j6329j6818j7061j6547j5140j3350
59429G03382j1738j0284q537o380m329k838j511N12L449O557R131J1322J3752
$$ plain form
59522 681020 682903 686799 692211 698835 705976 712672 718574 724133 729551 733828 735276 732853 726782 718064
59508 718064 707685 696213 683831 670698 657289 644279 632016 620392 609417 599556 591136 583724
59496 583724 576617 569828 564031 559533 555867 552553 549758 547909 546992 546504 545924 545045 544111 543805 544821 547231
59480 547231 550432 553919 557856 562693 568439 574632 580880 587133 593440 599679 605620 611113 616197 620938
59466 620938 625128 628270 630123 631261 632712 634960 637631 640297 643198 646931 651817 657961 665648 675223
59452 675223 686702 699867 714602 730724 747604 764408 780692 796417 811310 824538 834977
59441 834977 841442 842747 838138 828061 814241 798627 782298 765480 748419 731872 716732 703382
59429 703382 691644 681360 672823 666443 662114 659276 657765 658277 661726 668283 677414 688736 702488
59416G02488J6669J9805K2781K5222K6683K6925K6316K5578K4865K3136J8697
59405I59165J0634l4j0686j8718k2986k3746k1704j7596j2439p434l422r40q92
59392H29202m328j1050j8842k4816k7450k7159k5206k2584j9709j6669j3598j0874
59380F06917q857p423o055m593l458k890k405j521n71j93k97j69M73J162J471
59365E71591J527J652J937K368K969L676M322M918N683O748P974R122J0050J0825
59351F45362J1801J3456J5810J8191J9978K1426K3273K5515K7220K7721K7389
59340H77142K6879K6089K4430K1798J8635J5171J1135O399J413l273p663j2065
59328A006090j6361j9929k2332k3759k4586k4797k4240k3195k2193k1251j9834
$$ plain form
59416 702488 719157 738962 761743 786965 813648 840573 866889 892467 917332 940468 959165
59405 959165 969799 969765 959079 940361 917375 893629 871925 854329 841890 834456 831034 830094 829202
59392 829202 824874 813824 794982 770166 742716 715557 690351 667767 648058 631389 617791 606917
59380 606917 598060 590637 584582 579989 576531 573641 571236 569715 569144 568951 568654 568485 568958 570120 571591
59365 571591 573118 574770 576707 579075 582044 585720 590042 594960 600643 607391 615365 624487 634537 645362
59351 645362 657163 670619 686429 704620 724598 746024 769297 794812 822032 849753 877142
59340 877142 904021 930110 954540 976338 994973 1010144 1021279 1027678 1029091 1025818 1018155 1006090
59328 1006090 989729 969800 947468 923709 899123 874326 850086 826891 804698 783447 763613
59317G63613j7761j5639j4028j2660j0958r036p557o689n850m594l230k278j772
59304F51561j386r42l43P96K959N995Q946J0889J1852J2672J4022J5714J6936
59291G49671J6733J4281R224K281m699r924j2924j4303j4441j3190j0826q410
59279G03473o604m874k475L31K784M932P517J0612J3303J4891J5725J6553J7565
59266G93733J8399J8656J8122J6683J4424J1586Q320M519O4m832r583j3512j6224
59253H60355j7783j8490j8451j7555j5998j4475j3519j2833j1670r765p548n549
59241F96719l954k676j447J53K295M497O018O710P150P801Q455Q593P995O812
59227G55121N275L525J587o39l222o051q912j1616j3893j5327j5671j5169j4296
$$ plain form
59317 763613 745852 730213 716185 703525 692567 683531 675974 669285 663435 658841 655611 653333 651561
59304 651561 650175 649233 648890 649686 652645 658640 667586 678475 690327 702999 717021 732735 749671
59291 749671 766404 780685 789909 792190 787491 777567 764643 750340 735899 722709 711883 703473
59279 703473 696869 691995 689520 689851 692635 697567 705084 715696 728999 743890 759615 776168 793733
59266 793733 812132 830788 848910 865593 880017 891603 899923 904442 904506 899674 890091 876579 860355
59253 860355 842572 824082 805631 788076 772078 757603 744084 731251 719581 709816 702268 696719
59241 696719 692765 690089 688642 688795 691090 695587 701605 708315 715465 723266 731721 740314 748309 755121
59227 755121 760396 763921 765508 764869 761647 755596 746684 735068 721175 705848 690177 675008 660712
59214F60712j3302j2235j1194j0198r006p548o300n726n499m888l840k945k409
59201E65622j865j318j274j653j474k23J203J639J210J024J630K541L089L116
59187E73267K906K927L657N140O730P618P595P079O597O523P089Q130Q901Q692
59173F62851P675O717O309O170N997O130P081Q694J0203J1104J1622J2223J2887
59160G75663J3084J2433J1066R273P052M299J267j607m326p299j0522j3230j4694
59147G82459j5049j4994j4878j4534j3857j2987j1940j0536q930p833p773q294
59135F40854q292p221n661m516l930l310k308j271o20j70N18J472K358L067L829
59120F14799M781N850P000Q203R134R397R150R052R476J0098J0444J0447J0251
$$ plain form
59214 660712 647410 635175 623981 613783 604777 597229 590929 585203 579704 574816 570976 568031 565622
59201 565622 563757 562439 561165 559512 558038 557815 559018 560657 561867 562891 564521 567062 570151 573267
59187 573267 576173 579100 582757 587897 594627 602245 609840 616919 623516 630039 637128 645258 654159 662851
59173 662851 670526 677243 683552 689722 695719 701849 708930 717624 727827 738931 750553 762776 775663
59160 775663 788747 801180 812246 821519 828571 832870 834137 832530 828204 820905 810383 797153 782459
59147 782459 767410 752416 737538 723004 709147 696160 684220 673684 664754 656921 649148 640854
59135 640854 632562 625341 619680 615164 611234 607924 605616 604345 603725 603555 604073 605545 607903 610970 614799
59120 614799 619580 625430 632430 640633 649767 659164 668314 677366 686842 696940 707384 717831 728082
59107G28082R833R052P879O434M989L993L680L593K944J645M96R2O0k85r94j716
59091G79777k348k952l196k635j434l22J55n9q57k142l653n083o422p839r219
59076G31771j0159j0535j0661j0801j0824j0464r679q664p636o794o293o073n782
59063F17406n100m145l438l272l241k599j273j70k02j161k009k166k013k068k317
59048E82232k599l034l561l554k497q87J49N9o59j167j052m27L89J159J818K370
59032E68739K688K648K473K667L449M579N799P077Q268R103R777J0981J2838J4389
59018F65475J4789J4388J3898J3054J1120Q421O077M259J994j006l505m381m094
59005G40489l751l465k558q72J034K831M656O508Q080R320J0481J1492J1844J1398
$$ plain form
59107 728082 737915 746967 754846 761280 766269 770262 773942 777535 780479 782124 782620 782712 782772 782487 781493 779777
59091 779777 777429 774477 771281 768646 767212 766890 767045 766986 766129 763987 760334 755251 748829 740990 731771
59076 731771 721612 711077 700416 689615 678791 668327 658648 649984 642348 635554 629261 623188 617406
59063 617406 612306 608161 604723 601451 598210 595611 594338 594168 593966 592805 590796 588630 586617 584549 582232
59048 582232 579633 576599 573038 569484 566987 566100 566249 566308 565649 564482 563430 563003 563392 564551 566369 568739
59032 568739 571427 574075 576548 579215 582664 587243 593042 600119 608387 617490 627267 638248 651086 665475
59018 665475 680264 694652 708550 721604 732724 741145 747222 751481 753475 752469 748964 744583 740489
59005 740489 736738 733273 730715 729843 730877 733708 738364 744872 752952 762272 772753 784245 796089 807487
58991H07487J0818J0716J0743J0037Q447O741N447L995J440k190n736q107r142
58978H50696r282q859q041p038n903m300j929R07L552N773P856R988J1913J3351
58964H58684J4407J5428J6606J7825J8708J8752J7711J5832J3558J0941P596L283
58952A029331j673o593j0990j4782j8160k1194k3460k4209k3180k1115j9157j7747
58940H27071j6509j5146j3865j2717j1251r211p173n830m955l733k117j117j414
58927G22033k315k604k093j677j907k269k138j809j969k514k665k152j511j079
58913F93331n03M17J097J031P48J156K237L196L844M943P022R452J1187J2050
58899G51208J2848J4315J6250J7733J8151J7899J7970J8887K0314K1840K3674
$$ plain form
58991 807487 818305 829021 839764 849801 858248 864989 870436 874431 875871 873681 867945 859838 850696
58978 850696 841414 832555 824514 817476 811573 807273 805344 806251 809803 815576 823432 833420 845333 858684
58964 858684 873091 888519 905125 922950 941658 960410 978121 993953 1007511 1018452 1026048 1029331
58952 1029331 1027658 1021065 1010075 995293 977133 955939 932479 908270 885090 863975 844818 827071
58940 827071 810562 795416 781551 768834 757583 748372 741199 735369 730414 726681 724564 723447 722033
58927 722033 719718 717114 715021 713344 711437 709168 707030 705221 703252 700738 698073 695921 694410 693331
58913 693331 692828 693245 694342 695373 696121 697277 699514 702710 706554 711497 718519 727971 739158 751208
58899 751208 764056 778371 794621 812354 830505 848404 866374 885261 905575 927415 951089
58888I51089K6215K9283L2285L4939L7276L9034L9682L8978L6993L3581K8460
58877A327815K1905J4739P423k02q054j5342k1388k6431l0995l4825l7031l7191
58865A160423l5795l3562l0795k7550k4153k1219j9188j7986j7249j6676j6137
58854I00113j5468j4595j3785j3422j3332j2802j1614j0520j0144r886q746o920
58842G58879n661n548n917o154o537p326p964p871p373p167p286p271o993o686
58828F63125o374n885n233m480l462k092p98m2M12J260K687M158N107N432N351
58813F59166N212N410O026O519O160M883L421K488K141J951J462M52r35k179k776
58798F99401k751k667k992l665m262m487m414m392m726n273n450m788l449j984
$$ plain form
58888 951089 977304 1006587 1038872 1073811 1111087 1150121 1189803 1228781 1265774 1299355 1327815
58877 1327815 1349720 1364459 1371882 1371680 1363626 1348284 1326896 1300465 1269470 1234645 1197614 1160423
58865 1160423 1124628 1091066 1060271 1032721 1008568 987349 968161 950175 932926 916250 900113
58854 900113 884645 870050 856265 842843 829511 816709 805095 794575 784431 774545 765799 758879
58842 758879 753218 747670 741753 735599 729062 721736 713772 705901 698528 691361 684075 676804 669811 663125
58828 663125 656751 650866 645633 641153 637691 635599 634801 634759 635171 636431 639118 643276 648383 653815 659166
58813 659166 664378 669788 675814 682333 688493 693376 696797 699285 701426 703377 704839 705291 704356 702177 699401
58798 699401 696650 693983 690991 687326 683064 678577 674163 669771 665045 659772 654322 649534 646085 644101
58784F44101o74N86J768K574K910L178L718M290M345L690K587J311k2j262k216
58769F70884k958l790m750n458n576n194m501l464k212j386j498k014j800n30
58755F25753R96K065K849L654M214M377M796N986P173P084N721M348L832L925
58741F86773M314N239O710Q044Q695Q846Q726Q132P141O498O616O797O257N395
58727G84183N193N729O201O242O270O547O685O324N659N091M798M816N136N665
58713H64539O362P377Q696R746R892R216Q275P094N070K079j034l465n463p823
58699I20561j0857j4289j7848k1273k3899k4905k4226k2703k1159j9581j7511
58688G02310j4928j2432j0573r363q527p924p561p390p278p197p137o881o080
$$ plain form
58784 644101 643427 644013 645781 648355 651265 654443 658161 662451 666796 670486 673073 674384 674362 673100 670884
58769 670884 667926 664136 659386 653928 648352 643158 638657 635193 632981 631595 630097 628083 626283 625753
58755 625753 626749 628814 631663 635317 639531 643908 648704 654690 661863 668947 674668 679016 682848 686773
58741 686773 691087 696326 703036 711080 719775 728621 737347 745479 752620 759118 765734 772531 778788 784183
58727 784183 789376 795105 801306 807548 813818 820365 827050 833374 839033 844124 848922 853738 858874 864539
58713 864539 870901 878278 886974 896720 906612 915828 924103 931197 936267 938346 937312 933847 928384 920561
58699 920561 909704 895415 877567 856294 832395 807490 783264 760561 739402 719821 702310
58688 702310 687382 674950 664377 655014 646487 638563 631002 623612 616334 609137 602000 595119 589039
58675E89039m735l415k799k924l037k256l89J885L709M865N901P399R305J1008
58661F13556J1955J2007J1336J0201Q789P105M991K500J65j361j964k137k370
58648F74773k737l119l534m076m746n432n895n755m774l246j805p24K90J428K350
58633F32998K715K871L485M626N644N981N717N177M347K995J261k41r65q71k21
58618F75519R31K723N092P674J0129J2236J3679J4196J4106J4085J4118J3133
58606G97621J0328O397K763n2k530m838o432p101p456q008q495q485q071p598
58592G48043p191o890o770o563n612l581r01J751M068O041P743R394J1193J2812
58578G63537J3566J3268J2440J1448J0056Q206O560N759N737O227P421R513J2029
$$ plain form
58675 589039 584304 580889 578090 575166 572129 569873 569484 571369 575078 579943 585844 593243 602548 613556
58661 613556 625511 637518 648854 659055 667844 674949 679940 682440 682605 681244 679280 677143 674773
58648 674773 672036 668917 665383 661307 656561 651129 645234 639479 634705 631459 629654 628930 629220 630648 632998
58633 632998 635713 638584 642069 646695 652339 658320 664037 669214 673561 676556 677817 677576 676611 675740 675519
58618 675519 676450 679173 684265 691939 702068 714304 727983 742179 756285 770370 784488 797621
58606 797621 807949 814346 817109 817057 814527 809689 803257 796156 788700 780692 772197 763712 755641 748043
58592 748043 740852 733962 727192 720629 715017 711436 710535 712286 716354 722395 730138 739532 750725 763537
58578 763537 777103 790371 802811 814259 824315 832521 839081 844840 850577 856804 864225 873738 885767
58565H85767J4219J5846J7153J8409J9898K1889K4064K5410K5246K3959K2213
58554A114073J9869J6382J1800O729J601l214o940q906r442r538r680r693r541
58541A103500r579j0001j0757j2023j4089j6671j8922k0236k0616k0250j9249
58530I31107j7812j6165j4265j2012r616p353m991k138Q77L071L969M142M356
58517H63170M676M701M336L894L600L317K831K246J936K025K099J639O71l27j125
58502H99689j927k817l523l969m453n023n250n009m983n770o940p529p165o214
58488H29117n078l925k864j898q53K82J260K087L318N344P797J0061J1927J3324
58474H69899J3887J3469J2606J1768J0526Q098M458K51l980p797j0496j1486j0982
$$ plain form
58565 885767 899986 915832 932985 951394 971292 993181 1017245 1042655 1067901 1091860 1114073
58554 1114073 1133942 1150324 1162124 1168853 1170454 1167240 1160300 1151394 1141952 1132414 1122734 1113041 1103500
58541 1103500 1093921 1083920 1073163 1061140 1047051 1030380 1011458 991222 970606 950356 931107
58530 931107 913295 897130 882865 870853 861237 853884 848893 846755 847632 850703 854672 858814 863170
58517 863170 867846 872547 876883 880777 884377 887694 890525 892771 894707 896732 898831 900470 901141 900814 899689
58502 899689 897762 894945 891422 887453 883000 877977 872727 867718 862735 856965 850025 842496 835331 829117
58488 829117 824039 820114 817250 815352 814499 814781 816041 818128 821446 826790 834587 844648 856575 869899
58474 869899 883786 897255 909861 921629 932155 940253 944711 944962 940982 933185 922689 911203 900221
58461I00221r714q225o825n732m628k615N99L924O094P204Q146R076R423R019
58447I15967Q089O346L358k84l242m995o195p424q466q873q466p170n086k786
58433H70773r24M44J662K818L872N072O546P832Q569R252J0499J2035J3226J4069
58419I65745J4671J4377J2618J0139Q066O178L528L87k068l737n578p635q833
58406A007858q946r125r988j0741j0667j0186r813r247q069o463m761l094j735
58393I05023r38l30P09K058L121L866M553M800M194L530L861M602M298L166K836
58378I49349L497L431J798j26j113j459j495o74R35K007J952J990L193M941O353
58363I74579P732R469J1014J2069J3412J5333J6571J6113J4836J4074J3606J2378
$$ plain form
58461 900221 890507 882282 875457 869725 865097 862482 863081 867005 873099 880303 888449 897525 906948 915967
58447 915967 924056 930402 933760 933476 930234 925239 919044 911620 903154 894281 885815 878645 873559 870773
58433 870773 869849 870293 871955 874773 878645 883717 890263 898095 906664 915916 926415 938450 951676 965745
58419 965745 980416 994793 1007411 1017550 1025616 1031794 1035322 1035709 1033641 1029904 1024326 1016691 1007858
58406 1007858 998912 989787 979799 969058 958391 948205 938392 929145 921076 914613 909852 906758 905023
58393 905023 904085 903755 904464 906522 909643 913509 918062 922862 927056 930586 934447 939049 943347 946513 949349
58378 949349 952846 956277 958075 957949 956836 955377 953882 953208 954143 956150 958102 960092 963285 968226 974579
58363 974579 982311 991780 1002794 1014863 1028275 1043608 1060179 1076292 1091128 1105202 1118808 1131186
58351A131186J0278P901N423K899R75K10K33L85N77Q99J277K085M059O941R341
58336A184669J0569J1462J2774J4042J4865J5819J7079J7586J6714J5528J5155
58325A346262J5118J4397J3016J1356R112O207L782K937L302L939M749N960P204
58312A447341Q136R108J0276J1031J1228J1840J3518J5544J7116J8444J9723K0338
58300A613643K0068J9801K0038K0055J9474J9208J9744J9984J9107J8061J8058
58289A827241J8832J9647K0608K1857K2894K3771K5453K7938K9712L0124L0458
58278B098535L1584L2594L2977L3919L5957L7572L7884L8436M0498M2835M4087
58267B506878M5163M7169M9203N0468N2313N5907N9960O3111O6294P0361P3613
$$ plain form
58351 1131186 1141464 1149365 1154788 1157687 1158662 1158872 1159105 1159490 1160067 1160966 1162243 1164328 1168387 1175328 1184669
58336 1184669 1195238 1206700 1219474 1233516 1248381 1264200 1281279 1298865 1315579 1331107 1346262
58325 1346262 1361380 1375777 1388793 1400149 1409261 1415468 1419250 1422187 1425489 1429428 1434177 1440137 1447341
58312 1447341 1455477 1464585 1474861 1485892 1497120 1508960 1522478 1538022 1555138 1573582 1593305 1613643
58300 1613643 1633711 1653512 1673550 1693605 1713079 1732287 1752031 1772015 1791122 1809183 1827241
58289 1827241 1846073 1865720 1886328 1908185 1931079 1954850 1980303 2008241 2037953 2068077 2098535
58278 2098535 2130119 2162713 2195690 2229609 2265566 2303138 2341022 2379458 2419956 2462791 2506878
58267 2506878 2552041 2599210 2648413 2698881 2751194 2807101 2867061 2930172 2996466 3066827 3140440
58256C140440P4443P4258P5077P6328P6705P7042P8476P9995Q0702Q2343Q6631
58245D002440R2285R7590J03521J11269J19257J25910J32787J41603J50807J58682
58235E236151J66894J77285J88145J97740K08307K22205K37294K50911K65139
58226G150071K83154L03566L23729L45434L71771M01554M32674M67533N09034
58217A0588520N54799O01942O53990P16242P88139Q67475R57891J064538J186939
58208A7980475J324724J485676J679573J910127K182990K515536K928808L439051
58200C5446960M070626M867345N874743P120740Q630489J0446787J2615641J5168855
58192A04242186J8135722K1512591K5135694K8601313L1413999L3218990L3742447
$$ plain form
58256 3140440 3214883 3289141 3364218 3440546 3517251 3594293 3672769 3752764 3833466 3915809 4002440
58245 4002440 4094725 4192315 4295836 4407105 4526362 4652272 4785059 4926662 5077469 5236151
58235 5236151 5403045 5580330 5768475 5966215 6174522 6396727 6634021 6884932 7150071
58226 7150071 7433225 7736791 8060520 8405954 8777725 9179279 9611953 10079486 10588520
58217 10588520 11143319 11745261 12399251 13115493 13903632 14771107 15728998 16793536 17980475
58208 17980475 19305199 20790875 22470448 24380575 26563565 29079101 32007909 35446960
58200 35446960 39517586 44384931 50259674 57380414 66010903 76457690 89073331 104242186
58192 104242186 122377908 143890499 169026193 197627506 229041505 262260495 296002942
58185B96002942L2427699K8332672K0732735J0008263k120576j3358213k1933780
58178C50091742k7157856k9256204k8941092k7110442k4661381k2289212k0322779
58171A70352776j8731639j7303286j5847061j4297883j2702045j1145897r697106
58164G0627859q389000p232258o225488n358269m615761l984391l450906k999092
58156B8372694k613223k283463k003389j764680j559325j384404j238748j116568
58148A4408894j010011r16221q36140p67617p05449o47351n94364n45878m99441
58139G886422m55231m15791l81234l49063l18776k92538k71241k53567k38770
58130D910211k26798k15948k04034j91678j81060j71767j61329j49529j38597
$$ plain form
58185 296002942 328430641 356763313 377496048 387504311 385383735 372025522 350091742
58178 350091742 322933886 293677682 264736590 237626148 212964767 190675555 170352776
58171 170352776 151621137 134317851 118470790 104172907 91470862 80324965 70627859
58164 70627859 62238859 55006601 48781113 43422844 38807083 34822692 31371786 28372694
58156 28372694 25759471 23476008 21472619 19707939 18148614 16764210 15525462 14408894
58148 14408894 13398883 12482662 11646522 10878905 10173456 9526105 8931741 8385863 7886422
58139 7886422 7431191 7015400 6634166 6285103 5966327 5673789 5402548 5148981 4910211
58130 4910211 4683413 4467465 4263431 4071753 3890693 3718926 3557597 3408068 3269471
58121C269471j29312j20349j11499j04188r8503r2882q7005q2146p8469p4626
58111B290492p0327o6695o3900o0863n7482n4774n2763n0425m7786m5928m4931
58100A674618m3839m2494m1427m0243l8203l5995l4794l4000l2189k9744k8244
58089A273446k7556k6053k3499k1221j9693j8301j7410j8045j9576k0117j9404
58078A042571j8868j8875j8391j7494j7625j8868j9416j8379j6866j5761j4587
58067H47441j3208j2558j2780j2593j1321r867r021q386p725p667q299q568p891
58054G17557p102p084p599q031q224q161p799p500p557p338o078m511m195n198
58040F21180o000n818n450n456n276m627m235m545n056n516o479q058r336r684
$$ plain form
58121 3269471 3140159 3019810 2908311 2804123 2705620 2612738 2525733 2443587 2365118 2290492
58111 2290492 2220165 2153470 2089570 2028707 1971225 1916451 1863688 1813263 1765477 1719549 1674618
58100 1674618 1630779 1588285 1546858 1506615 1468412 1432417 1397623 1363623 1331434 1301690 1273446
58089 1273446 1245890 1219837 1196338 1175117 1155424 1137123 1119713 1101668 1082092 1061975 1042571
58078 1042571 1023703 1004828 986437 968943 951318 932450 913034 894655 877789 862028 847441
58067 847441 834233 821675 808895 796302 784981 775114 766093 757707 749982 742315 734016 725448 717557
58054 717557 710455 703371 695772 687741 679517 671356 663557 656057 648500 641162 635084 630573 626378 621180
58040 621180 615180 609362 603912 598456 593180 588553 584318 579773 574717 569201 562722 554664 545328 535644
58026E35644r557r498r329q841q285p770p027o153n608n331m792m056l784l979
58012D41634l943l554l419l562l198k156j263j014r88r37j252j983k525k664k911
57997D06265l381l501l148l005l454m030m313m215l310j067J870L953M636M879
57983C88179N396N695N325M802M570M269L607L005K677K163J388J168J937K892
57969D37073L121K775K423K103J649J254J057Q93Q46J363K239K396J179q05k642
57954D56924m128n328n950n850n528n502n628n479m910l927k632j496j106j338
57940C98122j389q39J00J421L404N629O990P164P115P653Q385Q655Q547Q397Q003
57925D77357P011N513L716J664l78j839k571l037l643m441n530o841p569o953
$$ plain form
58026 535644 526087 516589 507260 498419 490134 482364 475337 469184 463576 458245 453453 449397 445613 441634
58012 441634 437691 434137 430718 427156 423958 421802 420539 419525 418537 417600 416348 414365 411840 409176 406265
57997 406265 402884 399383 396235 393230 389776 385746 381433 377218 373908 372841 374711 378664 383300 388179
57983 388179 393575 399270 404595 409397 413967 418236 421843 424848 427525 429688 431076 432244 434181 437073
57969 437073 440194 442969 445392 447495 449144 450398 451455 452348 453194 454557 456796 459192 460371 459566 456924
57954 456924 452796 447468 441518 435668 430140 424638 419010 413531 408621 404694 402062 400566 399460 398122
57940 398122 396733 395894 395994 397415 400819 406448 413438 420602 427717 435370 443755 452410 460957 469354 477357
57925 477357 484368 489881 493597 495261 494883 493044 490473 487436 483793 479352 473822 466981 459412 452459
57911D52459n791n777p027p702o705n254m926n494n864n945o303o794o889o708
57897C65280o659o568o152n746n612n147l819k322j711j782j487o38j18m39j030
57882C16050j038j88J177K343K619J887O77n11j590k315k112r93ro2p41j059r21
57865C13214j052j744k515k837k583j822o95N14J580K484L239L777M216M828N575
57850C26179O101O348O654P047P158O979O913O810N890M090K506J859J472M51
57836C96457j004k296l491m715n341m900m123l909l819k868j358n72q71j359j394
57821C54437j253j165p97L5R27J405J335Q15J95J27R39J992K271J543L57r57k539
57804C59667m288n664o373o684o895o906o492n671m701l829l019k012q44k24q55
$$ plain form
57911 452459 446668 440891 433864 426162 419457 414203 409277 403783 397919 391974 385671 378877 371988 365280
57897 365280 358621 352053 345901 340155 334543 329396 325577 323255 321544 319762 318275 317637 317519 317080 316050
57882 316050 315012 314824 316001 318344 320963 322850 323527 323016 321426 319111 316999 316006 315997 315935 315194 314135 313214
57865 313214 312162 310418 307903 305066 302483 300661 299966 300480 302060 304544 307783 311560 315776 320604 326179
57850 326179 332280 338628 345282 352329 359487 366466 373379 380189 386079 390169 392675 394534 396006 396457
57836 396457 395453 393157 389666 384951 379610 374710 370587 366678 362859 359991 358633 358061 357190 355831 354437
57821 354437 353184 352019 351222 351257 352184 353589 354924 355739 355934 356061 357000 358992 361263 362806 363163 362206 359667
57804 359667 355379 349715 343342 336658 329763 322857 316365 310694 305993 302164 299145 297133 296289 296065 295210
57789B95210k240k920k224j011l03p6O5j7l58k60O41J389R90R4J00J029J698J719
57771B93526J908K607L064K731K070J648J382J009M88l71j806l419m373m564m830
57756B91070n696o629o855o269n212l982k946k474k396j979q71L78J032J020Q06
57741B48997P27P19N17p2r09j544j683j451j045l84M00O12j76j174j203l37K54
57724B42248J23J34Q78J602J380N73L02Q39J358J085J06r43j551j680j726k115
57708B42613k841l375l190k268j157n47p09j253j511j326j204j465j668j293o75
57693B18131n22p48n63K32R07R22O79Q23J393K060K627K902K687K398L130N419
57677B42477Q367J0717J2637J5568K0305K6075L1870L7902M5030N3027O0241O4897
$$ plain form
57789 295210 292970 290050 287826 286815 286512 286436 286501 286484 286126 285866 286507 287896 288886 288980 289080 290109 291807 293526
57771 293526 295434 298041 301105 303836 305906 307554 308936 309945 310433 310062 308256 304837 300464 295900 291070
57756 291070 285374 278745 271890 265621 260409 256427 253481 251007 248611 246632 245761 246139 247171 248191 248997
57741 248997 249724 250443 250960 250888 249979 248435 246752 245301 244256 243872 244272 244884 244708 243534 242331 241994 242248
57724 242248 242371 242505 243383 244985 246365 246938 247240 248079 249437 250522 250628 249685 248134 246454 244728 242613
57708 242613 239772 236397 233207 230939 229782 229235 228526 227273 225762 224436 223232 221767 220099 218806 218131
57693 218131 217609 216861 216298 216530 217437 218359 219038 219861 221254 223314 225941 228843 231530 233928 237058 242477
57677 242477 250844 261561 274198 289766 310071 336146 368016 405918 450948 503975 564216 629113
57665F29113O6063O3033N4584L9720J9149m369k7062m5352n6789o0965n9807n6098
57653E61220n1334m5434l8534l1946k6866k3025j9469j6080j3429j1559r872q053
57641B65619o339m904l716k900k620k576k245j591j041p42m17J22P50J255J442
57626B40097J111M24O2N09J260J279J96j364k503k695j970r82o55j295k214k674
57610B28586k789k949k897k189j146m23N8P78J425J201K56l59k63j78o03j120
57594B17388j361j579j830j605q31m12j003j935k072j310n72n93j215j689j432
57579A97949o08o1l81j074j152n26j54o93j703k360k373j881j156o68r19j792
57563A80448k471k323j477l85O72J462J772J706J556J289P18K94Q67K424L797
$$ plain form
57665 629113 695176 758209 812793 852513 871662 867293 840231 794879 738090 677125 617318 561220
57653 561220 509886 464452 425918 393972 367106 344081 324612 308532 295103 283544 273672 265619
57641 265619 259280 254376 250660 247760 245140 242564 240319 238728 237687 236945 236528 236650 237400 238655 240097
57626 240097 241208 241632 241694 242203 243463 244742 244938 243574 241071 238376 236406 235424 234769 233474 231260 228586
57610 228586 225797 222848 219951 217762 216616 216193 216251 217029 218454 219655 219911 219552 219289 219111 218508 217388
57594 217388 216027 214448 212618 211013 210182 209770 208767 206832 204760 203450 202878 202285 201070 199381 197949
57579 197949 197341 197280 196899 195825 194673 194147 193993 193300 191597 189237 186864 184983 183827 183159 182240 180448
57563 180448 177977 175654 174177 173792 174464 175926 177698 179404 180960 182249 182967 183261 184128 186552 190349
57548A90349M055L483K801K109J151N4p58j053q08j64M53O22O01J066K036K709
57532B08706K709K570K598K145P85o56j112p13l37k22P9O72J170J433J674J943
57516B23444K082K091K008J647J023P87J569K964L823L517K474J498J022R66R45
57501B51860N89k7m73o31r55j670k163j755p45q9j57m85o24o03n45m50m03n45
57483B40129o99n20n9K53L29O68J680K974L670L284K124Q89J5m68n65p7J037K240
57465B56904K715K201J220M35J11K24P13J369J784J726J333Q89O49Q79J691K633
57449B77476K939K364J467Q82P58R99J526K040K093J776J771K333K755K382J648
57434C05209J428J816K162K091J841J731J854K197K612K778K585K385K493K689
$$ plain form
57548 190349 194404 197887 200688 202797 203948 204002 203244 202191 201383 201219 201672 202294 202895 203961 205997 208706
57532 208706 211415 213985 216583 218728 219513 218857 217745 217032 216695 216473 216552 217224 218394 219827 221501 223444
57516 223444 225526 227617 229625 231272 232295 233082 234651 237615 241438 244955 247429 248927 249949 250915 251860
57501 251860 252449 252422 251949 251318 250363 248693 246530 244775 244030 243941 243784 243299 242675 242072 241527 241077 240674 240129
57483 240129 239430 238910 238851 239104 239433 240101 241781 244755 248425 251709 253833 254722 254737 254269 253704 253627 254664 256904
57465 256904 259619 261820 263040 263475 263586 263810 264523 265892 267676 269402 270735 271624 272273 273152 274843 277476
57449 277476 280415 282779 284246 285128 285886 286885 288411 290451 292544 294320 296091 298424 301179 303561 305209
57434 305209 306637 308453 310615 312706 314547 316278 318132 320329 322941 325719 328304 330689 333182 335871
57420C35871K620K422K435K574K530K447K763L441L883L742L329L171L392L637
57406C78257L481K910K488K820L741M392M223L597L112K799K435K181K403L021
57392D21860L582L855M015M247M552M846N029N121N398O025O516O182N291N046
57378D91565N912O760O363N087M145L832L555L234L338L699L455K479J765K095
57364E47284L142M181M915N245N020M497M408N017N580N315M528M218M791N687
57350F13828O225O339O379O502O516O240N853N721N929O130N980N557N265N409
57336F97873N950O560O777O330N440M715M602N071N833O568O945O812O488O506
57322G82470O903P193P203P351P868Q329Q363Q235Q270Q296Q229Q582R631J0574
$$ plain form
57420 335871 338491 340913 343348 345922 348452 350899 353662 357103 360986 364728 368057 371228 374620 378257
57406 378257 381738 384648 387136 389956 393697 398089 402312 405909 409021 411820 414255 416436 418839 421860
57392 421860 425442 429297 433312 437559 442111 446957 451986 457107 462505 468530 475046 481228 486519 491565
57378 491565 497477 504237 510600 515687 519832 523664 527219 530453 533791 537490 540945 543424 545189 547284
57364 547284 550426 554607 559522 564767 569787 574284 578692 583709 589289 594604 599132 603350 608141 613828
57350 613828 620053 626392 632771 639273 645789 652029 657882 663603 669532 675662 681642 687199 692464 697873
57336 697873 703823 710383 717160 723490 728930 733645 738247 743318 749151 755719 762664 769476 775964 782470
57322 782470 789373 796566 803769 811120 818988 827317 835680 843915 852185 860481 868710 877292 886923 897497
57308H97497J0447R517Q964R329J0096J0683J0978J0906J0335R540R162R509J0300
57295A027263J1093J1582J1617J1368J1369J1835J2250J2088J1647J1536J1660
57284A155308J1560J1492J2166J3444J4228J3911J3083J2638J2793J3272J3785
57273A297680J4081J3969J3517J2922J2249J1678J1740J2672J3755J4068J3774
57262A442105J3803J4349J4657J4333J3913J3860J3968J4093J4569J5448J6066
57251A601164J5901J5319J5027J5258J5825J6466J6822J6551J5760J4924J4232
57240A773249J3514J2879J2764J3169J3555J3673J3858J4153J3980J3073J2055
57229A919922J1685J2053J2923J4192J5504J6068J5432J4018J2502J1122R974
$$ plain form
57308 897497 907944 917461 926425 935754 945850 956533 967511 978417 988752 998292 1007454 1016963 1027263
57295 1027263 1038356 1049938 1061555 1072923 1084292 1096127 1108377 1120465 1132112 1143648 1155308
57284 1155308 1166868 1178360 1190526 1203970 1218198 1232109 1245192 1257830 1270623 1283895 1297680
57273 1297680 1311761 1325730 1339247 1352169 1364418 1376096 1387836 1400508 1414263 1428331 1442105
57262 1442105 1455908 1470257 1484914 1499247 1513160 1527020 1540988 1555081 1569650 1585098 1601164
57251 1601164 1617065 1632384 1647411 1662669 1678494 1694960 1711782 1728333 1744093 1759017 1773249
57240 1773249 1786763 1799642 1812406 1825575 1839130 1852803 1866661 1880814 1894794 1907867 1919922
57229 1919922 1931607 1943660 1956583 1970775 1986279 2002347 2017779 2031797 2044299 2055421 2065395
57218B065395R431R703J0413J1079J1590J1848J1553J0844J0627J1612J3401J5068
57206B202564J6245J7101J7724J8122J8546J9195J9822K0121K0281K0630K1087
57195B411438K1446K1888K2638K3358K3522K3182K2750K2269K1514K0617J9908
57184B654530J9153J7763J5810J4214J3633J3685J3553J2928J2153J1714J1829
57173B810965J2358J2918J3241J3501J4131J5233J6382J7111J7423J7705J8241
57162B979209J9037J9982K0965K1784K2149K2032K1802K1832K2032K2082K2054
57151C214960K2346K2852K2874K2156K1505K1805K2795K3509K3695K3955K4566
57140C467018K5043K4994K4729K4657K4673K4447K3906K3255K2844K3152K4359
$$ plain form
57218 2065395 2074826 2084529 2094942 2106021 2117611 2129459 2141012 2151856 2162483 2174095 2187496 2202564
57206 2202564 2218809 2235910 2253634 2271756 2290302 2309497 2329319 2349440 2369721 2390351 2411438
57195 2411438 2432884 2454772 2477410 2500768 2524290 2547472 2570222 2592491 2614005 2634622 2654530
57184 2654530 2673683 2691446 2707256 2721470 2735103 2748788 2762341 2775269 2787422 2799136 2810965
57173 2810965 2823323 2836241 2849482 2862983 2877114 2892347 2908729 2925840 2943263 2960968 2979209
57162 2979209 2998246 3018228 3039193 3060977 3083126 3105158 3126960 3148792 3170824 3192906 3214960
57151 3214960 3237306 3260158 3283032 3305188 3326693 3348498 3371293 3394802 3418497 3442452 3467018
57140 3467018 3492061 3517055 3541784 3566441 3591114 3615561 3639467 3662722 3685566 3708718 3733077
57129C733077K5911K7053K7923K9494L2282L5795L9538M3788M8837N4186N9213
57118D157097O4161O9736P5996Q2425Q8943R6234J04958J15288J27418J42080
57108E124336J60301J82794K09871K41934K79985L25706L81361M49784N34361
57099G890433O38754P66713R22427J110839J336789J603087J909185K250975K620608
57090B1049810L006126L392489L763911M104487M395802M614125M729303M703615
57082E3759668M491322M046736L345664K409444J311627J59715r35713j886971
57074F6701492k642956l191381l550927l756298l843457l841507l771016l645163
57066C8458787l472675l262091l024441k771924k515252k263200k023469j802076
$$ plain form
57129 3733077 3758988 3786041 3813964 3843458 3875740 3911535 3951073 3994861 4043698 4097884 4157097
57118 4157097 4221258 4290994 4366990 4449415 4538358 4634592 4739550 4854838 4982256 5124336
57108 5124336 5284637 5467431 5677302 5919236 6199221 6524927 6906288 7356072 7890433
57099 7890433 8529187 9295900 10218327 11329166 12665955 14269042 16178227 18429202 21049810
57090 21049810 24055936 27448425 31212336 35316823 39712625 44326750 49056053 53759668
57082 53759668 58250990 62297726 65643390 68052834 69364461 69524176 68588463 66701492
57074 66701492 64058536 60867155 57316228 53559930 49716473 45874966 42103950 38458787
57066 38458787 34986112 31724021 28699580 25927656 23412404 21149204 19125735 17323659
57058A7323659j602099j424226j268199j132731j014780r10585q17494p33898
57050H419647o58041n88299n24460m67318m16975l72591l33640l00137k71681
57041D486505k47346k26541k08898j93565j79702j67497j57408j48452j38776
57032B818320j27964j17412j08021r8997q9371p9234o8785n7480m5151l2817k1193
57021A971895r246M045J6291K1239J2703j0456m2659p4571r8247j10598j12954
57010A567442j08328r9486q8744p8034o8434o0039n2664m6374m1192l6866l3117
56999H54164k9793k6660k3497k0568j8518j7538j7029j6218j4809j2841j0431
56988F46262p853n489l398j196J348L775N164M796K525j238n696r956j3376j5685
$$ plain form
57058 17323659 15721560 14297334 13029135 11896404 10881624 9971039 9153545 8419647
57050 8419647 7761606 7173307 6648847 6181529 5764554 5391963 5058323 4758186 4486505
57041 4486505 4239159 4012618 3803720 3610155 3430453 3262956 3105548 2957096 2818320
57032 2818320 2690356 2572944 2464923 2365926 2276555 2197321 2128536 2071056 2025905 1993088 1971895
57021 1971895 1962649 1966694 1982985 2004224 2016927 2006471 1963812 1889241 1790994 1680396 1567442
57010 1567442 1459114 1359628 1270884 1192850 1124416 1064377 1011713 965339 924147 887281 854164
56999 854164 824371 797711 774214 753646 735128 717590 700561 684343 669534 656693 646262
56988 646262 638409 632920 629522 628326 629674 633449 638613 643409 645934 644696 639000 629044 615668 599983
56974E99983j6883j7089j6402j4884j2827j0908r691q841p367m856j975N98L074
56961D81932N896Q804J1222J3116J4644J5354J4565J2229Q630L570l072j0122
56949E76768j5507j8120j8520j7783j6490j4889j3171j1222q805o144l711j416
56937D30990J326M665Q170J1624J5123J8363K0601K1496K1040J8618J3131M566
56925E89713n424j4868k2651k8039l0244k9248k6423k3476k1107j9093j7099j4873
56913C37168j2227r478p484o698o543o258n820n509n007l772k075q93p00r30p62
56898B63012K3J062J977K736L635N035P052R439J1679J3206J3792J3914J4477
56885C61039J5741J6649J5658J2211P033J199m439q988j1615j2273j1791j0795
$$ plain form
56974 599983 583100 566011 549609 534725 521898 510990 501299 492458 485091 480235 478260 478858 481932
56961 481932 487828 496632 507854 520970 535614 550968 565533 577762 586392 589962 586890 576768
56949 576768 561261 543141 524621 506838 490348 475459 462288 451066 442261 436117 432406 430990
56937 430990 432316 436981 445151 456775 471898 490261 510862 532358 553398 572016 585147 589713
56925 589713 584289 569421 546770 518731 488487 459239 432816 409340 388233 369140 352041 337168
56913 337168 324941 315463 307979 301281 294738 288480 282660 277151 272144 268372 266297 265404 264704 263774 263012
56898 263012 263035 264097 266074 268810 272445 277480 284532 293971 305650 318856 332648 346562 361039
56885 361039 376780 393429 409087 421298 428331 429530 425091 416103 404488 392215 380424 369629
56873C69629r034o119k463J021L881O417R248J2906J7677K3451K9638L5370L9878
56860E31500M2772M4071M3792M1239L5001K4251J0047m973j8179k7917l3420l4677
56848F53507l2599k8587k3582j7853j1662n403J038Q336J6808K5935L5085M4080
56836F65103N2811O0748O7265P1790P3178O9433N8751M0936J7745p686l1573n0421
56824A088080o2196o6960o6231o1826n5241m7627l9733l1788k3674j5319o906
56813F10579J420R992J9425K9575L8798M5035M7872M8644M7850M3330L2141J4123
56801I88784p319k7650m3590n3619n7739n7283n4062m9246m3335l6887l0453k3935
56789E03666j7080j0434m770L39O041J2230J7418K0817K3165K4949K5099K2165
$$ plain form
56873 369629 360595 354476 352013 353034 356915 363332 372580 385486 403163 426614 456252 491622 531500
56860 531500 574272 618343 662135 703374 738375 762626 772673 767700 749521 721604 688184 653507
56848 653507 620908 592321 568739 550886 539224 533821 534859 543195 560003 585938 621023 665103
56836 665103 717914 778662 845927 917717 990895 1060328 1119079 1160015 1177760 1170074 1138501 1088080
56824 1088080 1025884 958924 892693 830867 775626 727999 688266 656478 632804 617485 610579
56813 610579 611999 621991 641416 670991 709789 754824 802696 851340 899190 942520 974661 988784
56801 988784 981465 953815 910225 856606 798867 741584 687522 638276 594941 558054 527601 503666
56789 503666 486586 476152 471382 471721 477762 489992 507410 528227 551392 576341 601440 623605
56777F23605J5764O415m916j6382k5657l1671l5195l7068l6894l4251l0110k6001
56765C67639k2540j9595j7184j5271j3391j1365r745q814p884o429n114m768n037
56752B20502m994m482l887l253k584k358k763k966k209j064n94q50j229j724k612
56737A82933l405l355k699k191j722p26M22O91J01k56Q3L93J84o2J04L43K65J67
56719A71270N24J278J984K295K079J440P25K96K09L29N94R28J163J304J558J798
56703A89774J530P03Nj49k53p35j096q47n94j123j982k138j633j351j385r39J43
56686A77930J009J135R65R95J077R42O53L45J15K72J012J842J949J224L25k90
56670A91500o83r00p77l45Q4L09K56j41o49p10l12l26j138j629o51R63J340L01
$$ plain form
56777 623605 639369 645784 640868 624486 598829 567158 531963 494895 458001 423750 393640 367639
56765 367639 345099 325504 308320 293049 279658 268293 258548 249734 241850 235421 230307 225539 220502
56752 220502 215508 211026 207139 203886 201302 198944 196181 193215 191006 189942 189348 188498 187269 185545 182933
56737 182933 179528 176173 173474 171283 169561 168835 169257 169948 170049 169793 169876 170269 170453 170391 170495 170838 171103 171270
56719 171270 171794 173072 175056 177351 179430 180870 181595 181891 182100 182429 183023 183951 185114 186418 187976 189774
56703 189774 191304 192007 192012 191863 191610 190875 189779 188932 188338 187215 185233 183095 181462 180111 178726 177787 177930
56686 177930 178939 180074 181039 182034 183111 184053 184706 185051 185166 185438 186450 188292 190241 191465 191790 191500
56670 191500 190817 189917 189140 188795 188879 189188 189444 189303 188654 187944 187632 187306 186168 184539 183888 184851 186191 186492
56652A86492m59L0Q18R84J090J881K735K542J392L06k05m39n90l52M90J536J970
56635B00221J218l84j667j629m33Q75J576J806J972K161K222K038J574R72N27
56620B13049L94L80L39M34O86O75J79k92k28O3K2j07K56Q83R55L28m24j008j531
56601B15053j770j381q36j043j900k251j576o96n19r19j221j113o83j95m1m19
56585A98490q95q35k71J99L28L61L88K90K72N99R46Q23N46Q22J423J399O91L48
56567B05924R93K050K810L257L589L920M622O071P733Q532Q329Q051Q122P855
56553B81858O705N008L162J136p19j597j454j286j635j828j348q64j157j893k280
56538B81808k192k009j965k181k645k794j976o77l26j327k376k415k126k590l397
$$ plain form
56652 186492 186033 186063 186881 187865 188955 190836 193571 196113 197505 197811 197606 197167 196577 196225 196715 198251 200221
56635 200221 201439 201055 199388 197759 197326 198201 199777 201583 203555 205716 207938 209976 211550 212522 213049
56620 213049 213443 213823 214162 214596 215282 215957 216136 215844 215616 215679 215701 215594 215850 216733 217688 218016 217592 216584 215053
56601 215053 213283 211902 211066 210023 208123 205872 204296 203600 203081 202162 200941 199828 199145 198950 198909 198490
56585 198490 197595 196760 196489 196688 197016 197377 197765 198055 198327 198926 199872 200695 201241 202063 203486 204885 205576 205924
56567 205924 206917 208967 211777 215034 218623 222543 227165 233236 240969 249501 257830 265881 274003 281858
56553 281858 288563 293571 296733 297869 297150 295553 294099 292813 291178 289350 288002 287138 285981 284088 281808
56538 281808 279616 277607 275642 273461 270816 268022 266046 265369 265043 263716 261340 258925 256799 254209 250812
56523B50812l275k022p59n40j400k550l022k460j585j396j785j753j081p19j131
56508B25334j501j238r36j040q12L12J360J206L64O2K19k35j349j982j506n26
56492B17732J60M04M41N27Q32J224J287R14N25K97j99j019j241j92J335K045J832
56475B26904J586J656J576J140P29O11O54P43Q53Q10N41M10P48J249J329R06L38
56458B42783j94p14j154j414j446j026P3J311J535M92n63m74L05O39M85N88R89
56441B42215J064P97Q01J057Q73J70k21J18M89J88m09m40K06P38N46o0k71J32
56423B47993N10K63l42o60o71p31n57M75J942K400J303j33o29l94k71k40J66O81
56405B51105O18j6o19r13j019r00m89n1K12N79J294J994K240K114J810J218N23
$$ plain form
56523 250812 247537 245515 244756 244216 242816 240266 237244 234784 233199 231803 230018 228265 227184 226465 225334
56508 225334 223833 222595 221659 220619 219807 220119 221479 222685 223049 223111 223330 223095 221746 219764 218258 217732
56492 217732 217892 218296 218737 219264 220096 221320 222607 223521 224046 224343 224144 223125 221884 221692 223027 225072 226904
56475 226904 228490 230146 231722 232862 233591 234202 234856 235599 236452 237262 237803 238213 238961 240210 241539 242445 242783
56458 242783 242589 241875 240721 239307 237861 236835 236908 238219 239754 240246 239683 239209 239514 240153 240638 241226 242215
56441 242215 243279 244076 244877 245934 246807 246977 246756 246874 247363 247551 247142 246702 246908 247646 248192 248132 247861 247993
56423 247993 248503 248766 248424 247764 247093 246362 245805 246280 248222 250622 251925 251792 251163 250769 250498 250258 250424 251105
56405 251105 251723 251707 251088 250175 249156 248256 247767 247716 247928 248507 249801 251795 254035 256149 257959 259177 259700
56388B59700M84J359K191K037J250P11M52Q1m8O38J623J764R42J68J14M75Q05
56371B74746J096J407J569J415Q97J75j68N05J910K815K561J925J834J956J478
56356B96121N86Q0R4J91L15N90O04J4n28j47Q78J516J492J362J362J305J375J938
56338C09148K702L019K958L133L626L937L865L628L326L056L224L913M354L861
56324C57750K871K235J909J375P21K35n24k006l461l744k982k145j417l31P60
56309C51246R01J24n74p60q09o58K12J642K826L601M384M977M710L846L397L493
56293C82558L254K485K129K777L879M724N140N075M603M449N383O943P865P814
56279D49078P610P680P617P368P611Q580R643J0330J0817J1301J1782J2531J3748
$$ plain form
56388 259700 260184 261543 263734 265771 267021 267732 268184 268265 268217 268855 270478 272242 273184 273352 273466 273941 274746
56371 274746 275842 277249 278818 280233 281130 281305 281137 281642 283552 286367 288928 290853 292687 294643 296121
56356 296121 296707 296787 296881 297072 297387 297977 298581 298595 298067 297920 298798 300314 301806 303168 304530 305835 307210 309148
56338 309148 311850 314869 317827 320960 324586 328523 332388 336016 339342 342398 345622 349535 353889 357750
56324 357750 360621 362856 364765 366140 366861 367096 366572 364566 361105 357361 354379 352234 350817 350486 351246
56309 351246 352147 352271 351697 350937 350128 349470 349682 351324 354150 357751 362135 367112 371822 375668 379065 382558
56293 382558 385812 388297 390426 393203 397082 401806 406946 412021 416624 421073 426456 433399 441264 449078
56279 449078 456688 464368 471985 479353 486964 495544 505187 515517 526334 537635 549417 561948 575696
56266E75696J4943J5674J6663J8852K1589K3318K3973K5077K7417L0316L3432
56255H26950L7452M2491M7529N2171N7592O4861P3569Q2768R2155J01607J10608
56244A589753J18844J26533J33610J39359J43152J44718J43491J38682J30292
56235B808434J19061J05202Q8198O8055M5730K2138k177k6230m8635o8646q6184
56224C024946j00786j11724j19163j24047j26827j27427j26290j23973j19954
56215A944755j13492j05566r8147r1580q4669p7444p1512o7293o3102n7785n2221
56204A061944m7361m2826l8370l4762l2148k9324k5819k2871k1191j9502j6708
56193G31062j3838j2340j1836j1100j0027r157q347p257o247n593m771l612l058
$$ plain form
56266 575696 590639 606313 622976 641828 663417 686735 710708 735785 763202 793518 826950
56255 826950 864402 906893 954422 1006593 1064185 1129046 1202615 1285383 1377538 1479145 1589753
56244 1589753 1708597 1835130 1968740 2108099 2251251 2395969 2539460 2678142 2808434
56235 2808434 2927495 3032697 3120895 3188950 3234680 3256818 3254641 3228411 3179776 3111130 3024946
56224 3024946 2924160 2812436 2693273 2569226 2442399 2314972 2188682 2064709 1944755
56215 1944755 1831263 1725697 1627550 1535970 1451301 1373857 1302345 1235052 1171950 1114165 1061944
56204 1061944 1014583 971757 933387 898625 866477 837153 811334 788463 767272 747770 731062
56193 731062 717224 704884 693048 681948 671921 662764 654417 647160 640913 635320 630549 626937 623879
56180F23879l626m194l573k290j573j473j222o49q6M75J040J135O05K56Q19J897
56164F11420K710L174L556L787L792L858M145M536N253O695Q435R500R884J0576
56150F91321J1881J3130J4325J6409J9421K2217K4567K7751L2237L6681M0162
56139I50102M3682M8305N3537N8659O4004O9718P4759P8291Q0584Q1453P9439
56128A682533P3823O5949N7519M9157M1616L6448L3866L1635K7576K1742J4939
56117B136803O938k207j0737j6919k1044k4471k8135l3201m1204n1760o1840o8932
56105A783291p3392p6137p6085p2049o5369n8298n1142m3229l5477k9593k5567
56094A176953k2039j8466j5143j1922q606n844m119k773j247j39J83O16J656K365
$$ plain form
56180 623879 620253 616059 612486 610196 608623 607150 605928 605279 605193 605668 606708 607843 608448 608704 609523 611420
56164 611420 614130 617304 620860 624647 628439 632297 636442 640978 646231 652926 661361 670861 680745 691321
56150 691321 703202 716332 730657 747066 766487 788704 813271 841022 873259 909940 950102
56139 950102 993784 1042089 1095626 1154285 1218289 1288007 1362766 1441057 1521641 1603094 1682533
56128 1682533 1756356 1822305 1879824 1928981 1970597 2007045 2040911 2072546 2100122 2121864 2136803
56117 2136803 2143741 2141534 2130797 2113878 2092834 2068363 2040228 2007027 1965823 1914063 1852223 1783291
56105 1783291 1709899 1633762 1557677 1485628 1420259 1361961 1310819 1267590 1232113 1202520 1176953
56094 1176953 1154914 1136448 1121305 1109383 1100777 1094933 1090814 1088041 1086794 1086655 1086838 1087454 1089110 1091475
56080A091475K408L249N660P886Q252P802Q315R402R816R971J0926J2201J2813
56067A200176J3182J4008J4713J4871J5574J7367J8667J8306J7812J8859K0368
56056A383903K0628K0379K1109K2012K1467K0027J9303J9192J8826J8741J9569
56045A605156K0212J9762J9604K1079K2927K3638K4290K6185K7885K7718K7231
56034A865687K8767L1539L3425L4780L7024L9297M0139M0718M2807M5239M6022
56023B285444M6203M7995N0793N2755N4570N7782O1188O2813O3778O6306O9733
56012B919360P2267P4749P8711Q2832Q5416Q8077R2863R8196J02021J06125J12698
56001C913315J19570J24069J28506J36309J45683J52992J59467J68386J78679
$$ plain form
56080 1091475 1093883 1097132 1102792 1110678 1118930 1126732 1135047 1144449 1154265 1164236 1175162 1187363 1200176
56067 1200176 1213358 1227366 1242079 1256950 1272524 1289891 1308558 1326864 1344676 1363535 1383903
56056 1383903 1404531 1424910 1446019 1468031 1489498 1509525 1528828 1548020 1566846 1585587 1605156
56045 1605156 1625368 1645130 1664734 1685813 1708740 1732378 1756668 1782853 1810738 1838456 1865687
56034 1865687 1894454 1925993 1959418 1994198 2031222 2070519 2110658 2151376 2194183 2239422 2285444
56023 2285444 2331647 2379642 2430435 2483190 2537760 2595542 2656730 2719543 2783321 2849627 2919360
56012 2919360 2991627 3066376 3145087 3227919 3313335 3401412 3494275 3592471 3694492 3800617 3913315
56001 3913315 4032885 4156954 4285460 4421769 4567452 4720444 4879911 5048297 5226976
55992E226976J87796J97803K11766K27195K40315K53611K71515K91899L10221
55983G419097L28818L53243L82427M11818M43319M82304N27543N74285O24604
55974A1547458O84312P52656Q26179R09370J009792J126431J255792J405541J588465
55965B1105996J807785K064375K374105K761884L245238L843798M598613N559120
55957D7360914O756700Q214730R975001J2085339J4573345J7459791K0749968
55950A37175788K4315774K7787151L0670743L2604283L3345159L2394620K8798594
55943C47092112K1666826J1107654j363563j3430565k3079832k9325080l2216043
55936B80451509l2427558l0828021k8196042k5099090k1905455j8853365j6091140
$$ plain form
55992 5226976 5414772 5612575 5824341 6051536 6291851 6545462 6816977 7108876 7419097
55983 7419097 7747915 8101158 8483585 8895403 9338722 9821026 10348569 10922854 11547458
55974 11547458 12231770 12984426 13810605 14719975 15729767 16856198 18111990 19517531 21105996
55965 21105996 22913781 24978156 27352261 30114145 33359383 37203181 41801794 47360914
55957 47360914 54117614 62332344 72307345 84392684 98966029 116425820 137175788
55950 137175788 161491562 189278713 219949456 252553739 285898898 318293518 347092112
55943 347092112 368758938 379866592 378503029 365072464 341992632 312667552 280451509
55936 280451509 248023951 217195930 188999888 163900798 141995343 123141978 107050838
55929A07050838j3681471j1620787r880400q427908p221873o214376n367685m657164
55921C9979174m058387l545546l102792k723816k399253k115712j866765j653030
55913A8513873j470859j311445j170921j050934r48863q57443p74520p03737o44784
55904I580367n91851n42513m99602m63344m29657l97168l68470l43465l18620
55895E625677k93724k72376k54878k37267k18388k01451j87544j73896j59643
55886C626510j47301j37299j26837j15460j06180r9695r2847q4260p6461p1017
55876B569153o6511o2812o2444o5836o9521p0872p0845p0624o9374o6800o4310
55865A829204o2222n9095n4928n1717m9821m7111m2856l9127l7255l5901l3800
$$ plain form
55929 107050838 93369367 81748580 71868180 63440272 56218399 50004023 44636338 39979174
55921 39979174 35920787 32375241 29272449 26548633 24149380 22033668 20166903 18513873
55913 18513873 17043014 15731569 14560648 13509714 12560851 11703408 10928888 10225151 9580367
55904 9580367 8988516 8446003 7946401 7483057 7053400 6656232 6287762 5944297 5625677
55895 5625677 5331953 5059577 4804699 4567432 4349044 4147593 3960049 3786153 3626510
55886 3626510 3479209 3341910 3215073 3099613 2993433 2893738 2800891 2716631 2640170 2569153
55876 2569153 2502642 2439830 2377386 2311550 2242029 2171157 2100312 2029688 1960314 1893514 1829204
55865 1829204 1766982 1707887 1652959 1601242 1551421 1504310 1461454 1422327 1385072 1349171 1315371
55854A315371l1505k9494k7345k5503k5141k5675k5233k3976k3918k5111k5257
55843A027213k3681k2336k2119k1526j9928j8878j9025j8805j7418j6190j5778
55832H11529j4889j3039j1830j2027j2077j0880r585r235r083q605q841j0253
55820F81185j1420j1304j0856j1012j1103j0486r842r576q822p248o024n701n052
55807E62739l359k014k276l043k387j29K432M305N149M889M029L504L576L669
55793E81084L584L650L512K298L47r29j315k167m013n647o284o734p599q218q361
55778E43208r162j1223j3417j4640j5210j5381j4227j1319q108o146n164m152
55766D15059l151k667k400j880j544j961k770l413m124n233o344p094p973r398
$$ plain form
55854 1315371 1283866 1254372 1227027 1201524 1176383 1150708 1125475 1101499 1077581 1052470 1027213
55843 1027213 1003532 981196 959077 937551 917623 898745 879720 860915 843497 827307 811529
55832 811529 796640 783601 771771 759744 747667 736787 727202 717967 708884 700279 691438 681185
55820 681185 669765 658461 647605 636593 625490 615004 605162 595586 586764 579516 573492 567791 562739
55807 562739 559380 557366 555090 552047 549660 549531 551963 556268 561417 566306 570335 573839 577415 581084
55793 581084 584668 588318 591830 594128 594475 593546 592231 590064 586051 580404 574120 567386 559787 551569 543208
55778 543208 534046 522823 509406 494766 479556 464175 449948 438629 430521 424375 419211 415059
55766 415059 411908 409241 406841 404961 403417 401456 398686 395273 391149 385916 379572 372478 364505 355107
55752C55107j0768j1267j0889r929q337o326m741l921l064j589l08k83j247k096
55738B80342k362k234j735p74K92Q87Q29K36o93j473j551j122j216k393l904m582
55722B58547m082k972k124k230l275m256m023k679j443j011q27k20O60J383J915
55707B33363K389K820L302L831L889K967J456J85q57k247l681m150l673l443l870
55692B32281l920k943j795j377j330r83n66n28n04P1R44J401J260R98J280K471
55676B26760M025M420K704J19j064m26K50k75j155j299j192j694k362k171j114
55661B25526k7N99P80O41N30R48J813K389K407K413K712K884K812L023L555L513
55645B56518K525J407P30j53j736l210l739l846m378m997m913m402m330m677m673
$$ plain form
55752 355107 344339 333072 322183 312254 303917 297591 292850 288929 285865 284276 283968 283685 282438 280342
55738 280342 277980 275746 274011 273237 273529 274416 275245 275481 274788 273315 271764 270642 269426 267033 263129 258547
55722 258547 254465 251493 249369 247139 243864 239608 235585 232906 231463 230452 229625 229405 230065 231448 233363
55707 233363 235752 238572 241874 245705 249594 252561 254017 254202 253345 251098 247417 243267 239594 236151 232281
55692 232281 228361 225418 223623 222246 220916 219933 219367 218839 218335 218406 219350 220751 222011 223009 224289 226760
55676 226760 230785 235205 237909 238028 236964 236538 236788 236513 235358 234059 232867 231173 228811 226640 225526
55661 225526 225499 226098 226878 227519 228049 228997 230810 233199 235606 238019 240731 243615 246427 249450 253005 256518
55645 256518 259043 260450 261180 261027 259291 256081 252342 248496 244118 239121 234208 229806 225476 220799 216126
55630B16126m150l700l728m058m341m300l826l232l011l111l001k621k458k408
55616A68181j689l09M82q0j192j776j868j907j735j222q51p85l29P22J195J88
55600A57025j375k042j827j652j566r95k07p3o31j111j211j293j521j734j967
55585A37820k256k201j486n26J31N86J110J409J198Q57P26L76m65r71k88J024
55569A37044J733J624J351J084N52O0K10P55Q93N34K31M4m54j107j202o25j12
55552A42615j96o07p53l63K97M95k92j463j667o47K00j69q36m16P06J065M44j9
55534A38394K34N87O10O47R33J185J237J198R71L65l69q51j105j176o95K39M79
55517A42883p13k199k309j206n03q11j296j381j308j052l23K06n51k070k397q70
$$ plain form
55630 216126 211976 208276 204548 200490 196149 191849 188023 184791 181780 178669 175668 173047 170589 168181
55616 168181 166492 166183 166665 166585 165393 163617 161749 159842 158107 156885 156034 155249 154920 155642 156837 157025
55600 157025 155650 153608 151781 150129 148563 147568 147361 147288 146657 145546 144335 143042 141521 139787 137820
55585 137820 135564 133363 131877 131351 131482 132068 133178 134587 135785 136642 137368 137744 137279 136308 136020 137044
55569 137044 138777 140401 141752 142836 143388 143448 143658 144413 145306 145840 146071 146115 145661 144554 143352 142727 142615
55552 142615 142419 141812 141059 140696 140993 141488 141196 139733 138066 137419 137619 137450 136614 136198 136904 137969 138413 138394
55534 138394 138628 139215 139825 140472 141405 142590 143827 145025 145996 146361 145992 145141 144036 142860 142165 142404 142883
55517 142883 142170 139971 137662 136456 135953 135142 133846 132465 131157 130105 129782 129988 129437 127367 124970 124100
55501A24100R17J433R96N13l3q84j534j530j365j567j701j170k89K51M06M91M56
55484A19490K13J35M95Q28O07J50J50N98Q43N84J29k00m53p70j111j220q95k77
55466A19296J13o4m64n02k38k74p44j111j070r72j056r79n04l9N4J16N20Q88O22
55447A13592Lp9O04J234J069L27k64m26m01l53j65J14J27k26m39j01M09M48J61
55428A15634K55O98O37j64p44l88K67L20L1J88O30N47k0j76M00J045J238J214
55410A21612J269J188P05p2q41j297j102k01Q19J174P04j27r01j399j358p03K6
55393A19496J60k33n05l21J15N38P18L88k91m41N22J893K436J927J093L46l89
55376A27452q65p28m24p12j271j039p1L01n11j425j324n55j28k41l33N3Q94J691
$$ plain form
55501 124100 125017 126450 127446 127959 127926 127042 125508 123978 122613 121046 119345 118175 117886 118137 118543 119034 119490
55484 119490 119703 119838 120333 121161 121768 121918 122068 122666 123509 124093 124222 124022 123569 122799 121688 120468 119573 119296
55466 119296 119409 119345 118881 118379 118141 117867 117123 116012 114942 113970 112914 111935 111431 111392 111446 111562 112082 112970 113592
55447 113592 113595 113516 114120 115354 116423 116750 116486 116060 115659 115306 115141 115255 115382 115156 114717 114616 115025 115473 115634
55428 115634 115889 116587 117224 117060 116316 115928 116195 116515 116546 116734 117364 117911 117891 117715 118115 119160 120398 121612
55410 121612 122881 124069 124774 124702 123861 122564 121462 121261 122080 123254 123958 123831 122930 121531 120173 119470 119496
55393 119496 119656 119423 118918 118597 118712 119250 119968 120356 120065 119624 120146 122039 124475 126402 127495 127841 127452
55376 127452 126587 125859 125435 124723 123452 122413 122342 122643 122132 120707 119383 118828 118700 118459 118126 118179 119073 120764
55358A20764J713P47l18m98j74n59j636k021j083Q0L97K24K58K89l3k31J49N81
55340A18649M27N7J07K93Q2j25L92J246J312L65o47r81q99r39j155j242j003n52
55322A15387k22k54m53l88NM02P21J210J689J436K96p52p45lM32K31m2N9L65M51
55302A19825J37l79o33l33K07L70R4q2O0Q6k25m05j26J87J22N2M71J105J326J098
55282A22957Q58Q42J020J284J274M82q61j585r41L56J111J166J133J155Q68L73
55266A31492K04M43O28N05J35n23j425j909j338j55M69J57l39m85o90j302j670
55249A24197r33O59J873J930J287Q62Q57O65j16j026j386j261j218j323r91m4
55233A24032Q14Q64K33m36o70k57P68J794J915J026Q0k29l98j084j800j616o47
$$ plain form
55358 120764 122477 123224 122906 122408 122234 121675 120039 118018 116935 117015 117412 117636 117894 118183 118150 117919 118068 118649
55340 118649 119076 119133 119240 119533 119615 119490 119882 121128 122440 122805 122158 121177 120278 119339 118184 116942 115939 115387
55322 115387 115165 114911 114458 114070 114075 114477 115198 116408 118097 119533 119829 119077 118332 118329 118761 118992 118950 119009 119374 119825
55302 119825 119962 119583 118950 118617 118824 119194 119288 119206 119266 119352 119127 118722 118596 118783 118905 118957 119428 120533 121859 122957
55282 122957 123815 124657 125677 126961 128235 128717 127856 126271 125330 125686 126797 127963 129096 130251 131119 131492
55266 131492 131696 132139 132767 133272 133407 132884 131459 129550 128212 128057 128526 128683 128344 127859 127169 125867 124197
55249 124197 123264 123923 125796 127726 129013 129875 130732 131397 131281 130255 128869 127608 126390 125067 124076 124032
55233 124032 124846 125710 125943 125507 124837 124580 125348 127142 129057 130083 130163 129934 129536 128452 126652 125036 124389
55216A24389J38L86N86R03Q38K14l48l09M1J30j03k62j01J45M7m48p52k28Q35
55197A26101J338P64q9k60J4j76r10j365j112n97k75l4L46P61R87R40O07J32j22
55178A27050J3J41j77o85p61l54J8J34K56M78N84O29R38J384J332N46l89p96n57
55159A29784J53J192K190K469J665K16r99j300n07R46K059J946P08o42j341j534
55143A37005j662j704j377p17m4M15N70L73k7k26j0L16L54J56K0r3m98j088j161
55124A30602k64J054J628R12m80j490j633j194o34j86M5Jk02k92p6M44J120J565
55106A30920J217L0r94o05J125K647K705J636N84M5k15l71m07l97l25J84J240
55089A39019K131K058J228N41L79M38N30P02O87J09o96r05m29p2k22k65K73Q12
$$ plain form
55216 124389 124527 124913 125499 126402 127240 127454 127106 126797 126838 126968 126865 126603 126502 126647 126694 126246 125494 125266 126101
55197 126101 127439 128203 128114 127854 127868 127692 126782 125417 124305 123708 123433 123399 123745 124506 125493 126433 127040 127172 127050
55178 127050 127063 127204 127027 126342 125581 125227 125245 125379 125635 126113 126697 127326 128264 129648 130980 131526 131137 130341 129784
55159 129784 129937 131129 133319 135788 137453 137669 136670 135370 134863 135809 137868 139814 140522 139880 138539 137005
55143 137005 135343 133639 132262 131545 131501 131916 132486 132859 132832 132606 132596 132912 133266 133422 133442 133349 132851 131763 130602
55124 130602 130338 131392 133020 133932 133452 131962 130329 129135 128501 128315 128360 128361 128159 127867 127791 128235 129355 130920
55106 130920 132137 132167 131173 130568 131693 134340 137045 138681 139265 139310 139095 138724 138317 137920 137595 137779 139019
55089 139019 141150 143208 144436 144977 145356 145794 146324 147026 147713 147822 147126 146221 145792 145720 145498 145233 145506 146318
55071A46318N17m57j168j061m34Q0J17k67p36r55q67o09k35K42N54L01m75j143
55053A39722j091l36O05J193J195P35K18j6j2p1l15o25r21j191j243q10L1Q06
55035A37874J110R01L54l01p27o30j63J18j79q12j118o45M18J306J307N03k56
55018A39060k86J21K11j28k46L13J167J637J567J371J392J448J102K99l54k67
55002A48407L30O22L35J58O94J503J668J013J72l10l73j60J85M63N95P51R65R15
54984A57933M72J07J99L82J29l79p34j156j974k602k169j000l11m24m73L3N76
54967A48609Q64J323J911J668K95r12p14L41Q19M04p5j85l11o05n79O9Q75J153
54949A54950P56J45r3K36P13O76o2r56j306r70l59M0P5J5K69Q39J159P86J56Q0
$$ plain form
55071 146318 146835 146378 145210 144149 143715 143795 143912 143645 142909 141954 141087 140478 140243 140485 141039 141340 140865 139722
55053 139722 138631 138295 138900 140093 141288 142023 142241 142225 142213 142142 141827 141202 140281 139090 137847 137037 137068 137874
55035 137874 138984 139885 140239 139938 139211 138581 138418 138536 138357 137545 136427 135782 136200 137506 138813 139316 139060
55018 139060 138774 138895 139106 138978 138732 139045 140212 141849 143416 144787 146179 147627 148729 149028 148674 148407
55002 148407 148737 149359 149694 149852 150546 152049 153717 154730 154902 154592 154219 154059 154244 154707 155302 156053 157018 157933
54984 157933 158405 158512 158711 159093 159222 158843 158109 156953 154979 152377 150208 149208 148897 148473 148000 148033 148609
54967 148609 149473 150796 152707 154375 154670 153758 153044 153385 154204 154608 154533 154348 154037 153432 152853 152922 153797 154950
54949 154950 155706 155851 155758 155994 156707 157383 157321 156365 155059 154089 153730 153770 153845 153860 154129 154968 156127 156913 157069 157149
54929A57149O16J024R25P43Q26R40R74J401K486L750M731N714P002P992P852O814
54913B10939N959N768N585M576K687M77j560l291m730n733o027n655n199n189
54899A98607n367n021m051l140k739k584k416k414k486j948o53K75k48j585k013
54884A62217q88P02J490J465J497K160L233M121M530M763N297O070O482O255N895
54869B15289N883N817M843K811M49j476k761l596m316n208o266p062p144o514
54855A90749n511m478l745l609l873l761k795j539r14r62r47n50l09p16j498k017
54839A53525j956j402o63j06L0j34k57k05j39k15m80r46j452j504p10N69J397
54822A45352J316Q59Q34J241J322N48o27j180o28M06R06O28K80M99R87R73J62
$$ plain form
54929 157149 157765 158789 159714 160457 161283 162223 163197 164598 167084 170834 175565 181279 188281 196273 204125 210939
54913 210939 216898 222666 228251 232827 235514 235991 234431 231140 226410 220677 214650 208995 203796 198607
54899 198607 193240 188219 184168 181028 178289 175705 173289 170875 168389 166441 165788 166063 165815 164230 162217
54884 162217 161329 162031 163521 164986 166483 168643 171876 175997 180527 185290 190587 196657 203139 209394 215289
54869 215289 221172 226989 231832 234643 235092 233616 230855 227259 222943 217735 211469 204407 197263 190749
54855 190749 185238 180760 177015 173406 169533 165772 162977 161438 160524 159562 158615 158065 157756 157040 155542 153525
54839 153525 151569 150167 149504 149398 149428 149294 149037 148832 148693 148478 147998 147052 145600 144096 143386 143955 145352
54822 145352 146668 147527 148361 149602 150924 151472 150845 149665 149037 149443 150349 150977 151257 151756 152743 153716 153878
54805A53878j017j888j906q42Q81K159K060Q48k22k78L17O18K93j00R3Q26J471
54788A57191J560J238R40P81N41J41j69k00r1l4PJ61M28P61J099J217Q69L17L73
54769A67130J555L353M704N081M864M769N201O032O779P082P025O906O642N730
54755B42853L921J546r73l466n655o951p106o681o381o201n729m947m198l565
54741A86467k880k222j815j513r51k08K14R0k79n94q57j095j137q34k18O03J530
54724A74301K427L262M144M994N371M970M252M099M834N874O366N824M264K036
54710B37018l30k390l983n088n637n671n518n459n375n011m454l976l518k808
54696A77800j955j490j667k022j883j135l59j67n14p58m55M5J32j45j60L10P85
$$ plain form
54805 153878 152861 150973 149067 148225 149106 151265 153325 154173 153951 153673 153990 154608 154901 154801 154894 155720 157191
54788 157191 158751 159989 160929 161710 162251 162392 162223 162023 161932 161898 161905 162066 162494 163255 164354 165571 166440 166757 167130
54769 167130 168685 172038 176742 181823 186687 191456 196657 202689 209468 216550 223575 230481 237123 242853
54755 242853 246774 248320 247347 243881 238226 231275 224169 217488 211107 204906 199177 194230 190032 186467
54741 186467 183587 181365 179550 178037 177086 176878 177092 177182 176903 176309 175452 174357 173220 172386 172168 172771 174301
54724 174301 176728 179990 184134 189128 194499 199469 203721 207820 212654 218528 224894 230718 234982 237018
54710 237018 236688 234298 230315 225227 219590 213919 208401 202942 197567 192556 188102 184126 180608 177800
54696 177800 175845 174355 172688 170666 168783 167648 167289 167122 166608 165850 165395 165440 165572 165427 165267 165577 166362
54679A66362R05R12R71P57J08n17p66r90j461j676j167m91n04j050j300j062q22
54662A58209p26n07k92n07r23p88m4N04L66o0k70k38mN27J146J354J031O17M34
54643A59829M61O88J091J179M43p10j258j006p79j006j060m46K62K75l27r33j215
54626A55488j105n02M58J249J515J405J109N58j31n27n33n62p34n83L2M64K20
54609A57821k46l29j46n6J05N38P80K98n36q61m48K20O52O09Lp84q75J52J513
54590A58410K131J917J476R43R0p14p64k22K6j79NR09J536R33m48j432j638j608
54572A61371j678j549r80l17l4q5K0N99J376J797J659J311J180J170Q10p2j006
54555A65572j375j045l54L64R94J387J156J33j113j541o82P61J572J221K24n38
$$ plain form
54679 166362 167267 168179 169150 169907 170015 169498 168732 167742 166281 164605 163438 162947 162443 161393 160093 159031 158209
54662 158209 157483 156976 156684 156177 155254 154466 154422 154926 155292 155232 154962 154724 154720 155247 156393 157747 158778 159395 159829
54643 159829 160290 160978 162069 163248 163691 162981 161723 160717 159938 158932 157872 157426 157688 157963 157636 156703 155488
54626 155488 154383 153881 154339 155588 157103 158508 159617 160175 160044 159517 158984 158422 157688 157105 157137 157601 157821
54609 157821 157575 157246 157100 157044 157149 157687 158467 158765 158229 157368 156920 157140 157792 158401 158404 157620 156745 156897 158410
54590 158410 160541 162458 163934 164877 164967 164253 163489 163267 163293 163114 163119 164028 165564 166497 166049 164617 162979 161371
54572 161371 159693 158144 157164 156847 156813 156728 156748 157347 158723 160520 162179 163490 164670 165840 166650 166578 165572
54555 165572 164197 163152 162798 163162 164156 165543 166699 166832 165719 164178 163496 164257 165829 167050 167274 166736
54539A66736n80O6J053J911K268K122J775J469J157O75j5p40j178j089n98j97
54523A74835k33n63q24r16q92o92l36j21k02k09J46M04l1p64q55k83K8k46l12
54504A67934L01Q64O44Q5k8J81J27j22q0J77J54j68l64l17k15j2M02P03M85Lj34
54483A70620Q6J33j39l22k52k01k50p9L84P43P15N06M00M64P53J328J884J867
54465A78640J190M46J29O7q8k35m6L69N22J86l09m86k48P5J37k8q5J57M77M86
54445A81356M7o42j256j535j395j049q71r66r47l80O36J470J561Q74j22q19r18
54428A75044o17l00RN98J392J754J284N15L40Q65J329J149N74K67M50P19N32j40
54410A85764o85m83K51N63p7j032j235n07L13M66O3k44r7K70L94J59kL76J113
$$ plain form
54539 166736 166156 166222 167275 169186 171454 173576 175351 176820 177977 178652 178637 177897 176719 175630 175032 174835
54523 174835 174602 174039 173215 172299 171407 170715 170379 170258 170056 169847 169993 170397 170366 169602 168747 168464 168492 168246 167934
54504 167934 168235 169099 169743 169828 169800 169981 170108 169986 169906 170083 170237 170069 169705 169388 169173 169161 169563 170266 170751 170754 170620
54483 170620 170706 170839 170700 170378 170126 169925 169675 169596 169980 170723 171438 171944 172344 172808 173561 174889 176773 178640
54465 178640 179830 180276 180405 180472 180384 180149 180103 180472 180994 181180 180871 180385 180137 180212 180349 180321 180236 180393 180870 181356
54445 181356 181403 180761 179505 177970 176575 175526 174655 173689 172742 172362 172998 174468 176029 176903 176781 175962 175044
54428 175044 174427 174127 174136 174734 176126 177880 179164 179679 180019 180884 182213 183362 183936 184203 184653 185372 185904 185764
54410 185764 185079 184596 184847 185410 185333 184301 183066 182559 182872 183338 183401 183157 183060 183330 183724 183883 183881 184257 185370
54391A85370J462J034L12j9J41M44P11R33R23N25O5J00P04J375J577J089l2j315
54373A95399j876j187J23O90r7j502k328k057j041J8N87O59P38J221J796J758
54357A92901J008K15q4j38m14q73j162j234j279j231p88PO29O31J39l60n32l47
54339A87088J12O95J089R75M13j89o00r68j332j243l88O90J117Q06N26P44J117
54322A90652J272J387J634J639J074L78L16J122K408L628M310M168L450K923L105
54307B23466L772M421M844M995M748M178L599K912J548n00k311l252l880m822
54293B43718n614n593n275n513n820m992l248k179k452k998k784k091j521r42
54279A92696j66L28J17l45l30K30R10J397J511J078K32n66j022j196j060n12Q8
$$ plain form
54391 185370 186832 187866 188178 188159 188300 188744 189455 190388 191311 191836 191901 192001 192705 194080 195657 196746 196714 195399
54373 195399 193523 192336 192459 193149 193052 191550 189222 187165 186124 186142 186729 187388 188126 189347 191143 192901
54357 192901 193909 194124 194040 193902 193488 192615 191453 190219 188940 187709 186921 186928 187557 188188 188327 187967 187435 187088
54339 187088 187200 187895 188984 189959 190372 190183 189583 188615 187283 186040 185652 186342 187459 188265 188791 189535 190652
54322 190652 191924 193311 194945 196584 197658 198036 198352 199474 201882 205510 209820 213988 217438 220361 223466
54307 223466 227238 231659 236503 241498 246246 250424 254023 256935 258483 257983 255672 252420 248540 243718
54293 243718 238104 232511 227236 221723 215903 210911 207663 205484 203032 200034 197250 195159 193638 192696
54279 192696 192530 192858 192975 192630 192300 192530 193440 194837 196348 197426 197658 197092 196070 194874 193814 193302 193390
54262A93390Q0n44j055j060q93o99l7J109J877J704J199J130J227Q41J47j98j83
54245A98035l04n81n76k38L6R8J48K12J30L9K53O97R16O87K49j34m15o60r25j209
54225A96458j309r02l7P40J006R43Q68O76J92k23o7M88P95O44M60N18N50K70k26
54206B01844p36j232j656j695j115k33K39j16r35j390j028j04Q71J636K005J653
54190A98008N66n08p99n90p65j282j133pR87Q83J19m50q77j457j609o74O10Q29
54172A91851k5n32J4O98N68J9k8N03R76J016P40L83J61K32N18P21P72Q82R95O47
54152B01111l06j266j610j443j234j085p95m10j48P8M94R16R00M63J18Q6O4q0
54134A95853O0O46J012N14m33q29n07k46m05l45L75J094R67L16K09R65J876K249
$$ plain form
54262 193390 193470 192926 191871 190811 189918 189219 189182 190291 192168 193872 195071 196201 197428 198269 198416 198218 198035
54245 198035 197731 197150 196574 196336 196372 196470 196618 196830 196960 196999 197252 197949 198865 199552 199801 199667 199252 198592 197667 196458
54225 196458 195149 194247 194210 194950 195956 196899 197767 198443 198635 198412 198345 198833 199628 200272 200732 201250 201800 202070 201844
54206 201844 201108 199876 198220 196525 195410 195177 195416 195300 194365 192975 191947 191843 192714 194350 196355 198008
54190 198008 198574 198066 197267 196677 195912 194630 193497 193490 194477 195360 195479 195029 194152 192695 191086 190412 191022 191851
54172 191851 191826 191294 191308 192006 192574 192593 192565 193068 194044 195060 195800 196183 196344 196576 197094 197815 198587 199469 200464 201111
54152 201111 200805 199539 197929 196486 195252 194167 193372 192962 192814 192892 193386 194302 195202 195665 195783 195869 195933 195853
54134 195853 195913 196559 197571 198085 197652 196823 196316 196070 195665 195320 195695 196789 197756 198072 198281 199246 201122 203371
54116B03371J969J077l61j784k275j550l23N79J008J213J291J234J095P89J70
54101B07503n30p74m34mJ11J8j64n54r60p68N5N78R1q37j207r50o34l33L07J123
54081B01637J550J594J791K170K082J255K61k93m69o43r04j042p92jJ181K188
54065B11565K533K366K183K062J632Q22P9k46k82k88l20m00n30m94L4R60J696
54048B23372J836J580J361J282J145Q93Q01J210K102L017L500L629L842M245M528
54033B58343M693N235O219O813O330N298M693M505L985L027K335K194K096J756
54019C17522J548J685J770J514J164Q35J80r38k010k604k906l184l296l184l269
54004C04827l763m140l862l237k930l006l094l120l209l116k516j720j354j353
$$ plain form
54116 203371 205340 206417 206056 204272 201997 200447 200124 200703 201711 202924 204215 205449 206544 207333 207503
54101 207503 206973 206199 205765 205761 205872 205890 205726 205172 204212 203444 203499 204077 204168 203331 202124 201174 200540 200207 200514 201637
54081 201637 203187 204781 206572 208742 210824 212079 212340 212047 211578 210935 210031 208989 208197 208196 209377 211565
54065 211565 214098 216464 218647 220709 222341 223163 223242 222996 222714 222426 222106 221706 221176 220682 220716 221676 223372
54048 223372 225208 226788 228149 229431 230576 231469 232270 233480 235582 238599 242099 245728 249570 253815 258343
54033 258343 263036 268271 274490 281303 287633 292931 297624 302129 306114 309141 311476 313670 315766 317522
54019 317522 319070 320755 322525 324039 325203 326038 326218 325280 323270 320666 317760 314576 311280 308096 304827
54004 304827 301064 296924 293062 289825 286895 283889 280795 277675 274466 271350 268834 267114 265760 264407
53990B64407r71j8O31J37j178k196k193j324j05J170K471L817N182O506P722Q838
53974B92896J0031J1539J3368J5151J6412J6838J6167J3963R912M370j665p242
53962D11740j1859j5150j6747j6704j5609j3981j1886r507p521o317n329l845
53950B77285k234j436j467j361o55L5J42K1K75R01J590K311L158L978M552M858
53934B91953M904M655M299M147M145L883L307K872K779K659K320K231K755L477
53920C40386L734L476L114K892K834L030L530M177M878N695O470O722O215N288
53906D02441M346L512K991L051L323K812J206n28j487k014k696l025k286j273
53892D10373j652l639n670o565o829p328p846p664o816n999n535n111m384l500
$$ plain form
53990 264407 263436 263418 264049 264186 263008 260812 258619 257295 257190 258360 260831 264648 269830 276336 284058 292896
53974 292896 302927 314466 327834 342985 359397 376235 392402 406365 416277 420647 418982 411740
53962 411740 399881 384731 367984 351280 335671 321690 309804 300297 292776 286459 281130 277285
53950 277285 275051 273615 272148 270787 270132 270167 270309 270330 270605 271506 273096 275407 278565 282543 287095 291953
53934 291953 296857 301512 305811 309958 314103 317986 321293 324165 326944 329603 331923 334154 336909 340386
53920 340386 344120 347596 350710 353602 356436 359466 362996 367173 372051 377746 384216 390938 397153 402441
53906 402441 406787 410299 413290 416341 419664 422476 423682 423154 421667 419653 416957 413932 411646 410373
53892 410373 408721 405082 399412 392847 386018 378690 370844 363180 356364 350365 344830 339719 335335 331835
53878C31835k965l142l805m221l921l238k841k831k825k752k967l500l794l390
53864B85643k467j564j210j750k975l882l503k138j133j205j701j763j402j033
53850B57917o65k65k64r03j543j389n97O5L52N04L93k99j042o55J065K731K899
53833B58304J680L10m22p60j149j476j266l87N96Q73K26o06o64J15Q41Q66N77
53816B57658P38J417K041K335K623L162L728M012M135M488N348O799Q765J0915
53802C18164J2791J4332J6087J8558K1475K4084K6068K7749K9137K9213K6393
53791E64051J9757R815j638j2269k0154k4477k5573k4374k1852j8830j5918j3394
53779D15144j1326r856r130q819q174o955n916n863o413o422n550m665m508m711
$$ plain form
53878 331835 328870 325728 321923 317702 313781 310543 307702 304871 302046 299294 296327 292827 289033 285643
53864 285643 283176 281612 280402 278652 275677 271795 268292 266154 265021 263816 262115 260352 258950 257917
53850 257917 257252 256987 256723 255820 254277 252888 252291 252356 252708 253212 253605 253306 252264 251609 252674 255405 258304
53833 258304 259984 260294 259872 259112 257963 256487 255221 254834 255430 256303 256529 255923 255259 255374 256215 257081 257658
53816 257658 258396 259813 261854 264189 266812 269974 273702 277714 281849 286337 291685 298484 307249 318164
53802 318164 330955 345287 361374 379932 401407 425491 451559 479308 508445 537658 564051
53791 564051 583808 593623 591985 579716 559562 535085 509512 485138 463286 444456 428538 415144
53779 415144 403818 393962 384832 376013 367839 360884 354968 349105 342692 336270 330720 326055 321547 316836
53765C16836m598m294m297m427l981k920k054j908k058j897j482j192r71l97O45
53750B81005J820K776L399L691L773M031M827O077P249P869P824P161N879M017
53736C51398J729p84l204n041n905o004o049o500p045o969n920m193k509j537
53722B91467j385j401p15P89K278K868K490J746J152Q75Q43Q18M65k68r66j191
53706B99865r05k59O94J740K336K262K137K654L461L567K755J832J459J505J710
53691C26813K146K706K859K446K042K010J811Q58l73q88n24p0j27n44r43j258
53675C38964j593j963k318k495k204j316k28M58N43L29J01p5r4J51M50L40l18
53658C28732j136j693j925j872j444o90n8R1k0Q3L88M17P1m7N98J657K245J970
$$ plain form
53765 316836 312238 307944 303647 299220 295239 292319 290265 288357 286299 284402 282920 281728 280757 280360 281005
53750 281005 282825 285601 289000 292691 296464 300495 305322 311399 318648 326517 334341 341502 347381 351398
53736 351398 353127 352343 349139 344098 338193 332189 326140 319640 312595 305626 299706 295513 293004 291467
53722 291467 290082 288681 287966 288755 291033 293901 296391 298137 299289 300164 301007 301825 302290 302022 301056 299865
53706 299865 298960 298701 299395 301135 303471 305733 307870 310524 313985 317552 320307 322139 323598 325103 326813
53691 326813 328959 331665 334524 336970 339012 341022 342833 343691 343318 342430 341906 341836 341709 341165 340222 338964
53675 338964 337371 335408 333090 330595 328391 327075 326847 327305 327848 328177 328278 328203 328109 328260 328710 329050 328732
53658 328732 327596 325903 323978 322106 320662 319972 319914 320005 319985 320068 320456 320873 320944 320897 321495 323152 325397 327367
53640C27367J238O77N77R24J520J913J671R57N41R23J710K192K207K043J838J601
53624C49899J606K093K666K686K209J987K369K983L490M064M801N354N479N352
53610C97038N051M367L481L101L422L664L223K693K911L565L665K997K214J698
53596D43090J264R07Q47Q51L65n40j177j294j345j525j368p50m34j061k193k859
53580D32778k728k167j574j188j208j602j895j690j223j056j333j719j998k236
53566D09161k375k128j421o14j23Mj2J3R9K10L23M08M60N48P33R73J137J116R46
53547D09458Q16R37J412K128K848L379L719L940M026L946L921M376N396O479P014
53532D63795P028P119P738Q827J0145J1579J2976J4058J4756J5355J6175J7263
$$ plain form
53640 327367 328605 329282 329859 330783 332303 334216 335887 336844 337385 338308 340018 342210 344417 346460 348298 349899
53624 349899 351505 353598 356264 358950 361159 363146 365515 368498 371988 376052 380853 386207 391686 397038
53610 397038 402089 406456 409937 413038 416460 420124 423347 426040 428951 432516 436181 439178 441392 443090
53596 443090 444354 445261 446108 446959 447324 446784 445607 444313 442968 441443 440075 439325 438891 437830 435637 432778
53580 432778 430050 427883 426309 425121 423913 422311 420416 418726 417503 416447 415114 413395 411397 409161
53566 409161 406786 404658 403237 402623 402500 402504 402492 402505 402604 402814 403137 403545 404005 404553 405286 406259 407396 408512 409458
53547 409458 410274 411211 412623 414751 417599 420978 424697 428637 432663 436609 440530 444906 450302 456781 463795
53532 463795 470823 477942 485680 494507 504652 516231 529207 543265 558021 573376 589551 606814
53520F06814J8534J9866K0994K1633K1847K1922K1675K0502J8405J6468J5722
53509H24382J5998J6423J6741J7358J8329J9190J9750K0349K1136K1722K1801
53498A033179K1547K1162K0542J9687J9027J8958J9266J9375J9027J8467J8088
53487A248325J8062J8259J8395J8292J8093J8154J8623J9169J9198J8321J6684
53476A449575J4788J3012J1328R552P676N739L536R61j502l253m572o408q929
53463A491503j1084j2048j2316j2664j2870j2471j2125j3010j5100j7287j9046
53452A341482k0787k2473k3222k2646k1565k0824k0322j9657j8920j8235j7217
53441A115614j5477j3209j0809q415o257m868m428m361m038l446k768j791k99
$$ plain form
53520 606814 625348 645214 666208 687841 709688 731610 753285 773787 792192 808660 824382
53509 824382 840380 856803 873544 890902 909231 928421 948171 968520 989656 1011378 1033179
53498 1033179 1054726 1075888 1096430 1116117 1135144 1154102 1173368 1192743 1211770 1230237 1248325
53487 1248325 1266387 1284646 1303041 1321333 1339426 1357580 1376203 1395372 1414570 1432891 1449575
53476 1449575 1464363 1477375 1488703 1498255 1505931 1511670 1515206 1516167 1514665 1511412 1506840 1500432 1491503
53463 1491503 1480419 1468371 1456055 1443391 1430521 1418050 1405925 1392915 1377815 1360528 1341482
53452 1341482 1320695 1298222 1275000 1252354 1230789 1209965 1189643 1169986 1151066 1132831 1115614
53441 1115614 1100137 1086928 1076119 1067704 1061447 1056579 1052151 1047790 1043752 1040306 1037538 1035747 1035448
53428A035448J425K992M482O088P576Q642R463J0409J1490J2651J4249J6616J9303
53415A160834K1335K2235K2401K2550K3208K4600K6600K8690L0361L1621L2943
53404A447378L4719L6850L8855M0335M1407M2696M4682M7128M9433N1381N3142
53393A928006N4577N5263N5261N5236N5483N5518N4931N4003N3013N1651M9618
53382B522560M7300M5212M3198M0785L7885L4592L0696K6097K1328J7058J3244
53371B879955R354N077L09n113j1088j7030k2613k8295l4422m0278m4867m8223
53359B642766n1026n3189n4031n3662n3090n2836n2398n1353n0003m8714m7343
53348B075121m5712m4014m2516m1364m0791m0910m1189m0764l9437l7687l5796
$$ plain form
53428 1035448 1036873 1039865 1044347 1050435 1058011 1066653 1076116 1086525 1098015 1110666 1124915 1141531 1160834
53415 1160834 1182169 1204404 1226805 1249355 1272563 1297163 1323763 1352453 1382814 1414435 1447378
53404 1447378 1482097 1518947 1557802 1598137 1639544 1682240 1726922 1774050 1823483 1874864 1928006
53393 1928006 1982583 2037846 2093107 2148343 2203826 2259344 2314275 2368278 2421291 2472942 2522560
53382 2522560 2569860 2615072 2658270 2699055 2736940 2771532 2802228 2828325 2849653 2866711 2879955
53371 2879955 2889309 2894386 2894695 2889582 2878494 2861464 2838851 2810556 2776134 2735856 2690989 2642766
53359 2642766 2591740 2538551 2484520 2430858 2377768 2324932 2272534 2221181 2171178 2122464 2075121
53348 2075121 2029409 1985395 1942879 1901515 1860724 1819814 1778625 1737861 1698424 1660737 1624941
53337A624941l3652l1427k9520k7671k5167k2182j9879j8758j7896j6450j4959
53326A367380j4318j4387j4505j4729j5425j6097j5764j4390j2989j2240j1812
53315A210724j1113r989q598p152n904m953l991k688j203J06J402L191N421P473
53301A172726R079J0658J2523J4385J5943J7380J8900K0278K1391K2754K4836
53290A360853K7035K8068K7459K6121K5249K5015K4633K3361K1160J8557J6144
53279A623655J4167J2327J0027O998L663O95j709l926o263q607j0744j2800j5089
53266A612394j7700k0347k2590k4070k4752k4987k5206k5451k5505k5521k6060
53255A350205k7217k8141k8042k7311k6994k7243k7126k6079k4774k4174k4342
$$ plain form
53337 1624941 1591289 1559862 1530342 1502671 1477504 1455322 1435443 1416685 1398789 1382339 1367380
53326 1367380 1353062 1338675 1324170 1309441 1294016 1277919 1262155 1247765 1234776 1222536 1210724
53315 1210724 1199611 1189622 1181024 1173872 1167968 1163015 1159024 1156336 1155133 1155239 1156641 1159832 1165253 1172726
53301 1172726 1181805 1192463 1204986 1219371 1235314 1252694 1271594 1291872 1313263 1336017 1360853
53290 1360853 1387888 1415956 1443415 1469536 1494785 1519800 1544433 1567794 1588954 1607511 1623655
53279 1623655 1637822 1650149 1660176 1667174 1670837 1671532 1669823 1665897 1659634 1651027 1640283 1627483 1612394
53266 1612394 1594694 1574347 1551757 1527687 1502935 1477948 1452742 1427291 1401786 1376265 1350205
53255 1350205 1322988 1294847 1266805 1239494 1212500 1185257 1158131 1132052 1107278 1083104 1058762
53244A058762k4705k4984k5199k5070k4167k2661k1286k0432j9704j8601j7203
53233H14750j5956j5071j4370j3547j2295j0473q414p005p019q306r938j1179
53221F81177j2049j2843j3510j3827j3889j3967j3983j3549j2615j1617j0858
53210E38470j0084q991p851p311p599q258q639q581q473q688q989q699p593o407
53196D22307o042o373o428n779n121n163n616n778n585n371n022m178l127k599
53182C50125k643k495j786j159j297j903k155j795j273j055j170j403j487j187
53168C27317m23N20J080Q93J98l19j62M77R87J068R43Q24N63R9j80OJ92k77j164
53149C32642j485q49L8L22j7m57o77o55l43J67M14n0j009j651j425o70k40n41
$$ plain form
53244 1058762 1034057 1009073 983874 958804 934637 911976 890690 870258 850554 831953 814750
53233 814750 798794 783723 769353 755806 743511 733038 724624 717619 710600 702294 692356 681177
53221 681177 669128 656285 642775 628948 615059 601092 587109 573560 560945 549328 538470
53210 538470 528386 519395 511544 504233 496634 488376 479737 471156 462683 453995 445006 436307 428714 422307
53196 422307 416265 409892 403464 397685 392564 387401 381785 376007 370422 365051 360029 355851 352724 350125
53182 350125 347482 344987 343201 342042 340745 338842 336687 334892 333619 332564 331394 329991 328504 327317
53168 327317 326894 327414 328494 329387 329585 329266 329104 329581 330568 331636 332579 333403 333966 334065 333885 333891 334083 333806 332642
53149 332642 331157 330308 330346 330668 330651 330194 329517 328862 328519 328686 329100 329050 328041 326390 324965 324295 324055 323514
53131C23514j105j207p16j38J53K35J34l96j262j702j228n09n44j204j411p67
53115C11847o1l1m64q27j016j048p44k30j43p70j432j332o46j79k62n81q86j220
53097B99975j535j646j516j285j019p66p13r17j043o85O9P88J270J632J812J486
53081B95907N56m95j016q69n60o70j152j375r52k89JK3L82J099J429R54J73l25
53063B92821o50j101j413j198o75k96J9O18J301J542J377J372J635J638J118N79
53047B98687O21J272K144K841L017K476J498P36N95Q34R51P11J87m54j017j299
53031C13800j244j009q09p24p12o94o59p03q88j037q45l03J59J27l54r33j325
53014C01847j319p32K41Q99P46J70j4L66P37O47K88k4l01o71r83r46n06P0L62
$$ plain form
53131 323514 322409 321202 320486 320348 320501 320736 320870 320474 319212 317510 316282 315773 315229 314025 312614 311847
53115 311847 311786 311755 311291 310464 309448 308400 307656 307426 307283 306513 305081 303749 303103 302924 302662 302081 301195 299975
53097 299975 298440 296794 295278 293993 292974 292208 291495 290578 289535 288850 288919 289707 290977 292609 294421 295907
53081 295907 296463 295968 294952 294083 293523 292853 291701 290326 289374 289085 289086 289109 289491 290590 292019 292973 293146 292821
53063 292821 292171 291070 289657 288459 287784 287488 287507 288125 289426 290968 292345 293717 295352 296990 298108 298687
53047 298687 299308 300580 302724 305565 308582 311058 312556 313292 313887 314721 315672 316383 316570 316116 315099 313800
53031 313800 312556 311547 310738 310014 309302 308608 307949 307246 306358 305321 304476 304173 304332 304459 304105 303172 301847
53014 301847 300528 299796 300037 300936 301682 301852 301838 302204 302941 303588 303876 303852 303551 302880 301897 300951 300445 300515 300877
52995C00877J02n51j049r58l44M19J021J181O36l99r94m12Q25J426R38K56L17
52978C03291R59J411J388J244J288J357J093M34j89j92M63J051R41N21P57J837
52962C17654K856L025K528J892J186L01m20n63l77n68j375k253k487j826o37L29
52946C19265M55j71q28r79q83j125j793k448k735k607k088j291o15m83q19j103
52930B99752j013p10m21r6L78Q64J087R42N51J39j14j84k40m29o55o53l69o4j0
52911B98755j92m04m63k49K99J024J446J101N2j037j478j166n50r6R8J72K14K36
52893B97762K81M18O18Q23J059J344J490J199M09o03j455j879j736j100l41J04
52877B98393J31K7L6J52K99M68N04J25o02j032o65J20M05j81j078j492j116m7
$$ plain form
52995 300877 300979 300428 299379 298421 298077 298496 299517 300698 301334 300935 299941 299529 300354 301780 302718 302974 303291
52978 303291 304250 305661 307049 308293 309581 310938 312031 312465 312276 312084 312547 313598 314539 315060 315817 317654
52962 317654 320510 323535 326063 327955 329141 329442 329022 328459 328082 327514 326139 323886 321399 319573 318936 319265
52946 319265 319720 319549 318721 317742 316859 315734 313941 311493 308758 306151 304063 302772 302157 301674 300855 299752
52930 299752 298739 298029 297608 297512 297890 298754 299841 300783 301334 301473 301359 301175 300935 300506 299851 299198 298829 298765 298755
52911 298755 298563 298159 297696 297447 297746 298770 300216 301317 301369 300332 298854 297688 297138 297042 297140 297312 297526 297762
52893 297762 298043 298461 299079 299902 300961 302305 303795 304994 305403 304800 303345 301466 299730 298630 298289 298393
52877 298393 298524 298551 298587 298739 299038 299506 300010 300135 299533 298501 297836 297956 298361 298180 297102 295610 294494 294447
52859B94447J512L196M324M336L402K365J870J738J307L51o64j306j786k563l487
52844C09042l846l348k640k477k748k763k339k076k421k982l007k268j172j87
52830B74768M86P86P54O06O18P56O57J47m45o33l91j57k77o39r48j115j209j167
52812B72597p99p8P90J624K403L064L352L134K720K607K854K975K511J501K24
52797C01479j226k755l831l748k519j144o50j062j584j675j535j603j875j918
52783B74354j408n40J06J28j64j1Q00J446J018j57p37k5J193J749J495J116R61
52766B81324P62L45K0J00M28O06M15n4n16o86m70m4L90Q04J201J372J023J57q63
52747B86314j572j619r59PO27O47M68N16N89K83j81j27N64J228J307R29M99J61
$$ plain form
52859 294447 295959 299155 303479 307815 311217 313582 315452 317190 318497 318848 318184 316878 315092 312529 309042
52844 309042 305196 301848 299208 296731 293983 291220 288881 286805 284384 281402 278395 276127 274955 274768
52830 274768 275254 276040 276794 277400 278018 278774 279431 279578 279133 278500 278109 277952 277675 277036 276088 274973 273764 272597
52812 272597 271798 271720 272510 274134 276537 279601 282953 286087 288807 291414 294268 297243 299754 301255 301479
52797 301479 300253 297498 293667 289919 287400 286256 285606 284544 282960 281285 279750 278147 276272 274354
52783 274354 272946 272406 272512 272640 272476 272465 273265 274711 275729 275572 274835 274810 276003 277752 279247 280363 281324
52766 281324 282086 282431 282451 282551 282979 283585 284000 283946 283430 282744 282274 282230 282620 283424 284625 285997 287020 287177 286314
52747 286314 284742 283123 282164 282171 282798 283445 283913 284429 285018 285301 285120 284993 285557 286785 288092 289021 289520 289681
52729B89681o9r7N2Q5j18k81j55R6K10K87N92J015J075M86m72j142j076m63L9
52710B89745K5j62M3N47O31o3r97j436j200n92N4M42L22j91o03o81p87j227j610
52691B82260j315m28L62O95Q85J333K015K604K804K457J673R21O96J015J360J232
52675C00569N91j65n37k25O32J534K006J955J565J014M81K43M31P31O46J30l14
52658C11287k59J21K67j35q51j347j268p00L4P52J405J806J607P82j84p77r87
52641C11553j135j330j399j220q94n73l45k13k3M68J224J834K033K109K446K920
52625C17455L155L230L523L825L276J486p31k143k330j881j543j610j932k220
52611C21560k224j873j342r00o41m53k72k33m05m31J85J296J968J528N51J88O01
$$ plain form
52729 289681 289612 289515 289567 289652 289534 289253 289098 289194 289404 289691 290283 291298 292373 292859 292387 291245 290169 289706 289745
52710 289745 289770 289608 289651 290198 290829 290766 289769 288333 287133 286541 286595 287037 287359 287168 286565 285884 285097 283870 282260
52691 282260 280945 280517 280879 281574 282459 283792 285807 288411 291215 293672 295345 296266 296962 297977 299337 300569
52675 300569 301160 300995 300458 300233 300865 302399 304405 306360 307925 308939 309420 309663 310094 310825 311471 311601 311287
52658 311287 311028 311149 311416 311281 310430 309083 307815 307115 307149 307901 309306 311112 312719 313501 313317 312540 311553
52641 311553 310418 309088 307689 306469 305575 305002 304657 304444 304421 304889 306113 307947 309980 312089 314535 317455
52625 317455 320610 323840 327363 331188 334464 335950 335219 333076 330746 328865 327322 325712 323780 321560
52611 321560 319336 317463 316121 315221 314580 314127 313855 313622 313217 312786 312971 314267 316235 317763 318314 318502 319103
52594C19103Q13L22m1N51J479J540P18R2J70L98M05N86J136J523J445J489K112
52577C33841K726K534J901J921K820L649L559K736J884J323Q71L06l61r84j506
52562C57220k016k555k912k806k322j933j973k308k619k746k619k169j562j186
52548C25494j130j017o22k88k76j52N73J481J693J124N37L68K84O0M5L91N74J64
52530C29303m44o32m61m02n00m24j33J44M09P57Q83L54n75j027n75L18J120J868
52512C29983K690L231L074K439J936J776J718J667J835K222K412K036J166J49
52498C58334p30j313j540j519j523j751k139k448k402j848r78m18p57j840k758
52483C34370k694j677m12M24O37N30O48J288K116K426K003J444J392J796K199
$$ plain form
52594 319103 319916 320238 320197 320748 322227 323767 324485 324577 324747 325145 325550 326136 327272 328795 330240 331729 333841
52577 333841 336567 339101 341002 342923 345743 349392 352951 355687 357571 358894 359765 360071 359710 358726 357220
52562 357220 355204 352649 349737 346931 344609 342676 340703 338395 335776 333030 330411 328242 326680 325494
52548 325494 324364 323347 322725 322437 322161 322009 322582 324063 325756 326880 327417 327785 328069 328129 328174 328565 329139 329303
52530 329303 328859 328227 327766 327364 326864 326440 326307 326451 326860 327617 328500 328854 328279 327252 326677 326995 328115 329983
52512 329983 332673 335904 338978 341417 343353 345129 346847 348514 350349 352571 354983 357019 358185 358334
52498 358334 357604 356291 354751 353232 351709 349958 347819 345371 342969 341121 340143 339725 338968 337128 334370
52483 334370 331676 329999 329587 330011 330648 331178 331826 333114 335230 337656 339659 341103 342495 344291 346490
52468C46490K463K663K553J808Q22N96J566K963L698L500K923K416J863R14m62
52453C76776j885k894l360l563l848m270m654m875m870m463l545k433j707j576
52439C28833j658j505j074n66j45R3J31J44L48N34K40m83q86n20R2K28J19N43
52421C24468J466J836J020k32o94j70M70N88O35J420K870L950L927L334L358M479
52405C52725O128P660R013J0285J1274J1792J1941J1501R604N754Q96l354o378
52392D38841q707j0547j1154j0030p921o066m944m186l331k268j228o58q12j247
52378C65742j109j71R06J614K257L157L893M036M055M628N430N579M980M249L436
52363D12682K001J39j054j115q57r93j141q56o46j030j356o66O90J478J351J135
$$ plain form
52468 346490 348953 351616 354169 355977 356799 357395 358961 361924 365622 369122 372045 374461 376324 377238 376776
52453 376776 374891 371997 368637 365074 361226 356956 352302 347427 342557 338094 334549 332116 330409 328833
52439 328833 327175 325670 324596 324030 323885 323978 324109 324253 324601 325135 325375 324892 324006 323486 323578 323806 323925 324468
52421 324468 325934 327770 328790 328558 327864 327694 328164 328752 329387 330807 333677 337627 341554 344888 348246 352725
52405 352725 358853 366513 375526 385811 397085 408877 420818 432319 441923 447677 448573 445219 438841
52392 438841 430134 419587 408433 398403 390482 384416 379472 375286 371955 369687 368459 367801 366989 365742
52378 365742 364633 364462 365368 366982 369239 372396 376289 380325 384380 389008 394438 400017 404997 409246 412682
52363 412682 414683 414822 413768 412653 411796 410803 409662 408806 408160 407130 405774 405108 405798 407276 408627 409762
52347D09762J405J853K220K798L631M111L861L361L235L429L635L949M544N153
52333D56947N476N824O707P950Q858R216R641J0840J2917J5349J7322J8114J7653
52320F02814J6764J6559J7357J8435J8871J8489J7888J7774J8305J8949J9025
52309H01230J8487J8032J8265J8961J9498J9842K0473K1382K1741K0857J9067
52298A017835J7366J6376J5887J5143J3416J0516P031L888J503m67k459m404o010
52285A105621p224q109q513q298p715p231o983o740o294n586m548l206j816o43
52271A022715M15J663L084M383N537O942Q838J0951J2782J4062J4780J4985J4794
52258A135931J4436J4167J4189J4585J5242J5861J6203J6338J6349J5907J4520
$$ plain form
52347 409762 411167 413020 415240 418038 421669 425780 429641 433002 436237 439666 443301 447250 451794 456947
52333 456947 462423 468247 474954 482904 491762 500978 510619 521459 534376 549725 567047 585161 602814
52320 602814 619578 636137 653494 671929 690800 709289 727177 744951 763256 782205 801230
52309 801230 819717 837749 856014 874975 894473 914315 934788 956170 977911 998768 1017835
52298 1017835 1035201 1051577 1067464 1082607 1096023 1106539 1113570 1117458 1118961 1118494 1116035 1111631 1105621
52285 1105621 1098397 1090288 1081775 1073477 1065762 1058531 1051548 1044808 1038514 1032928 1028380 1025174 1023358 1022715
52271 1022715 1023130 1024793 1027877 1032260 1037797 1044739 1053577 1064528 1077310 1091372 1106152 1121137 1135931
52258 1135931 1150367 1164534 1178723 1193308 1208550 1224411 1240614 1256952 1273301 1289208 1303728
52247A303728J2224R607P031M280J316j193k577l176m029n597p341q614r440j0178
52233A286041j0805j0993j0741j0558j0920j1705j2275j2079j1127r898q842q030
52221A158068p355o882o739o684o093m693l037j920j304l33J413L147L834L664
52207A125086L877N080O469P002O799O709O939O854O106N151M557M351M333M438
52193A203751M480M061L148K350K195K471K710K917L246L318K588J267Q1q40k137
52178A235606m093o103p575q692r823j0691j0764j0123r376q809q097o827m945
52165A129688k708n76R15J524J640K017L083M589N860O327N927N125M399L601
52151A171411K120m2j776j932p13O26J337J740K195K375J983J592J946K739K756
$$ plain form
52247 1303728 1315952 1325559 1332590 1336870 1338186 1336993 1334416 1331240 1327211 1321614 1314273 1305659 1296219 1286041
52233 1286041 1275236 1264243 1253502 1242944 1232024 1220319 1208044 1195965 1184838 1174940 1166098 1158068
52221 1158068 1150713 1143831 1137092 1130408 1124315 1119622 1116585 1114665 1113361 1113028 1114441 1117588 1121422 1125086
52207 1125086 1128963 1134043 1140512 1147514 1154313 1161022 1167961 1174815 1180921 1186072 1190629 1194980 1199313 1203751
52193 1203751 1208231 1212292 1215440 1217790 1219985 1222456 1225166 1228083 1231329 1234647 1237235 1238502 1238583 1237743 1235606
52178 1235606 1231513 1225410 1217835 1209143 1199320 1188629 1177865 1167742 1158366 1149557 1141460 1134633 1129688
52165 1129688 1126980 1126404 1127319 1128843 1130483 1132500 1135583 1140172 1146032 1152359 1158286 1163411 1167810 1171411
52151 1171411 1173531 1173489 1171713 1169781 1169068 1169694 1171031 1172771 1174966 1177341 1179324 1180916 1182862 1185601 1188357
52136A188357J353p49k294k742k462j924j134J41J877L843O071Q894J2315J5664
52122A227210J8266K0340K2680K5437K7801K9141K9850L0622L1341L1359L0604
52111A524651K9636K8636K7084K4650K1808J9234J7100J5337J4128J3584J3281
$$ plain form
52136 1188357 1189710 1188961 1186667 1183925 1181463 1179539 1178405 1178546 1180423 1184266 1190337 1199231 1211546 1227210
52122 1227210 1245476 1265816 1288496 1313933 1341734 1370875 1400725 1431347 1462688 1494047 1524651
52111 1524651 1554287 1582923 1610007 1634657 1656465 1675699 1692799 1708136 1722264 1735848 1749129
$$ [...]
##END NTUPLES=NMR SPECTRUM
##END=
