##TITLE=AC1561_ROEFFECT0018_8270796_OJMknnd640
##JCAMPDX= 6.0         $$ Bruker NMR JCAMP-DX V2.0
##DATA TYPE= NMR SPECTRUM
##DATA CLASS= NTUPLES
##ORIGIN= BRUKER
##OWNER= Administrator
$$ 1.72 TOPSPIN		Version 2.1
$$ 2013-10-12 20:47:22.960 -0700  Administrator@X
$$ Compression mode = diff/dup
##.OBSERVE FREQUENCY= 400.02188249412
##.OBSERVE NUCLEUS= ^1H
##.ACQUISITION MODE= SIMULTANEOUS (DQD)
##.ACQUISITION SCHEME= undefined
##.AVERAGES= 8
##.DIGITISER RES= 22
##SPECTROMETER/DATA SYSTEM= spect
##.PULSE SEQUENCE= zg30
##.SOLVENT NAME= COFFEE_meoh
##.SHIFT REFERENCE= INTERNAL, COFFEE_meoh, 1, 14.98509
##AUDIT TRAIL= $$ (NUMBER, WHEN, WHO, WHERE, PROCESS, VERSION, WHAT)
$$ ##TITLE= Audit trail, TOPSPIN		Version 2.1
$$ ##JCAMPDX= 5.01
$$ ##ORIGIN= Bruker BioSpin GmbH
$$ ##OWNER= Administrator
$$ $$ E:\/data/COFFEE/nmr/AC1561_ROEFFECT0018_8270796_OJMknnd640/10/pdata/1/auditp.txt
$$ ##AUDIT TRAIL=  $$ (NUMBER, WHEN, WHO, WHERE, PROCESS, VERSION, WHAT)
(   1,<2013-10-12 20:47:16.506 -0700>,<Administrator>,<X>,<go>,<TOPSPIN 2.1>,
      <created by zg
	started at 2013-10-12 20:46:09.724 -0700,
	POWCHK enabled, PULCHK disabled,
       configuration hash MD5:
       C8 4E 4E 5D D3 5C D8 9E 9F 52 82 E0 59 8A DE 15
       data hash MD5: 64K
       FA F7 7E E9 FA CF 0D 38 33 CB C2 C3 B2 B8 FE BB>)
(   2,<2013-10-12 20:47:19.381 -0700>,<Administrator>,<X>,<proc1d>,<TOPSPIN 2.1>,
      <Start of raw data processing
       efp LB = 0 FT_mod = 6 PKNL = 1 PHC0 = 0 PHC1 = 0 SI = 32K 
       data hash MD5: 32K
       CA CA 8B C1 AF BC 6C FB 4B 23 D8 94 84 F9 21 04>)
(   3,<2013-10-12 20:47:19.663 -0700>,<Administrator>,<X>,<proc1d>,<TOPSPIN 2.1>,
      <pk PHC0 = 96.17432 PHC1 = 0 
       data hash MD5: 32K
       3E 69 32 16 66 E5 23 2E 91 F2 F9 DD A6 C0 85 54>)
(   4,<2013-10-12 20:47:19.756 -0700>,<Administrator>,<X>,<proc1d>,<TOPSPIN 2.1>,
      <abs ABSG = 1 
       data hash MD5: 32K
       99 0F B6 78 89 2B CA 2B CF 45 B2 EA CA 11 22 16>)
(   5,<2013-10-12 20:47:19.835 -0700>,<Administrator>,<X>,<proc1d>,<TOPSPIN 2.1>,
      <abs ABSG = 2 
       data hash MD5: 32K
       11 1B 13 24 32 7C 61 79 73 C5 58 BE 96 CF 4A 6B>)
(   6,<2013-10-12 20:47:19.881 -0700>,<Administrator>,<X>,<proc1d>,<TOPSPIN 2.1>,
      <abs ABSG = 3 
       data hash MD5: 32K
       7B 45 86 DB 83 19 5B 72 72 3A 50 06 EA 2A 2E 96>)
(   7,<2013-10-12 20:47:19.975 -0700>,<Administrator>,<X>,<proc1d>,<TOPSPIN 2.1>,
      <abs ABSG = 4 
       data hash MD5: 32K
       96 39 D5 8B 82 4F 7B 26 15 2C 8D E3 D6 5B 34 E7>)
(   8,<2013-10-12 20:47:20.053 -0700>,<Administrator>,<X>,<proc1d>,<TOPSPIN 2.1>,
      <abs ABSG = 5 
       data hash MD5: 32K
       30 DA 70 A7 72 99 A1 CF CA 4E 9E 3D CA 4A A4 10>)
$$ ##END=
$$ 
$$ $$ hash MD5
$$ $$ 73 1D A3 BF 34 3B F1 89 42 96 9E 12 8D BD 1F 85
##$RELAX= 
##$RELAX= 
##$RELAX= 
##$RELAX= 
##$RELAX= 
##$RELAX= 
##$RELAX= 
$$ Bruker specific parameters
$$ --------------------------
##$DU= <E:\>
##$EXPNO= 10
$$ [...]
150 150 150 150 150 150 150 150
##$TP07= 0
##$TPNAME0= <>
##$TPNAME1= <>
##$TPNAME2= <>
##$TPNAME3= <>
##$TPNAME4= <>
##$TPNAME5= <>
##$TPNAME6= <>
##$TPNAME7= <>
##$TPOAL= (0..7)
0.5 0.5 0.5 0.5 0.5 0.5 0.5 0.5
##$TPOFFS= (0..7)
0 0 0 0 0 0 0 0
##$TUNHIN= 0
##$TUNHOUT= 0
##$TUNXOUT= 0
##$USERA1= <user>
##$USERA2= <user>
##$USERA3= <user>
##$USERA4= <user>
##$USERA5= <user>
##$V9= 5
##$VALIST= <valist>
##$VCLIST= <CCCCCCCCCCCCCCC>
##$VD= 0
##$VDLIST= <DDDDDDDDDDDDDDD>
##$VPLIST= <PPPPPPPPPPPPPPP>
##$VTLIST= <TTTTTTTTTTTTTTT>
##$WBST= 1024
##$WBSW= 4
##$XGAIN= (0..3)
0 0 0 0
##$XL= 0
##$YL= 0
##$YMAX_a= 603465
##$YMIN_a= -513437
##$ZGOPTNS= <>
##$ZL1= 120
##$ZL2= 120
##$ZL3= 120
##$ZL4= 120
##$ABSF1= 14.98509
##$ABSF2= -5.573092
##$ABSG= 5
##$ABSL= 3
##$ALPHA= 0
##$AQORDER= 0
##$ASSFAC= 0
##$ASSFACI= 0
##$ASSFACX= 0
##$ASSWID= 0
##$AUNMP= <proc_prof1d_extract_pilot.lims>
##$AXLEFT= 0
##$AXNAME= <>
##$AXNUC= <1H>
##$AXRIGHT= 0
##$AXTYPE= 0
##$AXUNIT= <>
##$AZFE= 0.1
##$AZFW= 0.1
##$BCFW= 0
##$BC_mod= 0
##$BYTORDP= 0
##$COROFFS= 0
##$CY= 15
##$DATMOD= 1
##$DC= 0
##$DFILT= <>
##$DTYPP= 0
##$F1P= 0
##$F2P= 0
##$FCOR= 0.5
##$FTSIZE= 32768
##$FT_mod= 6
##$GAMMA= 0
##$GB= 0
##$INTBC= 1
##$INTSCL= 1
##$ISEN= 128
##$LB= 0
##$LEV0= 0
##$LPBIN= 0
##$MAXI= 10000
##$MC2= 0
##$MEAN= 0
##$ME_mod= 0
##$MI= 0
##$NCOEF= 0
##$NC_proc= -8
##$NLEV= 6
##$NOISF1= 0
##$NOISF2= 0
##$NSP= 0
##$NTH_PI= 0
##$NZP= 0
##$OFFSET= 14.98509
##$PC= 1
##$PHC0= 96.17432
##$PHC1= 0
##$PH_mod= 1
##$PKNL= yes
##$PPARMOD= 0
##$PPDIAG= 0
##$PPIPTYP= 0
##$PPMPNUM= 2147483647
##$PPRESOL= 1
##$PSCAL= 4
##$PSIGN= 0
##$PYNMP= <proc.py>
##$REVERSE= no
##$SF= 400.02
##$SI= 32768
##$SIGF1= 0
##$SIGF2= 0
##$SINO= 400
##$SIOLD= 32768
##$SPECTYP= <>
##$SREGLST= <1H.CDCl3>
##$SSB= 0
##$STSI= 32768
##$STSR= 0
##$SW_p= 8223.68421052631
##$SYMM= 0
##$S_DEV= 0
##$TDeff= 65536
##$TDoff= 0
##$TI= <>
##$TILT= no
##$TM1= 0
##$TM2= 0
##$TOPLEV= 0
##$USERP1= <user>
##$USERP2= <user>
##$USERP3= <user>
##$USERP4= <user>
##$USERP5= <user>
##$WDW= 1
##$XDIM= 32768
##$YMAX_p= 417750726
##$YMIN_p= -659409
##$CURPLOT= <Network HP LaserJet P1505>
##$CURPRIN= <$Network HP LaserJet P1505>
##$DFORMAT= <normdp>
##$LAYOUT= <+/1D_H.xwp>
##$LFORMAT= <normlp>
##$PFORMAT= <normpl>
##$SURQMSG= 1
$$ End of Bruker specific parameters
$$ ---------------------------------
##NTUPLES= NMR SPECTRUM
##VAR_NAME=  FREQUENCY,     SPECTRUM/REAL,   SPECTRUM/IMAG
##SYMBOL=    X,             R,               I
##VAR_TYPE=  INDEPENDENT,   DEPENDENT,       DEPENDENT
##VAR_FORM=  AFFN,          ASDF,            ASDF
##VAR_DIM=   32768,         32768,           32768
##UNITS=     HZ,            ARBITRARY UNITS, ARBITRARY UNITS
##FACTOR=    0.250966925370066, 1,           1
##FIRST=     8223.43324360094, -46073,       -139020
##LAST=      0,             107020,          -127593
##MIN=       0,             -659409,         0
##MAX=       8223.43324360094, 417750726,    0
$$ Real data points
##PAGE= N=1
##DATA TABLE= (X++(R..R)), XYDATA
$$ [...]
19548B45055b85661b6442q9469H3549a80521C2056e1487j14672K9528F2459N7211
$$ 245055 -285661 -26442 -115911 83549 -180521 32056 -51487 -166159 -136631 62459 119670
19537A19670b00333g4447A1758g3761N675A90976b40294J11806M0024q17j14815
$$ 119670 -200333 -74447 11758 -73761 -68086 190976 -240294 -128488 -88464 -89281 -204096
19526b04096e1621n6460D5359d250o9415k34796o4935A0628b90540J44149G2863
$$ -204096 -51621 -108081 45359 -4250 -73665 -308461 -373396 10628 -290540 -146391 72863
19514I5589D2611e1274j79421H4369b65700b9988j40091d9053B0661K3649A0869
$$ 95589 42611 -51274 -230695 84369 -265700 -29988 -170079 -49053 20661 44310 10869
19502h2351j24595q0482A04290g3240K1135q432c501k27793B03329a77604A85080
$$ -82351 -206946 -287428 104290 -73240 -52105 -60537 -3501 -231294 203329 -177604 185080
19490c3346k20214i0617c5939A84586b8040C85539j58970M342b96356a07219j98394
$$ -33346 -253560 -90617 -35939 184586 -28040 385539 226569 230911 -296356 -107219 -305613
19479c05613a4960k40730d9081A90543D0722J0665d9813K2795A57764O4053h0603
$$ -305613 -14960 -255690 -49081 190543 40722 51387 -49813 -27018 157764 221817 -80603
19467a4330C250a47431M4872A35653b69195A35935b63081B40648b4710m310C24478
$$ -14330 3250 -147431 -102559 135653 -269195 135935 -263081 240648 -24710 -29020 324478
19455E3467a24644A57561b3203C01739e4149j31441d8077j60804A39067b94744
$$ 53467 -124644 157561 -23203 301739 -54149 -185590 -48077 -208881 139067 -294744
19444A91670b6981B946a8229k95345J05258F7330h889j72637A3570a23731J368
$$ 191670 -26981 2946 -18229 -313574 -208316 67330 -8889 -181526 13570 -123731 -122363
19433a22363j8326G638a59327p4126Q5261I172b52688d4034A6814b13421F7999
$$ -122363 -140689 7638 -159327 -233453 -148192 9172 -252688 -44034 16814 -213421 67999
19421h6957k30614a58588c9207k55000k0864A03606e5559j85409A29967A2686
$$ -86957 -317571 -158588 -39207 -294207 -315071 103606 -55559 -240968 129967 12686
19410f5042k84382A7966a64087j44819f2802H4181a51391A83293H7146c16753
$$ -65042 -349424 17966 -164087 -308906 -62802 84181 -151391 183293 87146 -316753
19399c0623p4645B68150e994A84674B9102O7660K4388c47784K7114B5026J20807
$$ -30623 -105268 268150 -5994 184674 29102 96762 121150 -347784 -320670 25026 145833
19388A45833h2591o5222L5279d8640A54910n5132b09969e7711j55023B5117J50071
$$ 145833 -82591 -147813 -112534 -48640 154910 99778 -209969 -57711 -212734 25117 175188
19377A75188b01951b6553A73169a27821B58732a22048a6371p8094J5470A52080
$$ 175188 -201951 -26553 173169 -127821 258732 -122048 -16371 -94465 -78995 152080
19366c49787a50187J5968a4705J462j24304A72079b02059n0447J2123a07064p8498
$$ -349787 -150187 -134219 -14705 -13243 -137547 172079 -202059 -252506 -240383 -107064 -185562
19355a85562A20442F0017b14379L4918G4321b70409J34458k14144G5692N7567
$$ -185562 120442 60017 -214379 -179461 74321 -270409 -135951 -350095 75692 133259
19345A33259D5146b33115m0580a07786b0670C2010h3514d0680B08994D9499f8102
$$ 133259 45146 -233115 -273695 -107786 -20670 32010 -83514 -40680 208994 49499 -68102
19333a25286k1811p429O4169l7692l9164K0071J638k20715A4063a08276o342A6705
$$ -125286 -147097 -154526 -90357 -128049 -167213 -147142 -145504 -366219 14063 -108276 -114618 16705
19320b0576r8736r9672c2443j35953A3688d06180d8553A6989r20b6288j38763
$$ -20576 -119312 -218984 -32443 -168396 13688 -406180 -48553 16989 16069 -26288 -165051
19309a65051O406O0076d6199l63624K01652H4565a18285A63019a23222r3982L5738
$$ -165051 -158645 -98569 -46199 -409823 -208171 84565 -118285 163019 -123222 -217204 -181466
19298a81466I66b10626B918b67533a13940N1016q3680p2916j14026e8420A9773
$$ -181466 966 -210626 2918 -267533 -113940 -62924 -146604 -219520 -333546 -58420 19773
19286a42374c2313A3704J70989e0702q1080n4374A09118K8786b72799A84959g8684
$$ -142374 -32313 13704 184693 -50702 -131782 -186156 109118 137904 -272799 184959 -78684
19274a2291A08688D1183a23410m7543I3188J17246Q7654j04823b70312g0491J5814
$$ -12291 108688 41183 -123410 -170953 93188 210434 298088 193265 -270312 -70491 -54677
19263e4677k9702B7914J10527K12144F4461e7341r9893m8742B33782K6605b6633
$$ -54677 -84379 27914 138441 350585 64461 -57341 -157234 -205976 233782 260387 -26633
19251b66172B94434d39877H3151b15161F5064J20482b55254A5059b73155E2832
$$ -266172 294434 -439877 83151 -215161 65064 185546 -255254 15059 -273155 52832
19240D2076b16332R3860b784j84037K1528A23232g1142N784B189R8190a65485
$$ 42076 -216332 -122472 -2784 -186821 -165293 123232 -71142 -65358 2189 100379 -165485
19228a45712B07514c41668J42982q7204E3117e6662H4030A0774N1057c55374J9699
$$ -145712 207514 -341668 -198686 -285890 53117 -56662 84030 10774 61831 -355374 -335675
19217c35675B39494g0012K4190m17435H4665a2292H2018h0929r6652c4136k1709
$$ -335675 239494 -70012 -45822 -463257 84665 -12292 82018 -80929 -177581 -34136 -55845
19206e5845k9251l6421m3079d1014A44837a30559r1437f9404l9019L038C9493
$$ -55845 -85096 -121517 -164596 -41014 144837 -130559 -221996 -69404 -108423 -105385 39493
19194c50995a35787j0232H8875J62087K5442m5360b17418r138m8141Q3962b2523
$$ -350995 -135787 -146019 88875 250962 276404 231044 -217418 -226556 -274697 -190735 -22523
19182B4755b61456A13794P549r779D2987N2104h7188j84894J30000k56026J62430
$$ 24755 -261456 113794 121343 111564 42987 95091 -87188 -272082 -142082 -398108 -235678
19171b35678Q7550A4029d13257a82608A80188q5121a81449N5655D4660h4767l80686
$$ -235678 -148128 14029 -413257 -182608 180188 95067 -181449 -125794 44660 -84767 -465453
19160d65453a60541f9396J3154H3623J0739a50435N7960k01598a26013E1082g6738
$$ -465453 -160541 -69396 -56242 83623 94362 -150435 -92475 -294073 -126013 51082 -76738
19148A44193B7878O9890f3228j9770m8630M2465p5075N3348b3767H5385J58765
$$ 144193 27878 97768 -63228 -82998 -131628 -89163 -164238 -110890 -23767 85385 244150
19137B44150b38239A81654J35152e36946e9698j40547a9862j27897F2675b07977
$$ 244150 -238239 181654 316806 -536946 -59698 -200245 -19862 -147759 62675 -207977
19126E0773O3834E0534J88681c1246k6089b8225E4987a6655j28928d7811B10229
$$ 50773 114607 50534 239215 -31246 -57335 -28225 54987 -16655 -145583 -47811 210229
19114c51345j9616a84622J0297c3755B96776c34704A35559j7031h6900r576k05688
$$ -351345 -370961 -184622 -174325 -33755 296776 -334704 135559 118528 -86900 -96476 -302164
19103c02164f3421E3120b65593P7374J9381a0032k62216Q5331h428k29837A02869
$$ -302164 -63421 53120 -265593 -188219 -168838 -10032 -272248 -186917 -8428 -238265 102869
19091d17125D23021k0310H7993K4781K3505a39576A61730J5265d8457D3916R4856
$$ -417125 423021 402711 87993 112774 136279 -139576 161730 176995 -48457 43916 138772
19080A38772Q418f3816A21724a70055m4702a05052c9245j86281A74245J4231g3416
$$ 138772 147190 -63816 121724 -170055 -214757 -105052 -39245 -225526 174245 188476 -73416
19068b8365G5222a17284l6799k11735g8453C72692a60474C18481G9322K56138
$$ -28365 75222 -117284 -154083 -365818 -78453 372692 -160474 318481 79322 335460
19058C35460b10175B36032f3732l79912B38655C1320b19840B4816A1784a56153
$$ 335460 -210175 236032 -63732 -443644 238655 31320 -219840 24816 11784 -156153
19047b64096D3881O027M5069g0231k12165J23173j44382C35689a96060e3449k03823
$$ -264096 43881 49908 94977 -70231 -282396 -159223 -303605 335689 -196060 -53449 -257272
19036b57272R1904K6978k9371L7970A72275O0148n9424C4107f3229J6016H324
$$ -257272 -165368 -138390 -167761 -129791 172275 232423 172999 34107 -63229 -47213 8324
19024e8924C61044o4521G9608J12745A5522a150j9570A63694c08397b8974j26886
$$ -58924 361044 296523 79608 192353 15522 -1150 -20720 163694 -308397 -28974 -155860
19013a55860f3914r813A89750B9256J33209h9050B317J08331J0070D3368a05355
$$ -155860 -63914 -73727 189750 29256 162465 -89050 2317 110648 120718 43368 -105355
19001c24539J55704L1181J9805k11639C53735g5835A82071a35538H582M55008
$$ -324539 -168835 -137654 -117849 -329488 353735 -75835 182071 -135538 8582 463590
18991D63590c22696A86075b8218n5855K8137I1813J55629a93826j30151B36792
$$ 463590 -322696 186075 -28218 -84073 -55936 91813 247442 -193826 -323977 236792
18980h7270L8914C2689b20168g0723j81364J11896A32549e32695a04531j7636
$$ -87270 -48356 32689 -220168 -70723 -252087 -140191 132549 -532695 -104531 -122167
18970a22167A51294c28561l6632a22847A34468o0451a15260A62596b03924c3825
$$ -122167 151294 -328561 -365193 -122847 134468 74017 -115260 162596 -203924 -33825
18959a57250D8276q257a67028C6865f8327K5116j56688b4272j74773G3615J00480
$$ -157250 48276 40019 -167028 36865 -68327 -43211 -199899 -24272 -199045 73615 174095
18948A74095K24038a3225H1289L1374B0790b28623C45783H7237J0487H641N2005
$$ 174095 398133 -13225 81289 112663 20790 -228623 345783 87237 97724 8641 60646
18937F0646f5541i459B9968b6169k82376R5016C07332g5974o9132B811N0175B1034
$$ 60646 -65541 -9459 29968 -26169 -308545 -213529 307332 -75974 -145106 2811 52986 21034
18924b2029A01420a6221k92955C85806h4349J6884B42523c94030J67048B33237
$$ -22029 101420 -16221 -309176 385806 -84349 -67465 242523 -394030 -226982 233237
18913E2211j7069b3602m92176b00884g124j90655I0442O9686c30923l6301a68554
$$ 52211 35142 -23602 -515778 -200884 -7124 -197779 90442 160128 -330923 -367224 -168554
18901c95328f1888k03898F141b26257i0696l53122J96353j35263a80644j31865
$$ -395328 -61888 -265786 6141 -226257 -90696 -443818 -247465 -382728 -180644 -312509
18891c12509i6135D35338G4502a79976C62836c64863d9666G7658k7132b7842j2716
$$ -312509 -96135 435338 74502 -179976 362836 -364863 -49666 77658 50526 -27842 -40558
18880d0558H291k860a88771A8067J6076j2653e1228G7056a95294B64131A02960
$$ -40558 8291 5431 -188771 18067 34143 21490 -51228 77056 -195294 264131 102960
18868a82505B53094A09441a07114g908C8289Q4487b30726A03484c09236J23572
$$ -182505 253094 109441 -107114 -7908 38289 122776 -230726 103484 -309236 -185664
18858a85664C2975L7946A1103b07282B63978h221r5246H2631g494A56630b8467
$$ -185664 32975 70921 11103 -207282 263978 -8221 -103467 82631 -7494 156630 -28467
18846B82501F0121J2907B5384K98744a89640i4070B19047H9219C0111l603K03447
$$ 282501 60121 73028 25384 324128 -189640 -94070 219047 89219 30111 26508 229955
18835B29955i7419J0098l18251a64780g1946C73793A49000G1908a29809M156K9660
$$ 229955 -97419 -87321 -405572 -164780 -71946 373793 149000 71908 -129809 -125653 -95993
18824i5993A55794b40989h4927B19525E3645a8379i23A16306m5890J48449L6298
$$ -95993 155794 -240989 -84927 219525 53645 -18379 -923 116306 70416 218865 255163
18813B55163b68184a18573B34493m6139f0741B15886a94228A63919n440c64353
$$ 255163 -268184 -118573 234493 188354 -60741 215886 -194228 163919 158479 -364353
18802b80099H220b0086A3529a09457d1944k83258b9327A78583K29148b17819a6799
$$ -280099 8220 -20086 13529 -109457 -41944 -325202 -29327 178583 407731 -217819 -16799
18790C6755J15255g1134b1081p7170l63218K08160b9097m41801a91276c4364B51390
$$ 36755 152010 -71134 -21081 -98251 -461469 -253309 -29097 -470898 -191276 -34364 251390
18778c11654K3871H1218C0869a45151F1789d3605p2133e6907l785j76013m6368
$$ -311654 -287783 81218 30869 -145151 61789 -43605 -115738 -56907 -60692 -236705 -283073
18767b83073b4489A51153a0713k49372J08691O6016H9796f771B16922h5418j1347
$$ -283073 -24489 151153 -10713 -260085 -151394 -85378 89796 -6771 216922 -85418 -96765
18756i6765A91762b85401A31265c06709e2237j21222b6484j04805j16822F8841
$$ -96765 191762 -285401 131265 -306709 -52237 -173459 -26484 -131289 -248111 68841
18745f4949A04579a62672m8136b9396A50068h6186h315k18187Q6524d0233Q436
$$ -64949 104579 -162672 -210808 -29396 150068 -86186 -8315 -226502 -139978 -40233 -31797
18734c1797k15230b7510k15706A141K2887K76587b31662B5957a32970o3505A68562
$$ -31797 -247027 -27510 -243216 1141 24028 300615 -231662 25957 -132970 -196475 168562
18722b30348i5965o60D9684c4159j5010E3126b69394q7163J21051D4870J2812
$$ -230348 -95965 -96625 49684 -34159 -49169 53126 -269394 -356557 -235506 44870 57682
18711E7682b37781M1751j02574b9171A485a01549b9652C57720a13456C3879h0429
$$ 57682 -237781 -196030 -298604 -29171 1485 -101549 -29652 357720 -113456 33879 -80429
18699A05969O8194c65020A9631J14765a0515A7377a49296L5523A93631h2913k8309
$$ 105969 174163 -365020 19631 134396 -10515 17377 -149296 -113773 193631 -82913 -111222
18688a11222L0352m9869E695a89706b8211C0673c2023G276J49054e28984A26610
$$ -111222 -80870 -130739 5695 -189706 -28211 30673 -32023 7276 156330 -528984 126610
18676f9058A12123J49913b2275I541O67a24647q381A21942e2347C64399a67107
$$ -69058 112123 262036 -22275 9541 10208 -124647 -133028 121942 -52347 364399 -167107
18664B16468R3666H9896a84243F427a02283k22405b0476j08152j05761C4045M8688
$$ 216468 310134 89896 -184243 6427 -102283 -324688 -20476 -128628 -234389 34045 82733
18653H2733i7234c2757k57360O5850L1957I9942b03804H5975a81313n7534C2505
$$ 82733 -97234 -32757 -290117 -224267 -192310 99942 -203804 85975 -181313 -238847 32505
18641a33826H7173c03042A09869A8169J82574a30440m0867J3940k25808d2462
$$ -133826 87173 -303042 109869 18169 200743 -130440 -171307 -157367 -383175 -42462
18630A2577m673a91486A20365E715a12011b3501o9261D3371c45035o0899K2819
$$ 12577 7904 -191486 120365 5715 -112011 -23501 -92762 43371 -345035 -405934 -383115
18619c83115H4806K25138D2654J45238C9442Q7328b13293A20949e684B68428a7469
$$ -383115 84806 309944 42654 187892 39442 126770 -213293 120949 -5684 268428 -17469
18607a14634B2091d27454b1515m0591F6547M0742a91003n2313A04023b31370B70728
$$ -114634 22091 -427454 -21515 -62106 66547 107289 -191003 -243316 104023 -231370 270728
18595A30032a44338p0164M9582D5760d1897G4170d48847B361g5707B38976a02282
$$ 130032 -144338 -214502 -164920 45760 -41897 74170 -448847 2361 -75707 238976 -102282
18583b79376a29947b5249j17693k80384a8552o6228j24403J00086k7335K4198
$$ -279376 -129947 -25249 -142942 -423326 -18552 -84780 -209183 -109097 -136432 -112234
18573a12234B19678C0011b65682J26219B08169b83875I4258j2662K11556A12235
$$ -112234 219678 30011 -265682 -139463 208169 -283875 94258 81596 293152 112235
18562c9239C3964c8567m1D4104c33728c8695B6668J41327C832M7009A757g4444
$$ -39239 33964 -38567 -38608 44104 -333728 -38695 26668 167995 3832 50841 1757 -74444
18549B3483a0646r3393j57541e642H7355f8412H1476a25652k7596E3524J84729
$$ 23483 -10646 -104039 -261580 -5642 87355 -68412 81476 -125652 -153248 53524 238253
18538B38253a06381d2724j63003h1585B352K7791a70300C81887a95755E583J54394
$$ 238253 -106381 -42724 -205727 -81585 2352 30143 -170300 381887 -195755 5583 159977
18527A59977e8536j00733j29546J03385h98k47863e787C9895P4969B843J34310
$$ 159977 -58536 -159269 -288815 -185430 -898 -248761 -5787 39895 114864 2843 137153
18516A37153a87535a4122j25304N5277j1976G3659h2904k11707R9772B33062a84647
$$ 137153 -187535 -14122 -139426 -84149 -96125 73659 -82904 -294611 -194839 233062 -184647
18504A39685k9379k624Q0503o05a0232j63223B88710A37150a56484a3286A47297
$$ 139685 110306 107682 188185 187580 -10232 -173455 288710 137150 -156484 -13286 147297
18492d1583A66573L5529k0657R365c27968A83143c93491a4213I6161l9759d13300
$$ -41583 166573 202102 181445 190810 -327968 183143 -393491 -14213 96161 56402 -413300
18480h3204C723b75626J6152C08873E239a93993B7503J01760D8211g8878K6037
$$ -83204 3723 -275626 -259474 308873 5239 -193993 27503 129263 48211 -78878 -52841
18469e2841r6114G1835f5822b9784A53980a9910l0063A43328B677a64258N6896
$$ -52841 -148955 71835 -65822 -29784 153980 -19910 -49973 143328 2677 -164258 -107362
18458a07362E8572g7790a1828A04315J03215r7721h5217p5676B5146J31395a43555
$$ -107362 58572 -77790 -11828 104315 207530 109809 -85217 -160893 25146 156541 -143555
18446b7195j12919A47284A8457e9467F6594K46843H0056J6989e6508r2040G764
$$ -27195 -140114 147284 18457 -59467 66594 313437 80056 97045 -56508 -148548 7764
18434a93797j78882G8326a91384b9378A02588a9328m30899B18915i4900d0729
$$ -193797 -372679 78326 -191384 -29378 102588 -19328 -450227 218915 -94900 -40729
18423a24690H7357a98890j80282a16954F0541p326i8255A11130b56476A50167
$$ -124690 87357 -198890 -379172 -116954 60541 53215 -98255 111130 -256476 150167
18412a67973A63908a92892N6815E0642a39770L1774j83221B24095Q8069a2128
$$ -167973 163908 -192892 -136077 50642 -139770 -107996 -291217 224095 312164 -12128
18401D9690B2449c4375I3633a35556i379q7819E3379N4206b53117j53640e0878
$$ 49690 22449 -34375 93633 -135556 -9379 -97198 53379 107585 -253117 -406757 -50878
18389C5907a68450D3382b58311m1675N5037E80404a1035n7511J6436j19697h3747
$$ 35907 -168450 43382 -258311 -299986 -244949 580404 -11035 -68546 -52110 -171807 -83747
18377B36271m3289D3060A1941P6255c3295C5636h3932D1K8669d8684j28913O6961
$$ 236271 192982 43060 11941 88196 -33295 35636 -83932 41 28710 -48684 -177597 -110636
18365a10636G7749a27328B02673q1563P0695a03054H5596N5079a01473J9918j15462
$$ -110636 77749 -127328 202673 121110 191805 -103054 85596 140675 -101473 -81555 -197017
18354a97017g5767o9852c2253f385j7199B13951A05418A7979h7820A5490K07355
$$ -197017 -75767 -145619 -32253 -6385 -23584 213951 105418 17979 -87820 15490 222845
18343B22845H2045a27648o854k19114h8317j16885F713K5750d0263j29604d7257
$$ 222845 82045 -127648 -134502 -353616 -88317 -205202 6713 32463 -40263 -169867 -47257
18331c68646M9014A86476B0587a38197q4113G0831l24L0344b36710j744h5793
$$ -368646 -319632 186476 20587 -138197 -222310 70831 70507 100851 -236710 -238454 -85793
18319C6964e1765A25876d7682l68563H2541K0034a00267H4770b9616r417R629
$$ 36964 -51765 125876 -47682 -416245 82541 102575 -100267 84770 -29616 -39033 -29404
18308b9404j8664H0878i3465a1164A40074e5159A06939a50623J5831G1060g9796
$$ -29404 -48068 80878 -93465 -11164 140074 -55159 106939 -150623 -134792 71060 -79796
18296g876C9487a04417r5492o7676A03209a24570a7974c712G6715A5734K6176
$$ -7876 39487 -104417 -199909 -267585 103209 -124570 -17974 -3712 76715 15734 41910
18285D1910K34974A02911K56006j69477D5986b86094a03636K4853p6326L5627
$$ 41910 276884 102911 358917 189440 45986 -286094 -103636 -78783 -155109 -119482
18275a19482M7765l8409B76473a30964O2427J5829p4387r8855q7266a5369n5885
$$ -119482 -71717 -110126 276473 -130964 -68537 -52708 -127095 -225950 -313216 -15369 -71254
18264g1254A28086A5976b74242b3925l69121b4545k167n891n3002q8974F1137
$$ -71254 128086 15976 -274242 -23925 -393046 -24545 -26712 -32603 -85605 -174579 61137
18252A3997Q9892L7D4540K1994C122b64294B1445b95000A30243B656b2893j05837
$$ 13997 103889 103926 44540 66534 3122 -264294 21445 -295000 130243 2656 -22893 -128730
18240a28730c2471o7105k00758b9102j06065K1316A33838c51882J8374i5371A19925
$$ -128730 -32471 -99576 -300334 -29102 -135167 -113851 133838 -351882 -333508 -95371 119925
18228G1412L61442a01050A07383d13324J07328I3548B4933a07914b7872a314q5674
$$ 71412 432854 -101050 107383 -413324 -305996 93548 24933 -107914 -27872 -1314 -86988
18217h6988A95807m3599l8625f344k11581e577k95080g5045l52642B25112d2852
$$ -86988 195807 152208 113583 -6344 -217925 -5577 -300657 -75045 -427687 225112 -42852
18205B58321B8173a40657k40359a00683q6052r668A84582a14186G6274a24400
$$ 258321 28173 -140657 -381016 -100683 -186735 -196403 184582 -114186 76274 -124400
18194a49866d5738k6035B8075K807b25199H7506b9089j94823F3058r221d1570
$$ -149866 -45738 -71773 28075 30882 -225199 87506 -29089 -223912 63058 53837 -41570
18182A60498b06897A805a74207j45471A01960i5920H7632b04510B15398b41049
$$ 160498 -206897 1805 -174207 -319678 101960 -95920 87632 -204510 215398 -241049
18171B721a66237A33712a70336g5711r3652B6956g8886B2791f1752A75114G3186
$$ 2721 -166237 133712 -170336 -75711 -169363 26956 -78886 22791 -61752 175114 73186
18159E5914a6162n1295b2316B93303A14714a71527A04099b73022h5086H2378g2938
$$ 55914 -16162 -67457 -22316 293303 114714 -171527 104099 -273022 -85086 82378 -72938
18147A3464a08484C02103H2299b23914L3602j0509A40472A5365L17788b11682
$$ 13464 -108484 302103 82299 -223914 -190312 -200821 140472 15365 333153 -211682
18136c1905j66697O2207j16351B24852b66905B90150A16224a22427j43419P8365
$$ -31905 -198602 -136395 -252746 224852 -266905 290150 116224 -122427 -265846 -187481
18126a87481P3709d3179l99355J42011J1678h4979D6386b69516a1494j0576B59514
$$ -187481 -113772 -43179 -442534 -300523 -288845 -84979 46386 -269516 -11494 -22070 259514
18114B17003q5518a45161e9046A78356j8721G6099f8923b7752A88395a1047B81073
$$ 217003 131485 -145161 -59046 178356 159635 76099 -68923 -27752 188395 -11047 281073
18102B6607a00978I222J03043c36891a18949J4843j23676G6981g1138j96698O6173
$$ 26607 -100978 9222 112265 -336891 -118949 -104106 -227782 76981 -71138 -267836 -201663
18091b01663h8311h783A62305F4370a30903I4026O6734E1761j2906J59160b70321
$$ -201663 -88311 -8783 162305 64370 -130903 94026 160760 51761 38855 198015 -270321
18079a66673M5083A33366m7587b9212B0733h3309l79356B31018B0005L2955f0293
$$ -166673 -121590 133366 85779 -29212 20733 -83309 -462665 231018 20005 52960 -60293
18067b81330a9906j02467B32096p8373b06083A07203a41059A47763c0589j9662
$$ -281330 -19906 -122373 232096 153723 -206083 107203 -141059 147763 -30589 -50251
18057e0251C1184J3298f7037j10824g1319a0060A64997a60356A78428c05807g149
$$ -50251 31184 44482 -67037 -177861 -71319 -10060 164997 -160356 178428 -305807 -7149
18045A13386b60408G4503e57982b09689A56127a10824j06801r5630J36773H4171
$$ 113386 -260408 74503 -557982 -209689 156127 -110824 -217625 -313255 -176482 84171
18034A83722G5852k4683a72692b7900B01463q3846a14758M0285g159C8720a34523
$$ 183722 75852 51169 -172692 -27900 201463 117617 -114758 -74473 -7159 38720 -134523
18022b94079A69881a38839B7400N139b19964B4092N4886J40995e005p9766D5452
$$ -294079 169881 -138839 27400 32539 -219964 24092 78978 219973 -5005 -84771 45452
18010C0680J04309c00066I7995c5403B1757P6630m5752A1637J78928b21627A76045
$$ 30680 134989 -300066 97995 -35403 21757 98387 52635 11637 190565 -221627 176045
17998e5460l0100r3358j27960e9164q21D8325a46540C995d9592p2710H1045K4027
$$ -55460 -85560 -178918 -306878 -59164 -59985 48325 -146540 3995 -49592 -122302 81045 105072
17986A05072J20055a39582H5511K40681A12491K60105b56387A64381c72458a52271
$$ 105072 225127 -139582 85511 326192 112491 372596 -256387 164381 -372458 -152271
17975A65786d5538A17095b59388B5760a71510k0837d160A8825a1169j22128d1066
$$ 165786 -45538 117095 -259388 25760 -171510 -192347 -4160 18825 -11169 -133297 -41066
17963a28603a2600A9890J10704E142K0063f7419k44669Q9039h0627j75379a22443
$$ -128603 -12600 19890 130594 5142 25205 -67419 -312088 -223049 -80627 -256006 -122443
17951a54838A63788k4049B7008f7133j01015a4988B82298j5757b62545D1057J57753
$$ -154838 163788 139739 27008 -67133 -168148 -14988 282298 266541 -262545 41057 198810
17940A98810b4997n6474j40453j15190P2547h3851c7452j55340g3481A18008L7090
$$ 198810 -24997 -81471 -221924 -337114 -264567 -83851 -37452 -192792 -73481 118008 155098
17929A55098a59848A01292J00103B4801b1721A14987L89145a95907C9387a60107
$$ 155098 -159848 101292 201395 24801 -21721 114987 504132 -195907 39387 -160107
17918g1499F162J39538m6599J9947J45900B4648J13774l3722a55966j95648D1749
$$ -71499 6162 145700 99101 119048 264948 24648 138422 104700 -155966 -351614 41749
17906a47108A37790M2354n6916c2900C64072d07485i3948d181I2618c18840H6948
$$ -147108 137790 180144 123228 -32900 364072 -407485 -93948 -4181 92618 -318840 86948
17894i0629H52a99891D73313C9004m495N1159e7745m52124A51406o0825a2362
$$ -90629 852 -199891 473313 39004 34509 85668 -57745 -509869 151406 90581 -12362
17882B47454j07412a17091a6214k27512A27045J29593a95180A10843a20936D15757
$$ 247454 140042 -117091 -16214 -243726 127045 256638 -195180 110843 -120936 415757
17871A52306J42227D9987c95617a10650A91515r575i702a675l01034a07890D99405
$$ 152306 294533 49987 -395617 -110650 191515 181940 -9702 -1675 -302709 -107890 499405
17859b46846A26972h5738A23919b9605q9143C9030g8891c006J181k0941p786j15547
$$ -246846 126972 -85738 123919 -29605 -118748 39030 -78891 -3006 -1825 -22766 -30552 -146099
17847a46099q2521a10669m86235A06693h8695C72147a17337H03M7302i4720L6481
$$ -146099 -228620 -110669 -596904 106693 -88695 372147 -117337 803 48105 -94720 -58239
17836e8239A49831b59183a21503G1067J4054e2418D5893P34a88940a142A19980
$$ -58239 149831 -259183 -121503 71067 85121 -52418 45893 46627 -188940 -1142 119980
17824b60788A0056c48225a45708A4042L99753A39443m8641c12495A51198n9468
$$ -260788 10056 -348225 -145708 14042 413795 139443 90802 -312495 151198 91730
17814I1730c20787J50682A96545n4876o3783l8265a06721C04090a15001j85412
$$ 91730 -320787 -170105 196545 141669 77886 39621 -106721 304090 -115001 -300413
17804c00413E5518P667J45591a92j13240E7836c10200I3723a15782B05508h8439
$$ -300413 55518 63185 208776 -192 -113432 57836 -310200 93723 -115782 205508 -88439
17792A25460M7288b77364D8925i0872a9806A5026K35530b60506c75j32256d8851
$$ 125460 172748 -277364 48925 -90872 -19806 15026 250556 -260506 -375 -132631 -48851
17780c19933a2983l21054A92027m0421f3165K0404b0808F2399j8069j0779P12
$$ -319933 -12983 -334037 192027 151606 -63165 -42761 -20808 62399 44330 33551 34263
17769C4263b36308d5031C61418A9167L88252l3116b00880A02986l9366L11845
$$ 34263 -236308 -45031 361418 19167 407419 374303 -200880 102986 63620 375465
17759C75465a28600o7920r3466E9314f3510A16803P2096c19298M8839g5045C766
$$ 375465 -128600 -196520 -289986 59314 -63510 116803 188899 -319298 -270459 -75045 3766
17747e1483J4796A72490q3647J79662p4618d4438A3499J71664K91273k08001g6248
$$ -51483 -36687 172490 88843 268505 193887 -44438 13499 185163 476436 268435 -76248
17735G4477R4702a42049j957J1911A84613b55973F1354h2127C04369f0021F8127
$$ 74477 169179 -142049 -144006 -132095 184613 -255973 61354 -82127 304369 -60021 68127
17723a92704A96989a0782I1144b43177A60878F5372k0641b02502i2627B87647
$$ -192704 196989 -10782 91144 -243177 160878 65372 44731 -202502 -92627 287647
17712D65020A80792j2770m8055k0658J2053K6434i3468L5908C96389i664G7057
$$ 465020 180792 168022 119967 99309 111362 137796 -93468 -57560 396389 -9664 77057
17700b21921C36257A2050b45206C1019K8634J40796a37767C28603C0457h1768
$$ -221921 336257 12050 -245206 31019 59653 200449 -137767 328603 30457 -81768
17689A65232f5291F2103O9250K2063a6426j86999A16239Q9522c31096B20432I0858
$$ 165232 -65291 62103 131353 153416 -16426 -203425 116239 205761 -331096 220432 90858
17677A97136c0720I7398c12233A14621J50150d9168J8821l6951G0849a42480M1148
$$ 197136 -30720 97398 -312233 114621 264771 -49168 -30347 -67298 70849 -142480 -101332
17666a01332A8535i4524B07272a18938a5254C46951G243d27532a11987O106j15336
$$ -101332 18535 -94524 207272 -118938 -15254 346951 7243 -427532 -111987 -105881 -221217
17655b21217C2750R0787k1775d0485j10062D8708O7883J23634j17208m9138K48845
$$ -221217 32750 123537 101762 -40485 -150547 48708 116591 240225 123017 73879 322724
17644C22724F4445J98229b28681B22027B6513L32587e770A81224i6655A12022
$$ 322724 64445 262674 -228681 222027 26513 359100 -5770 181224 -96655 112022
17633a94194j13636A51219h3810A07759b50221K4056g5532A259b54656M9059A03172
$$ -194194 -307830 151219 -83810 107759 -250221 -226165 -75532 1259 -254656 -205597 103172
17621b4000B15571o1734C4743J17148D8212O2781L31916a79176j27669L1079A2246
$$ -24000 215571 153837 34743 151891 48212 110993 442909 -179176 -306845 -275766 12246
17609a162A11961Q7732j4822J14106D4032a04332m6522f7177j86550C31364j03883
$$ -1162 111961 199693 184871 298977 44032 -104332 -150854 -67177 -253727 331364 227481
17598B27481r8629A5317c44960a02090k09519A09630b86926c0800k101G2626h5166
$$ 227481 128852 15317 -344960 -102090 -311609 109630 -286926 -30800 -32901 72626 -85166
17586E247J70891p3950g2722A27158J20864r9602c68089a20741D3681J4687c2432
$$ 5247 176138 102188 -72722 127158 248022 148420 -368089 -120741 43681 58368 -32432
17574A80993R4422E0825J12569m1925B3619J74277d0810j87944c9512k6384J2594
$$ 180993 275415 50825 163394 121469 23619 197896 -40810 -228754 -39512 -65896 -53302
17563e3302A08905a50183P2415B71200b09746B4693J33305a67855B9921a14535
$$ -53302 108905 -150183 -77768 271200 -209746 24693 157998 -167855 29921 -114535
17552h6080G8720g4221k06122f1976F9477J22517B5150J3305J75301A04243B994
$$ -86080 78720 -74221 -280343 -61976 69477 191994 25150 38455 213756 104243 2994
17540e6663A20224J53038H7857i8922A19636B7044J59757A5060M8584P9823A9460
$$ -56663 120224 273262 87857 -98922 119636 27044 186801 15060 63644 143467 19460
17528a66317H4044N2658e0134A49685n5336R0171c3778l42319c8245q3243G4794
$$ -166317 84044 136702 -50134 149685 94349 184520 -33778 -376097 -38245 -121488 74794
17516A48091a2185r8778A35541b5164n4580A25794K955P0795N5662J21782C6389
$$ 148091 -12185 -110963 135541 -25164 -79744 125794 128749 199544 255206 376988 36389
17504a02025A71349p6765j1661M2812K24746l6964H6006N0402K54305A87958Q7574
$$ -102025 171349 94584 82923 125735 350481 313517 86006 136408 390713 187958 275532
17493B75532j34129b56380A56236J68440I0268O7480b0009j0129I364L2108N308
$$ 275532 141403 -256380 156236 324676 90268 157748 -20009 -30138 9364 41472 46780
17482D6780B419a41897B2061J21817K7726o6136B6500b5043B93500j42668K70654
$$ 46780 2419 -141897 22061 143878 171604 105468 26500 -25043 293500 150832 421486
17471D21486D579f6207m4885A87681c3023A10683L03J36670O2651P527b02263
$$ 421486 4579 -66207 -111092 187681 -33023 110683 110986 247656 310307 317834 -202263
17459B24856j07269M2540m090P0314J58393o5137j58168m9191K62222J8804j27994
$$ 224856 117587 160127 156037 226351 384744 319607 161439 112248 374470 393274 265280
17448B65280I1485L9734K99336J39197c0965B50565f7082A20794K38804a09460
$$ 265280 91485 131219 430555 569752 -30965 250565 -67082 120794 359598 -109460
17437B07708K37815G2694c0952C26727C7928f5544D4809L35047O3156A70758L3278
$$ 207708 445523 72694 -30952 326727 37928 -65544 44809 379856 443012 170758 204036
17426B04036J29408A65593O0831J30652r0539O9411j07453l3157P5449l4216J53714
$$ 204036 333444 165593 226424 357076 266537 335948 228495 195338 270787 236571 390285
17415C90285J52942L0857k30948j39203J45112j29336q3654K6045J8935J05509
$$ 390285 543227 574084 343136 203933 349045 219709 136055 162100 181035 286544
17405B86544i4777D00896A53289j3893K48252g5645A62136a67643C02257a50205
$$ 286544 -94777 400896 153289 139396 387648 -75645 162136 -167643 302257 -150205
17394C48097A48860J01549r0538J45997j39897H0500J72332c0607A13395a08124
$$ 348097 148860 250409 159871 305868 165971 80500 252832 -30607 113395 -108124
17383G818M34749j02833a81463A84212f5334B48198F1087d2289C08059A30588
$$ 7818 442567 339734 -181463 184212 -65334 248198 61087 -42289 308059 130588
17372f1711C20323f2818A79837p0432Q9489J3183R3413b2090B760J59185j1619
$$ -61711 320323 -62818 179837 109405 198894 212077 305490 -22090 2760 161945 150326
17361A50326b10540C05980D7335J09892J90995A15872B4167K88008h6058a6717
$$ 150326 -210540 305980 47335 157227 348222 115872 24167 312175 -86058 -16717
17350B84602A25513F1075K88663j32686n1198M4339m3220F4818k479O4304K42487
$$ 284602 125513 61075 349738 217052 165854 210193 166973 64818 62339 126643 369130
17339C69130L33236a11784D98243j74294b39356F05876b41429A42523l4972O9143
$$ 369130 702366 -111784 498243 323949 -239356 605876 -241429 142523 107551 176694
17329A76694N3161n7568j4990c981B35979R2155j47222D0683J52405g8584H8603
$$ 176694 229855 172287 157297 -3981 235979 328134 180912 40683 193088 -78584 88603
17317C58456N0012E871b988A15413p036J61844A8629g1232C77727A81660J17132
$$ 358456 408468 5871 -2988 115413 108377 270221 18629 -71232 377727 181660 298792
17306B98792b9990H8456k459J69883a16754L4150c5263B79016j13014C9883K02776
$$ 298792 -29990 88456 85997 255880 -116754 -82604 -35263 279016 166002 39883 242659
17295B42659a7569B47315I4312e0263A26952e8343B1681K53041j32806e82D6423
$$ 242659 -17569 247315 94312 -50263 126952 -58343 21681 274722 141916 -582 46423
17283a5596B57026A17455R1250K98951B50883K09414D9113a1900m601A08715K21437
$$ -15596 257026 117455 208705 507656 250883 460297 49113 -11900 -16501 108715 330152
17272C30152r0392A7727R555K18758J14108q2264I3737J12793G7240J83772j27147
$$ 330152 239760 17727 27282 246040 360148 277884 93737 206530 77240 261012 133865
17261A33865j3303K05184Q5298A47011Q8862J15264j23884J17925i5789A86505
$$ 133865 120562 325746 411044 147011 235873 351137 227253 345178 -95789 186505
17250B2479a48357D01632j95558p775J02299i96B7026e8295A05965D7118J40767
$$ 22479 -148357 401632 206074 198299 300598 -996 27026 -58295 105965 47118 187885
17239A87885J68964j38087a23170D19122j24475A9936R2423C9966K4051J48149
$$ 187885 356849 218762 -123170 419122 294647 19936 112359 39966 64017 212166
17229B12166p0734J03515r6206a37349A03891K49704A71707n0012f3674B82490
$$ 212166 141432 244947 148741 -137349 103891 353595 171707 121695 -63674 282490
17218B62321p0784j0374K14636q7088j45828o1133L4725J14775D7992J46915O1277
$$ 262321 191537 181163 395799 308711 162883 101750 136475 251250 47992 194907 256184
17207B56184J09100o4755A10271O4231n0370b80572A03065O4882o5670B6504h4431
$$ 256184 365284 300529 110271 174502 124132 -280572 103065 167947 102277 26504 -84431
17195F86372l23913c1100E27783I0786J55727J6595A0855L40396J27744n2628
$$ 686372 362459 -31100 527783 90786 246513 263108 10855 351251 478995 426367
17185D26367j74534c1919B77807j9193F1047L71444j95098O4771L11653k59167
$$ 426367 251833 -31919 277807 258614 61047 432491 237393 302164 613817 354650
17175C54650h162C52660j32184r5866J90429j09177L08454j20374a35700E9585
$$ 354650 -8162 352660 220476 124610 315039 205862 514316 393942 -135700 59585
17164E9735k4518L92144j39805n2722m2050P909Q3982M1529K7047F2318J55009
$$ 59735 35217 427361 287556 234834 192784 200693 284675 326204 353251 62318 217327
17153B17327M553J19203J21651J51063j58761A16625K97401r7189l3198q2903
$$ 217327 221880 341083 462734 613797 455036 116625 414026 316837 283639 200736
17143B00736K06361N4460k3911G2549K13222A33671M3359p3099O1306K84005j40599
$$ 200736 407097 461557 437646 72549 285771 133671 177030 103931 165237 449242 308643
17132C08643K85075j47156k1426J11364k02322j20364l9373K4709J60565c1352
$$ 308643 593718 446562 425136 536500 334178 213814 174441 199150 359715 -31352
17121C42520r3195J68083J87263B91216K03766j65019J11318Q7558k13610J24081
$$ 342520 249325 417408 604671 291216 494982 329963 441281 528839 315229 439310
17111D39310M7013A53147F9706L23869L34696l33740p593J0772f7769C83664o5141
$$ 439310 486323 153147 69706 393575 728271 394531 386938 397710 -67769 383664 318523
17100C18523R1309j91005J56219j73642L60114j30855N368j92478Q4084o3453
$$ 318523 409832 218827 375046 201404 561518 430663 436031 243553 327637 264184
17090B64184J66298k5403I5960C514K08469J55142J01542K68897B99957M4709
$$ 264184 430482 405079 95960 3514 211983 367125 468667 737564 299957 344666
17080C44666L1168o4161L12505m9159o7961R4894J01531k81961k9597R7008A25666
$$ 344666 375834 311673 624178 575019 507058 601952 703483 421522 391925 488933 125666
17068E42119j45371p4185m8398J02969P1610j71424K44221j3257j75464J86423
$$ 542119 396748 322563 274165 377134 448744 277320 521541 508284 332820 519243
17058E19243j66661j12449K85656j95663L73742B88891M71309C08637N734L25876
$$ 519243 352582 240133 525789 330126 703868 288891 760200 308637 314371 640247
17048F40247j27097k3092L57300C36683J37731M0807j56960K24243B18675M49944
$$ 640247 513150 490058 847358 336683 474414 515221 358261 582504 218675 668619
17038F68619j28128B0297N73643j37288q4246M00915B75875J21171K04200o6164
$$ 668619 540491 20297 593940 456652 372406 773321 275875 397046 601246 535082
17028E35082p2342L702J9560Q1877j72897J35321K16646j9640J73901k75605k24928
$$ 535082 462740 466442 486002 567879 394982 530303 746949 727309 901210 625605 400677
17017D00677O13227m55218J25105k75733K85905K56815k56705J18859l75160K05564
$$ 400677 1013904 558686 683791 408058 693963 950778 694073 812932 437772 643336
17007F43336k14472J06152O2329J91288k53004J64475j87278L23634K5689q2577
$$ 643336 428864 535016 597345 788633 535629 700104 512826 836460 862149 779572
16997G79572j01605l9233M0922k29259J40669M669l5830j70065N93371m53946
$$ 779572 677967 638734 679656 450397 591066 595735 559905 389840 983211 529265
16987E29265O3510J41118J09177J26354l38957L31186j73555J63862m08559L38593
$$ 529265 592775 733893 843070 969424 630467 961653 788098 951960 543401 881994
16977H81994j48280N4245N1902n8299r3624L38442m14539M23679O3738l16632
$$ 881994 733714 787959 839861 781562 687938 1026380 611841 1035520 1099258 782626
16967G82626R8111j4478K07960k76389N5810j18994L26412j31032R4629p0112
$$ 782626 880737 866259 1074219 797830 853640 734646 1061058 930026 1024655 954543
16957I54543k85135j8165M13787L8596J63586m29k82396j8931k15455K65300j97573
$$ 954543 669408 651243 1065030 1103626 1267212 1266783 984387 965456 750001 1015301 817728
16946H17728J65360m920J57270q8561L4911J24191m3955l57132L51342j96116
$$ 817728 983088 978168 1135438 1046877 1081788 1205979 1162024 804892 1156234 960118
16936I60118j76426M14706j84618M34666j94556N7285m0151j13880M89381m93961
$$ 960118 783692 1198398 1013780 1448446 1253890 1311175 1271024 1157144 1646525 1152564
16926A152564p0697J73652L7119k48851Q1333J35250O3198Q1719l30870q8786
$$ 1152564 1081867 1255519 1292638 1043787 1125120 1260370 1323568 1405287 1074417 985631
16916I85631K48413N7923o5911l03947L67782J89600r7813k16115J231J86902
$$ 985631 1234044 1291967 1226056 922109 1289891 1479491 1381678 1165563 1166794 1353696
16906A353696K2971K92589k08190J62374J17291k58193K47697J14900j01458n9219
$$ 1353696 1376667 1669256 1461066 1623440 1740731 1482538 1730235 1845135 1743677 1684458
16896A684458P9143J31979k18790r1232Q6925P40667p32877J96759K1302L43200
$$ 1684458 1763601 1895580 1676790 1585558 1672483 2413150 1680273 1877032 1898334 2241534
16886B241534l90624k4261k71551N18352n0570l90874j1812L79027L71774j38154
$$ 2241534 1850910 1826649 1555098 2073450 2022880 1632006 1620194 1999221 2370995 2232841
16876B232841O7510r2890k39784J74919L32987o61777L68660K45303O5461j49126
$$ 2232841 2300351 2207461 1967677 2142596 2475583 1813806 2182466 2427769 2493230 2344104
16866B344104R4764m6104K58650N8789k76367j96510M44396l15277P01194o32389
$$ 2344104 2438868 2392764 2651414 2710203 2433836 2237326 2681722 2366445 3067639 2435250
16856B435250J12751j886J20166J14600P3100n6013j83387N99805R0140k78479
$$ 2435250 2548001 2546115 2666281 2780881 2853981 2797968 2614581 3214386 3304526 3026047
16846C026047Q8779O6793l62051N01176k04588K95460l746J36789J37263r4201
$$ 3026047 3114826 3181619 2819568 3320744 3116156 3411616 3407870 3544659 3681922 3587721
16836C587721L15824J5809N1601k26241L55552M7405n6813k82584M28826l42337
$$ 3587721 3903545 3919354 3970955 3744714 4100266 4147671 4090858 3808274 4237100 3894763
16826C894763L13990L03053J48323j5003K7456l8785N04644l24795J64851Q8730
$$ 3894763 4208753 4511806 4660129 4645126 4672582 4633797 5138441 4813646 4978497 5067227
16816E067227j1427K06871K39445j71928K91199j08230N46338J53999O2223R5333
$$ 5067227 5055800 5262671 5502116 5330188 5621387 5513157 6059495 6213494 6275717 6371050
16806F371050K93346k00246L46203j6272K0409M99374k81638N23992J81188K27278
$$ 6371050 6664396 6464150 6810353 6794081 6814490 7313864 7032226 7556218 7737406 7964684
16796G964684Q8075M20307N67548m37907N33140j79527N36235O3370O62991O3371
$$ 7964684 8052759 8473066 9040614 8602707 9135847 8956320 9492555 9555925 10218916 10282287
16786A0282287M14953J90062N93138j53487L63156N22287N30450J73926L94351
$$ 10282287 10697240 10887302 11480440 11326953 11690109 12212396 12742846 12916772 13311123
16777A3311123O25792K47447N08153K53348O69886O34323O56378K12561O14115
$$ 13311123 13936915 14184362 14692515 14945863 15615749 16250072 16906450 17119011 17733126
16768A7733126R35398R38467N80860M90875J103981P52583J272824Q58094R89504
$$ 17733126 18668524 19606991 20187851 20678726 21782707 22535290 23808114 24666208 25655712
16759B5655712J799279Q28302J058383J356554J281460J807746J736364J431452
$$ 25655712 27454991 28283293 29341676 30698230 31979690 33787436 35523800 36955252
16751C6955252J812356K538279K127978K167597K688516K427365L112826L119535
$$ 36955252 38767608 41305887 43433865 45601462 48289978 50717343 53830169 56949704
16743E6949704L013277M242113L575407M018055M683388N099530M911083N802371
$$ 56949704 59962981 64205094 67780501 71798556 76481944 81581474 86492557 92294928
16735I2294928N898278O465061O805415P117934P456821P526918Q060896Q033253
$$ 92294928 98193206 104658267 111463682 118581616 126038437 133565355 141626251 149659504
16727A49659504P854415P395633P663532O308626N584050M881908L197064J920987
$$ 149659504 157513919 164909552 172573084 178881710 184465760 189347668 192544732 194465719
16719A94465719K38662q65111l006851m031642m907144o361820p101611p697922
$$ 194465719 194704381 193839270 190832419 186800777 181893633 175531813 168430202 160732280
16711A60732280q043876q250680q250594q063745p783727p708269p064414o923137
$$ 160732280 152688404 144437724 136187130 128123385 120339658 112631389 105566975 98643838
16703I8643838o037164o306540n577121n493645m558817m048220m164180l787914
$$ 98643838 92606674 86300134 80723013 75229368 70670551 66622331 62458151 58670237
16695E8670237l236326l063349l609340k486758k534079k496668k208396k077061
$$ 58670237 55433911 52370562 48761222 46274464 43740385 41243717 39035321 36958260
16687C6958260j446238k291958j533977j335653j628961j120643j214905j656549
$$ 36958260 35512022 33220064 31686087 30350434 28721473 27600830 26385925 24729376
16679B4729376o49412r17817j199504o01075j097531q16176p27008n82022q47330
$$ 24729376 24079964 23162147 21962643 21361568 20264037 19447861 18720853 18138831 17291501
16670A7291501p91292o43027o30319l93578p01401k07363o93138l92014m16847
$$ 17291501 16500209 15857182 15226863 14833285 14131884 13924521 13231383 12839369 12422522
16661A2422522n20270k68175r8814n81997j27526n10160j42419q25530K9560j34637
$$ 12422522 11902252 11634077 11535263 10953266 10825740 10315580 10173161 9347631 9377191 9242554
16651I242554m59735l43155k70715p2112P5718n90481k41154J10175l63900j90649
$$ 9242554 8782819 8439664 8168949 8096837 8172555 7582074 7340920 7451095 7087195 6896546
16641F896546k76312p0872l40174k55202q103k72090J81097m01807N0856k63103
$$ 6896546 6620234 6549362 6209188 5953986 5945883 5673793 5854890 5453083 5503939 5240836
16631E240836M9183l16326p2734K7099n31217K86276k84844J23854O517k55624
$$ 5240836 5290019 4973693 4900959 4928058 4396841 4683117 4398273 4522127 4528644 4273020
16621D273020K5194k48656j51542j31968K40783p6700m12034K68907k00452J19746
$$ 4273020 4298214 4049558 3898016 3766048 4006831 3930131 3518097 3787004 3586552 3706298
16611C706298j20153q6826m00914j8164p2657P8682M35955n45191k67763K67105
$$ 3706298 3586145 3499319 3098405 3080241 3007584 3086266 3522221 2977030 2709267 2976372
16601B976372R6515k18160j52693L1803j35303p6104R2437k09942K13792m18946
$$ 2976372 3072887 2854727 2702034 2733837 2598534 2522430 2614867 2404925 2618717 2199771
16591B199771K45196q1010l92550K33120k5412k24310R4601L0295j92071L87933
$$ 2199771 2444967 2363957 1971407 2204527 2179115 1954805 2049406 2079701 1887630 2275563
16581B275563k90419n4614k8123L12593m38187l08423K89670j61771O51524m14735
$$ 2275563 1985144 1930530 1902407 2215000 1776813 1468390 1758060 1596289 2247813 1833078
16571A833078Q4850j85382k45568K2343L46931n02424o2054J53993P1516N3041
$$ 1833078 1917928 1732546 1486978 1509321 1856252 1353828 1291774 1445767 1517283 1570324
16561A570324m33056L98882j28003k66585L78707o3727k56671K41294k4958K0939
$$ 1570324 1137268 1536150 1408147 1141562 1520269 1456542 1199871 1441165 1416207 1437146
16551A437146k05637J6653J15492Q9048k41935J02292q8415j93242k15652M56403
$$ 1437146 1231509 1248162 1363654 1452702 1210767 1313059 1224644 1031402 815750 1272153
16541A272153K41090m44605K48115k257k08785l9784J56450p4765k60245N8012
$$ 1272153 1513243 1068638 1316753 1314496 1105711 1065927 1222377 1147612 887367 945379
16531I45379j18185K68808j6815j98260K75763k846j86390Q7560k74467L30812
$$ 945379 827194 1096002 1079187 880927 1156690 1153844 967454 1055014 780547 1111359
16521A111359j89661l04643L49569k54643K48992D75368L48072J0478j41867q328
$$ 1111359 921698 617055 966624 711981 960973 475368 823440 833918 692051 683723
16511F83723L82698k30336J98970j32203j63828J19130N5634m29360R1840J82824
$$ 683723 1066421 836085 1035055 902852 739024 858154 913788 484428 576268 759092
16501G59092k98930J06814j54679L13022k89331L5395K45544j725K21115j07734
$$ 759092 460162 566976 412297 725319 435988 471383 716927 715202 936317 828583
16491H28583k25559M2201R2237k71788L40669k68475o4011R8096K58688D00252
$$ 828583 603024 645225 737462 465674 806343 537868 473857 571953 830641 400252
16480C64934J35584K26452C20130P6516p1202K00324K22602j34753j71949p1103
$$ 364934 500518 726970 320130 396646 325444 525768 748370 613617 441668 370565
16470C70565q5428J34865l4129J50428K30604j29487A37809N69169A97057L8256
$$ 370565 285137 420002 385873 536301 766905 637418 137809 706978 197057 235313
16460B35313K81256j12808J87210j37648J81396n8837L29591l02725j49394J85671
$$ 235313 516569 403761 590971 453323 634719 575882 905473 602748 453354 639025
16450F39025B51429J23980A9682O49010B61438L05743A71182L77652j78422P6225
$$ 639025 251429 375409 19682 668692 261438 567181 171182 548834 370412 446637
16440D46637j26585A42319M19826A46760J23453p0081J05304R3759A80462M79737
$$ 446637 320052 142319 562145 146760 270213 200132 305436 399195 180462 660199
16430F60199l10369K35315A11957M17083A93822N32594A25281L02028A16491K76995
$$ 660199 349830 585145 111957 529040 193822 726416 125281 427309 116491 393486
16420C93486O2287K6839j86680J01463j40789P3858P824A41017J5648o0271L91898
$$ 393486 455773 482612 295932 397395 256606 330464 338288 141017 156665 96394 488292
16409D88292F8162N07968k56724Q8472N6998m3829i141D01491A50350K47903M951
$$ 488292 68162 576130 319406 407878 464876 421047 -9141 401491 150350 398253 403204
16398D03204A7790N03527J69331C10090E9365K72125n3926M2219M6021A37620
$$ 403204 17790 521317 690648 310090 59365 331490 277564 319783 365804 137620
16387C22031J31445j41057k6926A20913n5138e4509B01427a1300C13486K3959
$$ 322031 453476 312419 285493 120913 65775 -54509 201427 -11300 313486 337445
16377C37445D7016K18987j03689P8632D7221K78563A58374N7414j00230K60806
$$ 337445 47016 266003 162314 240946 47221 325784 158374 215788 115558 376364
16367C76364a09548D38345A72281K67362H8461J90727J21563j67371m855b0685
$$ 376364 -109548 438345 172281 439643 88461 279188 400751 233380 228525 -20685
16356C98810I2824M6578J13309F5149M5096L02014A44577Q5600i0650B77841N759
$$ 398810 92824 139402 252711 65149 110245 412259 144577 230177 -90650 277841 283600
16345B83600e523B42063e3080A27029D5133P1589O9754o7002R7754o5324Q7562
$$ 283600 -5523 242063 -53080 127029 45133 116722 186476 119474 217228 151904 239466
16334B39466K46562A83161c7308H8606g5292A66315a4381j33328B65889C8208
$$ 239466 486028 183161 -37308 88606 -75292 166315 -14381 -147709 265889 38208
16323A05927R2143e6941F1422J35680d6623A05808a6885E69540A27258K949D9843
$$ 105927 198070 -56941 61422 197102 -46623 105808 -16885 569540 127258 130207 49843
16311G6814O1510O6635a76168A30306J42880a3184A35136J79279f4240B19892
$$ 76814 138324 204959 -176168 130306 273186 -13184 135136 314415 -64240 219892
16300A16919J0009K34807A46379F0022M31959l8054F723J28813M7911q678n4808
$$ 116919 126928 361735 146379 60022 491981 453927 6723 135536 183447 174769 119961
16289A19961J34628a6673l7425C71050c5706p363A17331K00519j0823q9797e3144
$$ 119961 254589 -16673 -54098 371050 -35706 -43069 117331 317850 307027 217230 -53144
16277A18189P6641N4213A09712f5481C83838A69148Q2309j20410k2443K77148
$$ 118189 194830 249043 109712 -65481 383838 169148 251457 131047 108604 385752
16267C85752G2226f4578r8820B79588D2541E633J657K13346A05787A811c47573
$$ 385752 72226 -64578 -163398 279588 42541 5633 7290 220636 105787 1811 -347573
16255B85667N7042r0918P1647d3008B34831b20320B12233H9629a43174B57884
$$ 285667 342709 251791 323438 -43008 234831 -220320 212233 89629 -143174 257884
16244a07446H8860f1527e527G4853J01490M5255i230j11388C0505J47947b90652
$$ -107446 88860 -61527 -5527 74853 176343 221598 -9230 -120618 30505 178452 -290652
16232B99252G9637K19006a14640I3183K34126g9256B51605a75143G4522a83413
$$ 299252 79637 298643 -114640 93183 327309 -79256 251605 -175143 74522 -183413
16221a67050A02337J43271b5935A69596F0048a59779L0605E1307a80425A39620
$$ -167050 102337 245608 -25935 169596 60048 -159779 -129174 51307 -180425 139620
16210a47028K6400k6448m8954d4967B91462b39557A40594J31172A23405d95747
$$ -147028 -120628 -147076 -196030 -44967 291462 -239557 140594 271766 123405 -495747
16199B57522d4777j1724a8439q4272A56323f1719A21847J78002o0434a4260B04146
$$ 257522 -44777 -56501 -18439 -102711 156323 -61719 121847 299849 239415 -14260 204146
16187A97512a00489D1477L0394Q2708E7961J33861J13428a9593k66691B46076
$$ 197512 -100489 41477 71871 154579 57961 191822 305250 -19593 -286284 246076
16176B02816b8263k7966j13172f8781A18531f6700j52811A81797b64512q1858
$$ 202816 -28263 -56229 -169401 -68781 118531 -66700 -219511 181797 -264512 -346370
16166c46370A85652C3255J36855H4891K774b63572H5326c39904J06843B26874
$$ -346370 185652 33255 170110 84891 87665 -263572 85326 -339904 -233061 226874
16155D0174i5568L2404B34384f5842A25912c0801A4105J16315j1586N2555N6016
$$ 40174 -95568 -63164 234384 -65842 125912 -30801 14105 130420 118834 171389 227405
16144B27405c6661k73294C19412D5939J31440C8064b18356H2312O9391a58891
$$ 227405 -36661 -309955 319412 45939 177379 38064 -218356 82312 151703 -158891
16133A21291O1702c70742a26381p2407f1363A50258n9234a07428b0593l07091
$$ 121291 182993 -370742 -126381 -198788 -61363 150258 91024 -107428 -20593 -327684
16123c27684C0109c18178e3292A92181N9877b29176c9020H6201b26874B33040
$$ -327684 30109 -318178 -53292 192181 252058 -229176 -39020 86201 -226874 233040
16112a19561C0999R6350a47586A03992a14421E7868K09907D179L21991b34747
$$ -119561 30999 127349 -147586 103992 -114421 57868 267775 4179 326170 -234747
16101A58254J4352e067r8188C81877f315j95033B80544b65627a02793c7706B549
$$ 158254 172606 -5067 -103255 381877 -6315 -201348 280544 -265627 -102793 -37706 2549
16089D4689K7431P8387i7820j7919C20809q4447f1459A66059e09841B0659a49245
$$ 44689 72120 150507 -97820 -115739 320809 236362 -61459 166059 -509841 20659 -149245
16077F71a52239g1112B62428G4566g2651j70982h3109j6118B96250a38078r6720
$$ 671 -152239 -71112 262428 74566 -72651 -243633 -83109 -99227 296250 -138078 -234798
16066b34798k6283d6186A54424F1622h1111j43937B43040b94351J23633H6307
$$ -234798 -261081 -46186 154424 61622 -81111 -225048 243040 -294351 -170718 86307
16055F2956K6970O2214q269n3598e2852o9590A61769A2593i1272j96012a07688
$$ 62956 89926 152140 143871 90273 -52852 -122442 161769 12593 -91272 -287284 -107688
16043a4231n7950k31942h2685A35277a302A31051a51476E4383J0691J28224F9803
$$ -14231 -72181 -304123 -82685 135277 -1302 131051 -151476 54383 65074 193298 69803
16031B9471R8157I316c3824G9909c03357n0548J55306d6386B39728b44008g0846
$$ 29471 127628 9316 -33824 79909 -303357 -353905 -198599 -46386 239728 -244008 -70846
16019D1196b7359j65605A18510L4150c14340a7724A25839d2826j05816j02531
$$ 41196 -27359 -192964 118510 152660 -314340 -17724 125839 -42826 -148642 -251173
16009b51173A8458g2129H5307b1715B11474a12875c7329j03826d8160E2974c93578
$$ -251173 18458 -72129 85307 -21715 211474 -112875 -37329 -141155 -48160 52974 -393578
15997B14815a34168G3513b94146f2856A2891P3654P3580d63233a12342D2541d9937
$$ 214815 -134168 73513 -294146 -62856 12891 86545 160125 -463233 -112342 42541 -49937
15985b55877Q5846j38832B43011r7552M476J14734b2943G3955p095d82617A94631
$$ -255877 -170031 -308863 243011 145459 149935 264669 -22943 73955 66860 -482617 194631
15973B96942A34785m3366d13704b8028G7943J9309a95856K593B07087c48764b618
$$ 296942 134785 91419 -413704 -28028 77943 97252 -195856 -193263 207087 -348764 -2618
15961b42202g7153K2097B90771a342A28937o4459f9927j14415k8248c9920E7861
$$ -242202 -77153 -55056 290771 -1342 128937 64478 -69927 -184342 -212590 -39920 57861
15949F9749i4969n1775B88750a63659F4470K10144b2449j13624A46014a66673
$$ 69749 -94969 -146744 288750 -163659 64470 274614 -22449 -136073 146014 -166673
15938B45929d861B52962G2395b97507a46919D5781a82388C5427d55876b3743C3002
$$ 245929 -4861 252962 72395 -297507 -146919 45781 -182388 35427 -455876 -23743 33002
15926A60806g7656c8146B21039a82976K9473K4188p8157d2288k4611I7495b65968
$$ 160806 -77656 -38146 221039 -182976 -153503 -129315 -207472 -42288 -66899 97495 -265968
15914C5944b48181B5962K63978a65322L8783F6027b03003H1807K5051g2104b4111
$$ 35944 -248181 25962 289940 -165322 -126539 66027 -203003 81807 106858 -72104 -24111
15902e7126j84276a10153K1600B96758G0494f5869j12431f3180k13359e678n742
$$ -57126 -241402 -110153 -88553 296758 70494 -65869 -178300 -63180 -276539 -5678 -11420
15891a1420m8518j88768e944k86810J03594g1726o6973D1928Q430c27662C62666
$$ -11420 -59938 -248706 -5944 -292754 -189160 -71726 -138699 41928 50358 -327662 362666
15879c2084O222j63990k3278A42122a08451m2606P1589J8821l57446a88415q1045
$$ -32084 -25862 -189852 -213130 142122 -108451 -151057 -79468 -60647 -418093 -188415 -269460
15868b69460P59g902H8824O1121G1638b05754d3242j11758i391k48906Q9223B0591
$$ -269460 -268701 -7902 88824 149945 71638 -205754 -43242 -155000 -9391 -258297 -169074 20591
15855B42493b67702g6782D588d6641l14502B09423h9594J4334H0805N7750b29870
$$ 242493 -267702 -76782 4588 -46641 -361143 209423 -89594 -75260 80805 138555 -229870
15843a02885L7849C1397L7571b02262C21225i3495a6906B8986A3365J61811g7444
$$ -102885 -65036 31397 68968 -202262 321225 -93495 -16906 28986 13365 175176 -77444
15831A13295j152a58335a9589k4714k75046P6692f433E01547k19917a02369c8163
$$ 113295 112143 -158335 -19589 -44303 -319349 -242657 -6433 501547 281630 -102369 -38163
15819b19361q095f2943M86K9723H7656a5339k98757k2888C36441I2672b97767
$$ -219361 -227456 -62943 -62457 -32734 87656 -15339 -314096 -336984 336441 92672 -297767
15807a11600D2395e825C48813d6037L633I1294a6475E1152N206c558I3626K04122
$$ -111600 42395 -5825 348813 -46037 -42404 91294 -16475 51152 56358 -3558 93626 297748
15795B97748A2123b71544G8827i9263B85583l0637A18025a69376d6843B8887a84922
$$ 297748 12123 -271544 78827 -99263 285583 254946 118025 -169376 -46843 28887 -184922
15783b50048A00380b7742a1232r7907p4914P4544G4069h4634j99985A23143c5050
$$ -250048 100380 -27742 -11232 -109139 -184053 -109509 74069 -84634 -284619 123143 -35050
15771g6149j45929b9192j87063L5477B54993a60607A86406b20295B94726a51871
$$ -76149 -222078 -29192 -216255 -180778 254993 -160607 186406 -220295 294726 -151871
15760a76319O8378R935M5201B27108j288E3476a53631N2645f52j01156D5572J09656
$$ -176319 -107941 -98006 -52805 227108 225820 53476 -153631 -100986 -652 -101808 45572 155228
15748A55228n4548b77480i2786B40590M1139A6553i9363A90611J8539A2857b11112
$$ 155228 100680 -277480 -92786 240590 281729 16553 -99363 190611 209150 12857 -211112
15736a41110f8621q7743k015H186b62335j9412F6315a18819L1779A98832a17011
$$ -141110 -68621 -156364 -158379 8186 -262335 -281747 66315 -118819 -87040 198832 -117011
15724d96997C7969b95227D4254b07125c4632C0156e3393C0969a93261A18129b05216
$$ -496997 37969 -295227 44254 -207125 -34632 30156 -53393 30969 -193261 118129 -205216
15712a34550d4944B58436a56332k70247C5731h3237K7656A00633d22277B4896
$$ -134550 -44944 258436 -156332 -426579 35731 -83237 -55581 100633 -422277 24896
15701a03822K9384j22196h8883d1871l4540A7466L9219a13380A42343l3177K54807
$$ -103822 -74438 -196634 -88883 -41871 -76411 17466 56685 -113380 142343 109166 363973
15690C63973a96679C22018B4131K51674I0688b00612j00252F5228J94717a75884
$$ 363973 -196679 322018 24131 275805 90688 -200612 -300864 65228 259945 -175884
15679B1931g5980B49903a36206B967e0540D6547h6182a3997k59055a03442B13533
$$ 21931 -75980 249903 -136206 2967 -50540 46547 -86182 -13997 -273052 -103442 213533
15667G390R0875J58638b17478O965A47842i7208j6676A8509a39130B25338A2115
$$ 7390 98265 256903 -217478 -210513 147842 -97208 -113884 18509 -139130 225338 12115
15655b40175d4513j06244j84383g9635A8011J00947b145A43346d00773J81934
$$ -240175 -44513 -150757 -335140 -79635 18011 118958 -2145 143346 -400773 -218839
15645b18839B9647d81237b04885B03631m158D281R028b41517l2287A50740L09
$$ -218839 29647 -481237 -204885 203631 199473 4281 13309 -241517 -273804 150740 151049
15634A51049b95361C4301a17225L8361A71089a79390A07528C8184J56834e695
$$ 151049 -295361 34301 -117225 -78864 171089 -179390 107528 38184 195018 -5695
15623A63526J88335a0942B27466C3343e2137k53434A52452e78399B44555H4914
$$ 163526 351861 -10942 227466 33343 -52137 -305571 152452 -578399 244555 84914
15612a11647B89069a90264B19439E2353J3816K02629j24084c2132A61147b71066
$$ -111647 289069 -190264 219439 52353 66169 268798 144714 -32132 161147 -271066
15601A81094a11000j25299e0617j23625j6365O4296d4037C17714B3072R7476c27
$$ 181094 -111000 -236299 -50617 -174242 -190607 -126311 -44037 317714 23072 120548 -327
15589B36829l5288b97103a41233L4495b07j28963G6715K5136b8775k36684L8948
$$ 236829 201541 -297103 -141233 -106738 -207 -129170 76715 101851 -28775 -265459 -226511
15578b26511B40140D5033c94865J58270A23808a48533i144l96067B28457N9866
$$ -226511 240140 45033 -394865 -236595 123808 -148533 -9144 -405211 228457 288323
15568B88323b19612i9469E5424a89213A98020b73779i8695a6407n4698B92218
$$ 288323 -219612 -99469 55424 -189213 198020 -273779 -98695 -16407 -71105 292218
15557a07238p9901D4024b6011o0386j19342N4400C26232H0684P47L865a33327
$$ -107238 -187139 44024 -26011 -86397 -205739 -151339 326232 80684 81431 85296 -133327
15545a39964A44800a37528B3009c17880a6742A4686J038J13014b60209H761N4076
$$ -139964 144800 -137528 23009 -317880 -16742 14686 15724 128738 -260209 8761 62837
15534F2837P6636f6049H1668c3850l97123a78878E8293P4977a94413H320a52748
$$ 62837 139473 -66049 81668 -33850 -430973 -178878 58293 133270 -194413 8320 -152748
15522A21590D5382J27515J33701a32017D4639J88176l6392o3231J22888g2989
$$ 121590 45382 172897 306598 -132017 44639 232815 196423 133192 256080 -72989
15511B83647j9703A23284B252a36576n1974q2841G0082h5473B3856c02672C0174
$$ 283647 263944 123284 2252 -136576 -188550 -271391 70082 -85473 23856 -302672 30174
15499a75487A38082b94184e0051C1538I983J6697c3019B02230p7212c9799j11221
$$ -175487 138082 -294184 -50051 31538 9983 26680 -33019 202230 125018 -39799 -151020
15488a51020o7896H193J57986J76395i3525Q266B09613a73458A13910B0433K8007
$$ -151020 -218916 8193 166179 342574 -93525 -85259 209613 -173458 113910 20433 48440
15477D8440r032D150a93616q0426i5128o3150g8795p5094I7237J84348a82247
$$ 48440 39408 4150 -193616 -274042 -95128 -158278 -78795 -153889 97237 281585 -182247
15465a51044b1722C74597a80136A76902q3205f7616F1102a37648B03054K0993
$$ -151044 -21722 374597 -180136 176902 93697 -67616 61102 -137648 203054 224047
15455B24047a46705E1384A5561K78886j02892a23777A91399d7338D1428a0998
$$ 224047 -146705 51384 15561 294447 191555 -123777 191399 -47338 41428 -10998
15444g0680a5223B88541n9337a6439o3762D2859J42379A140a69743g1739k03148
$$ -70680 -15223 288541 229204 -16439 -80201 42859 185238 1140 -169743 -71739 -274887
15433b74887q857q0152J66222i5275G5685a92640g1867K6986j17611C27507a76211
$$ -274887 -283744 -363896 -197674 -95275 75685 -192640 -71867 -44881 -162492 327507 -176211
15421A38749k5059i2842j14192g2765j35404A46378m8992N179n1108J534L0222
$$ 138749 113690 -92842 -207034 -72765 -208169 146378 97386 102565 51457 52991 83213
15410H3213i9145k11738a16263B97643g2133q5350B79341A00128a50316m6651
$$ 83213 -99145 -310883 -116263 297643 -72133 -157483 279341 100128 -150316 -196967
15400a96967A64027a68254k0562R3134l1995M848C9068M422a67277A6933J85341
$$ -196967 164027 -168254 -188816 -95682 -127677 -122829 39068 43490 -167277 16933 202274
15389B02274q3496a75847d4044k04265A88864H028L0232h4060c9817C3741b97901
$$ 202274 118778 -175847 -44044 -248309 188864 8028 38260 -84060 -39817 33741 -297901
15377A49019b38758B53963a0934q8643B45136A9205N5469j2403a61265A14701
$$ 149019 -238758 253963 -10934 -99577 245136 19205 74674 62271 -161265 114701
15366A3438d1909k2723B88966i0813j9935L1599L342j33182B00027B7819a77834
$$ 13438 -41909 -64632 288966 -90813 -110748 -79149 -75807 -208989 200027 27819 -177834
15354C44859f3606q58A23323a39796q6757A16510n0384a38730B85302e3599j9975
$$ 344859 -63606 -64464 123323 -139796 -226553 116510 66126 -138730 285302 -53599 -73574
15343g3574H8909f9367K8117C6578J82508H1917c3678j06288f9617M640j54096
$$ -73574 88909 -69367 -41250 36578 219086 81917 -33678 -139966 -69617 -64977 -219073
15332b19073f9525b4125I4336a2661j27767H6593Q2123C1229a292l00989G5468
$$ -219073 -69525 -24125 94336 -12661 -140428 86593 168716 31229 -1292 -302281 75468
15320b7022H7056b17759F4788J2104N0120O4338l365a0089A09435J74213i1103
$$ -27022 87056 -217759 64788 76892 127012 191350 187985 -10089 109435 283648 -91103
15308D8334g4971A46492l5163a50741A76656l508p7906N1089J53153a20013A8829
$$ 48334 -74971 146492 111329 -150741 176656 173148 95242 146331 299484 -120013 18829
15296a6958j03454B54368d9175B0987L39575H6127P0480K27619b6960B32074B2032
$$ -16958 -120412 254368 -49175 20987 360562 86127 156607 384226 -26960 232074 22032
15284C709L12217l2957a37073A15850j650j3936C5188a34500I7083l2280P4657
$$ 3709 315926 282969 -137073 115850 114200 100264 35188 -134500 97083 64803 139460
15273A39460j7904J35112L5582b4681B57836h0888b9530B20900o2591a91204M7100
$$ 139460 121556 256668 292250 -24681 257836 -80888 -29530 220900 158309 -191204 -144104
15262a44104E7785b05782C06100A41998g6422j81823P9494A01178e2711H2810
$$ -144104 57785 -205782 306100 141998 -76422 -258245 -178751 101178 -52711 82810
15251C33635j45024L79397B60398o3474R30928O24476o56717M28372J11893D33202
$$ 333635 188611 568008 260398 196924 1127852 1752328 1095611 1523983 1635876 433202
15240C78915j34056A17205K81452d7021C39997f3538B88554H2269M3724m1537
$$ 378915 244859 117205 398657 -47021 339997 -63538 288554 82269 125993 84456
15230H4456a36897L1572D8621K83900j09795L3420A19382M3796D2078J33219g4060
$$ 84456 -136897 -105325 48621 332521 222726 256146 119382 163178 42078 175297 -74060
15218a44069j16962r077a05075A61926c8446C3279c5033q0462A56839a24212B93950
$$ -144069 -261031 -270108 -105075 161926 -38446 33279 -35033 -115495 156839 -124212 293950
15206F9216K98746H3022a46968B71154a04699j27070F2086J02938a43320A0296
$$ 69216 367962 83022 -146968 271154 -104699 -231769 62086 165024 -143320 10296
15195a85413B15486n8018B497e2352H0182O968B2369J38165K53071A39077Q3114
$$ -185413 215486 157468 2497 -52352 80182 87150 22369 160534 413605 139077 222191
15184B22191b06551G3073Q6995f7213B42837a00116B58778J72083A69444E959
$$ 222191 -206551 73073 160068 -67213 242837 -100116 258778 430861 169444 5959
15173B55435o327i7533C09470F0031O5787K29592j08240a7340A05905d920j5786
$$ 255435 249108 -97533 309470 60031 125818 355410 247170 -17340 105905 -4920 -20706
15162b0706A76684g2639C9728g705m3952l00670c6374A57335o0485g6821A61800
$$ -20706 176684 -72639 39728 -7705 -51657 -352327 -36374 157335 96850 -76821 161800
15150E357L28823A15683P1178f314i91a73G9150J14680A948M590O7193c4010A75909
$$ 5357 334180 115683 186861 -6314 -991 -173 79150 193830 1948 6538 73731 -34010 175909
15136B57517r2102n1719a05360A19858K08417a84106C57919a9512i37n1022B13984
$$ 257517 165415 113696 -105360 119858 328275 -184106 357919 -19512 -937 -51959 213984
15124I9845J1225H292K28090L3501o372K68178j68230C5839M17971A05690K39039
$$ 99845 111070 8292 236382 269883 263511 531689 363459 35839 453810 105690 344729
15113C44729A452K31350J00853A8797K26510a31589A66774m010O9996i3465B39949
$$ 344729 1452 232802 333655 18797 245307 -131589 166774 162764 232760 -93465 239949
15101a52748I9688J65466k2257k5177h3357C07695A37650B7733K62600j28488
$$ -152748 99688 265154 242897 217720 -83357 307695 137650 27733 290333 161845
15091A61845a68524D7569f8316I179b8801j65312C05474A40996q670m0184L95753
$$ 161845 -168524 47569 -68316 9179 -28801 -194113 305474 140996 132326 92142 487895
15080D87895f5395l1195A59767P8089M2212o1257a7733n677C59531F6378J23339
$$ 487895 -65395 -96590 159767 237856 280068 218811 -17733 -23410 359531 66378 189717
15069A89717o2690K91351A04145l0054P9285a4854A07618d2808o6150D36042A52128
$$ 189717 127027 418378 104145 74091 153376 -14854 107618 -42808 -108958 436042 152128
15057A45475j5475P9506F481J96758n981J06528H4428c8525B6772J86691l8011
$$ 145475 130000 209506 6481 203239 197258 303786 84428 -38525 26772 213463 175452
15046A75452G9531K4317J43349J3234A7654K27688K5020G5127J78138B1766P2711
$$ 175452 79531 103848 247197 260431 17654 245342 270362 75127 253265 21766 94477
15035I4477P4439n5670K5213J18070p883j4416J1355j09305k1827J50753l4668
$$ 94477 168916 113246 138459 256529 248646 234230 245585 136280 114453 265206 230538
15024B30538R4526j45403K61405A10837Q289K96203D0001f3512C27041P5937A89024
$$ 230538 325064 179661 441066 110837 119126 415329 40001 -63512 327041 402978 189024
15012B60584a25937B52147I3450L5460n0104L204L4805J13946L63491A46717P0684
$$ 260584 -125937 252147 93450 128910 78806 82010 116815 230761 594252 146717 217401
15001B17401m7605H3179K22477b3285D00294A20243l2953B7662J8982a56919b2629
$$ 217401 169796 83179 305656 -23285 400294 120243 87290 27662 46644 -156919 -22629
14989D1787L23380F2653K22148J89303C2650K53141A20653E3043J37338N2084
$$ 41787 365167 62653 284801 474104 32650 285791 120653 53043 190381 242465
14979B42465J66795j54114l850F4279K50901A37940R858K10916E6432K99212r9693
$$ 242465 409260 255146 251296 64279 315180 137940 147798 358714 56432 355644 255951
14968B55951L3291o7193K592j7280J58858B2242K36029A06331N93N42485B16052
$$ 255951 289242 222049 224641 207361 366219 22242 258271 106331 106924 649409 216052
14956E60589k78941A19778O32711B85073Q6819K67818B38980R5647d5684l2318
$$ 560589 281648 119778 752489 285073 371892 639710 238980 334627 -45684 -78002
14946g8002K2569E88440B25963m1461D1380J49567J72316j11087j2622K21158
$$ -78002 -55433 588440 225963 184502 41380 190947 363263 252176 239554 460712
14936D60712m2443A7820L73460l9868A08653N0604L10456j60659c9189j62065
$$ 460712 418269 17820 391280 351412 108653 159257 469713 309054 -39189 -201254
14926b01254B97906J03967P9131J03302k81652J15510j44046J36780A90627E7317
$$ -201254 297906 401873 481004 584306 302654 418164 274118 410898 190627 57317
14915A25748K94813F9456J79054h5188A32621M12603l6558j09458J60060m0510
$$ 125748 420561 69456 248510 -85188 132621 545224 508666 399208 559268 518758
14905E18758j32230j04934J24733j44173K7867Q9533m5264J49702a07881C77955
$$ 518758 386528 281594 406327 262154 290021 379554 334290 483992 -107881 377955
14894A18699k9167L22840m614A96894P9923J02890k8097J08837k19512L31407
$$ 118699 89532 412372 407758 196894 276817 379707 351610 460447 240935 572342
14884E72342O7812B15777L37761A97682L84597B69011C6363K36269o6036J90995
$$ 572342 640154 215777 553538 197682 582279 269011 36363 272632 206596 397591
14874C97591j89554E1092M15606p4003A52245K05170Q9632j8332K10160L4895
$$ 397591 208037 51092 466698 392695 152245 357415 447047 428715 638875 673770
14864F73770J55685l77587K89188B50950M59039k98041B03431J45729K64296B71794
$$ 673770 829455 451868 741056 250950 709989 411948 203431 349160 613456 271794
14853C23635K40602k05141K845R0048A89711b2061D98049j75402r1584J06816
$$ 323635 564237 359096 361941 451989 189711 -22061 498049 322647 231063 337879
14843C37879L45958l13771q8066J31134O612r0525j12528m5455M67011O0337k40153
$$ 337879 683837 370066 282000 413134 419746 329221 216693 171238 638249 698586 458433
14832D58433K38780C26668P2912A61439M32463j23376J0302m7914M07330j44440
$$ 458433 697213 326668 399580 161439 593902 470526 480828 432914 840244 695804
14822F95804R6193k14362B69389J98183K0405j21270L09165G2131N97294k77551
$$ 695804 791997 577635 269389 467572 487977 366707 675872 72131 669425 391874
14812C91874Q5614N8226B04997P0388K19623L96142D40748q8967j07390L78547
$$ 391874 477488 535714 204997 275385 495008 891150 440748 351781 244391 622938
14802F22938A79716J43158J42136P9106J00979k13595J08615J86560C24995N10696
$$ 622938 179716 322874 465010 544116 645095 431500 540115 726675 324995 835691
14792H35691j17930B69486K40093K46539l15324J12816k28926L15843j2043j09144
$$ 835691 717761 269486 509579 756118 440794 553610 324684 640527 628484 519340
14782E19340j32295R9070J79701k37838K23950O1296k91207J51706L5937B53939
$$ 519340 387045 486115 665816 427978 651928 713224 422017 573723 609660 253939
14771G60214L3112l40701J11815L61723l38042J6815J01512k87976L32837j25730
$$ 760214 793326 452625 564440 926163 588121 604936 706448 418472 751309 625579
14761F25579R3474k6957k44165L4518J44926j44513N3816J64434J43119j98014
$$ 625579 719053 692096 447931 482449 627375 482862 536678 701112 844231 646217
14751F46217O887K23883j03547K6571L0237m06025J9320L17095J6311l26979L59506
$$ 646217 653104 876987 773440 800011 830248 424223 443543 760638 776949 449970 809476
14740H09476B96357L34135K43129l0680Q9385C67437L52324K45548m29081M86553
$$ 809476 296357 630492 873621 842941 932326 367437 719761 965309 536228 1022781
14730A022781k53603K09950n4963k63959k6979J53895K63543l71619N14076n33421
$$ 1022781 769178 979128 924165 660206 633227 787122 1050665 679046 1193122 659701
14720F59701K72399j17428j41810J36604k3664K44741J33965n55980p5739J48177
$$ 659701 932100 814672 672862 809466 785802 1030543 1164508 608528 532789 680966
14710F80966K62667k14853M05755j47508P2147j25616q6179j2858j19300K29319
$$ 680966 943633 728780 1134535 987027 1059174 933558 847379 834521 715221 944540
14700I44540R5637o7406n9278L697j12426J16350J25320k39583O200Q0433R300
$$ 944540 1040177 972771 913493 917190 804764 921114 1046434 806851 813051 893484 902784
14689I02784L2572J08917p0561J13769k3409k21944L03758l19341P7502J12146
$$ 902784 935356 1044273 973712 1087481 1064072 842128 1145886 826545 904047 1016193
14679A016193l40498K59987J17035k48027K69061m8007M6984J25658p6894L2096
$$ 1016193 675695 935682 1052717 804690 1073751 1025744 1072728 1198386 1121492 1153588
14669A153588P8286n070j48342k83638J71039L57593l38341K68239l77385K21452
$$ 1153588 1231874 1226804 1078462 794824 965863 1323456 985115 1253354 875969 1097421
14659A097421j09279L06397m04459K40835q7942J4296R4156l08236M43726q670
$$ 1097421 988142 1294539 890080 1130915 1042973 1057269 1151425 843189 1286915 1278245
14649A278245j0193J1557k38733Q3477m77397K72334j33952K35377K92977k94558
$$ 1278245 1268052 1279609 1040876 1124353 646956 919290 785338 1020715 1313692 1019134
14639A019134k4137O30833j50845O8930l25122K08575n08828K04612J17085K15209
$$ 1019134 994997 1625830 1474985 1543915 1218793 1427368 918540 1123152 1240237 1455446
14629A455446j19537j30623K17620l28997L71191P2700k92098M21051n56963L49093
$$ 1455446 1335909 1205286 1422906 1093909 1465100 1537800 1245702 1666753 1109790 1458883
14619A458883m8672Q1599o9263l94377L36189J55487J18385j82181K5715K1068
$$ 1458883 1410211 1491810 1422547 1028170 1364359 1519846 1638231 1456050 1481765 1502833
14609A502833L9283l15365J57577K22644J47917l90977J30086K37335L119q9937
$$ 1502833 1542116 1226751 1384328 1606972 1754889 1363912 1493998 1731333 1734452 1644515
14599A644515j66126k622L12641k32301M80108k98368Q2567r1967Q2212K8366
$$ 1644515 1478389 1475767 1788408 1556107 2036215 1737847 1820414 1728447 1810659 1839025
14589A839025k45687J98740J56043l81393J86103k42j86272M92312k59644k60
$$ 1839025 1593338 1792078 1948121 1566728 1752831 1752589 1566317 2058629 1798985 1798725
14579A798725K25148J38604k90177k31716O36382j53878j30056j69357J68958
$$ 1798725 2023873 2162477 1872300 1640584 2276966 2123088 1993032 1823675 1992633
14570A992633j4165K57253J06646l06620J89020O5950K53125R5330j78980Q5473
$$ 1992633 1978468 2235721 2342367 2035747 2224767 2290717 2543842 2639172 2460192 2545665
14560B545665J56717N1079L5292n331K4787L74771J30964K66531K13695R01753
$$ 2545665 2702382 2753461 2788753 2783422 2808209 3182980 3313944 3580475 3794170 4695923
14550D695923M54697J636956K778090Q891181J5950552J2514178B1771227I343669
$$ 4695923 5150620 6787576 9565666 18456847 34407399 46921577 21771227 9343669
14541G246024C314671q78929k95591n54051K09880J31982O7654j34991l80420
$$ 7246024 3314671 2435742 2140151 1586100 1795980 1927962 1995616 1860625 1480205
14532A480205N95543K25750k24197o6149K30026j47576j57693K62270J09924j85189
$$ 1480205 2075748 2301498 2077301 2011152 2241178 2093602 1935909 2198179 2308103 2122914
14522B122914M07499k49754l4432N37870o27817K89012J53418q3162l6857J62744
$$ 2122914 2530413 2280659 2246227 2784097 2156280 2445292 2598710 2515548 2478691 2641435
14512B641435j338J53119k61895J06256N1024k8466k4311M49189p4187K02702
$$ 2641435 2640097 2793216 2531321 2637577 2688601 2660135 2635824 3085013 3010826 3213528
14502C213528k84818L5800L56530l34123N19203l46565O5897j03920k69573N08381
$$ 3213528 2928710 2964510 3321040 2986917 3506120 3159555 3225452 3121532 2851959 3360340
14492C360340l0930k71711P3761L20551L19677k86788J79796Q1014l98435K73353
$$ 3360340 3329410 3057699 3131460 3452011 3771688 3484900 3664696 3745710 3347275 3620628
14482C620628J75184m72029J75323J10486L23709J13888r0563j22631P3913J87237
$$ 3620628 3795812 3323783 3499106 3609592 3933301 4047189 3956626 3833995 3907908 4095145
14472D095145J06006j00861J68920j04364K32188j360j35504Q7116j4992k3643
$$ 4095145 4201151 4100290 4269210 4164846 4397034 4395674 4260170 4347286 4332294 4308651
14462D308651J18455J53367J93463L76344o21583N08621O9792j87244M95856l17134
$$ 4308651 4427106 4580473 4773936 5150280 4528697 5037318 5107110 4919866 5415722 5098588
14452E098588J78223j8950r8524J45100m2864N4059J58526L64428j86437K05375
$$ 5098588 5276811 5257861 5159337 5304437 5261573 5315632 5474158 5838586 5652149 5857524
14442E857524k12861K25970j6764R556J44347L92927L3380l26370L50258l09455
$$ 5857524 5644663 5870633 5853869 5863425 6007772 6400699 6434079 6107709 6457967 6148512
14432F148512M66266o3708k94032P44553k00714N86148m80106K84619j35273J82294
$$ 6148512 6614778 6551070 6257038 7001591 6800877 7387025 6906919 7191538 7056265 7238559
14422G238559J33758K73618p1623P8579K2527L57773J06600K20947j48719K00894
$$ 7238559 7372317 7645935 7574312 7652891 7675418 8033191 8139791 8360738 8212019 8412913
14412H412913L1812M51502p2336K49637J42708L6032l17842K77261M06364L24610
$$ 8412913 8444725 8896227 8823891 9073528 9216236 9252268 8934426 9211687 9618051 9942661
14402I942661J1368J90772J13867P6536L76367n6064J89866L13584K51413j35973
$$ 9942661 9954029 10144801 10258668 10335204 10711571 10655507 10845373 11158957 11410370 11274397
14392A1274397L30301M030M00408K07553N51760k98220M94032j68669L18909L76373
$$ 11274397 11604698 11608728 12009136 12216689 12768449 12470229 12964261 12795592 13114501 13490874
14382A3490874J59503L05516K14959M79483J03086L86605J12300M80170M5298
$$ 13490874 13650377 13955893 14170852 14650335 14753421 15140026 15252326 15732496 15777794
14373A5777794O06525J40680L23960L73908M92835j05044O93409O01272K24559
$$ 15777794 16384319 16524999 16848959 17222867 17715702 17610658 18304067 18905339 19129898
14364A9129898K73986N84628M33371K18938M40998K46356J001937J72107P00830
$$ 19129898 19403884 19988512 20421883 20640821 21081819 21328175 22330112 22502219 23203049
14355B3203049L28865O23628M59351O25023N62108P96331O74945L61153Q48908
$$ 23203049 23531914 24155542 24614893 25239916 25802024 26598355 27273300 27634453 28483361
14346B8483361N69608R02465P41216P97972P05276Q72922J075407J229604P63998
$$ 28483361 29052969 29955434 30696650 31494622 32199898 33072820 34148227 35377831 36141829
14337C6141829P77165J058772J171135Q36762J270060J013923J445103J427086
$$ 36141829 36918994 37977766 39148901 39985663 41255723 42269646 43714749 45141835
14329D5141835J351724J277597J437241J557307K208204J070062K397193J834933
$$ 45141835 46493559 47771156 49208397 50765704 52973908 54043970 56441163 58276096
14321E8276096J753264K051545K320575K464552K578939K459495K292582L021054
$$ 58276096 60029360 62080905 64401480 66866032 69444971 71904466 74197048 77218102
14313G7218102L238105K959842L308026L574719L668941M032005M066469M226478
$$ 77218102 80456207 83416049 86724075 90298794 93967735 97999740 102066209 106292687
14305A06292687M701137N002127N462720N226422N901308O230108N995336O764474
$$ 106292687 110993824 115995951 121458671 126685093 132586401 138816509 144811845 151576319
14297A51576319P564795P814152P851409Q370656R034211R359389R824111J0657333
$$ 151576319 159141114 166955266 174806675 183177331 192211542 201570931 211395042 222052375
14289B22052375J0909226J0801895J1808060J2223727J2346655J2813548J3057652
$$ 222052375 232961601 243763496 255571556 267795283 280141938 292955486 306013138
14282C06013138J2778868J3188001J3060967J2514607J2096067J1510287J0484682
$$ 306013138 318792006 331980007 345040974 357555581 369651648 381161935 391646617
14275C91646617R712320P791958O120369K479462j8538j455855P52037K13195
$$ 391646617 401358937 409150895 415271264 417750726 417732188 416276333 417028370 417241565
14267D17241565l651342n619048p361899q989813r936331j1317508j2161593j2954824
$$ 417241565 413590223 407971175 400609276 391619463 381683132 370365624 358204031 345249207
14259C45249207j3452300j3883413j3508511j3865433j3318408j3039187j1773633
$$ 345249207 331796907 317913494 304404983 290539550 277221142 264181955 252408322
14252B52408322j1443268j1863405j1098238j0774067r926621r435282q775423
$$ 252408322 240965054 229101649 218003411 207229344 197302723 187867441 179092018
14245A79092018q541846p732787p471659p364000o916331o254660n974262n638787
$$ 179092018 170550172 162817385 155345726 147981726 141065395 134810735 128836473 123197686
14237A23197686m998899m892788n126777m462323m218937m174119l107841l837371
$$ 123197686 118198787 113305999 108179222 103716899 99497962 95323843 92216002 88378631
14229H8378631l566145l315723k877493l182092k705002k747037k245895k117425
$$ 88378631 84812486 81496763 78619270 75437178 72732176 69985139 67739244 65621819
14221F5621819k496560k345677k090084j695016k091871j814099j413748j807296
$$ 65621819 63125259 60779582 58689498 56994482 54902611 53088512 51674764 49867468
14213D9867468r57041j485538j748137j470469j278773j333145n28656j033370
$$ 49867468 48910427 47424889 45676752 44206283 42927510 41594365 41065709 40032339
14205D0032339j776518r49178q80387j090105p73157q73030j145606p99135p66819
$$ 40032339 38255821 37306643 36426256 35336151 34562994 33689964 32544358 31745223 30978404
14196C0978404o94176p86107q55356n70645p37656q44454n97664l98444n43371
$$ 30978404 30284228 29498121 28642765 28072120 27334464 26490010 25892346 25493902 24950531
14187B4950531p33816l73977q05903o87758l28894k80010q58712k33913k87051
$$ 24950531 24216715 23842738 23036835 22349077 22020183 21740173 20881461 20647548 20360497
14178B0360497o85708l04298l19663j51576o31654n19975j66506m86680l35495
$$ 20360497 19674789 19370491 19050828 18899252 18267598 17747623 17581117 17094437 16758942
14169A6758942K0832m22536k98814l49837k80298m46598j59079k81850m49162
$$ 16758942 16779774 16357238 16058424 15708587 15428289 14981691 14822612 14540762 14091600
14160A4091600m8451j19027n07822J65206l06848j96787m47138m69645O3243J69462
$$ 14091600 14043149 13924122 13416300 13581506 13274658 13077871 12630733 12161088 12224331 12393793
14150A2393793o41826j59700l86540j49764P8307k28831k23865j5801m64148q0829
$$ 12393793 11751967 11592267 11205727 11055963 11134270 10905439 10681574 10665773 10201625 10120796
14140A0120796k49475J46984o2737l83377M9865m63546J60132m0704m59766K04485
$$ 10120796 9871321 10018305 9955568 9572191 9622056 9158510 9318642 9277938 8818172 9022657
14130I022657l42422l1060L4341j72947k36739Q8530l86442J71922m52118j51396
$$ 9022657 8680235 8649175 8683516 8510569 8273830 8362360 7975918 8147840 7695722 7544326
14120G544326L81988k64144l90280J25430j44431J29988k33401k47749q2654J43699
$$ 7544326 7926314 7662170 7271890 7397320 7252889 7382877 7149476 6901727 6819073 6962772
14110F962772l12893r143l54212K61713j60327l066M5464l63361P0887k33630
$$ 6962772 6649879 6640736 6286524 6548237 6387910 6384844 6430308 6066947 6137834 5904204
14100E904204j01461j46837J00065k09783j89578L83228r0409m16230K6504j04611
$$ 5904204 5802743 5655906 5755971 5546188 5356610 5739838 5649429 5233199 5259703 5155092
14090E155092J22477l3229l01816K56346l53631K12897O1262l163l45896Q179
$$ 5155092 5277569 5244340 4942524 5198870 4845239 5058136 5119398 5116235 4770339 4778518
14080D778518m00684J24532J35363R4829l01891m1202k76882M11250l18007k33715
$$ 4778518 4377834 4502366 4637729 4732558 4430667 4389465 4112583 4523833 4205826 3972111
14070C972111K30110p6597Q8932k06182K05033j95625j14147J64090k45258O6816
$$ 3972111 4202221 4125624 4214556 4008374 4213407 4017782 3903635 4067725 3822467 3889283
14060C889283j40767M07131J56202k78389l84439k5008q7244L84870k77615J95097
$$ 3889283 3748516 4155647 4311849 4033460 3649021 3624013 3536769 3921639 3644024 3839121
14050C839121k27972M12919m27057k10151K25808m99431O438J20938O4794m9792
$$ 3839121 3611149 4024068 3597011 3386860 3612668 3113237 3119675 3240613 3305407 3255615
14040C255615n5877n7775L33611r334l05726k6178j00814J35044k41203K20459
$$ 3255615 3199738 3141963 3475574 3466240 3160514 3134336 3033522 3168566 2927363 3147822
14030C147822k24613n4374j87355O61755k39885k23488l27149K43793L7067k27577
$$ 3147822 2923209 2868835 2681480 3343235 3103350 2879862 2552713 2796506 2833573 2605996
14020B605996M3162j5813n33886M06625L46312k87958K9304K24682l08315j89310
$$ 2605996 2649158 2633345 2099459 2506084 2852396 2564438 2593742 2818424 2510109 2320799
14010B320799K69628m18777J37411K12611k1607m4072m71281Q4567l195k50920
$$ 2320799 2590427 2171650 2309061 2521672 2500065 2455993 1984712 2069279 2066084 1815164
14000A815164j55879K28093J68590l6190j83240O0941J33648K4573K34533J61646
$$ 1815164 1659285 1887378 2055968 2019778 1836538 1897479 2031127 2055700 2290233 2451879
13990B451879j82689L49832K245944O605014J5822857J9871215j9143232A2888547
$$ 2451879 2269190 2619022 4864966 11469980 27292837 47164052 28020820 12888547
13981G811622k133573j448689l21109p98218j9101m03325J59487m52052K79727
$$ 7811622 5678049 4229360 3908251 3110033 3090932 2687607 2847094 2395042 2674769
13972B674769l12343J69237j30626n0536j68534K66576p085l40285p3596J90250
$$ 2674769 2362426 2531663 2401037 2350501 2181967 2448543 2441458 2101173 2027577 2217827
13962B217827N6238Q0348l69162M35934o38551J07792q0066M36625l33100k02607
$$ 2217827 2274065 2354413 1985251 2421185 1782634 1890426 1810360 2246985 1913885 1711278
13952A711278K04859j95126j66072K05569K28536j11120q3632K30191l49368J39098
$$ 1711278 1916137 1721011 1554939 1760508 1989044 1877924 1794292 2024483 1675115 1814213
13942A814213o3963j72897J27533N8302j44080J8072K13898r4625l2236j23206
$$ 1814213 1750250 1577353 1704886 1763188 1619108 1637180 1851078 1756453 1724217 1601011
13932A601011J29799N2410j41316n9046o8675j89837O12925o86765Q7015L32418
$$ 1601011 1730810 1783220 1641904 1582858 1514183 1324346 1937271 1250506 1337521 1669939
13922A669939l09609K72658k10116l09160K04068K34053J98893m05313K08552
$$ 1669939 1360330 1632988 1422872 1113712 1317780 1551833 1750726 1345413 1553965
13913A553965j81707Q6942k07665k6033j71124J46536L00370n19326K40958j26635
$$ 1553965 1372258 1459200 1251535 1225502 1054378 1200914 1501284 981958 1222916 1096281
13903A096281K60024n4119j99179J45567J73094m53550M46692l83161q1888M25909
$$ 1096281 1356305 1302186 1103007 1248574 1421668 968118 1414810 1031649 949761 1375670
13893A375670l03923L59041m75866J91666N962M36211k69991o0820k47632P2371
$$ 1375670 1071747 1430788 954922 1146588 1152550 1588761 1318770 1257950 1010318 1082689
13883A082689Q4245k12955K69155p7803J5047P9301j57624j54022K33128o3371
$$ 1082689 1166934 953979 1223134 1145331 1160378 1239679 1082055 928033 1161161 1097790
13873A097790J52752j23595J03994l1208j18490O779q8473K84811l82971j79189
$$ 1097790 1250542 1126947 1230941 1199733 1081243 1088022 999549 1284360 901389 722200
13863G22200J90994L7206J01927r6188K11263l76304J39591J61059J74591l91363
$$ 722200 913194 950400 1052327 956139 1167402 791098 930689 1091748 1266339 874976
13853H74976L31736k13735p3077O3207m4994J27078q5103j1523J13780l86310
$$ 874976 1206712 992977 919900 983107 938113 1065191 980088 968565 1082345 696035
13843F96035L77033m13597K56813J3650r1780k56460M05430n8787Q5445J29772
$$ 696035 1073068 659471 916284 929934 838154 581694 987124 928337 1013782 1143554
13833A143554k88518L71865k76108K92454m92892p0659J53549J3617J51352k12591
$$ 1143554 855036 1226901 950793 1243247 750355 679696 833245 846862 998214 785623
13823G85623K22299l43580M99025k33227q5000K6349J57576l49593k58562J86022
$$ 785623 1007922 664342 1163367 930140 845140 871489 1029065 679472 420910 606932
13813F06932P8618j42135K34111j62665j98562P1202L32964L1068O0132j21078
$$ 606932 685550 543415 777526 614861 416299 487501 820465 851533 911665 790587
13803G90587K123L50137m94833j04936K57557J38927k94349m9461K87186l5113
$$ 790587 792710 1142847 648014 543078 800635 939562 645213 595752 882938 847825
13793H47825K011j92568P0503k94438K89298j87258N2092O4831J03885O8640J66065
$$ 847825 849836 657268 727771 433333 722631 535373 587465 652296 756181 824821 990886
13782I90886j83197j77133J77102k05137K3727J69197j55494K52370l48832M93997
$$ 990886 807689 630556 807658 602521 626248 795445 639951 892321 543489 1037486
13772A037486D51951N18557k58173K58183P8923D18660M45407C95800j058L35385
$$ 1037486 451951 970508 712335 970518 1049441 418660 864067 395800 394742 730127
13762G30127l11623K62022k63559N00026k37433m7415k24184k03038L64103R3177
$$ 730127 418504 680526 416967 916993 679560 632145 407961 204923 569026 662203
13752F62203L33865C44254j34801K88809k6262k11369J61441L37441k51444N07515
$$ 662203 996068 344254 209453 498262 472000 260631 422072 759513 508069 1015584
13742A015584j62816k60508k91699L23564J91892l84209M3649K37216A99042K66168
$$ 1015584 852768 592260 300561 624125 816017 431808 475457 712673 199042 465210
13732D65210J41001J955r7986Q1678j81189J40588O709K54021C36182K21611o0718
$$ 465210 606211 608166 510180 591858 410669 551257 557966 811987 336182 557793 497075
13721D97075j20463n2145j3783K40561K75309k43407J23857k80189N02132C52224
$$ 497075 376612 324467 310684 551245 826554 583147 707004 426815 928947 352224
13710C03254C7686O79302j61578C6792N37068K57120k89214J0407j15281J3447
$$ 303254 37686 716988 555410 36792 573860 830980 541766 552173 436892 450339
13700D50339m1213K23171j90606N95j63781L06478j14170p0187j35071J06088
$$ 450339 409126 632297 441691 442286 278505 584983 470813 400626 265555 371643
13690C71643J31442L441q9629J46883j54666j73482N49742l27284q5290Q6764
$$ 371643 503085 506526 416897 563780 409114 235632 785374 458090 372800 459564
13680D59564j61616A38286J62856l9859L21531k28330j36040L6338K84154j55167
$$ 459564 297948 138286 301142 261283 582814 354484 218444 254782 538936 383769
13670C83769J93101k8657j48341p9302K33278j65853L69000B07189R254K09048
$$ 383769 576870 548213 399872 320570 553848 387995 756995 207189 216443 425491
13660D25491l480j4212J5366J69489j71539L3692B23722K10155K35484B67202
$$ 425491 422011 407799 423165 592654 421115 454807 223722 433877 669361 267202
13649C33005l4287J28708o7166l7830n7014J53893j57534K77626j39225A53797
$$ 333005 298718 427426 360260 322430 265416 419309 261775 539401 400176 153797
13638G2680K32481M90295l50610B13409M53439l07613P3662B07590K19579k00854
$$ 72680 305161 795456 444846 213409 666848 359235 432897 207590 427169 226315
13628B26315K17170f3767E17814K44j16104O532K65869j58483n1938M0063l5563
$$ 226315 443485 -63767 517814 518058 401954 408486 674355 515872 463934 503997 468434
13617D68434I2807K20670K77134G7232K96384J86440k70177J6154A38557c9370
$$ 468434 92807 313477 590611 77232 373616 560056 289879 306033 138557 -39370
13606A87597K5697Q4667N080k7503o2724L2114K29279r6041A68846L19165j409
$$ 187597 213294 297961 303041 275538 212814 244928 474207 378166 168846 488011 486602
13595D86602j51994L12331j65293B14278a45035D16893I8378L98753j70810Q0355
$$ 486602 334608 646939 481646 214278 -145035 416893 98378 497131 326321 406676
13585D06676j08917n9851J08252j32946R7226K6525J24548R6532A82896L48474
$$ 406676 297759 237908 346160 213214 310440 336965 461513 558045 182896 531370
13575E31370C9623M46030H2286A7907M12752K49418j26918a38095D95784q6956
$$ 531370 39623 485653 82286 17907 430659 680077 553159 -138095 495784 408828
13565D08828G8314L69542j66304J42519j24514b21533D43644j97824n2505n4594
$$ 408828 78314 447856 281552 424071 299557 -221533 443644 245820 193315 138721
13555A38721R249k1716N5626k4994J4481N1287Q0834d0794C54200j56648K41894
$$ 138721 147970 126254 181880 156886 171367 222654 303488 -40794 354200 197552 439446
13544D39446j07284i37G25775k92882R4556r1711p5182I8202a20063D52350A59841
$$ 439446 332162 -937 725775 432893 527449 435738 360556 98202 -120063 452350 159841
13532A83981O6600O6403j07781N8578n9123R7673M7555A21485J51571j17816J80715
$$ 183981 250581 316984 209203 267781 208658 306331 353886 121485 273056 155240 335955
13521C35955N3919J50794k45793m1355J39239i954B91700r1413J02370H8784N2545
$$ 335955 389874 540668 294875 253520 392759 -9954 291700 200287 302657 88784 141329
13510A41329K76973J58507j29971j48550j513L27418l02896A3433M05219q2441
$$ 141329 418302 576809 446838 298288 296775 624193 321297 13433 418652 336211
13500C36211j19960P7881J03236j78531J7423B9901M12434A78155K03963k0932
$$ 336211 216251 294132 397368 218837 236260 29901 442335 178155 382118 361186
13490C61186j38788o0271p5449L7137B7568N62376j63980A56132l7803L52319
$$ 361186 222398 162127 86678 123815 27568 589944 425964 156132 118329 470648
13480D70648I2666K16003J13195A47477J63897d8996k0393A08403J21003j8166
$$ 470648 92666 308669 421864 147477 311374 -48996 -69389 108403 229406 211240
13470B11240m0608J56757Q8318C8101J87599f5263a1779B29205j968M76752l20172
$$ 211240 170632 327389 415707 38101 225700 -65263 -11779 229205 227237 703989 383817
13459C83817G0543J7991R1827j2219j4511J01778J53297j83343R0101i1011C13186
$$ 383817 70543 88534 180361 168142 153631 255409 408706 225363 315464 -91011 313186
13447C28850E8526J95755R9725j24082J32047A11552a61886C72582j08461j27875
$$ 328850 58526 254281 354006 229924 361971 111552 -161886 372582 264121 136246
13437A36246J67153l8360q8845K7102G5234K99209p6463K61013j75471G0872J30731
$$ 136246 303399 265039 176194 203296 75234 374443 297980 558993 383522 70872 201603
13426B01603A4584a00912A48939i2259C4310K19395J74133A11081J44106D9641
$$ 201603 14584 -100912 148939 -92259 34310 253705 427838 111081 255187 49641
13415B08490F3416b56662A04002k2953K11855a3903A61834J44386b34824C03538
$$ 208490 63416 -256662 104002 81049 292904 -13903 161834 306220 -234824 303538
13404C33255A26591j2280K1179M9886n8644E7009J50185J19057h8924B58928n227
$$ 333255 126591 114311 135490 185376 126732 57009 207194 326251 -88924 258928 253701
13393B53701N7591F3344L1868b3312A67407n9062k1732i6443C02660b25390D2476
$$ 253701 311292 63344 95212 -23312 167407 108345 86613 -96443 302660 -225390 42476
13381I4212D1339M07009k11123R7371H3330M95958B6768J247L79792a25739C36496
$$ 94212 41339 448348 237225 334596 83330 579288 26768 28015 407807 -125739 336496
13369D6862L29939a9341A61475N8425D6655a00566B63285g871A0811J40256L49669
$$ 46862 376801 -19341 161475 219900 46655 -100566 263285 -7871 10811 151067 500736
13358E00736C1905K59675A40458J99556j61050A3880L89396A43677R2226J91509
$$ 500736 31905 291580 140458 340014 178964 13880 403276 143677 235903 427412
13348D27412j20971j29747E4710J40871p4658K44742J92543j63208j12588o8031
$$ 427412 306441 176694 54710 195581 120923 365665 558208 395000 282412 214381
13338B14381K05218J63503B29548O1441O2832j04589j22688J00553f721A04256
$$ 214381 419599 583102 229548 290989 353821 249232 126544 227097 -6721 104256
13327C09416A47655o2559J92983n9545B9074J91964E220J50482J20743A20564
$$ 309416 147655 85096 278079 218534 29074 221038 5220 155702 276445 120564
13316C06747a31183B6158c5382C29247j36305J59738j56791b45983d8193C24496
$$ 306747 -131183 26158 -35382 329247 192942 352680 195889 -245983 -48193 324496
13305C05233n3398O3849a28082A06223O04K42750A2496J55873c17011C5234a49204
$$ 305233 251835 315684 -128082 106223 106827 349577 12496 168369 -317011 35234 -149204
13293A41064K18555j12203H4566J38356p4142E940J90123f0621j14575B11025
$$ 141064 359619 247416 84566 222922 148780 5940 196063 -60621 -175196 211025
13282G0956b7608j1347l4206B36535a22805A08264f3884A48081J06432O057j09508
$$ 70956 -27608 -38955 -73161 236535 -122805 108264 -63884 148081 254513 260570 151062
13271A51062I58J13060N15316b9175k08538B00278c28345A4089J21853e0911C36617
$$ 151062 958 114018 629334 -29175 -237713 200278 -328345 14089 135942 -50911 336617
13259F890J94635a52282C49614J41602b1110A94558n3753K4743o7985c36121D1601
$$ 6890 201525 -152282 349614 491216 -21110 194558 140805 165548 97563 -336121 41601
13247c90765B7024L4878K03861J04389j69813R9226d3176D7345L21590j50312
$$ -390765 27024 61902 265763 370152 200339 299565 -43176 47345 368935 218623
13237B18623q0946k0023J34232o0075H1406a90875E2003a78619F5164c8185j58045
$$ 218623 137677 117654 251886 191811 81406 -190875 52003 -178619 65164 -38185 -196230
13226a96230H8003C3957L64655A72779G1401A325c7211D6316j6279c46958F7033
$$ -196230 88003 33957 398612 172779 71401 1325 -37211 46316 30037 -346958 67033
13214a34824e8661A64112m9900M1827o2799M092E351K727J34050J24980j30644
$$ -134824 -58661 164112 114212 156039 93240 97332 5351 8078 142128 267108 136464
13203A36464a16601C74501A16550b37335B70777G4205j4486Q6712K32990B0443
$$ 136464 -116601 374501 116550 -237335 270777 74205 59719 146431 379421 20443
13192G5467J30782I9474M04123B27109O6619Q7675A75324O5409j5223l614L08130
$$ 75467 206249 99474 503597 227109 293728 381403 175324 240733 225510 221896 530026
13181E30026e6726B78831A15618l0203e3235C9758M19277b94859B1246O2985J99394
$$ 530026 -56726 278831 115618 85415 -53235 39758 459035 -294859 21246 84231 283625
13170B83625f1761j73649B96608m8349m3182c15319a7614k99329C80614F7863
$$ 283625 -61761 -235410 296608 248259 205077 -315319 -17614 -316943 380614 67863
13159a3673A05265b70790e115A74214d0836G8537i5102A99833r6776a1829n8552
$$ -13673 105265 -270790 -5115 174214 -40836 78537 -95102 199833 103057 -11829 -70381
13148g0381C4846P9488a78339Q3129A07252a50766N0286G1817A6772N7743M72850
$$ -70381 34846 114334 -178339 -95210 107252 -150766 -100480 71817 16772 74515 547365
13137E47365A0888J80320b22486G5520O2568a9384A33538f7508q8992A03869a16731
$$ 547365 10888 191208 -222486 75520 138088 -19384 133538 -67508 -156500 103869 -116731
13125B64576j21994I981J44679P0054a56214D99031k21150a96250e3104C50931
$$ 264576 142582 9981 154660 224714 -156214 499031 277881 -196250 -53104 350931
13114a21595a0109B67776o9668L8490p1998b8641G7649A6325J75580F1387f6261
$$ -121595 -10109 267776 198108 236598 164600 -28641 77649 16325 191905 61387 -66261
13102a61744j4859P0258A1204J30552o1091i5664k9646C76607j22661d7632B053
$$ -161744 -176603 -106345 11204 141756 80665 -95664 -125310 376607 253946 -47632 2053
13090C09132B7362i7485b2860A38504O2886e4397H1383a69468D02631A9792h1058
$$ 309132 27362 -97485 -22860 138504 201390 -54397 81383 -169468 402631 19792 -81058
13078A64435L96n6439K2827D6977L9822a34126B4920K73064A6563J6887J1981
$$ 164435 164831 108392 131219 46977 86799 -134126 24920 297984 16563 33450 45431
13067D5431c6947n6453A67007a2321F9423O7661B3892f1369C14323H5756J85906
$$ 45431 -36947 -93400 167007 -12321 69423 137084 23892 -61369 314323 85756 271662
13056B71662J9244H4128M277O9280j8985L28750F8755M2180J02110p0150a16942
$$ 271662 290906 84128 88405 157685 138700 467450 68755 110935 213045 142895 -116942
13044g7460A71999m7842h3108A17773K06678Q8293A07729K769b7015A3305J69843
$$ -77460 171999 124157 -83108 117773 324451 412744 107729 110498 -27015 13305 183148
13033A83148g3812k0869A70007q0396J94471C5623K83747c0569A26238g7780A3339
$$ 183148 -73812 -94681 170007 89611 284082 35623 319370 -30569 126238 -77780 13339
13021a71643A90387n3117i9608C56074a58983a8092E7410K03015k9641F4208g7278
$$ -171643 190387 137270 -99608 356074 -158983 -18092 57410 260425 230784 64208 -77278
13009b29600J11551B32577a05732B15667j0835n7566a2196A27803c28409e230
$$ -229600 -118049 232577 -105732 215667 204832 147266 -12196 127803 -328409 -5230
12998C4445R2651l3395B6742a9077M918j29581E033g0481A43846a53492a261p832
$$ 34445 127096 93701 26742 -19077 -14159 -143740 5033 -70481 143846 -153492 -1261 -9093
12986i093m2709H5390c6517B59887e8521B40029C6873K1792J03501j6226n3415
$$ -9093 -51802 85390 -36517 259887 -58521 240029 36873 58665 162166 145940 92525
12975I2525J59309F0171J82288a11234k00776H3230f5642C6932a04842A45833
$$ 92525 251834 60171 242459 -111234 -312010 83230 -65642 36932 -104842 145833
12964c76j841j81758A68474E6039J53978J7901E4753A0580K90339H5752a68991
$$ -376 -2217 -183975 168474 56039 210017 227918 54753 10580 300919 85752 -168991
12952A77982j4779J3508a91891C18055I8092a40098A2089K6065a93754h3449C63925
$$ 177982 163203 176711 -191891 318055 98092 -140098 12089 38154 -193754 -83449 363925
12940H9015a72329E3712g9850a9304C9128b01436C5657i8179A18654k889b04022
$$ 89015 -172329 53712 -79850 -19304 39128 -201436 35657 -98179 118654 115765 -204022
12928A43481b23859B46473a4075B10033a68766H8060a11786A48686G0260Q374
$$ 143481 -223859 246473 -14075 210033 -168766 88060 -111786 148686 70260 78634
12918G8634b12815B70774a08779B9150M7550a97175Q8825A79076J18239b48375
$$ 78634 -212815 270774 -108779 29150 76700 -197175 -108350 179076 297315 -248375
12907A08149h4528I713a63861c2681i496j8564o8899G9390J26539K04812A13657
$$ 108149 -84528 9713 -163861 -32681 -9496 -28060 -96959 79390 205929 410741 113657
12895A1916Q377J79170a85638B2959J21571a56811A5175K86868j5785B1893O1581
$$ 11916 20293 199463 -185638 22959 144530 -156811 15175 302043 286258 21893 83474
12884H3474M8264a6864F8399k851a37152F063b0409A06477Q4480o7203D9374a22895
$$ 83474 131738 -16864 68399 65548 -137152 6063 -20409 106477 190957 123754 49374 -122895
12871A43199R7524a61458n0964Q3923l9003G7168h9886d1726A50909a15973A01516
$$ 143199 240723 -161458 -212422 -128499 -167502 77168 -89886 -41726 150909 -115973 101516
12859b21165M066A38424a81109G5769B0269c33022d3617l01755e2776k02664c1511
$$ -221165 -217099 138424 -181109 75769 20269 -333022 -43617 -345372 -52776 -255440 -31511
12847A39219e5492B3358M01576r0910M807B197c4093B46708G0496l0446a52629
$$ 139219 -55492 23358 424934 334024 338831 2197 -34093 246708 70496 40050 -152629
12835C02320E1499c11815C22545a24273B23171f7501A56246a18295A66102b42353
$$ 302320 51499 -311815 322545 -124273 223171 -67501 156246 -118295 166102 -242353
12824a86361B43716N4552b05714r4558A24292d634k31820H6335c264I9616f7333
$$ -186361 243716 298268 -205714 -300272 124292 -4634 -236454 86335 -3264 99616 -67333
12812d9780B3767R6043f3293A41009c82145a76457A57658i6379o8131j05061g4351
$$ -49780 23767 119810 -63293 141009 -382145 -176457 157658 -96379 -164510 -269571 -74351
12800a7970n9871A89646E9175a48038h134E1240L837a15088B73132L690A03116
$$ -17970 -77841 189646 59175 -148038 -8134 51240 55077 -115088 273132 276822 103116
12788A48483j0681c9885a2400I6229b8121p6373n1973b3602C08646b8168d888
$$ 148483 137802 -39885 -12400 96229 -28121 -104494 -156467 -23602 308646 -28168 -4888
12776A60303i2676B6234b07677o8152c5021a4309A62166a06311A0609J77897a35423
$$ 160303 -92676 26234 -207677 -275829 -35021 -14309 162166 -106311 10609 188506 -135423
12764b28858P1349B20433c40835I9789J06585b60553A77799m2698a0454m7401
$$ -228858 -157509 220433 -340835 99789 206374 -260553 177799 135101 -10454 -57855
12754e7855A09650b2545F1112b95951c3703j98071A04289a71622H5883K43947
$$ -57855 109650 -22545 61112 -295951 -33703 -231774 104289 -171622 85883 329830
12744C29830e7265j60954D07944i3945A30544a88153i1261j38568A39438O7524
$$ 329830 -57265 -218219 407944 -93945 130544 -188153 -91261 -229829 139438 206962
12734B06962A3605b71585A74126b76992A74032a46433A7980a75749A15116h0191
$$ 206962 13605 -271585 174126 -276992 174032 -146433 17980 -175749 115116 -80191
12723f395A5333J39542a03299h809k8053A41324a0813I1220M1884J50785C5720
$$ -6395 15333 154875 -103299 -8809 -36862 141324 -10813 91220 133104 283889 35720
12711H4345K23628b16014a0218A72884J96413J86459j24409P7088A72306P7022
$$ 84345 307973 -216014 -10218 172884 369297 555756 431347 508435 172306 249328
12701B49328J45343f513k84995A56568l8459L8982d2316A18006h7533G3690h7857
$$ 249328 394671 -6513 -291508 156568 118109 157091 -42316 118006 -87533 73690 -87857
12689G1933M0484K94109H9419a46963o3709c6433B91952L5415C4384A1783J57847
$$ 71933 112417 406526 89419 -146963 -210672 -36433 291952 327367 34384 11783 169630
12678A69630J19339A11168D8006J4054M61003a59345D0624I56J49740Q3255D9475
$$ 169630 288969 111168 48006 62060 523063 -159345 40624 956 150696 233951 49475
12666g640k67349A45728J97187A06023a55248A65199F556L52298j9623j07213
$$ -7640 -274989 145728 342915 106023 -155248 165199 6556 358854 339231 232018
12656B32018E6024O1447C5760A4749J87305R6241G4568K81118k1150b37118A66246
$$ 232018 56024 117471 35760 14749 202054 298295 74568 355686 334536 -237118 166246
12644B01195b31651J14830D3098L34983J61328I7338r976J90031h2716K3244B18262
$$ 201195 -231651 -116821 43098 378081 539409 97338 87362 277393 -82716 -59472 218262
12632A94879D2795d3338A90213a25772A44265J18548q5512d804A25800J6885L9878
$$ 194879 42795 -43338 190213 -125772 144265 262813 177301 -4804 125800 142685 182563
12621A82563j8005j1860K2513m0005J56275A32083a34735c868r2903j03380e3197
$$ 182563 164558 152698 175211 135206 291481 132083 -134735 -3868 -96771 -200151 -53197
12609b18579C16796b21002b0491C78075A29384J60515a77140B64312Q9502A21201
$$ -218579 316796 -221002 -20491 378075 129384 289899 -177140 264312 353814 121201
12598B52994j00345G0701a11820C47035C3334N6879a36319e9637k86848c354j64168
$$ 252994 152649 70701 -111820 347035 33334 90213 -136319 -59637 -346485 -3354 -167522
12587a67522h167q8511j50224A773N161K55941a26923C54485D7960J05685P3357
$$ -167522 -8167 -96678 -246902 1773 6934 262875 -126923 354485 47960 153645 227002
12576B27002a28423l36385C08337h1869C6153a52176B4670R1970a7881F2648J46619
$$ 227002 -128423 -464808 308337 -81869 36153 -152176 24670 116640 -17881 62648 209267
12565B09267a78266c8045j07149d5653I0158J8127c8099C87405b71314a9837B2114
$$ 209267 -178266 -38045 -145194 -45653 90158 108285 -38099 387405 -271314 -19837 22114
12553C5951M6044N5606l3579a77265D199K4057P7219E94a81941j45265b9606B11542
$$ 35951 81995 137601 104022 -177265 4199 28256 105475 594 -181941 -327206 -29606 211542
12540B79295b06350c0849F9301e5951j01498b7874q3840g624B21878m3059m0792
$$ 279295 -206350 -30849 69301 -55951 -157449 -27874 -111714 -7624 221878 178819 138027
12529A38027b31754h0958j37251B25627h9045a4799o6506B63809e7553q0206m9757
$$ 138027 -231754 -80958 -218209 225627 -89045 -14799 -81305 263809 -57553 -137759 -187516
12518a87516D80453C17f9878b2614A1907M906N3413a10710H1814B1934J40636
$$ -187516 480453 317 -69878 -22614 11907 16813 70226 -110710 81814 21934 162570
12507A62570c01500G2102M1726Q2150a16162c7715B63523G1419h8263A68980Q8578
$$ 162570 -301500 72102 113828 195978 -116162 -37715 263523 71419 -88263 168980 257558
12496B57558I9914K475a2847j25130k02885J23862e7426B27987c4170m163B91315
$$ 257558 99914 102389 -12847 -137977 -340862 -217000 -57426 227987 -34170 -38333 291315
12484C08777K6802a4959D8934d7129D8271h2868b8686a1k40570A39327n3297e7225
$$ 308777 335579 -14959 48934 -47129 48271 -82868 -28686 -11 -240581 139327 86030 -57225
12471B85808a84977E4293h1051F9807A7199K8783b42576c1913k95072B18590J2268
$$ 285808 -184977 54293 -81051 69807 17199 45982 -242576 -31913 -326985 218590 230858
12460B30858D7978e7500B78731f6402B7822i0617B54091o1740b55344c9892A86136
$$ 230858 47978 -57500 278731 -66402 27822 -90617 254091 192351 -255344 -39892 186136
12448F31J56849G7791a91540I6923g6738r1402j09217d62B93073j25784E2634
$$ 631 157480 77791 -191540 96923 -76738 -168140 -277357 -462 293073 167289 52634
12436a46657K6855b884j77520I7233c3110I845L08405a91941E2411O5668c44207
$$ -146657 -119802 -2884 -180404 97233 -33110 9845 318250 -191941 52411 118079 -344207
12424C07219g7701K1406G3520J11494h4781E3750O4915a12587j05098H4021j5618
$$ 307219 -77701 -56295 73520 185014 -84781 53750 118665 -112587 -217685 84021 68403
12413F8403J12988e1038F1316a70203D0774h6171c3880k37714h4608C8802C807
$$ 68403 181391 -51038 61316 -170203 40774 -86171 -33880 -271594 -84608 38802 3807
12401A54594a28350A81750c13873j14319D6733J87185J83608F1805a39325B60571
$$ 154594 -128350 181750 -313873 -428192 46733 233918 417526 61805 -139325 260571
12390a73777A1959d5480p1711M4412D5552a45802J5573M0744k09690a46836A04667
$$ -173777 11959 -45480 -117191 -72779 45552 -145802 -130229 -89485 -299175 -146836 104667
12378c1117A63665c17424I9265b30140l32895H3622D1635b562m460k04587g785
$$ -31117 163665 -317424 99265 -230140 -563035 83622 41635 -2562 -7022 -211609 -7785
12366a14190b4882G5584a34720A8055K09638j09846b27345c9254D3062K96706
$$ -114190 -24882 75584 -134720 18055 227693 117847 -227345 -39254 43062 339768
12356C39768H4177G47b56623f211B40534H3813A6726a93959B32186R424J0141
$$ 339768 84177 747 -256623 -6211 240534 83813 16726 -193959 232186 241610 251751
12345B51751j14850A1158J58118e903B1618f3212C3553n245K93857E0186N0378
$$ 251751 136901 11158 169276 -5903 21618 -63212 33553 28308 322165 50186 100564
12334A00564d0053J8296E1303c0971F0766h4691A4107N7605j3461a83753G8267
$$ 100564 -40053 -21757 51303 -30971 60766 -84691 14107 71712 58251 -183753 78267
12322C6241J71393a62611f2793B83289D738N2928a09194A50936g2852k09353G6789
$$ 36241 207634 -162611 -62793 283289 4738 57666 -109194 150936 -72852 -282205 76789
12310B73790p4590b99566I4611c3464A02828i8173r3995A4768c922j25600I6099
$$ 273790 199200 -299566 94611 -33464 102828 -98173 -192168 14768 -3922 -129522 96099
12298a33362f227j20858A28635D5079c63858G4832b52471C13160c6053F965i8548
$$ -133362 -6227 -127085 128635 45079 -363858 74832 -252471 313160 -36053 6965 -98548
12286h7533H1092K25622a47874A08907L018C8013N4155P3244k6465F9385N0204
$$ -87533 81092 306714 -147874 108907 111925 38013 92168 165412 138947 69385 119589
12275A19589J88256E694A158K08799a30074a3010k32622H8372a41273c5765j49815
$$ 119589 307845 5694 1158 209957 -130074 -13010 -245632 88372 -141273 -35765 -185580
12264a85580A76364C868J89842N3726d8836l0761A22757M8575J37497J7728a78153
$$ -185580 176364 3868 193710 247436 -48836 -79597 122757 171332 308829 326557 -178153
12252e3751A97970o694E7785J16223f8957A10613e6100j73330C9797J32742P6365
$$ -53751 197970 191276 57785 174008 -68957 110613 -56100 -229430 39797 172539 248904
12241B48904c0270q0915j0281F1899b5681A61871o2418a90841A42555M183g5863
$$ 248904 -30270 -111185 -121466 61899 -25681 161871 99453 -190841 142555 146738 -75863
12229a16000A58807i3626D91715B5923K04706a58648B00633r1627K56964j33206
$$ -116000 158807 -93626 491715 25923 230629 -158648 200633 109006 365970 232764
12219B32764a22673C94173j56453A13999c7881F6369J56546b7983j12480G1206
$$ 232764 -122673 394173 237720 113999 -37881 66369 222915 -27983 -140463 71206
12208B60572H1965j2957L5752J14851E0014l389L71206o9901a03832B69443d338
$$ 260572 81965 69008 104760 219611 50014 46625 417831 347930 -103832 269443 -4338
12196B27988i9699B28891F2450K66196j64168L919n9182K04859J1930A21438f1138
$$ 227988 -99699 228891 62450 328646 164478 168397 109215 314074 326004 121438 -61138
12184i079B70936J4414D5937K96059a67503B22820K14611A25963a55291E8133
$$ -9079 270936 285350 45937 341996 -167503 222820 437431 125963 -155291 58133
12173h9530g942B86806A34390b1063P079C89566o1568j18220J02319p668h6602
$$ -89530 -7942 286806 134390 -21063 -13984 389566 327998 209778 312097 304429 -86602
12161g6319m4341B89289p2685N1795A25741D492R1344F367c755C5375M4726a35933
$$ -76319 -120660 289289 216604 268399 125741 4492 95836 6367 -3755 35375 80101 -135933
12148C38486h5306A11102K34920a62277g8549j06823a214m0859A14553A2042L2551
$$ 338486 -85306 111102 346022 -162277 -78549 -185372 -1214 -42073 114553 12042 44593
12137D4593j6748h8898G8988a38054A98629K28298A65237a01617B17010c30556
$$ 44593 27845 -88898 78988 -138054 198629 426927 165237 -101617 217010 -330556
12126h4340I071K37235A12335A0133a74191c5246A02572O2826g0731A5634a42412
$$ -84340 9071 246306 112335 10133 -174191 -35246 102572 165398 -70731 15634 -142412
12114f7506p9221N360e6356A46428k1504a00455A48536m4102l1956k8926J08309
$$ -67506 -146727 -141367 -56356 146428 124924 -100455 148536 104434 72478 43552 151861
12103A51861c18227d4677j43848F5083b96990J05483j8841B9789i6063k97549
$$ 151861 -318227 -44677 -188525 65083 -296990 -191507 -210348 29789 -96063 -393612
12093c93612b9767F4460h4331c9569H6485h6519R003E1836f0287F2850c9697A52921
$$ -393612 -29767 64460 -84331 -39569 86485 -86519 -77516 51836 -60287 62850 -39697 152921
12080E7995a3053m9050B50687b23228l78389a02860a9907j69977c5064B6848P1855
$$ 57995 -13053 -62103 250687 -223228 -601617 -102860 -19907 -189884 -35064 26848 98703
12069I8703J95749c93505A02031C3101O8918a06703d377j61239A266a3582F6862
$$ 98703 294452 -393505 102031 33101 102019 -106703 -4377 -165616 1266 -13582 66862
12057B31625L87461J076365G90764A72355J1808j50i0577P658K6641m8114G2131
$$ 231625 619086 1695451 790764 172355 184163 184013 -90577 -82919 -56278 -104392 72131
12045b10252A84963b7678A77513d4550F1694c3265A49432E9854A6278d0180A88491
$$ -210252 184963 -27678 177513 -44550 61694 -33265 149432 59854 16278 -40180 188491
12033A8464b3128A16698A5488L05247F8465b79200B69858d0208E2486b88967J10779
$$ 18464 -23128 116698 15488 320735 68465 -279200 269858 -40208 52486 -288967 -178188
12022a78188D3391L23802b7525A00796K28876H6229K4356F018b5652q4755k1193
$$ -178188 43391 367193 -27525 100796 329672 86229 110585 6018 -25652 -110407 -131600
12011a31600F7428a4650j92184b8413A42577d9082p421k8950b2603k11915e6200
$$ -131600 67428 -14650 -206834 -28413 142577 -49082 -56503 -85453 -22603 -234518 -56200
11999H9363c10348A16155N4652J21145a16851m9513k09847A04977P1358a13348
$$ 89363 -310348 116155 170807 291952 -116851 -166364 -376211 104977 176335 -113348
11988B93666d23321b05344I88J03756J9406K449l1979e4103J4791j96330A28030
$$ 293666 -423321 -205344 988 104744 124150 126599 94620 -54103 -39312 -235642 128030
11976B0607g8398B93770a43672I7684D7372f0464k21126A59721b39109A37689
$$ 20607 -78398 293770 -143672 97684 47372 -60464 -281590 159721 -239109 137689
11965d0082p2113B51025H7119c71837a12204j25759B11081h2874a8497j369k5430
$$ -40082 -112195 251025 87119 -371837 -112204 -237963 211081 -82874 -18497 -19866 -45296
11954d5296H9009J41809B3502J70611i8867D01308A82906j4277K24853c09110
$$ -45296 89009 230818 23502 194113 -98867 401308 182906 168629 393482 -309110
11943F8183H602a3086C8469a86450J4207A2939c84025B4015O9847a9790b444m01980
$$ 68183 8602 -13086 38469 -186450 -172243 12939 -384025 24015 93862 -19790 -2444 -404424
11931d04424K01918F0328K70504D8168L5620O77a65875n6499a05974A3581K1989
$$ -404424 -202506 60328 330832 48168 83788 84465 -165875 -222374 -105974 13581 35570
11920C5570h7552D7919b21628R0843k15263A13340L1589a58953D4007b67965C65832
$$ 35570 -87552 47919 -221628 -130785 -346048 113340 144929 -158953 44007 -267965 365832
11908A20313c78192D54940c25485a27601M9479R355a2647A4474b7328j42491O0160
$$ 120313 -378192 454940 -325485 -127601 -78122 -68767 -12647 14474 -27328 -169819 -109659
11897a09659M6497A45103A7285K53325a09394p9366e5027j9511m88742A31804
$$ -109659 -63162 145103 17285 270610 -109394 -188760 -55027 -74538 -563280 131804
11886d3267k2592j45694A04533c0305q7038B04029c04281C8239J34861l255a19091
$$ -43267 -65859 -211553 104533 -30305 -117343 204029 -304281 38239 173100 169845 -119091
11874b4486j0811C49383a56638J2304a013A19502B1617d7129a0150l42532f4647
$$ -24486 -35297 349383 -156638 -144334 -1013 119502 21617 -47129 -10150 -352682 -64647
11862F8117d04788D6307c9397l0198D14793b24371B823a4695m3540I2032i5712
$$ 68117 -404788 46307 -39397 -69595 414793 -224371 2823 -14695 -58235 92032 -95712
11850b20892c5367l3654j35275L0162C6196J80081K05586a50638e4717H7983f3197
$$ -220892 -35367 -69021 -204296 -174134 36196 216277 421863 -150638 -54717 87983 -63197
11838C90607a95899e9188n8305B2689a85327n4888e4538A79347J25106c43503
$$ 390607 -195899 -59188 -117493 22689 -185327 -240215 -54538 179347 304453 -343503
11827a02102c1683l75296a13209j81790H061b90611I2322f9943l0026m4529F5127
$$ -102102 -31683 -406979 -113209 -294999 8061 -290611 92322 -69943 -99969 -144498 65127
11815c3805j06757m5923L806c5193j39119M4457I502c36954a46289f9096O070
$$ -33805 -140562 -186485 -182679 -35193 -174312 -129855 9502 -336954 -146289 -69096 -63026
11804f3026g504C50126A1916h0075E3069r341i4716j32023J02564B8718b9323
$$ -63026 -7504 350126 11916 -80075 53069 43728 -94716 -226739 -124175 28718 -29323
11792b87004a17957G567a50548r4086B3362c84056J11973B44340b58800a8090
$$ -287004 -117957 7567 -150548 -244634 23362 -384056 -272083 244340 -258800 -18090
11781c2658k55835A16982A6356a72609e968A7593a43969o3084e7141a0r975G9760
$$ -32658 -288493 116982 16356 -172609 -5968 17593 -143969 -207053 -57141 -10 -9985 79760
11768h8756a7064C72790A50310d105j43334a7573j54471g3239B22721E9589b90
$$ -88756 -17064 372790 150310 -4105 -147439 -17573 -172044 -73239 222721 59589 -290
11756b53517K4477A48152D1847a0991j65850d5343p1595k532b1802o09289K17341
$$ -253517 -229040 148152 41847 -10991 -176841 -45343 -116938 -119470 -21802 -631091 -413750
11745d13750A86682b3119k87878a235o0338A58561j7147i7177A39605c8137C70071
$$ -413750 186682 -23119 -310997 -1235 -61573 158561 141414 -97177 139605 -38137 370071
11733a7504j73452D6582J02915P9770F5002J29937I7463a06577B52627a23812
$$ -17504 -190956 46582 149497 229267 65002 194939 97463 -106577 252627 -123812
11722a595j34793k50165E5783c34742D0653J02029C9839K222J829K62247c2789
$$ -1595 -136388 -386553 55783 -334742 40653 142682 39839 42061 43890 306137 -32789
11710A48977O9254h9183c3560C2579h7384j8389h04A47086a83777A24442i8653
$$ 148977 218231 -89183 -33560 32579 -87384 -105773 -804 147086 -183777 124442 -98653
11698A12491E1726j4554a93934d5817C66795j81744J19785K5650K9972A67968
$$ 112491 51726 37172 -193934 -45817 366795 185051 304836 330486 360458 167968
11687H8551e275j16231G30340f2620A05853O101C8824b6737O777j13161C3436
$$ 88551 -5275 -121506 730340 -62620 105853 111954 38824 -26737 -19960 -133121 33436
11675a023j41246a5343n2525k4129K7230F6965a35949N2617M0206l5365b1108
$$ -1023 -142269 -15343 -67868 -91997 -64767 66965 -135949 -83332 -43126 -78491 -21108
11663C34912i6956o0836H6259a20067j5498L8221A33278L25294C498Q552a24620
$$ 334912 -96956 -157792 86259 -120067 -135565 -97344 133278 458572 3498 12050 -124620
11651C39355j62320o7469a08120D1504a73581K1464d8587j39545B2419a91114
$$ 339355 177035 109566 -108120 41504 -173581 -152117 -48587 -188132 22419 -191114
11640A85591a99814e812p4974A55010C7945J14482h9938j27109B98444C9264N6822
$$ 185591 -199814 -5812 -80786 155010 37945 152427 -89938 -217047 298444 39264 96086
11629I6086d2069N016m7465B8036b21056P3242A46005k0193a34516q712k08828
$$ 96086 -42069 -37053 -84518 28036 -221056 -147814 146005 125812 -134516 -143228 -352056
11618c52056C99253I1768d0210A5825J77095m1038f7413j22446B3531g4802A34832
$$ -352056 399253 91768 -40210 15825 192920 151882 -67413 -189859 23531 -74802 134832
11606b39406B8361M1929N8767b10903h531C30658E4554a406m8327A53079J88801
$$ -239406 28361 70290 129057 -210903 -8531 330658 54554 -1406 -49733 153079 341880
11595C41880A11244F586c6214A86300a32092b5776A13813J8822M04835B5640M28339
$$ 341880 111244 6586 -36214 186300 -132092 -25776 113813 132635 537470 25640 453979
11584D53979k12434D4977k545L1565c9797k4092b4226j637B30986a81263A52665
$$ 453979 241545 44977 42432 73997 -39797 -63889 -24226 -25863 230986 -181263 152665
11572H8046a30127B30744J38821E2303a49204B58117i5914k39696D0957a73518
$$ 88046 -130127 230744 369565 52303 -149204 258117 -95914 -335610 40957 -173518
11561A11249L30709b10892A2333M359N6412M336b36981C6058d73956d3724B73834
$$ 111249 441958 -210892 12333 16692 73104 77440 -236981 36058 -473956 -43724 273834
11549B05373b12980F5940c1062A66946F8126a0855j37454b9178E9070J78662I156
$$ 205373 -212980 65940 -31062 166946 68126 -10855 -148309 -29178 59070 237732 9156
11537D03470G2574O9553Q920J58946d5476B48674R77F5270B4762b4333j39683
$$ 403470 72574 142127 151047 309993 -45476 248674 249651 65270 24762 -24333 -164016
11526a64016b3291I2712b3578j64178A16111a56808l7618f3793F8111K31072n9951
$$ -164016 -23291 92712 -23578 -187756 116111 -156808 -194426 -63793 68111 299183 239232
11515B39232g6211B693d6897A47094a52491G6989b0812A59252J83807A06106J48049
$$ 239232 -76211 2693 -46897 147094 -152491 76989 -20812 159252 343059 106106 254155
11504B54155c3623A09338a59340B4572L01925A03838g6425A57772b22355E48321
$$ 254155 -33623 109338 -159340 24572 326497 103838 -76425 157772 -222355 548321
11493C42901A24884K0432e4830A47330g1641C01876a91930B3909K88901p196r1068
$$ 342901 124884 145316 -54830 147330 -71641 301876 -191930 23909 312810 305614 214546
11482B14546C5209O1607K28020l821j104A01051F821a3289j9443A50984N7942
$$ 214546 35209 96816 324836 321015 319911 101051 6821 -13289 -32732 150984 208926
11471B08926O6891k3817E7457M65344d4759B9359J85700K05773j98758I4208b37006
$$ 208926 275817 252000 57457 522801 -44759 29359 215059 420832 222074 94208 -237006
11459A25302L3442d7855B45942B7944h7888A50930b99841J08774A41425a86138
$$ 125302 158744 -47855 245942 27944 -87888 150930 -299841 -191067 141425 -186138
11448A455J87141d8216k2721A80804B7978h7630A30003c2543F6884O1415M16C4966
$$ 1455 188596 -48216 -70937 180804 27978 -87630 130003 -32543 66884 128299 128715 34966
11435a86870B46250a70507H0231L7283a68214A00478a62839A4620d4574B31715
$$ -186870 246250 -170507 80231 117514 -168214 100478 -162839 14620 -44574 231715
11424C88212A74841H072i1328A6308A098J23440c60874Q6144a5013E5307B2492
$$ 388212 174841 8072 -91328 16308 1098 124538 -360874 -274730 -15013 55307 22492
11412C38800a7897B0755i1285i068B10031n0964a13359A26729K11448a61320B25895
$$ 338800 -17897 20755 -91285 -9068 210031 159067 -113359 126729 338177 -161320 225895
11400f2717F5950J7415J9963c48299B84313q1632J9766r9892a79885B30571J5243
$$ -62717 65950 83365 103328 -348299 284313 202681 222447 122555 -179885 230571 245814
11389B45814a4616C1639b16439f7129I0860A5112c29163R1305E3122j3736d1206
$$ 245814 -14616 31639 -216439 -67129 90860 15112 -329163 -237858 53122 39386 -41206
11377c10939A4586J6798b77201k6766B62682H2420O7372a4944A39366C7479J925
$$ -310939 14586 31384 -277201 -303967 262682 82420 149792 -14944 139366 37479 39404
11366C9404a31094M5254I0282B0188a53464g4022D09812b87921d178C47962b0182
$$ 39404 -131094 -85840 90282 20188 -153464 -74022 409812 -287921 -4178 347962 -20182
11354F1904b90527B64538Q1734j27307h5956A23084b52068A28263b37865A05804
$$ 61904 -290527 264538 346272 218965 -85956 123084 -252068 128263 -237865 105804
11343B26413a72436B3555Q468a63119F6863d14588E5148b20579D0443K04601b05405
$$ 226413 -172436 23555 32023 -163119 66863 -414588 55148 -220579 40443 245044 -205405
11331h2147j07799A12399A0899a62360J055J8880J6212A06045h7640K4317D09914
$$ -82147 -189946 112399 10899 -162360 -161305 -142425 -126213 106045 -87640 -63323 409914
11319A55131E36N0387c05447d6260A77577E1752J35963D3616j1673a27839B21212
$$ 155131 536 50923 -305447 -46260 177577 51752 187715 43616 31943 -127839 221212
11307A05697b09023B1017a68943e8482l44091J22883a29258p4288L9310e4413
$$ 105697 -209023 21017 -168943 -58482 -402573 -279690 -129258 -203546 -164236 -54413
11296B2692o07N9460J19997C9697a2881k33421A56137o0409b00469o3569a31791
$$ 22692 22085 81545 201542 39697 -12881 -246302 156137 95728 -200469 -264038 -131791
11284c27872g1378O248J3523l03819E1879b79753A88874a19122G3393f1934q9787
$$ -327872 -71378 -65130 -51607 -355426 51879 -279753 188874 -119122 73393 -61934 -151721
11273a51721J2360A16565c14184a39327A56838d30628a54584J8818A28763a60938
$$ -151721 -139361 116565 -314184 -139327 156838 -430628 -154584 -135766 128763 -160938
11262c3904E7547A8947a7746j61519b1320m73960D27757a57593d7514I9560e9403
$$ -33904 57547 18947 -17746 -179265 -21320 -495280 427757 -157593 -47514 99560 -59403
11250F2659b69661A17306i613B7397b89860a14312I5375i2194G5460a81505j82328
$$ 62659 -269661 117306 -9613 27397 -289860 -114312 95375 -92194 75460 -181505 -363833
11239c63833a66064A5705M1527K22734m9608A06590C0718b40359A28332b34907
$$ -363833 -166064 15705 57232 279966 230358 106590 30718 -240359 128332 -234907
11228c1809l03851a53841A54822a92872b9176r6849A40532O720F4598J0380d4943
$$ -31809 -335660 -153841 154822 -192872 -29176 -126025 140532 147252 64598 74978 -44943
11216A24809a97999A01940a40406n695B0361M011K50998a94024i572j61985C2880
$$ 124809 -197999 101940 -140406 -146101 20361 24372 275370 -194024 -9572 -171557 32880
11204f1571l00849g5138r7932j85645i7231j23004B06169I495b23852f2228A22094
$$ -61571 -362420 -75138 -173070 -358715 -97231 -220235 206169 9495 -223852 -62228 122094
11192a91254H4906J98962b66074A8478a15997L5216C8249c25116B0316a59467
$$ -191254 84906 283868 -266074 18478 -115997 -80781 38249 -325116 20316 -159467
11181e3323B06678b78569E2723b1375o5225R566o4571E9303b16698a07743K6657
$$ -53323 206678 -278569 52723 -21375 -86600 -77034 -141605 59303 -216698 -107743 -81086
11170h1086E4506R5438b4960j63056J1289A24161J11565g5856G1714b8109n8446
$$ -81086 54506 149944 -24960 -188016 -176727 124161 235726 -75856 71714 -28109 -86555
11159h6555D7721K27583d8056k88199D2730b21486A40856k6544h5577B9019M21025
$$ -86555 47721 275304 -48056 -336255 42730 -221486 140856 114312 -85577 29019 450044
11148D50044a38440j10339A27104a924D9070d81726C59869j25117E976e8897G6573
$$ 450044 -138440 -248779 127104 -1924 49070 -481726 359869 234752 5976 -58897 76573
11136b29520R232B56951e0335C8125a23897I4412J42449G4718J59216A10748B439
$$ -229520 -220288 256951 -50335 38125 -123897 94412 236861 74718 233934 110748 2439
11124A75743q7191J90577a73155l3229M9224A4391b05172B54053j21720J50507
$$ 175743 88552 279129 -173155 -206384 -157160 14391 -205172 254053 132333 282840
11114B82840r5096a8079M800l5202F1851j9317K15863b09209A58279J74944a27409
$$ 282840 187744 -18079 -13279 -48481 61851 42534 258397 -209209 158279 333223 -127409
11102A86854h6310n3011A83876g4879A94119R2414g059A40213k4436B3386Q3225
$$ 186854 -86310 -139321 183876 -74879 194119 286533 -7059 140213 115777 23386 106611
11091A06611g0176E49853A24670E1653a53962A02356k6251K58949m3800K59195
$$ 106611 -70176 549853 124670 51653 -153962 102356 76105 335054 291254 550449
11081E50449E6981N6277L42575J20044a17915B96357r6527J75623j84024L07333
$$ 550449 56981 113258 455833 575877 -117915 296357 199830 375453 191429 498762
11071D98762j07788J32130I4325J51183J5272I603L97045j78936o8831L22517
$$ 498762 390974 523104 94325 245508 260780 9603 406648 227712 158881 481398
11061D81398R352O9452j25150K68787k37831j1484L63004r9808l7978k76696L9072
$$ 481398 490750 560202 435052 703839 466008 454524 817528 717720 679742 403046 442118
11050D42118J21344R3392N5478j60195L7348J23892j93969j7742K48205j1658
$$ 442118 563462 656854 712332 552137 589485 713377 519408 501666 749871 738213
11040G38213J60347l89708K9226J06048k05944J19769M6144j11088j01348K08505
$$ 738213 898560 508852 538078 644126 438182 557951 604095 493007 391659 600164
11030F00164P2018k46709L98122j78000m6497J27240k3265j29321j53042L88248
$$ 600164 672182 425473 823595 645595 599098 726338 703073 573752 420710 808958
11020H08958B88262L60740K8497C16214Q8301K52378k69963M34296k41169j61678
$$ 808958 288262 649002 677499 316214 404515 656893 386930 821226 580057 418379
11010D18379R5279m6208K02426j03640L43339D20724K29289q6413K63811k10617
$$ 418379 513658 467450 669876 566236 909575 420724 650013 563600 827411 616794
11000F16794k9600R852K8018j68344K00852B37288M91830j92237o620j02317K52991
$$ 616794 587194 597046 625064 456720 657572 237288 729118 536881 530261 427944 680935
10989F80935o1785k36809N22352m0631j30947L06014k68744K73972P9423j97292
$$ 680935 619150 382341 904693 864062 733115 1039129 770385 1044357 1123780 926488
10979I26488K45112k48966M33858K32088P4296K39714K12850L14600J96395R6241
$$ 926488 1171600 922634 1356492 1588580 1662876 1902590 2115440 2430040 2626435 2722676
10969B722676l7440j29363l6539m84212o2225j62699p2903j71025j45027N06773
$$ 2722676 2685236 2555873 2519334 2035122 1972897 1810198 1737295 1566270 1421243 1928016
10959A928016k86767k70821J60877j8122K48833k2500J25047n97073j92623j00829
$$ 1928016 1641249 1370428 1531305 1513183 1762016 1739516 1864563 1267490 1074867 974038
10949I74038o8007M1537C20993K82549G4129J76109J14986A24352J88847m3351
$$ 974038 906031 947568 320993 603542 74129 250238 365224 124352 313199 269848
10939B69848j03196l9506a12938B00878H3989k5889A077P8336B8755K33270F0650
$$ 269848 166652 127146 -112938 200878 83989 58100 1077 79413 28755 262025 60650
10927A07404j1007K26029c4269J2855B62373a40246C09803n9213N1744A7151J51503
$$ 107404 96397 322426 -34269 -21414 262373 -140246 309803 250590 302334 17151 168654
10916A68654b43125c2768B28549a14162Q173C54245I0237I342a7874r5274a3538
$$ 168654 -243125 -32768 228549 -114162 -105989 354245 90237 9342 -17874 -113148 -13538
10904i9390r1619B7185b03359d742j35259C60407c2015j03963o7284E5526f9262
$$ -99390 -191009 27185 -203359 -4742 -140001 360407 -32015 -135978 -203262 55526 -69262
10892B7420i0731j3685A00283K4057J04201m4035l3292a0366k90823a37239C33019
$$ 27420 -90731 -104416 100283 124340 228541 184506 151214 -10366 -301189 -137239 333019
10880c74474E8712J34553Q5890o7425b10742k08521f7154E1981N8384B3843r455
$$ -374474 58712 193265 279155 211730 -210742 -419263 -67154 51981 110365 23843 14388
10869A4388a29716B0599K356c1728k9285L986A46514D5922b88953c4057A66897
$$ 14388 -129716 20599 22955 -31728 -61013 -57027 146514 45922 -288953 -34057 166897
10857a74388C93791j76264b54522E2955J8382a45521D7992d5665l57950D1654
$$ -174388 393791 217527 -254522 52955 71337 -145521 47992 -45665 -403615 41654
10846C5449a82951d2243p5658n6861Q0262A34993A5248e8052B64191j27042b13260
$$ 35449 -182951 -42243 -117901 -174762 -94500 134993 15248 -58052 264191 137149 -213260
10834d9745q4413A47253d3217C4000a03145a0770A60042c27505A01528a7891A05290
$$ -49745 -134158 147253 -43217 34000 -103145 -10770 160042 -327505 101528 -17891 105290
10822A36346E6294a36393c6809C05545l5379b10808K6478e1257D000e7582E581
$$ 136346 56294 -136393 -36809 305545 270166 -210808 -184330 -51257 4000 -57582 5581
10810a06055N1353o638F732g1424a5263j49148O6638B30486a57495j43567i9682
$$ -106055 -54702 -61340 6732 -71424 -15263 -164411 -97773 230486 -157495 -301062 -99682
10798a16118L0216j24382q7184D364L29008b49066N5624B46433a08496A85091
$$ -116118 -85902 -210284 -297468 4364 333372 -249066 -193442 246433 -108496 185091
10787e1083q5850G6968M1258o298a52849B43872A13291C8321M1680d9602A19438
$$ -51083 -136933 76968 118226 111928 -152849 243872 113291 38321 80001 -49602 119438
10775a49590j9998P348J3731M027k8773B25701A10869a56544b2180F8739f8424
$$ -149590 -169588 -162240 -148509 -144482 -173255 225701 110869 -156544 -22180 68739 -68424
10763b08896c8553j44820L4396M400L8710j00078O2638A6563h1356K3229j39090
$$ -208896 -38553 -183373 -148977 -144577 -105867 -205945 -143307 16563 -81356 -58127 -197217
10752a97217B05065h4538j26240j6896B16620b4063C7401J28362G8250b7601l4008
$$ -197217 205065 -84538 -210778 -227674 216620 -24063 37401 165763 78250 -27601 -61609
10741f1609B6061g4784A88327a86575B3306J41244e2185b562D67925I1786c11771
$$ -61609 26061 -74784 188327 -186575 23306 164550 -52185 -2562 467925 91786 -311771
10729C58013e9817q1624A88684l8408o6392K0598J19400a50852M7655c6036k5533
$$ 358013 -59817 -141441 188684 150276 83884 104482 223882 -150852 -103197 -36036 -61569
10718f1569I8953m6881I485f6870a6519C47842A02771b51190c6596k47391g4494
$$ -61569 98953 52072 9485 -66870 -16519 347842 102771 -251190 -36596 -283987 -74494
10706a59890A12001J6794b52547e2423k91433B71740a2142J373n6565B33475a09895
$$ -159890 112001 128795 -252547 -52423 -343856 271740 -12142 -10769 -67334 233475 -109895
10694b22102Q705A18521A3325f5099j0712F6869a67517j49069k7593A6534a01523
$$ -222102 -213397 118521 13325 -65099 -75811 66869 -167517 -316586 -344179 16534 -101523
10682d8103G4222b62001A4537d09873E7491A2058a95192R7264k64211L2700A21145
$$ -48103 74222 -262001 14537 -409873 57491 12058 -195192 -97928 -362139 -329439 121145
10670A31444R7904o0315p487d2751A8019h3003J8516A43845k4159e1431j13524
$$ 131444 229348 169033 161546 -42751 18019 -83003 -64487 143845 119686 -51431 -164955
10659a64955g2290k1726j25549j15730M9272f6929l30707R7410A66233a88774
$$ -164955 -72290 -94016 -219565 -335295 -286023 -66929 -397636 -300226 166233 -188774
10648a78727B3325b57032B43840q4513e4909A22363a49645j61142g1610A49526
$$ -178727 23325 -257032 243840 159327 -54909 122363 -149645 -310787 -71610 149526
10637B10187a80710j04870B81297D3888N5408b66987J05536b7354j73407A57082
$$ 210187 -180710 -285580 281297 43888 99296 -266987 -161451 -27354 -200761 157082
10626a13275A46064g6414K3011D3083e5240Q314j43807c1996l35142F3217h7631
$$ -113275 146064 -76414 -53403 43083 -55240 -46926 -190733 -31996 -367138 63217 -87631
10614a81472a0782l7A13882J00025c60405A10577k2165A8336K26148A01806B518
$$ -181472 -10782 -10819 113882 213907 -360405 110577 88412 18336 244484 101806 2518
10602f0445A92884a1933r4448H3682i0157o3988A28016C7830b75279i2120j8429
$$ -60445 192884 -11933 -106381 83682 -90157 -154145 128016 37830 -275279 -92120 -110549
10591a10549A89711f1367A67370a6540m39585I5375b0961K968q4946A05574A6014
$$ -110549 189711 -61367 167370 -16540 -456125 95375 -20961 -17993 -102939 105574 16014
10579c0872k7619A14240c07621j45948B39276C2822a15623B27926M3954e18A6218
$$ -30872 -58491 114240 -307621 -453569 239276 32822 -115623 227926 271880 -518 16218
10567b82061I9120c23709I8593a9644j72307P9960o2775n4162E7928A5722R7396
$$ -282061 99120 -323709 98593 -19644 -191951 -111991 -174766 -228928 57928 15722 113118
10556A13118k0528a62832g231A89884b91801a35290o0923c3759j26268K6990F89
$$ 113118 92590 -162832 -7231 189884 -291801 -135290 -196213 -33759 -160027 -133037 689
10544b03166A6852b01103g6595c5512B03612b40805B1422J41585G8129M8509e790
$$ -203166 16852 -201103 -76595 -35512 203612 -240805 21422 163007 78129 126638 -5790
10532g7877E849h4732k32k09A72374c57009O1190P6558A526i9169C2174a01204
$$ -77877 5849 -84732 -84964 -85173 172374 -357009 -295819 -219261 1526 -99169 32174 -101204
10519a42958A96318C1841a48893j68325a27692B26508b9178A59428k2361d1001
$$ -142958 196318 31841 -148893 -317218 -127692 226508 -29178 159428 137067 -41001
10508a87115B0592K10250a26507I3529h6082q7676r3033c5427A0724L44042D1139
$$ -187115 20592 230842 -126507 93529 -86082 -173758 -266791 -35427 10724 354766 41139
10496h1089m8280F5191a2585F9442d8762D8149P9359a57069F4008J45173a67941
$$ -81089 -129369 65191 -12585 69442 -48762 48149 127508 -157069 64008 209181 -167941
10484A16737B6300J32664M7382K5944K28824n4512m7632A71109K9554L06066A28224
$$ 116737 26300 158964 206346 232290 461114 406602 358970 171109 200663 506729 128224
10472A33809b33253A22241g6380A60108f320l22331a14429H9805M52173k33365
$$ 133809 -233253 122241 -76380 160108 -6320 -328651 -114429 89805 541978 308613
10462C08613a66090D4060J80400l9461b12375a5435H7932R6706F2668g2714B3635
$$ 308613 -166090 44060 224460 184999 -212375 -15435 87932 184638 62668 -72714 23635
10450G4981N0886a75313A48143a82172a2985A25250a07778M628j72935C49880
$$ 74981 125867 -175313 148143 -182172 -12985 125250 -107778 -103150 -276085 349880
10439B2466a19402A041a1417p3399L6505l7320C7969a52559A84228b76636h7257
$$ 22466 -119402 1041 -11417 -84816 -48311 -85631 37969 -152559 184228 -276636 -87257
10427A47039a71019N3614k19765A94172a20177B08237N154p564q3324m4287c60688
$$ 147039 -171019 -117405 -337170 194172 -120177 208237 213391 205827 122503 78216 -360688
10415F4093d17705a15093C8447d8529k59773j18712A21218d2468A36664k9498
$$ 64093 -417705 -115093 38447 -48529 -308302 -427014 121218 -42468 136664 107166
10405A07166K74031C4634b11649Q3003B8317g0824f716o3460B55550a45615b9509
$$ 107166 381197 34634 -211649 -128646 28317 -70824 -6716 -70176 255550 -145615 -29509
10393B41146J6997j05032j0845e5338K4875B2790a340B24840p7521F2859a93707
$$ 241146 258143 153111 142266 -55338 -30463 22790 -1340 224840 147319 62859 -193707
10381I9149c19754a6646C22823A30431K04484R020a2328G6832D612K32737p3090
$$ 99149 -319754 -16646 322823 130431 334915 343935 -12328 76832 4612 237349 164259
10370A64259O5252A14588L18728c721C89820J55135o519j48121J98954A60261
$$ 164259 229511 114588 433316 -3721 389820 544955 538436 390315 589269 160261
10359i4455A81218O6195M1225M7543C2991J3256G082M39480K42892j95580n3925
$$ -94455 181218 247413 288638 336181 32991 46247 7082 446562 689454 493874 439949
10348D39949L2697I4080j6713J18552g639B62027L62924B70326K0523k9017R713
$$ 439949 472646 94080 77367 195919 -7639 262027 624951 270326 290849 261832 271545
10337B71545j5718J29165j28688B8460B566N0669i4529A71777a6653D10476A52833
$$ 271545 255827 384992 256304 28460 2566 53235 -94529 171777 -16653 410476 152833
10325e3953B17128B9586L68870a41334B41759J91827j36396G2839b97132B29272
$$ -53953 217128 29586 398456 -141334 241759 433586 297190 72839 -297132 229272
10314B07382n7498i2018G2546K05067b34147J09411j717l2702A22613a49942q2265
$$ 207382 149884 -92018 72546 277613 -234147 -124736 -126453 -159155 122613 -149942 -232207
10303b32207c139A60095b29099j42735F7887C2518a49328H1113C3348b09326l2411
$$ -232207 -3139 160095 -229099 -371834 67887 32518 -149328 81113 33348 -209326 -241737
10292b41737B7494K2333d569j91237D6486a76435c9135j41160d7652j00887c2626
$$ -241737 27494 49827 -4569 -195806 46486 -176435 -39135 -180295 -47652 -148539 -32626
10280a1104B39431a76149F658a41389M4361k93225F9509M3614h2432p5627m4153
$$ -11104 239431 -176149 6658 -141389 -97028 -390253 69509 113123 -82432 -158059 -202212
10269b02212H7771N2370C2283a59810A76912J06296G864d8805A54506R4090A08318
$$ -202212 87771 140141 32283 -159810 176912 283208 7864 -48805 154506 248596 108318
10257D35463J23398I4428m6337J33046m1237A2115J12414J3491J04945B3153a368
$$ 435463 558861 94428 48091 181137 139900 12115 124529 138020 242965 23153 -1368
10245H6215C3249b5139E5535K37629H453g2032q000C121J80871a49014D578O589
$$ 86215 33249 -25139 55535 293164 8453 -72032 -80032 3121 183992 -149014 4578 11167
10233A1167L02767a08140j21174C4576L1953K40613b74843q6565d8773m817A93720
$$ 11167 313934 -108140 -229314 34576 66529 307142 -274843 -361408 -48773 -53590 193720
10221g1849A81473K0682c16213n8749J30888M0002e8383B04952E8576a99449F2097
$$ -71849 181473 202155 -316213 -374962 -244074 -204072 -58383 204952 58576 -199449 62097
10209A14359a374p1947e552j71871k09676a37788J2027d0564j47673l09842b02070
$$ 114359 -1374 -73321 -5552 -177423 -387099 -137788 -125761 -40564 -188237 -498079 -202070
10197b17031k89959J74388J05707O2758g0791j18036i1383n0348b5119j24681
$$ -217031 -506990 -332602 -226895 -164137 -70791 -188827 -91383 -141731 -25119 -149800
10187a49800I2270J88318c30642M6004a38915j30781D097e6041k14881J35341
$$ -149800 92270 280588 -330642 -284638 -138915 -269696 4097 -56041 -270922 -135581
10177a35581o6569a5645G9039B4442c40945o982P9269J33413C3206b91574a39445
$$ -135581 -202150 -15645 79039 24442 -340945 -347927 -268658 -135245 33206 -291574 -139445
10165a75206h4936n5426I1074k8884k1364a14852j72014q0328J65101Q8635k027
$$ -175206 -84936 -140362 91074 62190 40826 -114852 -286866 -367194 -202093 -113458 -115485
10154a15485P507e0600D5013K97067a14645r3354D26282b44233A43031J8752m0384
$$ -115485 -107978 -50600 45013 342080 -114645 -207999 426282 -244233 143031 161783 121399
10143A21399m0354a20594N5541j17460b1126A39226a07277d9353k01683B2558
$$ 121399 81045 -120594 -65053 -182513 -21126 139226 -107277 -49353 -251036 22558
10132c9444A71451k1961M3580a9265k10612b83A338N0481K16400c9139n818n36664
$$ -39444 171451 149490 193070 -19265 -229877 -283 1338 51819 268219 -39139 -44957 -581621
10120e81621B8899a50869e7758N270j42128b5062m7119E30032a70934a2720A90922
$$ -581621 28899 -150869 -57758 -52488 -194616 -25062 -72181 530032 -170934 -12720 190922
10108b10454l6202g5527R314j54953d571j0645E8199a45131N1072g382A53125
$$ -210454 -246656 -75527 -66213 -221166 -4571 -15216 58199 -145131 -94059 -7382 153125
10096A06271d00847C17536a54489M4614A33537E8479O6332d4986j77842a02111
$$ 106271 -400847 317536 -154489 -109875 133537 58479 124811 -44986 -222828 -102111
10085b48913q6361d376k00163h5848C8644g3420k81345i0064b8265B8579d7585
$$ -248913 -335274 -4376 -204539 -85848 38644 -73420 -354765 -90064 -28265 28579 -47585
10073h6091K0964k7267j07324i1832D2118c1301C6271b45560P2405E7432a00009
$$ -86091 -65127 -92394 -199718 -91832 42118 -31301 36271 -245560 -173155 57432 -100009
10061a23446a3986k4011B81164f1886q5561g2043j44000K8175A32628d9756k2162
$$ -123446 -13986 -37997 281164 -61886 -147447 -72043 -216043 -187868 132628 -49756 -71918
10050g1918q6972L6394K3587r2168A15439N3334c1099q5164A42193e16578D7344
$$ -71918 -158890 -122496 -98909 -191077 115439 168773 -31099 -116263 142193 -516578 47344
10038a47323J2874A68627i0982F5894L1656d99821A57908b13408K0366a0826H3316
$$ -147323 -134449 168627 -90982 65894 97550 -499821 157908 -213408 -193042 -10826 83316
10026C7648d31540e4932j72589B32879a91991A53322f7509j70851i9498j87666
$$ 37648 -431540 -54932 -227521 232879 -191991 153322 -67509 -238360 -99498 -287164
10016b87164R9167H8847e866j22951j16376l3683A56674D8305A4356K01622A3147
$$ -287164 -187997 88847 -5866 -128817 -245193 -278876 156674 48305 14356 215978 13147
10004h6707N000c517j74276j66076A01641J09366b68906G0805j8112A6909J15306
$$ -86707 -81707 -3517 -177793 -343869 101641 211007 -268906 70805 52693 16909 132215
9993A32215J46140f8126E0866J92786b25131D2078d52123C6356a02237K7393m1455
$$ 132215 278355 -68126 50866 243652 -225131 42078 -452123 36356 -102237 -74844 -116299
9982a16299C55631a96223h7746l14081J97446Q9504o3519A0464a6742A34526a59511
$$ -116299 355631 -196223 -87746 -401827 -204381 -114877 -178396 10464 -16742 134526 -159511
9970a31278E7885b06411e3098j23061k4979A962b55636B22826c75553a8461A15614
$$ -131278 57885 -206411 -53098 -176159 -201138 1962 -255636 222826 -375553 -18461 115614
9958D5851b7818B28361b24609E4578a65432C2287a71881r5274H7535a05640d8999
$$ 45851 -27818 228361 -224609 54578 -165432 32287 -171881 -267155 87535 -105640 -48999
9946a92481G5097f5944G1539c70144E5526a41102A49115a19001B7522c4746A467
$$ -192481 75097 -65944 71539 -370144 55526 -141102 149115 -119001 27522 -34746 1467
9934E2238a361k06596L438C14223a8641E4365a5978l11620k9514A00390L5492
$$ 52238 -1361 -207957 -204519 314223 -18641 54365 -15978 -327598 -357112 100390 135882
9923A35882e6501A00324M87076j49579b48704k13586a18828r9338j39357A7163
$$ 135882 -56501 100324 587400 437821 -248704 -462290 -118828 -218166 -357523 17163
9912A40972b57918Q8340m9829e8178F6444a97694A01571g2142B88137d27967a64542
$$ 140972 -257918 -169578 -219407 -58178 66444 -197694 101571 -72142 288137 -427967 -164542
9900b98046C1471b22912R1293B53386A09842M0844d7812k25012B30543G8268a81680
$$ -298046 31471 -222912 -131619 253386 109842 150686 -47812 -272824 230543 78268 -181680
9888a14573K6672l3458l8560j61132B50978i2529a6716n3988B5614J9906J57812
$$ -114573 -87901 -121359 -159919 -321051 250978 -92529 -16716 -70704 25614 45520 203332
9877B03332A2555K6232d2418k51353O4776e967j0270k51020P1614D8881b1173
$$ 203332 12555 38787 -42418 -293771 -228995 -5967 -16237 -267257 -195643 48881 -21173
9865A5539e8784A0999h5593A88312b77648I9803g4443a9559p2857j81637F2752
$$ 15539 -58784 10999 -85593 188312 -277648 99803 -74443 -19559 -92416 -274053 62752
9853a73778Q2631A23580J40471c7626l69885H0462a88422A56489a25446A07830
$$ -173778 -91147 123580 264051 -37626 -407511 80462 -188422 156489 -125446 107830
9842e2042J9126F5560J0714c43j31905L6058m9280A6550J39557b63700M6686D4449
$$ -52042 -32916 65560 76274 -343 -132248 -96190 -145470 16550 156107 -263700 -217014 44449
9829C542a14305D7363J09220b99988f7753k89970J64407Q9465F1023A0121a41931
$$ 3542 -114305 47363 156583 -299988 -67753 -357723 -193316 -103851 61023 10121 -141931
9817g5903C1400J71308b35170J14212c54o5919J1288A7701J06155a07084j91903
$$ -75903 31400 202708 -235170 -120958 -354 -66273 -54985 17701 123856 -107084 -298987
9806b98987N8307p970a0429B036b63418j05439D7166e5752C36715b16075R1478
$$ -298987 -240680 -248650 -10429 2036 -263418 -368857 47166 -55752 336715 -216075 -124597
9795a24597G3354a48160o7451f775k56862C38177a24657A70110b03279j41393
$$ -124597 73354 -148160 -215611 -6775 -263637 338177 -124657 170110 -203279 -344672
9785c44672J32633A47400n692b63784A59222b21712P1224e1226j26221G7996h997
$$ -344672 -212039 147400 141708 -263784 159222 -221712 -150488 -51226 -177447 77996 -8997
9773a14775D6859c6391C3334a08348K673C530J72752c29429A56589b76832g0608
$$ -114775 46859 -36391 33334 -108348 -105675 3530 176282 -329429 156589 -276832 -70608
9761E3120K4074J16560I0499b14452b8429m7894D9464b57294j41973B6489j1442
$$ 53120 77194 193754 90499 -214452 -28429 -76323 49464 -257294 -399267 26489 15047
9750A5047c0890m34846A6840J8990h150D8654b30592g6887B34485I0548a59963
$$ 15047 -30890 -465736 16840 35830 -8150 48654 -230592 -76887 234485 90548 -159963
9738d249p4979A37545c8931n1356A98873a19268j3777A02162a42619j17139h2568
$$ -4249 -79228 137545 -38931 -90287 198873 -119268 -133045 102162 -142619 -259758 -82568
9726b2773j76356l1785O8566O0104A89977a56386P2758b4103j55431D1769h6053
$$ -22773 -199129 -230914 -162348 -102244 189977 -156386 -83628 -24103 -179534 41769 -86053
9714b74097a08580K5303j8394F2880Q3096b26824p7350h9817K4767E7941a68869
$$ -274097 -108580 -83277 -101671 62880 145976 -226824 -304174 -89817 -65050 57941 -168869
9702A47322b53466k628b1733A23729d1110g167l05558B34616p1484b27888E6241
$$ 147322 -253466 -256094 -21733 123729 -41110 -7167 -312725 234616 163132 -227888 56241
9690F3951b48151A48988b85807J15212L3368P493l8574p5314j55953p1061a5968
$$ 63951 -248151 148988 -285807 -170595 -137227 -129734 -168308 -243622 -399575 -470636 -15968
9678A11210l6306B788O5358B2601O8883m3391b12022Q3029l87157A3627h9774
$$ 111210 74904 2788 68146 22601 91484 48093 -212022 -128993 -516150 13627 -89774
9666F2222J96202a70169b7405j83727d8135k0230k59736i3333n8556m1776A93367
$$ 62222 258424 -170169 -27405 -211132 -48135 -68365 -328101 -93333 -151889 -193665 193367
9654E2954d8435j13334M3861H2207d5817r6028c726k93755F7207O6313b91541
$$ 52954 -48435 -161769 -117908 82207 -45817 -141845 -3726 -297481 67207 133520 -291541
9642b07616k98389a99976L6442K4931k46990A2756d8206D0301a06494k12034a08313
$$ -207616 -506005 -199976 -163534 -138603 -385593 12756 -48206 40301 -106494 -318528 -108313
9630d3049G1136d11244a49387A64597n1311J17630f5664A64623a99032m7944A98815
$$ -43049 71136 -411244 -149387 164597 113286 230916 -65664 164623 -199032 -246976 198815
9618i6662r3457K6144k6612R0107A65075n7616a72235A14252g5631A34291N5798
$$ -96662 -190119 -163975 -190587 -100480 165075 107459 -172235 114252 -75631 134291 190089
9607A90089K26164b6205j10535F5254J13877G6274B9779P4431l9505a06516J0901
$$ 190089 416253 -26205 -136740 65254 179131 76274 29779 104210 64705 -106516 -95615
9596i5615E6389a55580j92091h6690m8907A08472a6804j69871O9774G2231k8219
$$ -95615 56389 -155580 -347671 -86690 -135597 108472 -16804 -186675 -116901 72231 44012
9585D4012b58856b8380k50154J20753O2119l0832j37158B1098b08798f932m34057
$$ 44012 -258856 -28380 -278534 -157781 -95662 -126494 -263652 21098 -208798 -6932 -440989
9574d40989e9654l49917a74754h1732k58475A51807c882C649a26228j0514d9391
$$ -440989 -59654 -409571 -174754 -81732 -340207 151807 -3882 3649 -126228 -136742 -49391
9562a7111I2995d22038h2818k55986B29605a76971A18192m6482a48134j07259
$$ -17111 92995 -422038 -82818 -338804 229605 -176971 118192 71710 -148134 -255393
9552b55393a9925k02839a3365C53612a25360B7618a79472r6436A79650h9583B20377
$$ -255393 -19925 -222764 -13365 353612 -125360 27618 -179472 -275908 179650 -89583 220377
9540B9462a32425b5979k72757L0250G2518K54852A32722b84615A38793a18308
$$ 29462 -132425 -25979 -298736 -268486 72518 327370 132722 -284615 138793 -118308
9529a25474j81907J03115L002n0685d6177A38715N0084b06902e9931e013q3328
$$ -125474 -307381 -204266 -201264 -251949 -46177 138715 188799 -206902 -59931 -5013 -88341
9518h8341d812j3057A76915p8704a74322b493j84714C6886a09122J7274A44428
$$ -88341 -4812 -17869 176915 98211 -174322 -2493 -187207 36886 -109122 -91848 144428
9506A44619a82199p2293p7690A54746c3807E4841e7538A19561c1015j99322b5092
$$ 144619 -182199 -254492 -332182 154746 -33807 54841 -57538 119561 -31015 -230337 -25092
9494I8281a97446k18218B2134c6154k19972A06707j7387d12047A99205A9207a42679
$$ 98281 -197446 -415664 22134 -36154 -256126 106707 89320 -412047 199205 19207 -142679
9482b58168A50207b48740f6269b6883j85362e3631E0389a92545J5630A18893d84336
$$ -258168 150207 -248740 -66269 -26883 -212245 -53631 50389 -192545 -176915 118893 -484336
9470b56244M767A14184b04287a5005A64475a66772r1821A71192f7388k41839A16255
$$ -256244 -251477 114184 -204287 -15005 164475 -166772 -258593 171192 -67388 -309227 116255
9458f5653j80123a22055A68710m7512a21549J4501k79490J36776a3365m50784
$$ -65653 -245776 -122055 168710 121198 -121549 -107048 -386538 -249762 -13365 -464149
9448d64149a64747b0875q6984j35136H8591J64510j08732k1411Q591i8897j87566
$$ -464149 -164747 -20875 -107859 -242995 88591 253101 144369 122958 131549 -98897 -286463
9437b86463M2650j95156b09652N6415d1381l52993A24085K1950e77435a9965j61196
$$ -286463 -243813 -438969 -209652 -153237 -41381 -394374 124085 146035 -577435 -19965 -181161
9426a81161C01016C6748K4350d7522H7693c3020k06074o2873c1121A31225e4558
$$ -181161 301016 36748 61098 -47522 87693 -33020 -239094 -301967 -31121 131225 -54558
9414B22241p4460a97029H435J13098b25282a08908i25j2655A78521l0298M4648
$$ 222241 147781 -197029 8435 121533 -225282 -108908 -925 -13580 178521 148223 192871
9403A92871b87486A72035a99936B17000p6035c18721H7662a45997b4068M712Q272
$$ 192871 -287486 172035 -199936 217000 140965 -318721 87662 -145997 -24068 -19356 -11084
9392a1084A09601a71375J4096G0343h0768A94866c78852C34737C2966a57649j25500
$$ -11084 109601 -171375 -157279 70343 -80768 194866 -378852 334737 32966 -157649 -283149
9381b83149H3534L7625c33005a7036q436C2791Q7360d58248c7646l27849g1783
$$ -283149 83534 121159 -333005 -17036 -25472 32791 120151 -458248 -37646 -365495 -71783
9369b61266D5653J0824a19176N3395j37866A09756a50779O9711k99105a58864
$$ -261266 45653 56477 -119176 -65781 -203647 109756 -150779 -81068 -380173 -158864
9358a80187K5927l5142C48225c6394b246H1859O8847n1466f7136L399K7064D4784
$$ -180187 -154260 -189402 348225 -36394 -2246 81859 150706 99240 -67136 -63737 -36673 44784
9345B95681a27835B1714b17970f0661j09262I8162a70963N2224j63475e8946C29868
$$ 295681 -127835 21714 -217970 -60661 -169923 98162 -170963 -118739 -282214 -58946 329868
9333a5037a765A13198c71051J82496h0299j19963i6839I8961c95698B01211a6491
$$ -15037 -1765 113198 -371051 -188555 -80299 -200262 -96839 98961 -395698 201211 -16491
9321f980E1693i5079E149a07749A63152a6862k05156B67862A07461c4134p54A88501
$$ -6980 51693 -95079 5149 -107749 163152 -16862 -222018 267862 107461 -34134 -34888 188501
9308a08477r9432I4219a23024N5042A51813b97797f8786E9599c13983A2143J17708
$$ -108477 -207909 94219 -123024 -67982 151813 -297797 -68786 59599 -313983 12143 129851
9297A29851e4543j25183K0832C46963h3722G1537a50569m1318l4607a10269B58203
$$ 129851 -54543 -179726 -158894 346963 -83722 71537 -150569 -191887 -226494 -110269 258203
9285d7226l3730H6570N6149a67937N498M3110b5080k7758o175r3426M007L3327
$$ -47226 -80956 86570 142719 -167937 -162439 -119329 -25080 -52838 -59013 -152439 -148432 -115105
9273a15105B24181a49665o3764r5139A11067j0709c95506O7753R9225R9068A01450
$$ -115105 224181 -149665 -213429 -308568 111067 100358 -395506 -327753 -228528 -129460 101450
9261A10058c14384B6752b53371g4087A38421J63970b81180a09052B04142b12381
$$ 110058 -314384 26752 -253371 -74087 138421 302391 -281180 -109052 204142 -212381
9250B58844a66453j04405J24248G5481R2812P9293d1588K196k46751B63783b06647
$$ 258844 -166453 -270858 -146610 75481 168293 247586 -41588 -39392 -286143 263783 -206647
9238a30895A48612c9168C7639d5321A4514d6907H8139a14843j46060B4091a31324
$$ -130895 148612 -39168 37639 -45321 14514 -46907 88139 -114843 -260903 24091 -131324
9226F26223A38926n3905f6708H6244b01886B16317g4903A82435a07363A49079
$$ 626223 138926 85021 -66708 86244 -201886 216317 -74903 182435 -107363 149079
9215b8964k85167C0236L1860a51762a6606n3222A11698i5108K4989m9441r8762
$$ -28964 -314131 30236 62096 -151762 -16606 -69828 111698 -95108 -70119 -119560 -218322
9204b18322B07569a79218n3870r0236B40661a96084A64293G6303e2981p2716B77786
$$ -218322 207569 -179218 -233088 -323324 240661 -196084 164293 76303 -52981 -125697 277786
9192f9528H4596a50202k33572a56185L4978k2455D1771J57227a84101l2799e180
$$ -69528 84596 -150202 -383774 -156185 -121207 -143662 41771 198998 -184101 -216900 -5180
9180c91752a37736A04741i4076A51663b02820f2360j8306j6206A02869L5326a97891
$$ -391752 -137736 104741 -94076 151663 -202820 -62360 -80666 -96872 102869 138195 -197891
9168a11507B1671a62109m5355k1201J04424e0807A27228c7282C4478a48269k865
$$ -111507 21671 -162109 -207464 -228665 -124241 -50807 127228 -37282 34478 -148269 -151134
9157a51134j60672J00404F7876a67784D6092a65215j0743n6499h6082C7309c47361
$$ -151134 -311806 -211402 67876 -167784 46092 -165215 -175958 -232457 -86082 37309 -347361
9145a83676D14766a47949j36015E2554b41054A11422P6369e53795e4529A16849
$$ -183676 414766 -147949 -283964 52554 -241054 111422 187791 -553795 -54529 116849
9134D41749a29564I5058d1539j88833c7169F3149J35435a83473P0248N5228m3826
$$ 441749 -129564 95058 -41539 -230372 -37169 63149 198584 -183473 -113225 -57997 -101823
9123a01823c8228B1408a23417J939C5046J66047p3062h1402B36222l447E1311
$$ -101823 -38228 21408 -123417 -121478 35046 201093 128031 -81402 236222 232775 51311
9111G0672c51173h9830A667f3570B51179k2182a61244A69180f4328Q221k77276
$$ 70672 -351173 -89830 1667 -63570 251179 228997 -161244 169180 -64328 -56107 -333383
9100c33383k3918P8018b6229C3225a81599g4937o1056b3422B18030h7973L0554
$$ -333383 -357301 -279283 -26229 33225 -181599 -74937 -135993 -23422 218030 -87973 -57419
9089e7419j95873A43165n0478b57046K7938A0950e6534l88770C1260J29174D4081
$$ -57419 -253292 143165 92687 -257046 -229108 10950 -56534 -445304 31260 160434 44081
9077a20719e4976A6780c27116a15079I7349b39491l1326H0878B0368a12197J0324
$$ -120719 -54976 16780 -327116 -115079 97349 -239491 -270817 80878 20368 -112197 -101873
9066a01873j39915J00038q256f5696r7738B2466d27395J550B92336e3901F809
$$ -101873 -241788 -141750 -150006 -65696 -163434 22466 -427395 -425845 292336 -53901 6809
9054A57133a13584K7615a9966C31909H4973a8407A21296b3528D2770b41410F9934
$$ 157133 -113584 -85969 -19966 331909 84973 -18407 121296 -23528 42770 -241410 69934
9042b07930e8394l24289b7658C9947O8422b66408K9980B18658j01104M2388c64064
$$ -207930 -58394 -382683 -27658 39947 108369 -266408 -236428 218658 117554 159942 -364064
9030a49268j7660K1058A34036b2335k99949C2963b7717j70791N9009D1098a82807
$$ -149268 -166928 -145870 134036 -22335 -322284 32963 -27717 -198508 -139499 41098 -182807
9018A43651a69441j5495Q9368a0152G9430e922A4757a04395K5709b0224l5147
$$ 143651 -169441 -184936 -95568 -10152 79430 -5922 14757 -104395 -78686 -20224 -55371
9007e5371A41926a28170C3186O7596g7509K3756l32961e2734l01498A61274m1915
$$ -55371 141926 -128170 33186 100782 -77509 -53753 -386714 -52734 -354232 161274 119359
8996A19359a20321m4387p3125A36490K7681h1704A24189a52954b967m05449J93091
$$ 119359 -120321 -164708 -237833 136490 164171 -81704 124189 -152954 -2967 -408416 -215325
8985b15325f3486A53240a3136j49975N8172k7706p9715Q6487o6880A53597c3177
$$ -215325 -63486 153240 -13136 -163111 -104939 -132645 -212360 -125873 -192753 153597 -33177
8973c11689f8088A84710F0518a07402r7487g1926j55997P2631o2120B46836K5386
$$ -311689 -68088 184710 60518 -107402 -204889 -71926 -227923 -155292 -217412 246836 272222
8962B72222A22464O3521f4707k7731A69347o4222a24883B12090a51179j69571
$$ 272222 122464 185985 -64707 -92438 169347 105125 -124883 212090 -151179 -320750
8952c20750A02371e103B9942a15417B33025G15a51454G6643a03670j30403A45364
$$ -320750 102371 -5103 29942 -115417 233025 715 -151454 76643 -103670 -234073 145364
8940b43249C4233a90396o6864B05478a18457I2174K09302J69674a8524j27341
$$ -243249 34233 -190396 -257260 205478 -118457 92174 301476 471150 -18524 -145865
8930a45865c6924A73376k1606a03680A25190m5474N15915J556816M506567Q003625
$$ -145865 -36924 173376 151770 -103680 125190 79716 595631 2152447 6659014 14662639
8920A4662639C204690G91390l81242j84440r0914d8944G0450J8249c0199B07575
$$ 14662639 3204690 791390 410148 225708 134794 -48944 70450 88699 -30199 207575
8909a95014F0527K46495b41772c0519j63207g5579E5378e6805j9752n5299a5143
$$ -195014 60527 307022 -241772 -30519 -193726 -75579 55378 -56805 -76557 -131856 -15143
8897a55843N2091l055B51260a83152K7867m4565d0218j54749o4915a25595N2715
$$ -155843 -103752 -106807 251260 -183152 -155285 -199850 -40218 -194967 -259882 -125595 -72880
8886g2880R636k38128A73901m0429a39972B21448H9655D3997a38993c3779j35160
$$ -72880 -63244 -301372 173901 133472 -139972 221448 89655 43997 -138993 -33779 -168939
8875a68939g9908l10361A83003B4317b3390p0547A68413M4864a10906J8807k4491
$$ -168939 -79908 -390269 183003 24317 -23390 -93937 168413 213277 -110906 -92099 -116590
8864a16590Q741l3428A15495b36498P2177I3627f0007k79104P6187a11103F2794
$$ -116590 -107849 -141277 115495 -236498 -164321 93627 -60007 -339111 -262924 -111103 62794
8852d9887C431R208a5130l03437a36807A7375g7894A9761M01816A88475C4994
$$ -49887 3431 12639 -15130 -318567 -136807 17375 -77894 19761 421577 188475 34994
8840c28892O6237C42476b01112J431e3584A13972b08330o9469L6811B0929b12419
$$ -328892 -262655 342476 -201112 -199681 -53584 113972 -208330 -277799 -240988 20929 -212419
$$ [...]
##END NTUPLES=NMR SPECTRUM
##END=
